{
  "to_account_id": "{{destinationAccount}}",
  "description": null,
  "amount": "{{amount}}",
  "bankdata": null,
  "bank_id": "bank_pvbc",
  "from_account_id": "{{sourceAccount}}",
  "updated_at": "{{datetimeUpdated}}",
  "status": "pending",
  "id": "{{uniqueBookId}}",
  "error": null,
  "created_at": "{{datetimeCreated}}",
  "userdata": {{{userdataMetadata}}}
}