{
  "SEQUENCE": 0,
  "ResponseData": [
    {
      "RECS_RETURNED": {{num_transactions}},
      "MOREDATA": "N",
      "TRANSACTION": [
      {{#transactions}}
        {
          "TRANDATE": "2018-09-24",
          "TRANCD": "4025",
          "TRANAMT": {{trans_amnt}},
          "CHECKNBR": "0",
          "TRANDESC": "Fake transfer",
          "TRANDESCS": "{{{trans_id}}}",
          "TRANDESC3": "",
          "TRANDESC4": "",
          "TRANDESC5": "",
          "TRANDESC6": "",
          "TRANDESC7": "",
          "TRANDESC8": "",
          "TRANDESC9": "",
          "TRANDESC10": "",
          "TRANDESC11": "",
          "EFFDATE": "2018-09-24",
          "CURRAVAILBAL": 100500.00,
          "MEMOPSTIND": "M",
          "TRANCDX": "4025",
          "DRCRFLAG": "{{trans_type}}",
          "IMAGEFLAG": "",
          "ORIGPROCDT": "0",
          "ORIGSRC": "",
          "ORIGSUBSRC": "",
          "UniqueId": ""
        }{{^last}}, {{/last}}
      {{/transactions}}
      ]
    }
  ],
  "ERROR": null
}
