{
  "responseCode": "503",
  "reasonPhrase": "Internal Server Error",
  "XferRes": {
    "EFXHdr": {
      "Client": {
        "Organization": {
          "OrgId": "12345"
        },
        "ClientAppIdent": "MCB_API_TEST"
      },
      "Tracking": {
        "OriginatingTrnId": "cdbe9f74-7fb6-48cc-9dfc-f41a116b82a7",
        "TrnId": "cf8737ac-208a-4f70-b978-9a1689cd6c23",
        "ParentTrnId": "cdbe9f74-7fb6-48cc-9dfc-f41a116b82a7"
      }
    },
    "EFXStatus": {
      "ns1:StatusCode": "1090",
      "ns1:StatusDesc": "Invalid Value",
      "ns1:Severity": "Error",
      "ns1:SvcProviderName": "Cleartouch",
      "ns1:ServerStatusCode": "1090",
      "ns1:ServerStatusDesc": "Invalid Value: AccountFrom:TransferDescription cannot exceed 33 characters"
    }
  }
}