{
  "responseCode": "503",
  "reasonPhrase": "Internal Server Error",
  "AcctInqRs": {
    "EFXHdr": {
      "Client": {
        "Organization": {
          "OrgId": "12345"
        },
        "ClientAppIdent": "MCB_API_TEST"
      },
      "Tracking": {
        "OriginatingTrnId": "824ea750-a29f-4540-ab7e-5dd7c07efa1d",
        "TrnId": "824ea750-a29f-4540-ab7e-5dd7c07efa1d",
        "ParentTrnId": "824ea750-a29f-4540-ab7e-5dd7c07efa1d"
      }
    },
    "EFXStatus": {
      "ns1:StatusCode": "1045",
      "ns1:StatusDesc": "Request Denied",
      "ns1:Severity": "Error",
      "ns1:SvcProviderName": "Cleartouch"
    }
  }
}