{
    "defaultSeverity": "error",
    "extends": [
        "tslint:recommended",
        "tslint-no-unused-expression-chai"
    ],
    "rulesDirectory": [
        "tslint-no-focused-test"
    ],
    "rules": {
        "interface-name": false,
        "max-line-length": {
            "options": {
                "limit": 100,
                "ignore-pattern": "^import"
            }
        },
        "no-focused-test": true,
        "object-literal-sort-keys": false,
        "no-async-without-await": true,
        "whitespace": [true,
            "check-module",
            /* Default whitespace config below */
            "check-branch",
            "check-decl",
            "check-operator",
            "check-separator",
            "check-type",
            "check-typecast"
        ]
    },
    "jsRules": {
        "max-line-length": {
            "options": [
                100
            ]
        }
    },
    "no-focused-test": true
}
