{
  "type": "service_account",
  "project_id": "partiel-393312",
  "private_key_id": "e1ee552013423001583c05ae8f4fb729b759f32f",
  "private_key": "-----BEGIN PRIVATE KEY-----\nMIIEvQIBADANBgkqhkiG9w0BAQEFAASCBKcwggSjAgEAAoIBAQC7NCajrU6c4Q7p\npjgW42sufosGcdVueHfJEoJWLppZVA6xC/87dCdkf6Iu4L1K4DSyZIMBOCx7k9aK\nSVVtME6PcP80UXpO1bqy2HpK7OHNXxl/Pf7e/GmVIBJJm5NeZC6p+IQ3YGsZ51dU\nCEM+u6FulKEjkAazA8mH+CgPBHS1xK8UtSj+0V3XaxVRgh31Mgw8xdOuFfSr/xOS\nUBfoagn5jw0kQujaY8ZTWHGfDkmfoQ9RuxOlKMVSsP6hFDTQ6YrA0U41JvpP9vLC\nUT5PSu5aJmh1GMnIFwpNtVhmupA8dognpq/Xwvba92u78EoqKlk44xMhVWhEBwjF\n0R4NyppxAgMBAAECggEATBGkc9UcAR5op2POHeraZkGwb3V5I1MbZZ66TJfSS2Mf\nNy0nUPrhePJuLjtPX+ocL7MtEqVHWg3YW0fySRScj6f8Y7+KAhfSLhNOGj0IgiHX\nI//GnciWhKzMEZIAv5XY6mNcIn5w9s0tDK3w2UB4GA2YLvG67yomTbR2XqfSXvty\nGdtXpwwsrxiwhan+SQ7J2TK40uiacWu/qxZqaHUgJLBJVeAbabScCLV/XfjMTo4E\nGw1BWlaeOypM0J6qXfOg/Jy3VMm0tgLqlDL/Ea69qqXT23K17yIhTMiMrOsbNypL\nvowhMk5uY69ZWuGqO2NNK0+IWaa03wqksbyzQ2HzKwKBgQD6kYY3jP4RrR0lJLcV\nSVfTsh9r/piM9wF8alPiSVgLO1Ds0EzSda1PJV5ZosYloZ66nCw/gd1rojWNTQrF\nqTXfxPz5wfTZz1H1F8Eq/hQ7e71aOOzVxGSZvXQor/C/uLXgqxD0KFHFNs6tbAmu\nDKxSVmRoXOInYKtuZC00/3NiBwKBgQC/Qv9m2sIWhGABNypY/hdcVfv8IPe5Cuyr\nr7hxQJQgNTlTB8dMTOG+9j665KMO2sT4JkC+LQ1GA3nfA4hcLYXGnm6XQXjV7p3N\n5KYbIEj+Z4CAcx+8c9yAj3fCjuuc14tjp103O5H3ufRVLoT0Zp0RHKgS3ELbPgXm\niraGqTWhxwKBgHGsu5tQF6OlSeej9HtvvqyHzsGLy2GIXeA3zL6IT60ox9nn1jJU\nuL+DUH6R3hsMa5p1Z42YOP+vo2PrY8uwrIRMNgiI+bAm4iOzFyuOAVfLF2hrEucY\nJhupW51p1GrmPX0jnplmAVLbPoBm1y1jCnqAPyUpnmAG9z8pq2izy4DZAoGAfa+O\nXM3m+5sT59iTqJWZTmFmzSHxCJXIP26jGzFf5eZz/D9BVb+0HaR+RpzXFnznMVcZ\n9p9ueJLyNH6CzmhP39zfOeCZgqRi6RmXmn3V2fC0PjTpJxNQVN9yyNTYumHexKcI\nF7K60ntNt+hxEJaaItOdE3/RI3gXso93MPjjOKMCgYEAp/2tTFczvLnAX6nMdCAR\nBc1A4bxkyRNN0nvWcsnEEVYOJ3SMW09kToKN2VNmLsCwWyObaBxu8w8s8kPUK/im\n6KY4MOz9CMfkGbFftBWByoIKlD7coPqURJJMfZMPeAzYTMpufqo2XAP3/AODDgoo\nkWLz/qryjNXXlQPmp6vXcg0=\n-----END PRIVATE KEY-----\n",
  "client_email": "partiel-groupe2@partiel-393312.iam.gserviceaccount.com",
  "client_id": "107915591665843854259",
  "auth_uri": "https://accounts.google.com/o/oauth2/auth",
  "token_uri": "https://oauth2.googleapis.com/token",
  "auth_provider_x509_cert_url": "https://www.googleapis.com/oauth2/v1/certs",
  "client_x509_cert_url": "https://www.googleapis.com/robot/v1/metadata/x509/partiel-groupe2%40partiel-393312.iam.gserviceaccount.com",
  "universe_domain": "googleapis.com"
}
