{
    "defaultSeverity": "error",
    "extends": [
        "tslint:recommended"
    ],
    "jsRules": {},
    "rules": {
        "trailing-comma": [
            true,
            {
                "multiline": {
                    "objects": "never",
                    "arrays": "never",
                    "functions": "never",
                    "typeLiterals": "ignore"
                },
                "singleline": "never"
            }
        ],
        "array-type": [
            true, "generic"
        ]
    },
    "rulesDirectory": []
}