[
    {
        "name": "Player 1",
        "point": "20"

    },
    {
        "name": "Player 2",
        "point": "19"
    },
    {
        "name": "Player 1",
        "point": "20"

    },
    {
        "name": "Player 2",
        "point": "19"
    },
    {
        "name": "Player 1",
        "point": "20"

    },
    {
        "name": "Player 2",
        "point": "19"
    },
    {
        "name": "Player 1",
        "point": "20"

    },
    {
        "name": "Player 2",
        "point": "19"
    },
    {
        "name": "Player 2",
        "point": "19"
    },
    {
        "name": "Player 3",
        "point": "18"

    }
]