2.6	1360	150	11.9	1046	166	1056	113	1692
2	1292	112	9.4	955	103	1174	92	1559
2.2	1402	88	9.0	939	131	1140	114	1555
2.2	1376	80	9.2	948	172	1092	122	1584
1.6	1272	51	6.5	836	131	1205	116	1490
1.2	1197	38	4.7	750	89	1337	96	1393
1.2	1185	31	3.6	690	62	1462	77	1333
1	1136	31	3.3	672	62	1453	76	1333
0.9	1094	24	2.3	609	45	1579	60	1276
0.6	1010	19	1.7	561	-200	1705	-200	1235
-200	1011	14	1.3	527	21	1818	34	1197
0.7	1066	8	1.1	512	16	1918	28	1182
0.7	1052	16	1.6	553	34	1738	48	1221
1.1	1144	29	3.2	667	98	1490	82	1339
2	1333	64	8.0	900	174	1136	112	1517
2.2	1351	87	9.5	960	129	1079	101	1583
1.7	1233	77	6.3	827	112	1218	98	1446
1.5	1179	43	5.0	762	95	1328	92	1362
1.6	1236	61	5.2	774	104	1301	95	1401
1.9	1286	63	7.3	869	146	1162	112	1537
2.9	1371	164	11.5	1034	207	983	128	1730
2.2	1310	79	8.8	933	184	1082	126	1647
2.2	1292	95	8.3	912	193	1103	131	1591
2.9	1383	150	11.2	1020	243	1008	135	1719
4.8	1581	307	20.8	1319	281	799	151	2083
6.9	1776	461	27.4	1488	383	702	172	2333
6.1	1640	401	24.0	1404	351	743	165	2191
3.9	1313	197	12.8	1076	240	957	136	1707
1.5	965	61	4.7	749	94	1325	85	1333
1	913	26	2.6	629	47	1565	53	1252