{
  "name": "Bite",
  "nameOnCard": "Bite",
  "mana": 4,
  "rarity": "Rare",
  "classOfCard": "Mage",
  "type": "Spell",
  "description": "Give your hero +4 Attack this turn. Gain 4 Armor.",
  "activeTurn": false,
  "spellCard": {
    "questAndReward": false
  }
}