{
  "name": "AnubisathDefender",
  "nameOnCard": "Anubisath Defender",
  "mana": 5,
  "rarity": "Epic",
  "classOfCard": "Neutral",
  "type": "Minion",
  "description": "Costs (0) if you have cost a spell that costs (5) or more this turn.",
  "activeTurn": false,
  "minionCard": {
    "Health": 5,
    "Attack": 3
  }
}