[
  ["Rouge", "case1", "result", "Friendly", "Card", "OtherHero", "Mana", "decrease","2",
  "case2", "condition","have","Weapon","result", "HeroPower", "Ultra" ],

  ["Priest", "case1", "Friendly","Spell", "All", "times","2"],

  ["Hunter", "case1", "Friendly", "Minion", "All","Rush"]


]