{
  "name": "BlessingOfTheAncients",
  "nameOnCard": "Blessing Of The Ancients",
  "mana": 3,
  "rarity": "Common",
  "classOfCard": "Neutral",
  "type": "Spell",
  "description": "Twinspell Give your minions +1/ +1",
  "activeTurn": false,
  "spellCard": {
    "questAndReward": false
  }
}