{
  "username": "Mostafa",
  "password": "1378",
  "numberOfManas": 50,
  "allDecks": [
    {
      "name": "Mage Special",
      "cards": [
        "Polymorph",
        "Alexstrasza",
        "Blur",
        "Blur",
        "Locust",
        "Polymorph",
        "Moonfire",
        "BloodFury",
        "Locust"
      ],
      "numOfPlays": 0,
      "numOfWins": 0,
      "winsToPlays": 0.0,
      "meanOfManas": 0.0,
      "heroName": "Mage",
      "mostFrequentCard": ""
    },
    {
      "name": "Neutral Heavy",
      "cards": [
        "DraconicEmissary",
        "DragonClaw",
        "DragonClaw",
        "Blur",
        "Locust",
        "GuardBot",
        "Moonfire",
        "BloodFury",
        "Locust"
      ],
      "numOfPlays": 0,
      "numOfWins": 0,
      "winsToPlays": 0.0,
      "meanOfManas": 0.0,
      "heroName": "Neutral",
      "mostFrequentCard": ""
    },
    {
      "name": "Hunter Special",
      "cards": [
        "DraconicEmissary",
        "SwampKingDred",
        "Blur",
        "Blur",
        "BloodFury",
        "GuardBot",
        "Moonfire",
        "BloodFury",
        "Locust"
      ],
      "numOfPlays": 0,
      "numOfWins": 0,
      "winsToPlays": 0.0,
      "meanOfManas": 0.0,
      "heroName": "Hunter",
      "mostFrequentCard": ""
    }
  ],
  "availableCards": [
    "Polymorph",
    "Alexstrasza",
    "Blur",
    "Locust",
    "Moonfire",
    "BloodFury",
    "DraconicEmissary",
    "DragonClaw",
    "GuardBot",
    "SwampKingDred"
  ],
  "currentDeck": {
    "name": "Mage Special",
    "cards": [
      "Polymorph",
      "Alexstrasza",
      "Blur",
      "Blur",
      "Locust",
      "Polymorph",
      "Moonfire",
      "BloodFury",
      "Locust"
    ],
    "numOfPlays": 0,
    "numOfWins": 0,
    "winsToPlays": 0.0,
    "meanOfManas": 0.0,
    "heroName": "Mage",
    "mostFrequentCard": ""
  },
  "hasChosenHero": false,
  "hasChosenDeck": false
}