{
  "name": "Dreadscale",
  "nameOnCard": "Dreadscale",
  "mana": 3,
  "rarity": "Legendary",
  "classOfCard": "Warlock",
  "type": "Minion",
  "description": "At the end of your turn, deal 1 damage to all other minions.",
  "activeTurn": false,
  "minionCard": {
    "Health": 2,
    "Attack": 4
  }
}