{
  "name": "PoisonedDagger",
  "nameOnCard": "Poisoned Dagger",
  "mana": 1,
  "rarity": "Common",
  "classOfCard": "Neutral",
  "type": "Weapon",
  "description": "",
  "activeTurn": false,
  "weaponCard": {
    "durability": 2,
    "attack": 2
  }
}