{
  "name": "Moonfire",
  "nameOnCard": "Moonfire",
  "mana": 0,
  "rarity": "Common",
  "classOfCard": "Neutral",
  "type": "Spell",
  "description": "Deal 1 damage.",
  "activeTurn": false,
  "spellCard": {
    "questAndReward": false
  }
}