{
  "systems": ["RenderSystem"],
  "entities": [
    {
      "Position": {
        "x": 180,
        "y": 100
      },
      "Shape": {
        "type": "Circle",
        "size": {
          "width": 32,
          "height": 32
        },
        "color": {
          "r": 100,
          "g": 100,
          "b": 100
        }
      }
    },
    {
      "Position": {
        "x": 460,
        "y": 100
      },
      "Shape": {
        "type": "Circle",
        "size": {
          "width": 32,
          "height": 32
        },
        "color": {
          "r": 100,
          "g": 100,
          "b": 100
        }
      }
    },
    {
      "Position": {
        "x": 50,
        "y": 200
      },
      "Shape": {
        "type": "Rectangle",
        "size": {
          "width": 540,
          "height": 32
        },
        "color": {
          "r": 255,
          "g": 0,
          "b": 0
        }
      }
    }
  ]
}
