2;0;5;4;2
3;3;4;0;0
5;4;0;2;0
7;4;2;5;2
5;0;5;2;2
9;4;1;0;2
3;3;3;5;1
2;5;2;4;1
0;3;4;1;1
7;2;1;1;1
1;2;5;5;0
9;3;2;1;2
2;1;0;5;0
5;2;1;5;1
5;5;0;4;2
8;0;0;4;2
6;4;2;5;2
2;1;2;3;1
8;2;5;1;1
5;2;1;1;0
5;4;0;3;1
9;4;2;5;1
8;0;1;4;0
0;1;0;2;0
7;5;0;1;0
8;3;0;4;1
3;2;0;3;2
5;5;1;0;2
8;0;4;1;1
9;5;0;1;0
6;0;5;3;2
2;2;2;1;0
9;2;0;5;1
1;5;0;0;0
3;1;0;4;1
3;2;4;5;1
2;4;3;1;2
0;3;3;4;2
1;5;1;2;2
6;4;3;5;2
2;3;2;0;1
5;5;1;4;2
7;4;2;4;0
8;3;2;0;2
6;4;2;1;2
8;5;1;0;1
9;1;3;1;1
8;2;2;4;1
2;5;0;3;1
0;0;6;4;0
3;4;2;1;2
7;4;0;0;2
6;1;1;0;1
9;5;1;1;2
2;4;3;2;0
1;0;1;5;0
8;0;3;3;0
8;0;7;1;0
1;1;4;4;2
6;4;2;3;0
5;1;2;4;0
7;3;2;3;0
7;0;1;2;2
8;3;3;1;0
5;1;4;3;1
2;2;2;2;1
3;1;0;2;0
6;4;2;4;2
9;2;5;1;1
5;3;2;3;2
1;4;1;3;1
8;0;2;3;1
9;1;6;1;2
6;2;4;0;0
7;4;1;3;2
9;4;1;4;0
0;2;0;0;2
7;4;1;0;1
5;0;4;2;0
3;3;3;4;1
2;4;1;4;0
0;0;4;4;0
0;0;1;4;0
0;2;2;3;1
1;1;5;4;1
6;1;0;5;1
0;5;0;2;1
5;4;2;3;0
1;5;0;2;1
6;0;4;5;1
8;5;0;1;1
8;5;0;4;2
9;1;4;0;0
1;3;0;1;1
6;0;5;2;2
1;5;0;0;1
7;5;0;2;2
5;4;2;4;2
0;1;1;3;1
6;2;1;1;1
