{
  "https://easylist-downloads.adblockplus.org/exceptionrules.txt": {
    "url": "https://easylist-downloads.adblockplus.org/exceptionrules.txt",
    "id": "acceptable_ads",
    "homepage": "",
    "languages": [],
    "type": "",
    "index": 1,
    "title": "Acceptable Ads"
  },
  "https://easylist-downloads.adblockplus.org/exceptionrules-privacy-friendly.txt": {
    "url": "https://easylist-downloads.adblockplus.org/exceptionrules-privacy-friendly.txt",
    "id": "acceptable_ads_privacy",
    "homepage": "",
    "languages": [],
    "type": "",
    "index": 2,
    "title": "Acceptable Ads Privacy"
  },
  "https://cdn.adblockcdn.com/filters/adblock_custom.txt": {
    "url": "https://cdn.adblockcdn.com/filters/adblock_custom.txt",
    "id": "adblock_custom",
    "homepage": "https://getadblock.com/help",
    "languages": [],
    "type": "ads",
    "index": 3,
    "title": "AdBlock Custom"
  },
  "https://cdn.adblockcdn.com/filters/distraction-control-video.txt": {
    "url": "https://cdn.adblockcdn.com/filters/distraction-control-video.txt",
    "id": "distraction-control-video",
    "homepage": "https://getadblock.com/help",
    "languages": [],
    "type": "distraction-control",
    "index": 4,
    "title": "Distraction Control - Video"
  },
  "https://cdn.adblockcdn.com/filters/distraction-control-survey.txt": {
    "url": "https://cdn.adblockcdn.com/filters/distraction-control-survey.txt",
    "id": "distraction-control-survey",
    "homepage": "https://getadblock.com/help",
    "languages": [],
    "type": "distraction-control",
    "index": 5,
    "title": "Distraction Control - Survey"
  },
  "https://cdn.adblockcdn.com/filters/distraction-control-newsletter.txt": {
    "url": "https://cdn.adblockcdn.com/filters/distraction-control-newsletter.txt",
    "id": "distraction-control-newsletter",
    "homepage": "https://getadblock.com/help",
    "languages": [],
    "type": "distraction-control",
    "index": 6,
    "title": "Distraction Control - Newsletter"
  },
  "https://cdn.adblockcdn.com/filters/distraction-control-push.txt": {
    "url": "https://cdn.adblockcdn.com/filters/distraction-control-push.txt",
    "id": "distraction-control-push",
    "homepage": "https://getadblock.com/help",
    "languages": [],
    "type": "distraction-control",
    "index": 7,
    "title": "Distraction Control - Notifications"
  },
  "https://raw.githubusercontent.com/hoshsadiq/adblock-nocoin-list/master/nocoin.txt": {
    "url": "https://raw.githubusercontent.com/hoshsadiq/adblock-nocoin-list/master/nocoin.txt",
    "id": "bitcoin_mining_protection",
    "homepage": "",
    "languages": [],
    "type": "",
    "index": 8,
    "title": "Acceptable Ads"
  },
  "https://easylist-downloads.adblockplus.org/antiadblockfilters.txt": {
    "url": "https://easylist-downloads.adblockplus.org/antiadblockfilters.txt",
    "id": "warning_removal",
    "homepage": "",
    "languages": [],
    "type": "",
    "index": 9,
    "title": "Warning Removal"
  },
  "https://www.void.gr/kargig/void-gr-filters.txt": {
    "url": "https://www.void.gr/kargig/void-gr-filters.txt",
    "id": "easylist_plus_greek",
    "homepage": "mailto:kargig at void.gr",
    "languages": ["el"],
    "type": "ads",
    "index": 10,
    "title": "EasyList Greek+EasyList"
  },
  "https://raw.githubusercontent.com/hufilter/hufilter/master/hufilter-abp.txt": {
    "url": "https://raw.githubusercontent.com/hufilter/hufilter/master/hufilter-abp.txt",
    "id": "hungarian",
    "homepage": "mailto:pete at teamlupus.hu",
    "languages": ["hu"],
    "type": "ads",
    "index": 11,
    "title": "EasyList Hungarian+EasyList"
  },
  "https://raw.githubusercontent.com/k2jp/abp-japanese-filters/master/abpjf.txt": {
    "url": "https://raw.githubusercontent.com/k2jp/abp-japanese-filters/master/abpjf.txt",
    "id": "japanese",
    "homepage": "https://github.com/k2jp/abp-japanese-filters/",
    "languages": ["ja"],
    "type": "ads",
    "index": 12,
    "title": "Japanese"
  },
  "https://easylist-downloads.adblockplus.org/abpindo+easylist.txt": {
    "url": "https://easylist-downloads.adblockplus.org/abpindo+easylist.txt",
    "id": "easylist_plus_indonesian",
    "homepage": "http://abpindo.blogspot.com/",
    "languages": ["id", "ms"],
    "type": "ads",
    "index": 13,
    "title": "ABPindo+EasyList"
  },
  "https://easylist-downloads.adblockplus.org/abpvn+easylist.txt": {
    "url": "https://easylist-downloads.adblockplus.org/abpvn+easylist.txt",
    "id": "easylist_plus_vietnamese",
    "homepage": "http://abpvn.com/",
    "languages": ["vi"],
    "type": "ads",
    "index": 14,
    "title": "ABPVN List+EasyList"
  },
  "https://easylist-downloads.adblockplus.org/bulgarian_list+easylist.txt": {
    "url": "https://easylist-downloads.adblockplus.org/bulgarian_list+easylist.txt",
    "id": "easylist_plus_bulgarian",
    "homepage": "http://stanev.org/abp/",
    "languages": ["bg"],
    "type": "ads",
    "index": 15,
    "title": "Bulgarian list+EasyList"
  },
  "https://easylist-downloads.adblockplus.org/easylist.txt": {
    "url": "https://easylist-downloads.adblockplus.org/easylist.txt",
    "id": "easylist",
    "homepage": "https://easylist.to/",
    "languages": ["en"],
    "type": "ads",
    "index": 16,
    "title": "EasyList"
  },
  "https://easylist-downloads.adblockplus.org/easylistchina+easylist.txt": {
    "url": "https://easylist-downloads.adblockplus.org/easylistchina+easylist.txt",
    "id": "chinese",
    "homepage": "http://abpchina.org/forum/",
    "languages": ["zh"],
    "type": "ads",
    "index": 17,
    "title": "EasyList China+EasyList"
  },
  "https://easylist-downloads.adblockplus.org/easylistczechslovak+easylist.txt": {
    "url": "https://easylist-downloads.adblockplus.org/easylistczechslovak+easylist.txt",
    "id": "czech",
    "homepage": "https://adblock.sk/",
    "languages": ["cs", "sk"],
    "type": "ads",
    "index": 18,
    "title": "EasyList Czech and Slovak+EasyList"
  },
  "https://easylist-downloads.adblockplus.org/easylistdutch+easylist.txt": {
    "url": "https://easylist-downloads.adblockplus.org/easylistdutch+easylist.txt",
    "id": "dutch",
    "homepage": "https://easylist.to/",
    "languages": ["nl"],
    "type": "ads",
    "index": 19,
    "title": "EasyList Dutch+EasyList"
  },
  "https://easylist-downloads.adblockplus.org/easylistgermany+easylist.txt": {
    "url": "https://easylist-downloads.adblockplus.org/easylistgermany+easylist.txt",
    "id": "easylist_plus_german",
    "homepage": "https://easylist.to/",
    "languages": ["de"],
    "type": "ads",
    "index": 20,
    "title": "EasyList Germany+EasyList"
  },
  "https://easylist-downloads.adblockplus.org/israellist+easylist.txt": {
    "url": "https://easylist-downloads.adblockplus.org/israellist+easylist.txt",
    "id": "israeli",
    "homepage": "https://github.com/easylist/EasyListHebrew",
    "languages": ["he"],
    "type": "ads",
    "index": 21,
    "title": "EasyList Hebrew+EasyList"
  },
  "https://easylist-downloads.adblockplus.org/easylistitaly+easylist.txt": {
    "url": "https://easylist-downloads.adblockplus.org/easylistitaly+easylist.txt",
    "id": "italian",
    "homepage": "https://easylist.to/",
    "languages": ["it"],
    "type": "ads",
    "index": 22,
    "title": "EasyList Italy+EasyList"
  },
  "https://easylist-downloads.adblockplus.org/easylistlithuania+easylist.txt": {
    "url": "https://easylist-downloads.adblockplus.org/easylistlithuania+easylist.txt",
    "id": "easylist_plus_lithuania",
    "homepage": "http://margevicius.lt/",
    "languages": ["lt"],
    "type": "ads",
    "index": 23,
    "title": "EasyList Lithuania+EasyList"
  },
  "https://easylist-downloads.adblockplus.org/easylistpolish+easylist.txt": {
    "url": "https://easylist-downloads.adblockplus.org/easylistpolish+easylist.txt",
    "id": "easylist_plus_polish",
    "homepage": "https://easylist.to/",
    "languages": ["pl"],
    "type": "ads",
    "index": 24,
    "title": "EasyList Polish+EasyList"
  },
  "https://easylist-downloads.adblockplus.org/easylistportuguese+easylist.txt": {
    "url": "https://easylist-downloads.adblockplus.org/easylistportuguese+easylist.txt",
    "id": "easylist_plus_portuguese",
    "homepage": "https://easylist.to/",
    "languages": ["pt"],
    "type": "ads",
    "index": 25,
    "title": "EasyList Portuguese+EasyList"
  },
  "https://easylist-downloads.adblockplus.org/easylistspanish+easylist.txt": {
    "url": "https://easylist-downloads.adblockplus.org/easylistspanish+easylist.txt",
    "id": "easylist_plus_spanish",
    "homepage": "https://easylist.to/",
    "languages": ["es"],
    "type": "ads",
    "index": 26,
    "title": "EasyList Spanish+EasyList"
  },
  "https://easylist-downloads.adblockplus.org/indianlist+easylist.txt": {
    "url": "https://easylist-downloads.adblockplus.org/indianlist+easylist.txt",
    "id": "easylist_plus_indian",
    "homepage": "https://easylist.to/",
    "languages": ["bn", "gu", "hi", "pa", "as", "mr", "ml", "te", "kn", "or", "ne", "si"],
    "type": "ads",
    "index": 27,
    "title": "IndianList+EasyList"
  },
  "https://easylist-downloads.adblockplus.org/koreanlist+easylist.txt": {
    "url": "https://easylist-downloads.adblockplus.org/koreanlist+easylist.txt",
    "id": "easylist_plun_korean",
    "homepage": "https://easylist.to/",
    "languages": ["ko"],
    "type": "ads",
    "index": 28,
    "title": "KoreanList+EasyList"
  },
  "https://easylist-downloads.adblockplus.org/latvianlist+easylist.txt": {
    "url": "https://easylist-downloads.adblockplus.org/latvianlist+easylist.txt",
    "id": "latvian",
    "homepage": "https://notabug.org/latvian-list/adblock-latvian",
    "languages": ["lv"],
    "type": "ads",
    "index": 29,
    "title": "Latvian List+EasyList"
  },
  "https://easylist-downloads.adblockplus.org/liste_ar+liste_fr+easylist.txt": {
    "url": "https://easylist-downloads.adblockplus.org/liste_ar+liste_fr+easylist.txt",
    "id": "easylist_plus_arabic_plus_french",
    "homepage": "https://code.google.com/p/liste-ar-adblock/",
    "languages": ["ar"],
    "type": "ads",
    "index": 30,
    "title": "Liste AR+Liste FR+EasyList"
  },
  "https://easylist-downloads.adblockplus.org/liste_fr+easylist.txt": {
    "url": "https://easylist-downloads.adblockplus.org/liste_fr+easylist.txt",
    "id": "easylist_plus_french",
    "homepage": "https://forums.lanik.us/viewforum.php?f",
    "languages": ["fr"],
    "type": "ads",
    "index": 31,
    "title": "Liste FR+EasyList"
  },
  "https://easylist-downloads.adblockplus.org/ruadlist+easylist.txt": {
    "url": "https://easylist-downloads.adblockplus.org/ruadlist+easylist.txt",
    "id": "russian",
    "homepage": "https://forums.lanik.us/viewforum.php?f",
    "languages": ["ru", "uk"],
    "type": "ads",
    "index": 32,
    "title": "RuAdList+EasyList"
  },
  "https://easylist-downloads.adblockplus.org/rolist+easylist.txt": {
    "type": "ads",
    "index": 33,
    "languages": ["ro"],
    "id": "easylist_plus_romanian",
    "title": "ROList+EasyList",
    "url": "https://easylist-downloads.adblockplus.org/rolist+easylist.txt",
    "homepage": "https://zoso.ro/rolist/",
    "language": true,
    "hidden": false
  },
  "https://easylist-downloads.adblockplus.org/abp-filters-anti-cv.txt": {
    "url": "https://easylist-downloads.adblockplus.org/abp-filters-anti-cv.txt",
    "id": "anticircumvent",
    "homepage": "https://github.com/abp-filters/abp-filters-anti-cv",
    "languages": [],
    "type": "circumvention",
    "index": 34,
    "title": "ABP filters"
  },
  "https://easylist-downloads.adblockplus.org/easyprivacy.txt": {
    "url": "https://easylist-downloads.adblockplus.org/easyprivacy.txt",
    "id": "easyprivacy",
    "homepage": "https://easylist.to/",
    "languages": [],
    "type": "privacy",
    "index": 35,
    "title": "EasyPrivacy"
  },
  "https://easylist-downloads.adblockplus.org/i_dont_care_about_cookies.txt": {
    "url": "https://easylist-downloads.adblockplus.org/i_dont_care_about_cookies.txt",
    "id": "idcac",
    "homepage": "https://www.i-dont-care-about-cookies.eu/",
    "languages": [],
    "type": "cookies",
    "index": 36,
    "title": "I Don't Care About Cookies"
  },
  "https://easylist-downloads.adblockplus.org/fanboy-social.txt": {
    "url": "https://easylist-downloads.adblockplus.org/fanboy-social.txt",
    "id": "antisocial",
    "homepage": "https://easylist.to/",
    "languages": [],
    "type": "social",
    "index": 37,
    "title": "Fanboy's Social Blocking List"
  },
  "https://fanboy.co.nz/fanboy-annoyance.txt": {
    "url": "https://fanboy.co.nz/fanboy-annoyance.txt",
    "id": "annoyances",
    "homepage": "https://easylist.to/",
    "languages": [],
    "type": "social",
    "index": 38,
    "title": "Fanboy's Annoyances"
  },
  "https://easylist-downloads.adblockplus.org/fanboy-notifications.txt": {
    "type": "notifications",
    "index": 39,
    "id": "fb_notifications",
    "title": "Fanboy's Notifications Blocking List",
    "url": "https://easylist-downloads.adblockplus.org/fanboy-notifications.txt",
    "homepage": "https://easylist.to/",
    "languages": []
  },
  "https://fanboy.co.nz/fanboy-turkish.txt": {
    "url": "https://fanboy.co.nz/fanboy-turkish.txt",
    "id": "turkish",
    "language": true,
    "index": 40,
    "hidden": false
  },
  "https://easylist-downloads.adblockplus.org/Liste_AR.txt": {
    "url": "https://easylist-downloads.adblockplus.org/Liste_AR.txt",
    "id": "easylist_plus_arabic",
    "language": true,
    "index": 41,
    "hidden": true
  },
  "https://margevicius.lt/easylistlithuania.txt": {
    "url": "https://margevicius.lt/easylistlithuania.txt",
    "id": "easylist_plus_lithuania_old",
    "language": true,
    "index": 42,
    "hidden": true
  },
  "https://notabug.org/latvian-list/adblock-latvian/raw/master/lists/latvian-list.txt": {
    "url": "https://notabug.org/latvian-list/adblock-latvian/raw/master/lists/latvian-list.txt",
    "id": "latvian_old",
    "index": 43,
    "language": true,
    "hidden": true
  },
  "https://easylist-downloads.adblockplus.org/easylistitaly.txt": {
    "url": "https://easylist-downloads.adblockplus.org/easylistitaly.txt",
    "id": "italian_old",
    "index": 44,
    "language": true,
    "hidden": true
  },
  "https://stanev.org/abp/adblock_bg.txt": {
    "url": "https://stanev.org/abp/adblock_bg.txt",
    "id": "easylist_plus_bulgarian_old",
    "index": 45,
    "language": true,
    "hidden": true
  },
  "https://easylist-downloads.adblockplus.org/easylistdutch.txt": {
    "url": "https://easylist-downloads.adblockplus.org/easylistdutch.txt",
    "id": "dutch_old",
    "index": 46,
    "language": true,
    "hidden": true
  },
  "https://easylist-downloads.adblockplus.org/liste_fr.txt": {
    "url": "https://easylist-downloads.adblockplus.org/liste_fr.txt",
    "id": "easylist_plus_french_old",
    "index": 47,
    "language": true,
    "hidden": true
  },
  "https://easylist-downloads.adblockplus.org/easylistgermany.txt": {
    "url": "https://easylist-downloads.adblockplus.org/easylistgermany.txt",
    "id": "easylist_plus_german_old",
    "index": 48,
    "language": true,
    "hidden": true
  },
  "https://raw.githubusercontent.com/heradhis/indonesianadblockrules/master/subscriptions/abpindo.txt": {
    "url": "https://raw.githubusercontent.com/heradhis/indonesianadblockrules/master/subscriptions/abpindo.txt",
    "id": "easylist_plus_indonesian_old",
    "index": 49,
    "language": true,
    "hidden": true
  },
  "https://www.certyficate.it/adblock/adblock.txt": {
    "url": "https://www.certyficate.it/adblock/adblock.txt",
    "id": "easylist_plus_polish_old",
    "index": 50,
    "language": true,
    "hidden": true
  },
  "https://www.zoso.ro/pages/rolist.txt": {
    "url": "https://www.zoso.ro/pages/rolist.txt",
    "id": "easylist_plus_romanian_old",
    "index": 51,
    "language": true,
    "hidden": true
  },
  "https://easylist-downloads.adblockplus.org/advblock.txt": {
    "url": "https://easylist-downloads.adblockplus.org/advblock.txt",
    "id": "russian_old",
    "index": 52,
    "language": true,
    "hidden": true
  },
  "https://easylist-downloads.adblockplus.org/easylistchina.txt": {
    "url": "https://easylist-downloads.adblockplus.org/easylistchina.txt",
    "id": "chinese_old",
    "index": 53,
    "language": true,
    "hidden": true
  },
  "https://raw.github.com/tomasko126/easylistczechandslovak/master/filters.txt": {
    "url": "https://raw.github.com/tomasko126/easylistczechandslovak/master/filters.txt",
    "id": "czech_old",
    "index": 54,
    "language": true,
    "hidden": true
  },
  "https://easylist-downloads.adblockplus.org/dandelion_sprouts_nordic_filters+easylist.txt": {
    "type": "ads",
    "index": 55,
    "languages": ["no", "nb", "nn", "da", "is", "fo", "kl", "sv", "fi"],
    "title": "Nordic Filters+EasyList",
    "url": "https://easylist-downloads.adblockplus.org/dandelion_sprouts_nordic_filters+easylist.txt",
    "homepage": "https://github.com/DandelionSprout/adfilt",
    "language": true,
    "hidden": false,
    "id": "nordic"
  }
}
