CONTA;CONTA ORIGEM;CONTA SOMATORIA;MULTIPLICADOR;;
;34;11005;;SER;DAC
;42;11007;;SER;DAC
;67;12003;;SER;DAC
;240;21002;;SER;DAC
;448;22001;;SER;DAC
;554;13001;;SER;DAC
;562;13001;;SER;DAC
;570;13001;-1;SER;DAC
;620;13003;-1;SER;DAC
;653;13005;-1;SER;DAC
;1099;25001;;SER;DAC
;1107;25001;-1;SER;DAC
;1115;25002;;SER;DAC
;1123;25002;;SER;DAC
;1131;25002;;SER;DAC
;1149;25003;;SER;DAC
;1693;25001;;SER;DAC
;1701;25001;;SER;DAC
;1909;25003;-1;SER;DAC
;2428;13001;;SER;DAC
;2469;13002;;SER;DAC
;4630;11001;;SER;DAC
;4648;11001;;SER;DAC
;4655;11021;;SER;DAC
;4663;11001;;SER;DAC
;4689;11002;;SER;DAC
;4739;11004;;SER;DAC
;4754;11004;;SER;DAC
;4762;11005;;SER;DAC
;4770;11011;;SER;DAC
;4804;11100;;SER;DAC
;4812;11021;;SER;DAC
;4820;11006;;SER;DAC
;4838;11007;;SER;DAC
;4846;11100;;SER;DAC
;4853;11100;;SER;DAC
;4861;12001;;SER;DAC
;4879;12100;;SER;DAC
;4887;12100;;SER;DAC
;4895;12100;;SER;DAC
;4903;12010;;SER;DAC
;4945;13001;;SER;DAC
;4952;13001;;SER;DAC
;4960;13002;;SER;DAC
;4978;13002;;SER;DAC
;4986;13002;;SER;DAC
;4994;13002;;SER;DAC
;5009;13002;;SER;DAC
;5017;13002;;SER;DAC
;5033;13002;;SER;DAC
;5041;13002;;SER;DAC
;5058;13004;;SER;DAC
;5066;13004;;SER;DAC
;5074;13004;;SER;DAC
;5082;13004;;SER;DAC
;5090;13004;;SER;DAC
;5108;21001;;SER;DAC
;5181;21004;;SER;DAC
;5199;21008;;SER;DAC
;5215;21010;;SER;DAC
;5223;21010;;SER;DAC
;5231;21100;;SER;DAC
;5249;21006;;SER;DAC
;5256;21100;;SER;DAC
;5264;22012;;SER;DAC
;5298;21002;;SER;DAC
;5306;21002;;SER;DAC
;5314;21002;;SER;DAC
;5322;21002;;SER;DAC
;5330;21100;;SER;DAC
;5355;21100;;SER;DAC
;5371;22001;;SER;DAC
;5389;22001;;SER;DAC
;5397;22001;;SER;DAC
;5405;22001;;SER;DAC
;5413;22001;;SER;DAC
;5421;22100;;SER;DAC
;5439;22012;;SER;DAC
;5462;22002;;SER;DAC
;5470;22010;;SER;DAC
;5496;22006;;SER;DAC
;5512;22100;;SER;DAC
;5538;23001;;SER;DAC
;5546;23002;-1;SER;DAC
;5561;25002;;SER;DAC
;6353;12002;;SER;DAC
;6379;12002;;SER;DAC
;6387;12003;;SER;DAC
;6957;11002;;SER;DAC
;6965;11002;;SER;DAC
;6973;11002;;SER;DAC
;6981;11002;;SER;DAC
;6999;11002;;SER;DAC
;7013;11008;;SER;DAC
;7021;11008;;SER;DAC
;7039;11008;;SER;DAC
;7047;11004;;SER;DAC
;7054;11004;;SER;DAC
;7062;11004;;SER;DAC
;7070;11004;;SER;DAC
;7088;11004;;SER;DAC
;7120;11004;;SER;DAC
;7138;11004;;SER;DAC
;7146;11004;;SER;DAC
;7153;11004;;SER;DAC
;7161;12005;;SER;DAC
;7179;11022;;SER;DAC
;7187;11100;;SER;DAC
;7195;13001;;SER;DAC
;7203;11021;;SER;DAC
;7211;11005;;SER;DAC
;7229;11004;;SER;DAC
;7237;11100;;SER;DAC
;7245;11002;;SER;DAC
;7252;12001;;SER;DAC
;7260;12001;;SER;DAC
;7278;12001;;SER;DAC
;7286;12002;;SER;DAC
;7328;12002;;SER;DAC
;7336;12002;;SER;DAC
;7344;12002;;SER;DAC
;7351;12002;;SER;DAC
;7369;12002;;SER;DAC
;7377;12002;;SER;DAC
;7385;12002;;SER;DAC
;7393;12002;;SER;DAC
;7401;12100;;SER;DAC
;7419;12018;;SER;DAC
;7427;12017;;SER;DAC
;7443;12003;;SER;DAC
;7450;12003;;SER;DAC
;7468;12003;;SER;DAC
;7476;13001;;SER;DAC
;7484;12018;;SER;DAC
;7492;12003;;SER;DAC
;7500;12100;;SER;DAC
;7518;12002;;SER;DAC
;7526;12005;;SER;DAC
;7534;13001;;SER;DAC
;7542;13002;;SER;DAC
;7559;13002;;SER;DAC
;7567;13002;;SER;DAC
;7575;13002;;SER;DAC
;7583;13002;;SER;DAC
;7591;13002;;SER;DAC
;7609;13002;;SER;DAC
;7617;13002;;SER;DAC
;7625;21001;;SER;DAC
;7641;21009;;SER;DAC
;7658;21009;;SER;DAC
;7666;21009;;SER;DAC
;7682;21002;;SER;DAC
;7708;21002;;SER;DAC
;7716;21002;;SER;DAC
;7732;21010;;SER;DAC
;7740;21009;;SER;DAC
;7757;21009;;SER;DAC
;7765;21023;;SER;DAC
;7773;21010;;SER;DAC
;7781;21010;;SER;DAC
;7799;21010;;SER;DAC
;7807;21010;;SER;DAC
;7815;22017;;SER;DAC
;7823;22017;;SER;DAC
;7831;22010;;SER;DAC
;7856;22003;;SER;DAC
;7864;22003;;SER;DAC
;7872;22003;;SER;DAC
;7880;22001;;SER;DAC
;7906;22001;;SER;DAC
;7914;22001;;SER;DAC
;7948;22003;;SER;DAC
;7955;22100;;SER;DAC
;7963;22003;;SER;DAC
;7971;22003;;SER;DAC
;7989;22004;;SER;DAC
;7997;22019;;SER;DAC
;8003;22100;;SER;DAC
;8011;22004;;SER;DAC
;8029;25002;;SER;DAC
;8151;11004;;SER;DAC
;8169;12002;;SER;DAC
;8938;25002;-1;SER;DAC
;8946;25003;-1;SER;DAC
;9209;11100;;SER;DAC
;9332;12100;;SER;DAC
;24638;12010;;SER;DAC
;24661;11003;-1;SER;DAC
;24687;11003;-1;SER;DAC
;24703;11003;-1;SER;DAC
;24729;11003;-1;SER;DAC
;24760;12001;-1;SER;DAC
;24786;12001;-1;SER;DAC
;24802;12001;-1;SER;DAC
;24828;12001;-1;SER;DAC
;24851;21002;;SER;DAC
;25007;11003;-1;SER;DAC
;25460;11100;;SER;DAC
;25577;21007;;SER;DAC
;25585;21005;;SER;DAC
;25593;11100;;SER;DAC
;25601;12100;;SER;DAC
;25874;25003;;SER;DAC
;25882;25003;;SER;DAC
;25908;24000;;SER;DAC
;34010;11002;;SER;DAC
;34011;11002;;SER;DAC
;34012;12001;;SER;DAC
;34013;11002;;SER;DAC
;34015;11021;-1;SER;DAC
;34017;12001;;SER;DAC
;34018;11002;;SER;DAC
;34019;11002;;SER;DAC
;34020;11002;;SER;DAC
;34021;11002;;SER;DAC
;34022;11002;;SER;DAC
;34024;11002;;SER;DAC
;34026;21002;;SER;DAC
;34028;11004;;SER;DAC
;34029;11004;;SER;DAC
;34030;11004;;SER;DAC
;34031;11004;;SER;DAC
;34032;11004;;SER;DAC
;34033;11004;;SER;DAC
;34034;11004;;SER;DAC
;34037;11004;-1;SER;DAC
;34041;12010;;SER;DAC
;34042;22014;;SER;DAC
;34045;12005;;SER;DAC
;34047;11013;;SER;DAC
;34048;11100;;SER;DAC
;34049;11006;;SER;DAC
;34050;11017;;SER;DAC
;34051;11007;;SER;DAC
;34054;12018;-1;SER;DAC
;34055;21001;;SER;DAC
;34057;21001;;SER;DAC
;34058;21001;;SER;DAC
;34059;22004;;SER;DAC
;34062;21016;;SER;DAC
;34064;21002;;SER;DAC
;34065;11002;;SER;DAC
;34066;12001;;SER;DAC
;34067;12001;;SER;DAC
;34068;12001;;SER;DAC
;34069;12001;;SER;DAC
;34070;11002;;SER;DAC
;34071;12001;;SER;DAC
;34074;12002;;SER;DAC
;34076;12002;-1;SER;DAC
;34080;22012;;SER;DAC
;34081;12012;;SER;DAC
;34086;12016;;SER;DAC
;34087;12004;;SER;DAC
;34088;12100;;SER;DAC
;34089;12100;;SER;DAC
;34091;12100;;SER;DAC
;34092;12100;;SER;DAC
;34093;12100;;SER;DAC
;34096;13001;;SER;DAC
;34097;13001;;SER;DAC
;34098;13001;;SER;DAC
;34099;13001;-1;SER;DAC
;34100;13002;;SER;DAC
;34101;13002;;SER;DAC
;34102;13002;;SER;DAC
;34103;13002;;SER;DAC
;34104;13002;;SER;DAC
;34105;13002;;SER;DAC
;34106;13002;;SER;DAC
;34107;13002;;SER;DAC
;34108;13002;;SER;DAC
;34109;13002;;SER;DAC
;34129;21002;;SER;DAC
;34130;21002;;SER;DAC
;34132;21002;;SER;DAC
;34133;21002;;SER;DAC
;34134;22001;;SER;DAC
;34135;21002;;SER;DAC
;34136;21023;;SER;DAC
;34137;21023;;SER;DAC
;34138;21023;;SER;DAC
;34139;21023;;SER;DAC
;34140;21002;;SER;DAC
;34141;21023;;SER;DAC
;34151;21006;;SER;DAC
;34155;12010;;SER;DAC
;34157;21014;;SER;DAC
;34165;21015;;SER;DAC
;34166;21008;;SER;DAC
;34167;22100;;SER;DAC
;34168;21020;;SER;DAC
;34169;21100;;SER;DAC
;34170;21100;;SER;DAC
;34171;21100;;SER;DAC
;34173;22017;;SER;DAC
;34176;22007;;SER;DAC
;34177;22001;;SER;DAC
;34178;22001;;SER;DAC
;34179;21002;;SER;DAC
;34180;22003;;SER;DAC
;34182;22019;;SER;DAC
;34183;22019;;SER;DAC
;34184;22019;;SER;DAC
;34185;22019;;SER;DAC
;34186;22001;;SER;DAC
;34187;22019;;SER;DAC
;34189;22002;;SER;DAC
;34197;22012;;SER;DAC
;34198;12012;;SER;DAC
;34201;21001;;SER;DAC
;34202;22004;;SER;DAC
;34204;22100;;SER;DAC
;34205;21008;;SER;DAC
;34206;22013;;SER;DAC
;34207;22021;;SER;DAC
;34208;22016;;SER;DAC
;34210;25002;;SER;DAC
;34211;25002;;SER;DAC
;34212;25002;;SER;DAC
;34214;25002;;SER;DAC
;34215;25003;;SER;DAC
;34232;23001;;SER;DAC
;34267;21002;;SER;DAC
;34268;22001;;SER;DAC
;34269;21002;;SER;DAC
;34270;22001;;SER;DAC
;34271;21002;;SER;DAC
;34272;22001;;SER;DAC
;34273;21002;;SER;DAC
;34274;22001;;SER;DAC
;34286;23001;;SER;DAC
;34287;23001;;SER;DAC
;34288;23001;;SER;DAC
;34289;23002;-1;SER;DAC
;34290;23002;-1;SER;DAC
;34291;23002;-1;SER;DAC
;34538;11017;;SER;DAC
;34539;12100;;SER;DAC
;34540;11017;;SER;DAC
;34541;12100;;SER;DAC
;34542;21008;;SER;DAC
;34543;22100;;SER;DAC
;34544;21008;;SER;DAC
;34545;22100;;SER;DAC
;34576;11004;;SER;DAC
;34577;12002;;SER;DAC
;34579;21005;;SER;DAC
;34580;21005;;SER;DAC
;34581;21005;;SER;DAC
;34582;21005;;SER;DAC
;34583;21005;;SER;DAC
;34584;22010;;SER;DAC
;34585;22010;;SER;DAC
;34586;22010;;SER;DAC
;34587;22010;;SER;DAC
;34588;22010;;SER;DAC
;34604;13002;;SER;DAC
;34606;21001;;SER;DAC
;34607;22017;;SER;DAC
;34608;21100;;SER;DAC
;34609;22100;;SER;DAC
;34610;21002;;SER;DAC
;34611;22001;;SER;DAC
;34612;12012;;SER;DAC
;34613;12012;;SER;DAC
;34614;21014;;SER;DAC
;34615;22014;;SER;DAC
;34616;12010;;SER;DAC
;34617;12010;;SER;DAC
;34618;22012;;SER;DAC
;34619;22012;;SER;DAC
;34620;11021;;SER;DAC
;34621;12018;;SER;DAC
;34622;11021;;SER;DAC
;34623;12018;;SER;DAC
;34624;11021;;SER;DAC
;34625;12018;;SER;DAC
;34626;11021;;SER;DAC
;34627;11021;;SER;DAC
;34628;12018;;SER;DAC
;34629;11015;;SER;DAC
;34630;12018;;SER;DAC
;34756;11003;-1;SER;DAC
;34757;12001;-1;SER;DAC
;1100199;11000;;DAC;DAC
;1102199;11000;;DAC;DAC
;1100299;11000;;DAC;DAC
;1100499;11000;;DAC;DAC
;11006;11000;;DAC;DAC
;1201299;11000;;DAC;DAC
;11099;11000;;DAC;DAC
;1100899;11099;;DAC;DAC
;1110099;11099;;DAC;DAC
;1201899;12000;;DAC;DAC
;1201099;12000;;DAC;DAC
;1200499;12000;;DAC;DAC
;12021;12000;;DAC;DAC
;12099;12000;;DAC;DAC
;1200199;12099;;DAC;DAC
;1210099;12099;;DAC;DAC
;13001;13000;;DAC;DAC
;1300299;13000;;DAC;DAC
;1300499;13000;;DAC;DAC
;21001;21000;;DAC;DAC
;2100299;21000;;DAC;DAC
;2100599;21000;;DAC;DAC
;21008;21000;;DAC;DAC
;21006;21000;;DAC;DAC
;2101299;21000;;DAC;DAC
;21099;21000;;DAC;DAC
;2100999;21099;;DAC;DAC
;2110099;21099;;DAC;DAC
;2200199;22000;;DAC;DAC
;2201299;22000;;DAC;DAC
;22021;22000;;DAC;DAC
;22002;22000;;DAC;DAC
;22099;22000;;DAC;DAC
;2200399;22099;;DAC;DAC
;2210099;22099;;DAC;DAC
;23001;23000;;DAC;DAC
;23002;23000;;DAC;DAC
;25001;25000;;DAC;DAC
;2500299;25000;;DAC;DAC
;24000;25000;;DAC;DAC
;11001;1100199;;DAC;DAC
;11011;1100199;;DAC;DAC
;11002;1100299;;DAC;DAC
;11003;1100299;;DAC;DAC
;11004;1100499;;DAC;DAC
;11005;1100499;;DAC;DAC
;11007;1100899;;DAC;DAC
;11008;1100899;;DAC;DAC
;11009;1100899;;DAC;DAC
;11010;1100899;;DAC;DAC
;11016;1100899;;DAC;DAC
;11022;1100899;;DAC;DAC
;11023;1100899;;DAC;DAC
;11021;1102199;;DAC;DAC
;11025;1102199;;DAC;DAC
;11015;1102199;;DAC;DAC
;11100;1110099;;DAC;DAC
;11017;1110099;;DAC;DAC
;11018;1110099;;DAC;DAC
;11020;1110099;;DAC;DAC
;11019;1110099;;DAC;DAC
;11024;1110099;;DAC;DAC
;12001;1200199;;DAC;DAC
;12002;1200199;;DAC;DAC
;12003;1200199;;DAC;DAC
;12014;1200199;;DAC;DAC
;12015;1200199;;DAC;DAC
;12022;1200199;;DAC;DAC
;12023;1200199;;DAC;DAC
;12024;1200199;;DAC;DAC
;12005;1200199;;DAC;DAC
;11013;1200499;;DAC;DAC
;12004;1200499;;DAC;DAC
;12010;1201099;;DAC;DAC
;12012;1201099;;DAC;DAC
;11012;1201299;;DAC;DAC
;11014;1201299;;DAC;DAC
;12018;1201899;;DAC;DAC
;12025;1210099;;DAC;DAC
;12100;1210099;;DAC;DAC
;12006;1210099;;DAC;DAC
;12007;1210099;;DAC;DAC
;12008;1210099;;DAC;DAC
;12009;1210099;;DAC;DAC
;12011;1210099;;DAC;DAC
;12013;1210099;;DAC;DAC
;12016;1210099;;DAC;DAC
;12017;1210099;;DAC;DAC
;12019;1210099;;DAC;DAC
;12020;1210099;;DAC;DAC
;13002;1300299;;DAC;DAC
;13003;1300299;;DAC;DAC
;13004;1300499;;DAC;DAC
;13005;1300499;;DAC;DAC
;21002;2100299;;DAC;DAC
;21003;2100299;;DAC;DAC
;21004;2100299;;DAC;DAC
;21023;2100299;;DAC;DAC
;21025;2100299;;DAC;DAC
;21005;2100599;;DAC;DAC
;21007;2100599;;DAC;DAC
;21009;2100999;;DAC;DAC
;21010;2100999;;DAC;DAC
;21011;2100999;;DAC;DAC
;21015;2100999;;DAC;DAC
;21019;2100999;;DAC;DAC
;21024;2100999;;DAC;DAC
;21012;2101299;;DAC;DAC
;21014;2101299;;DAC;DAC
;21013;2110099;;DAC;DAC
;21017;2110099;;DAC;DAC
;21016;2110099;;DAC;DAC
;21018;2110099;;DAC;DAC
;21021;2110099;;DAC;DAC
;21022;2110099;;DAC;DAC
;21020;2110099;;DAC;DAC
;21100;2110099;;DAC;DAC
;22001;2200199;;DAC;DAC
;22019;2200199;;DAC;DAC
;22022;2200199;;DAC;DAC
;22003;2200399;;DAC;DAC
;22004;2200399;;DAC;DAC
;22010;2200399;;DAC;DAC
;22017;2200399;;DAC;DAC
;22012;2201299;;DAC;DAC
;22014;2201299;;DAC;DAC
;22006;2210099;;DAC;DAC
;22007;2210099;;DAC;DAC
;22008;2210099;;DAC;DAC
;22009;2210099;;DAC;DAC
;22013;2210099;;DAC;DAC
;22015;2210099;;DAC;DAC
;22016;2210099;;DAC;DAC
;22018;2210099;;DAC;DAC
;22020;2210099;;DAC;DAC
;22023;2210099;;DAC;DAC
;22024;2210099;;DAC;DAC
;22025;2210099;;DAC;DAC
;22005;2210099;;DAC;DAC
;22011;2210099;;DAC;DAC
;22100;2210099;;DAC;DAC
;25002;2500299;;DAC;DAC
;25003;2500299;;DAC;DAC
;11000;14000;;DAC;DAC
;12000;14000;;DAC;DAC
;13000;14000;;DAC;DAC
;21000;26000;;DAC;DAC
;22000;26000;;DAC;DAC
;23000;26000;;DAC;DAC
;25000;26000;;DAC;DAC
;1214;31000;;SER;DAC
;1214;31001;;SER;DAC
;1214;32000;;SER;DAC
;1214;33000;;SER;DAC
;1214;34000;;SER;DAC
;1214;35000;;SER;DAC
;1214;36000;;SER;DAC
;1214;37000;;SER;DAC
;1214;41002;;SER;DAC
;1214;42000;;SER;DAC
;1271;33001;-1;SER;DAC
;1271;34000;-1;SER;DAC
;1271;35000;-1;SER;DAC
;1271;36000;-1;SER;DAC
;1271;37000;-1;SER;DAC
;1271;41002;-1;SER;DAC
;1271;42000;-1;SER;DAC
;1305;33001;-1;SER;DAC
;1305;34000;-1;SER;DAC
;1305;35000;-1;SER;DAC
;1305;36000;-1;SER;DAC
;1305;37000;-1;SER;DAC
;1305;41002;-1;SER;DAC
;1305;42000;-1;SER;DAC
;1362;35001;;SER;DAC
;1362;36000;;SER;DAC
;1362;37000;;SER;DAC
;1362;41002;;SER;DAC
;1362;42000;;SER;DAC
;1404;35001;-1;SER;DAC
;1404;36000;-1;SER;DAC
;1404;37000;-1;SER;DAC
;1404;41002;-1;SER;DAC
;1404;42000;-1;SER;DAC
;1917;35002;;SER;DAC
;1917;36000;;SER;DAC
;1917;37000;;SER;DAC
;1917;41002;;SER;DAC
;1917;42000;;SER;DAC
;2790;31000;;SER;DAC
;2790;31001;;SER;DAC
;2790;32000;;SER;DAC
;2790;33000;;SER;DAC
;2790;34000;;SER;DAC
;2790;35000;;SER;DAC
;2790;36000;;SER;DAC
;2790;37000;;SER;DAC
;2790;41002;;SER;DAC
;2790;42000;;SER;DAC
;3392;33001;-1;SER;DAC
;3392;34000;-1;SER;DAC
;3392;35000;-1;SER;DAC
;3392;36000;-1;SER;DAC
;3392;37000;-1;SER;DAC
;3392;41002;-1;SER;DAC
;3392;42000;-1;SER;DAC
;5611;31000;;SER;DAC
;5611;31001;;SER;DAC
;5611;32000;;SER;DAC
;5611;33000;;SER;DAC
;5611;34000;;SER;DAC
;5611;35000;;SER;DAC
;5611;36000;;SER;DAC
;5611;37000;;SER;DAC
;5611;41002;;SER;DAC
;5611;42000;;SER;DAC
;5629;31000;;SER;DAC
;5629;31002;;SER;DAC
;5629;32000;;SER;DAC
;5629;33000;;SER;DAC
;5629;34000;;SER;DAC
;5629;35000;;SER;DAC
;5629;36000;;SER;DAC
;5629;37000;;SER;DAC
;5629;41002;;SER;DAC
;5629;42000;;SER;DAC
;5645;31000;;SER;DAC
;5645;31002;;SER;DAC
;5645;32000;;SER;DAC
;5645;33000;;SER;DAC
;5645;34000;;SER;DAC
;5645;35000;;SER;DAC
;5645;36000;;SER;DAC
;5645;37000;;SER;DAC
;5645;41002;;SER;DAC
;5645;42000;;SER;DAC
;5652;31003;-1;SER;DAC
;5652;32000;-1;SER;DAC
;5652;33000;-1;SER;DAC
;5652;34000;-1;SER;DAC
;5652;35000;-1;SER;DAC
;5652;36000;-1;SER;DAC
;5652;37000;-1;SER;DAC
;5652;41002;-1;SER;DAC
;5652;42000;-1;SER;DAC
;5660;31003;-1;SER;DAC
;5660;32000;-1;SER;DAC
;5660;33000;-1;SER;DAC
;5660;34000;-1;SER;DAC
;5660;35000;-1;SER;DAC
;5660;36000;-1;SER;DAC
;5660;37000;-1;SER;DAC
;5660;41002;-1;SER;DAC
;5660;42000;-1;SER;DAC
;5678;31003;-1;SER;DAC
;5678;32000;-1;SER;DAC
;5678;33000;-1;SER;DAC
;5678;34000;-1;SER;DAC
;5678;35000;-1;SER;DAC
;5678;36000;-1;SER;DAC
;5678;37000;-1;SER;DAC
;5678;41002;-1;SER;DAC
;5678;42000;-1;SER;DAC
;5710;35001;;SER;DAC
;5710;36000;;SER;DAC
;5710;37000;;SER;DAC
;5710;41002;;SER;DAC
;5710;42000;;SER;DAC
;5728;33003;;SER;DAC
;5728;34000;;SER;DAC
;5728;35000;;SER;DAC
;5728;36000;;SER;DAC
;5728;37000;;SER;DAC
;5728;41002;;SER;DAC
;5728;42000;;SER;DAC
;5777;34003;;SER;DAC
;5777;35000;;SER;DAC
;5777;36000;;SER;DAC
;5777;37000;;SER;DAC
;5777;41002;;SER;DAC
;5777;42000;;SER;DAC
;5793;32001;-1;SER;DAC
;5793;33000;-1;SER;DAC
;5793;34000;-1;SER;DAC
;5793;35000;-1;SER;DAC
;5793;36000;-1;SER;DAC
;5793;37000;-1;SER;DAC
;5793;41002;-1;SER;DAC
;5793;42000;-1;SER;DAC
;5801;32001;-1;SER;DAC
;5801;33000;-1;SER;DAC
;5801;34000;-1;SER;DAC
;5801;35000;-1;SER;DAC
;5801;36000;-1;SER;DAC
;5801;37000;-1;SER;DAC
;5801;41002;-1;SER;DAC
;5801;42000;-1;SER;DAC
;5819;32001;-1;SER;DAC
;5819;33000;-1;SER;DAC
;5819;34000;-1;SER;DAC
;5819;35000;-1;SER;DAC
;5819;36000;-1;SER;DAC
;5819;37000;-1;SER;DAC
;5819;41002;-1;SER;DAC
;5819;42000;-1;SER;DAC
;5876;32001;-1;SER;DAC
;5876;33000;-1;SER;DAC
;5876;34000;-1;SER;DAC
;5876;35000;-1;SER;DAC
;5876;36000;-1;SER;DAC
;5876;37000;-1;SER;DAC
;5876;41002;-1;SER;DAC
;5876;42000;-1;SER;DAC
;5934;34001;-1;SER;DAC
;5934;35000;-1;SER;DAC
;5934;36000;-1;SER;DAC
;5934;37000;-1;SER;DAC
;5934;41002;-1;SER;DAC
;5934;42000;-1;SER;DAC
;5942;33001;-1;SER;DAC
;5942;34000;-1;SER;DAC
;5942;35000;-1;SER;DAC
;5942;36000;-1;SER;DAC
;5942;37000;-1;SER;DAC
;5942;41002;-1;SER;DAC
;5942;42000;-1;SER;DAC
;5983;33001;;SER;DAC
;5983;34000;;SER;DAC
;5983;35000;;SER;DAC
;5983;36000;;SER;DAC
;5983;37000;;SER;DAC
;5983;41002;;SER;DAC
;5983;42000;;SER;DAC
;6031;35001;;SER;DAC
;6031;36000;;SER;DAC
;6031;37000;;SER;DAC
;6031;41002;;SER;DAC
;6031;42000;;SER;DAC
;6056;35001;-1;SER;DAC
;6056;36000;-1;SER;DAC
;6056;37000;-1;SER;DAC
;6056;41002;-1;SER;DAC
;6056;42000;-1;SER;DAC
;9324;41000;;SER;DAC
;6080;42000;;SER;DAC
;6106;36001;-1;SER;DAC
;6106;37000;-1;SER;DAC
;6106;41002;-1;SER;DAC
;6106;42000;-1;SER;DAC
;6114;41006;-1;SER;DAC
;6114;42000;-1;SER;DAC
;6510;35003;;SER;DAC
;6510;36000;;SER;DAC
;6510;37000;;SER;DAC
;6510;41002;;SER;DAC
;6510;42000;;SER;DAC
;6544;31003;-1;SER;DAC
;6544;32000;-1;SER;DAC
;6544;33000;-1;SER;DAC
;6544;34000;-1;SER;DAC
;6544;35000;-1;SER;DAC
;6544;36000;-1;SER;DAC
;6544;37000;-1;SER;DAC
;6544;41002;-1;SER;DAC
;6544;42000;-1;SER;DAC
;6551;33001;-1;SER;DAC
;6551;34000;-1;SER;DAC
;6551;35000;-1;SER;DAC
;6551;36000;-1;SER;DAC
;6551;37000;-1;SER;DAC
;6551;41002;-1;SER;DAC
;6551;42000;-1;SER;DAC
;6684;41001;;SER;DAC
;6684;42000;;SER;DAC
;6734;41001;;SER;DAC
;6734;42000;;SER;DAC
;6742;41001;;SER;DAC
;6742;42000;;SER;DAC
;6759;41004;;SER;DAC
;6759;42000;;SER;DAC
;6080;41003;;SER;DAC
;6775;42000;-1;SER;DAC
;24992;41003;;SER;DAC
;6783;42000;-1;SER;DAC
;6809;41001;-1;SER;DAC
;6809;42000;-1;SER;DAC
;6775;41005;-1;SER;DAC
;6833;42000;;SER;DAC
;8037;31000;;SER;DAC
;8037;31001;;SER;DAC
;8037;32000;;SER;DAC
;8037;33000;;SER;DAC
;8037;34000;;SER;DAC
;8037;35000;;SER;DAC
;8037;36000;;SER;DAC
;8037;37000;;SER;DAC
;8037;41002;;SER;DAC
;8037;42000;;SER;DAC
;8045;31000;;SER;DAC
;8045;31001;;SER;DAC
;8045;32000;;SER;DAC
;8045;33000;;SER;DAC
;8045;34000;;SER;DAC
;8045;35000;;SER;DAC
;8045;36000;;SER;DAC
;8045;37000;;SER;DAC
;8045;41002;;SER;DAC
;8045;42000;;SER;DAC
;8060;33003;;SER;DAC
;8060;34000;;SER;DAC
;8060;35000;;SER;DAC
;8060;36000;;SER;DAC
;8060;37000;;SER;DAC
;8060;41002;;SER;DAC
;8060;42000;;SER;DAC
;8094;32001;-1;SER;DAC
;8094;33000;-1;SER;DAC
;8094;34000;-1;SER;DAC
;8094;35000;-1;SER;DAC
;8094;36000;-1;SER;DAC
;8094;37000;-1;SER;DAC
;8094;41002;-1;SER;DAC
;8094;42000;-1;SER;DAC
;8102;32001;-1;SER;DAC
;8102;33000;-1;SER;DAC
;8102;34000;-1;SER;DAC
;8102;35000;-1;SER;DAC
;8102;36000;-1;SER;DAC
;8102;37000;-1;SER;DAC
;8102;41002;-1;SER;DAC
;8102;42000;-1;SER;DAC
;8110;32001;-1;SER;DAC
;8110;33000;-1;SER;DAC
;8110;34000;-1;SER;DAC
;8110;35000;-1;SER;DAC
;8110;36000;-1;SER;DAC
;8110;37000;-1;SER;DAC
;8110;41002;-1;SER;DAC
;8110;42000;-1;SER;DAC
;9290;34003;;SER;DAC
;9290;35000;;SER;DAC
;9290;36000;;SER;DAC
;9290;37000;;SER;DAC
;9290;41002;;SER;DAC
;9290;42000;;SER;DAC
;9308;34001;-1;SER;DAC
;9308;35000;-1;SER;DAC
;9308;36000;-1;SER;DAC
;9308;37000;-1;SER;DAC
;9308;41002;-1;SER;DAC
;9308;42000;-1;SER;DAC
;6783;41005;-1;SER;DAC
;9324;42000;;SER;DAC
;9340;32001;-1;SER;DAC
;9340;33000;-1;SER;DAC
;9340;34000;-1;SER;DAC
;9340;35000;-1;SER;DAC
;9340;36000;-1;SER;DAC
;9340;37000;-1;SER;DAC
;9340;41002;-1;SER;DAC
;9340;42000;-1;SER;DAC
;24877;41006;-1;SER;DAC
;24877;42000;-1;SER;DAC
;24885;33002;-1;SER;DAC
;24885;34000;-1;SER;DAC
;24885;35000;-1;SER;DAC
;24885;36000;-1;SER;DAC
;24885;37000;-1;SER;DAC
;24885;41002;-1;SER;DAC
;24885;42000;-1;SER;DAC
;24919;35001;;SER;DAC
;24919;36000;;SER;DAC
;24919;37000;;SER;DAC
;24919;41002;;SER;DAC
;24919;42000;;SER;DAC
;24935;35002;;SER;DAC
;24935;36000;;SER;DAC
;24935;37000;;SER;DAC
;24935;41002;;SER;DAC
;24935;42000;;SER;DAC
;6833;41005;;SER;DAC
;24976;42000;;SER;DAC
;24984;41001;;SER;DAC
;24984;42000;;SER;DAC
;24976;41005;;SER;DAC
;24992;42000;;SER;DAC
;25619;32001;;SER;DAC
;25619;33000;;SER;DAC
;25619;34000;;SER;DAC
;25619;35000;;SER;DAC
;25619;36000;;SER;DAC
;25619;37000;;SER;DAC
;25619;41002;;SER;DAC
;25619;42000;;SER;DAC
;25825;33000;;SER;DAC
;25825;34000;;SER;DAC
;25825;35000;;SER;DAC
;25825;36000;;SER;DAC
;25825;37000;;SER;DAC
;25825;41002;;SER;DAC
;25825;42000;;SER;DAC
;25890;35001;;SER;DAC
;25890;36000;;SER;DAC
;25890;37000;;SER;DAC
;25890;41002;;SER;DAC
;25890;42000;;SER;DAC
;25924;41005;;SER;DAC
;25924;42000;;SER;DAC
;27243;35001;;SER;DAC
;27243;36000;;SER;DAC
;27243;37000;;SER;DAC
;27243;41002;;SER;DAC
;27243;42000;;SER;DAC
;34008;41005;;SER;DAC
;34008;42000;;SER;DAC
;34110;31000;;SER;DAC
;34110;31001;;SER;DAC
;34110;32000;;SER;DAC
;34110;33000;;SER;DAC
;34110;34000;;SER;DAC
;34110;35000;;SER;DAC
;34110;36000;;SER;DAC
;34110;37000;;SER;DAC
;34110;41002;;SER;DAC
;34110;42000;;SER;DAC
;34111;31000;;SER;DAC
;34111;31001;;SER;DAC
;34111;32000;;SER;DAC
;34111;33000;;SER;DAC
;34111;34000;;SER;DAC
;34111;35000;;SER;DAC
;34111;36000;;SER;DAC
;34111;37000;;SER;DAC
;34111;41002;;SER;DAC
;34111;42000;;SER;DAC
;34112;31000;;SER;DAC
;34112;31001;;SER;DAC
;34112;32000;;SER;DAC
;34112;33000;;SER;DAC
;34112;34000;;SER;DAC
;34112;35000;;SER;DAC
;34112;36000;;SER;DAC
;34112;37000;;SER;DAC
;34112;41002;;SER;DAC
;34112;42000;;SER;DAC
;34113;31000;;SER;DAC
;34113;31001;;SER;DAC
;34113;32000;;SER;DAC
;34113;33000;;SER;DAC
;34113;34000;;SER;DAC
;34113;35000;;SER;DAC
;34113;36000;;SER;DAC
;34113;37000;;SER;DAC
;34113;41002;;SER;DAC
;34113;42000;;SER;DAC
;34114;31000;;SER;DAC
;34114;31001;;SER;DAC
;34114;32000;;SER;DAC
;34114;33000;;SER;DAC
;34114;34000;;SER;DAC
;34114;35000;;SER;DAC
;34114;36000;;SER;DAC
;34114;37000;;SER;DAC
;34114;41002;;SER;DAC
;34114;42000;;SER;DAC
;34115;31000;;SER;DAC
;34115;31001;;SER;DAC
;34115;32000;;SER;DAC
;34115;33000;;SER;DAC
;34115;34000;;SER;DAC
;34115;35000;;SER;DAC
;34115;36000;;SER;DAC
;34115;37000;;SER;DAC
;34115;41002;;SER;DAC
;34115;42000;;SER;DAC
;34116;32001;;SER;DAC
;34116;33000;;SER;DAC
;34116;34000;;SER;DAC
;34116;35000;;SER;DAC
;34116;36000;;SER;DAC
;34116;37000;;SER;DAC
;34116;41002;;SER;DAC
;34116;42000;;SER;DAC
;34117;32001;-1;SER;DAC
;34117;33000;-1;SER;DAC
;34117;34000;-1;SER;DAC
;34117;35000;-1;SER;DAC
;34117;36000;-1;SER;DAC
;34117;37000;-1;SER;DAC
;34117;41002;-1;SER;DAC
;34117;42000;-1;SER;DAC
;34118;32001;-1;SER;DAC
;34118;33000;-1;SER;DAC
;34118;34000;-1;SER;DAC
;34118;35000;-1;SER;DAC
;34118;36000;-1;SER;DAC
;34118;37000;-1;SER;DAC
;34118;41002;-1;SER;DAC
;34118;42000;-1;SER;DAC
;34119;33001;-1;SER;DAC
;34119;34000;-1;SER;DAC
;34119;35000;-1;SER;DAC
;34119;36000;-1;SER;DAC
;34119;37000;-1;SER;DAC
;34119;41002;-1;SER;DAC
;34119;42000;-1;SER;DAC
;34120;33001;-1;SER;DAC
;34120;34000;-1;SER;DAC
;34120;35000;-1;SER;DAC
;34120;36000;-1;SER;DAC
;34120;37000;-1;SER;DAC
;34120;41002;-1;SER;DAC
;34120;42000;-1;SER;DAC
;34121;33002;-1;SER;DAC
;34121;34000;-1;SER;DAC
;34121;35000;-1;SER;DAC
;34121;36000;-1;SER;DAC
;34121;37000;-1;SER;DAC
;34121;41002;-1;SER;DAC
;34121;42000;-1;SER;DAC
;34122;33002;;SER;DAC
;34122;34000;;SER;DAC
;34122;35000;;SER;DAC
;34122;36000;;SER;DAC
;34122;37000;;SER;DAC
;34122;41002;;SER;DAC
;34122;42000;;SER;DAC
;34124;41006;-1;SER;DAC
;34124;42000;-1;SER;DAC
;34125;35001;;SER;DAC
;34125;36000;;SER;DAC
;34125;37000;;SER;DAC
;34125;41002;;SER;DAC
;34125;42000;;SER;DAC
;34127;33003;;SER;DAC
;34127;34000;;SER;DAC
;34127;35000;;SER;DAC
;34127;36000;;SER;DAC
;34127;37000;;SER;DAC
;34127;41002;;SER;DAC
;34127;42000;;SER;DAC
;34144;41005;;SER;DAC
;34144;42000;;SER;DAC
;34146;41006;-1;SER;DAC
;34146;42000;-1;SER;DAC
;34147;41006;-1;SER;DAC
;34147;42000;-1;SER;DAC
;34148;41005;;SER;DAC
;34148;42000;;SER;DAC
;34156;41001;;SER;DAC
;34156;42000;;SER;DAC
;34160;41005;;SER;DAC
;34160;42000;;SER;DAC
;34162;41005;;SER;DAC
;34162;42000;;SER;DAC
;34221;41006;-1;SER;DAC
;34221;42000;-1;SER;DAC
;34224;41005;;SER;DAC
;34224;42000;;SER;DAC
;34225;41005;;SER;DAC
;34225;42000;;SER;DAC
;34226;41005;;SER;DAC
;34226;42000;;SER;DAC
;34228;41005;;SER;DAC
;34228;42000;;SER;DAC
;34229;41004;;SER;DAC
;34229;42000;;SER;DAC
;34560;41004;;SER;DAC
;34560;42000;;SER;DAC
;34561;41004;;SER;DAC
;34561;42000;;SER;DAC
;34573;41005;-1;SER;DAC
;34573;42000;-1;SER;DAC
;34631;35002;;SER;DAC
;34631;36000;;SER;DAC
;34631;37000;;SER;DAC
;34631;41002;;SER;DAC
;34631;42000;;SER;DAC
;34752;35002;;SER;DAC
;34752;36000;;SER;DAC
;34752;37000;;SER;DAC
;34752;41002;;SER;DAC
;34752;42000;;SER;DAC
;34000;81000;;DAC;DAC
99903;99903;;;DAC;DAC
;34000;82000;;DAC;DAC
;99903;82000;;DAC;DAC
;34001;82100;;DAC;DAC
;34003;82100;;DAC;DAC
;36001;82101;;DAC;DAC
;34000;83000;;DAC;DAC
;99903;83000;;DAC;DAC
;34001;83000;;DAC;DAC
;34003;83000;;DAC;DAC
;36001;83000;;DAC;DAC
71001;71001;;;DAC;DAC
71002;71002;;;DAC;DAC
;34000;71004;;DAC;DAC
;50001;71004;;DAC;DAC
;99903;71004;;DAC;DAC
;34000;71006;;DAC;DAC
;50001;71006;;DAC;DAC
;99903;71006;;DAC;DAC
;34001;71006;;DAC;DAC
;34003;71006;;DAC;DAC
;36001;71006;;DAC;DAC
;38000;71006;;DAC;DAC
;71007;71009;;DAC;DAC
;21002;71007;;DAC;DAC
;21003;71007;;DAC;DAC
;21004;71007;;DAC;DAC
;21023;71007;;DAC;DAC
;71008;71009;;DAC;DAC
;22001;71008;;DAC;DAC
;22019;71008;;DAC;DAC
;71009;71011;;DAC;DAC
;71010;71011;-1;DAC;DAC
;11001;71010;;DAC;DAC
;11011;71010;;DAC;DAC
;11021;71010;;DAC;DAC
;12018;71010;;DAC;DAC
;34000;71014;;DAC;DAC
;50001;71014;;DAC;DAC
;99903;71014;;DAC;DAC
;21000;71015;;DAC;DAC
;22000;71015;;DAC;DAC
;11000;71016;;DAC;DAC
;11000;71017;;DAC;DAC
;1100499;71017;-1;DAC;DAC
;11000;71018;;DAC;DAC
;12000;71018;;DAC;DAC
;71027;71019;;DAC;DAC
71020;71024;;;DAC;DAC
71021;71025;;;DAC;DAC
71022;71026;;;DAC;DAC
;32000;91001;;DAC;DAC
;34000;91002;;DAC;DAC
;37000;91003;;DAC;DAC
;21000;91018;;DAC;DAC
;22000;91018;;DAC;DAC
;34000;91005;;DAC;DAC
;50001;91005;;DAC;DAC
;99903;91005;;DAC;DAC
;11000;91019;;DAC;DAC
;34000;91007;;DAC;DAC
;50001;91007;;DAC;DAC
;99903;91007;;DAC;DAC
;34001;91007;;DAC;DAC
;34003;91007;;DAC;DAC
;36001;91007;;DAC;DAC
;35004;91007;;DAC;DAC
;38000;91007;;DAC;DAC
;88002;91008;;DAC;DAC
;88001;91008;;DAC;DAC
;88003;91008;;DAC;DAC
;99909;91008;;DAC;DAC
;11001;91009;;DAC;DAC
;11011;91009;;DAC;DAC
;11002;91009;;DAC;DAC
;11003;91009;;DAC;DAC
;11004;91009;;DAC;DAC
;11005;91009;;DAC;DAC
;11006;91009;;DAC;DAC
;11007;91009;;DAC;DAC
;11008;91009;;DAC;DAC
;11009;91009;;DAC;DAC
;11010;91009;;DAC;DAC
;11016;91009;;DAC;DAC
;11018;91009;;DAC;DAC
;11020;91009;;DAC;DAC
;11022;91009;;DAC;DAC
;11023;91009;;DAC;DAC
;11024;91009;;DAC;DAC
;11025;91009;;DAC;DAC
;11012;91009;;DAC;DAC
;11014;91009;;DAC;DAC
;11021;91009;;DAC;DAC
;11100;91009;;DAC;DAC
;11013;91009;;DAC;DAC
;11017;91009;;DAC;DAC
;12001;91010;;DAC;DAC
;12002;91010;;DAC;DAC
;12013;91010;;DAC;DAC
;12014;91010;;DAC;DAC
;12015;91010;;DAC;DAC
;12022;91010;;DAC;DAC
;12023;91010;;DAC;DAC
;12024;91010;;DAC;DAC
;12004;91010;;DAC;DAC
;12017;91010;;DAC;DAC
;12005;91010;;DAC;DAC
;12010;91010;;DAC;DAC
;12012;91010;;DAC;DAC
;12018;91010;;DAC;DAC
;12021;91010;;DAC;DAC
;12006;91010;;DAC;DAC
;12025;91010;;DAC;DAC
;12100;91010;;DAC;DAC
;12011;91010;;DAC;DAC
;12016;91010;;DAC;DAC
;12019;91010;;DAC;DAC
;12020;91010;;DAC;DAC
;13001;91011;;DAC;DAC
;13002;91011;;DAC;DAC
;13003;91011;;DAC;DAC
;13004;91011;;DAC;DAC
;13005;91011;;DAC;DAC
;91012;91021;;DAC;DAC
;21001;91012;;DAC;DAC
;21002;91012;;DAC;DAC
;21003;91012;;DAC;DAC
;21004;91012;;DAC;DAC
;21023;91012;;DAC;DAC
;21005;91012;;DAC;DAC
;21007;91012;;DAC;DAC
;21006;91012;;DAC;DAC
;21008;91012;;DAC;DAC
;21009;91012;;DAC;DAC
;21010;91012;;DAC;DAC
;21011;91012;;DAC;DAC
;21013;91012;;DAC;DAC
;21019;91012;;DAC;DAC
;21025;91012;;DAC;DAC
;21012;91012;;DAC;DAC
;21014;91012;;DAC;DAC
;21016;91012;;DAC;DAC
;21018;91012;;DAC;DAC
;21024;91012;;DAC;DAC
;21100;91012;;DAC;DAC
;21015;91012;;DAC;DAC
;21022;91012;;DAC;DAC
;91013;91021;;DAC;DAC
;22001;91013;;DAC;DAC
;22019;91013;;DAC;DAC
;22002;91013;;DAC;DAC
;22003;91013;;DAC;DAC
;22004;91013;;DAC;DAC
;22015;91013;;DAC;DAC
;22016;91013;;DAC;DAC
;22017;91013;;DAC;DAC
;22022;91013;;DAC;DAC
;22012;91013;;DAC;DAC
;22014;91013;;DAC;DAC
;22021;91013;;DAC;DAC
;22100;91013;;DAC;DAC
;22006;91013;;DAC;DAC
;22008;91013;;DAC;DAC
;22009;91013;;DAC;DAC
;22010;91013;;DAC;DAC
;22013;91013;;DAC;DAC
;25001;91014;;DAC;DAC
;25002;91014;;DAC;DAC
;25003;91014;;DAC;DAC
;25004;91014;;DAC;DAC
;24000;91014;;DAC;DAC
;14000;91020;;DAC;DAC
;91100;91102;;DAC;DAC
;21002;91100;;DAC;DAC
;21003;91100;;DAC;DAC
;21004;91100;;DAC;DAC
;21023;91100;;DAC;DAC
;91101;91102;;DAC;DAC
;22001;91101;;DAC;DAC
;22019;91101;;DAC;DAC
;91102;91015;;DAC;DAC
;91103;91015;-1;DAC;DAC
;11001;91103;;DAC;DAC
;11021;91103;;DAC;DAC
;12018;91103;;DAC;DAC
;34000;91017;;DAC;DAC
;50001;91017;;DAC;DAC
;99903;91017;;DAC;DAC
;34000;91006;;DAC;DAC
;50001;91006;;DAC;DAC
;99903;91006;;DAC;DAC
