[
  {
    "cliente": {
      "analista": "THAIS RODRIGUES DA SILVA",
      "valoresEm": "R$ MIL",
      "cnpj": "",
      "codigoGrupoEconomico": "041341",
      "nomeControlador": "",
      "tipoCliente": "G"
    },
    "origem": {
      "id": "B",
      "descricao": "DAC",
      "fonte": "ImportacaoSQL"
    },
    "dados": {
      "referencia": "2017-09-01T00:00:00",
      "tipo": "Balancete",
      "status": "Provisorio",
      "fonte": "DAC",
      "moeda": "R$ MIL",
      "confidencial": "Não",
      "somatorio": "Individual",
      "highlightAuditoria": false,
      "highlightNotaExplicativa": false,
      "planoDeContas": "PlanoContas_v1.0",
      "dataAtualizacao": "2018-06-15T13:45:19",
      "contas": {
        "ativo": [
          {
            "conta": "11001",
            "valor": 2843,
            "notaVinculadaValor": [],
            "notaVinculadaConta": []
          },
          {
            "conta": "11001",
            "valor": 2843,
            "notaVinculadaValor": [],
            "notaVinculadaConta": []
          }
        ],
        "passivo": [
          {
            "conta": "21001",
            "valor": 52850,
            "notaVinculadaValor": [],
            "notaVinculadaConta": []
          },
          {
            "conta": "21002",
            "valor": 12501,
            "notaVinculadaValor": [],
            "notaVinculadaConta": []
          }
        ],
        "dre": [
          {
            "conta": "31000",
            "valor": 436643,
            "porcentagem": null,
            "notaVinculadaValor": [],
            "notaVinculadaConta": []
          },
          {
            "conta": "31001",
            "valor": 436643,
            "porcentagem": null,
            "notaVinculadaValor": [],
            "notaVinculadaConta": []
          }
        ],
        "mutacao": [
          {
            "conta": "41000",
            "valor": 430429,
            "notaVinculadaValor": [],
            "notaVinculadaConta": []
          },
          {
            "conta": "41002",
            "valor": 24677,
            "notaVinculadaValor": [],
            "notaVinculadaConta": []
          }
        ],
        "fluxoCaixa": [
          {
            "conta": "81000",
            "valor": 28764,
            "notaVinculadaValor": [],
            "notaVinculadaConta": []
          },
          {
            "conta": "81001",
            "valor": 29010,
            "notaVinculadaValor": [],
            "notaVinculadaConta": []
          }
        ],
        "indicadores": [
          {
            "conta": "71000",
            "valor": 12431,
            "notaVinculadaValor": [],
            "notaVinculadaConta": []
          },
          {
            "conta": "71001",
            "valor": 40332,
            "notaVinculadaValor": [],
            "notaVinculadaConta": []
          }
        ],
        "highlights": [
          {
            "conta": "91000",
            "valor": 86433,
            "notaVinculadaValor": [],
            "notaVinculadaConta": []
          },
          {
            "conta": "91001",
            "valor": 362992,
            "notaVinculadaValor": [],
            "notaVinculadaConta": []
          }
        ],
        "notaExplicativa": [
          {
            "valor": "ANALISTA: THAÍS RODRIGUES DA SILVA"
          },
          {
            "valor": "EMPRESAS PRESENTES NO SOMATÓRIO"
          },
          {
            "valor": "                                             12/2015    12/2016    09/2017"
          },
          {
            "valor": "035094382 - C ROLIM ENG LTDA                   X          X          X"
          },
          {
            "valor": "007196926 - C ROLIM COM DE CONFECCOES LTDA     X          X          X"
          },
          {
            "valor": "007196900 - CRASA C ROLIM AUTOMOVEIS LTDA      X          X          X"
          },
          {
            "valor": "006964399 - CASA PIO CALCADOS LTDA             X          X          X"
          },
          {
            "valor": "003624070 - IMOBILIARIA CPC LTDA               X          X          X"
          },
          {
            "valor": "**SOMATÓRIO COM AJUSTE DE MÚTUOS E PL X INVESTIMENTO."
          },
          {
            "valor": "*PROVISÓRIO: INDIVIDUAIS"
          },
          {
            "valor": "NOTA 01)DUPLICATAS"
          },
          {
            "valor": "                                             12/2015    12/2016    09/2017"
          },
          {
            "valor": "C ROLIM ENG LTDA                             25.721     35.409     29.250   "
          },
          {
            "valor": "C ROLIM COM DE CONFECCOES LTDA               23.368     25.592     15.886"
          },
          {
            "valor": "CRASA C ROLIM AUTOMOVEIS LTDA                 6.914     12.267     12.428 "
          },
          {
            "valor": "CASA PIO CALCADOS LTDA                      121.219    133.294     88.680  "
          },
          {
            "valor": "IMOBILIARIA CPC LTDA                          6.946      2.874      4.773 "
          },
          {
            "valor": "NOTA 02)ENDIVIDAMENTO"
          },
          {
            "valor": "                                             12/2015    12/2016    09/2017"
          },
          {
            "valor": "C ROLIM ENG LTDA                                920      1.331      9.532 "
          },
          {
            "valor": "C ROLIM COM DE CONFECCOES LTDA                    3        130        422"
          },
          {
            "valor": "CRASA C ROLIM AUTOMOVEIS LTDA                    -      19.393      5.619  "
          },
          {
            "valor": "CASA PIO CALCADOS LTDA                        4.826      4.605      2.947 "
          },
          {
            "valor": "IMOBILIARIA CPC LTDA                             -          -          -"
          },
          {
            "valor": "NOTA 03)RECEITA BRUTA"
          },
          {
            "valor": "                                             12/2015    12/2016    09/2017"
          },
          {
            "valor": "C ROLIM ENG LTDA                             24.539     23.826     11.252    "
          },
          {
            "valor": "C ROLIM COM DE CONFECCOES LTDA               70.249     70.508     40.472"
          },
          {
            "valor": "CRASA C ROLIM AUTOMOVEIS LTDA               130.635    101.955     85.980 "
          },
          {
            "valor": "CASA PIO CALCADOS LTDA                      348.579    349.858    275.164 "
          },
          {
            "valor": "IMOBILIARIA CPC LTDA                         27.001     30.976     28.302  "
          },
          {
            "valor": "NOTA 04)LUCRO LÍQUIDO"
          },
          {
            "valor": "                                             12/2015    12/2016    09/2017"
          },
          {
            "valor": "C ROLIM ENG LTDA                              3.690      4.058    (16.585)   "
          },
          {
            "valor": "C ROLIM COM DE CONFECCOES LTDA                2.925      2.370     (1.124)"
          },
          {
            "valor": "CRASA C ROLIM AUTOMOVEIS LTDA                   (89)    (1.274)       621 "
          },
          {
            "valor": "CASA PIO CALCADOS LTDA                       39.607     36.097     24.024  "
          },
          {
            "valor": "IMOBILIARIA CPC LTDA                         18.447     20.441     21.153"
          }
        ],
        "auditoria": []
      }
    }
  }
]