{
  "title": "GameConfig",
  "description": "General game configuration",
  "type": "object",
  "allOf": [
    {
      "properties": {
        "setup": {
          "$ref": "game_setup.schema.json"
        },
        "scoreLimit": {
          "type": "number",
          "minimum": 1,
          "description": "Score a player has to hit for the game to end. Only used if stopTrigger=score"
        },
        "timeLimit": {
          "type": "number",
          "minimum": 1,
          "description": "Duration of the game (in minutes). Only used if stopTrigger=time"
        },
        "stopTrigger": {
          "description": "How the game end is triggered",
          "type": "string",
          "enum": [
            "time",
            "score",
            "manual"
          ]
        },
        "muteOnDeath": {
          "description": "Whether to mute dead players in voice chat",
          "type": "boolean"
        }
      },
      "required": [
        "setup",
        "stopTrigger",
        "muteOnDeath"
      ],
      "additionalProperties": false
    },
    {
      "if": {
        "properties": {
          "stopTrigger": {
            "enum": [
              "time"
            ]
          }
        }
      },
      "then": {
        "required": [
          "timeLimit"
        ]
      }
    },
    {
      "if": {
        "properties": {
          "stopTrigger": {
            "enum": [
              "score"
            ]
          }
        }
      },
      "then": {
        "required": [
          "scoreLimit"
        ]
      }
    }
  ]
}