{
  "title": "AppWSData",
  "type": "object",
  "description": "Message sent via the app websocket will have this schema",
  "allOf": [
    {
      "properties": {
        "event": {
          "type": "string",
          "enum": [
            "config_changed",
            "players_changed",
            "players_tobeevaluated_changed",
            "players_tobeready_changed",
            "game_started",
            "game_starting",
            "game_ready",
            "game_stopped",
            "kill",
            "scoreboard",
            "game_finished",
            "reset"
          ]
        },
        "config": {
          "$ref": "game_config.schema.json"
        },
        "scoreboard": {
          "$ref": "scoreboard.schema.json"
        },
        "list": {
          "type": "array",
          "items": {
            "type": "number",
            "minimum": 0,
            "maximum": 9
          }
        },
        "kill": {
          "type": "object",
          "title": "KillEventData",
          "properties": {
            "offenderID": {
              "type": "number",
              "minimum": 0,
              "maximum": 9
            },
            "victimID": {
              "type": "number",
              "minimum": 0,
              "maximum": 9
            },
            "assists": {
              "type": "array",
              "items": {
                "type": "number",
                "minimum": 0,
                "maximum": 9
              }
            }
          },
          "required": [
            "offenderID",
            "victimID",
            "assists"
          ]
        }
      },
      "required": [
        "result"
      ]
    },
    {
      "if": {
        "properties": {
          "event": {
            "enum": [
              "scoreboard"
            ]
          }
        }
      },
      "then": {
        "required": [
          "scoreboard"
        ]
      }
    },
    {
      "if": {
        "properties": {
          "event": {
            "enum": [
              "kill"
            ]
          }
        }
      },
      "then": {
        "required": [
          "kill"
        ]
      }
    },
    {
      "if": {
        "properties": {
          "event": {
            "enum": [
              "players_changed",
              "players_tobeevaluated_changed",
              "players_tobeready_changed"
            ]
          }
        }
      },
      "then": {
        "required": [
          "list"
        ]
      }
    },
    {
      "if": {
        "properties": {
          "event": {
            "enum": [
              "config_changed"
            ]
          }
        }
      },
      "then": {
        "required": [
          "config"
        ]
      }
    }
  ]
}