{
  "title": "ESPStatus",
  "description": "Status of an ESP seen server-side",
  "type": "object",
  "properties": {
    "ok": {
      "type": "boolean",
      "description": "If status submitted from ESP is correct and nothing is awaited"
    },
    "status": {
      "type": "number",
      "minimum": 0,
      "maximum": 5,
      "description": "SETUP: 0, READY: 1, STARTING: 2, RUNNING: 3, EVALUATION: 4, FINISHED: 5"
    },
    "awaiting": {
      "type": "number",
      "minimum": 0,
      "maximum": 3,
      "description": "0: All clear, 1: Awaiting registration, 2: Awaiting ready, 3: Awaiting result"
    }
  }
}