EESchema Schematic File Version 4
EELAYER 30 0
EELAYER END
$Descr A4 11693 8268
encoding utf-8
Sheet 1 1
Title ""
Date ""
Rev ""
Comp ""
Comment1 ""
Comment2 ""
Comment3 ""
Comment4 ""
$EndDescr
$Comp
L GenericPCB-rescue:ATtiny861-20PU-MCU_Microchip_ATtiny U1
U 1 1 5D645BCE
P 3650 2850
F 0 "U1" H 3021 2896 50  0000 R CNN
F 1 "ATtiny861-20PU" H 3021 2805 50  0000 R CNN
F 2 "Package_DIP:DIP-20_W7.62mm" H 3650 2850 50  0001 C CIN
F 3 "http://ww1.microchip.com/downloads/en/DeviceDoc/atmel-2588-8-bit-avr-microcontrollers-tinyavr-attiny261-attiny461-attiny861_datasheet.pdf" H 3650 2850 50  0001 C CNN
	1    3650 2850
	1    0    0    -1  
$EndComp
Wire Wire Line
	3750 3950 3750 4200
$Comp
L Device:C C2
U 1 1 5D647243
P 2200 2850
F 0 "C2" H 2315 2896 50  0000 L CNN
F 1 "100n" H 2315 2805 50  0000 L CNN
F 2 "Capacitor_THT:C_Disc_D3.8mm_W2.6mm_P2.50mm" H 2238 2700 50  0001 C CNN
F 3 "~" H 2200 2850 50  0001 C CNN
	1    2200 2850
	1    0    0    -1  
$EndComp
$Comp
L Device:C C1
U 1 1 5D647E0C
P 1600 2850
F 0 "C1" H 1715 2896 50  0000 L CNN
F 1 "100n" H 1715 2805 50  0000 L CNN
F 2 "Capacitor_THT:C_Disc_D3.8mm_W2.6mm_P2.50mm" H 1638 2700 50  0001 C CNN
F 3 "~" H 1600 2850 50  0001 C CNN
	1    1600 2850
	1    0    0    -1  
$EndComp
Wire Wire Line
	2200 2700 2200 1550
Wire Wire Line
	2200 1550 3650 1550
Wire Wire Line
	3650 1550 3650 1750
Wire Wire Line
	3650 4000 2200 4000
Wire Wire Line
	2200 4000 2200 3000
Wire Wire Line
	3650 4000 3650 3950
Wire Wire Line
	1600 4200 1600 3000
Wire Wire Line
	1600 2700 1600 1450
Wire Wire Line
	3750 1450 3750 1750
Wire Wire Line
	1600 4200 3750 4200
Text Label 2900 4200 0    50   ~ 0
GND
Text Label 2900 4000 0    50   ~ 0
GND
Wire Wire Line
	1600 1450 3750 1450
Text Label 3050 1450 0    50   ~ 0
VCC
Text Label 3050 1550 0    50   ~ 0
VCC
$Comp
L Device:R R1
U 1 1 5D656355
P 4700 3950
F 0 "R1" H 4770 3996 50  0000 L CNN
F 1 "10k" H 4770 3905 50  0000 L CNN
F 2 "Resistor_THT:R_Axial_DIN0207_L6.3mm_D2.5mm_P10.16mm_Horizontal" V 4630 3950 50  0001 C CNN
F 3 "~" H 4700 3950 50  0001 C CNN
	1    4700 3950
	1    0    0    -1  
$EndComp
Wire Wire Line
	4700 4100 4700 4400
Wire Wire Line
	4700 3800 4700 3650
Wire Wire Line
	4700 3650 4350 3650
Text Label 4700 4400 0    50   ~ 0
VCC
Wire Wire Line
	6100 1100 5800 1100
Wire Wire Line
	6100 1200 5800 1200
Wire Wire Line
	6100 1300 5800 1300
Wire Wire Line
	6100 1400 5800 1400
Wire Wire Line
	6100 1500 5800 1500
Wire Wire Line
	6100 1600 5800 1600
$Comp
L Connector:Conn_01x06_Male ProgHeader1
U 1 1 5D6575F2
P 6300 1300
F 0 "ProgHeader1" H 6272 1274 50  0000 R CNN
F 1 "Conn_01x06_Male" H 6272 1183 50  0000 R CNN
F 2 "Connector_PinHeader_2.54mm:PinHeader_1x06_P2.54mm_Vertical" H 6300 1300 50  0001 C CNN
F 3 "~" H 6300 1300 50  0001 C CNN
	1    6300 1300
	-1   0    0    -1  
$EndComp
Text Label 5800 1100 0    50   ~ 0
VCC
Text Label 5800 1600 0    50   ~ 0
GND
Text Label 5800 1200 0    50   ~ 0
MOSI
Text Label 5800 1300 0    50   ~ 0
MISO
Text Label 5800 1400 0    50   ~ 0
SLCK
Text Label 5800 1500 0    50   ~ 0
RESET
Text Label 4600 3650 0    50   ~ 0
RESET
$Comp
L Device:LED IR1
U 1 1 5D65A6DF
P 8000 2300
F 0 "IR1" H 7993 2045 50  0000 C CNN
F 1 "LED" H 7993 2136 50  0000 C CNN
F 2 "LED_THT:LED_D5.0mm" H 8000 2300 50  0001 C CNN
F 3 "~" H 8000 2300 50  0001 C CNN
	1    8000 2300
	-1   0    0    1   
$EndComp
$Comp
L Device:LED IR2
U 1 1 5D65AF28
P 8000 2650
F 0 "IR2" H 7993 2395 50  0000 C CNN
F 1 "LED" H 7993 2486 50  0000 C CNN
F 2 "LED_THT:LED_D5.0mm" H 8000 2650 50  0001 C CNN
F 3 "~" H 8000 2650 50  0001 C CNN
	1    8000 2650
	-1   0    0    1   
$EndComp
$Comp
L Device:LED IR3
U 1 1 5D65B4D5
P 8000 3050
F 0 "IR3" H 7993 2795 50  0000 C CNN
F 1 "LED" H 7993 2886 50  0000 C CNN
F 2 "LED_THT:LED_D5.0mm" H 8000 3050 50  0001 C CNN
F 3 "~" H 8000 3050 50  0001 C CNN
	1    8000 3050
	-1   0    0    1   
$EndComp
$Comp
L Device:LED STATUS1
U 1 1 5D65B863
P 5350 3550
F 0 "STATUS1" H 5343 3295 50  0000 C CNN
F 1 "LED" H 5343 3386 50  0000 C CNN
F 2 "LED_THT:LED_D5.0mm" H 5350 3550 50  0001 C CNN
F 3 "~" H 5350 3550 50  0001 C CNN
	1    5350 3550
	-1   0    0    1   
$EndComp
$Comp
L Device:R R3
U 1 1 5D65CA38
P 7450 2300
F 0 "R3" V 7243 2300 50  0000 C CNN
F 1 "R" V 7334 2300 50  0000 C CNN
F 2 "Resistor_THT:R_Axial_DIN0207_L6.3mm_D2.5mm_P10.16mm_Horizontal" V 7380 2300 50  0001 C CNN
F 3 "~" H 7450 2300 50  0001 C CNN
	1    7450 2300
	0    1    1    0   
$EndComp
$Comp
L Device:R R4
U 1 1 5D65CE57
P 7450 2650
F 0 "R4" V 7243 2650 50  0000 C CNN
F 1 "R" V 7334 2650 50  0000 C CNN
F 2 "Resistor_THT:R_Axial_DIN0207_L6.3mm_D2.5mm_P10.16mm_Horizontal" V 7380 2650 50  0001 C CNN
F 3 "~" H 7450 2650 50  0001 C CNN
	1    7450 2650
	0    1    1    0   
$EndComp
$Comp
L Device:R R5
U 1 1 5D65D0DD
P 7450 3050
F 0 "R5" V 7243 3050 50  0000 C CNN
F 1 "R" V 7334 3050 50  0000 C CNN
F 2 "Resistor_THT:R_Axial_DIN0207_L6.3mm_D2.5mm_P10.16mm_Horizontal" V 7380 3050 50  0001 C CNN
F 3 "~" H 7450 3050 50  0001 C CNN
	1    7450 3050
	0    1    1    0   
$EndComp
Wire Wire Line
	7600 2300 7650 2300
Wire Wire Line
	7850 2650 7600 2650
Wire Wire Line
	7600 3050 7850 3050
Wire Wire Line
	7300 3050 7300 2650
Wire Wire Line
	7300 2300 7300 2650
Connection ~ 7300 2650
Wire Wire Line
	7300 2650 7000 2650
Wire Wire Line
	8150 2300 8150 2650
Wire Wire Line
	8150 2650 8150 3050
Connection ~ 8150 2650
$Comp
L Transistor_BJT:PN2222A Q1
U 1 1 5D65F862
P 8050 3550
F 0 "Q1" H 8240 3596 50  0000 L CNN
F 1 "PN2222A" H 8240 3505 50  0000 L CNN
F 2 "Package_TO_SOT_THT:TO-92_Inline" H 8250 3475 50  0001 L CIN
F 3 "http://www.fairchildsemi.com/ds/PN/PN2222A.pdf" H 8050 3550 50  0001 L CNN
	1    8050 3550
	1    0    0    -1  
$EndComp
Wire Wire Line
	8150 3750 8150 3850
Wire Wire Line
	8150 3350 8150 3250
Connection ~ 8150 3050
Wire Wire Line
	7850 3550 7700 3550
Text Label 7000 2650 0    50   ~ 0
VCC
Text Label 7350 3550 0    50   ~ 0
IR_CTRL
Wire Wire Line
	4350 3450 4700 3450
Text Label 4700 3450 2    50   ~ 0
IR_CTRL
$Comp
L Device:R R2
U 1 1 5D667929
P 5800 3550
F 0 "R2" V 5593 3550 50  0000 C CNN
F 1 "220" V 5684 3550 50  0000 C CNN
F 2 "Resistor_THT:R_Axial_DIN0207_L6.3mm_D2.5mm_P10.16mm_Horizontal" V 5730 3550 50  0001 C CNN
F 3 "~" H 5800 3550 50  0001 C CNN
	1    5800 3550
	0    1    1    0   
$EndComp
Wire Wire Line
	5200 3550 4350 3550
Wire Wire Line
	5500 3550 5650 3550
$Comp
L power:GND #PWR04
U 1 1 5D669D1D
P 3650 4050
F 0 "#PWR04" H 3650 3800 50  0001 C CNN
F 1 "GND" H 3655 3877 50  0000 C CNN
F 2 "" H 3650 4050 50  0001 C CNN
F 3 "" H 3650 4050 50  0001 C CNN
	1    3650 4050
	1    0    0    -1  
$EndComp
$Comp
L power:GND #PWR07
U 1 1 5D66A04A
P 6400 4050
F 0 "#PWR07" H 6400 3800 50  0001 C CNN
F 1 "GND" H 6405 3877 50  0000 C CNN
F 2 "" H 6400 4050 50  0001 C CNN
F 3 "" H 6400 4050 50  0001 C CNN
	1    6400 4050
	1    0    0    -1  
$EndComp
$Comp
L power:GND #PWR05
U 1 1 5D66A1EE
P 3750 4250
F 0 "#PWR05" H 3750 4000 50  0001 C CNN
F 1 "GND" H 3755 4077 50  0000 C CNN
F 2 "" H 3750 4250 50  0001 C CNN
F 3 "" H 3750 4250 50  0001 C CNN
	1    3750 4250
	1    0    0    -1  
$EndComp
$Comp
L power:GND #PWR08
U 1 1 5D66B934
P 8150 3900
F 0 "#PWR08" H 8150 3650 50  0001 C CNN
F 1 "GND" H 8155 3727 50  0000 C CNN
F 2 "" H 8150 3900 50  0001 C CNN
F 3 "" H 8150 3900 50  0001 C CNN
	1    8150 3900
	1    0    0    -1  
$EndComp
Wire Wire Line
	3750 4250 3750 4200
Connection ~ 3750 4200
Wire Wire Line
	3650 4000 3650 4050
Connection ~ 3650 4000
Wire Wire Line
	4350 2950 4700 2950
Wire Wire Line
	4350 3050 4700 3050
Wire Wire Line
	4350 3150 4700 3150
Text Label 4700 2950 2    50   ~ 0
MOSI
Text Label 4700 3050 2    50   ~ 0
MISO
Text Label 4700 3150 2    50   ~ 0
SLCK
$Comp
L Switch:SW_DIP_x06 CONFIG1
U 1 1 5D671087
P 5500 2350
F 0 "CONFIG1" H 5500 2917 50  0000 C CNN
F 1 "SW_DIP_x06" H 5500 2826 50  0000 C CNN
F 2 "Button_Switch_THT:SW_DIP_SPSTx06_Slide_6.7x16.8mm_W7.62mm_P2.54mm_LowProfile" H 5500 2350 50  0001 C CNN
F 3 "~" H 5500 2350 50  0001 C CNN
F 4 "CT2106MS-ND" H 5500 2350 50  0001 C CNN "DigikeyPN"
	1    5500 2350
	1    0    0    -1  
$EndComp
$Comp
L power:GND #PWR06
U 1 1 5D672372
P 5950 2650
F 0 "#PWR06" H 5950 2400 50  0001 C CNN
F 1 "GND" H 5955 2477 50  0000 C CNN
F 2 "" H 5950 2650 50  0001 C CNN
F 3 "" H 5950 2650 50  0001 C CNN
	1    5950 2650
	1    0    0    -1  
$EndComp
Wire Wire Line
	5950 2650 5950 2550
Wire Wire Line
	5950 2550 5800 2550
Wire Wire Line
	5800 2450 5950 2450
Wire Wire Line
	5950 2450 5950 2550
Connection ~ 5950 2550
Wire Wire Line
	5800 2350 5950 2350
Wire Wire Line
	5950 2350 5950 2450
Connection ~ 5950 2450
Wire Wire Line
	5800 2250 5950 2250
Wire Wire Line
	5950 2250 5950 2350
Connection ~ 5950 2350
Wire Wire Line
	5950 2150 5950 2250
Connection ~ 5950 2250
Wire Wire Line
	5800 2150 5950 2150
Wire Wire Line
	5950 2050 5950 2150
Connection ~ 5950 2150
Wire Wire Line
	5800 2050 5950 2050
Wire Wire Line
	4350 2050 5200 2050
Wire Wire Line
	5200 2150 4350 2150
Wire Wire Line
	4350 2250 5200 2250
Wire Wire Line
	5200 2350 4350 2350
Wire Wire Line
	4350 2450 5200 2450
Wire Wire Line
	5200 2550 4350 2550
Wire Wire Line
	4350 2750 4800 2750
Text Label 4800 2750 2    50   ~ 0
VOLT_MON
$Comp
L Device:R R6
U 1 1 5D68973D
P 9300 1550
F 0 "R6" H 9370 1596 50  0000 L CNN
F 1 "5k1" H 9370 1505 50  0000 L CNN
F 2 "Resistor_THT:R_Axial_DIN0207_L6.3mm_D2.5mm_P10.16mm_Horizontal" V 9230 1550 50  0001 C CNN
F 3 "~" H 9300 1550 50  0001 C CNN
	1    9300 1550
	1    0    0    -1  
$EndComp
$Comp
L Device:R R7
U 1 1 5D68A22A
P 9300 2000
F 0 "R7" H 9370 2046 50  0000 L CNN
F 1 "1k" H 9370 1955 50  0000 L CNN
F 2 "Resistor_THT:R_Axial_DIN0207_L6.3mm_D2.5mm_P10.16mm_Horizontal" V 9230 2000 50  0001 C CNN
F 3 "~" H 9300 2000 50  0001 C CNN
	1    9300 2000
	1    0    0    -1  
$EndComp
$Comp
L power:GND #PWR09
U 1 1 5D68A823
P 9300 2350
F 0 "#PWR09" H 9300 2100 50  0001 C CNN
F 1 "GND" H 9305 2177 50  0000 C CNN
F 2 "" H 9300 2350 50  0001 C CNN
F 3 "" H 9300 2350 50  0001 C CNN
	1    9300 2350
	1    0    0    -1  
$EndComp
Wire Wire Line
	9300 2150 9300 2350
Wire Wire Line
	9300 1850 9300 1750
Wire Wire Line
	9300 1400 9300 1200
Wire Wire Line
	9300 1200 8900 1200
Text Label 8900 1200 0    50   ~ 0
VCC
Wire Wire Line
	9300 1750 9850 1750
Connection ~ 9300 1750
Wire Wire Line
	9300 1750 9300 1700
Text Label 9850 1750 2    50   ~ 0
VOLT_MON
$Comp
L Switch:SW_Push SW1
U 1 1 5D666293
P 6200 3100
F 0 "SW1" H 6200 3385 50  0000 C CNN
F 1 "SW_Push" H 6200 3294 50  0000 C CNN
F 2 "Button_Switch_THT:SW_PUSH_6mm" H 6200 3300 50  0001 C CNN
F 3 "~" H 6200 3300 50  0001 C CNN
	1    6200 3100
	1    0    0    -1  
$EndComp
Wire Wire Line
	6400 3100 6400 3550
Wire Wire Line
	4950 3100 4950 2650
Wire Wire Line
	4950 2650 4350 2650
Wire Wire Line
	4950 3100 6000 3100
$Comp
L Device:LED RESLED1
U 1 1 5D671B5E
P 5350 3900
F 0 "RESLED1" H 5343 3645 50  0000 C CNN
F 1 "LED" H 5343 3736 50  0000 C CNN
F 2 "LED_THT:LED_D5.0mm" H 5350 3900 50  0001 C CNN
F 3 "~" H 5350 3900 50  0001 C CNN
	1    5350 3900
	-1   0    0    1   
$EndComp
$Comp
L Device:R RES1
U 1 1 5D671F72
P 5800 3900
F 0 "RES1" V 5593 3900 50  0000 C CNN
F 1 "220" V 5684 3900 50  0000 C CNN
F 2 "Resistor_THT:R_Axial_DIN0207_L6.3mm_D2.5mm_P10.16mm_Horizontal" V 5730 3900 50  0001 C CNN
F 3 "~" H 5800 3900 50  0001 C CNN
	1    5800 3900
	0    1    1    0   
$EndComp
Wire Wire Line
	5950 3550 6400 3550
Wire Wire Line
	5950 3900 6400 3900
Wire Wire Line
	6400 3900 6400 4050
Wire Wire Line
	6400 3900 6400 3550
Connection ~ 6400 3900
Connection ~ 6400 3550
Wire Wire Line
	5500 3900 5650 3900
Wire Wire Line
	5200 3900 5000 3900
Wire Wire Line
	5000 3900 5000 3250
Wire Wire Line
	5000 3250 4350 3250
$Comp
L Connector:Conn_01x01_Female RESCON1
U 1 1 5D67A9A6
P 4550 3350
F 0 "RESCON1" H 4578 3376 50  0000 L CNN
F 1 "Conn_01x01_Female" H 4578 3285 50  0000 L CNN
F 2 "Connector_Wire:SolderWirePad_1x01_Drill0.8mm" H 4550 3350 50  0001 C CNN
F 3 "~" H 4550 3350 50  0001 C CNN
	1    4550 3350
	1    0    0    -1  
$EndComp
$Comp
L Connector:TestPoint TP1
U 1 1 5D67C58D
P 7700 3550
F 0 "TP1" H 7758 3668 50  0000 L CNN
F 1 "TestPoint" H 7758 3577 50  0000 L CNN
F 2 "TestPoint:TestPoint_Pad_D1.5mm" H 7900 3550 50  0001 C CNN
F 3 "~" H 7900 3550 50  0001 C CNN
	1    7700 3550
	1    0    0    -1  
$EndComp
Connection ~ 7700 3550
Wire Wire Line
	7700 3550 7350 3550
$Comp
L Connector:TestPoint TP2
U 1 1 5D67E67A
P 7650 2300
F 0 "TP2" H 7708 2418 50  0000 L CNN
F 1 "TestPoint" H 7708 2327 50  0000 L CNN
F 2 "TestPoint:TestPoint_Pad_D1.5mm" H 7850 2300 50  0001 C CNN
F 3 "~" H 7850 2300 50  0001 C CNN
	1    7650 2300
	1    0    0    -1  
$EndComp
Connection ~ 7650 2300
Wire Wire Line
	7650 2300 7850 2300
$Comp
L Connector:TestPoint TPGND1
U 1 1 5D67F258
P 8650 3850
F 0 "TPGND1" H 8708 3968 50  0000 L CNN
F 1 "TestPoint" H 8708 3877 50  0000 L CNN
F 2 "TestPoint:TestPoint_Pad_D2.0mm" H 8850 3850 50  0001 C CNN
F 3 "~" H 8850 3850 50  0001 C CNN
	1    8650 3850
	1    0    0    -1  
$EndComp
Wire Wire Line
	8650 3850 8150 3850
Connection ~ 8150 3850
Wire Wire Line
	8150 3850 8150 3900
$Comp
L Connector:TestPoint TP3
U 1 1 5D682A87
P 8350 3250
F 0 "TP3" H 8408 3368 50  0000 L CNN
F 1 "TestPoint" H 8408 3277 50  0000 L CNN
F 2 "TestPoint:TestPoint_Pad_D1.5mm" H 8550 3250 50  0001 C CNN
F 3 "~" H 8550 3250 50  0001 C CNN
	1    8350 3250
	1    0    0    -1  
$EndComp
Wire Wire Line
	8350 3250 8150 3250
Connection ~ 8150 3250
Wire Wire Line
	8150 3250 8150 3050
Wire Wire Line
	1050 1050 1200 1050
Wire Wire Line
	1200 1050 1200 1300
$Comp
L power:GND #PWR02
U 1 1 5D68840C
P 1200 1300
F 0 "#PWR02" H 1200 1050 50  0001 C CNN
F 1 "GND" H 1205 1127 50  0000 C CNN
F 2 "" H 1200 1300 50  0001 C CNN
F 3 "" H 1200 1300 50  0001 C CNN
	1    1200 1300
	1    0    0    -1  
$EndComp
Wire Wire Line
	1350 950  1150 950 
Text Label 2550 950  2    50   ~ 0
VCC
$Comp
L power:+BATT #PWR01
U 1 1 5D68D768
P 1150 950
F 0 "#PWR01" H 1150 800 50  0001 C CNN
F 1 "+BATT" H 1165 1123 50  0000 C CNN
F 2 "" H 1150 950 50  0001 C CNN
F 3 "" H 1150 950 50  0001 C CNN
	1    1150 950 
	1    0    0    -1  
$EndComp
Connection ~ 1150 950 
Wire Wire Line
	1150 950  1050 950 
$Comp
L power:+VDC #PWR03
U 1 1 5D68DCCF
P 2050 950
F 0 "#PWR03" H 2050 850 50  0001 C CNN
F 1 "+VDC" H 2050 1225 50  0000 C CNN
F 2 "" H 2050 950 50  0001 C CNN
F 3 "" H 2050 950 50  0001 C CNN
	1    2050 950 
	1    0    0    -1  
$EndComp
Wire Wire Line
	2050 950  2250 950 
$Comp
L Connector:TestPoint TPVCC1
U 1 1 5D68E210
P 2250 950
F 0 "TPVCC1" H 2308 1068 50  0000 L CNN
F 1 "TestPoint" H 2308 977 50  0000 L CNN
F 2 "TestPoint:TestPoint_Pad_D2.0mm" H 2450 950 50  0001 C CNN
F 3 "~" H 2450 950 50  0001 C CNN
	1    2250 950 
	1    0    0    -1  
$EndComp
Connection ~ 2250 950 
Wire Wire Line
	2250 950  2550 950 
$Comp
L Connector_Generic:Conn_01x02 J1
U 1 1 5D69D170
P 850 950
F 0 "J1" H 768 1167 50  0000 C CNN
F 1 "Conn_01x02" H 768 1076 50  0000 C CNN
F 2 "Connector_Wire:SolderWirePad_1x02_P3.81mm_Drill1mm" H 850 950 50  0001 C CNN
F 3 "~" H 850 950 50  0001 C CNN
	1    850  950 
	-1   0    0    -1  
$EndComp
$Comp
L Switch:SW_DPDT_x2 SW2
U 2 1 5D6ADABB
P 1550 950
F 0 "SW2" H 1550 1235 50  0000 C CNN
F 1 "SW_DPDT_x2" H 1550 1144 50  0000 C CNN
F 2 "Button_Switch_THT:SW_CuK_JS202011AQN_DPDT_Angled" H 1550 950 50  0001 C CNN
F 3 "~" H 1550 950 50  0001 C CNN
	2    1550 950 
	1    0    0    -1  
$EndComp
Wire Wire Line
	1750 850  1850 850 
Wire Wire Line
	1850 850  1850 950 
Wire Wire Line
	1850 950  2050 950 
Connection ~ 2050 950 
$Comp
L Switch:SW_DPDT_x2 SW2
U 1 1 5D6B3B1B
P 1000 1950
F 0 "SW2" H 1000 2235 50  0000 C CNN
F 1 "SW_DPDT_x2" H 1000 2144 50  0000 C CNN
F 2 "Button_Switch_THT:SW_CuK_JS202011AQN_DPDT_Angled" H 1000 1950 50  0001 C CNN
F 3 "~" H 1000 1950 50  0001 C CNN
F 4 "563-1575-ND" H 1000 1950 50  0001 C CNN "DigikeyPN"
	1    1000 1950
	1    0    0    -1  
$EndComp
$EndSCHEMATC
