(module R_1225_6432Metric_Pad3.2x6.3mm_HandSolder (layer F.Cu) (tedit 5F99F1B3)
  (descr "Resistor SMD 1225 (6432 Metric), square (rectangular) end terminal, IPC_7351 nominal with elongated pad for handsoldering.")
  (tags "resistor handsolder")
  (attr smd)
  (fp_text reference REF** (at 0 -3.32) (layer F.SilkS)
    (effects (font (size 1 1) (thickness 0.15)))
  )
  (fp_text value R_1225_6432Metric_Pad3.2x6.3mm_HandSolder (at -0.0254 4.1148) (layer F.Fab)
    (effects (font (size 1 1) (thickness 0.15)))
  )
  (fp_line (start -1.6002 3.1496) (end -1.6 -3.1242) (layer F.Fab) (width 0.1))
  (fp_line (start -1.6 -3.1242) (end 1.6 -3.1242) (layer F.Fab) (width 0.1))
  (fp_line (start 1.6 -3.1242) (end 1.6 3.1496) (layer F.Fab) (width 0.1))
  (fp_line (start 1.6 3.1496) (end -1.6 3.1496) (layer F.Fab) (width 0.1))
  (fp_line (start -0.817528 -2.9718) (end 0.7366 -2.9718) (layer F.SilkS) (width 0.12))
  (fp_line (start -0.817528 3.0226) (end 0.7366 3.0226) (layer F.SilkS) (width 0.12))
  (fp_line (start -2.413 3.429) (end -2.413 -3.2766) (layer F.CrtYd) (width 0.05))
  (fp_line (start -2.4016 -3.2766) (end 2.4384 -3.2766) (layer F.CrtYd) (width 0.05))
  (fp_line (start 2.4384 -3.2766) (end 2.427 3.429) (layer F.CrtYd) (width 0.05))
  (fp_line (start 2.427 3.429) (end -2.413 3.429) (layer F.CrtYd) (width 0.05))
  (fp_text user %R (at 0 0) (layer F.Fab)
    (effects (font (size 0.8 0.8) (thickness 0.12)))
  )
  (pad 1 smd roundrect (at -1.5625 0) (size 1.225 6.3) (layers F.Cu F.Paste F.Mask) (roundrect_rratio 0.204))
  (pad 2 smd roundrect (at 1.5625 0) (size 1.225 6.3) (layers F.Cu F.Paste F.Mask) (roundrect_rratio 0.204))
  (model ${KISYS3DMOD}/Resistor_SMD.3dshapes/R_1218_3246Metric.wrl
    (at (xyz 0 0 0))
    (scale (xyz 1 1 1))
    (rotate (xyz 0 0 0))
  )
)
