EESchema Schematic File Version 4
EELAYER 30 0
EELAYER END
$Descr A4 11693 8268
encoding utf-8
Sheet 1 1
Title ""
Date ""
Rev ""
Comp ""
Comment1 ""
Comment2 ""
Comment3 ""
Comment4 ""
$EndDescr
$Comp
L MCU_Microchip_ATtiny:ATtiny861-20PU U2
U 1 1 5F89CE1B
P 4950 1950
F 0 "U2" H 4321 1996 50  0000 R CNN
F 1 "ATtiny861-20PU" H 4321 1905 50  0000 R CNN
F 2 "Package_DIP:DIP-20_W7.62mm" H 4950 1950 50  0001 C CIN
F 3 "http://ww1.microchip.com/downloads/en/DeviceDoc/atmel-2588-8-bit-avr-microcontrollers-tinyavr-attiny261-attiny461-attiny861_datasheet.pdf" H 4950 1950 50  0001 C CNN
	1    4950 1950
	1    0    0    -1  
$EndComp
$Comp
L Device:C C1
U 1 1 5F89EEE5
P 2300 2000
F 0 "C1" H 2415 2046 50  0000 L CNN
F 1 "10n" H 2415 1955 50  0000 L CNN
F 2 "Capacitor_THT:C_Disc_D3.8mm_W2.6mm_P2.50mm" H 2338 1850 50  0001 C CNN
F 3 "~" H 2300 2000 50  0001 C CNN
	1    2300 2000
	1    0    0    -1  
$EndComp
$Comp
L Device:C C2
U 1 1 5F89F0E9
P 3050 2000
F 0 "C2" H 3165 2046 50  0000 L CNN
F 1 "10n" H 3165 1955 50  0000 L CNN
F 2 "Capacitor_THT:C_Disc_D3.8mm_W2.6mm_P2.50mm" H 3088 1850 50  0001 C CNN
F 3 "~" H 3050 2000 50  0001 C CNN
	1    3050 2000
	1    0    0    -1  
$EndComp
$Comp
L power:GND #PWR0101
U 1 1 5F8A436C
P 10050 2800
F 0 "#PWR0101" H 10050 2550 50  0001 C CNN
F 1 "GND" H 10055 2627 50  0000 C CNN
F 2 "" H 10050 2800 50  0001 C CNN
F 3 "" H 10050 2800 50  0001 C CNN
	1    10050 2800
	1    0    0    -1  
$EndComp
$Comp
L power:GND #PWR0102
U 1 1 5F8A4790
P 4850 3200
F 0 "#PWR0102" H 4850 2950 50  0001 C CNN
F 1 "GND" H 4855 3027 50  0000 C CNN
F 2 "" H 4850 3200 50  0001 C CNN
F 3 "" H 4850 3200 50  0001 C CNN
	1    4850 3200
	1    0    0    -1  
$EndComp
Wire Wire Line
	5050 3450 5050 3400
Wire Wire Line
	4950 3050 4950 3200
Wire Wire Line
	4950 3200 4850 3200
Wire Wire Line
	4850 3200 3050 3200
Wire Wire Line
	3050 3200 3050 2150
Connection ~ 4850 3200
Wire Wire Line
	3050 800  4950 800 
Wire Wire Line
	4950 800  4950 850 
Wire Wire Line
	3050 800  3050 1850
Wire Wire Line
	5050 850  5050 750 
Wire Wire Line
	5050 750  2300 750 
Wire Wire Line
	2300 750  2300 1850
Wire Wire Line
	2300 2150 2300 3400
Wire Wire Line
	2300 3400 5050 3400
Connection ~ 5050 3400
Wire Wire Line
	5050 3400 5050 3050
$Comp
L Device:R R8
U 1 1 5F8A63DD
P 6000 3050
F 0 "R8" H 6070 3096 50  0000 L CNN
F 1 "10k" H 6070 3005 50  0000 L CNN
F 2 "Resistor_SMD:R_1206_3216Metric_Pad1.42x1.75mm_HandSolder" V 5930 3050 50  0001 C CNN
F 3 "~" H 6000 3050 50  0001 C CNN
	1    6000 3050
	1    0    0    -1  
$EndComp
Wire Wire Line
	6000 3200 6000 3400
Text Label 6000 3400 0    50   ~ 0
VCC
Wire Wire Line
	6000 2900 6000 2750
Wire Wire Line
	6000 2750 5650 2750
Text Label 5850 2750 0    50   ~ 0
RESET
Wire Wire Line
	5650 2050 6050 2050
Wire Wire Line
	5650 2150 6050 2150
Wire Wire Line
	5650 2250 6050 2250
Text Label 6050 2050 2    50   ~ 0
MOSI
Text Label 6050 2150 2    50   ~ 0
MISO
Text Label 6050 2250 2    50   ~ 0
SCLK
Wire Wire Line
	5650 1850 6050 1850
Text Label 6050 1850 2    50   ~ 0
VOLT_MON
Text Label 2700 750  0    50   ~ 0
VCC
Text Label 3250 800  0    50   ~ 0
VCC
$Comp
L Device:R R9
U 1 1 5F8A8752
P 8550 1250
F 0 "R9" H 8620 1296 50  0000 L CNN
F 1 "R" H 8620 1205 50  0000 L CNN
F 2 "Resistor_SMD:R_1206_3216Metric_Pad1.42x1.75mm_HandSolder" V 8480 1250 50  0001 C CNN
F 3 "~" H 8550 1250 50  0001 C CNN
	1    8550 1250
	1    0    0    -1  
$EndComp
$Comp
L Device:R R10
U 1 1 5F8A891A
P 8550 1750
F 0 "R10" H 8620 1796 50  0000 L CNN
F 1 "R" H 8620 1705 50  0000 L CNN
F 2 "Resistor_SMD:R_1206_3216Metric_Pad1.42x1.75mm_HandSolder" V 8480 1750 50  0001 C CNN
F 3 "~" H 8550 1750 50  0001 C CNN
	1    8550 1750
	1    0    0    -1  
$EndComp
$Comp
L power:GND #PWR0103
U 1 1 5F8A8BAD
P 8550 2100
F 0 "#PWR0103" H 8550 1850 50  0001 C CNN
F 1 "GND" H 8555 1927 50  0000 C CNN
F 2 "" H 8550 2100 50  0001 C CNN
F 3 "" H 8550 2100 50  0001 C CNN
	1    8550 2100
	1    0    0    -1  
$EndComp
Wire Wire Line
	8550 2100 8550 1900
Wire Wire Line
	8550 1600 8550 1500
Wire Wire Line
	8550 1100 8550 900 
Wire Wire Line
	8550 900  8300 900 
Wire Wire Line
	8550 1500 9000 1500
Connection ~ 8550 1500
Wire Wire Line
	8550 1500 8550 1400
Text Label 9000 1500 2    50   ~ 0
VOLT_MON
Text Label 8300 900  0    50   ~ 0
VCC
$Comp
L LasertagLib:Receiver-433MHz U1
U 1 1 5F8AAAB8
P 2400 5400
F 0 "U1" H 2828 5251 50  0000 L CNN
F 1 "Receiver-433MHz" H 2828 5160 50  0000 L CNN
F 2 "LasertagLib:Receiver433MHz" H 2400 5400 50  0001 C CNN
F 3 "" H 2400 5400 50  0001 C CNN
	1    2400 5400
	1    0    0    -1  
$EndComp
$Comp
L Connector_Generic:Conn_01x03 J9
U 1 1 5F8AB5E8
P 4900 5600
F 0 "J9" H 4980 5642 50  0000 L CNN
F 1 "MotionSensor" H 4980 5551 50  0000 L CNN
F 2 "Connector_Wire:SolderWire-0.5sqmm_1x02_P4.6mm_D0.9mm_OD2.1mm" H 4900 5600 50  0001 C CNN
F 3 "~" H 4900 5600 50  0001 C CNN
	1    4900 5600
	1    0    0    -1  
$EndComp
$Comp
L Device:Speaker LS1
U 1 1 5F8AC7CA
P 6950 5600
F 0 "LS1" H 7120 5596 50  0000 L CNN
F 1 "Speaker" H 7120 5505 50  0000 L CNN
F 2 "LasertagLib:SolderWirePad_2x_0-8mmDrill" H 6950 5400 50  0001 C CNN
F 3 "~" H 6940 5550 50  0001 C CNN
	1    6950 5600
	1    0    0    -1  
$EndComp
$Comp
L LasertagLib:74HC30 U3
U 1 1 5F8B4D92
P 10200 4000
F 0 "U3" H 10200 4525 50  0000 C CNN
F 1 "74HC30" H 10200 4434 50  0000 C CNN
F 2 "Package_SO:SOIC-14_3.9x8.7mm_P1.27mm" H 10200 4000 50  0001 C CNN
F 3 "http://www.ti.com/lit/gpn/cd74hc30" H 10200 4000 50  0001 C CNN
	1    10200 4000
	1    0    0    -1  
$EndComp
Wire Wire Line
	10500 4000 10850 4000
Text Label 10850 4000 2    50   ~ 0
IR_NAND
Wire Wire Line
	4700 5600 4450 5600
Wire Wire Line
	4700 5500 4450 5500
Text Label 4450 5500 0    50   ~ 0
VCC
Wire Wire Line
	4700 5700 4600 5700
$Comp
L power:GND #PWR0104
U 1 1 5F8B85B4
P 5050 3450
F 0 "#PWR0104" H 5050 3200 50  0001 C CNN
F 1 "GND" H 5055 3277 50  0000 C CNN
F 2 "" H 5050 3450 50  0001 C CNN
F 3 "" H 5050 3450 50  0001 C CNN
	1    5050 3450
	1    0    0    -1  
$EndComp
Connection ~ 4600 5700
Wire Wire Line
	4600 5700 4450 5700
$Comp
L LasertagLib:74HC30 U3
U 2 1 5F8B9FCE
P 10050 2200
F 0 "U3" H 10280 2246 50  0000 L CNN
F 1 "74HC30" H 10280 2155 50  0000 L CNN
F 2 "Package_SO:SOIC-14_3.9x8.7mm_P1.27mm" H 10050 2200 50  0001 C CNN
F 3 "http://www.ti.com/lit/gpn/cd74hc30" H 10050 2200 50  0001 C CNN
	2    10050 2200
	1    0    0    -1  
$EndComp
$Comp
L power:GND #PWR0105
U 1 1 5F8BBA06
P 4600 5700
F 0 "#PWR0105" H 4600 5450 50  0001 C CNN
F 1 "GND" H 4605 5527 50  0000 C CNN
F 2 "" H 4600 5700 50  0001 C CNN
F 3 "" H 4600 5700 50  0001 C CNN
	1    4600 5700
	1    0    0    -1  
$EndComp
Wire Wire Line
	10050 2800 10050 2700
Wire Wire Line
	10050 1700 10050 1450
Wire Wire Line
	10050 1450 10300 1450
Text Label 10300 1450 2    50   ~ 0
VCC
Wire Wire Line
	2000 5700 1800 5700
Wire Wire Line
	1800 5700 1800 5800
Wire Wire Line
	2000 5500 1800 5500
Text Label 1800 5500 0    50   ~ 0
VDD
$Comp
L power:GND #PWR0106
U 1 1 5F8C1394
P 1800 5800
F 0 "#PWR0106" H 1800 5550 50  0001 C CNN
F 1 "GND" H 1805 5627 50  0000 C CNN
F 2 "" H 1800 5800 50  0001 C CNN
F 3 "" H 1800 5800 50  0001 C CNN
	1    1800 5800
	1    0    0    -1  
$EndComp
Wire Wire Line
	2000 5600 1800 5600
Text Label 1800 5600 2    50   ~ 0
MOTION_RF_IN
Text Label 4450 5600 2    50   ~ 0
MOTION_RF_IN
Text Notes 3400 5300 0    50   ~ 0
ONLY USE ONE\n
Wire Wire Line
	6750 5700 6600 5700
Wire Wire Line
	6600 5700 6600 5900
$Comp
L power:GND #PWR0107
U 1 1 5F8C38B7
P 6600 5900
F 0 "#PWR0107" H 6600 5650 50  0001 C CNN
F 1 "GND" H 6605 5727 50  0000 C CNN
F 2 "" H 6600 5900 50  0001 C CNN
F 3 "" H 6600 5900 50  0001 C CNN
	1    6600 5900
	1    0    0    -1  
$EndComp
Wire Wire Line
	6750 5600 6600 5600
Text Label 6600 5600 2    50   ~ 0
SOUND
$Comp
L Connector_Generic:Conn_01x08 J12
U 1 1 5F8CA3D0
P 8000 4200
F 0 "J12" H 8080 4192 50  0000 L CNN
F 1 "RFID_Con" H 8080 4101 50  0000 L CNN
F 2 "Connector_PinSocket_2.54mm:PinSocket_1x08_P2.54mm_Vertical" H 8000 4200 50  0001 C CNN
F 3 "~" H 8000 4200 50  0001 C CNN
	1    8000 4200
	1    0    0    -1  
$EndComp
Wire Wire Line
	7800 3900 7300 3900
Wire Wire Line
	7800 4000 7300 4000
Wire Wire Line
	7800 4200 7300 4200
Wire Wire Line
	7800 4300 7300 4300
Wire Wire Line
	7800 4400 7300 4400
Wire Wire Line
	7800 4500 7300 4500
Wire Wire Line
	7800 4600 7300 4600
Wire Wire Line
	5650 2350 6000 2350
Wire Wire Line
	5650 2450 6000 2450
Wire Wire Line
	5650 2550 6000 2550
Wire Wire Line
	5650 2650 6000 2650
Text Label 7300 3900 0    50   ~ 0
VCC
Text Label 7300 4000 0    50   ~ 0
RFID_RST
Wire Wire Line
	6900 4100 6900 4150
Wire Wire Line
	6900 4100 7800 4100
$Comp
L power:GND #PWR0108
U 1 1 5F8D7A32
P 6900 4150
F 0 "#PWR0108" H 6900 3900 50  0001 C CNN
F 1 "GND" H 6905 3977 50  0000 C CNN
F 2 "" H 6900 4150 50  0001 C CNN
F 3 "" H 6900 4150 50  0001 C CNN
	1    6900 4150
	1    0    0    -1  
$EndComp
NoConn ~ 7300 4200
Text Label 7300 4300 0    50   ~ 0
RFID_MISO
Text Label 7300 4400 0    50   ~ 0
RFID_MOSI
Text Label 7300 4500 0    50   ~ 0
RFID_SCK
Text Label 7300 4600 0    50   ~ 0
RFID_SS
Text Label 6000 2350 2    50   ~ 0
RFID_MOSI
Text Label 6000 2450 2    50   ~ 0
RFID_MISO
Text Label 6000 2650 2    50   ~ 0
RFID_SCK
Wire Wire Line
	5650 1750 6050 1750
Text Label 6050 1750 2    50   ~ 0
RFID_SS
Wire Wire Line
	5650 1650 6050 1650
Text Label 6050 1650 0    50   ~ 0
MOTION_RF_IN
Wire Wire Line
	5650 1550 6050 1550
Text Label 6050 1550 2    50   ~ 0
SOUND
Wire Wire Line
	5650 1450 6050 1450
Text Label 6050 1450 2    50   ~ 0
IR_NAND
$Comp
L Connector_Generic:Conn_01x02 J1
U 1 1 5F8E40D1
P 850 1100
F 0 "J1" H 768 775 50  0000 C CNN
F 1 "Power_Conn" H 768 866 50  0000 C CNN
F 2 "LasertagLib:SolderWirePad_2x_0-8mmDrill" H 850 1100 50  0001 C CNN
F 3 "~" H 850 1100 50  0001 C CNN
	1    850  1100
	-1   0    0    1   
$EndComp
Wire Wire Line
	1050 1000 1250 1000
Wire Wire Line
	1050 1100 1250 1100
Text Label 1250 1000 2    50   ~ 0
VCC
Text Label 1250 1100 2    50   ~ 0
GND
$Comp
L Device:R R2
U 1 1 5F8E9CC9
P 1350 4450
F 0 "R2" H 1420 4496 50  0000 L CNN
F 1 "56" H 1420 4405 50  0000 L CNN
F 2 "Resistor_SMD:R_1206_3216Metric_Pad1.42x1.75mm_HandSolder" V 1280 4450 50  0001 C CNN
F 3 "~" H 1350 4450 50  0001 C CNN
	1    1350 4450
	1    0    0    -1  
$EndComp
$Comp
L power:GND #PWR0109
U 1 1 5F8EA364
P 1350 4750
F 0 "#PWR0109" H 1350 4500 50  0001 C CNN
F 1 "GND" H 1355 4577 50  0000 C CNN
F 2 "" H 1350 4750 50  0001 C CNN
F 3 "" H 1350 4750 50  0001 C CNN
	1    1350 4750
	1    0    0    -1  
$EndComp
Wire Wire Line
	1350 4600 1350 4750
$Comp
L Device:R R1
U 1 1 5F8ED20F
P 1300 6800
F 0 "R1" H 1370 6846 50  0000 L CNN
F 1 "220" H 1370 6755 50  0000 L CNN
F 2 "Resistor_SMD:R_1206_3216Metric_Pad1.42x1.75mm_HandSolder" V 1230 6800 50  0001 C CNN
F 3 "~" H 1300 6800 50  0001 C CNN
	1    1300 6800
	1    0    0    -1  
$EndComp
$Comp
L Connector_Generic:Conn_01x02 J2
U 1 1 5F8EE581
P 1100 3800
F 0 "J2" H 1018 3475 50  0000 C CNN
F 1 "Status_LED" H 1018 3566 50  0000 C CNN
F 2 "LasertagLib:SolderWirePad_2x_0-8mmDrill" H 1100 3800 50  0001 C CNN
F 3 "~" H 1100 3800 50  0001 C CNN
	1    1100 3800
	-1   0    0    1   
$EndComp
Wire Wire Line
	1300 3800 1350 3800
Wire Wire Line
	1350 3800 1350 4200
Wire Wire Line
	1300 3700 1550 3700
Text Label 1650 3700 0    50   ~ 0
STATUS_LED
Wire Wire Line
	5650 1350 6050 1350
Text Label 6050 1350 0    50   ~ 0
STATUS_LED
Text Label 6000 2550 2    50   ~ 0
IR_CTRL
$Comp
L Transistor_BJT:PN2222A Q1
U 1 1 5F8FFA5D
P 1200 7250
F 0 "Q1" H 1390 7296 50  0000 L CNN
F 1 "PN2222A" H 1390 7205 50  0000 L CNN
F 2 "Package_TO_SOT_THT:TO-92_Inline" H 1400 7175 50  0001 L CIN
F 3 "http://www.fairchildsemi.com/ds/PN/PN2222A.pdf" H 1200 7250 50  0001 L CNN
	1    1200 7250
	1    0    0    -1  
$EndComp
$Comp
L power:GND #PWR0110
U 1 1 5F90083C
P 1300 7500
F 0 "#PWR0110" H 1300 7250 50  0001 C CNN
F 1 "GND" H 1305 7327 50  0000 C CNN
F 2 "" H 1300 7500 50  0001 C CNN
F 3 "" H 1300 7500 50  0001 C CNN
	1    1300 7500
	1    0    0    -1  
$EndComp
Wire Wire Line
	1000 7250 650  7250
Text Label 650  7250 0    50   ~ 0
IR_CTRL
Wire Wire Line
	1300 7450 1300 7500
$Comp
L Device:R R3
U 1 1 5F90F5EB
P 1550 6800
F 0 "R3" H 1620 6846 50  0000 L CNN
F 1 "220" H 1620 6755 50  0000 L CNN
F 2 "Resistor_SMD:R_1206_3216Metric_Pad1.42x1.75mm_HandSolder" V 1480 6800 50  0001 C CNN
F 3 "~" H 1550 6800 50  0001 C CNN
	1    1550 6800
	1    0    0    -1  
$EndComp
$Comp
L Device:R R4
U 1 1 5F90F7BB
P 1750 6800
F 0 "R4" H 1820 6846 50  0000 L CNN
F 1 "R" H 1820 6755 50  0000 L CNN
F 2 "Resistor_SMD:R_1206_3216Metric_Pad1.42x1.75mm_HandSolder" V 1680 6800 50  0001 C CNN
F 3 "~" H 1750 6800 50  0001 C CNN
	1    1750 6800
	1    0    0    -1  
$EndComp
$Comp
L Device:R R5
U 1 1 5F90F923
P 1950 6800
F 0 "R5" H 2020 6846 50  0000 L CNN
F 1 "220" H 2020 6755 50  0000 L CNN
F 2 "Resistor_SMD:R_1206_3216Metric_Pad1.42x1.75mm_HandSolder" V 1880 6800 50  0001 C CNN
F 3 "~" H 1950 6800 50  0001 C CNN
	1    1950 6800
	1    0    0    -1  
$EndComp
$Comp
L Device:R R6
U 1 1 5F90FAAC
P 2200 6800
F 0 "R6" H 2270 6846 50  0000 L CNN
F 1 "220" H 2270 6755 50  0000 L CNN
F 2 "Resistor_SMD:R_1206_3216Metric_Pad1.42x1.75mm_HandSolder" V 2130 6800 50  0001 C CNN
F 3 "~" H 2200 6800 50  0001 C CNN
	1    2200 6800
	1    0    0    -1  
$EndComp
$Comp
L Device:R R7
U 1 1 5F90FCF9
P 2450 6800
F 0 "R7" H 2520 6846 50  0000 L CNN
F 1 "220" H 2520 6755 50  0000 L CNN
F 2 "Resistor_SMD:R_1206_3216Metric_Pad1.42x1.75mm_HandSolder" V 2380 6800 50  0001 C CNN
F 3 "~" H 2450 6800 50  0001 C CNN
	1    2450 6800
	1    0    0    -1  
$EndComp
Wire Wire Line
	1300 7050 1300 7000
Wire Wire Line
	1300 7000 1550 7000
Wire Wire Line
	1550 7000 1550 6950
Connection ~ 1300 7000
Wire Wire Line
	1300 7000 1300 6950
Wire Wire Line
	1550 7000 1750 7000
Wire Wire Line
	1750 7000 1750 6950
Connection ~ 1550 7000
Wire Wire Line
	1750 7000 1950 7000
Wire Wire Line
	1950 7000 1950 6950
Connection ~ 1750 7000
Wire Wire Line
	1950 7000 2200 7000
Wire Wire Line
	2200 7000 2200 6950
Connection ~ 1950 7000
Wire Wire Line
	2200 7000 2450 7000
Wire Wire Line
	2450 7000 2450 6950
Connection ~ 2200 7000
$Comp
L Connector_Generic:Conn_01x02 J10
U 1 1 5F91CA76
P 7450 1150
F 0 "J10" H 7368 825 50  0000 C CNN
F 1 "Res_con" H 7368 916 50  0000 C CNN
F 2 "LasertagLib:SolderWirePad_2x_0-8mmDrill" H 7450 1150 50  0001 C CNN
F 3 "~" H 7450 1150 50  0001 C CNN
	1    7450 1150
	1    0    0    -1  
$EndComp
$Comp
L power:GND #PWR0111
U 1 1 5F9205D1
P 7050 1350
F 0 "#PWR0111" H 7050 1100 50  0001 C CNN
F 1 "GND" H 7055 1177 50  0000 C CNN
F 2 "" H 7050 1350 50  0001 C CNN
F 3 "" H 7050 1350 50  0001 C CNN
	1    7050 1350
	1    0    0    -1  
$EndComp
Wire Wire Line
	7050 1350 7050 1250
Wire Wire Line
	7050 1250 7250 1250
Wire Wire Line
	5650 1150 7250 1150
Wire Wire Line
	1300 6650 1300 6400
Wire Wire Line
	1550 6400 1550 6650
Wire Wire Line
	1750 6650 1750 6400
Wire Wire Line
	1950 6650 1950 6400
Wire Wire Line
	2200 6650 2200 6400
Wire Wire Line
	2450 6650 2450 6400
Text Label 1300 6400 3    50   ~ 0
IR1
Text Label 1550 6400 3    50   ~ 0
IR2
Text Label 1750 6400 3    50   ~ 0
IR3
Text Label 1950 6400 3    50   ~ 0
IR4
Text Label 2200 6400 3    50   ~ 0
IR5
Text Label 2450 6400 3    50   ~ 0
IR6
$Comp
L Connector_Generic:Conn_01x02 J4
U 1 1 5F941999
P 4600 6450
F 0 "J4" H 4680 6442 50  0000 L CNN
F 1 "Conn_01x02" H 4680 6351 50  0000 L CNN
F 2 "LasertagLib:SolderWirePad_2x_0-8mmDrill" H 4600 6450 50  0001 C CNN
F 3 "~" H 4600 6450 50  0001 C CNN
	1    4600 6450
	1    0    0    -1  
$EndComp
$Comp
L Connector_Generic:Conn_01x02 J5
U 1 1 5F941D8E
P 5400 7300
F 0 "J5" H 5480 7292 50  0000 L CNN
F 1 "Conn_01x02" H 5480 7201 50  0000 L CNN
F 2 "LasertagLib:SolderWirePad_2x_0-8mmDrill" H 5400 7300 50  0001 C CNN
F 3 "~" H 5400 7300 50  0001 C CNN
	1    5400 7300
	0    -1   -1   0   
$EndComp
$Comp
L Connector_Generic:Conn_01x02 J6
U 1 1 5F942390
P 4600 7000
F 0 "J6" H 4680 6992 50  0000 L CNN
F 1 "Conn_01x02" H 4680 6901 50  0000 L CNN
F 2 "LasertagLib:SolderWirePad_2x_0-8mmDrill" H 4600 7000 50  0001 C CNN
F 3 "~" H 4600 7000 50  0001 C CNN
	1    4600 7000
	1    0    0    -1  
$EndComp
$Comp
L Connector_Generic:Conn_01x02 J7
U 1 1 5F94276D
P 4600 7300
F 0 "J7" H 4680 7292 50  0000 L CNN
F 1 "Conn_01x02" H 4680 7201 50  0000 L CNN
F 2 "LasertagLib:SolderWirePad_2x_0-8mmDrill" H 4600 7300 50  0001 C CNN
F 3 "~" H 4600 7300 50  0001 C CNN
	1    4600 7300
	1    0    0    -1  
$EndComp
$Comp
L Connector_Generic:Conn_01x02 J8
U 1 1 5F942B4B
P 4600 7600
F 0 "J8" H 4680 7592 50  0000 L CNN
F 1 "Conn_01x02" H 4680 7501 50  0000 L CNN
F 2 "LasertagLib:SolderWirePad_2x_0-8mmDrill" H 4600 7600 50  0001 C CNN
F 3 "~" H 4600 7600 50  0001 C CNN
	1    4600 7600
	1    0    0    -1  
$EndComp
$Comp
L Connector_Generic:Conn_01x02 J3
U 1 1 5F942FC5
P 4600 6150
F 0 "J3" H 4680 6142 50  0000 L CNN
F 1 "Conn_01x02" H 4680 6051 50  0000 L CNN
F 2 "LasertagLib:SolderWirePad_2x_0-8mmDrill" H 4600 6150 50  0001 C CNN
F 3 "~" H 4600 6150 50  0001 C CNN
	1    4600 6150
	1    0    0    -1  
$EndComp
Wire Wire Line
	4400 6150 4150 6150
Wire Wire Line
	4400 6250 4150 6250
Wire Wire Line
	4400 6450 4150 6450
Wire Wire Line
	4400 6550 4150 6550
Wire Wire Line
	4400 7000 4150 7000
Wire Wire Line
	4400 7100 4150 7100
Wire Wire Line
	4400 7300 4150 7300
Wire Wire Line
	4150 7400 4400 7400
Wire Wire Line
	4400 7600 4150 7600
Wire Wire Line
	4400 7700 4150 7700
Text Label 4150 6150 0    50   ~ 0
VCC
Text Label 4150 6450 0    50   ~ 0
VCC
Text Label 4150 7000 0    50   ~ 0
VCC
Text Label 4150 7300 0    50   ~ 0
VCC
Text Label 4150 7600 0    50   ~ 0
VCC
Text Label 4150 6250 0    50   ~ 0
IR1
Text Label 4150 6550 0    50   ~ 0
IR2
Text Label 4150 7100 0    50   ~ 0
IR4
Text Label 4150 7400 0    50   ~ 0
IR5
Text Label 4150 7700 0    50   ~ 0
IR6
$Comp
L Connector_Generic:Conn_01x06 J11
U 1 1 5F9714F2
P 8000 3150
F 0 "J11" H 8080 3142 50  0000 L CNN
F 1 "AVR_Programmer" H 8080 3051 50  0000 L CNN
F 2 "Connector_PinHeader_2.54mm:PinHeader_1x06_P2.54mm_Vertical" H 8000 3150 50  0001 C CNN
F 3 "~" H 8000 3150 50  0001 C CNN
	1    8000 3150
	1    0    0    -1  
$EndComp
Wire Wire Line
	7800 3450 7400 3450
Wire Wire Line
	7800 3350 7400 3350
Wire Wire Line
	7800 3250 7400 3250
Wire Wire Line
	7800 3150 7400 3150
Wire Wire Line
	7800 3050 7400 3050
Wire Wire Line
	7800 2950 7400 2950
Text Label 7400 2950 0    50   ~ 0
VCC
Text Label 7400 3050 0    50   ~ 0
MOSI
Text Label 7400 3150 0    50   ~ 0
MISO
Text Label 7400 3350 0    50   ~ 0
RESET
Text Label 7400 3250 0    50   ~ 0
SCLK
$Comp
L Connector_Generic:Conn_01x03 J13
U 1 1 5F9944EA
P 8050 5250
F 0 "J13" H 7968 4925 50  0000 C CNN
F 1 "IR_IN1" H 7968 5016 50  0000 C CNN
F 2 "Connector_Wire:SolderWire-0.5sqmm_1x03_P4.6mm_D0.9mm_OD2.1mm" H 8050 5250 50  0001 C CNN
F 3 "~" H 8050 5250 50  0001 C CNN
	1    8050 5250
	-1   0    0    -1  
$EndComp
$Comp
L power:GND #PWR0112
U 1 1 5F9AF8D5
P 7400 3450
F 0 "#PWR0112" H 7400 3200 50  0001 C CNN
F 1 "GND" H 7405 3277 50  0000 C CNN
F 2 "" H 7400 3450 50  0001 C CNN
F 3 "" H 7400 3450 50  0001 C CNN
	1    7400 3450
	1    0    0    -1  
$EndComp
Wire Wire Line
	9100 5150 9300 5150
Wire Wire Line
	9300 5150 9300 5250
Wire Wire Line
	8250 5250 9300 5250
Wire Wire Line
	8250 5150 8800 5150
Text Label 8550 5150 0    50   ~ 0
VCC
$Comp
L power:GND #PWR0113
U 1 1 5F9BB0AE
P 8600 5350
F 0 "#PWR0113" H 8600 5100 50  0001 C CNN
F 1 "GND" H 8605 5177 50  0000 C CNN
F 2 "" H 8600 5350 50  0001 C CNN
F 3 "" H 8600 5350 50  0001 C CNN
	1    8600 5350
	1    0    0    -1  
$EndComp
Wire Wire Line
	8250 5350 8600 5350
Wire Wire Line
	9900 3700 9700 3700
Wire Wire Line
	9900 3800 9700 3800
Wire Wire Line
	9900 3900 9700 3900
Wire Wire Line
	9900 4000 9700 4000
Wire Wire Line
	9900 4100 9700 4100
Wire Wire Line
	9900 4200 9700 4200
Wire Wire Line
	9900 4300 9700 4300
Wire Wire Line
	9900 4400 9700 4400
Text Label 9700 3700 0    50   ~ 0
IR_IN1
Text Label 9700 3800 0    50   ~ 0
IR_IN2
Text Label 9700 3900 0    50   ~ 0
IR_IN3
Text Label 9700 4000 0    50   ~ 0
IR_IN4
Text Label 9700 4100 0    50   ~ 0
IR_IN5
Text Label 9700 4200 0    50   ~ 0
IR_IN6
$Comp
L Connector_Generic:Conn_01x03 J14
U 1 1 5F9F8818
P 8050 5900
F 0 "J14" H 7968 5575 50  0000 C CNN
F 1 "IR_IN2" H 7968 5666 50  0000 C CNN
F 2 "Connector_Wire:SolderWire-0.5sqmm_1x03_P4.6mm_D0.9mm_OD2.1mm" H 8050 5900 50  0001 C CNN
F 3 "~" H 8050 5900 50  0001 C CNN
	1    8050 5900
	-1   0    0    -1  
$EndComp
$Comp
L Jumper:SolderJumper_2_Open JP2
U 1 1 5F9F881E
P 8950 5800
F 0 "JP2" H 8950 6005 50  0000 C CNN
F 1 "SolderJumper_2_Open" H 8950 5914 50  0000 C CNN
F 2 "Jumper:SolderJumper-2_P1.3mm_Open_RoundedPad1.0x1.5mm" H 8950 5800 50  0001 C CNN
F 3 "~" H 8950 5800 50  0001 C CNN
	1    8950 5800
	1    0    0    -1  
$EndComp
Wire Wire Line
	9100 5800 9300 5800
Wire Wire Line
	9300 5800 9300 5900
Wire Wire Line
	8250 5900 9300 5900
Wire Wire Line
	8250 5800 8800 5800
Text Label 8550 5800 0    50   ~ 0
VCC
$Comp
L power:GND #PWR0114
U 1 1 5F9F8829
P 8600 6000
F 0 "#PWR0114" H 8600 5750 50  0001 C CNN
F 1 "GND" H 8605 5827 50  0000 C CNN
F 2 "" H 8600 6000 50  0001 C CNN
F 3 "" H 8600 6000 50  0001 C CNN
	1    8600 6000
	1    0    0    -1  
$EndComp
Wire Wire Line
	8250 6000 8600 6000
$Comp
L Connector_Generic:Conn_01x03 J18
U 1 1 5F9FDB1A
P 9650 5200
F 0 "J18" H 9568 4875 50  0000 C CNN
F 1 "IR_IN5" H 9568 4966 50  0000 C CNN
F 2 "Connector_Wire:SolderWire-0.5sqmm_1x03_P4.6mm_D0.9mm_OD2.1mm" H 9650 5200 50  0001 C CNN
F 3 "~" H 9650 5200 50  0001 C CNN
	1    9650 5200
	-1   0    0    -1  
$EndComp
$Comp
L Jumper:SolderJumper_2_Open JP6
U 1 1 5F9FDB20
P 10550 5100
F 0 "JP6" H 10550 5305 50  0000 C CNN
F 1 "SolderJumper_2_Open" H 10550 5214 50  0000 C CNN
F 2 "Jumper:SolderJumper-2_P1.3mm_Open_RoundedPad1.0x1.5mm" H 10550 5100 50  0001 C CNN
F 3 "~" H 10550 5100 50  0001 C CNN
	1    10550 5100
	1    0    0    -1  
$EndComp
Wire Wire Line
	10700 5100 10900 5100
Wire Wire Line
	10900 5100 10900 5200
Wire Wire Line
	9850 5200 10900 5200
Wire Wire Line
	9850 5100 10400 5100
Text Label 10150 5100 0    50   ~ 0
VCC
$Comp
L power:GND #PWR0115
U 1 1 5F9FDB2B
P 10200 5300
F 0 "#PWR0115" H 10200 5050 50  0001 C CNN
F 1 "GND" H 10205 5127 50  0000 C CNN
F 2 "" H 10200 5300 50  0001 C CNN
F 3 "" H 10200 5300 50  0001 C CNN
	1    10200 5300
	1    0    0    -1  
$EndComp
Wire Wire Line
	9850 5300 10200 5300
$Comp
L Connector_Generic:Conn_01x03 J19
U 1 1 5FA03391
P 9650 5900
F 0 "J19" H 9568 5575 50  0000 C CNN
F 1 "IR_IN6" H 9568 5666 50  0000 C CNN
F 2 "Connector_Wire:SolderWire-0.5sqmm_1x03_P4.6mm_D0.9mm_OD2.1mm" H 9650 5900 50  0001 C CNN
F 3 "~" H 9650 5900 50  0001 C CNN
	1    9650 5900
	-1   0    0    -1  
$EndComp
$Comp
L Jumper:SolderJumper_2_Open JP7
U 1 1 5FA03397
P 10550 5800
F 0 "JP7" H 10550 6005 50  0000 C CNN
F 1 "SolderJumper_2_Open" H 10550 5914 50  0000 C CNN
F 2 "Jumper:SolderJumper-2_P1.3mm_Open_RoundedPad1.0x1.5mm" H 10550 5800 50  0001 C CNN
F 3 "~" H 10550 5800 50  0001 C CNN
	1    10550 5800
	1    0    0    -1  
$EndComp
Wire Wire Line
	10700 5800 10900 5800
Wire Wire Line
	10900 5800 10900 5900
Wire Wire Line
	9850 5900 10900 5900
Wire Wire Line
	9850 5800 10400 5800
Text Label 10150 5800 0    50   ~ 0
VCC
$Comp
L power:GND #PWR0116
U 1 1 5FA033A2
P 10200 6000
F 0 "#PWR0116" H 10200 5750 50  0001 C CNN
F 1 "GND" H 10205 5827 50  0000 C CNN
F 2 "" H 10200 6000 50  0001 C CNN
F 3 "" H 10200 6000 50  0001 C CNN
	1    10200 6000
	1    0    0    -1  
$EndComp
Wire Wire Line
	9850 6000 10200 6000
$Comp
L Connector_Generic:Conn_01x03 J15
U 1 1 5FA0942F
P 8050 6600
F 0 "J15" H 7968 6275 50  0000 C CNN
F 1 "IR_IN3" H 7968 6366 50  0000 C CNN
F 2 "Connector_Wire:SolderWire-0.5sqmm_1x03_P4.6mm_D0.9mm_OD2.1mm" H 8050 6600 50  0001 C CNN
F 3 "~" H 8050 6600 50  0001 C CNN
	1    8050 6600
	-1   0    0    -1  
$EndComp
$Comp
L Jumper:SolderJumper_2_Open JP3
U 1 1 5FA09435
P 8950 6500
F 0 "JP3" H 8950 6705 50  0000 C CNN
F 1 "SolderJumper_2_Open" H 8950 6614 50  0000 C CNN
F 2 "Jumper:SolderJumper-2_P1.3mm_Open_RoundedPad1.0x1.5mm" H 8950 6500 50  0001 C CNN
F 3 "~" H 8950 6500 50  0001 C CNN
	1    8950 6500
	1    0    0    -1  
$EndComp
Wire Wire Line
	9100 6500 9300 6500
Wire Wire Line
	9300 6500 9300 6600
Wire Wire Line
	8250 6600 9300 6600
Wire Wire Line
	8250 6500 8800 6500
Text Label 8550 6500 0    50   ~ 0
VCC
$Comp
L power:GND #PWR0117
U 1 1 5FA09440
P 8600 6700
F 0 "#PWR0117" H 8600 6450 50  0001 C CNN
F 1 "GND" H 8605 6527 50  0000 C CNN
F 2 "" H 8600 6700 50  0001 C CNN
F 3 "" H 8600 6700 50  0001 C CNN
	1    8600 6700
	1    0    0    -1  
$EndComp
Wire Wire Line
	8250 6700 8600 6700
$Comp
L Connector_Generic:Conn_01x03 J16
U 1 1 5FA1603C
P 8050 7250
F 0 "J16" H 7968 6925 50  0000 C CNN
F 1 "IR_IN4" H 7968 7016 50  0000 C CNN
F 2 "Connector_Wire:SolderWire-0.5sqmm_1x03_P4.6mm_D0.9mm_OD2.1mm" H 8050 7250 50  0001 C CNN
F 3 "~" H 8050 7250 50  0001 C CNN
	1    8050 7250
	-1   0    0    -1  
$EndComp
$Comp
L Jumper:SolderJumper_2_Open JP4
U 1 1 5FA16042
P 8950 7150
F 0 "JP4" H 8950 7355 50  0000 C CNN
F 1 "SolderJumper_2_Open" H 8950 7264 50  0000 C CNN
F 2 "Jumper:SolderJumper-2_P1.3mm_Open_RoundedPad1.0x1.5mm" H 8950 7150 50  0001 C CNN
F 3 "~" H 8950 7150 50  0001 C CNN
	1    8950 7150
	1    0    0    -1  
$EndComp
Wire Wire Line
	9100 7150 9300 7150
Wire Wire Line
	9300 7150 9300 7250
Wire Wire Line
	8250 7250 9300 7250
Wire Wire Line
	8250 7150 8800 7150
Text Label 8550 7150 0    50   ~ 0
VCC
$Comp
L power:GND #PWR0119
U 1 1 5FA1604D
P 8600 7350
F 0 "#PWR0119" H 8600 7100 50  0001 C CNN
F 1 "GND" H 8605 7177 50  0000 C CNN
F 2 "" H 8600 7350 50  0001 C CNN
F 3 "" H 8600 7350 50  0001 C CNN
	1    8600 7350
	1    0    0    -1  
$EndComp
Wire Wire Line
	8250 7350 8600 7350
Text Label 9050 5250 0    50   ~ 0
IR_IN1
Text Label 9050 5900 0    50   ~ 0
IR_IN2
Text Label 9050 6600 0    50   ~ 0
IR_IN3
Text Label 9050 7250 0    50   ~ 0
IR_IN4
Text Label 10650 5200 0    50   ~ 0
IR_IN5
Text Label 10650 5900 0    50   ~ 0
IR_IN6
Wire Wire Line
	9700 4300 9700 4400
Text Label 9700 4300 0    50   ~ 0
VCC
$Comp
L Device:LED D1
U 1 1 5F991F73
P 1750 4050
F 0 "D1" V 1789 3932 50  0000 R CNN
F 1 "LED" V 1698 3932 50  0000 R CNN
F 2 "LED_SMD:LED_1210_3225Metric_Pad1.42x2.65mm_HandSolder" H 1750 4050 50  0001 C CNN
F 3 "~" H 1750 4050 50  0001 C CNN
F 4 "https://www.reichelt.de/led-smd-1210-gruen-342-mcd-20--evl-42-21sygc-s2-p231666.html?&trstct=pol_10&nbc=1" V 1750 4050 50  0001 C CNN "Reichelt"
	1    1750 4050
	0    -1   -1   0   
$EndComp
Wire Wire Line
	1750 4200 1350 4200
Connection ~ 1350 4200
Wire Wire Line
	1350 4200 1350 4300
Wire Wire Line
	1750 3900 1550 3900
Wire Wire Line
	1550 3900 1550 3700
Connection ~ 1550 3700
Wire Wire Line
	1550 3700 1650 3700
Wire Wire Line
	5650 1250 6700 1250
Text Label 6100 1250 2    50   ~ 0
RFID_RST
$Comp
L Device:LED D3
U 1 1 5F9A9285
P 6250 7350
F 0 "D3" V 6289 7232 50  0000 R CNN
F 1 "LED" V 6198 7232 50  0000 R CNN
F 2 "LED_SMD:LED_1210_3225Metric_Pad1.42x2.65mm_HandSolder" H 6250 7350 50  0001 C CNN
F 3 "~" H 6250 7350 50  0001 C CNN
	1    6250 7350
	0    -1   -1   0   
$EndComp
$Comp
L Device:LED D2
U 1 1 5F9AA4E8
P 5750 7350
F 0 "D2" V 5789 7232 50  0000 R CNN
F 1 "LED" V 5698 7232 50  0000 R CNN
F 2 "LED_THT:LED_D5.0mm" H 5750 7350 50  0001 C CNN
F 3 "~" H 5750 7350 50  0001 C CNN
	1    5750 7350
	0    -1   -1   0   
$EndComp
Wire Wire Line
	5750 7500 5750 7650
Wire Wire Line
	5750 7650 6250 7650
Wire Wire Line
	6250 7650 6250 7500
Wire Wire Line
	5500 7500 5500 7650
Wire Wire Line
	5500 7650 5750 7650
Connection ~ 5750 7650
Wire Wire Line
	5400 7500 5400 7650
Wire Wire Line
	5400 7650 5300 7650
Wire Wire Line
	5300 7650 5300 7150
Wire Wire Line
	5300 7150 5750 7150
Wire Wire Line
	5750 7150 5750 7200
Wire Wire Line
	6250 7200 6250 7150
Wire Wire Line
	6250 7150 5750 7150
Connection ~ 5750 7150
Text Label 5850 7150 0    50   ~ 0
VCC
Text Label 6000 7650 0    50   ~ 0
IR3
Text Notes 5650 7000 0    50   ~ 0
Alternatives\n
$EndSCHEMATC
