(module LOGO (layer F.Cu)
  (at 0 0)
 (fp_text reference "G***" (at 0 0) (layer F.SilkS) hide
  (effects (font (thickness 0.3)))
  )
  (fp_text value "LOGO" (at 0.75 0) (layer F.SilkS) hide
  (effects (font (thickness 0.3)))
  )
  (fp_poly (pts (xy -5.890474 8.132618) (xy -5.787430 8.150463) (xy -5.690250 8.182089) (xy -5.600230 8.226818) (xy -5.518663 8.283971) (xy -5.446845 8.352869) (xy -5.386070 8.432835) (xy -5.337634 8.523190)
     (xy -5.326096 8.551196) (xy -5.310658 8.594849) (xy -5.295298 8.644189) (xy -5.283265 8.688761) (xy -5.282969 8.690002) (xy -5.275125 8.729400) (xy -5.267866 8.777407) (xy -5.261559 8.829980)
     (xy -5.256571 8.883079) (xy -5.253267 8.932662) (xy -5.252013 8.974687) (xy -5.253176 9.005112) (xy -5.253916 9.010601) (xy -5.259288 9.042400) (xy -6.276306 9.042400) (xy -6.271260 9.116484)
     (xy -6.260127 9.198810) (xy -6.238975 9.270363) (xy -6.208327 9.329988) (xy -6.168704 9.376530) (xy -6.145296 9.394799) (xy -6.096871 9.418473) (xy -6.038171 9.433306) (xy -5.973529 9.439029)
     (xy -5.907273 9.435370) (xy -5.843736 9.422059) (xy -5.822622 9.414950) (xy -5.776201 9.390535) (xy -5.732351 9.355029) (xy -5.696268 9.313232) (xy -5.677625 9.281074) (xy -5.661628 9.245600)
     (xy -5.272616 9.245600) (xy -5.278058 9.272808) (xy -5.288436 9.306122) (xy -5.306934 9.348064) (xy -5.331079 9.394050) (xy -5.358399 9.439497) (xy -5.386422 9.479822) (xy -5.396757 9.492870)
     (xy -5.463539 9.561217) (xy -5.542890 9.621557) (xy -5.631529 9.671844) (xy -5.726177 9.710032) (xy -5.762024 9.720675) (xy -5.817967 9.731859) (xy -5.885015 9.739294) (xy -5.957733 9.742861)
     (xy -6.030686 9.742445) (xy -6.098441 9.737926) (xy -6.155562 9.729188) (xy -6.155601 9.729180) (xy -6.249347 9.701081) (xy -6.337310 9.659600) (xy -6.416710 9.606395) (xy -6.484767 9.543125)
     (xy -6.503078 9.521789) (xy -6.560710 9.437716) (xy -6.607188 9.342286) (xy -6.642183 9.237165) (xy -6.665365 9.124018) (xy -6.676405 9.004509) (xy -6.674974 8.880305) (xy -6.663747 8.779934)
     (xy -6.273377 8.779934) (xy -5.672666 8.779934) (xy -5.672792 8.760884) (xy -5.676207 8.730676) (xy -5.685021 8.691125) (xy -5.697547 8.648265) (xy -5.712102 8.608135) (xy -5.721051 8.587994)
     (xy -5.751763 8.540417) (xy -5.792842 8.498395) (xy -5.839574 8.466209) (xy -5.869768 8.452918) (xy -5.906726 8.444033) (xy -5.950443 8.438786) (xy -5.973233 8.437976) (xy -6.041053 8.444137)
     (xy -6.099627 8.462963) (xy -6.149435 8.494964) (xy -6.190958 8.540652) (xy -6.224676 8.600539) (xy -6.251068 8.675135) (xy -6.268448 8.752417) (xy -6.273377 8.779934) (xy -6.663747 8.779934)
     (xy -6.660742 8.753069) (xy -6.658146 8.737600) (xy -6.631042 8.623105) (xy -6.591675 8.518865) (xy -6.540646 8.425532) (xy -6.478554 8.343757) (xy -6.406000 8.274195) (xy -6.323585 8.217496)
     (xy -6.231909 8.174314) (xy -6.131572 8.145301) (xy -6.108975 8.140985) (xy -5.998087 8.129233) (xy -5.890474 8.132618) )(layer F.SilkS) (width  0.010000)
  )
  (fp_poly (pts (xy -4.247908 8.132145) (xy -4.206893 8.135627) (xy -4.099938 8.152301) (xy -4.007150 8.177634) (xy -3.927991 8.211890) (xy -3.861922 8.255330) (xy -3.808406 8.308216) (xy -3.783848 8.341857)
     (xy -3.771575 8.360791) (xy -3.761039 8.377712) (xy -3.752096 8.394026) (xy -3.744602 8.411134) (xy -3.738413 8.430441) (xy -3.733385 8.453350) (xy -3.729374 8.481264) (xy -3.726237 8.515588)
     (xy -3.723829 8.557724) (xy -3.722005 8.609075) (xy -3.720623 8.671046) (xy -3.719538 8.745040) (xy -3.718606 8.832460) (xy -3.717683 8.934709) (xy -3.717182 8.991600) (xy -3.716234 9.097429)
     (xy -3.715377 9.187669) (xy -3.714553 9.263667) (xy -3.713704 9.326766) (xy -3.712772 9.378312) (xy -3.711699 9.419649) (xy -3.710427 9.452123) (xy -3.708897 9.477077) (xy -3.707052 9.495858)
     (xy -3.704835 9.509809) (xy -3.702185 9.520276) (xy -3.699047 9.528603) (xy -3.695361 9.536136) (xy -3.693531 9.539581) (xy -3.675435 9.569134) (xy -3.654262 9.598042) (xy -3.649081 9.604199)
     (xy -3.628746 9.635789) (xy -3.623733 9.659468) (xy -3.623733 9.685867) (xy -4.055782 9.685867) (xy -4.072566 9.658350) (xy -4.085644 9.630850) (xy -4.094170 9.602216) (xy -4.094348 9.601200)
     (xy -4.099056 9.574511) (xy -4.104118 9.558811) (xy -4.112239 9.553973) (xy -4.126127 9.559873) (xy -4.148488 9.576386) (xy -4.174701 9.597479) (xy -4.259272 9.657616) (xy -4.344517 9.701506)
     (xy -4.432194 9.729799) (xy -4.524060 9.743147) (xy -4.571238 9.744428) (xy -4.613876 9.742768) (xy -4.656804 9.738959) (xy -4.692680 9.733716) (xy -4.702098 9.731701) (xy -4.780994 9.704440)
     (xy -4.850469 9.663825) (xy -4.909679 9.611102) (xy -4.957780 9.547517) (xy -4.993929 9.474315) (xy -5.017283 9.392742) (xy -5.026999 9.304043) (xy -5.026237 9.252908) (xy -5.024533 9.238944)
     (xy -4.629050 9.238944) (xy -4.619952 9.297117) (xy -4.619716 9.297934) (xy -4.597743 9.345840) (xy -4.562918 9.382741) (xy -4.515327 9.408560) (xy -4.491567 9.416076) (xy -4.462709 9.419901)
     (xy -4.423257 9.420311) (xy -4.379112 9.417717) (xy -4.336174 9.412527) (xy -4.300344 9.405152) (xy -4.290532 9.402115) (xy -4.243131 9.377632) (xy -4.199021 9.340498) (xy -4.162650 9.294958)
     (xy -4.145749 9.263947) (xy -4.126933 9.215048) (xy -4.114712 9.164835) (xy -4.108157 9.108141) (xy -4.106333 9.044572) (xy -4.106598 9.007399) (xy -4.107772 8.984300) (xy -4.110425 8.972419)
     (xy -4.115127 8.968902) (xy -4.121150 8.970351) (xy -4.149341 8.980219) (xy -4.187440 8.990924) (xy -4.237367 9.002944) (xy -4.301042 9.016753) (xy -4.343383 9.025438) (xy -4.391852 9.035809)
     (xy -4.437530 9.046643) (xy -4.476416 9.056915) (xy -4.504503 9.065598) (xy -4.512717 9.068787) (xy -4.563415 9.099174) (xy -4.600134 9.138587) (xy -4.622228 9.185638) (xy -4.629050 9.238944)
     (xy -5.024533 9.238944) (xy -5.015680 9.166405) (xy -4.993995 9.091202) (xy -4.960171 9.025026) (xy -4.913203 8.965600) (xy -4.887978 8.940883) (xy -4.845761 8.906747) (xy -4.798426 8.877627)
     (xy -4.743784 8.852718) (xy -4.679649 8.831215) (xy -4.603830 8.812312) (xy -4.514139 8.795205) (xy -4.474633 8.788800) (xy -4.394619 8.775880) (xy -4.329536 8.764204) (xy -4.277473 8.753283)
     (xy -4.236517 8.742626) (xy -4.204754 8.731745) (xy -4.180274 8.720148) (xy -4.163338 8.709040) (xy -4.131965 8.680759) (xy -4.114088 8.652064) (xy -4.106938 8.617834) (xy -4.106458 8.603913)
     (xy -4.113817 8.557734) (xy -4.134903 8.518004) (xy -4.167735 8.488294) (xy -4.172006 8.485775) (xy -4.215401 8.468411) (xy -4.270344 8.457323) (xy -4.332451 8.453053) (xy -4.397338 8.456140)
     (xy -4.405128 8.457033) (xy -4.468197 8.468777) (xy -4.517103 8.487652) (xy -4.553629 8.515089) (xy -4.579554 8.552517) (xy -4.596660 8.601364) (xy -4.599198 8.612717) (xy -4.609254 8.661400)
     (xy -4.996922 8.661400) (xy -4.991184 8.616950) (xy -4.971187 8.516750) (xy -4.938578 8.427833) (xy -4.893457 8.350308) (xy -4.835924 8.284283) (xy -4.766081 8.229866) (xy -4.684026 8.187167)
     (xy -4.589860 8.156294) (xy -4.559300 8.149361) (xy -4.490005 8.138576) (xy -4.410698 8.131943) (xy -4.327843 8.129716) (xy -4.247908 8.132145) )(layer F.SilkS) (width  0.010000)
  )
  (fp_poly (pts (xy 0.891868 7.592015) (xy 0.941136 7.593804) (xy 0.981589 7.597000) (xy 1.017278 7.601929) (xy 1.052253 7.608919) (xy 1.054603 7.609454) (xy 1.172749 7.644113) (xy 1.280049 7.691223)
     (xy 1.375982 7.750223) (xy 1.460027 7.820551) (xy 1.531661 7.901645) (xy 1.590363 7.992944) (xy 1.635612 8.093885) (xy 1.666885 8.203907) (xy 1.679789 8.282667) (xy 1.684584 8.323034)
     (xy 1.480648 8.320767) (xy 1.276713 8.318500) (xy 1.253665 8.249794) (xy 1.220594 8.169097) (xy 1.179831 8.102800) (xy 1.130177 8.049664) (xy 1.070436 8.008451) (xy 0.999408 7.977923)
     (xy 0.986803 7.973913) (xy 0.936039 7.962925) (xy 0.875655 7.956715) (xy 0.812328 7.955462) (xy 0.752734 7.959345) (xy 0.711200 7.966520) (xy 0.632772 7.994162) (xy 0.559119 8.036560)
     (xy 0.492948 8.091664) (xy 0.436966 8.157425) (xy 0.415516 8.190460) (xy 0.375750 8.271970) (xy 0.344878 8.364988) (xy 0.322949 8.466582) (xy 0.310012 8.573821) (xy 0.306115 8.683774)
     (xy 0.311307 8.793509) (xy 0.325635 8.900096) (xy 0.349149 9.000603) (xy 0.381895 9.092099) (xy 0.400010 9.130233) (xy 0.448434 9.206868) (xy 0.507157 9.270808) (xy 0.575162 9.321280)
     (xy 0.651429 9.357508) (xy 0.724584 9.376995) (xy 0.776295 9.385008) (xy 0.819268 9.388178) (xy 0.860989 9.386510) (xy 0.908943 9.380014) (xy 0.925297 9.377189) (xy 1.009455 9.354630)
     (xy 1.082829 9.319098) (xy 1.145026 9.270989) (xy 1.195656 9.210696) (xy 1.234329 9.138617) (xy 1.260651 9.055145) (xy 1.265000 9.033934) (xy 1.275222 8.978900) (xy 1.693956 8.974370)
     (xy 1.688538 9.018968) (xy 1.667548 9.139736) (xy 1.635141 9.248462) (xy 1.590843 9.346025) (xy 1.534179 9.433307) (xy 1.464675 9.511187) (xy 1.388534 9.575624) (xy 1.295350 9.635281)
     (xy 1.192814 9.682196) (xy 1.079743 9.716851) (xy 1.004308 9.732309) (xy 0.950941 9.738851) (xy 0.886588 9.742770) (xy 0.816666 9.744076) (xy 0.746594 9.742783) (xy 0.681791 9.738900)
     (xy 0.627675 9.732439) (xy 0.622300 9.731517) (xy 0.503232 9.702199) (xy 0.393001 9.658566) (xy 0.292057 9.601011) (xy 0.200847 9.529929) (xy 0.119820 9.445713) (xy 0.049425 9.348756)
     (xy -0.009890 9.239454) (xy -0.049747 9.141452) (xy -0.069489 9.082020) (xy -0.084877 9.026637) (xy -0.096493 8.971577) (xy -0.104917 8.913113) (xy -0.110731 8.847520) (xy -0.114518 8.771072)
     (xy -0.116107 8.716412) (xy -0.117415 8.645211) (xy -0.117545 8.587332) (xy -0.116375 8.539196) (xy -0.113784 8.497223) (xy -0.109649 8.457836) (xy -0.106496 8.434771) (xy -0.079743 8.300038)
     (xy -0.040675 8.174985) (xy 0.010236 8.060255) (xy 0.072519 7.956495) (xy 0.145702 7.864347) (xy 0.229313 7.784456) (xy 0.322879 7.717467) (xy 0.425928 7.664023) (xy 0.471310 7.645995)
     (xy 0.531865 7.625582) (xy 0.588114 7.610626) (xy 0.644589 7.600437) (xy 0.705820 7.594322) (xy 0.776336 7.591591) (xy 0.829734 7.591305) (xy 0.891868 7.592015) )(layer F.SilkS) (width  0.010000)
  )
  (fp_poly (pts (xy 4.395793 8.132096) (xy 4.437574 8.135627) (xy 4.544046 8.152117) (xy 4.636342 8.177118) (xy 4.715180 8.211079) (xy 4.781277 8.254452) (xy 4.835349 8.307686) (xy 4.878115 8.371232)
     (xy 4.904330 8.428898) (xy 4.908268 8.439658) (xy 4.911635 8.450364) (xy 4.914488 8.462400) (xy 4.916884 8.477149) (xy 4.918881 8.495995) (xy 4.920535 8.520320) (xy 4.921905 8.551508)
     (xy 4.923047 8.590941) (xy 4.924018 8.640003) (xy 4.924876 8.700076) (xy 4.925677 8.772545) (xy 4.926480 8.858792) (xy 4.927340 8.960200) (xy 4.927600 8.991600) (xy 4.931833 9.503834)
     (xy 4.954279 9.546167) (xy 4.971200 9.574246) (xy 4.989585 9.599132) (xy 4.998729 9.609026) (xy 5.017004 9.635273) (xy 5.020733 9.657709) (xy 5.020733 9.685867) (xy 4.588685 9.685867)
     (xy 4.571900 9.658350) (xy 4.558823 9.630850) (xy 4.550297 9.602216) (xy 4.550119 9.601200) (xy 4.545410 9.574511) (xy 4.540349 9.558811) (xy 4.532227 9.553973) (xy 4.518339 9.559873)
     (xy 4.495978 9.576386) (xy 4.469766 9.597479) (xy 4.385195 9.657616) (xy 4.299950 9.701506) (xy 4.212273 9.729799) (xy 4.120407 9.743147) (xy 4.073229 9.744428) (xy 4.030590 9.742768)
     (xy 3.987663 9.738959) (xy 3.951786 9.733716) (xy 3.942369 9.731701) (xy 3.864074 9.704371) (xy 3.794064 9.663047) (xy 3.733756 9.609214) (xy 3.684566 9.544357) (xy 3.647908 9.469959)
     (xy 3.628059 9.402234) (xy 3.616085 9.311157) (xy 3.617615 9.255871) (xy 4.018524 9.255871) (xy 4.021350 9.291778) (xy 4.027990 9.318596) (xy 4.029507 9.321800) (xy 4.062094 9.365810)
     (xy 4.106695 9.398247) (xy 4.152900 9.416022) (xy 4.181580 9.419859) (xy 4.220870 9.420307) (xy 4.264874 9.417771) (xy 4.307699 9.412653) (xy 4.343451 9.405360) (xy 4.353514 9.402259)
     (xy 4.408571 9.374195) (xy 4.454352 9.332405) (xy 4.490522 9.277543) (xy 4.516743 9.210265) (xy 4.532677 9.131227) (xy 4.537986 9.043611) (xy 4.537787 9.006709) (xy 4.536637 8.983868)
     (xy 4.533964 8.972216) (xy 4.529192 8.968887) (xy 4.523317 8.970351) (xy 4.495126 8.980219) (xy 4.457027 8.990924) (xy 4.407100 9.002944) (xy 4.343424 9.016753) (xy 4.301083 9.025438)
     (xy 4.228779 9.041176) (xy 4.171161 9.056643) (xy 4.126035 9.072911) (xy 4.091205 9.091050) (xy 4.064478 9.112130) (xy 4.043658 9.137222) (xy 4.031981 9.156700) (xy 4.023934 9.182023)
     (xy 4.019416 9.217183) (xy 4.018524 9.255871) (xy 3.617615 9.255871) (xy 3.618533 9.222728) (xy 3.634929 9.138972) (xy 3.664801 9.061916) (xy 3.707675 8.993588) (xy 3.729478 8.967946)
     (xy 3.772790 8.926892) (xy 3.821408 8.892185) (xy 3.877508 8.862908) (xy 3.943265 8.838143) (xy 4.020857 8.816973) (xy 4.112459 8.798482) (xy 4.144433 8.793087) (xy 4.226691 8.779512)
     (xy 4.294048 8.767728) (xy 4.348375 8.757191) (xy 4.391545 8.747363) (xy 4.425428 8.737700) (xy 4.451896 8.727663) (xy 4.472820 8.716711) (xy 4.490072 8.704302) (xy 4.505523 8.689895)
     (xy 4.507127 8.688233) (xy 4.528350 8.654740) (xy 4.536859 8.615129) (xy 4.533385 8.573574) (xy 4.518660 8.534251) (xy 4.493414 8.501335) (xy 4.471586 8.485284) (xy 4.429104 8.468335)
     (xy 4.375023 8.457426) (xy 4.313759 8.453092) (xy 4.249727 8.455871) (xy 4.239218 8.457048) (xy 4.179724 8.467230) (xy 4.134217 8.482412) (xy 4.100082 8.504262) (xy 4.074701 8.534450)
     (xy 4.055620 8.574212) (xy 4.046090 8.603282) (xy 4.039914 8.629031) (xy 4.038600 8.640551) (xy 4.038600 8.661400) (xy 3.647545 8.661400) (xy 3.653282 8.616950) (xy 3.673163 8.516534)
     (xy 3.705390 8.427707) (xy 3.749974 8.350457) (xy 3.806925 8.284773) (xy 3.876254 8.230644) (xy 3.957972 8.188057) (xy 4.052089 8.157003) (xy 4.085227 8.149417) (xy 4.154225 8.138625)
     (xy 4.233272 8.131974) (xy 4.315939 8.129713) (xy 4.395793 8.132096) )(layer F.SilkS) (width  0.010000)
  )
  (fp_poly (pts (xy 6.019800 8.131065) (xy 6.136793 8.144055) (xy 6.242750 8.169694) (xy 6.338055 8.208130) (xy 6.423092 8.259509) (xy 6.480890 8.307117) (xy 6.548730 8.377862) (xy 6.603644 8.452280)
     (xy 6.647050 8.533135) (xy 6.680364 8.623193) (xy 6.705004 8.725220) (xy 6.710294 8.754825) (xy 6.717597 8.815577) (xy 6.721404 8.885923) (xy 6.721851 8.961204) (xy 6.719074 9.036762)
     (xy 6.713210 9.107938) (xy 6.704394 9.170075) (xy 6.697182 9.203267) (xy 6.661483 9.310298) (xy 6.612999 9.407729) (xy 6.552524 9.494595) (xy 6.480856 9.569931) (xy 6.398791 9.632773)
     (xy 6.307125 9.682155) (xy 6.299200 9.685580) (xy 6.249631 9.705052) (xy 6.203058 9.719407) (xy 6.155151 9.729432) (xy 6.101579 9.735911) (xy 6.038009 9.739630) (xy 5.994400 9.740841)
     (xy 5.945493 9.741545) (xy 5.900805 9.741687) (xy 5.863843 9.741292) (xy 5.838113 9.740389) (xy 5.829300 9.739578) (xy 5.717082 9.714155) (xy 5.615329 9.675507) (xy 5.524325 9.623939)
     (xy 5.444352 9.559757) (xy 5.375695 9.483267) (xy 5.318636 9.394774) (xy 5.273460 9.294584) (xy 5.240449 9.183002) (xy 5.223032 9.086056) (xy 5.217243 9.019179) (xy 5.215861 8.943299)
     (xy 5.217408 8.898467) (xy 5.616430 8.898467) (xy 5.616807 8.993525) (xy 5.628445 9.082747) (xy 5.650584 9.164698) (xy 5.682458 9.237942) (xy 5.723307 9.301040) (xy 5.772366 9.352558)
     (xy 5.828874 9.391059) (xy 5.890552 9.414728) (xy 5.930127 9.420170) (xy 5.978104 9.420167) (xy 6.027533 9.415271) (xy 6.071466 9.406034) (xy 6.092127 9.398713) (xy 6.155210 9.361740)
     (xy 6.209067 9.311193) (xy 6.253169 9.248026) (xy 6.286989 9.173193) (xy 6.309998 9.087648) (xy 6.321669 8.992345) (xy 6.322154 8.983134) (xy 6.322010 8.880819) (xy 6.311044 8.789836)
     (xy 6.288778 8.708108) (xy 6.254734 8.633561) (xy 6.233767 8.599264) (xy 6.187739 8.541322) (xy 6.136276 8.498985) (xy 6.077668 8.471340) (xy 6.010205 8.457474) (xy 5.964409 8.455389)
     (xy 5.898030 8.461475) (xy 5.840136 8.480148) (xy 5.787276 8.512925) (xy 5.744663 8.552025) (xy 5.697295 8.611647) (xy 5.661183 8.680023) (xy 5.635753 8.758710) (xy 5.620427 8.849263)
     (xy 5.616430 8.898467) (xy 5.217408 8.898467) (xy 5.218602 8.863870) (xy 5.225183 8.786347) (xy 5.235321 8.716184) (xy 5.244433 8.674172) (xy 5.280717 8.563927) (xy 5.329212 8.465192)
     (xy 5.389354 8.378362) (xy 5.460582 8.303832) (xy 5.542331 8.241995) (xy 5.634040 8.193245) (xy 5.735145 8.157978) (xy 5.845083 8.136587) (xy 5.963291 8.129467) (xy 6.019800 8.131065) )(layer F.SilkS) (width  0.010000)
  )
  (fp_poly (pts (xy 7.738822 8.138293) (xy 7.837837 8.155742) (xy 7.927486 8.182364) (xy 7.934611 8.185076) (xy 8.020665 8.226494) (xy 8.094979 8.278890) (xy 8.156742 8.341242) (xy 8.205142 8.412528)
     (xy 8.239368 8.491728) (xy 8.258608 8.577820) (xy 8.260537 8.595247) (xy 8.265898 8.652934) (xy 7.882789 8.652934) (xy 7.878395 8.631767) (xy 7.873149 8.606342) (xy 7.869251 8.587317)
     (xy 7.861487 8.565181) (xy 7.848140 8.539296) (xy 7.844283 8.533117) (xy 7.815381 8.502708) (xy 7.774602 8.478636) (xy 7.725012 8.460984) (xy 7.669674 8.449836) (xy 7.611654 8.445276)
     (xy 7.554017 8.447388) (xy 7.499828 8.456254) (xy 7.452151 8.471959) (xy 7.414051 8.494586) (xy 7.390604 8.520739) (xy 7.378079 8.552460) (xy 7.374394 8.587816) (xy 7.379490 8.620568)
     (xy 7.391767 8.642910) (xy 7.399657 8.650599) (xy 7.409280 8.657828) (xy 7.422203 8.665146) (xy 7.439996 8.673098) (xy 7.464227 8.682233) (xy 7.496465 8.693098) (xy 7.538279 8.706240)
     (xy 7.591239 8.722207) (xy 7.656911 8.741545) (xy 7.736866 8.764803) (xy 7.762055 8.772100) (xy 7.831777 8.792600) (xy 7.898458 8.812795) (xy 7.959809 8.831948) (xy 8.013542 8.849322)
     (xy 8.057367 8.864179) (xy 8.088996 8.875784) (xy 8.103909 8.882194) (xy 8.170442 8.924783) (xy 8.224921 8.978747) (xy 8.266310 9.042742) (xy 8.293572 9.115425) (xy 8.297828 9.133675)
     (xy 8.303877 9.184812) (xy 8.303874 9.244651) (xy 8.298303 9.306272) (xy 8.287645 9.362757) (xy 8.280069 9.388331) (xy 8.261540 9.431024) (xy 8.234975 9.479056) (xy 8.204042 9.526649)
     (xy 8.172409 9.568026) (xy 8.151950 9.590070) (xy 8.100139 9.630569) (xy 8.034679 9.667031) (xy 7.958636 9.698116) (xy 7.875078 9.722484) (xy 7.825251 9.732855) (xy 7.787873 9.737512)
     (xy 7.737967 9.740882) (xy 7.679894 9.742929) (xy 7.618015 9.743620) (xy 7.556688 9.742919) (xy 7.500275 9.740790) (xy 7.453134 9.737200) (xy 7.442200 9.735929) (xy 7.331032 9.715575)
     (xy 7.232647 9.684741) (xy 7.147231 9.643569) (xy 7.074969 9.592203) (xy 7.016047 9.530785) (xy 6.970651 9.459457) (xy 6.938965 9.378363) (xy 6.929959 9.342225) (xy 6.923608 9.309036)
     (xy 6.919086 9.279294) (xy 6.917414 9.260261) (xy 6.917267 9.236821) (xy 7.113235 9.239094) (xy 7.309202 9.241367) (xy 7.320531 9.280236) (xy 7.333075 9.309280) (xy 7.352878 9.341157)
     (xy 7.366551 9.358516) (xy 7.390807 9.382536) (xy 7.417385 9.400518) (xy 7.449083 9.413237) (xy 7.488702 9.421469) (xy 7.539041 9.425992) (xy 7.602899 9.427580) (xy 7.615767 9.427614)
     (xy 7.684769 9.426059) (xy 7.740046 9.420875) (xy 7.784557 9.411323) (xy 7.821262 9.396664) (xy 7.853119 9.376158) (xy 7.866485 9.364985) (xy 7.894818 9.330593) (xy 7.907195 9.294121)
     (xy 7.903965 9.258053) (xy 7.885478 9.224872) (xy 7.852084 9.197064) (xy 7.842055 9.191549) (xy 7.824705 9.184330) (xy 7.793307 9.172890) (xy 7.750014 9.157950) (xy 7.696974 9.140227)
     (xy 7.636337 9.120443) (xy 7.570255 9.099316) (xy 7.509934 9.080382) (xy 7.424003 9.053554) (xy 7.352564 9.030970) (xy 7.293903 9.011962) (xy 7.246306 8.995864) (xy 7.208058 8.982008)
     (xy 7.177447 8.969728) (xy 7.152758 8.958357) (xy 7.132277 8.947227) (xy 7.114290 8.935672) (xy 7.097083 8.923025) (xy 7.088729 8.916475) (xy 7.044135 8.870608) (xy 7.009520 8.813217)
     (xy 6.985477 8.746871) (xy 6.972600 8.674141) (xy 6.971482 8.597596) (xy 6.982716 8.519807) (xy 6.990349 8.490451) (xy 7.021680 8.413219) (xy 7.067657 8.342883) (xy 7.126973 8.280662)
     (xy 7.198320 8.227776) (xy 7.280389 8.185444) (xy 7.340877 8.163546) (xy 7.431469 8.142642) (xy 7.531049 8.131577) (xy 7.635030 8.130182) (xy 7.738822 8.138293) )(layer F.SilkS) (width  0.010000)
  )
  (fp_poly (pts (xy -6.874933 7.975600) (xy -7.476067 7.975600) (xy -7.476067 9.685867) (xy -7.899400 9.685867) (xy -7.899400 7.975600) (xy -8.525933 7.975600) (xy -8.525933 7.620000) (xy -6.874933 7.620000)
     (xy -6.874933 7.975600) )(layer F.SilkS) (width  0.010000)
  )
  (fp_poly (pts (xy -2.487010 8.131717) (xy -2.424129 8.141768) (xy -2.364213 8.156886) (xy -2.314125 8.175663) (xy -2.313536 8.175940) (xy -2.275436 8.198469) (xy -2.234160 8.230083) (xy -2.195113 8.266054)
     (xy -2.163699 8.301651) (xy -2.153896 8.315645) (xy -2.133893 8.347333) (xy -2.071925 8.286164) (xy -2.001588 8.226056) (xy -1.927160 8.181399) (xy -1.846326 8.151177) (xy -1.756774 8.134376)
     (xy -1.718733 8.131228) (xy -1.622663 8.132476) (xy -1.533500 8.147091) (xy -1.452473 8.174483) (xy -1.380814 8.214063) (xy -1.319753 8.265240) (xy -1.270520 8.327424) (xy -1.255395 8.353392)
     (xy -1.245596 8.372007) (xy -1.237089 8.389312) (xy -1.229783 8.406596) (xy -1.223586 8.425150) (xy -1.218406 8.446265) (xy -1.214152 8.471231) (xy -1.210732 8.501338) (xy -1.208054 8.537877)
     (xy -1.206027 8.582138) (xy -1.204558 8.635411) (xy -1.203557 8.698987) (xy -1.202932 8.774156) (xy -1.202592 8.862209) (xy -1.202443 8.964436) (xy -1.202395 9.082128) (xy -1.202392 9.099706)
     (xy -1.202266 9.686179) (xy -1.399116 9.683906) (xy -1.595966 9.681634) (xy -1.600200 9.139767) (xy -1.601051 9.027871) (xy -1.601811 8.931622) (xy -1.602612 8.849736) (xy -1.603580 8.780929)
     (xy -1.604846 8.723915) (xy -1.606539 8.677411) (xy -1.608788 8.640132) (xy -1.611721 8.610793) (xy -1.615469 8.588109) (xy -1.620160 8.570797) (xy -1.625923 8.557572) (xy -1.632888 8.547149)
     (xy -1.641183 8.538243) (xy -1.650938 8.529571) (xy -1.662282 8.519848) (xy -1.662541 8.519620) (xy -1.698640 8.494385) (xy -1.740003 8.479024) (xy -1.790751 8.472288) (xy -1.820333 8.471757)
     (xy -1.888647 8.479341) (xy -1.946908 8.500495) (xy -1.994873 8.534985) (xy -2.032296 8.582578) (xy -2.058932 8.643040) (xy -2.074303 8.714306) (xy -2.075837 8.734539) (xy -2.077284 8.769869)
     (xy -2.078614 8.818459) (xy -2.079799 8.878474) (xy -2.080809 8.948078) (xy -2.081614 9.025433) (xy -2.082186 9.108704) (xy -2.082495 9.196055) (xy -2.082538 9.230940) (xy -2.082800 9.686179)
     (xy -2.279650 9.683906) (xy -2.476500 9.681634) (xy -2.480733 9.139767) (xy -2.481584 9.027871) (xy -2.482345 8.931622) (xy -2.483145 8.849736) (xy -2.484113 8.780929) (xy -2.485380 8.723915)
     (xy -2.487072 8.677411) (xy -2.489321 8.640132) (xy -2.492255 8.610793) (xy -2.496002 8.588109) (xy -2.500693 8.570797) (xy -2.506456 8.557572) (xy -2.513421 8.547149) (xy -2.521716 8.538243)
     (xy -2.531471 8.529571) (xy -2.542815 8.519848) (xy -2.543074 8.519620) (xy -2.579214 8.494362) (xy -2.620606 8.479015) (xy -2.671370 8.472333) (xy -2.700866 8.471843) (xy -2.769050 8.479751)
     (xy -2.827871 8.501710) (xy -2.877021 8.537513) (xy -2.916193 8.586952) (xy -2.938681 8.632454) (xy -2.958649 8.682567) (xy -2.964523 9.685867) (xy -3.157250 9.685867) (xy -3.212746 9.685629)
     (xy -3.262485 9.684962) (xy -3.303996 9.683937) (xy -3.334810 9.682623) (xy -3.352458 9.681091) (xy -3.355622 9.680222) (xy -3.356453 9.671111) (xy -3.357247 9.646273) (xy -3.357995 9.606918)
     (xy -3.358689 9.554254) (xy -3.359319 9.489487) (xy -3.359877 9.413825) (xy -3.360353 9.328478) (xy -3.360739 9.234651) (xy -3.361026 9.133554) (xy -3.361205 9.026394) (xy -3.361266 8.914379)
     (xy -3.361267 8.913989) (xy -3.361267 8.153400) (xy -2.963333 8.153400) (xy -2.963353 8.244417) (xy -2.963372 8.335434) (xy -2.900339 8.275355) (xy -2.826548 8.214805) (xy -2.748922 8.170530)
     (xy -2.666449 8.142110) (xy -2.578114 8.129124) (xy -2.545993 8.128147) (xy -2.487010 8.131717) )(layer F.SilkS) (width  0.010000)
  )
  (fp_poly (pts (xy 2.379133 8.368925) (xy 2.406245 8.335246) (xy 2.473553 8.264098) (xy 2.548744 8.207600) (xy 2.630897 8.166167) (xy 2.719089 8.140215) (xy 2.812396 8.130159) (xy 2.859552 8.131151)
     (xy 2.949973 8.143594) (xy 3.033738 8.168687) (xy 3.109151 8.205417) (xy 3.174515 8.252770) (xy 3.228133 8.309731) (xy 3.268307 8.375288) (xy 3.268326 8.375328) (xy 3.278646 8.397416)
     (xy 3.287583 8.417872) (xy 3.295236 8.438044) (xy 3.301704 8.459282) (xy 3.307088 8.482933) (xy 3.311487 8.510348) (xy 3.315001 8.542875) (xy 3.317728 8.581864) (xy 3.319768 8.628662)
     (xy 3.321222 8.684619) (xy 3.322188 8.751085) (xy 3.322766 8.829407) (xy 3.323055 8.920935) (xy 3.323156 9.027019) (xy 3.323167 9.118600) (xy 3.323167 9.681634) (xy 2.925233 9.681634)
     (xy 2.921000 9.156700) (xy 2.920128 9.046305) (xy 2.919336 8.951510) (xy 2.918488 8.870980) (xy 2.917449 8.803384) (xy 2.916081 8.747388) (xy 2.914251 8.701660) (xy 2.911822 8.664866)
     (xy 2.908658 8.635674) (xy 2.904623 8.612751) (xy 2.899583 8.594763) (xy 2.893401 8.580379) (xy 2.885941 8.568264) (xy 2.877069 8.557087) (xy 2.866647 8.545514) (xy 2.857785 8.535830)
     (xy 2.821614 8.504236) (xy 2.778953 8.483850) (xy 2.726778 8.473586) (xy 2.679700 8.471876) (xy 2.605882 8.480097) (xy 2.540632 8.502120) (xy 2.485078 8.537031) (xy 2.440348 8.583921)
     (xy 2.407569 8.641876) (xy 2.388333 8.707405) (xy 2.386071 8.728925) (xy 2.384108 8.766781) (xy 2.382455 8.820380) (xy 2.381122 8.889127) (xy 2.380121 8.972429) (xy 2.379462 9.069691)
     (xy 2.379156 9.180318) (xy 2.379133 9.221755) (xy 2.379133 9.685867) (xy 2.185811 9.685867) (xy 2.130227 9.685630) (xy 2.080398 9.684965) (xy 2.038790 9.683942) (xy 2.007867 9.682632)
     (xy 1.990095 9.681104) (xy 1.986845 9.680222) (xy 1.986128 9.671200) (xy 1.985437 9.646282) (xy 1.984779 9.606503) (xy 1.984158 9.552900) (xy 1.983581 9.486511) (xy 1.983052 9.408372)
     (xy 1.982579 9.319519) (xy 1.982165 9.220989) (xy 1.981818 9.113818) (xy 1.981542 8.999044) (xy 1.981344 8.877702) (xy 1.981229 8.750830) (xy 1.981200 8.647289) (xy 1.981200 7.620000)
     (xy 2.379133 7.620000) (xy 2.379133 8.368925) )(layer F.SilkS) (width  0.010000)
  )
  (fp_poly (pts (xy -2.754584 -9.731251) (xy -2.669681 -9.712213) (xy -2.591328 -9.678487) (xy -2.520766 -9.630949) (xy -2.459237 -9.570472) (xy -2.407982 -9.497933) (xy -2.368244 -9.414207) (xy -2.360966 -9.393766)
     (xy -2.359898 -9.388235) (xy -2.358887 -9.377866) (xy -2.357932 -9.362166) (xy -2.357029 -9.340645) (xy -2.356177 -9.312811) (xy -2.355373 -9.278172) (xy -2.354613 -9.236238) (xy -2.353895 -9.186515)
     (xy -2.353217 -9.128514) (xy -2.352576 -9.061742) (xy -2.351969 -8.985709) (xy -2.351394 -8.899921) (xy -2.350847 -8.803889) (xy -2.350327 -8.697120) (xy -2.349830 -8.579123) (xy -2.349354 -8.449407)
     (xy -2.348896 -8.307479) (xy -2.348454 -8.152849) (xy -2.348025 -7.985025) (xy -2.347606 -7.803516) (xy -2.347194 -7.607829) (xy -2.346787 -7.397474) (xy -2.346383 -7.171959) (xy -2.345978 -6.930793)
     (xy -2.345570 -6.673483) (xy -2.345319 -6.508954) (xy -2.341033 -3.658009) (xy -1.825362 -4.904521) (xy -1.767412 -5.044532) (xy -1.710782 -5.181220) (xy -1.655851 -5.313673) (xy -1.602998 -5.440983)
     (xy -1.552605 -5.562240) (xy -1.505049 -5.676533) (xy -1.460711 -5.782952) (xy -1.419969 -5.880588) (xy -1.383205 -5.968531) (xy -1.350796 -6.045871) (xy -1.323123 -6.111698) (xy -1.300565 -6.165102)
     (xy -1.283502 -6.205173) (xy -1.272313 -6.231002) (xy -1.268807 -6.238794) (xy -1.247349 -6.282648) (xy -1.227913 -6.316045) (xy -1.206761 -6.344451) (xy -1.180155 -6.373335) (xy -1.169722 -6.383725)
     (xy -1.102451 -6.440068) (xy -1.030534 -6.480811) (xy -0.952196 -6.506670) (xy -0.865660 -6.518357) (xy -0.832742 -6.519233) (xy -0.753343 -6.513742) (xy -0.681837 -6.496113) (xy -0.613022 -6.464944)
     (xy -0.596900 -6.455635) (xy -0.528376 -6.405321) (xy -0.470532 -6.344035) (xy -0.424400 -6.274070) (xy -0.391014 -6.197722) (xy -0.371407 -6.117285) (xy -0.366613 -6.035054) (xy -0.375351 -5.963567)
     (xy -0.380592 -5.946581) (xy -0.392370 -5.914143) (xy -0.410624 -5.866399) (xy -0.435298 -5.803494) (xy -0.466331 -5.725573) (xy -0.503666 -5.632781) (xy -0.547243 -5.525263) (xy -0.597003 -5.403163)
     (xy -0.652889 -5.266628) (xy -0.714840 -5.115802) (xy -0.782799 -4.950830) (xy -0.856706 -4.771858) (xy -0.926453 -4.603295) (xy -0.985007 -4.461860) (xy -1.041783 -4.324639) (xy -1.096444 -4.192449)
     (xy -1.148652 -4.066109) (xy -1.198072 -3.946436) (xy -1.244365 -3.834250) (xy -1.287195 -3.730367) (xy -1.326225 -3.635606) (xy -1.361118 -3.550786) (xy -1.391538 -3.476724) (xy -1.417146 -3.414238)
     (xy -1.437606 -3.364146) (xy -1.452582 -3.327267) (xy -1.461735 -3.304419) (xy -1.464733 -3.296436) (xy -1.458820 -3.301805) (xy -1.441373 -3.318715) (xy -1.412828 -3.346731) (xy -1.373623 -3.385416)
     (xy -1.324195 -3.434336) (xy -1.264980 -3.493056) (xy -1.196415 -3.561140) (xy -1.118938 -3.638153) (xy -1.032986 -3.723659) (xy -0.938995 -3.817224) (xy -0.837403 -3.918412) (xy -0.728646 -4.026788)
     (xy -0.613162 -4.141916) (xy -0.491387 -4.263361) (xy -0.363759 -4.390689) (xy -0.230714 -4.523463) (xy -0.092690 -4.661248) (xy 0.049877 -4.803609) (xy 0.196549 -4.950111) (xy 0.346890 -5.100319)
     (xy 0.500462 -5.253797) (xy 0.548217 -5.301531) (xy 0.734278 -5.487505) (xy 0.908751 -5.661869) (xy 1.072013 -5.824995) (xy 1.224441 -5.977256) (xy 1.366413 -6.119022) (xy 1.498305 -6.250667)
     (xy 1.620494 -6.372562) (xy 1.733357 -6.485080) (xy 1.837272 -6.588592) (xy 1.932615 -6.683472) (xy 2.019764 -6.770091) (xy 2.099094 -6.848821) (xy 2.170985 -6.920034) (xy 2.235812 -6.984104)
     (xy 2.293952 -7.041401) (xy 2.345783 -7.092298) (xy 2.391681 -7.137167) (xy 2.432024 -7.176381) (xy 2.467188 -7.210311) (xy 2.497551 -7.239329) (xy 2.523490 -7.263809) (xy 2.545381 -7.284121)
     (xy 2.563602 -7.300639) (xy 2.578530 -7.313734) (xy 2.590541 -7.323778) (xy 2.600013 -7.331144) (xy 2.607323 -7.336204) (xy 2.612409 -7.339115) (xy 2.700163 -7.374242) (xy 2.787876 -7.392674)
     (xy 2.874931 -7.394399) (xy 2.960706 -7.379402) (xy 3.043968 -7.347970) (xy 3.095760 -7.316719) (xy 3.148204 -7.274206) (xy 3.196784 -7.224872) (xy 3.236984 -7.173163) (xy 3.257984 -7.137400)
     (xy 3.289804 -7.054761) (xy 3.305681 -6.969050) (xy 3.305730 -6.882468) (xy 3.290065 -6.797215) (xy 3.258799 -6.715494) (xy 3.233905 -6.671122) (xy 3.227638 -6.662917) (xy 3.215578 -6.649047)
     (xy 3.197437 -6.629224) (xy 3.172927 -6.603157) (xy 3.141759 -6.570555) (xy 3.103646 -6.531128) (xy 3.058300 -6.484586) (xy 3.005433 -6.430639) (xy 2.944756 -6.368997) (xy 2.875983 -6.299369)
     (xy 2.798824 -6.221466) (xy 2.712992 -6.134996) (xy 2.618198 -6.039669) (xy 2.514156 -5.935196) (xy 2.400576 -5.821287) (xy 2.277172 -5.697650) (xy 2.143654 -5.563995) (xy 1.999735 -5.420033)
     (xy 1.845127 -5.265474) (xy 1.679542 -5.100026) (xy 1.502692 -4.923400) (xy 1.314289 -4.735305) (xy 1.195430 -4.616670) (xy -0.808566 -2.616640) (xy -0.702733 -2.659708) (xy -0.682842 -2.667859)
     (xy -0.648253 -2.682100) (xy -0.599910 -2.702041) (xy -0.538758 -2.727290) (xy -0.465743 -2.757457) (xy -0.381810 -2.792150) (xy -0.287903 -2.830980) (xy -0.184969 -2.873555) (xy -0.073952 -2.919484)
     (xy 0.044202 -2.968376) (xy 0.168549 -3.019840) (xy 0.298143 -3.073487) (xy 0.432040 -3.128923) (xy 0.569294 -3.185760) (xy 0.608561 -3.202022) (xy 0.766682 -3.267434) (xy 0.916814 -3.329393)
     (xy 1.058343 -3.387649) (xy 1.190655 -3.441954) (xy 1.313137 -3.492060) (xy 1.425175 -3.537717) (xy 1.526155 -3.578677) (xy 1.615462 -3.614691) (xy 1.692485 -3.645511) (xy 1.756607 -3.670888)
     (xy 1.807217 -3.690573) (xy 1.843700 -3.704317) (xy 1.865441 -3.711872) (xy 1.870094 -3.713154) (xy 1.955107 -3.723480) (xy 2.037770 -3.717553) (xy 2.119662 -3.695156) (xy 2.173987 -3.671280)
     (xy 2.249245 -3.624310) (xy 2.312812 -3.565797) (xy 2.363741 -3.497286) (xy 2.401087 -3.420324) (xy 2.423902 -3.336454) (xy 2.431257 -3.251200) (xy 2.426200 -3.173528) (xy 2.409923 -3.103753)
     (xy 2.380767 -3.035794) (xy 2.364541 -3.006768) (xy 2.326837 -2.954211) (xy 2.279071 -2.904182) (xy 2.226476 -2.861649) (xy 2.185568 -2.836923) (xy 2.172800 -2.831035) (xy 2.148072 -2.820237)
     (xy 2.111169 -2.804441) (xy 2.061874 -2.783554) (xy 1.999969 -2.757488) (xy 1.925239 -2.726152) (xy 1.837465 -2.689456) (xy 1.736432 -2.647309) (xy 1.621923 -2.599621) (xy 1.493720 -2.546303)
     (xy 1.351607 -2.487263) (xy 1.195368 -2.422412) (xy 1.024784 -2.351660) (xy 0.839640 -2.274915) (xy 0.639719 -2.192089) (xy 0.424803 -2.103090) (xy 0.194677 -2.007828) (xy -0.050877 -1.906214)
     (xy -0.065909 -1.899995) (xy -0.432385 -1.748367) (xy 5.242691 -1.744133) (xy 10.917767 -1.739900) (xy 10.977897 -1.717901) (xy 11.059720 -1.679502) (xy 11.131072 -1.628747) (xy 11.190896 -1.567132)
     (xy 11.238134 -1.496154) (xy 11.271728 -1.417307) (xy 11.290622 -1.332090) (xy 11.294534 -1.270000) (xy 11.286362 -1.184092) (xy 11.262715 -1.102270) (xy 11.224889 -1.026313) (xy 11.174182 -0.957995)
     (xy 11.111894 -0.899093) (xy 11.039323 -0.851384) (xy 10.964944 -0.819025) (xy 10.909300 -0.800100) (xy 5.242426 -0.795866) (xy -0.424448 -0.791633) (xy 0.234393 -0.518929) (xy 0.343940 -0.473583)
     (xy 0.455821 -0.427269) (xy 0.568058 -0.380804) (xy 0.678674 -0.335008) (xy 0.785691 -0.290699) (xy 0.887130 -0.248696) (xy 0.981016 -0.209818) (xy 1.065369 -0.174883) (xy 1.138213 -0.144712)
     (xy 1.197569 -0.120122) (xy 1.202267 -0.118175) (xy 1.287134 -0.083018) (xy 1.382972 -0.043328) (xy 1.485104 -0.001041) (xy 1.588853 0.041907) (xy 1.689542 0.083578) (xy 1.782493 0.122037)
     (xy 1.828800 0.141192) (xy 1.899891 0.170729) (xy 1.967791 0.199196) (xy 2.030512 0.225739) (xy 2.086064 0.249507) (xy 2.132459 0.269646) (xy 2.167707 0.285305) (xy 2.189820 0.295631)
     (xy 2.193320 0.297415) (xy 2.257559 0.340548) (xy 2.315025 0.397281) (xy 2.363529 0.464913) (xy 2.400885 0.540744) (xy 2.409437 0.564227) (xy 2.425917 0.632878) (xy 2.432380 0.706827)
     (xy 2.428628 0.779536) (xy 2.417575 0.834393) (xy 2.385722 0.915337) (xy 2.339960 0.988784) (xy 2.282165 1.052886) (xy 2.214210 1.105797) (xy 2.137972 1.145670) (xy 2.082736 1.164291)
     (xy 2.042577 1.171482) (xy 1.992547 1.175440) (xy 1.939417 1.176060) (xy 1.889956 1.173236) (xy 1.854883 1.167828) (xy 1.848928 1.166095) (xy 1.838981 1.162657) (xy 1.824522 1.157303)
     (xy 1.805035 1.149818) (xy 1.780002 1.139992) (xy 1.748906 1.127610) (xy 1.711228 1.112460) (xy 1.666451 1.094330) (xy 1.614058 1.073007) (xy 1.553531 1.048277) (xy 1.484353 1.019929)
     (xy 1.406005 0.987750) (xy 1.317970 0.951527) (xy 1.219730 0.911047) (xy 1.110769 0.866098) (xy 0.990567 0.816466) (xy 0.858608 0.761940) (xy 0.714375 0.702306) (xy 0.557348 0.637352)
     (xy 0.387012 0.566865) (xy 0.202847 0.490632) (xy 0.004338 0.408442) (xy -0.209035 0.320080) (xy -0.321733 0.273404) (xy -0.394466 0.243283) (xy -0.465468 0.213886) (xy -0.532491 0.186143)
     (xy -0.593289 0.160984) (xy -0.645613 0.139339) (xy -0.687218 0.122138) (xy -0.715855 0.110310) (xy -0.719666 0.108738) (xy -0.800100 0.075575) (xy 1.211921 2.088838) (xy 3.223943 4.102100)
     (xy 3.258895 4.174067) (xy 3.291762 4.258781) (xy 3.307728 4.343025) (xy 3.306792 4.427183) (xy 3.288953 4.511638) (xy 3.258747 4.587600) (xy 3.212882 4.663533) (xy 3.154696 4.728343)
     (xy 3.085467 4.781000) (xy 3.006470 4.820474) (xy 2.946406 4.839620) (xy 2.869891 4.850850) (xy 2.789033 4.848421) (xy 2.708320 4.833122) (xy 2.632239 4.805743) (xy 2.575896 4.774456)
     (xy 2.566866 4.766454) (xy 2.546316 4.746920) (xy 2.514697 4.716301) (xy 2.472457 4.675042) (xy 2.420046 4.623589) (xy 2.357914 4.562390) (xy 2.286509 4.491890) (xy 2.206283 4.412536)
     (xy 2.117683 4.324773) (xy 2.021160 4.229049) (xy 1.917163 4.125809) (xy 1.806142 4.015500) (xy 1.688545 3.898567) (xy 1.564824 3.775458) (xy 1.435426 3.646619) (xy 1.300803 3.512495)
     (xy 1.161402 3.373534) (xy 1.017674 3.230181) (xy 0.870068 3.082883) (xy 0.719034 2.932085) (xy 0.565021 2.778235) (xy 0.530986 2.744226) (xy 0.342628 2.556017) (xy 0.165896 2.379467)
     (xy 0.000456 2.214245) (xy -0.154026 2.060021) (xy -0.297883 1.916466) (xy -0.431449 1.783250) (xy -0.555057 1.660043) (xy -0.669041 1.546515) (xy -0.773735 1.442337) (xy -0.869472 1.347179)
     (xy -0.956587 1.260711) (xy -1.035412 1.182603) (xy -1.106281 1.112526) (xy -1.169529 1.050149) (xy -1.225488 0.995143) (xy -1.274492 0.947178) (xy -1.316875 0.905924) (xy -1.352971 0.871052)
     (xy -1.383113 0.842232) (xy -1.407635 0.819133) (xy -1.426870 0.801426) (xy -1.441153 0.788782) (xy -1.450816 0.780871) (xy -1.456194 0.777362) (xy -1.457620 0.777926) (xy -1.457287 0.778934)
     (xy -1.449436 0.797414) (xy -1.435759 0.830030) (xy -1.416675 0.875770) (xy -1.392601 0.933620) (xy -1.363956 1.002568) (xy -1.331159 1.081601) (xy -1.294628 1.169707) (xy -1.254781 1.265873)
     (xy -1.212037 1.369086) (xy -1.166814 1.478334) (xy -1.119531 1.592605) (xy -1.070605 1.710885) (xy -1.020456 1.832162) (xy -0.969501 1.955424) (xy -0.918160 2.079658) (xy -0.866850 2.203851)
     (xy -0.815989 2.326991) (xy -0.765997 2.448064) (xy -0.717292 2.566059) (xy -0.670292 2.679963) (xy -0.625415 2.788764) (xy -0.583079 2.891448) (xy -0.543704 2.987003) (xy -0.507708 3.074416)
     (xy -0.475508 3.152675) (xy -0.447524 3.220768) (xy -0.424174 3.277681) (xy -0.405876 3.322403) (xy -0.393048 3.353919) (xy -0.386109 3.371219) (xy -0.385063 3.373967) (xy -0.374135 3.420519)
     (xy -0.369035 3.477109) (xy -0.369712 3.537895) (xy -0.376114 3.597036) (xy -0.387456 3.646385) (xy -0.421070 3.726737) (xy -0.467634 3.797875) (xy -0.525315 3.858751) (xy -0.592279 3.908318)
     (xy -0.666694 3.945529) (xy -0.746725 3.969335) (xy -0.830541 3.978689) (xy -0.916307 3.972545) (xy -0.947393 3.966317) (xy -1.019623 3.941854) (xy -1.089399 3.904326) (xy -1.153178 3.856414)
     (xy -1.207414 3.800799) (xy -1.248563 3.740161) (xy -1.250010 3.737436) (xy -1.256109 3.724168) (xy -1.268311 3.696109) (xy -1.286256 3.654119) (xy -1.309584 3.599058) (xy -1.337936 3.531786)
     (xy -1.370953 3.453164) (xy -1.408274 3.364051) (xy -1.449540 3.265309) (xy -1.494391 3.157797) (xy -1.542469 3.042376) (xy -1.593412 2.919905) (xy -1.646863 2.791246) (xy -1.702461 2.657258)
     (xy -1.759846 2.518802) (xy -1.808682 2.400849) (xy -2.341033 1.114464) (xy -2.345266 3.967182) (xy -2.349500 6.819900) (xy -2.368343 6.869308) (xy -2.407369 6.953031) (xy -2.456189 7.023879)
     (xy -2.516288 7.083735) (xy -2.566996 7.120835) (xy -2.637931 7.157354) (xy -2.716795 7.181744) (xy -2.799086 7.193203) (xy -2.880305 7.190928) (xy -2.921000 7.183965) (xy -3.003726 7.156758)
     (xy -3.079125 7.114850) (xy -3.146079 7.059294) (xy -3.203471 6.991144) (xy -3.250183 6.911453) (xy -3.275870 6.849533) (xy -3.277109 6.844915) (xy -3.278275 6.837950) (xy -3.279370 6.828110)
     (xy -3.280397 6.814864) (xy -3.281361 6.797680) (xy -3.282264 6.776027) (xy -3.283110 6.749376) (xy -3.283901 6.717195) (xy -3.284641 6.678953) (xy -3.285333 6.634121) (xy -3.285981 6.582166)
     (xy -3.286588 6.522559) (xy -3.287157 6.454768) (xy -3.287691 6.378263) (xy -3.288193 6.292513) (xy -3.288668 6.196987) (xy -3.289117 6.091155) (xy -3.289545 5.974485) (xy -3.289954 5.846448)
     (xy -3.290347 5.706511) (xy -3.290729 5.554146) (xy -3.291102 5.388820) (xy -3.291470 5.210002) (xy -3.291835 5.017163) (xy -3.292202 4.809772) (xy -3.292572 4.587297) (xy -3.292950 4.349208)
     (xy -3.293339 4.094975) (xy -3.293533 3.965521) (xy -3.297767 1.119608) (xy -3.834635 2.416121) (xy -3.902006 2.578653) (xy -3.966311 2.733453) (xy -4.027292 2.879912) (xy -4.084690 3.017418)
     (xy -4.138247 3.145360) (xy -4.187705 3.263126) (xy -4.232805 3.370105) (xy -4.273290 3.465688) (xy -4.308902 3.549261) (xy -4.339381 3.620216) (xy -4.364471 3.677939) (xy -4.383912 3.721821)
     (xy -4.397447 3.751249) (xy -4.404776 3.765548) (xy -4.456192 3.831717) (xy -4.520044 3.887672) (xy -4.594274 3.931955) (xy -4.676822 3.963105) (xy -4.687522 3.965977) (xy -4.771146 3.979130)
     (xy -4.853875 3.976413) (xy -4.933960 3.958867) (xy -5.009652 3.927536) (xy -5.079205 3.883461) (xy -5.140868 3.827684) (xy -5.192894 3.761247) (xy -5.233533 3.685192) (xy -5.253766 3.628533)
     (xy -5.262167 3.586416) (xy -5.266770 3.535055) (xy -5.267467 3.481024) (xy -5.264150 3.430894) (xy -5.257629 3.394497) (xy -5.253327 3.382689) (xy -5.242879 3.356089) (xy -5.226631 3.315547)
     (xy -5.204933 3.261909) (xy -5.178131 3.196024) (xy -5.146574 3.118738) (xy -5.110609 3.030901) (xy -5.070584 2.933358) (xy -5.026846 2.826959) (xy -4.979745 2.712551) (xy -4.929626 2.590981)
     (xy -4.876839 2.463097) (xy -4.821731 2.329746) (xy -4.764649 2.191778) (xy -4.714310 2.070232) (xy -4.655895 1.929243) (xy -4.599171 1.792319) (xy -4.544485 1.660294) (xy -4.492182 1.534003)
     (xy -4.442606 1.414280) (xy -4.396103 1.301959) (xy -4.353019 1.197875) (xy -4.313699 1.102861) (xy -4.278488 1.017753) (xy -4.247731 0.943384) (xy -4.221773 0.880588) (xy -4.200960 0.830201)
     (xy -4.185637 0.793056) (xy -4.176150 0.769988) (xy -4.172904 0.762000) (xy -4.178190 0.766281) (xy -4.195011 0.782109) (xy -4.222933 0.809053) (xy -4.261522 0.846683) (xy -4.310345 0.894567)
     (xy -4.368966 0.952275) (xy -4.436952 1.019375) (xy -4.513870 1.095437) (xy -4.599284 1.180030) (xy -4.692762 1.272722) (xy -4.793868 1.373084) (xy -4.902169 1.480683) (xy -5.017230 1.595090)
     (xy -5.138619 1.715873) (xy -5.265900 1.842601) (xy -5.398640 1.974844) (xy -5.536405 2.112170) (xy -5.678760 2.254148) (xy -5.825271 2.400349) (xy -5.975505 2.550340) (xy -6.129028 2.703691)
     (xy -6.182383 2.757004) (xy -6.367494 2.941978) (xy -6.541019 3.115355) (xy -6.703342 3.277514) (xy -6.854847 3.428834) (xy -6.995920 3.569694) (xy -7.126944 3.700474) (xy -7.248306 3.821551)
     (xy -7.360388 3.933306) (xy -7.463577 4.036117) (xy -7.558256 4.130363) (xy -7.644810 4.216423) (xy -7.723624 4.294677) (xy -7.795083 4.365503) (xy -7.859571 4.429281) (xy -7.917472 4.486389)
     (xy -7.969172 4.537207) (xy -8.015056 4.582113) (xy -8.055507 4.621487) (xy -8.090910 4.655707) (xy -8.121650 4.685154) (xy -8.148112 4.710204) (xy -8.170681 4.731239) (xy -8.189740 4.748637)
     (xy -8.205675 4.762776) (xy -8.218871 4.774036) (xy -8.229711 4.782796) (xy -8.238581 4.789435) (xy -8.245865 4.794332) (xy -8.251948 4.797866) (xy -8.255000 4.799404) (xy -8.341546 4.832078)
     (xy -8.428554 4.848621) (xy -8.514425 4.849471) (xy -8.597564 4.835065) (xy -8.676371 4.805843) (xy -8.749251 4.762241) (xy -8.814605 4.704699) (xy -8.870836 4.633655) (xy -8.873352 4.629798)
     (xy -8.907524 4.567825) (xy -8.929460 4.504677) (xy -8.940561 4.435334) (xy -8.942636 4.381500) (xy -8.938273 4.305711) (xy -8.924177 4.239345) (xy -8.898842 4.177024) (xy -8.872467 4.131123)
     (xy -8.865909 4.122627) (xy -8.853089 4.107981) (xy -8.833734 4.086911) (xy -8.807573 4.059143) (xy -8.774334 4.024402) (xy -8.733746 3.982414) (xy -8.685537 3.932904) (xy -8.629434 3.875597)
     (xy -8.565168 3.810221) (xy -8.492465 3.736499) (xy -8.411055 3.654158) (xy -8.320666 3.562923) (xy -8.221025 3.462519) (xy -8.111862 3.352674) (xy -7.992905 3.233111) (xy -7.863882 3.103556)
     (xy -7.724521 2.963736) (xy -7.574551 2.813375) (xy -7.413700 2.652200) (xy -7.241697 2.479935) (xy -7.058270 2.296307) (xy -6.863147 2.101041) (xy -6.838225 2.076105) (xy -4.838700 0.075511)
     (xy -4.897966 0.100510) (xy -4.948362 0.121693) (xy -5.010536 0.147702) (xy -5.083483 0.178125) (xy -5.166202 0.212546) (xy -5.257687 0.250552) (xy -5.356937 0.291730) (xy -5.462946 0.335665)
     (xy -5.574712 0.381944) (xy -5.691231 0.430153) (xy -5.811500 0.479879) (xy -5.934514 0.530707) (xy -6.059272 0.582224) (xy -6.184768 0.634015) (xy -6.309999 0.685669) (xy -6.433963 0.736769)
     (xy -6.555654 0.786904) (xy -6.674071 0.835658) (xy -6.788209 0.882619) (xy -6.897064 0.927372) (xy -6.999634 0.969504) (xy -7.094915 1.008601) (xy -7.181903 1.044249) (xy -7.259594 1.076035)
     (xy -7.326986 1.103544) (xy -7.383074 1.126363) (xy -7.426855 1.144078) (xy -7.457326 1.156276) (xy -7.473482 1.162542) (xy -7.475487 1.163234) (xy -7.519312 1.171920) (xy -7.572845 1.176182)
     (xy -7.629451 1.176017) (xy -7.682490 1.171421) (xy -7.722180 1.163351) (xy -7.803898 1.130995) (xy -7.877916 1.085086) (xy -7.942439 1.027447) (xy -7.995668 0.959901) (xy -8.035806 0.884269)
     (xy -8.055793 0.825057) (xy -8.065218 0.769941) (xy -8.068199 0.706905) (xy -8.064750 0.643679) (xy -8.055320 0.589656) (xy -8.029132 0.517422) (xy -7.989699 0.447545) (xy -7.940018 0.384207)
     (xy -7.883083 0.331588) (xy -7.857607 0.313614) (xy -7.839137 0.303541) (xy -7.807395 0.288199) (xy -7.764802 0.268675) (xy -7.713782 0.246056) (xy -7.656757 0.221429) (xy -7.596149 0.195882)
     (xy -7.584791 0.191164) (xy -7.374313 0.103943) (xy -7.178781 0.022917) (xy -6.997499 -0.052202) (xy -6.829769 -0.121701) (xy -6.674895 -0.185871) (xy -6.532181 -0.244998) (xy -6.400929 -0.299373)
     (xy -6.280444 -0.349282) (xy -6.170028 -0.395016) (xy -6.068984 -0.436862) (xy -5.976617 -0.475109) (xy -5.892230 -0.510045) (xy -5.815125 -0.541960) (xy -5.744607 -0.571141) (xy -5.679978 -0.597877)
     (xy -5.620542 -0.622457) (xy -5.565603 -0.645169) (xy -5.562600 -0.646410) (xy -5.211233 -0.791633) (xy -8.056033 -0.795866) (xy -10.900833 -0.800100) (xy -10.963315 -0.822914) (xy -11.045599 -0.861184)
     (xy -11.117658 -0.911420) (xy -11.178377 -0.972090) (xy -11.226642 -1.041661) (xy -11.261340 -1.118598) (xy -11.281357 -1.201371) (xy -11.286066 -1.267129) (xy -11.285448 -1.274233) (xy -4.220410 -1.274233)
     (xy -4.219913 -1.198926) (xy -4.217910 -1.136281) (xy -4.213855 -1.082054) (xy -4.207203 -1.032002) (xy -4.197411 -0.981879) (xy -4.183933 -0.927442) (xy -4.169052 -0.874198) (xy -4.120060 -0.734569)
     (xy -4.056265 -0.601673) (xy -3.978797 -0.476538) (xy -3.888789 -0.360190) (xy -3.787372 -0.253655) (xy -3.675676 -0.157961) (xy -3.554834 -0.074135) (xy -3.425975 -0.003202) (xy -3.290233 0.053810)
     (xy -3.148737 0.095874) (xy -3.085473 0.109284) (xy -3.044550 0.116691) (xy -3.006794 0.123141) (xy -2.977124 0.127813) (xy -2.963333 0.129637) (xy -2.918792 0.132629) (xy -2.862834 0.133882)
     (xy -2.800872 0.133503) (xy -2.738320 0.131604) (xy -2.680592 0.128291) (xy -2.633103 0.123676) (xy -2.627025 0.122854) (xy -2.475748 0.093340) (xy -2.331730 0.048713) (xy -2.194328 -0.011314)
     (xy -2.062904 -0.087025) (xy -1.936817 -0.178705) (xy -1.920327 -0.192190) (xy -1.829134 -0.276030) (xy -1.743170 -0.371174) (xy -1.664819 -0.474290) (xy -1.596466 -0.582049) (xy -1.540497 -0.691120)
     (xy -1.510808 -0.764116) (xy -1.499351 -0.795866) (xy -2.022628 -0.795866) (xy -2.052246 -0.751416) (xy -2.127173 -0.653280) (xy -2.213193 -0.566192) (xy -2.308678 -0.491190) (xy -2.412004 -0.429312)
     (xy -2.521545 -0.381598) (xy -2.635676 -0.349086) (xy -2.699050 -0.338162) (xy -2.820431 -0.330322) (xy -2.940351 -0.338583) (xy -3.057397 -0.362111) (xy -3.170156 -0.400073) (xy -3.277216 -0.451639)
     (xy -3.377164 -0.515973) (xy -3.468586 -0.592244) (xy -3.550071 -0.679619) (xy -3.620204 -0.777265) (xy -3.677574 -0.884349) (xy -3.694857 -0.925118) (xy -3.716434 -0.982960) (xy -3.732296 -1.034652)
     (xy -3.743245 -1.084821) (xy -3.750084 -1.138095) (xy -3.753614 -1.199101) (xy -3.754635 -1.270000) (xy -3.754415 -1.327288) (xy -3.753386 -1.371538) (xy -3.751205 -1.406637) (xy -3.747530 -1.436473)
     (xy -3.742020 -1.464936) (xy -3.734996 -1.493402) (xy -3.695079 -1.614175) (xy -3.641270 -1.727491) (xy -3.574578 -1.831801) (xy -3.496015 -1.925554) (xy -3.406591 -2.007201) (xy -3.393257 -2.017582)
     (xy -3.288852 -2.087151) (xy -3.178852 -2.141515) (xy -3.064672 -2.180624) (xy -2.947727 -2.204425) (xy -2.829431 -2.212866) (xy -2.711199 -2.205896) (xy -2.594444 -2.183462) (xy -2.480581 -2.145514)
     (xy -2.371026 -2.091998) (xy -2.314893 -2.057105) (xy -2.267394 -2.021550) (xy -2.215920 -1.976890) (xy -2.164428 -1.927075) (xy -2.116875 -1.876051) (xy -2.077216 -1.827769) (xy -2.058522 -1.801242)
     (xy -2.021544 -1.744133) (xy -1.760072 -1.744133) (xy -1.695477 -1.744219) (xy -1.636684 -1.744464) (xy -1.585734 -1.744844) (xy -1.544666 -1.745339) (xy -1.515519 -1.745928) (xy -1.500335 -1.746587)
     (xy -1.498600 -1.746907) (xy -1.501898 -1.757750) (xy -1.510674 -1.780054) (xy -1.523245 -1.809931) (xy -1.537933 -1.843496) (xy -1.553057 -1.876861) (xy -1.566937 -1.906141) (xy -1.570873 -1.914075)
     (xy -1.621382 -2.002692) (xy -1.684159 -2.094021) (xy -1.755913 -2.184095) (xy -1.833352 -2.268944) (xy -1.913186 -2.344601) (xy -1.960033 -2.383285) (xy -2.087174 -2.471766) (xy -2.220948 -2.544839)
     (xy -2.360708 -2.602253) (xy -2.505807 -2.643762) (xy -2.655597 -2.669114) (xy -2.717800 -2.674753) (xy -2.872103 -2.677179) (xy -3.022604 -2.663599) (xy -3.168418 -2.634689) (xy -3.308660 -2.591123)
     (xy -3.442443 -2.533576) (xy -3.568882 -2.462723) (xy -3.687091 -2.379238) (xy -3.796185 -2.283798) (xy -3.895278 -2.177076) (xy -3.983485 -2.059748) (xy -4.059919 -1.932488) (xy -4.123695 -1.795971)
     (xy -4.173928 -1.650872) (xy -4.200482 -1.544918) (xy -4.207445 -1.510072) (xy -4.212593 -1.477932) (xy -4.216191 -1.444890) (xy -4.218504 -1.407337) (xy -4.219799 -1.361665) (xy -4.220341 -1.304266)
     (xy -4.220410 -1.274233) (xy -11.285448 -1.274233) (xy -11.278185 -1.357690) (xy -11.255011 -1.441747) (xy -11.217253 -1.518339) (xy -11.165619 -1.586505) (xy -11.100816 -1.645286) (xy -11.023553 -1.693722)
     (xy -10.947400 -1.726470) (xy -10.942785 -1.727708) (xy -10.935826 -1.728872) (xy -10.925993 -1.729966) (xy -10.912755 -1.730993) (xy -10.895582 -1.731956) (xy -10.873944 -1.732858) (xy -10.847312 -1.733703)
     (xy -10.815154 -1.734493) (xy -10.776941 -1.735233) (xy -10.732142 -1.735925) (xy -10.680229 -1.736573) (xy -10.620669 -1.737180) (xy -10.552934 -1.737748) (xy -10.476494 -1.738282) (xy -10.390817 -1.738785)
     (xy -10.295374 -1.739259) (xy -10.189636 -1.739708) (xy -10.073071 -1.740135) (xy -9.945149 -1.740544) (xy -9.805342 -1.740938) (xy -9.653118 -1.741320) (xy -9.487947 -1.741692) (xy -9.309299 -1.742060)
     (xy -9.116645 -1.742425) (xy -8.909453 -1.742790) (xy -8.687195 -1.743160) (xy -8.449339 -1.743538) (xy -8.195356 -1.743926) (xy -8.056614 -1.744133) (xy -5.203928 -1.748367) (xy -5.601281 -1.912672)
     (xy -5.689849 -1.949304) (xy -5.782808 -1.987770) (xy -5.877159 -2.026827) (xy -5.969901 -2.065232) (xy -6.058033 -2.101742) (xy -6.138555 -2.135116) (xy -6.208468 -2.164110) (xy -6.248400 -2.180683)
     (xy -6.296711 -2.200735) (xy -6.358840 -2.226509) (xy -6.432961 -2.257250) (xy -6.517249 -2.292199) (xy -6.609876 -2.330600) (xy -6.709016 -2.371696) (xy -6.812844 -2.414729) (xy -6.919533 -2.458943)
     (xy -7.027257 -2.503581) (xy -7.134190 -2.547886) (xy -7.145040 -2.552381) (xy -7.245034 -2.593842) (xy -7.341045 -2.633721) (xy -7.431845 -2.671504) (xy -7.516209 -2.706676) (xy -7.592908 -2.738724)
     (xy -7.660716 -2.767135) (xy -7.718406 -2.791394) (xy -7.764750 -2.810988) (xy -7.798521 -2.825403) (xy -7.818494 -2.834125) (xy -7.822960 -2.836211) (xy -7.884581 -2.876166) (xy -7.941614 -2.929534)
     (xy -7.991078 -2.992872) (xy -8.029991 -3.062736) (xy -8.040202 -3.087138) (xy -8.052843 -3.125619) (xy -8.060938 -3.165554) (xy -8.065700 -3.213571) (xy -8.066724 -3.231836) (xy -8.068216 -3.274759)
     (xy -8.067317 -3.307299) (xy -8.063291 -3.335922) (xy -8.055403 -3.367096) (xy -8.048901 -3.388469) (xy -8.014248 -3.472820) (xy -7.966786 -3.546123) (xy -7.906674 -3.608216) (xy -7.834074 -3.658936)
     (xy -7.749145 -3.698121) (xy -7.738533 -3.701902) (xy -7.706813 -3.711465) (xy -7.675426 -3.717213) (xy -7.638485 -3.719900) (xy -7.594600 -3.720316) (xy -7.570747 -3.720183) (xy -7.550315 -3.719794)
     (xy -7.531590 -3.718594) (xy -7.512853 -3.716029) (xy -7.492388 -3.711544) (xy -7.468478 -3.704584) (xy -7.439406 -3.694595) (xy -7.403456 -3.681023) (xy -7.358911 -3.663312) (xy -7.304054 -3.640910)
     (xy -7.237168 -3.613260) (xy -7.156536 -3.579809) (xy -7.145867 -3.575384) (xy -7.091711 -3.552929) (xy -7.023928 -3.524834) (xy -6.944534 -3.491934) (xy -6.855548 -3.455066) (xy -6.758988 -3.415064)
     (xy -6.656872 -3.372765) (xy -6.551217 -3.329005) (xy -6.444041 -3.284619) (xy -6.337362 -3.240444) (xy -6.261100 -3.208868) (xy -6.081269 -3.134410) (xy -5.916489 -3.066178) (xy -5.766161 -3.003924)
     (xy -5.629689 -2.947401) (xy -5.506476 -2.896361) (xy -5.395924 -2.850555) (xy -5.297437 -2.809736) (xy -5.210417 -2.773657) (xy -5.134267 -2.742070) (xy -5.068391 -2.714726) (xy -5.012191 -2.691378)
     (xy -4.965070 -2.671779) (xy -4.926430 -2.655680) (xy -4.895676 -2.642834) (xy -4.872209 -2.632993) (xy -4.855434 -2.625909) (xy -4.844751 -2.621334) (xy -4.839566 -2.619021) (xy -4.839065 -2.618771)
     (xy -4.844294 -2.624321) (xy -4.861060 -2.641412) (xy -4.888927 -2.669607) (xy -4.927461 -2.708472) (xy -4.976227 -2.757571) (xy -5.034792 -2.816467) (xy -5.102721 -2.884725) (xy -5.179578 -2.961910)
     (xy -5.264931 -3.047584) (xy -5.358343 -3.141314) (xy -5.459381 -3.242662) (xy -5.567611 -3.351193) (xy -5.682597 -3.466471) (xy -5.803906 -3.588060) (xy -5.931102 -3.715525) (xy -6.063751 -3.848430)
     (xy -6.201420 -3.986338) (xy -6.343672 -4.128815) (xy -6.490075 -4.275424) (xy -6.640192 -4.425730) (xy -6.793591 -4.579296) (xy -6.842317 -4.628071) (xy -6.997048 -4.782992) (xy -7.148799 -4.935009)
     (xy -7.297125 -5.083675) (xy -7.441584 -5.228542) (xy -7.581731 -5.369163) (xy -7.717122 -5.505092) (xy -7.847314 -5.635880) (xy -7.971863 -5.761081) (xy -8.090324 -5.880246) (xy -8.202255 -5.992930)
     (xy -8.307212 -6.098685) (xy -8.404750 -6.197063) (xy -8.494425 -6.287617) (xy -8.575795 -6.369901) (xy -8.648415 -6.443466) (xy -8.711842 -6.507866) (xy -8.765631 -6.562653) (xy -8.809338 -6.607381)
     (xy -8.842521 -6.641601) (xy -8.864735 -6.664867) (xy -8.875536 -6.676731) (xy -8.876441 -6.677926) (xy -8.913335 -6.753430) (xy -8.935498 -6.834061) (xy -8.943228 -6.917326) (xy -8.936828 -7.000736)
     (xy -8.916598 -7.081797) (xy -8.882838 -7.158018) (xy -8.835851 -7.226907) (xy -8.806269 -7.259026) (xy -8.736952 -7.315765) (xy -8.660614 -7.357095) (xy -8.577285 -7.383006) (xy -8.486994 -7.393486)
     (xy -8.470900 -7.393732) (xy -8.387399 -7.387648) (xy -8.312119 -7.368493) (xy -8.241403 -7.335263) (xy -8.227971 -7.327144) (xy -8.221726 -7.322593) (xy -8.212080 -7.314553) (xy -8.198725 -7.302718)
     (xy -8.181350 -7.286781) (xy -8.159645 -7.266434) (xy -8.133301 -7.241371) (xy -8.102008 -7.211285) (xy -8.065456 -7.175868) (xy -8.023336 -7.134814) (xy -7.975337 -7.087815) (xy -7.921150 -7.034564)
     (xy -7.860464 -6.974755) (xy -7.792971 -6.908081) (xy -7.718360 -6.834234) (xy -7.636322 -6.752907) (xy -7.546546 -6.663793) (xy -7.448723 -6.566586) (xy -7.342544 -6.460978) (xy -7.227697 -6.346662)
     (xy -7.103875 -6.223331) (xy -6.970766 -6.090678) (xy -6.828060 -5.948396) (xy -6.675449 -5.796179) (xy -6.512623 -5.633718) (xy -6.339271 -5.460707) (xy -6.155083 -5.276840) (xy -5.959751 -5.081808)
     (xy -5.752964 -4.875305) (xy -5.610992 -4.733511) (xy -5.452152 -4.574892) (xy -5.304876 -4.427876) (xy -5.168770 -4.292079) (xy -5.043441 -4.167114) (xy -4.928497 -4.052594) (xy -4.823544 -3.948133)
     (xy -4.728190 -3.853343) (xy -4.642042 -3.767840) (xy -4.564706 -3.691236) (xy -4.495790 -3.623144) (xy -4.434901 -3.563179) (xy -4.381646 -3.510954) (xy -4.335632 -3.466081) (xy -4.296467 -3.428176)
     (xy -4.263756 -3.396850) (xy -4.237108 -3.371719) (xy -4.216130 -3.352394) (xy -4.200428 -3.338491) (xy -4.189609 -3.329621) (xy -4.183282 -3.325399) (xy -4.181052 -3.325439) (xy -4.181540 -3.327400)
     (xy -4.193616 -3.355635) (xy -4.211210 -3.397341) (xy -4.233905 -3.451506) (xy -4.261286 -3.517120) (xy -4.292935 -3.593171) (xy -4.328438 -3.678650) (xy -4.367376 -3.772546) (xy -4.409335 -3.873848)
     (xy -4.453897 -3.981545) (xy -4.500646 -4.094626) (xy -4.549166 -4.212082) (xy -4.599041 -4.332901) (xy -4.649855 -4.456073) (xy -4.701190 -4.580587) (xy -4.752631 -4.705432) (xy -4.803761 -4.829598)
     (xy -4.854164 -4.952073) (xy -4.903424 -5.071849) (xy -4.951124 -5.187913) (xy -4.996848 -5.299255) (xy -5.040180 -5.404864) (xy -5.080703 -5.503730) (xy -5.118001 -5.594843) (xy -5.151657 -5.677190)
     (xy -5.181257 -5.749762) (xy -5.206382 -5.811549) (xy -5.226616 -5.861539) (xy -5.241544 -5.898721) (xy -5.250750 -5.922086) (xy -5.253723 -5.930184) (xy -5.263814 -5.981883) (xy -5.267931 -6.042199)
     (xy -5.266069 -6.103901) (xy -5.258223 -6.159758) (xy -5.253902 -6.177149) (xy -5.222249 -6.257742) (xy -5.176591 -6.331006) (xy -5.118847 -6.395051) (xy -5.050935 -6.447990) (xy -4.974773 -6.487934)
     (xy -4.919069 -6.506758) (xy -4.887549 -6.512748) (xy -4.847132 -6.517173) (xy -4.805841 -6.519190) (xy -4.800262 -6.519233) (xy -4.711985 -6.512571) (xy -4.632336 -6.491827) (xy -4.559504 -6.456248)
     (xy -4.491676 -6.405082) (xy -4.466022 -6.380571) (xy -4.437272 -6.349337) (xy -4.410688 -6.316781) (xy -4.390448 -6.288162) (xy -4.384556 -6.278033) (xy -4.378932 -6.265644) (xy -4.367199 -6.238457)
     (xy -4.349715 -6.197326) (xy -4.326834 -6.143104) (xy -4.298913 -6.076645) (xy -4.266309 -5.998801) (xy -4.229376 -5.910426) (xy -4.188471 -5.812374) (xy -4.143951 -5.705497) (xy -4.096170 -5.590650)
     (xy -4.045486 -5.468685) (xy -3.992254 -5.340456) (xy -3.936830 -5.206816) (xy -3.879570 -5.068618) (xy -3.830134 -4.949200) (xy -3.297767 -3.662699) (xy -3.293533 -6.507066) (xy -3.293143 -6.767805)
     (xy -3.292770 -7.012152) (xy -3.292410 -7.240648) (xy -3.292061 -7.453834) (xy -3.291718 -7.652252) (xy -3.291378 -7.836443) (xy -3.291037 -8.006947) (xy -3.290692 -8.164307) (xy -3.290337 -8.309063)
     (xy -3.289971 -8.441757) (xy -3.289589 -8.562929) (xy -3.289187 -8.673122) (xy -3.288762 -8.772876) (xy -3.288311 -8.862732) (xy -3.287828 -8.943232) (xy -3.287311 -9.014916) (xy -3.286756 -9.078327)
     (xy -3.286160 -9.134005) (xy -3.285518 -9.182492) (xy -3.284827 -9.224328) (xy -3.284083 -9.260056) (xy -3.283282 -9.290215) (xy -3.282421 -9.315348) (xy -3.281496 -9.335995) (xy -3.280504 -9.352698)
     (xy -3.279440 -9.365999) (xy -3.278301 -9.376437) (xy -3.277084 -9.384555) (xy -3.275783 -9.390893) (xy -3.274397 -9.395994) (xy -3.273754 -9.398000) (xy -3.237275 -9.483012) (xy -3.188768 -9.557402)
     (xy -3.129498 -9.620176) (xy -3.060729 -9.670341) (xy -2.983728 -9.706904) (xy -2.899759 -9.728873) (xy -2.844794 -9.734727) (xy -2.754584 -9.731251) )(layer F.SilkS) (width  0.010000)
  )
)
