{
  "packages": [
    "packages/*"
  ],
  "version": "0.1.9",
  "npmClient": "npm",
  "command": {
    "publish": {
      "ignoreChanges": [
        "*.md",
        "test/**"
      ],
      "message": "chore(release): publish"
    },
    "bootstrap": {
      "npmClientArgs": [
        "--no-package-lock"
      ]
    }
  }
}
