floorId	partitionId	location_x	location_y	timeStamp
19	895	344.7722462474041	278.3776609965549	21/02/21 12:32:03
19	895	344.6215790641142	278.6263693080911	21/02/21 12:32:03
19	895	344.46734316396805	278.88096854772647	21/02/21 12:32:04
19	895	344.3353076431949	279.0989213276037	21/02/21 12:32:04
19	895	344.2326409841082	279.26839453918814	21/02/21 12:32:04
19	895	344.08464242549707	279.51269771668325	21/02/21 12:32:04
19	895	344.08464242549707	279.51269771668325	21/02/21 12:32:04
19	895	344.08464242549707	279.51269771668325	21/02/21 12:32:04
19	964	343.97588045597684	279.82201554896426	21/02/21 12:32:04
19	964	344.21662953923357	279.83423475062216	21/02/21 12:32:04
19	964	344.21662953923357	279.83423475062216	21/02/21 12:32:04
19	964	344.38641326965245	279.84285211112115	21/02/21 12:32:04
19	964	344.60395056430616	279.85389320019004	21/02/21 12:32:05
19	964	344.7610800062619	279.8618682932275	21/02/21 12:32:05
19	964	345.0123066682878	279.8746192836097	21/02/21 12:32:05
19	964	345.18557254814874	279.88341338034235	21/02/21 12:32:05
19	964	345.3881316564978	279.8936942526891	21/02/21 12:32:05
19	964	345.61342139628914	279.90512881652927	21/02/21 12:32:05
19	964	345.83728678607486	279.9164910875918	21/02/21 12:32:05
19	964	346.09360060843375	279.92950027641507	21/02/21 12:32:05
19	964	346.2482073364977	279.93734732929823	21/02/21 12:32:05
19	964	346.48049848585856	279.94913724915585	21/02/21 12:32:06
19	964	346.6803805493766	279.95928224829305	21/02/21 12:32:06
19	964	347.15707887427	279.98347703600757	21/02/21 12:32:06
19	964	347.42799299016656	279.9972272616339	21/02/21 12:32:06
19	964	347.67662066722056	280.00984634072887	21/02/21 12:32:06
19	964	347.9154339840466	280.02196729270685	21/02/21 12:32:06
19	964	348.0666068719571	280.02964006129065	21/02/21 12:32:06
19	964	348.0666068719571	280.02964006129065	21/02/21 12:32:06
19	964	348.23069591127404	280.03796838817	21/02/21 12:32:06
19	964	348.6924777687475	280.0614060916997	21/02/21 12:32:06
19	964	348.91806159032467	280.0728555816389	21/02/21 12:32:07
19	964	349.19990035860565	280.08716028717737	21/02/21 12:32:07
19	964	349.4902387518297	280.1018963905421	21/02/21 12:32:07
19	964	349.75866569128897	280.11552037971495	21/02/21 12:32:07
19	964	349.75866569128897	280.11552037971495	21/02/21 12:32:07
19	964	350.1836416466415	280.137090002444	21/02/21 12:32:07
19	964	350.3966253837156	280.1478999760396	21/02/21 12:32:07
19	964	350.67789328825035	280.1621757074314	21/02/21 12:32:07
19	964	350.8815405807542	280.1725118104833	21/02/21 12:32:07
19	964	351.1415596362991	280.1857090581389	21/02/21 12:32:08
19	964	351.36663148888954	280.1971325631306	21/02/21 12:32:08
19	964	351.61763302578146	280.2098721273035	21/02/21 12:32:08
19	964	351.7815082892173	280.21818960400407	21/02/21 12:32:08
19	964	351.9353496461197	280.22599781053134	21/02/21 12:32:08
19	964	352.2263700240799	280.2407685279802	21/02/21 12:32:08
19	964	352.2263700240799	280.2407685279802	21/02/21 12:32:08
19	964	352.50796271333064	280.2550607437959	21/02/21 12:32:08
19	964	352.6775942368954	280.2636703790474	21/02/21 12:32:08
19	964	353.14248984640807	280.28726612082835	21/02/21 12:32:08
19	964	353.3079831436815	280.2956657207149	21/02/21 12:32:09
19	964	353.55253573124014	280.3080779689483	21/02/21 12:32:09
19	964	353.55253573124014	280.3080779689483	21/02/21 12:32:09
19	964	353.98439483199587	280.32999694520583	21/02/21 12:32:09
19	964	354.26101932033794	280.3440370003572	21/02/21 12:32:09
19	964	354.4932587897793	280.3558242972044	21/02/21 12:32:09
19	964	354.669933933174	280.3647914308519	21/02/21 12:32:09
19	964	354.669933933174	280.3647914308519	21/02/21 12:32:09
19	964	355.11324443598915	280.38729162216185	21/02/21 12:32:09
19	968	355.2829402822087	280.2140392945733	21/02/21 12:32:10
19	968	355.2829402822087	280.2140392945733	21/02/21 12:32:10
19	968	355.62777375593913	279.8619788093865	21/02/21 12:32:10
19	968	355.8097470188313	279.6761917553289	21/02/21 12:32:10
19	968	355.92348667171785	279.5600683495961	21/02/21 12:32:10
19	968	355.92348667171785	279.5600683495961	21/02/21 12:32:10
