stationId	t_start	t_end	t_max	timeStamp
109	20/04/28 05:08:49	20/04/28 05:08:49	20/04/28 05:08:49
47	20/04/28 05:08:51	20/04/28 05:08:51	20/04/28 05:08:51
130	20/04/28 05:08:53	20/04/28 05:08:53	20/04/28 05:08:53
143	20/04/28 05:08:55	20/04/28 05:08:57	20/04/28 05:08:57
109	20/04/28 05:08:59	20/04/28 05:08:59	20/04/28 05:08:59
130	20/04/28 05:09:01	20/04/28 05:09:01	20/04/28 05:09:01
157	20/04/28 05:09:03	20/04/28 05:09:04	20/04/28 05:09:04
147	20/04/28 05:09:06	20/04/28 05:09:06	20/04/28 05:09:06
147	20/04/28 05:13:27	20/04/28 05:09:08	20/04/28 05:09:08
153	20/04/28 05:09:10	20/04/28 05:09:10	20/04/28 05:09:10
153	20/04/28 05:09:12	20/04/28 05:09:13	20/04/28 05:09:13
52	20/04/28 05:09:15	20/04/28 05:09:15	20/04/28 05:09:15
4	20/04/28 05:09:17	20/04/28 05:09:17	20/04/28 05:09:17
71	20/04/28 05:09:19	20/04/28 05:09:19	20/04/28 05:09:19
105	20/04/28 05:09:21	20/04/28 05:09:21	20/04/28 05:09:21
147	20/04/28 05:09:23	20/04/28 05:09:24	20/04/28 05:09:24
153	20/04/28 05:09:26	20/04/28 05:09:26	20/04/28 05:09:26
64	20/04/28 05:09:28	20/04/28 05:09:28	20/04/28 05:09:28
94	20/04/28 05:09:30	20/04/28 05:09:30	20/04/28 05:09:30
153	20/04/28 05:09:32	20/04/28 05:09:32	20/04/28 05:09:32
150	20/04/28 05:09:34	20/04/28 05:09:34	20/04/28 05:09:34
128	20/04/28 05:09:36	20/04/28 05:09:37	20/04/28 05:09:36
106	20/04/28 05:09:39	20/04/28 05:09:39	20/04/28 05:09:39
111	20/04/28 05:09:41	20/04/28 05:09:41	20/04/28 05:09:41
108	20/04/28 05:09:43	20/04/28 05:09:43	20/04/28 05:09:43
71	20/04/28 05:09:45	20/04/28 05:09:45	20/04/28 05:09:45
56	20/04/28 05:09:47	20/04/28 05:09:47	20/04/28 05:09:47
33	20/04/28 05:09:49	20/04/28 05:09:49	20/04/28 05:09:49
61	20/04/28 05:09:51	20/04/28 05:09:51	20/04/28 05:09:51
108	20/04/28 05:09:53	20/04/28 05:09:53	20/04/28 05:09:53
109	20/04/28 05:09:55	20/04/28 05:09:55	20/04/28 05:09:55
14	20/04/28 05:09:57	20/04/28 05:09:58	20/04/28 05:09:58
151	20/04/28 05:10:00	20/04/28 05:10:00	20/04/28 05:10:00
125	20/04/28 05:10:02	20/04/28 05:10:02	20/04/28 05:10:02
130	20/04/28 05:10:04	20/04/28 05:10:04	20/04/28 05:10:04
26	20/04/28 05:10:06	20/04/28 05:10:06	20/04/28 05:10:06
12	20/04/28 05:10:08	20/04/28 05:10:08	20/04/28 05:10:08
151	20/04/28 05:10:10	20/04/28 05:10:10	20/04/28 05:10:10
10	20/04/28 05:10:12	20/04/28 05:10:12	20/04/28 05:10:12
10	20/04/28 05:10:14	20/04/28 05:10:15	20/04/28 05:10:15
67	20/04/28 05:10:17	20/04/28 05:10:17	20/04/28 05:10:17
6	20/04/28 05:10:19	20/04/28 05:10:19	20/04/28 05:10:19
117	20/04/28 05:10:21	20/04/28 05:10:21	20/04/28 05:10:21
74	20/04/28 05:10:23	20/04/28 05:10:23	20/04/28 05:10:23
68	20/04/28 05:10:25	20/04/28 05:10:25	20/04/28 05:10:25
118	20/04/28 05:10:27	20/04/28 05:10:27	20/04/28 05:10:27
91	20/04/28 05:10:29	20/04/28 05:10:29	20/04/28 05:10:29
74	20/04/28 05:10:31	20/04/28 05:10:31	20/04/28 05:10:31
65	20/04/28 05:10:33	20/04/28 05:10:33	20/04/28 05:10:33
6	20/04/28 05:10:35	20/04/28 05:10:35	20/04/28 05:10:35
72	20/04/28 05:10:37	20/04/28 05:10:37	20/04/28 05:10:37
147	20/04/28 05:10:39	20/04/28 05:10:39	20/04/28 05:10:39
86	20/04/28 05:10:41	20/04/28 05:10:41	20/04/28 05:10:41
151	20/04/28 05:10:43	20/04/28 05:10:43	20/04/28 05:10:43
85	20/04/28 05:10:45	20/04/28 05:10:45	20/04/28 05:10:45
14	20/04/28 05:10:47	20/04/28 05:10:47	20/04/28 05:10:47
105	20/04/28 05:10:49	20/04/28 05:10:49	20/04/28 05:10:49
74	20/04/28 05:10:51	20/04/28 05:10:51	20/04/28 05:10:51
136	20/04/28 05:10:53	20/04/28 05:10:53	20/04/28 05:10:53
157	20/04/28 05:10:55	20/04/28 05:10:55	20/04/28 05:10:55
129	20/04/28 05:10:57	20/04/28 05:10:57	20/04/28 05:10:57
74	20/04/28 05:10:59	20/04/28 05:10:59	20/04/28 05:10:59
40	20/04/28 05:11:01	20/04/28 05:11:01	20/04/28 05:11:01
90	20/04/28 05:11:03	20/04/28 05:11:03	20/04/28 05:11:03
101	20/04/28 05:11:05	20/04/28 05:11:05	20/04/28 05:11:05
134	20/04/28 05:11:07	20/04/28 05:11:07	20/04/28 05:11:07
29	20/04/28 05:11:09	20/04/28 05:11:09	20/04/28 05:11:09
101	20/04/28 05:11:11	20/04/28 05:11:11	20/04/28 05:11:11
90	20/04/28 05:11:13	20/04/28 05:11:14	20/04/28 05:11:14
70	20/04/28 05:11:16	20/04/28 05:11:16	20/04/28 05:11:16
64	20/04/28 05:11:18	20/04/28 05:11:18	20/04/28 05:11:18
64	20/04/28 05:11:20	20/04/28 05:11:20	20/04/28 05:11:20
90	20/04/28 05:11:22	20/04/28 05:11:22	20/04/28 05:11:22
90	20/04/28 05:11:24	20/04/28 05:11:24	20/04/28 05:11:24
32	20/04/28 05:11:26	20/04/28 05:11:26	20/04/28 05:11:26
96	20/04/28 05:11:28	20/04/28 05:11:28	20/04/28 05:11:28
90	20/04/28 05:11:30	20/04/28 05:11:30	20/04/28 05:11:30
90	20/04/28 05:11:32	20/04/28 05:11:32	20/04/28 05:11:32
96	20/04/28 05:11:34	20/04/28 05:11:34	20/04/28 05:11:34
64	20/04/28 05:11:36	20/04/28 05:11:36	20/04/28 05:11:36
40	20/04/28 05:11:38	20/04/28 05:11:38	20/04/28 05:11:38
96	20/04/28 05:11:40	20/04/28 05:11:41	20/04/28 05:11:41
90	20/04/28 05:11:43	20/04/28 05:11:43	20/04/28 05:11:43
90	20/04/28 05:11:45	20/04/28 05:11:45	20/04/28 05:11:45
101	20/04/28 05:11:47	20/04/28 05:11:47	20/04/28 05:11:47
90	20/04/28 05:11:49	20/04/28 05:11:50	20/04/28 05:11:50
90	20/04/28 05:11:52	20/04/28 05:11:52	20/04/28 05:11:52
90	20/04/28 05:11:54	20/04/28 05:11:54	20/04/28 05:11:54
101	20/04/28 05:11:56	20/04/28 05:11:56	20/04/28 05:11:56
90	20/04/28 05:11:58	20/04/28 05:11:59	20/04/28 05:11:59
90	20/04/28 05:12:01	20/04/28 05:12:01	20/04/28 05:12:01
29	20/04/28 05:12:03	20/04/28 05:12:03	20/04/28 05:12:03
26	20/04/28 05:12:05	20/04/28 05:12:05	20/04/28 05:12:05
101	20/04/28 05:12:07	20/04/28 05:12:07	20/04/28 05:12:07
96	20/04/28 05:12:09	20/04/28 05:12:09	20/04/28 05:12:09
130	20/04/28 05:12:11	20/04/28 05:12:11	20/04/28 05:12:11
