floorId	partitionId	location_x	location_y	timeStamp
19	895	344.25435931704124	279.40371272280333	21/02/24 15:47:09
19	895	344.0239106641472	279.5696135352708	21/02/24 15:47:09
19	964	343.7591595352034	279.67379192946356	21/02/24 15:47:09
19	964	343.50854108425887	279.70000431631604	21/02/24 15:47:10
19	964	343.2119857793225	279.7310212759487	21/02/24 15:47:10
19	964	342.93064236059826	279.7604472120767	21/02/24 15:47:10
19	964	342.67594644218985	279.78708606455507	21/02/24 15:47:10
19	964	342.49449581662486	279.8060641325066	21/02/24 15:47:10
19	964	342.3246953255722	279.82382370344976	21/02/24 15:47:10
19	964	342.1382552370561	279.84332362337415	21/02/24 15:47:10
19	964	341.9072442052013	279.86748525437673	21/02/24 15:47:10
19	964	341.7290221401301	279.8861256445702	21/02/24 15:47:10
19	964	341.7290221401301	279.8861256445702	21/02/24 15:47:10
19	964	341.5662907182789	279.90314585583775	21/02/24 15:47:11
19	964	341.29621952337925	279.93139282094245	21/02/24 15:47:11
19	964	340.82640267192625	279.9805313461136	21/02/24 15:47:11
19	964	340.5828827293825	280.0060012942207	21/02/24 15:47:11
19	964	340.3746566625372	280.02777982727105	21/02/24 15:47:11
19	964	340.0978082151285	280.05673563070707	21/02/24 15:47:11
19	964	339.87782387886836	280.07974397068284	21/02/24 15:47:11
19	964	339.87782387886836	280.07974397068284	21/02/24 15:47:11
19	964	339.6059330958597	280.1081812479822	21/02/24 15:47:11
19	964	339.3372197745841	280.1362861919843	21/02/24 15:47:11
19	964	338.9435104175148	280.17746457265036	21/02/24 15:47:12
19	964	338.76870485033976	280.19574762856064	21/02/24 15:47:12
19	964	338.58146811325844	280.21533087060396	21/02/24 15:47:12
19	964	338.3248271366468	280.2421731582958	21/02/24 15:47:12
19	964	338.11616812206205	280.263996973701	21/02/24 15:47:12
19	964	337.9511946167359	280.2812516862959	21/02/24 15:47:12
19	964	337.65622427153727	280.3121028737053	21/02/24 15:47:12
19	964	337.46263945905986	280.332350066098	21/02/24 15:47:12
19	964	337.22698769932356	280.35699707458997	21/02/24 15:47:12
19	964	337.22698769932356	280.35699707458997	21/02/24 15:47:13
19	964	336.84396277202126	280.3970579620895	21/02/24 15:47:13
19	964	336.84396277202126	280.3970579620895	21/02/24 15:47:13
19	964	336.67929092451175	280.4142811240489	21/02/24 15:47:13
19	964	336.1108503200221	280.47373478746186	21/02/24 15:47:13
19	964	335.8148042780529	280.50469848286815	21/02/24 15:47:13
19	964	335.62620924693	280.52442378998586	21/02/24 15:47:13
19	964	335.62620924693	280.52442378998586	21/02/24 15:47:13
19	964	335.4005106011897	280.54802979422027	21/02/24 15:47:13
19	964	335.1528400382157	280.5739338590813	21/02/24 15:47:13
19	964	334.9661293914752	280.5934620769096	21/02/24 15:47:14
19	964	334.6408964354523	280.627478455306	21/02/24 15:47:14
19	948	334.39675546870143	280.6525859160274	21/02/24 15:47:14
19	948	334.39675546870143	280.6525859160274	21/02/24 15:47:14
19	948	334.51779199268253	280.2749654102834	21/02/24 15:47:14
19	948	334.51779199268253	280.2749654102834	21/02/24 15:47:14
19	948	334.57388342872514	280.0999663624785	21/02/24 15:47:14
19	948	334.6639725161896	279.8188984199155	21/02/24 15:47:14
19	948	334.7206429362395	279.64209300634184	21/02/24 15:47:14
19	948	334.78070574061377	279.4547037306241	21/02/24 15:47:14
19	948	334.83102072667924	279.29772656489257	21/02/24 15:47:15
19	948	334.9081837183595	279.05698660488207	21/02/24 15:47:15
19	948	334.9930084426794	278.79234289037583	21/02/24 15:47:15
19	948	335.16411596585147	278.25850643083777	21/02/24 15:47:15
19	948	335.16411596585147	278.25850643083777	21/02/24 15:47:15
19	948	335.30430422328607	278.1397271980242	21/02/24 15:47:15
19	948	335.2380505141933	277.9596649875363	21/02/24 15:47:15
19	948	335.2380505141933	277.9596649875363	21/02/24 15:47:15
19	948	335.2565635926939	278.0474707333635	21/02/24 15:47:15
19	948	335.27839606694727	278.2825993475572	21/02/24 15:47:16
19	948	335.20601038827925	278.3553009812907	21/02/24 15:47:16
19	948	335.0668058833653	278.2210858554091	21/02/24 15:47:16
19	948	334.8036319245798	278.03520221651087	21/02/24 15:47:16
19	948	334.75213453560923	277.90855834115695	21/02/24 15:47:16
19	948	334.7532473362905	277.9049047767953	21/02/24 15:47:16
19	948	334.9730288583985	277.7830566414783	21/02/24 15:47:16
19	948	334.9730288583985	277.7830566414783	21/02/24 15:47:16
19	948	334.84588553369406	277.80844717663376	21/02/24 15:47:16
19	948	334.80052275664224	277.7845205042759	21/02/24 15:47:16
19	948	334.86926831537187	277.7252126103198	21/02/24 15:47:17
19	948	335.0380972058275	277.4835762791626	21/02/24 15:47:17
19	948	334.8864625846301	277.2852743647604	21/02/24 15:47:17
19	948	334.95152408233326	277.09062664007496	21/02/24 15:47:17
19	948	334.931200885152	277.05918622192894	21/02/24 15:47:17
19	948	334.9208146394651	277.01950451621815	21/02/24 15:47:17
19	948	334.8822701504237	276.9219352858455	21/02/24 15:47:17
19	948	334.8822701504237	276.9219352858455	21/02/24 15:47:17
19	948	334.9521309586214	276.65649498016495	21/02/24 15:47:17
19	948	334.9291946461348	276.8071479745032	21/02/24 15:47:17
19	948	334.9948094247255	276.86505268807474	21/02/24 15:47:18
19	948	334.950157920127	276.9326628048181	21/02/24 15:47:18
19	948	334.9996320543162	277.05481898604637	21/02/24 15:47:18
19	948	335.0178395170712	277.1440376792646	21/02/24 15:47:18
19	948	335.18798567272336	277.1066802305546	21/02/24 15:47:18
19	948	335.1327386881571	277.0982837067322	21/02/24 15:47:18
19	948	334.9117091990556	277.0103546933225	21/02/24 15:47:18
19	948	335.0594794629331	276.98780758293896	21/02/24 15:47:18
19	948	335.0594794629331	276.98780758293896	21/02/24 15:47:18
19	948	335.1464631242222	277.07205124876396	21/02/24 15:47:18
19	948	334.88054572352377	277.0215582257744	21/02/24 15:47:19
19	948	335.055201596947	277.01038411829836	21/02/24 15:47:19
19	948	334.9153657376279	276.8459747747293	21/02/24 15:47:19
19	948	335.14639470285795	276.86011543050745	21/02/24 15:47:19
19	948	335.0427847698083	276.7359910772179	21/02/24 15:47:19
19	948	334.83879725253723	276.53644504889667	21/02/24 15:47:19
19	948	334.8328432279485	276.63363271208294	21/02/24 15:47:19
19	948	335.08815756770326	276.60207608915675	21/02/24 15:47:19
19	948	335.01228406254893	276.6104715825762	21/02/24 15:47:19
19	948	335.0694141649111	276.6435891770734	21/02/24 15:47:20
19	948	335.3014913255282	276.638775260028	21/02/24 15:47:20
19	948	335.18370208616375	276.5269922136642	21/02/24 15:47:20
19	948	335.0143264107852	276.6586534366642	21/02/24 15:47:20
19	948	334.9749919163208	276.60346126519244	21/02/24 15:47:20
19	948	335.01229089526294	276.58430767840855	21/02/24 15:47:20
19	948	335.17510323410727	276.7845454636476	21/02/24 15:47:20
19	948	334.9720069609149	276.97884416558753	21/02/24 15:47:20
19	948	334.9720069609149	276.97884416558753	21/02/24 15:47:20
19	948	335.017363748576	276.93187569834265	21/02/24 15:47:20
19	948	334.98585703763786	276.7834441679363	21/02/24 15:47:21
19	948	334.98585703763786	276.7834441679363	21/02/24 15:47:21
19	948	335.15337238791903	276.82680091300085	21/02/24 15:47:21
19	948	335.1906214059829	276.8124314764407	21/02/24 15:47:21
19	948	334.7131395566647	276.7591165874385	21/02/24 15:47:21
19	948	334.7131395566647	276.7591165874385	21/02/24 15:47:21
19	948	334.81134479945075	276.9202368200217	21/02/24 15:47:21
19	948	334.7784865055126	276.68431996362506	21/02/24 15:47:21
19	948	334.9817056353188	276.489568648679	21/02/24 15:47:21
19	948	334.77507783575544	276.6131725474638	21/02/24 15:47:21
19	948	334.77507783575544	276.6131725474638	21/02/24 15:47:22
19	948	334.82811217790265	276.62549912690406	21/02/24 15:47:22
19	948	334.7982733492717	276.5132918741816	21/02/24 15:47:22
19	948	334.77943368941635	276.2669152687191	21/02/24 15:47:22
19	948	334.7852116054238	276.06026718731835	21/02/24 15:47:22
19	948	334.56663526844756	276.0861970646321	21/02/24 15:47:22
19	948	334.70934959438085	276.07895383245807	21/02/24 15:47:22
19	948	334.6865849607156	276.0531246025019	21/02/24 15:47:22
19	948	334.47568075054295	276.0253225508884	21/02/24 15:47:22
19	948	334.49521273966224	276.080078364966	21/02/24 15:47:23
19	948	334.45796080607215	276.1223991866772	21/02/24 15:47:23
19	948	334.47914436536826	276.0995186737031	21/02/24 15:47:23
19	948	334.3185181526058	276.30219364712553	21/02/24 15:47:23
19	948	334.39371078617177	276.32151932845227	21/02/24 15:47:23
19	948	334.1011767553375	276.3135964539766	21/02/24 15:47:23
19	948	334.23146340788924	276.4380176208369	21/02/24 15:47:23
19	948	334.329333249013	276.2097476609781	21/02/24 15:47:23
19	948	334.4429719467235	276.09595656579484	21/02/24 15:47:23
19	948	334.29257325724126	276.08812762001696	21/02/24 15:47:23
19	948	334.31208121458735	276.10882061279426	21/02/24 15:47:24
19	948	334.21721701213926	275.990587479584	21/02/24 15:47:24
19	948	334.2181505207514	276.1308290993494	21/02/24 15:47:24
19	948	334.2565524882997	276.1044924677403	21/02/24 15:47:24
19	948	334.1139332342666	275.97208576308816	21/02/24 15:47:24
19	948	334.0956306259293	275.819914313377	21/02/24 15:47:24
19	948	334.16682998665374	275.9322009794951	21/02/24 15:47:24
19	948	334.09677586008866	276.17835770160536	21/02/24 15:47:24
19	948	334.03921252575	275.94494666275347	21/02/24 15:47:24
19	948	333.99970984026305	275.96870086057436	21/02/24 15:47:24
19	948	333.97875852071286	275.9732725612315	21/02/24 15:47:25
19	948	333.99288436680695	275.97330291694107	21/02/24 15:47:25
19	948	333.96493281880004	276.13145017451535	21/02/24 15:47:25
19	948	334.001369819536	276.1081981062113	21/02/24 15:47:25
19	948	334.00167172346255	276.02764517625695	21/02/24 15:47:25
19	948	333.9117063314787	276.0569457687286	21/02/24 15:47:25
19	948	333.882827790407	276.11170034151684	21/02/24 15:47:25
19	948	334.02100197517603	276.2411701414362	21/02/24 15:47:25
19	948	334.04893727444676	275.9987888598718	21/02/24 15:47:25
19	948	334.1845403033414	276.01065468523524	21/02/24 15:47:26
19	948	334.3576964539034	276.0433254312306	21/02/24 15:47:26
19	948	334.35361597425265	276.02516405678085	21/02/24 15:47:26
19	948	334.5707015385902	276.19104388425194	21/02/24 15:47:26
19	948	334.7132959309914	276.4405740425254	21/02/24 15:47:26
19	948	334.7581040857641	276.50491699577714	21/02/24 15:47:26
19	948	334.5985622335519	276.5290899223955	21/02/24 15:47:26
19	948	334.66835702600343	276.80643632920373	21/02/24 15:47:26
19	948	334.6715382261038	276.80537896937795	21/02/24 15:47:26
19	948	334.67028002607884	276.82566572936594	21/02/24 15:47:26
19	948	334.4506489265137	276.9302979646937	21/02/24 15:47:27
19	948	334.5127443400863	276.91889759082926	21/02/24 15:47:27
19	948	334.44635297358843	276.91206446201846	21/02/24 15:47:27
19	948	334.4767902133739	276.9400266368489	21/02/24 15:47:27
19	948	334.5967739983758	276.7787960953824	21/02/24 15:47:27
19	948	334.66178667481284	276.7189791260444	21/02/24 15:47:27
19	948	334.57035441798286	276.61380843370773	21/02/24 15:47:27
19	948	334.5901695106821	276.57970435212286	21/02/24 15:47:27
19	948	334.6212368172686	276.55718303231095	21/02/24 15:47:27
19	948	334.48201832824884	276.4206510359974	21/02/24 15:47:27
19	948	334.2758327638226	276.4152593667158	21/02/24 15:47:28
19	948	334.2758327638226	276.4152593667158	21/02/24 15:47:28
19	948	334.28162497833557	276.43062438192277	21/02/24 15:47:28
19	948	334.2078884181869	276.3384808587983	21/02/24 15:47:28
19	948	334.2665976831875	276.68168987256286	21/02/24 15:47:28
19	948	334.39104551102076	276.67644738903624	21/02/24 15:47:28
19	948	334.36301083459	276.6981078341161	21/02/24 15:47:28
19	948	334.36301083459	276.6981078341161	21/02/24 15:47:28
19	948	334.2866536328618	276.829205913184	21/02/24 15:47:28
19	948	334.3299546795535	276.83396376265614	21/02/24 15:47:28
19	948	334.53456364325865	277.0413261095748	21/02/24 15:47:29
19	948	334.54816702056803	277.3006872003218	21/02/24 15:47:29
19	948	334.6170906318348	277.3207132508417	21/02/24 15:47:29
19	948	334.631456801104	277.5205857105488	21/02/24 15:47:29
19	948	334.6687193043705	277.39864684439254	21/02/24 15:47:29
19	948	334.6687193043705	277.39864684439254	21/02/24 15:47:29
19	948	334.7998531134251	277.63691295249686	21/02/24 15:47:29
19	948	334.7307252130079	277.6513087918467	21/02/24 15:47:29
19	948	335.00764176666297	277.57668102297265	21/02/24 15:47:29
19	948	334.9983405220937	277.5892549650886	21/02/24 15:47:30
19	948	334.54995891788957	277.47973199389907	21/02/24 15:47:30
19	948	334.54995891788957	277.47973199389907	21/02/24 15:47:30
19	948	334.57249590429126	277.448702023397	21/02/24 15:47:30
19	948	334.5486155508646	277.6616560851809	21/02/24 15:47:30
19	948	334.54868459892384	277.6623412655018	21/02/24 15:47:30
19	948	334.54868459892384	277.6623412655018	21/02/24 15:47:30
19	948	334.5062823219481	277.56799697889807	21/02/24 15:47:30
19	948	334.5640429977715	277.7232481921855	21/02/24 15:47:30
19	948	334.64471421375146	277.72972736470865	21/02/24 15:47:30
19	948	334.4739418763304	277.6596361280025	21/02/24 15:47:31
19	948	334.37579115704136	277.831351097135	21/02/24 15:47:31
19	948	334.3684599142267	277.7915249815144	21/02/24 15:47:31
19	948	334.3690782045527	277.9501537422987	21/02/24 15:47:31
19	948	334.3021165233469	277.7142118742976	21/02/24 15:47:31
19	948	334.43952122782616	277.66165195607095	21/02/24 15:47:31
19	948	334.35837436021353	277.7089374587927	21/02/24 15:47:31
19	948	334.4074003793171	277.7051738475674	21/02/24 15:47:31
19	948	334.2376916368473	277.7374652099382	21/02/24 15:47:31
19	948	334.4971269540887	277.70668587627364	21/02/24 15:47:31
19	948	334.33655686629	277.5392316690717	21/02/24 15:47:32
19	948	334.47166482912115	277.40902070051993	21/02/24 15:47:32
19	948	334.47166482912115	277.40902070051993	21/02/24 15:47:32
19	948	334.5433500247457	277.5122494331449	21/02/24 15:47:32
19	948	334.58044341966456	277.61204063678014	21/02/24 15:47:32
19	948	334.59166668264066	277.6686650397161	21/02/24 15:47:32
19	948	334.5858262894955	277.66786782057227	21/02/24 15:47:32
19	948	334.4786193538525	277.8990292426981	21/02/24 15:47:32
19	948	334.3057549950601	277.73510745220403	21/02/24 15:47:32
19	948	334.312281992867	277.7265535071856	21/02/24 15:47:33
19	948	334.4608567452934	277.7341374100236	21/02/24 15:47:33
19	948	334.4860977651997	277.7305831430599	21/02/24 15:47:33
19	948	334.37148968231173	277.81647284345206	21/02/24 15:47:33
19	948	334.4933727446842	277.67039645034095	21/02/24 15:47:33
19	948	334.6129142307798	277.6498095701639	21/02/24 15:47:33
19	948	334.6236453975989	277.67325886179003	21/02/24 15:47:33
19	948	334.67712624002314	277.4787962193148	21/02/24 15:47:33
19	948	334.8400909008586	277.4826634888417	21/02/24 15:47:33
19	948	334.8400909008586	277.4826634888417	21/02/24 15:47:33
19	948	334.7799825124264	277.42957096840877	21/02/24 15:47:34
19	948	334.86119281158	277.5556092872361	21/02/24 15:47:34
19	948	334.8249980500499	277.4870873115819	21/02/24 15:47:34
19	948	334.82895744066735	277.4858157271943	21/02/24 15:47:34
19	948	334.67441936458704	277.41460057746457	21/02/24 15:47:34
19	948	334.46894933373335	277.5575103141669	21/02/24 15:47:34
19	948	334.7441167100214	277.5324801375686	21/02/24 15:47:34
19	948	334.75578833612417	277.5251631487422	21/02/24 15:47:34
19	948	334.7474223566241	277.2866685079564	21/02/24 15:47:34
19	948	334.7213892445053	277.23658627768276	21/02/24 15:47:34
19	948	334.8831204230825	277.1923443442857	21/02/24 15:47:35
19	948	334.7679703391638	277.3696479412271	21/02/24 15:47:35
19	948	334.723945072898	277.41160044213603	21/02/24 15:47:35
19	948	334.7005125887627	277.4607384002983	21/02/24 15:47:35
19	948	334.4899895992908	277.4511789540936	21/02/24 15:47:35
19	948	334.40233728640516	277.3897279862475	21/02/24 15:47:35
19	948	334.4019073981033	277.3896299523377	21/02/24 15:47:35
19	948	334.1253902175752	277.37551303598275	21/02/24 15:47:35
19	948	334.2937103734949	277.48447669201096	21/02/24 15:47:35
19	948	334.0942813334992	277.4881014199054	21/02/24 15:47:35
19	948	334.3546664686168	277.50339538124445	21/02/24 15:47:36
19	948	334.3083678751973	277.78238591984933	21/02/24 15:47:36
19	948	334.1394069031898	277.93700847680367	21/02/24 15:47:36
19	948	334.2521261547791	277.9837459992886	21/02/24 15:47:36
19	948	334.1624160303555	278.0387554469357	21/02/24 15:47:36
19	948	334.2505370217572	278.08679400898075	21/02/24 15:47:36
19	948	334.2636682483302	278.35871426187765	21/02/24 15:47:36
19	948	334.22152128101663	278.29934809084597	21/02/24 15:47:36
19	948	334.1126473834614	278.1068266258543	21/02/24 15:47:36
19	948	334.19285346814047	278.12015256749334	21/02/24 15:47:37
19	948	334.20052283510523	278.1269815110774	21/02/24 15:47:37
19	948	334.33602255332653	278.19435684395506	21/02/24 15:47:37
19	948	334.25553145503494	278.36109175479044	21/02/24 15:47:37
19	948	334.4995887538737	278.413217797294	21/02/24 15:47:37
19	948	334.39565458097013	278.35454822004743	21/02/24 15:47:37
19	948	334.5207557473392	278.20676569924325	21/02/24 15:47:37
19	948	334.4199533000652	278.13551423574347	21/02/24 15:47:37
19	948	334.4158202340555	278.1307212256672	21/02/24 15:47:37
19	948	334.2957982534483	278.1595928080791	21/02/24 15:47:37
19	948	334.3637136014119	278.1097337735552	21/02/24 15:47:38
19	948	334.2244849087813	277.9621712817164	21/02/24 15:47:38
19	948	334.268970798689	277.91301798721935	21/02/24 15:47:38
19	948	334.3437201028185	277.99279938555355	21/02/24 15:47:38
19	948	334.53498083715937	277.9011581856508	21/02/24 15:47:38
19	948	334.45687119049734	277.95026254180135	21/02/24 15:47:38
19	948	334.3819922157423	277.9460586987232	21/02/24 15:47:38
19	948	334.4972658012899	277.88646523368254	21/02/24 15:47:38
19	948	334.2770373420539	277.94918334212275	21/02/24 15:47:38
19	948	334.34250554497004	277.7468927343843	21/02/24 15:47:38
19	948	334.45252014115704	277.8495836726227	21/02/24 15:47:39
19	948	334.46803457725724	277.8492171730308	21/02/24 15:47:39
19	948	334.5349811341116	277.8376645109652	21/02/24 15:47:39
19	948	334.6844178381111	277.7883554432495	21/02/24 15:47:39
19	948	334.91306774368024	277.74778378435633	21/02/24 15:47:39
19	948	334.75335206028177	277.60948459163035	21/02/24 15:47:39
19	948	334.81914784509	277.7838061669887	21/02/24 15:47:39
19	948	334.83094514404667	277.5303570811039	21/02/24 15:47:39
19	948	334.81395244320777	277.4474772432615	21/02/24 15:47:39
19	948	334.7602844592362	277.42665856754405	21/02/24 15:47:40
19	948	334.7169385712082	277.60449466550745	21/02/24 15:47:40
19	948	334.7134847629363	277.6137514550514	21/02/24 15:47:40
19	948	334.69056813089264	277.62564071931354	21/02/24 15:47:40
19	948	334.835188524351	277.80084474021464	21/02/24 15:47:40
19	948	335.041690510511	277.7272310331556	21/02/24 15:47:40
19	948	334.92486554032985	277.58506179582815	21/02/24 15:47:40
19	948	334.650221163522	277.61888048907196	21/02/24 15:47:40
19	948	334.7445365487753	277.672603003599	21/02/24 15:47:40
19	948	334.99708539268454	277.5243646791712	21/02/24 15:47:40
19	948	335.01320595001886	277.48918561223695	21/02/24 15:47:41
19	948	335.05922465793816	277.3561719195925	21/02/24 15:47:41
19	948	334.7832030305547	277.3378216962855	21/02/24 15:47:41
19	948	334.6400540836562	277.3872295810547	21/02/24 15:47:41
19	948	334.57106108003677	277.5383901936182	21/02/24 15:47:41
19	948	334.73368004337937	277.33493779173926	21/02/24 15:47:41
19	948	334.5047904382529	277.1719394384176	21/02/24 15:47:41
19	948	334.54435341025385	277.36041477076435	21/02/24 15:47:41
19	948	334.61363444679256	277.19553042687323	21/02/24 15:47:41
19	948	334.64519509012126	277.03664134743707	21/02/24 15:47:41
19	948	334.6641939703892	276.9843296041307	21/02/24 15:47:42
19	948	334.8375251681252	277.157570790235	21/02/24 15:47:42
19	948	334.9605309823066	277.42198603529977	21/02/24 15:47:42
19	948	334.9592595464777	277.41987394102154	21/02/24 15:47:42
19	948	335.1908667576159	277.2952634839079	21/02/24 15:47:42
19	948	335.18309877240944	277.2089956289933	21/02/24 15:47:42
19	948	335.18309877240944	277.2089956289933	21/02/24 15:47:42
19	948	335.18309877240944	277.2089956289933	21/02/24 15:47:42
19	948	335.16455010687866	277.41448861126014	21/02/24 15:47:42
19	948	335.16455010687866	277.41448861126014	21/02/24 15:47:42
19	948	335.1473193469624	277.60538106312146	21/02/24 15:47:43
19	948	335.1255846945964	277.8461702738499	21/02/24 15:47:43
19	948	335.1002010060925	278.1273856444623	21/02/24 15:47:43
19	948	335.0865966934458	278.27810218915494	21/02/24 15:47:43
19	948	335.07058551281483	278.45548342728335	21/02/24 15:47:43
19	948	335.0514107074173	278.6679131537775	21/02/24 15:47:43
19	948	335.03157112634176	278.8877076546472	21/02/24 15:47:43
19	948	335.01601608342673	279.0600355319598	21/02/24 15:47:43
19	948	334.99239326630743	279.3217429378833	21/02/24 15:47:43
19	948	334.97866597972404	279.47382185988306	21/02/24 15:47:44
19	948	334.96226219483793	279.65555259793103	21/02/24 15:47:44
19	948	334.9445929224805	279.851303147489	21/02/24 15:47:44
19	948	334.92552019289644	280.06260201832737	21/02/24 15:47:44
19	948	334.90141030324617	280.32970549906776	21/02/24 15:47:44
19	948	334.884855395943	280.51311045977735	21/02/24 15:47:44
19	964	334.9387341913067	280.6552278537159	21/02/24 15:47:44
19	964	335.11797542514114	280.66115600506845	21/02/24 15:47:44
19	964	335.2887912427166	280.66680549764516	21/02/24 15:47:44
19	964	335.5481603912135	280.67538376691704	21/02/24 15:47:44
19	964	335.72735251052575	280.68131029387587	21/02/24 15:47:45
19	964	335.9975528152562	280.6902467883848	21/02/24 15:47:45
19	964	336.2289864329303	280.69790112932117	21/02/24 15:47:45
19	964	336.45161513224826	280.7052642599844	21/02/24 15:47:45
19	964	336.7418606495935	280.71486372166737	21/02/24 15:47:45
19	964	336.9693810626988	280.7223886388743	21/02/24 15:47:45
19	964	337.2239246568959	280.73080730973436	21/02/24 15:47:45
19	964	337.4668146055104	280.73884055268064	21/02/24 15:47:45
19	964	337.6827774389549	280.74598321921883	21/02/24 15:47:45
19	964	337.8363894702849	280.75106372079654	21/02/24 15:47:45
19	964	338.0030169693458	280.75657469063754	21/02/24 15:47:46
19	964	338.22488663074523	280.76391271719075	21/02/24 15:47:46
19	964	338.3899635747654	280.7693724046077	21/02/24 15:47:46
19	964	338.5510347758588	280.7746996077193	21/02/24 15:47:46
19	964	338.8191511941163	280.7835671806182	21/02/24 15:47:46
19	964	339.22377535220033	280.7969495547443	21/02/24 15:47:46
19	964	339.39057348829715	280.80246616816487	21/02/24 15:47:46
19	964	339.5484610068976	280.8076880754621	21/02/24 15:47:46
19	964	339.79165726056885	280.81573144901677	21/02/24 15:47:46
19	964	340.04128378551275	280.82398749473685	21/02/24 15:47:46
19	964	340.2540971808171	280.8310259980445	21/02/24 15:47:47
19	964	340.48312163118044	280.8386006591653	21/02/24 15:47:47
19	964	340.6826816976121	280.84520082728744	21/02/24 15:47:47
19	964	340.9041350372988	280.8525250845864	21/02/24 15:47:47
19	964	341.0636678199688	280.85780140667543	21/02/24 15:47:47
19	964	341.217055585998	280.8628744909942	21/02/24 15:47:47
19	964	341.4305617749184	280.8699359074749	21/02/24 15:47:47
19	964	341.66887924843985	280.8778179222477	21/02/24 15:47:47
19	964	341.8631754264225	280.8842439946734	21/02/24 15:47:47
19	964	342.1374194034577	280.8933142279484	21/02/24 15:47:48
19	964	342.1374194034577	280.8933142279484	21/02/24 15:47:48
19	964	342.3345510242808	280.8998340786524	21/02/24 15:47:48
19	964	342.8780209776476	280.91780858189685	21/02/24 15:47:48
19	964	343.073209333863	280.924264161861	21/02/24 15:47:48
19	964	343.2996582538687	280.9317536409428	21/02/24 15:47:48
19	964	343.54542030651845	280.9398818746848	21/02/24 15:47:48
19	964	343.74944378128725	280.946629663751	21/02/24 15:47:48
19	964	344.01977519474696	280.9555704944965	21/02/24 15:47:48
19	964	344.2550655608229	280.9633523919542	21/02/24 15:47:48
19	964	344.45450302864066	280.9699485052998	21/02/24 15:47:49
19	964	344.6329218921024	280.9758494579105	21/02/24 15:47:49
19	964	344.8446468174215	280.9828519616064	21/02/24 15:47:49
19	964	345.0448619784981	280.9894737960612	21/02/24 15:47:49
19	964	345.2108433964961	280.994963397681	21/02/24 15:47:49
19	964	345.3784856106853	281.00050792779564	21/02/24 15:47:49
19	964	345.63558705819435	281.00901119605135	21/02/24 15:47:49
19	964	345.820458519752	281.01512555925575	21/02/24 15:47:49
19	964	345.98801164484155	281.0206671428739	21/02/24 15:47:49
19	964	346.2233768621818	281.0284515159317	21/02/24 15:47:49
19	964	346.4097845040898	281.03461668613755	21/02/24 15:47:50
19	964	346.6927872502275	281.0439766033641	21/02/24 15:47:50
19	964	346.86251249245214	281.04959002669716	21/02/24 15:47:50
19	964	347.103819273811	281.05757090861636	21/02/24 15:47:50
19	964	347.37940780797106	281.0666856112245	21/02/24 15:47:50
19	964	347.55834939709064	281.0726038522501	21/02/24 15:47:50
19	964	347.7913619285358	281.0803104135356	21/02/24 15:47:50
19	964	348.0655591129043	281.08937909920905	21/02/24 15:47:50
19	964	348.28251847232235	281.09655472444024	21/02/24 15:47:50
19	964	348.5309379781712	281.1047708497038	21/02/24 15:47:51
19	964	348.7096724504893	281.1106822406329	21/02/24 15:47:51
19	964	348.9721928558425	281.1193647332869	21/02/24 15:47:51
19	964	349.2394000013911	281.1282022332717	21/02/24 15:47:51
19	964	349.524596303	281.1376346992559	21/02/24 15:47:51
19	964	349.7776052519398	281.1460026138856	21/02/24 15:47:51
19	964	349.96861556238	281.1523200108704	21/02/24 15:47:51
19	964	350.1984391383249	281.15992110194435	21/02/24 15:47:51
19	964	350.43015990709176	281.1675849399987	21/02/24 15:47:51
19	964	350.6736828175618	281.1756391172668	21/02/24 15:47:51
19	964	350.87302062231174	281.18223193439684	21/02/24 15:47:52
19	964	351.1502583614924	281.1914011821382	21/02/24 15:47:52
19	964	351.3113555299132	281.1967292440826	21/02/24 15:47:52
19	964	351.54203524247487	281.20435865066923	21/02/24 15:47:52
19	964	351.83998333980736	281.21421286433645	21/02/24 15:47:52
19	964	352.05447102070906	281.22130674228197	21/02/24 15:47:52
19	964	352.26137121643075	281.228149674842	21/02/24 15:47:52
19	964	352.4634115344421	281.23483187379173	21/02/24 15:47:52
19	964	352.6569675477383	281.2412334663129	21/02/24 15:47:52
19	964	352.90043079688746	281.24928567036693	21/02/24 15:47:52
19	964	352.90043079688746	281.24928567036693	21/02/24 15:47:53
19	964	353.0553855449614	281.2544105804098	21/02/24 15:47:53
19	964	353.4545309654245	281.2676117530057	21/02/24 15:47:53
19	964	353.65213228766265	281.27414713842245	21/02/24 15:47:53
19	964	353.8171030725161	281.2796033147745	21/02/24 15:47:53
19	964	353.97381510541595	281.28478634453785	21/02/24 15:47:53
19	964	354.22732186646925	281.29317072360203	21/02/24 15:47:53
19	964	354.5249222386135	281.30301343674836	21/02/24 15:47:53
19	964	354.7718875264253	281.3111814657986	21/02/24 15:47:53
19	964	355.0157696463094	281.3192475234122	21/02/24 15:47:53
19	964	355.20002443010594	281.3253414908682	21/02/24 15:47:54
19	964	355.4414121458945	281.3333250495796	21/02/24 15:47:54
19	964	355.59355570990726	281.33835698366914	21/02/24 15:47:54
19	964	355.84364429447703	281.3466283113606	21/02/24 15:47:54
19	964	356.10123228904007	281.3551476714748	21/02/24 15:47:54
19	964	356.26687541486154	281.36062608455734	21/02/24 15:47:54
19	964	356.45843478261963	281.36696164083963	21/02/24 15:47:54
19	918	356.5460728806774	281.4649343232335	21/02/24 15:47:54
19	918	356.63525451406315	281.6687089932309	21/02/24 15:47:54
19	918	356.71099377136983	281.84176864214714	21/02/24 15:47:55
19	918	356.79092195563715	282.0243997372978	21/02/24 15:47:55
19	918	356.86119663430514	282.1849731525974	21/02/24 15:47:55
19	918	356.9214670990519	282.32268754061755	21/02/24 15:47:55
19	918	356.99275910780085	282.48558549398246	21/02/24 15:47:55
19	918	357.10879840129024	282.75072830242664	21/02/24 15:47:55
19	918	357.20020367737004	282.95958386227744	21/02/24 15:47:55
19	990	357.3006087239287	283.1556384979251	21/02/24 15:47:55
19	990	357.3006087239287	283.1556384979251	21/02/24 15:47:55
19	990	357.3891782107711	283.286054361853	21/02/24 15:47:55
19	990	357.4735691779722	283.4103174832464	21/02/24 15:47:56
19	990	357.58430242808987	283.5733688115818	21/02/24 15:47:56
19	990	357.6793270721499	283.7132896973331	21/02/24 15:47:56
19	990	357.8147825405667	283.91274373694796	21/02/24 15:47:56
19	990	357.91757864525596	284.0641078610884	21/02/24 15:47:56
19	990	358.0402629828124	284.2447568006189	21/02/24 15:47:56
19	990	358.1835476446269	284.45573908836104	21/02/24 15:47:56
19	990	358.29109013460493	284.6140921198559	21/02/24 15:47:56
19	990	358.44722881108044	284.8440015515471	21/02/24 15:47:56
19	990	358.57474386801044	285.03176357779574	21/02/24 15:47:56
19	918	358.6522583836537	285.1459013343186	21/02/24 15:47:57
19	918	358.49965048732224	285.2252951615195	21/02/24 15:47:57
19	918	358.42597943872175	285.3309230866445	21/02/24 15:47:57
19	918	358.4669087930378	285.34266930292097	21/02/24 15:47:57
19	918	358.6152901973145	285.33847901152245	21/02/24 15:47:57
19	918	358.7967898617034	285.44247711314716	21/02/24 15:47:57
19	918	358.7967898617034	285.44247711314716	21/02/24 15:47:57
19	918	358.7267875217264	285.48043786177413	21/02/24 15:47:57
19	918	358.60837051426284	285.3406532611837	21/02/24 15:47:57
19	918	358.36290813179886	285.1082539080091	21/02/24 15:47:57
19	918	358.14673986243815	284.9096493857532	21/02/24 15:47:58
19	918	358.14673986243815	284.9096493857532	21/02/24 15:47:58
19	918	358.09956816277514	284.963740324682	21/02/24 15:47:58
19	918	357.88438547218243	285.0528818650777	21/02/24 15:47:58
19	918	357.70659669898083	284.984029306041	21/02/24 15:47:58
19	918	357.70659669898083	284.984029306041	21/02/24 15:47:58
19	918	357.61992862890446	284.9317233218233	21/02/24 15:47:58
19	918	357.62288303801097	284.96331347723077	21/02/24 15:47:58
19	918	357.4057269756903	284.8729903431884	21/02/24 15:47:58
19	918	357.6371067489349	285.03156082266344	21/02/24 15:47:59
19	918	357.63518344469	285.03249911810497	21/02/24 15:47:59
19	918	357.5077967029441	285.05209405665136	21/02/24 15:47:59
19	918	357.72123590441214	285.14446190405187	21/02/24 15:47:59
19	918	357.70236825274884	285.14922711375135	21/02/24 15:47:59
19	918	357.6954328967711	284.9279839250237	21/02/24 15:47:59
19	918	357.76935918992564	285.0626419187374	21/02/24 15:47:59
19	918	357.9117829952715	284.9961877696026	21/02/24 15:47:59
19	918	357.8348102830208	284.7929149103722	21/02/24 15:47:59
19	918	357.8730126540342	284.73835731061246	21/02/24 15:47:59
19	918	357.92385542997164	284.9008097223881	21/02/24 15:48:00
