stationId	t_start	t_end	t_max	timeStamp
11	20/04/28 05:13:39	20/04/28 05:11:17	20/04/28 05:13:39
66	20/04/28 05:13:41	20/04/28 05:13:41	20/04/28 05:13:41
16	20/04/28 05:13:43	20/04/28 05:13:43	20/04/28 05:13:43
147	20/04/28 05:13:45	20/04/28 05:13:45	20/04/28 05:13:45
39	20/04/28 05:13:47	20/04/28 05:13:47	20/04/28 05:13:47
41	20/04/28 05:13:49	20/04/28 05:13:49	20/04/28 05:13:49
6	20/04/28 05:13:51	20/04/28 05:13:51	20/04/28 05:13:51
95	20/04/28 05:09:01	20/04/28 05:09:01	20/04/28 05:13:53
150	20/04/28 05:13:55	20/04/28 05:13:55	20/04/28 05:13:55
26	20/04/28 05:13:57	20/04/28 05:13:57	20/04/28 05:13:57
95	20/04/28 05:13:59	20/04/28 05:14:00	20/04/28 05:13:59
26	20/04/28 05:14:02	20/04/28 05:14:02	20/04/28 05:14:02
25	20/04/28 05:14:04	20/04/28 05:14:04	20/04/28 05:14:04
6	20/04/28 05:14:06	20/04/28 05:14:06	20/04/28 05:14:06
151	20/04/28 05:14:08	20/04/28 05:14:08	20/04/28 05:14:08
40	20/04/28 05:14:10	20/04/28 05:14:10	20/04/28 05:14:10
26	20/04/28 05:14:12	20/04/28 05:14:12	20/04/28 05:14:12
135	20/04/28 05:14:14	20/04/28 05:14:14	20/04/28 05:14:14
99	20/04/28 05:14:16	20/04/28 05:14:16	20/04/28 05:14:16
14	20/04/28 05:14:18	20/04/28 05:14:18	20/04/28 05:14:18
11	20/04/28 05:14:20	20/04/28 05:14:20	20/04/28 05:14:20
33	20/04/28 05:14:22	20/04/28 05:14:22	20/04/28 05:14:22
18	20/04/28 05:14:24	20/04/28 05:14:24	20/04/28 05:14:24
62	20/04/28 05:14:26	20/04/28 05:14:26	20/04/28 05:14:26
135	20/04/28 05:14:28	20/04/28 05:14:28	20/04/28 05:14:28
62	20/04/28 05:14:30	20/04/28 05:14:30	20/04/28 05:14:30
62	20/04/28 05:14:33	20/04/28 05:14:33	20/04/28 05:14:33
156	20/04/28 05:14:35	20/04/28 05:14:35	20/04/28 05:14:35
156	20/04/28 05:14:37	20/04/28 05:14:37	20/04/28 05:14:37
18	20/04/28 05:14:39	20/04/28 05:14:39	20/04/28 05:14:39
33	20/04/28 05:14:41	20/04/28 05:14:41	20/04/28 05:14:41
11	20/04/28 05:14:43	20/04/28 05:14:43	20/04/28 05:14:43
108	20/04/28 05:14:45	20/04/28 05:14:45	20/04/28 05:14:45
89	20/04/28 05:14:47	20/04/28 05:14:47	20/04/28 05:14:47
32	20/04/28 05:14:49	20/04/28 05:14:49	20/04/28 05:14:49
12	20/04/28 05:14:51	20/04/28 05:14:51	20/04/28 05:14:51
105	20/04/28 05:14:53	20/04/28 05:14:53	20/04/28 05:14:53
40	20/04/28 05:14:55	20/04/28 05:14:55	20/04/28 05:14:55
26	20/04/28 05:14:57	20/04/28 05:14:57	20/04/28 05:14:57
152	20/04/28 05:14:59	20/04/28 05:15:00	20/04/28 05:14:59
62	20/04/28 05:15:02	20/04/28 05:15:02	20/04/28 05:15:02
23	20/04/28 05:15:04	20/04/28 05:15:04	20/04/28 05:15:04
120	20/04/28 05:15:06	20/04/28 05:15:06	20/04/28 05:15:06
120	20/04/28 05:15:08	20/04/28 05:15:08	20/04/28 05:15:08
97	20/04/28 05:15:10	20/04/28 05:15:10	20/04/28 05:15:10
97	20/04/28 05:15:12	20/04/28 05:15:12	20/04/28 05:15:12
120	20/04/28 05:15:14	20/04/28 05:15:15	20/04/28 05:15:15
23	20/04/28 05:15:17	20/04/28 05:15:19	20/04/28 05:15:18
23	20/04/28 05:15:21	20/04/28 05:15:21	20/04/28 05:15:21
120	20/04/28 05:15:23	20/04/28 05:15:24	20/04/28 05:15:24
23	20/04/28 05:15:26	20/04/28 05:15:26	20/04/28 05:15:26
120	20/04/28 05:15:28	20/04/28 05:15:29	20/04/28 05:15:29
120	20/04/28 05:15:31	20/04/28 05:15:34	20/04/28 05:15:33
98	20/04/28 05:15:36	20/04/28 05:15:36	20/04/28 05:15:36
158	20/04/28 05:15:38	20/04/28 05:15:38	20/04/28 05:15:38
25	20/04/28 05:15:40	20/04/28 05:15:40	20/04/28 05:15:40
39	20/04/28 05:15:42	20/04/28 05:15:42	20/04/28 05:15:42
158	20/04/28 05:15:44	20/04/28 05:15:44	20/04/28 05:15:44
26	20/04/28 05:15:46	20/04/28 05:15:46	20/04/28 05:15:46
19	20/04/28 05:15:48	20/04/28 05:15:48	20/04/28 05:15:48
25	20/04/28 05:15:50	20/04/28 05:15:50	20/04/28 05:15:50
65	20/04/28 05:15:52	20/04/28 05:15:52	20/04/28 05:15:52
87	20/04/28 05:15:54	20/04/28 05:15:54	20/04/28 05:15:54
117	20/04/28 05:15:56	20/04/28 05:15:56	20/04/28 05:15:56
91	20/04/28 05:15:58	20/04/28 05:15:59	20/04/28 05:15:58
101	20/04/28 05:16:01	20/04/28 05:16:02	20/04/28 05:16:02
127	20/04/28 05:16:04	20/04/28 05:16:04	20/04/28 05:16:04
101	20/04/28 05:16:06	20/04/28 05:16:06	20/04/28 05:16:06
101	20/04/28 05:16:08	20/04/28 05:16:08	20/04/28 05:16:08
147	20/04/28 05:16:10	20/04/28 05:16:10	20/04/28 05:16:10
118	20/04/28 05:16:12	20/04/28 05:16:12	20/04/28 05:16:12
25	20/04/28 05:16:14	20/04/28 05:16:14	20/04/28 05:16:14
147	20/04/28 05:16:16	20/04/28 05:16:16	20/04/28 05:16:16
127	20/04/28 05:16:18	20/04/28 05:16:18	20/04/28 05:16:18
101	20/04/28 05:16:20	20/04/28 05:16:23	20/04/28 05:16:20
100	20/04/28 05:16:25	20/04/28 05:16:25	20/04/28 05:16:25
147	20/04/28 05:16:27	20/04/28 05:16:27	20/04/28 05:16:27
25	20/04/28 05:16:29	20/04/28 05:16:29	20/04/28 05:16:29
142	20/04/28 05:16:31	20/04/28 05:16:31	20/04/28 05:16:31
97	20/04/28 05:16:33	20/04/28 05:16:33	20/04/28 05:16:33
94	20/04/28 05:16:35	20/04/28 05:16:35	20/04/28 05:16:35
24	20/04/28 05:16:37	20/04/28 05:16:37	20/04/28 05:16:37
76	20/04/28 05:16:39	20/04/28 05:16:39	20/04/28 05:16:39
86	20/04/28 05:16:41	20/04/28 05:16:41	20/04/28 05:16:41
87	20/04/28 05:16:43	20/04/28 05:16:43	20/04/28 05:16:43
150	20/04/28 05:16:45	20/04/28 05:16:45	20/04/28 05:16:45
109	20/04/28 05:16:47	20/04/28 05:16:47	20/04/28 05:16:47
96	20/04/28 05:16:49	20/04/28 05:16:49	20/04/28 05:16:49
97	20/04/28 05:16:51	20/04/28 05:16:51	20/04/28 05:16:51
12	20/04/28 05:16:53	20/04/28 05:16:53	20/04/28 05:16:53
130	20/04/28 05:16:55	20/04/28 05:16:55	20/04/28 05:16:55
158	20/04/28 05:16:57	20/04/28 05:16:57	20/04/28 05:16:57
132	20/04/28 05:16:59	20/04/28 05:16:59	20/04/28 05:16:59
98	20/04/28 05:17:01	20/04/28 05:17:01	20/04/28 05:17:01
157	20/04/28 05:17:03	20/04/28 05:17:03	20/04/28 05:17:03
31	20/04/28 05:17:05	20/04/28 05:17:05	20/04/28 05:17:05
98	20/04/28 05:17:07	20/04/28 05:14:01	20/04/28 05:14:01
30	20/04/28 05:17:09	20/04/28 05:17:09	20/04/28 05:17:09
3	20/04/28 05:17:11	20/04/28 05:17:11	20/04/28 05:17:11
128	20/04/28 05:17:13	20/04/28 05:17:13	20/04/28 05:17:13
30	20/04/28 05:17:15	20/04/28 05:17:18	20/04/28 05:17:17
132	20/04/28 05:17:20	20/04/28 05:17:20	20/04/28 05:17:20
30	20/04/28 05:17:22	20/04/28 05:17:22	20/04/28 05:17:22
150	20/04/28 05:17:24	20/04/28 05:17:24	20/04/28 05:17:24
150	20/04/28 05:17:26	20/04/28 05:17:26	20/04/28 05:17:26
53	20/04/28 05:17:28	20/04/28 05:17:28	20/04/28 05:17:28
152	20/04/28 05:17:30	20/04/28 05:17:30	20/04/28 05:17:30
30	20/04/28 05:17:32	20/04/28 05:17:32	20/04/28 05:17:32
130	20/04/28 05:17:34	20/04/28 05:17:35	20/04/28 05:17:35
90	20/04/28 05:17:37	20/04/28 05:17:37	20/04/28 05:17:37
130	20/04/28 05:17:39	20/04/28 05:17:39	20/04/28 05:17:39
152	20/04/28 05:17:41	20/04/28 05:17:41	20/04/28 05:17:41
4	20/04/28 05:17:43	20/04/28 05:17:43	20/04/28 05:17:43
