floorId	partitionId	location_x	location_y	timeStamp
18	979	341.3179542174323	279.8134374747344	21/02/24 15:41:33
18	979	341.3179542174323	279.8134374747344	21/02/24 15:41:34
18	979	341.3179542174323	279.8134374747344	21/02/24 15:41:35
18	979	341.3179542174323	279.8134374747344	21/02/24 15:41:36
18	979	341.3179542174323	279.8134374747344	21/02/24 15:41:37
18	979	341.3179542174323	279.8134374747344	21/02/24 15:41:38
18	979	341.3179542174323	279.8134374747344	21/02/24 15:41:39
18	979	341.3179542174323	279.8134374747344	21/02/24 15:41:40
18	979	341.3179542174323	279.8134374747344	21/02/24 15:41:41
18	979	341.3179542174323	279.8134374747344	21/02/24 15:41:42
18	979	341.3179542174323	279.8134374747344	21/02/24 15:41:43
18	979	341.3179542174323	279.8134374747344	21/02/24 15:41:44
18	979	341.3179542174323	279.8134374747344	21/02/24 15:41:45
18	979	341.3179542174323	279.8134374747344	21/02/24 15:41:46
18	979	341.3179542174323	279.8134374747344	21/02/24 15:41:47
18	979	341.3179542174323	279.8134374747344	21/02/24 15:41:48
18	979	341.3179542174323	279.8134374747344	21/02/24 15:41:49
18	979	341.3179542174323	279.8134374747344	21/02/24 15:41:50
18	979	341.3179542174323	279.8134374747344	21/02/24 15:41:51
18	979	341.3179542174323	279.8134374747344	21/02/24 15:41:52
18	979	341.3179542174323	279.8134374747344	21/02/24 15:41:53
18	979	341.3179542174323	279.8134374747344	21/02/24 15:41:54
18	979	341.3179542174323	279.8134374747344	21/02/24 15:41:55
18	979	341.3179542174323	279.8134374747344	21/02/24 15:41:56
18	979	341.3179542174323	279.8134374747344	21/02/24 15:41:58
18	979	341.3179542174323	279.8134374747344	21/02/24 15:41:59
18	979	341.3179542174323	279.8134374747344	21/02/24 15:42:00
18	979	341.3179542174323	279.8134374747344	21/02/24 15:42:01
18	979	341.3179542174323	279.8134374747344	21/02/24 15:42:02
18	979	341.3179542174323	279.8134374747344	21/02/24 15:42:03
18	979	341.3179542174323	279.8134374747344	21/02/24 15:42:04
18	979	341.3179542174323	279.8134374747344	21/02/24 15:42:05
18	979	341.3179542174323	279.8134374747344	21/02/24 15:42:06
18	979	341.3179542174323	279.8134374747344	21/02/24 15:42:07
18	979	341.3179542174323	279.8134374747344	21/02/24 15:42:08
18	979	341.3179542174323	279.8134374747344	21/02/24 15:42:09
18	979	341.3179542174323	279.8134374747344	21/02/24 15:42:10
18	979	341.3179542174323	279.8134374747344	21/02/24 15:42:11
18	979	341.3179542174323	279.8134374747344	21/02/24 15:42:12
18	979	341.3179542174323	279.8134374747344	21/02/24 15:42:13
18	979	341.3179542174323	279.8134374747344	21/02/24 15:42:14
18	979	341.3179542174323	279.8134374747344	21/02/24 15:42:15
18	979	341.3179542174323	279.8134374747344	21/02/24 15:42:16
18	979	341.3179542174323	279.8134374747344	21/02/24 15:42:17
18	979	341.3179542174323	279.8134374747344	21/02/24 15:42:18
18	982	335.5707947754775	282.66660998132573	21/02/24 15:42:19
18	979	341.3179542174323	279.8134374747344	21/02/24 15:42:20
18	979	341.3179542174323	279.8134374747344	21/02/24 15:42:21
18	979	341.3179542174323	279.8134374747344	21/02/24 15:42:22
18	979	341.3179542174323	279.8134374747344	21/02/24 15:42:23
18	979	341.3179542174323	279.8134374747344	21/02/24 15:42:24
18	NULL	315.4628213255176	-56.0073098285283	21/02/24 15:42:25
18	979	341.3179542174323	279.8134374747344	21/02/24 15:42:26
18	979	341.3179542174323	279.8134374747344	21/02/24 15:42:27
18	979	341.3179542174323	279.8134374747344	21/02/24 15:42:28
18	979	341.3179542174323	279.8134374747344	21/02/24 15:42:29
18	979	341.3179542174323	279.8134374747344	21/02/24 15:42:30
18	979	341.3179542174323	279.8134374747344	21/02/24 15:42:31
18	979	341.3179542174323	279.8134374747344	21/02/24 15:42:32
18	979	341.3179542174323	279.8134374747344	21/02/24 15:42:33
18	979	341.3179542174323	279.8134374747344	21/02/24 15:42:34
18	979	341.3179542174323	279.8134374747344	21/02/24 15:42:35
18	979	341.3179542174323	279.8134374747344	21/02/24 15:42:36
18	979	341.3179542174323	279.8134374747344	21/02/24 15:42:37
18	979	341.3179542174323	279.8134374747344	21/02/24 15:42:38
18	979	341.3179542174323	279.8134374747344	21/02/24 15:42:39
18	979	341.3179542174323	279.8134374747344	21/02/24 15:42:40
18	979	341.3179542174323	279.8134374747344	21/02/24 15:42:41
18	979	341.3179542174323	279.8134374747344	21/02/24 15:42:42
18	979	341.3179542174323	279.8134374747344	21/02/24 15:42:43
18	979	341.3179542174323	279.8134374747344	21/02/24 15:42:44
18	979	341.3179542174323	279.8134374747344	21/02/24 15:42:45
18	979	341.3179542174323	279.8134374747344	21/02/24 15:42:46
18	979	341.3179542174323	279.8134374747344	21/02/24 15:42:47
18	979	341.3179542174323	279.8134374747344	21/02/24 15:42:48
18	979	341.3179542174323	279.8134374747344	21/02/24 15:42:49
18	979	341.3179542174323	279.8134374747344	21/02/24 15:42:50
18	979	341.3179542174323	279.8134374747344	21/02/24 15:42:51
18	979	341.3179542174323	279.8134374747344	21/02/24 15:42:52
18	979	341.3179542174323	279.8134374747344	21/02/24 15:42:53
18	979	341.3179542174323	279.8134374747344	21/02/24 15:42:54
18	979	341.3179542174323	279.8134374747344	21/02/24 15:42:55
18	979	341.3179542174323	279.8134374747344	21/02/24 15:42:56
18	979	341.3179542174323	279.8134374747344	21/02/24 15:42:57
18	979	341.3179542174323	279.8134374747344	21/02/24 15:42:58
18	979	341.3179542174323	279.8134374747344	21/02/24 15:42:59
18	979	341.3179542174323	279.8134374747344	21/02/24 15:43:00
18	979	341.3179542174323	279.8134374747344	21/02/24 15:43:01
18	979	341.3179542174323	279.8134374747344	21/02/24 15:43:02
18	979	341.3179542174323	279.8134374747344	21/02/24 15:43:03
18	979	341.3179542174323	279.8134374747344	21/02/24 15:43:04
18	979	341.3179542174323	279.8134374747344	21/02/24 15:43:05
18	979	341.3179542174323	279.8134374747344	21/02/24 15:43:06
18	979	341.3179542174323	279.8134374747344	21/02/24 15:43:07
18	979	341.3179542174323	279.8134374747344	21/02/24 15:43:08
18	979	341.3179542174323	279.8134374747344	21/02/24 15:43:09
18	979	341.3179542174323	279.8134374747344	21/02/24 15:43:10
18	979	341.3179542174323	279.8134374747344	21/02/24 15:43:11
18	982	335.5707947754775	282.66660998132573	21/02/24 15:43:12
18	982	335.5707947754775	282.66660998132573	21/02/24 15:43:13
18	982	335.5707947754775	282.66660998132573	21/02/24 15:43:14
18	982	335.5707947754775	282.66660998132573	21/02/24 15:43:15
18	982	335.5707947754775	282.66660998132573	21/02/24 15:43:16
18	982	335.5707947754775	282.66660998132573	21/02/24 15:43:17
18	982	335.5707947754775	282.66660998132573	21/02/24 15:43:18
18	982	335.5707947754775	282.66660998132573	21/02/24 15:43:19
18	982	335.5707947754775	282.66660998132573	21/02/24 15:43:20
18	982	335.5707947754775	282.66660998132573	21/02/24 15:43:21
18	982	335.5707947754775	282.66660998132573	21/02/24 15:43:22
18	982	335.5707947754775	282.66660998132573	21/02/24 15:43:23
18	982	335.5707947754775	282.66660998132573	21/02/24 15:43:24
18	982	335.5707947754775	282.66660998132573	21/02/24 15:43:25
18	982	335.5707947754775	282.66660998132573	21/02/24 15:43:26
18	982	335.5707947754775	282.66660998132573	21/02/24 15:43:27
18	982	335.5707947754775	282.66660998132573	21/02/24 15:43:28
18	982	335.5707947754775	282.66660998132573	21/02/24 15:43:29
18	982	335.5707947754775	282.66660998132573	21/02/24 15:43:30
18	982	335.5707947754775	282.66660998132573	21/02/24 15:43:31
18	979	341.3179542174323	279.8134374747344	21/02/24 15:43:32
18	979	341.3179542174323	279.8134374747344	21/02/24 15:43:33
18	979	341.3179542174323	279.8134374747344	21/02/24 15:43:34
18	979	341.3179542174323	279.8134374747344	21/02/24 15:43:35
18	979	341.3179542174323	279.8134374747344	21/02/24 15:43:36
18	979	341.3179542174323	279.8134374747344	21/02/24 15:43:37
18	979	341.3179542174323	279.8134374747344	21/02/24 15:43:38
18	979	341.3179542174323	279.8134374747344	21/02/24 15:43:39
18	979	341.3179542174323	279.8134374747344	21/02/24 15:43:40
18	979	341.3179542174323	279.8134374747344	21/02/24 15:43:41
18	979	341.3179542174323	279.8134374747344	21/02/24 15:43:42
18	979	341.3179542174323	279.8134374747344	21/02/24 15:43:43
18	979	348.2367582443579	277.15183328693064	21/02/24 15:43:44
18	979	341.3179542174323	279.8134374747344	21/02/24 15:43:45
18	979	341.3179542174323	279.8134374747344	21/02/24 15:43:46
18	979	341.3179542174323	279.8134374747344	21/02/24 15:43:47
18	979	341.3179542174323	279.8134374747344	21/02/24 15:43:48
18	979	341.3179542174323	279.8134374747344	21/02/24 15:43:49
18	979	341.3179542174323	279.8134374747344	21/02/24 15:43:50
18	979	341.3179542174323	279.8134374747344	21/02/24 15:43:51
18	979	341.3179542174323	279.8134374747344	21/02/24 15:43:52
18	979	341.3179542174323	279.8134374747344	21/02/24 15:43:53
18	979	341.3179542174323	279.8134374747344	21/02/24 15:43:54
18	979	341.3179542174323	279.8134374747344	21/02/24 15:43:55
18	979	341.3179542174323	279.8134374747344	21/02/24 15:43:56
18	979	348.2367582443579	277.15183328693064	21/02/24 15:43:57
18	979	348.2367582443579	277.15183328693064	21/02/24 15:43:58
18	979	348.2367582443579	277.15183328693064	21/02/24 15:43:59
18	979	348.2367582443579	277.15183328693064	21/02/24 15:44:00
18	979	341.3179542174323	279.8134374747344	21/02/24 15:44:01
18	979	348.2367582443579	277.15183328693064	21/02/24 15:44:02
18	979	348.2367582443579	277.15183328693064	21/02/24 15:44:03
18	979	341.3179542174323	279.8134374747344	21/02/24 15:44:04
18	979	348.2367582443579	277.15183328693064	21/02/24 15:44:05
18	979	341.3179542174323	279.8134374747344	21/02/24 15:44:06
18	979	341.3179542174323	279.8134374747344	21/02/24 15:44:07
18	979	341.3179542174323	279.8134374747344	21/02/24 15:44:08
18	979	341.3179542174323	279.8134374747344	21/02/24 15:44:09
18	979	341.3179542174323	279.8134374747344	21/02/24 15:44:10
18	979	341.3179542174323	279.8134374747344	21/02/24 15:44:11
18	979	341.3179542174323	279.8134374747344	21/02/24 15:44:12
18	979	341.3179542174323	279.8134374747344	21/02/24 15:44:13
18	979	341.3179542174323	279.8134374747344	21/02/24 15:44:14
