floorId	partitionId	location_x	location_y	timeStamp
19	900	325.978898777269	268.9815408410886	21/02/21 12:24:02
19	900	325.978898777269	268.9815408410886	21/02/21 12:24:03
19	900	325.978898777269	268.9815408410886	21/02/21 12:24:04
19	900	325.978898777269	268.9815408410886	21/02/21 12:24:05
19	950	329.1478373016018	268.73646457387355	21/02/21 12:24:06
19	950	329.1478373016018	268.73646457387355	21/02/21 12:24:07
19	909	331.5177404550703	270.84963839246103	21/02/21 12:24:08
19	909	334.61759054547247	271.7957465892094	21/02/21 12:24:09
19	909	334.61759054547247	271.7957465892094	21/02/21 12:24:10
19	909	337.39217142336037	272.36882753177247	21/02/21 12:24:11
19	NULL	339.5371768354517	273.7210898699793	21/02/21 12:24:12
19	NULL	339.5371768354517	273.7210898699793	21/02/21 12:24:13
19	964	343.44367231207883	275.15890443585744	21/02/21 12:24:14
19	964	343.44367231207883	275.15890443585744	21/02/21 12:24:15
19	946	348.3933779365746	276.2556604682856	21/02/21 12:24:16
19	946	348.3933779365746	276.25566046828567	21/02/21 12:24:17
19	954	353.50966239774925	278.7343482092214	21/02/21 12:24:18
19	954	353.50966239774925	278.7343482092214	21/02/21 12:24:19
19	990	358.24403586236184	280.8317933219381	21/02/21 12:24:20
19	990	360.7696344530844	281.71047019619976	21/02/21 12:24:21
19	990	360.7696344530844	281.71047019619976	21/02/21 12:24:22
19	990	360.76963445308434	281.71047019619976	21/02/21 12:24:23
19	990	360.76963445308434	281.71047019619976	21/02/21 12:24:24
19	990	364.8554360955142	278.53407260132843	21/02/21 12:24:25
19	990	364.8554360955142	278.53407260132843	21/02/21 12:24:26
19	990	369.36976862338014	281.9000383871016	21/02/21 12:24:27
19	937	373.90257625180317	279.2932613585551	21/02/21 12:24:28
19	990	377.534064848506	282.0682559955897	21/02/21 12:24:29
19	990	377.53406484850603	282.0682559955897	21/02/21 12:24:30
19	990	377.53406484850603	282.0682559955897	21/02/21 12:24:31
19	937	375.3069192384801	278.526579341296	21/02/21 12:24:32
