stationId	t_start	t_end	t_max	timeStamp
63	20/04/28 05:10:49	20/04/28 05:10:49	20/04/28 05:10:49
109	20/04/28 05:09:52	20/04/28 05:09:52	20/04/28 05:10:51
56	20/04/28 05:10:53	20/04/28 05:10:53	20/04/28 05:10:53
140	20/04/28 05:10:55	20/04/28 05:10:57	20/04/28 05:10:57
159	20/04/28 05:10:59	20/04/28 05:11:00	20/04/28 05:11:00
159	20/04/28 05:11:02	20/04/28 05:11:02	20/04/28 05:11:02
37	20/04/28 05:11:04	20/04/28 05:11:04	20/04/28 05:11:04
109	20/04/28 05:11:06	20/04/28 05:11:06	20/04/28 05:11:06
47	20/04/28 05:11:08	20/04/28 05:11:08	20/04/28 05:11:08
37	20/04/28 05:11:10	20/04/28 05:11:11	20/04/28 05:11:11
108	20/04/28 05:11:13	20/04/28 05:11:13	20/04/28 05:11:13
108	20/04/28 05:11:15	20/04/28 05:11:15	20/04/28 05:11:15
140	20/04/28 05:11:17	20/04/28 05:11:17	20/04/28 05:11:17
140	20/04/28 05:11:19	20/04/28 05:11:19	20/04/28 05:11:19
140	20/04/28 05:11:21	20/04/28 05:11:21	20/04/28 05:11:21
37	20/04/28 05:11:23	20/04/28 05:11:23	20/04/28 05:11:23
140	20/04/28 05:11:25	20/04/28 05:11:25	20/04/28 05:11:25
64	20/04/28 05:11:27	20/04/28 05:11:27	20/04/28 05:11:27
140	20/04/28 05:11:29	20/04/28 05:11:29	20/04/28 05:11:29
140	20/04/28 05:11:31	20/04/28 05:11:31	20/04/28 05:11:31
140	20/04/28 05:11:33	20/04/28 05:11:33	20/04/28 05:11:33
140	20/04/28 05:11:35	20/04/28 05:11:35	20/04/28 05:11:35
70	20/04/28 05:11:37	20/04/28 05:11:37	20/04/28 05:11:37
63	20/04/28 05:11:39	20/04/28 05:11:39	20/04/28 05:11:39
140	20/04/28 05:11:41	20/04/28 05:11:42	20/04/28 05:11:42
46	20/04/28 05:11:44	20/04/28 05:11:44	20/04/28 05:11:44
13	20/04/28 05:11:46	20/04/28 05:11:46	20/04/28 05:11:46
63	20/04/28 05:11:48	20/04/28 05:11:48	20/04/28 05:11:48
159	20/04/28 05:11:50	20/04/28 05:11:50	20/04/28 05:11:50
63	20/04/28 05:11:52	20/04/28 05:11:52	20/04/28 05:11:52
13	20/04/28 05:11:54	20/04/28 05:11:54	20/04/28 05:11:54
63	20/04/28 05:11:56	20/04/28 05:11:56	20/04/28 05:11:56
70	20/04/28 05:11:58	20/04/28 05:11:59	20/04/28 05:11:59
159	20/04/28 05:12:01	20/04/28 05:12:01	20/04/28 05:12:01
56	20/04/28 05:12:03	20/04/28 05:12:04	20/04/28 05:12:03
47	20/04/28 05:12:06	20/04/28 05:12:06	20/04/28 05:12:06
47	20/04/28 05:12:08	20/04/28 05:12:10	20/04/28 05:12:10
63	20/04/28 05:12:12	20/04/28 05:12:12	20/04/28 05:12:12
159	20/04/28 05:12:14	20/04/28 05:12:14	20/04/28 05:12:14
63	20/04/28 05:12:16	20/04/28 05:12:16	20/04/28 05:12:16
140	20/04/28 05:12:18	20/04/28 05:12:19	20/04/28 05:12:19
160	20/04/28 05:12:21	20/04/28 05:12:22	20/04/28 05:12:22
47	20/04/28 05:12:24	20/04/28 05:12:24	20/04/28 05:12:24
37	20/04/28 05:12:26	20/04/28 05:12:26	20/04/28 05:12:26
63	20/04/28 05:12:28	20/04/28 05:12:28	20/04/28 05:12:28
37	20/04/28 05:12:30	20/04/28 05:12:31	20/04/28 05:12:31
37	20/04/28 05:12:33	20/04/28 05:12:33	20/04/28 05:12:33
109	20/04/28 05:12:35	20/04/28 05:12:35	20/04/28 05:12:35
12	20/04/28 05:12:37	20/04/28 05:12:37	20/04/28 05:12:37
159	20/04/28 05:12:39	20/04/28 05:12:40	20/04/28 05:12:40
109	20/04/28 05:12:42	20/04/28 05:12:42	20/04/28 05:12:42
37	20/04/28 05:12:44	20/04/28 05:12:45	20/04/28 05:12:45
64	20/04/28 05:12:47	20/04/28 05:12:47	20/04/28 05:12:47
108	20/04/28 05:12:49	20/04/28 05:12:49	20/04/28 05:12:49
160	20/04/28 05:12:51	20/04/28 05:12:51	20/04/28 05:12:51
140	20/04/28 05:12:53	20/04/28 05:12:54	20/04/28 05:12:54
129	20/04/28 05:12:56	20/04/28 05:12:56	20/04/28 05:12:56
160	20/04/28 05:12:58	20/04/28 05:12:58	20/04/28 05:12:58
37	20/04/28 05:13:00	20/04/28 05:13:00	20/04/28 05:13:00
108	20/04/28 05:13:02	20/04/28 05:13:02	20/04/28 05:13:02
56	20/04/28 05:13:04	20/04/28 05:13:04	20/04/28 05:13:04
14	20/04/28 05:13:06	20/04/28 05:13:06	20/04/28 05:13:06
109	20/04/28 05:13:08	20/04/28 05:13:08	20/04/28 05:13:08
109	20/04/28 05:13:10	20/04/28 05:13:10	20/04/28 05:13:10
108	20/04/28 05:11:22	20/04/28 05:11:22	20/04/28 05:13:12
109	20/04/28 05:13:14	20/04/28 05:13:14	20/04/28 05:13:14
140	20/04/28 05:13:16	20/04/28 05:13:16	20/04/28 05:13:16
64	20/04/28 05:13:18	20/04/28 05:13:18	20/04/28 05:13:18
109	20/04/28 05:13:20	20/04/28 05:13:20	20/04/28 05:13:20
108	20/04/28 05:13:22	20/04/28 05:13:23	20/04/28 05:13:22
109	20/04/28 05:13:25	20/04/28 05:13:25	20/04/28 05:13:25
