floorId	partitionId	location_x	location_y	timeStamp
1	50	325.82176653676186	290.66965224740585	20/04/28 05:15:00
1	50	327.6844095055158	288.5207594301078	20/04/28 05:15:01
1	50	327.6844095055158	288.52075943010783	20/04/28 05:15:02
1	50	327.6844095055158	288.52075943010783	20/04/28 05:15:03
1	50	327.6844095055158	288.52075943010783	20/04/28 05:15:04
1	50	327.6844095055158	288.5207594301078	20/04/28 05:15:05
1	50	327.6844095055158	288.5207594301078	20/04/28 05:15:06
1	50	327.6844095055158	288.52075943010783	20/04/28 05:15:07
1	50	327.6844095055158	288.5207594301078	20/04/28 05:15:08
1	50	327.6844095055158	288.5207594301078	20/04/28 05:15:09
1	50	327.6844095055158	288.52075943010783	20/04/28 05:15:10
1	50	328.0892907075774	291.9473090105973	20/04/28 05:15:11
1	50	325.82176653676186	290.66965224740585	20/04/28 05:15:12
1	50	325.82176653676186	290.66965224740585	20/04/28 05:15:13
1	93	325.32504216255245	294.1232464693243	20/04/28 05:15:14
1	50	328.0892907075774	291.9473090105973	20/04/28 05:15:15
1	50	328.0892907075774	291.9473090105973	20/04/28 05:15:16
1	50	328.0892907075774	291.9473090105973	20/04/28 05:15:17
1	50	328.0892907075774	291.9473090105973	20/04/28 05:15:18
1	50	328.0892907075774	291.9473090105973	20/04/28 05:15:19
1	50	328.0892907075774	291.9473090105973	20/04/28 05:15:20
1	50	328.0892907075774	291.9473090105973	20/04/28 05:15:21
1	50	327.6844095055158	288.5207594301078	20/04/28 05:15:22
1	16	330.71128525095463	290.0288388939632	20/04/28 05:15:23
1	50	327.6844095055158	288.5207594301078	20/04/28 05:15:24
1	50	327.6844095055158	288.52075943010783	20/04/28 05:15:25
1	50	327.6844095055158	288.52075943010783	20/04/28 05:15:26
1	50	327.6844095055158	288.52075943010783	20/04/28 05:15:27
1	50	327.6844095055158	288.52075943010783	20/04/28 05:15:28
1	50	327.6844095055158	288.52075943010783	20/04/28 05:15:29
1	59	325.9232207888915	287.3354881525654	20/04/28 05:15:30
1	50	327.6844095055158	288.52075943010783	20/04/28 05:15:31
1	50	327.6844095055158	288.5207594301078	20/04/28 05:15:32
1	50	327.6844095055158	288.52075943010783	20/04/28 05:15:33
1	50	328.0892907075774	291.9473090105973	20/04/28 05:15:34
1	50	328.0892907075774	291.9473090105973	20/04/28 05:15:35
1	50	325.82176653676186	290.66965224740585	20/04/28 05:15:36
1	50	325.82176653676186	290.66965224740585	20/04/28 05:15:37
1	93	325.32504216255245	294.1232464693243	20/04/28 05:15:38
1	50	325.82176653676186	290.66965224740585	20/04/28 05:15:39
1	50	325.82176653676186	290.66965224740585	20/04/28 05:15:40
1	50	327.6844095055158	288.52075943010783	20/04/28 05:15:41
1	50	325.82176653676186	290.66965224740585	20/04/28 05:15:42
1	50	328.0892907075774	291.9473090105973	20/04/28 05:15:43
1	50	325.82176653676186	290.66965224740585	20/04/28 05:15:44
1	50	328.0892907075774	291.9473090105973	20/04/28 05:15:45
1	50	328.0892907075774	291.9473090105973	20/04/28 05:15:46
1	50	327.6844095055158	288.52075943010783	20/04/28 05:15:47
1	50	327.6844095055158	288.52075943010783	20/04/28 05:15:48
1	50	327.6844095055158	288.5207594301078	20/04/28 05:15:49
1	50	327.6844095055158	288.52075943010783	20/04/28 05:15:50
1	59	325.9232207888915	287.3354881525654	20/04/28 05:15:51
1	50	327.6844095055158	288.52075943010783	20/04/28 05:15:52
1	50	327.6844095055158	288.52075943010783	20/04/28 05:15:53
1	59	325.9232207888915	287.3354881525654	20/04/28 05:15:54
1	50	327.6844095055158	288.52075943010783	20/04/28 05:15:55
1	50	327.6844095055158	288.52075943010783	20/04/28 05:15:56
1	59	325.9232207888915	287.3354881525654	20/04/28 05:15:57
1	50	327.6844095055158	288.52075943010783	20/04/28 05:15:58
1	50	327.6844095055158	288.52075943010783	20/04/28 05:15:59
1	50	327.6844095055158	288.52075943010783	20/04/28 05:16:00
1	50	327.6844095055158	288.52075943010783	20/04/28 05:16:01
1	59	325.9232207888915	287.3354881525654	20/04/28 05:16:02
1	59	325.9232207888915	287.3354881525654	20/04/28 05:16:03
1	59	325.9232207888915	287.3354881525654	20/04/28 05:16:04
1	59	325.9232207888915	287.3354881525654	20/04/28 05:16:05
1	50	325.82176653676186	290.6696522474059	20/04/28 05:16:06
1	50	327.6844095055158	288.52075943010783	20/04/28 05:16:07
1	59	325.9232207888915	287.3354881525654	20/04/28 05:16:08
1	50	327.6844095055158	288.52075943010783	20/04/28 05:16:09
1	50	327.6844095055158	288.52075943010783	20/04/28 05:16:10
1	50	327.6844095055158	288.52075943010783	20/04/28 05:16:11
1	59	325.9232207888915	287.3354881525654	20/04/28 05:16:12
1	50	327.6844095055158	288.52075943010783	20/04/28 05:16:13
1	50	325.82176653676186	290.6696522474059	20/04/28 05:16:14
1	50	327.6844095055158	288.52075943010783	20/04/28 05:16:15
1	50	324.9201609604908	290.69669688883477	20/04/28 05:16:16
1	50	327.6844095055158	288.52075943010783	20/04/28 05:16:17
1	93	325.32504216255245	294.1232464693243	20/04/28 05:16:18
1	93	325.32504216255245	294.1232464693243	20/04/28 05:16:19
1	50	325.82176653676186	290.66965224740585	20/04/28 05:16:20
1	93	325.32504216255245	294.1232464693243	20/04/28 05:16:21
1	50	328.0892907075774	291.9473090105973	20/04/28 05:16:22
1	93	325.32504216255245	294.1232464693243	20/04/28 05:16:23
1	50	325.82176653676186	290.6696522474059	20/04/28 05:16:24
1	50	325.82176653676186	290.66965224740585	20/04/28 05:16:25
1	50	325.82176653676186	290.66965224740585	20/04/28 05:16:26
