floorId	partitionId	location_x	location_y	timeStamp
3	68	354.4982598253989	256.5424320855769	20/04/28 05:08:49
3	42	352.0898782617341	257.6816897320676	20/04/28 05:08:50
3	42	352.0898782617341	257.6816897320676	20/04/28 05:08:51
3	42	352.0898782617341	257.6816897320676	20/04/28 05:08:52
3	42	352.0898782617341	257.6816897320676	20/04/28 05:08:53
3	68	354.08131374203464	255.73290488058714	20/04/28 05:08:54
3	42	352.0898782617341	257.6816897320676	20/04/28 05:08:55
3	42	352.0898782617341	257.6816897320676	20/04/28 05:08:56
3	42	352.0898782617341	257.6816897320676	20/04/28 05:08:57
3	42	352.0898782617341	257.6816897320676	20/04/28 05:08:58
3	42	352.0898782617341	257.6816897320676	20/04/28 05:08:59
3	42	352.0898782617341	257.6816897320676	20/04/28 05:09:00
3	42	352.0898782617341	257.6816897320676	20/04/28 05:09:01
3	42	352.0898782617341	257.6816897320676	20/04/28 05:09:02
3	42	352.0898782617341	257.6816897320676	20/04/28 05:09:03
3	42	352.0898782617341	257.6816897320676	20/04/28 05:09:04
3	42	352.0898782617341	257.6816897320676	20/04/28 05:09:05
3	42	352.0898782617341	257.6816897320676	20/04/28 05:09:06
3	42	352.0898782617341	257.6816897320676	20/04/28 05:09:07
3	42	352.0898782617341	257.6816897320676	20/04/28 05:09:08
3	42	352.0898782617341	257.6816897320676	20/04/28 05:09:09
3	42	352.0898782617341	257.6816897320676	20/04/28 05:09:10
3	42	352.0898782617341	257.6816897320676	20/04/28 05:09:11
3	42	352.0898782617341	257.6816897320676	20/04/28 05:09:12
3	42	352.0898782617341	257.6816897320676	20/04/28 05:09:13
3	42	352.0898782617341	257.6816897320676	20/04/28 05:09:14
3	42	352.0898782617341	257.6816897320676	20/04/28 05:09:15
3	42	352.0898782617341	257.6816897320676	20/04/28 05:09:16
3	42	352.0898782617341	257.6816897320676	20/04/28 05:09:17
3	42	352.0898782617341	257.6816897320676	20/04/28 05:09:18
3	54	353.42135665220485	262.57913793665006	20/04/28 05:09:19
3	54	354.93110780732565	263.85962413987545	20/04/28 05:09:20
3	8	357.87501606482897	266.0533751351783	20/04/28 05:09:21
3	8	357.87501606482897	266.0533751351783	20/04/28 05:09:22
3	8	359.9234896609493	266.999666868601	20/04/28 05:09:23
3	8	359.9234896609493	266.999666868601	20/04/28 05:09:24
3	NULL	360.5507848693131	269.4873868166837	20/04/28 05:09:25
3	46	362.7162137688074	270.4856820770022	20/04/28 05:09:26
3	NULL	360.5507848693131	269.4873868166837	20/04/28 05:09:27
3	8	359.7453243041916	269.7859418005323	20/04/28 05:09:28
3	8	360.0833814688194	266.8125651781161	20/04/28 05:09:29
3	8	360.0833814688194	266.8125651781161	20/04/28 05:09:30
3	8	359.9234896609493	266.999666868601	20/04/28 05:09:31
3	8	359.9234896609493	266.999666868601	20/04/28 05:09:32
3	8	359.9234896609493	266.999666868601	20/04/28 05:09:33
3	8	360.0833814688194	266.8125651781161	20/04/28 05:09:34
3	NULL	360.5507848693131	269.4873868166837	20/04/28 05:09:35
3	NULL	360.5507848693131	269.4873868166837	20/04/28 05:09:36
3	NULL	360.5507848693131	269.4873868166837	20/04/28 05:09:37
3	8	359.9234896609493	266.999666868601	20/04/28 05:09:38
3	NULL	360.5507848693131	269.4873868166837	20/04/28 05:09:39
3	8	359.9234896609493	266.999666868601	20/04/28 05:09:40
3	8	359.9234896609493	266.999666868601	20/04/28 05:09:41
3	8	360.0833814688194	266.8125651781161	20/04/28 05:09:42
3	8	360.0833814688194	266.8125651781161	20/04/28 05:09:43
3	8	357.8750160648289	266.0533751351783	20/04/28 05:09:44
3	8	357.8750160648289	266.0533751351783	20/04/28 05:09:45
3	8	357.8750160648289	266.0533751351783	20/04/28 05:09:46
3	46	361.6170319482885	264.17422801455785	20/04/28 05:09:47
3	34	363.08940602427793	260.2393220879455	20/04/28 05:09:48
3	34	361.2642468288334	255.55936173685845	20/04/28 05:09:49
3	17	361.9057312824121	254.45903554354518	20/04/28 05:09:50
3	17	363.0633788732786	253.76883669815365	20/04/28 05:09:51
3	17	363.0633788732786	253.76883669815368	20/04/28 05:09:52
3	30	365.53445097535786	248.80973562593917	20/04/28 05:09:53
3	23	366.2602386887035	244.5685484047918	20/04/28 05:09:54
3	23	366.2602386887035	244.5685484047918	20/04/28 05:09:55
3	23	366.2602386887035	244.5685484047918	20/04/28 05:09:56
3	23	366.0274078202198	241.72892363871526	20/04/28 05:09:57
3	23	366.0274078202198	241.72892363871526	20/04/28 05:09:58
3	23	366.0274078202198	241.72892363871526	20/04/28 05:09:59
3	23	366.0274078202198	241.72892363871526	20/04/28 05:10:00
3	23	366.0274078202198	241.72892363871526	20/04/28 05:10:01
3	23	366.0274078202198	241.72892363871526	20/04/28 05:10:02
3	23	366.0274078202198	241.72892363871526	20/04/28 05:10:03
3	23	366.0274078202198	241.72892363871526	20/04/28 05:10:04
3	23	366.0274078202198	241.72892363871526	20/04/28 05:10:05
3	23	366.0274078202198	241.72892363871526	20/04/28 05:10:06
3	23	366.2602386887035	244.5685484047918	20/04/28 05:10:07
3	23	366.2602386887035	244.5685484047918	20/04/28 05:10:08
3	23	366.2602386887035	244.5685484047918	20/04/28 05:10:09
3	17	362.3945272480641	251.57317905073432	20/04/28 05:10:10
3	17	363.0633788732786	253.76883669815368	20/04/28 05:10:11
3	17	363.0633788732786	253.76883669815365	20/04/28 05:10:12
3	34	361.2642468288334	255.55936173685845	20/04/28 05:10:13
3	34	361.2642468288334	255.55936173685845	20/04/28 05:10:14
3	34	362.2167196060361	259.70189758364177	20/04/28 05:10:15
3	34	362.2167196060361	259.70189758364177	20/04/28 05:10:16
3	57	365.8336784609425	258.95489486040736	20/04/28 05:10:17
3	57	365.8336784609425	258.9548948604074	20/04/28 05:10:18
3	54	372.48785670166836	262.3595943162643	20/04/28 05:10:19
3	57	374.26377240687094	258.097817872792	20/04/28 05:10:20
3	54	376.18269094789457	263.03655301878126	20/04/28 05:10:21
3	15	379.8755906118027	262.6421307240284	20/04/28 05:10:22
3	15	379.8755906118027	262.6421307240284	20/04/28 05:10:23
3	15	380.97239583354167	266.94453563659977	20/04/28 05:10:24
1	33	381.6109766893215	266.73786054806715	20/04/28 05:10:25
1	33	381.6109766893215	266.73786054806715	20/04/28 05:10:26
1	86	377.91614244309534	266.0609018455502	20/04/28 05:10:27
1	69	376.18075636557654	261.96517202151136	20/04/28 05:10:28
1	69	372.48785670166836	262.3595943162643	20/04/28 05:10:29
1	69	372.48785670166836	262.3595943162643	20/04/28 05:10:30
1	69	372.48785670166836	262.3595943162643	20/04/28 05:10:31
1	69	367.80245440868674	262.5455232582413	20/04/28 05:10:32
1	13	368.31727752533806	266.1301521552222	20/04/28 05:10:33
3	34	363.08940602427793	260.2393220879455	20/04/28 05:10:34
3	54	359.7450566703883	261.7485007314006	20/04/28 05:10:35
1	64	357.53669126639784	260.98931068846287	20/04/28 05:10:36
1	69	353.6772354413353	258.9507399026464	20/04/28 05:10:37
1	41	352.7251685521831	260.56227788261185	20/04/28 05:10:38
1	69	353.6772354413353	258.9507399026464	20/04/28 05:10:39
1	41	352.3082224688189	259.75275067762215	20/04/28 05:10:40
1	41	351.1038521390131	261.25919659268993	20/04/28 05:10:41
1	22	345.9671156385064	259.7767423613448	20/04/28 05:10:42
1	22	343.1917987024697	259.9647561276533	20/04/28 05:10:43
1	22	343.1917987024697	259.9647561276533	20/04/28 05:10:44
1	22	343.1917987024697	259.9647561276533	20/04/28 05:10:45
1	22	343.1917987024697	259.9647561276533	20/04/28 05:10:46
1	22	343.1917987024697	259.9647561276533	20/04/28 05:10:47
1	22	346.48253983850464	261.2777688197779	20/04/28 05:10:48
1	22	346.48253983850464	261.2777688197779	20/04/28 05:10:49
1	22	346.48253983850464	261.2777688197779	20/04/28 05:10:50
1	22	346.48253983850464	261.2777688197779	20/04/28 05:10:51
1	41	349.6149730760457	260.6816456755546	20/04/28 05:10:52
1	22	346.48253983850464	261.2777688197779	20/04/28 05:10:53
1	41	349.6149730760457	260.6816456755546	20/04/28 05:10:54
1	22	346.48253983850464	261.2777688197779	20/04/28 05:10:55
1	22	346.48253983850464	261.2777688197779	20/04/28 05:10:56
1	41	349.6149730760457	260.6816456755546	20/04/28 05:10:57
1	41	349.6149730760457	260.6816456755546	20/04/28 05:10:58
1	41	349.6149730760457	260.6816456755546	20/04/28 05:10:59
1	41	350.03191915941005	261.4911728805443	20/04/28 05:11:00
1	22	346.48253983850464	261.2777688197779	20/04/28 05:11:01
1	22	346.48253983850464	261.2777688197779	20/04/28 05:11:02
1	22	346.48253983850464	261.2777688197779	20/04/28 05:11:03
1	41	349.2732493252067	263.17227144197165	20/04/28 05:11:04
1	22	346.48253983850464	261.2777688197779	20/04/28 05:11:05
1	22	346.48253983850464	261.2777688197779	20/04/28 05:11:06
1	22	346.48253983850464	261.2777688197779	20/04/28 05:11:07
1	41	349.2732493252067	263.17227144197165	20/04/28 05:11:08
1	22	346.48253983850464	261.2777688197779	20/04/28 05:11:09
1	41	350.03191915941005	261.4911728805443	20/04/28 05:11:10
1	22	346.48253983850464	261.2777688197779	20/04/28 05:11:11
1	41	349.2732493252067	263.17227144197165	20/04/28 05:11:12
1	41	349.2732493252067	263.17227144197165	20/04/28 05:11:13
1	41	349.2732493252067	263.17227144197165	20/04/28 05:11:14
1	22	346.48253983850464	261.2777688197779	20/04/28 05:11:15
1	22	346.48253983850464	261.2777688197779	20/04/28 05:11:16
1	22	346.48253983850464	261.2777688197779	20/04/28 05:11:17
1	22	346.48253983850464	261.2777688197779	20/04/28 05:11:18
1	22	346.48253983850464	261.2777688197779	20/04/28 05:11:19
1	41	349.2732493252067	263.17227144197165	20/04/28 05:11:20
1	22	346.48253983850464	261.2777688197779	20/04/28 05:11:21
1	22	343.1917987024697	259.9647561276533	20/04/28 05:11:22
1	22	343.1917987024697	259.9647561276533	20/04/28 05:11:23
1	22	343.1917987024697	259.9647561276533	20/04/28 05:11:24
1	41	349.6149730760457	260.6816456755546	20/04/28 05:11:25
1	41	349.2732493252067	263.17227144197165	20/04/28 05:11:26
1	41	352.7251685521831	260.56227788261185	20/04/28 05:11:27
1	41	352.7251685521831	260.56227788261185	20/04/28 05:11:28
1	64	354.3333978239378	262.53426333928064	20/04/28 05:11:29
1	64	354.3333978239378	262.53426333928064	20/04/28 05:11:30
1	64	357.3387197726773	263.8494133906552	20/04/28 05:11:31
1	64	359.0687213949978	261.8954025150879	20/04/28 05:11:32
3	46	364.70031867043167	266.8771548784566	20/04/28 05:11:34
1	13	368.31727752533806	266.1301521552222	20/04/28 05:11:35
1	13	367.4445911070962	265.59272765091856	20/04/28 05:11:36
1	13	368.31727752533806	266.1301521552222	20/04/28 05:11:37
1	13	368.31727752533806	266.1301521552222	20/04/28 05:11:38
1	13	368.31727752533806	266.1301521552222	20/04/28 05:11:39
1	13	368.31727752533806	266.1301521552222	20/04/28 05:11:40
1	13	368.31727752533806	266.1301521552222	20/04/28 05:11:41
1	13	368.31727752533806	266.1301521552222	20/04/28 05:11:42
1	13	368.31727752533806	266.1301521552222	20/04/28 05:11:43
1	13	368.31727752533806	266.1301521552222	20/04/28 05:11:44
1	13	364.70031867043167	266.8771548784566	20/04/28 05:11:45
1	13	364.70031867043167	266.8771548784566	20/04/28 05:11:46
1	13	364.70031867043167	266.8771548784566	20/04/28 05:11:47
1	13	368.31727752533806	266.1301521552222	20/04/28 05:11:48
1	13	368.31727752533806	266.1301521552222	20/04/28 05:11:49
1	13	368.31727752533806	266.1301521552222	20/04/28 05:11:50
1	13	368.31727752533806	266.1301521552222	20/04/28 05:11:51
1	13	368.31727752533806	266.1301521552222	20/04/28 05:11:52
1	13	368.31727752533806	266.1301521552222	20/04/28 05:11:53
3	46	368.31727752533806	266.1301521552222	20/04/28 05:11:54
1	13	368.31727752533806	266.1301521552222	20/04/28 05:11:55
1	13	364.70031867043167	266.8771548784566	20/04/28 05:11:56
