stationId	t_start	t_end	t_max	timeStamp
96	20/04/28 05:10:55	20/04/28 05:10:55	20/04/28 05:10:55
91	20/04/28 05:10:57	20/04/28 05:10:57	20/04/28 05:10:57
13	20/04/28 05:10:59	20/04/28 05:10:59	20/04/28 05:10:59
24	20/04/28 05:11:01	20/04/28 05:11:01	20/04/28 05:11:01
13	20/04/28 05:11:03	20/04/28 05:11:03	20/04/28 05:11:03
13	20/04/28 05:11:05	20/04/28 05:11:05	20/04/28 05:11:05
6	20/04/28 05:11:07	20/04/28 05:11:07	20/04/28 05:11:07
40	20/04/28 05:11:09	20/04/28 05:11:09	20/04/28 05:11:09
134	20/04/28 05:11:11	20/04/28 05:11:11	20/04/28 05:11:11
142	20/04/28 05:11:13	20/04/28 05:11:13	20/04/28 05:11:13
89	20/04/28 05:11:15	20/04/28 05:11:15	20/04/28 05:11:15
43	20/04/28 05:11:17	20/04/28 05:11:17	20/04/28 05:11:17
99	20/04/28 05:11:19	20/04/28 05:11:19	20/04/28 05:11:19
11	20/04/28 05:11:21	20/04/28 05:11:21	20/04/28 05:11:21
33	20/04/28 05:11:23	20/04/28 05:11:23	20/04/28 05:11:23
98	20/04/28 05:11:25	20/04/28 05:11:25	20/04/28 05:11:25
62	20/04/28 05:11:27	20/04/28 05:11:27	20/04/28 05:11:27
61	20/04/28 05:11:29	20/04/28 05:11:30	20/04/28 05:11:29
157	20/04/28 05:11:32	20/04/28 05:11:32	20/04/28 05:11:32
157	20/04/28 05:11:34	20/04/28 05:11:34	20/04/28 05:11:34
61	20/04/28 05:11:36	20/04/28 05:11:36	20/04/28 05:11:36
157	20/04/28 05:11:38	20/04/28 05:11:38	20/04/28 05:11:38
61	20/04/28 05:11:40	20/04/28 05:11:44	20/04/28 05:11:41
61	20/04/28 05:11:46	20/04/28 05:11:46	20/04/28 05:11:46
157	20/04/28 05:11:48	20/04/28 05:11:48	20/04/28 05:11:48
157	20/04/28 05:11:50	20/04/28 05:11:50	20/04/28 05:11:50
154	20/04/28 05:11:52	20/04/28 05:11:53	20/04/28 05:11:52
154	20/04/28 05:11:55	20/04/28 05:11:55	20/04/28 05:11:55
155	20/04/28 05:11:57	20/04/28 05:11:57	20/04/28 05:11:57
154	20/04/28 05:11:59	20/04/28 05:11:59	20/04/28 05:11:59
61	20/04/28 05:12:02	20/04/28 05:12:02	20/04/28 05:12:02
158	20/04/28 05:12:04	20/04/28 05:12:04	20/04/28 05:12:04
156	20/04/28 05:12:06	20/04/28 05:12:06	20/04/28 05:12:06
86	20/04/28 05:12:08	20/04/28 05:12:08	20/04/28 05:12:08
75	20/04/28 05:12:10	20/04/28 05:12:10	20/04/28 05:12:10
35	20/04/28 05:12:12	20/04/28 05:12:12	20/04/28 05:12:12
39	20/04/28 05:12:14	20/04/28 05:12:14	20/04/28 05:12:14
130	20/04/28 05:12:16	20/04/28 05:12:16	20/04/28 05:12:16
32	20/04/28 05:12:18	20/04/28 05:12:18	20/04/28 05:12:18
33	20/04/28 05:12:20	20/04/28 05:12:20	20/04/28 05:12:20
150	20/04/28 05:12:22	20/04/28 05:12:22	20/04/28 05:12:22
40	20/04/28 05:12:24	20/04/28 05:12:24	20/04/28 05:12:24
10	20/04/28 05:12:26	20/04/28 05:12:26	20/04/28 05:12:26
28	20/04/28 05:12:28	20/04/28 05:12:28	20/04/28 05:12:28
17	20/04/28 05:12:30	20/04/28 05:12:30	20/04/28 05:12:30
25	20/04/28 05:12:32	20/04/28 05:12:32	20/04/28 05:12:32
65	20/04/28 05:12:34	20/04/28 05:12:34	20/04/28 05:12:34
87	20/04/28 05:12:36	20/04/28 05:12:36	20/04/28 05:12:36
117	20/04/28 05:12:38	20/04/28 05:12:38	20/04/28 05:12:38
117	20/04/28 05:12:40	20/04/28 05:12:40	20/04/28 05:12:40
41	20/04/28 05:12:42	20/04/28 05:12:42	20/04/28 05:12:42
67	20/04/28 05:12:44	20/04/28 05:12:44	20/04/28 05:12:44
19	20/04/28 05:12:46	20/04/28 05:12:46	20/04/28 05:12:46
73	20/04/28 05:12:48	20/04/28 05:12:48	20/04/28 05:12:48
120	20/04/28 05:12:50	20/04/28 05:12:50	20/04/28 05:12:50
95	20/04/28 05:12:52	20/04/28 05:12:52	20/04/28 05:12:52
114	20/04/28 05:12:54	20/04/28 05:12:54	20/04/28 05:12:54
78	20/04/28 05:12:56	20/04/28 05:12:56	20/04/28 05:12:56
134	20/04/28 05:12:58	20/04/28 05:12:58	20/04/28 05:12:58
96	20/04/28 05:13:00	20/04/28 05:13:00	20/04/28 05:13:00
76	20/04/28 05:13:02	20/04/28 05:13:02	20/04/28 05:13:02
88	20/04/28 05:13:04	20/04/28 05:13:04	20/04/28 05:13:04
12	20/04/28 05:13:06	20/04/28 05:13:06	20/04/28 05:13:06
89	20/04/28 05:13:08	20/04/28 05:13:08	20/04/28 05:13:08
44	20/04/28 05:13:10	20/04/28 05:13:12	20/04/28 05:13:10
30	20/04/28 05:13:14	20/04/28 05:13:14	20/04/28 05:13:14
150	20/04/28 05:13:16	20/04/28 05:13:16	20/04/28 05:13:16
111	20/04/28 05:13:18	20/04/28 05:13:18	20/04/28 05:13:18
134	20/04/28 05:13:20	20/04/28 05:13:20	20/04/28 05:13:20
13	20/04/28 05:13:22	20/04/28 05:13:23	20/04/28 05:13:23
86	20/04/28 05:13:25	20/04/28 05:13:25	20/04/28 05:13:25
56	20/04/28 05:13:27	20/04/28 05:13:28	20/04/28 05:13:28
56	20/04/28 05:13:30	20/04/28 05:13:30	20/04/28 05:13:30
134	20/04/28 05:13:32	20/04/28 05:17:46	20/04/28 05:13:32
134	20/04/28 05:13:34	20/04/28 05:13:34	20/04/28 05:13:34
