stationId	t_start	t_end	t_max	timeStamp
56	20/04/28 05:17:35	20/04/28 05:17:36	20/04/28 05:17:35
144	20/04/28 05:17:38	20/04/28 05:17:40	20/04/28 05:17:40
56	20/04/28 05:17:42	20/04/28 05:17:42	20/04/28 05:17:42
144	20/04/28 05:17:44	20/04/28 05:17:44	20/04/28 05:17:44
141	20/04/28 05:17:46	20/04/28 05:17:46	20/04/28 05:17:46
47	20/04/28 05:17:48	20/04/28 05:17:48	20/04/28 05:17:48
114	20/04/28 05:17:50	20/04/28 05:17:50	20/04/28 05:17:50
84	20/04/28 05:17:52	20/04/28 05:17:52	20/04/28 05:17:52
144	20/04/28 05:17:54	20/04/28 05:17:54	20/04/28 05:17:54
95	20/04/28 05:17:56	20/04/28 05:17:56	20/04/28 05:17:56
95	20/04/28 05:17:58	20/04/28 05:17:59	20/04/28 05:17:59
144	20/04/28 05:18:01	20/04/28 05:18:01	20/04/28 05:18:01
49	20/04/28 05:18:03	20/04/28 05:18:03	20/04/28 05:18:03
84	20/04/28 05:18:05	20/04/28 05:18:06	20/04/28 05:18:06
160	20/04/28 05:18:08	20/04/28 05:18:08	20/04/28 05:18:08
46	20/04/28 05:18:10	20/04/28 05:18:10	20/04/28 05:18:10
84	20/04/28 05:18:12	20/04/28 05:18:13	20/04/28 05:18:13
84	20/04/28 05:18:15	20/04/28 05:18:15	20/04/28 05:18:15
84	20/04/28 05:18:17	20/04/28 05:18:17	20/04/28 05:18:17
49	20/04/28 05:18:19	20/04/28 05:18:19	20/04/28 05:18:19
77	20/04/28 05:18:21	20/04/28 05:18:21	20/04/28 05:18:21
77	20/04/28 05:18:23	20/04/28 05:18:23	20/04/28 05:18:23
77	20/04/28 05:18:25	20/04/28 05:18:25	20/04/28 05:18:25
76	20/04/28 05:18:27	20/04/28 05:18:27	20/04/28 05:18:27
84	20/04/28 05:18:29	20/04/28 05:18:29	20/04/28 05:18:29
24	20/04/28 05:18:31	20/04/28 05:18:32	20/04/28 05:18:32
79	20/04/28 05:18:34	20/04/28 05:18:34	20/04/28 05:18:34
24	20/04/28 05:18:36	20/04/28 05:18:36	20/04/28 05:18:36
114	20/04/28 05:18:38	20/04/28 05:18:38	20/04/28 05:18:38
84	20/04/28 05:18:40	20/04/28 05:18:40	20/04/28 05:18:40
83	20/04/28 05:18:42	20/04/28 05:18:42	20/04/28 05:18:42
79	20/04/28 05:18:44	20/04/28 05:18:44	20/04/28 05:18:44
84	20/04/28 05:18:46	20/04/28 05:18:46	20/04/28 05:18:46
