floorId	partitionId	location_x	location_y	timeStamp
3	42	350.89187837601196	258.78037083195954	20/04/28 05:17:35
3	42	351.05113066826397	259.0079888207478	20/04/28 05:17:35
3	42	351.15008536015955	259.1494239463081	20/04/28 05:17:35
3	42	351.2854645885206	259.34292036163436	20/04/28 05:17:35
3	42	351.44062453612213	259.56468919594204	20/04/28 05:17:35
3	42	351.53579378264203	259.7007138156259	20/04/28 05:17:36
3	42	351.6811109283809	259.90841441435384	20/04/28 05:17:36
3	42	351.8233270150165	260.1116826948637	20/04/28 05:17:36
3	42	351.9795523125417	260.33497422503694	20/04/28 05:17:36
3	42	352.1028921519842	260.5112628410082	20/04/28 05:17:36
3	14	351.98555260823537	260.6170429617288	20/04/28 05:17:36
3	14	351.7809545117663	260.6512386706898	20/04/28 05:17:36
3	14	351.5663476895232	260.6871071981156	20/04/28 05:17:36
3	14	351.31632734110576	260.72889460091335	20/04/28 05:17:36
3	14	351.1364426592294	260.75895980843063	20/04/28 05:17:36
3	14	350.97038905656063	260.7867133445914	20/04/28 05:17:37
3	14	350.7707181262284	260.82008554667664	20/04/28 05:17:37
3	14	350.57072703752465	260.85351125875377	20/04/28 05:17:37
3	14	350.40034841274957	260.88198766184126	20/04/28 05:17:37
3	14	350.15908923992214	260.922310756731	20/04/28 05:17:37
3	14	349.8904790355302	260.9672051938341	20/04/28 05:17:37
3	14	349.6948406179619	260.9999034178362	20/04/28 05:17:37
3	14	349.53516481672324	261.02659099373017	20/04/28 05:17:37
3	14	349.2961078965755	261.0665460128998	20/04/28 05:17:37
3	14	349.0425592220191	261.10892312604113	20/04/28 05:17:37
3	14	348.7974943095477	261.14988229706006	20/04/28 05:17:38
3	14	348.7974943095477	261.14988229706006	20/04/28 05:17:38
3	14	348.53982188245163	261.1929486377363	20/04/28 05:17:38
3	14	348.34670103499747	261.2252260851213	20/04/28 05:17:38
3	14	348.1069501854382	261.2652970848821	20/04/28 05:17:38
3	14	347.94727794310944	261.291984065954	20/04/28 05:17:38
3	14	347.70135561999797	261.333086541164	20/04/28 05:17:38
3	14	347.4320202220189	261.3781021842278	20/04/28 05:17:38
3	14	347.16941644128906	261.4219927316614	20/04/28 05:17:38
3	14	346.9970897336319	261.4507947295438	20/04/28 05:17:39
3	14	346.7527255661346	261.49163678084557	20/04/28 05:17:39
3	14	346.5288954785526	261.5290468480151	20/04/28 05:17:39
3	14	346.28263413930154	261.57020598502913	20/04/28 05:17:39
3	14	346.0043796602243	261.6167123276972	20/04/28 05:17:39
3	14	345.75474353097707	261.6584355136369	20/04/28 05:17:39
3	14	345.4960511218034	261.7016723300452	20/04/28 05:17:39
3	14	345.23421792124253	261.745434085786	20/04/28 05:17:39
3	14	344.94785833044216	261.79329508446676	20/04/28 05:17:39
3	14	344.76680901374243	261.8235549443985	20/04/28 05:17:39
3	14	344.6170518731649	261.848584754951	20/04/28 05:17:40
3	14	344.341476162153	261.8946433790199	20/04/28 05:17:40
3	14	344.341476162153	261.8946433790199	20/04/28 05:17:40
3	14	344.1627418604279	261.92451631659173	20/04/28 05:17:40
3	14	344.0143322798395	261.94932090134796	20/04/28 05:17:40
3	14	343.79630281225195	261.9857614760513	20/04/28 05:17:40
3	14	343.5725408235373	262.02316016144806	20/04/28 05:17:40
3	14	343.422313734537	262.0482685173036	20/04/28 05:17:40
3	14	343.2008725040904	262.0852793204293	20/04/28 05:17:40
3	14	342.94821575153776	262.1275073612881	20/04/28 05:17:41
3	14	342.75325439983055	262.16009242320547	20/04/28 05:17:41
3	14	342.51781357235063	262.19944306308423	20/04/28 05:17:41
3	14	342.2995415612607	262.23592417554016	20/04/28 05:17:41
3	14	342.1254069468657	262.2650283397365	20/04/28 05:17:41
3	14	341.90045539701026	262.3026258436328	20/04/28 05:17:41
3	14	341.680925571362	262.3393171821921	20/04/28 05:17:41
3	14	341.4962169132711	262.37018864983355	20/04/28 05:17:41
3	14	341.2904064410709	262.4045869904337	20/04/28 05:17:41
3	14	341.02343382024844	262.44920772835724	20/04/28 05:17:41
3	14	340.74138879363534	262.4963476080062	20/04/28 05:17:42
3	14	340.5535242264701	262.52774654169	20/04/28 05:17:42
3	14	340.3316696003153	262.5648264381239	20/04/28 05:17:42
3	14	340.3316696003153	262.5648264381239	20/04/28 05:17:42
3	14	340.1734470788461	262.59127111863955	20/04/28 05:17:42
3	14	339.9474180723026	262.6290487043449	20/04/28 05:17:42
3	14	339.7307019887048	262.665269765292	20/04/28 05:17:42
3	14	339.4639035769578	262.70986138660624	20/04/28 05:17:42
3	14	339.26572200151196	262.74298466386216	20/04/28 05:17:42
3	14	338.9763817080946	262.79134384527754	20/04/28 05:17:42
3	14	338.7413034859483	262.8306338807486	20/04/28 05:17:43
3	14	338.50499658539377	262.8701292726232	20/04/28 05:17:43
3	14	338.2607800888547	262.91094664279063	20/04/28 05:17:43
3	14	338.0682257648928	262.943129403701	20/04/28 05:17:43
3	14	337.9040187369002	262.9705743107431	20/04/28 05:17:43
3	14	337.6504321681924	263.0129577573616	20/04/28 05:17:43
3	14	337.36316817111697	263.0609699148963	20/04/28 05:17:43
3	14	337.171671199391	263.0929759541756	20/04/28 05:17:43
3	14	336.97014897206117	263.1266575746494	20/04/28 05:17:43
3	14	336.7081554618387	263.17044612390697	20/04/28 05:17:44
3	14	336.42625426453486	263.21756196449945	20/04/28 05:17:44
3	14	336.2359183370007	263.2493739514881	20/04/28 05:17:44
3	14	336.00078067921345	263.2886739207949	20/04/28 05:17:44
3	14	335.7729579308022	263.32675130535426	20/04/28 05:17:44
3	14	335.56629606033437	263.36129194526154	20/04/28 05:17:44
3	14	335.30756510348914	263.40453520437376	20/04/28 05:17:44
3	14	335.10723515006066	263.43801755294805	20/04/28 05:17:44
3	14	334.88271997192817	263.4755421234169	20/04/28 05:17:44
3	14	334.6377763259502	263.51648102643827	20/04/28 05:17:44
3	14	334.44750781802344	263.5482817451829	20/04/28 05:17:45
3	14	334.2409022228523	263.5828129794618	20/04/28 05:17:45
3	14	334.0276800027019	263.618450090022	20/04/28 05:17:45
3	14	333.7375696334941	263.6669379788304	20/04/28 05:17:45
3	14	333.50599687099736	263.7056421257716	20/04/28 05:17:45
3	14	333.2702389292475	263.7450457668633	20/04/28 05:17:45
3	14	333.1054797068268	263.77258296547745	20/04/28 05:17:45
3	14	332.82798864404253	263.8189617137943	20/04/28 05:17:45
3	14	332.63636489240776	263.85098894256134	20/04/28 05:17:45
3	14	332.47355062089105	263.8782010698468	20/04/28 05:17:45
3	14	332.29304779387064	263.9083695916754	20/04/28 05:17:46
3	14	332.0445540087523	263.94990185077836	20/04/28 05:17:46
3	14	331.77953144898055	263.99419666328373	20/04/28 05:17:46
3	14	331.5724823270057	264.02880202686174	20/04/28 05:17:46
3	14	331.3692953719986	264.0627618832729	20/04/28 05:17:46
3	14	331.1635447424033	264.097150222019	20/04/28 05:17:46
3	14	330.9271578213661	264.13665898819755	20/04/28 05:17:46
3	14	330.696359006009	264.17523378070393	20/04/28 05:17:46
3	14	330.53194920945356	264.20271257767405	20/04/28 05:17:46
3	14	330.2879521810618	264.2434932668116	20/04/28 05:17:47
3	14	330.09692719273534	264.27542042066995	20/04/28 05:17:47
3	14	329.89562511118044	264.3090652468579	20/04/28 05:17:47
3	14	329.7021516315173	264.3414016317824	20/04/28 05:17:47
3	14	329.4168175572873	264.38909122971813	20/04/28 05:17:47
3	14	329.1664640867096	264.43093430922374	20/04/28 05:17:47
3	14	329.0075190748167	264.4574997439042	20/04/28 05:17:47
3	14	328.8251952065286	264.4879726272996	20/04/28 05:17:47
3	14	328.8251952065286	264.4879726272996	20/04/28 05:17:47
3	14	328.67696118318247	264.51274787011926	20/04/28 05:17:47
3	14	328.4536049393268	264.55007874094025	20/04/28 05:17:48
3	14	328.2329892614792	264.5869515645007	20/04/28 05:17:48
3	14	328.0250300819237	264.6217090314692	20/04/28 05:17:48
3	14	327.87569218667585	264.64666877103116	20/04/28 05:17:48
3	14	327.6994381773213	264.67612716243906	20/04/28 05:17:48
3	14	327.43632259349084	264.72010325059944	20/04/28 05:17:48
3	14	327.2681955567324	264.7482033322555	20/04/28 05:17:48
3	14	327.1148748137986	264.7738287490777	20/04/28 05:17:48
3	54	326.9096816559551	264.85208329347887	20/04/28 05:17:48
3	54	326.75438865192524	264.96017418292064	20/04/28 05:17:48
3	54	326.5407104002844	265.1089038209266	20/04/28 05:17:49
3	54	326.41758580992143	265.19460405299844	20/04/28 05:17:49
3	54	326.2439256356178	265.31547931597856	20/04/28 05:17:49
3	54	326.11541231470727	265.404930345979	20/04/28 05:17:49
3	54	325.88635403449223	265.56436517304746	20/04/28 05:17:49
3	54	325.74232781989053	265.6646138721855	20/04/28 05:17:49
3	54	325.53967995247086	265.80566586850506	20/04/28 05:17:49
3	14	325.33814771428985	265.94594133688344	20/04/28 05:17:49
3	14	325.3388119208734	265.8743185377217	20/04/28 05:17:49
3	14	325.44133860614306	265.68012399708454	20/04/28 05:17:50
3	14	325.3478537876104	265.53881738800703	20/04/28 05:17:50
3	14	325.2931467937228	265.8021490230976	20/04/28 05:17:50
3	14	325.1837821474373	265.5805374191455	20/04/28 05:17:50
3	14	325.24999607879283	265.37289718339974	20/04/28 05:17:50
3	14	325.30676167724243	265.47648655495766	20/04/28 05:17:50
3	14	325.29687743000176	265.5376966585233	20/04/28 05:17:50
3	14	325.30706911013505	265.5715116870815	20/04/28 05:17:50
3	14	325.3850747477334	265.7563504299827	20/04/28 05:17:50
3	14	325.2225619631842	265.95530727811877	20/04/28 05:17:50
3	14	325.2566962567837	266.0178328840654	20/04/28 05:17:51
3	14	325.2220977061962	265.95220353873157	20/04/28 05:17:51
3	14	325.21835594229555	266.0105631421935	20/04/28 05:17:51
3	14	325.2677103326473	265.9816724264533	20/04/28 05:17:51
3	14	325.4155953956779	266.0058797560624	20/04/28 05:17:51
3	14	325.63808751628494	266.0400585477291	20/04/28 05:17:51
3	14	325.61918532339035	266.10558494741315	20/04/28 05:17:51
3	14	325.3874684789355	266.2397671218073	20/04/28 05:17:51
3	14	325.14570678986627	266.405583581343	20/04/28 05:17:51
3	14	325.188170789713	266.35519517635106	20/04/28 05:17:51
3	14	325.1248859859787	266.3008004602176	20/04/28 05:17:52
3	14	325.0903135349423	266.2005280800325	20/04/28 05:17:52
3	14	325.22857211774925	266.2926308568609	20/04/28 05:17:52
3	14	325.06608291527755	266.29079321596504	20/04/28 05:17:52
3	14	325.1627149514987	266.29488213908974	20/04/28 05:17:52
3	14	325.17092685133116	266.2796526726281	20/04/28 05:17:52
3	14	325.1963304279893	266.2656784092674	20/04/28 05:17:52
3	14	325.1461061446693	266.3694594591492	20/04/28 05:17:52
3	14	325.147250786445	266.2240165933129	20/04/28 05:17:52
3	14	325.2577136836449	266.3006855046572	20/04/28 05:17:53
3	14	325.3499055994608	266.15877923113885	20/04/28 05:17:53
3	14	325.42544658912794	266.0970526261018	20/04/28 05:17:53
3	14	325.3604966238702	266.1218245843321	20/04/28 05:17:53
3	14	325.5587465196468	266.09185478621396	20/04/28 05:17:53
3	14	325.54486032696457	266.25612245045517	20/04/28 05:17:53
3	14	325.509513064423	266.4063331564378	20/04/28 05:17:53
3	14	325.4400619028808	266.1411333862352	20/04/28 05:17:53
3	14	325.578720025385	266.1187918991082	20/04/28 05:17:53
3	14	325.4684412458777	265.95464850772714	20/04/28 05:17:53
3	14	325.3241869751836	265.87180122776215	20/04/28 05:17:54
3	14	325.33847831313227	265.84913350289634	20/04/28 05:17:54
3	14	325.3562462107655	265.97897338545613	20/04/28 05:17:54
3	14	325.562531655719	265.99522528945045	20/04/28 05:17:54
3	14	325.5981602167584	266.17784754356006	20/04/28 05:17:54
3	14	325.5918721006064	266.2342944220376	20/04/28 05:17:54
3	14	325.4571627658193	266.3326157330866	20/04/28 05:17:54
3	14	325.3640009536532	266.3290383142794	20/04/28 05:17:54
3	14	325.42223338853256	266.15419148325856	20/04/28 05:17:54
3	14	325.3055159627472	266.1514171767999	20/04/28 05:17:54
3	14	325.369706066809	265.86923869948527	20/04/28 05:17:55
3	14	325.37731363242324	265.88892661583225	20/04/28 05:17:55
3	14	325.54087029708813	265.73834116183235	20/04/28 05:17:55
3	14	325.26044880483647	265.75388988119414	20/04/28 05:17:55
3	14	325.27564743119757	265.7600718634587	20/04/28 05:17:55
3	14	325.3612332102857	265.7229301648394	20/04/28 05:17:55
3	14	325.2374294588977	265.8355773207171	20/04/28 05:17:55
3	14	325.27587160792046	265.9787697511855	20/04/28 05:17:55
3	14	325.2362996645284	266.0188983021135	20/04/28 05:17:55
3	14	325.371464799554	266.10588746084034	20/04/28 05:17:56
3	14	325.3764967421703	266.11662293328146	20/04/28 05:17:56
3	14	325.4265476154299	265.9807242820038	20/04/28 05:17:56
3	14	325.5335992605419	265.9094893445478	20/04/28 05:17:56
3	14	325.565827822582	265.9412017581785	20/04/28 05:17:56
3	14	325.6879597953557	265.8938539309703	20/04/28 05:17:56
3	14	325.63054920579475	265.903560346565	20/04/28 05:17:56
3	14	325.50375003465666	265.8785666271779	20/04/28 05:17:56
3	14	325.6946693777232	265.7513161180679	20/04/28 05:17:56
3	14	325.8318647787707	266.0100310773616	20/04/28 05:17:56
3	14	325.84002894028856	266.0114816683349	20/04/28 05:17:57
3	14	325.85196922112027	265.8612064220363	20/04/28 05:17:57
3	14	326.129338475732	265.9120520192191	20/04/28 05:17:57
3	14	326.14033206002574	265.9170932065566	20/04/28 05:17:57
3	14	326.1276603110753	265.886833005347	20/04/28 05:17:57
3	14	326.14931410061644	265.9005467422177	20/04/28 05:17:57
3	14	326.2340759229201	265.92374874391663	20/04/28 05:17:57
3	14	326.33982912369675	265.9749033614066	20/04/28 05:17:57
3	14	326.37229947656647	265.99479477486034	20/04/28 05:17:57
3	14	326.26316858468016	265.99711166010746	20/04/28 05:17:58
3	14	326.3702919089887	266.0368270708336	20/04/28 05:17:58
3	14	326.3098728593452	265.770701531675	20/04/28 05:17:58
3	14	326.1145691869146	265.55563693446993	20/04/28 05:17:58
3	14	326.09049852000226	265.5272071512405	20/04/28 05:17:58
3	14	326.16042752995594	265.3200857366348	20/04/28 05:17:58
3	14	326.1624501475202	265.034390906924	20/04/28 05:17:58
3	14	326.2640936343807	265.06855964704533	20/04/28 05:17:58
3	14	326.13852653181243	265.269177458637	20/04/28 05:17:58
3	14	326.13810296531756	265.3209761550335	20/04/28 05:17:58
3	14	326.1873216139319	265.08336638141844	20/04/28 05:17:59
3	14	325.9603486960337	265.20938304740804	20/04/28 05:17:59
3	14	325.9094029188931	265.0497450075126	20/04/28 05:17:59
3	14	326.0963860292907	265.14429884542193	20/04/28 05:17:59
3	14	326.0969913367305	265.23115387546994	20/04/28 05:17:59
3	14	326.00684300961257	265.229557948056	20/04/28 05:17:59
3	14	326.1103381319321	265.1867435355847	20/04/28 05:17:59
3	14	326.1486331150027	265.33548022794906	20/04/28 05:17:59
3	14	326.1851126618119	265.31319744915317	20/04/28 05:17:59
3	14	326.15253162267175	265.5340446313648	20/04/28 05:17:59
3	14	326.16878689765196	265.6821524233245	20/04/28 05:18:00
3	14	326.3680886882589	265.6210616965885	20/04/28 05:18:00
3	14	326.3851502772436	265.57827091303386	20/04/28 05:18:00
3	14	326.2645179694958	265.59536018532424	20/04/28 05:18:00
3	14	326.2051600712878	265.64752079721796	20/04/28 05:18:00
3	14	325.95644547036716	265.5588175551008	20/04/28 05:18:00
3	14	325.9174263714548	265.54026781055126	20/04/28 05:18:00
3	14	325.7948703330858	265.4436300592823	20/04/28 05:18:00
3	14	325.6638154861467	265.45038041721546	20/04/28 05:18:00
3	14	325.75146469521854	265.2929323434159	20/04/28 05:18:01
3	14	325.7603167952423	265.27813285556437	20/04/28 05:18:01
3	14	325.6474348870213	265.2680825106131	20/04/28 05:18:01
3	14	325.6402351589988	265.1944122485429	20/04/28 05:18:01
3	14	325.7562263584416	265.3524116022099	20/04/28 05:18:01
3	14	325.983189487606	265.31603510318473	20/04/28 05:18:01
3	14	325.983189487606	265.31603510318473	20/04/28 05:18:01
3	14	325.9328489529226	265.3659133111186	20/04/28 05:18:01
3	14	325.8511378152395	265.10740698722515	20/04/28 05:18:01
3	14	325.8801667264301	265.00378926049297	20/04/28 05:18:01
3	14	325.8710856539366	265.20067602187663	20/04/28 05:18:02
3	14	325.73854309935456	265.15155425244757	20/04/28 05:18:02
3	14	325.6522782701384	265.3522635835013	20/04/28 05:18:02
3	14	325.70922573237954	265.1086510417127	20/04/28 05:18:02
3	14	325.71647115527895	265.13780336139126	20/04/28 05:18:02
3	14	325.8054263321075	264.92455584301376	20/04/28 05:18:02
3	14	325.664882319944	264.7807095172214	20/04/28 05:18:02
3	14	325.73807935764256	264.616171555415	20/04/28 05:18:02
3	14	325.8910608848465	264.7236096203446	20/04/28 05:18:02
3	14	325.7760700579916	264.62206074546606	20/04/28 05:18:02
3	14	325.6462368959474	264.8371733501061	20/04/28 05:18:03
3	14	325.6652623420476	264.81785784530695	20/04/28 05:18:03
3	14	325.9158281521074	264.93084231259337	20/04/28 05:18:03
3	14	325.9180647812191	264.87744360449835	20/04/28 05:18:03
3	14	326.1187533475183	264.9449901746606	20/04/28 05:18:03
3	14	326.2237177211498	265.0760520063686	20/04/28 05:18:03
3	14	326.23934751303784	265.03943453615256	20/04/28 05:18:03
3	14	326.1354567737114	265.1018493161531	20/04/28 05:18:03
3	14	326.14215121183605	265.04830875298603	20/04/28 05:18:03
3	14	326.0406227833974	264.8790418463871	20/04/28 05:18:04
3	14	325.9553164579443	264.9531663348584	20/04/28 05:18:04
3	14	326.1258311784802	264.8736928686013	20/04/28 05:18:04
3	14	326.14467901710714	264.83618404297556	20/04/28 05:18:04
3	14	326.0659624957794	265.08115763244587	20/04/28 05:18:04
3	14	326.09128472999157	265.2131983959852	20/04/28 05:18:04
3	14	326.0636378003603	265.1511408525252	20/04/28 05:18:04
3	14	326.2509053401231	265.07038684520245	20/04/28 05:18:04
3	14	326.5301913960896	265.1042257778442	20/04/28 05:18:04
3	14	326.7125502994976	265.03349450380915	20/04/28 05:18:04
3	14	326.6169766227946	265.2481603534006	20/04/28 05:18:05
3	14	326.61611438526666	265.24835634013016	20/04/28 05:18:05
3	14	326.5056037748545	265.22798830277446	20/04/28 05:18:05
3	14	326.6560351980514	265.195713972606	20/04/28 05:18:05
3	14	326.6249859193726	265.1182542726221	20/04/28 05:18:05
3	14	326.4378376307353	265.33252597234633	20/04/28 05:18:05
3	14	326.37068467616814	265.0613955564132	20/04/28 05:18:05
3	14	326.37068467616814	265.0613955564132	20/04/28 05:18:05
3	14	326.3809175806842	265.29623822520244	20/04/28 05:18:05
3	14	326.33521221114296	265.3407230845832	20/04/28 05:18:05
3	14	326.3393122414433	265.31711369443656	20/04/28 05:18:06
3	14	326.3393122414433	265.31711369443656	20/04/28 05:18:06
3	14	326.0974079440259	265.57458584152977	20/04/28 05:18:06
3	14	326.0540007544395	265.64895928685473	20/04/28 05:18:06
3	14	326.0670183065328	265.384346309312	20/04/28 05:18:06
3	14	326.1876931693735	265.26484819582356	20/04/28 05:18:06
3	14	326.2753107107557	265.23686529511974	20/04/28 05:18:06
3	14	326.2970357650847	265.2568346082288	20/04/28 05:18:06
3	14	326.2365305195994	265.13490528141153	20/04/28 05:18:06
3	14	326.3249693184156	265.2965255887277	20/04/28 05:18:07
3	14	326.32979432945825	265.1979472433426	20/04/28 05:18:07
3	14	326.4621213253441	265.2099433913197	20/04/28 05:18:07
3	14	326.483380159903	265.18039843751876	20/04/28 05:18:07
3	14	326.43391934091954	265.05899980163935	20/04/28 05:18:07
3	14	326.5712439993176	265.161815074442	20/04/28 05:18:07
3	14	326.761763776083	265.00966152706565	20/04/28 05:18:07
3	14	326.6173580239539	265.10387815780746	20/04/28 05:18:07
3	14	326.6339882229357	265.0582848240583	20/04/28 05:18:07
3	14	326.6742545680615	265.0507722143316	20/04/28 05:18:07
3	14	326.65070050873436	265.0561095311924	20/04/28 05:18:08
3	14	326.61519946719756	264.79713780225796	20/04/28 05:18:08
3	14	326.3837188952452	264.69839682517403	20/04/28 05:18:08
3	14	326.4340412879425	264.63783510078645	20/04/28 05:18:08
3	14	326.46477572169664	264.75284883823105	20/04/28 05:18:08
3	14	326.2755167088558	264.86885349825803	20/04/28 05:18:08
3	14	326.2601782200271	264.9293337000957	20/04/28 05:18:08
3	14	326.2136954226065	264.8224234846897	20/04/28 05:18:08
3	14	326.3564837306098	264.68044291920603	20/04/28 05:18:08
3	14	326.4583579726979	264.81934826140576	20/04/28 05:18:08
3	14	326.7114853667982	264.94255450803	20/04/28 05:18:09
3	14	326.7691208752662	265.11485489442475	20/04/28 05:18:09
3	14	326.75408755277255	265.1129463676132	20/04/28 05:18:09
3	14	326.77172550606866	265.40197121634935	20/04/28 05:18:09
3	14	326.7122753985532	265.23260203178734	20/04/28 05:18:09
3	14	326.7807300783587	265.51552806006544	20/04/28 05:18:09
3	14	326.7544362396909	265.77385745178634	20/04/28 05:18:09
3	14	326.7751314977231	265.78214380124734	20/04/28 05:18:09
3	14	326.67626355959356	265.8041369479982	20/04/28 05:18:09
3	14	326.69641003394094	265.7421652700325	20/04/28 05:18:10
3	14	326.6537749356989	265.53000317030444	20/04/28 05:18:10
3	14	326.745629290739	265.56672039573584	20/04/28 05:18:10
3	14	326.7363249337225	265.58820416919957	20/04/28 05:18:10
3	14	326.7830623364733	265.69361330553227	20/04/28 05:18:10
3	14	326.73815295416006	265.78162117879305	20/04/28 05:18:10
3	14	326.6336449565216	265.5165583124578	20/04/28 05:18:10
3	14	326.64402892031427	265.48822719341985	20/04/28 05:18:10
3	14	326.58097855409585	265.63988575083016	20/04/28 05:18:10
3	14	326.61850207949254	265.6663815607568	20/04/28 05:18:10
3	14	326.6420707337638	265.78207792252505	20/04/28 05:18:11
3	14	326.6655559345609	265.9691738515237	20/04/28 05:18:11
3	14	326.52494428078995	266.2001130276549	20/04/28 05:18:11
3	14	326.4851779056695	266.0882709426055	20/04/28 05:18:11
3	14	326.5598540084699	265.8241080734378	20/04/28 05:18:11
3	14	326.45386209965005	265.69660509822046	20/04/28 05:18:11
3	14	326.2783470568463	265.4559807416454	20/04/28 05:18:11
3	14	326.2783470568463	265.4559807416454	20/04/28 05:18:11
3	14	326.2783470568463	265.4559807416454	20/04/28 05:18:11
3	14	326.21795840062146	265.47992596404475	20/04/28 05:18:11
3	14	326.24595846248224	265.74984629289173	20/04/28 05:18:12
3	14	326.16112323784506	265.53672065115876	20/04/28 05:18:12
3	14	326.4127059502895	265.58981787158075	20/04/28 05:18:12
3	14	326.3959659437206	265.42734026869385	20/04/28 05:18:12
3	14	326.4148738920121	265.43807246603376	20/04/28 05:18:12
3	14	326.3969379223227	265.37696270248	20/04/28 05:18:12
3	14	326.4338106196142	265.3393393528002	20/04/28 05:18:12
3	14	326.41534128387167	265.4402882961306	20/04/28 05:18:12
3	14	326.639758591263	265.28396727567053	20/04/28 05:18:12
3	14	326.62321588716054	265.32492730339845	20/04/28 05:18:13
3	14	326.4516384970532	265.3365558771679	20/04/28 05:18:13
3	14	326.6739673663937	265.3845086953016	20/04/28 05:18:13
3	14	326.6281815255501	265.3217664090847	20/04/28 05:18:13
3	14	326.6753715322251	265.4588089097924	20/04/28 05:18:13
3	14	326.56219749967676	265.6413433196396	20/04/28 05:18:13
3	14	326.55512343953217	265.62960647854277	20/04/28 05:18:13
3	14	326.391061222061	265.4293326413363	20/04/28 05:18:13
3	14	326.3836469808542	265.43551570500017	20/04/28 05:18:13
3	14	326.24336715735603	265.2038297995041	20/04/28 05:18:13
3	14	326.11942485922066	265.00791971332643	20/04/28 05:18:14
3	14	325.8957616831386	265.102481475033	20/04/28 05:18:14
3	14	326.01239991487614	264.83497686719045	20/04/28 05:18:14
3	14	326.02241052596435	264.84497499964544	20/04/28 05:18:14
3	14	325.93770112003716	264.84549925551426	20/04/28 05:18:14
3	14	325.97250743096055	265.11175759747834	20/04/28 05:18:14
3	14	325.8089045422065	265.3429598960723	20/04/28 05:18:14
3	14	325.79296153935366	265.33681558267546	20/04/28 05:18:14
3	14	326.0710531004038	265.3542341279806	20/04/28 05:18:14
3	14	326.1118763771642	265.3709116570707	20/04/28 05:18:14
3	14	325.98398519843596	265.4628452909326	20/04/28 05:18:15
3	14	325.9984035863211	265.41349278218297	20/04/28 05:18:15
3	14	326.15328457306003	265.509273677351	20/04/28 05:18:15
3	14	326.01627935376524	265.49430333053937	20/04/28 05:18:15
3	14	326.16738735522983	265.4142641878769	20/04/28 05:18:15
3	14	326.1614834410622	265.38920169641153	20/04/28 05:18:15
3	14	326.17040965312697	265.51115279257937	20/04/28 05:18:15
3	14	326.0558086314946	265.24516392567904	20/04/28 05:18:15
3	14	326.3000487111136	265.38018561183554	20/04/28 05:18:15
3	14	326.11473218182414	265.26266468510715	20/04/28 05:18:16
3	14	326.18554130918886	265.17639782464624	20/04/28 05:18:16
3	14	326.20621766595065	265.153654748567	20/04/28 05:18:16
3	14	326.3653449862694	265.2787756737778	20/04/28 05:18:16
3	14	326.4976398344737	265.4337310863337	20/04/28 05:18:16
3	14	326.5176983783355	265.5597630391423	20/04/28 05:18:16
3	14	326.3767202330391	265.772573805009	20/04/28 05:18:16
3	14	326.1309080934257	265.72887901575064	20/04/28 05:18:16
3	14	326.20323587032823	265.44269171149824	20/04/28 05:18:16
3	14	326.2964534401111	265.674567110422	20/04/28 05:18:16
3	14	326.11416030842406	265.857649129416	20/04/28 05:18:17
3	14	326.12359079714	265.78460220701464	20/04/28 05:18:17
3	14	326.0808906131073	265.70034623621586	20/04/28 05:18:17
3	14	326.2663603033252	265.82689843983246	20/04/28 05:18:17
3	14	326.28579189119836	265.9358197379937	20/04/28 05:18:17
3	14	326.15643104282066	265.9280722659609	20/04/28 05:18:17
3	14	326.13128700960135	265.77992610477605	20/04/28 05:18:17
3	14	325.85213909493393	265.7860213592754	20/04/28 05:18:17
3	14	325.83899958769763	265.7584249279019	20/04/28 05:18:17
3	14	325.81328952298674	266.0079211222717	20/04/28 05:18:17
3	14	325.6042811213895	266.18555475354134	20/04/28 05:18:18
3	14	325.60145394043104	266.1937117331319	20/04/28 05:18:18
3	14	325.6357659833072	266.0211983755326	20/04/28 05:18:18
3	14	325.597998127295	265.9258129102236	20/04/28 05:18:18
3	14	325.5443488917241	266.0967370555572	20/04/28 05:18:18
3	14	325.59378175791903	266.19918336525063	20/04/28 05:18:18
3	14	325.75705933471164	266.2112504114049	20/04/28 05:18:18
3	14	325.78371936844826	266.39008547491034	20/04/28 05:18:18
3	14	325.8005467376239	266.42123408496303	20/04/28 05:18:18
3	14	325.5820747739826	266.28457620463706	20/04/28 05:18:19
3	14	325.5982595706286	266.34311853601747	20/04/28 05:18:19
3	14	325.40023601325134	266.4495524268882	20/04/28 05:18:19
3	14	325.38471618759905	266.4248730673611	20/04/28 05:18:19
3	14	325.2534313467152	266.5178113637704	20/04/28 05:18:19
3	14	325.0328561371141	266.40642560845123	20/04/28 05:18:19
3	14	325.0255951896818	266.4230810859379	20/04/28 05:18:19
3	14	324.9799095113134	266.28129712052925	20/04/28 05:18:19
3	14	324.9126643261168	266.21225342807963	20/04/28 05:18:19
3	14	324.9506720875985	266.2472230894517	20/04/28 05:18:19
3	14	324.97016606545225	266.248813594172	20/04/28 05:18:20
3	14	325.14440983821004	266.06971611526774	20/04/28 05:18:20
3	14	325.1992944285079	266.05213564717485	20/04/28 05:18:20
3	14	325.1322155441299	266.0604039418971	20/04/28 05:18:20
3	14	325.00376649488237	265.88442196756097	20/04/28 05:18:20
3	14	325.0792760101035	265.7865722329635	20/04/28 05:18:20
3	14	325.0995001104186	265.89305847591197	20/04/28 05:18:20
3	14	325.08601895465216	265.90133808457	20/04/28 05:18:20
3	14	325.11802513985896	265.94953011455686	20/04/28 05:18:20
3	14	325.1172358979511	265.8693301252939	20/04/28 05:18:20
3	14	325.08253612188304	266.1659019766056	20/04/28 05:18:21
3	14	325.29524682636827	266.0884493982319	20/04/28 05:18:21
3	14	325.2850691523703	266.0713232576632	20/04/28 05:18:21
3	14	325.4377156210503	266.0154548509645	20/04/28 05:18:21
3	14	325.43935994220294	266.0732382424163	20/04/28 05:18:21
3	14	325.2430657566192	266.2471489177574	20/04/28 05:18:21
3	14	325.1342015797658	266.2604970795305	20/04/28 05:18:21
3	14	325.1680461656285	266.2518583548413	20/04/28 05:18:21
3	14	325.1516511305531	266.38525581563954	20/04/28 05:18:21
3	14	325.07552549290705	266.5669334265106	20/04/28 05:18:22
3	14	324.848336266391	266.46851695281913	20/04/28 05:18:22
3	14	324.8467575728151	266.46843301371683	20/04/28 05:18:22
3	14	325.0130098794364	266.2789711471657	20/04/28 05:18:22
3	14	325.289796005797	266.37284135616875	20/04/28 05:18:22
3	14	325.1143195522179	266.2069332699084	20/04/28 05:18:22
3	14	325.34557730465025	266.0883235940724	20/04/28 05:18:22
3	14	325.5208912360014	265.8882138327626	20/04/28 05:18:22
3	14	325.6165149314599	266.15166554137625	20/04/28 05:18:22
3	14	325.6548233150903	266.28379560506517	20/04/28 05:18:22
3	14	325.61996212019824	266.449624824908	20/04/28 05:18:23
3	14	325.64040749026054	266.32088400378984	20/04/28 05:18:23
3	14	325.6880023608984	266.25035417896765	20/04/28 05:18:23
3	14	325.59246623571005	266.1727807184384	20/04/28 05:18:23
3	14	325.54852938090346	266.21658066186666	20/04/28 05:18:23
3	14	325.67709755530984	266.33844263123444	20/04/28 05:18:23
3	14	325.6759914489893	266.34159296744076	20/04/28 05:18:23
3	14	325.7564908606455	266.36093461078883	20/04/28 05:18:23
3	14	325.7594684492016	266.3598051582346	20/04/28 05:18:23
3	14	325.801145581853	266.2059444197289	20/04/28 05:18:23
3	14	325.6707252320373	266.28157196914214	20/04/28 05:18:24
3	14	325.71978009119596	266.487814159868	20/04/28 05:18:24
3	14	325.71978009119596	266.487814159868	20/04/28 05:18:24
3	14	325.71978009119596	266.487814159868	20/04/28 05:18:24
3	14	325.99235238774503	266.472920126451	20/04/28 05:18:24
3	14	325.9836667342368	266.465631525519	20/04/28 05:18:24
3	14	325.98438948937746	266.45210705322836	20/04/28 05:18:24
3	14	326.22773385364184	266.5160785597897	20/04/28 05:18:24
3	14	326.24887679350303	266.6031126383923	20/04/28 05:18:24
3	14	326.3560829790606	266.42881393209376	20/04/28 05:18:25
3	14	326.3526612889016	266.34463978650626	20/04/28 05:18:25
3	14	326.5967630273422	266.19857068785825	20/04/28 05:18:25
3	14	326.3022244722911	266.172079075956	20/04/28 05:18:25
3	14	326.2895924821527	266.14207366020025	20/04/28 05:18:25
3	14	326.37690785129485	266.15823509627114	20/04/28 05:18:25
3	14	326.34033858409555	266.1660583034406	20/04/28 05:18:25
3	14	326.2389479526273	266.1423213943716	20/04/28 05:18:25
3	14	326.22440977100666	266.1821176194887	20/04/28 05:18:25
3	14	326.01037837827386	266.37463522654133	20/04/28 05:18:25
3	14	326.05485844662513	266.3931057885588	20/04/28 05:18:26
3	14	326.06218359640707	266.59525892735496	20/04/28 05:18:26
3	14	326.08126081268443	266.623410784827	20/04/28 05:18:26
3	14	326.11288034465736	266.60968243465214	20/04/28 05:18:26
3	14	326.04986495782424	266.5037089927866	20/04/28 05:18:26
3	14	326.2000808074481	266.2881557018404	20/04/28 05:18:26
3	14	326.37479703002845	266.3401743068025	20/04/28 05:18:26
3	14	326.3573431628149	266.3230862531217	20/04/28 05:18:26
3	14	326.29194588261436	266.3939481082619	20/04/28 05:18:26
3	14	326.20866592519894	266.508506576354	20/04/28 05:18:26
3	14	326.3290039028634	266.5499374703171	20/04/28 05:18:27
3	14	326.1158349458624	266.39666146149756	20/04/28 05:18:27
3	14	326.14045169654094	266.3715430815221	20/04/28 05:18:27
3	14	326.0762014507412	266.5874722004814	20/04/28 05:18:27
3	14	325.98788357696304	266.6731577935759	20/04/28 05:18:27
3	14	326.027028999289	266.7246735076093	20/04/28 05:18:27
3	14	325.97123348027867	266.79899517288953	20/04/28 05:18:27
3	14	326.0618343773542	266.6240268889967	20/04/28 05:18:27
3	14	326.10691138390615	266.667626401002	20/04/28 05:18:27
3	14	326.09328702626317	266.692580291551	20/04/28 05:18:28
3	14	326.1957600879225	266.610964041756	20/04/28 05:18:28
3	14	326.2948907892575	266.60294649968836	20/04/28 05:18:28
3	14	326.2621273171147	266.61301205997137	20/04/28 05:18:28
3	14	326.5363448225916	266.6040956686903	20/04/28 05:18:28
3	14	326.4760430536142	266.55857397380146	20/04/28 05:18:28
3	14	326.53999476065155	266.7154036867272	20/04/28 05:18:28
3	14	326.66040235812255	266.66051093340315	20/04/28 05:18:28
3	14	326.6598872253692	266.7798742261688	20/04/28 05:18:28
3	14	326.85673111645417	266.8970021046563	20/04/28 05:18:28
3	14	326.940830417072	266.7302070470567	20/04/28 05:18:29
3	14	326.78246361282555	266.63140285108153	20/04/28 05:18:29
3	14	326.7320082124095	266.7664728518979	20/04/28 05:18:29
3	14	326.6418560905574	266.7572008068421	20/04/28 05:18:29
3	14	326.6103033765026	266.7676130029576	20/04/28 05:18:29
3	14	326.517334532082	266.6521400399437	20/04/28 05:18:29
3	14	326.6359282138407	266.6600046004813	20/04/28 05:18:29
3	14	326.61538721184803	266.8730435067859	20/04/28 05:18:29
3	14	326.5610822869357	266.9691124840045	20/04/28 05:18:29
3	14	326.48668785943676	266.97455318332067	20/04/28 05:18:29
3	14	326.6005077166131	266.7138651611865	20/04/28 05:18:30
3	14	326.5077783760923	266.65568418338376	20/04/28 05:18:30
3	14	326.50312930338504	266.62175799109474	20/04/28 05:18:30
3	14	326.5195403918366	266.6947146039185	20/04/28 05:18:30
3	14	326.58896696902013	266.8936615848521	20/04/28 05:18:30
3	14	326.6057222971648	266.70382768438384	20/04/28 05:18:30
3	14	326.6099166630185	266.4872451190515	20/04/28 05:18:30
3	14	326.5121991155152	266.44004737691336	20/04/28 05:18:30
3	14	326.4103802646849	266.5073793554915	20/04/28 05:18:30
3	14	326.40349497851435	266.5228626733196	20/04/28 05:18:31
3	14	326.49771345551216	266.7718923562881	20/04/28 05:18:31
3	14	326.4864004131307	266.7354598039701	20/04/28 05:18:31
3	14	326.25078205309813	266.88166235253783	20/04/28 05:18:31
3	14	326.2783395257513	266.8997536662996	20/04/28 05:18:31
3	14	326.33537496385	266.7804002652298	20/04/28 05:18:31
3	14	326.4374048255643	266.66227971743695	20/04/28 05:18:31
3	14	326.3596376133502	266.9358419404926	20/04/28 05:18:31
3	14	326.4091587174096	266.8411510672431	20/04/28 05:18:31
3	14	326.37561706215195	266.8160065164614	20/04/28 05:18:31
3	14	326.4048524290223	266.76629302480416	20/04/28 05:18:32
3	14	326.49269449246316	266.62945655900216	20/04/28 05:18:32
3	14	326.60401770022787	266.77325947688604	20/04/28 05:18:32
3	14	326.5750013297381	266.90365988241047	20/04/28 05:18:32
3	14	326.5477749229655	266.8982655344799	20/04/28 05:18:32
3	14	326.3866418634679	267.097553768443	20/04/28 05:18:32
3	14	326.49417933597107	267.0739989694028	20/04/28 05:18:32
3	14	326.54955287913344	267.1479801763674	20/04/28 05:18:32
3	14	326.38368114042254	267.05227015802205	20/04/28 05:18:32
3	14	326.437072869346	267.0590194636494	20/04/28 05:18:32
3	14	326.384919127267	266.8983657540301	20/04/28 05:18:33
3	14	326.29841444075777	266.8797867488836	20/04/28 05:18:33
3	14	326.1354990587505	266.94159812506103	20/04/28 05:18:33
3	14	326.08804294554415	267.23630730243224	20/04/28 05:18:33
3	14	326.18105719351456	267.2987729840636	20/04/28 05:18:33
3	14	326.3020771040071	267.2698444396741	20/04/28 05:18:33
3	14	326.27494895662744	267.09903459098325	20/04/28 05:18:33
3	14	326.38522852719325	267.34827322730393	20/04/28 05:18:33
3	14	326.38522852719325	267.34827322730393	20/04/28 05:18:33
3	14	326.38522852719325	267.34827322730393	20/04/28 05:18:34
3	14	326.44640654632525	267.13299964291457	20/04/28 05:18:34
3	14	326.51806006397055	266.88086481088743	20/04/28 05:18:34
3	14	326.5908061009638	266.62488561515937	20/04/28 05:18:34
3	14	326.65825202647676	266.38755648382045	20/04/28 05:18:34
3	14	326.73208550078976	266.12775080706297	20/04/28 05:18:34
3	14	326.80514383314085	265.8706727045376	20/04/28 05:18:34
3	14	326.84739105937786	265.72201290888574	20/04/28 05:18:34
3	14	326.89311983675	265.56110221000546	20/04/28 05:18:34
3	14	326.95885680233084	265.32978657723	20/04/28 05:18:34
3	47	326.9337248314988	265.199037769389	20/04/28 05:18:35
3	47	326.7373338643354	265.16137924472434	20/04/28 05:18:35
3	47	326.472984996346	265.1106895999354	20/04/28 05:18:35
3	47	326.2841944575461	265.07448847895444	20/04/28 05:18:35
3	47	326.11258055974406	265.04158102757555	20/04/28 05:18:35
3	47	325.9587280674426	265.0120793760498	20/04/28 05:18:35
3	47	325.68107456202887	264.95883852932	20/04/28 05:18:35
3	47	325.68107456202887	264.95883852932	20/04/28 05:18:35
3	47	325.39052621329176	264.90312505982985	20/04/28 05:18:35
3	47	325.1455367537669	264.8561476364923	20/04/28 05:18:35
3	47	324.9369591179119	264.81615228356037	20/04/28 05:18:36
3	47	324.72829100332353	264.7761395810748	20/04/28 05:18:36
3	47	324.5444871833986	264.740894677574	20/04/28 05:18:36
3	47	324.28238951164826	264.6906367060454	20/04/28 05:18:36
3	47	324.0126853965409	264.63892017744104	20/04/28 05:18:36
3	47	323.7659811602781	264.5916139408031	20/04/28 05:18:36
3	47	323.4964917949276	264.5399385910734	20/04/28 05:18:36
3	47	323.28559565742125	264.49949865887754	20/04/28 05:18:36
3	47	323.1141046461192	264.46661477133335	20/04/28 05:18:36
3	47	322.8796023151277	264.42164828462	20/04/28 05:18:37
3	47	322.69180518441385	264.38563765245556	20/04/28 05:18:37
3	47	322.496513392496	264.34818989776005	20/04/28 05:18:37
3	47	322.2209172307789	264.29534355251604	20/04/28 05:18:37
3	47	322.0403630774355	264.2607217817941	20/04/28 05:18:37
3	47	321.85455499746934	264.22509255574886	20/04/28 05:18:37
3	47	321.66731388702823	264.1891885420479	20/04/28 05:18:37
3	47	321.46895185978207	264.1511520610249	20/04/28 05:18:37
3	47	321.19773448175005	264.0991453599651	20/04/28 05:18:37
3	47	321.02360641741996	264.06575581002755	20/04/28 05:18:37
3	47	320.77582615731814	264.0182432427683	20/04/28 05:18:38
3	47	320.5524599205506	263.97541213369	20/04/28 05:18:38
3	47	320.39045965204133	263.9443481229798	20/04/28 05:18:38
3	47	320.23832114054443	263.915175132132	20/04/28 05:18:38
3	47	320.08875267588013	263.88649495504967	20/04/28 05:18:38
3	47	319.8110588555986	263.8332463778297	20/04/28 05:18:38
3	47	319.63893720516336	263.8002415634441	20/04/28 05:18:38
3	47	319.3674473701635	263.7481826179884	20/04/28 05:18:38
3	47	319.14510803019084	263.70554841928146	20/04/28 05:18:38
3	47	318.93123922776675	263.66453847016095	20/04/28 05:18:38
3	47	318.7389919583023	263.6276745112762	20/04/28 05:18:39
3	47	318.56893975033927	263.5950665183509	20/04/28 05:18:39
3	47	318.40538498848775	263.56370442913584	20/04/28 05:18:39
3	47	318.21285513471616	263.5267862839092	20/04/28 05:18:39
3	47	317.9501018452955	263.47640259583386	20/04/28 05:18:39
3	47	317.66607010732764	263.4219387049314	20/04/28 05:18:39
3	47	317.4001627721308	263.3709502196377	20/04/28 05:18:39
3	47	317.11965667280407	263.3171623799388	20/04/28 05:18:39
3	47	316.84296466580366	263.2641059032553	20/04/28 05:18:39
3	47	316.56395014781106	263.21060407850547	20/04/28 05:18:40
3	47	316.36393190864754	263.1722500141525	20/04/28 05:18:40
3	47	316.18502455266565	263.1379440214928	20/04/28 05:18:40
3	47	315.9257938544634	263.0882358002691	20/04/28 05:18:40
3	47	315.6735290981365	263.03986331814644	20/04/28 05:18:40
3	47	315.4280927354128	262.99280019985366	20/04/28 05:18:40
3	47	315.20075341668877	262.94920724104765	20/04/28 05:18:40
3	47	314.94935993131105	262.90100182759926	20/04/28 05:18:40
3	47	314.7128625472221	262.8556527837991	20/04/28 05:18:40
3	47	314.5306095906536	262.8207052627431	20/04/28 05:18:40
3	47	314.3408511800863	262.78431854960706	20/04/28 05:18:41
3	47	314.1227571184066	262.74249839504694	20/04/28 05:18:41
3	47	313.90790149123524	262.7012992194838	20/04/28 05:18:41
3	47	313.61956784349326	262.6460104251875	20/04/28 05:18:41
3	47	313.33514803919667	262.59147212146644	20/04/28 05:18:41
3	47	313.18600440881295	262.56287340756165	20/04/28 05:18:41
3	47	312.95749486872546	262.519056055492	20/04/28 05:18:41
3	47	312.6782654805888	262.46551302878294	20/04/28 05:18:41
3	47	312.4543215815596	262.42257115132844	20/04/28 05:18:41
3	47	312.22758926423376	262.3790945867612	20/04/28 05:18:41
3	47	311.93908129700014	262.32377236620823	20/04/28 05:18:42
3	47	311.7761110639432	262.2925223620465	20/04/28 05:18:42
3	47	311.5352585512947	262.2463382099995	20/04/28 05:18:42
3	47	311.33545377729496	262.20802507819684	20/04/28 05:18:42
3	47	311.1391806295369	262.1703891457371	20/04/28 05:18:42
3	47	310.9140159366962	262.12721317760867	20/04/28 05:18:42
3	47	310.71922339752564	262.0898611560427	20/04/28 05:18:42
3	47	310.48714769468245	262.04535998215556	20/04/28 05:18:42
3	47	310.30160463867736	262.00978157520615	20/04/28 05:18:42
3	47	310.0389895946696	261.95942439608064	20/04/28 05:18:43
3	47	309.88499182551504	261.9298948873065	20/04/28 05:18:43
3	47	309.7316965832604	261.9005000900569	20/04/28 05:18:43
3	47	309.47785936768224	261.8518260844153	20/04/28 05:18:43
3	47	309.1849162810275	261.795653417141	20/04/28 05:18:43
3	47	309.02105895210343	261.7642333098321	20/04/28 05:18:43
3	47	308.8220648202885	261.72607562096624	20/04/28 05:18:43
3	47	308.6640995576402	261.695785334068	20/04/28 05:18:43
3	47	308.456470725846	261.65597191700425	20/04/28 05:18:43
3	47	308.1733886548564	261.6016901274369	20/04/28 05:18:43
3	47	307.96099561802095	261.56096316055135	20/04/28 05:18:44
3	47	307.7731205411697	261.5249375819941	20/04/28 05:18:44
3	47	307.54702516530534	261.48158315275765	20/04/28 05:18:44
3	47	307.36809286637106	261.4472723772161	20/04/28 05:18:44
3	47	307.11363683862817	261.3984797125878	20/04/28 05:18:44
3	47	306.963917342807	261.369770574853	20/04/28 05:18:44
3	47	306.7805582081573	261.33461094101426	20/04/28 05:18:44
3	47	306.61755207868123	261.3033540536124	20/04/28 05:18:44
3	47	306.4246761594927	261.26636954936106	20/04/28 05:18:44
3	47	306.210032224978	261.22521096646494	20/04/28 05:18:44
3	47	305.95265828206294	261.1758587833309	20/04/28 05:18:45
3	47	305.67950480786635	261.1234808303433	20/04/28 05:18:45
3	47	305.5528605584405	261.24004607982477	20/04/28 05:18:45
3	47	305.4311575023426	261.3811821698528	20/04/28 05:18:45
3	47	305.25016420648154	261.59107571663924	20/04/28 05:18:45
3	47	305.070874464015	261.7989936937648	20/04/28 05:18:45
3	47	304.907666966363	261.98826148062585	20/04/28 05:18:45
3	47	304.80119620263747	262.1117330496754	20/04/28 05:18:45
3	47	304.6095331927706	262.3340000056824	20/04/28 05:18:45
3	47	304.44716941846696	262.52228934698695	20/04/28 05:18:46
3	47	304.31550330715925	262.67497935112476	20/04/28 05:18:46
3	47	304.2146658925104	262.7919180615268	20/04/28 05:18:46
3	47	304.03717063455497	262.9977550183754	20/04/28 05:18:46
3	47	303.8712238069543	263.1901995399106	20/04/28 05:18:46
3	47	303.7029906506286	263.38529546155945	20/04/28 05:18:46
3	47	303.5347370830923	263.5804150535954	20/04/28 05:18:46
3	47	303.413956034559	263.72048191375524	20/04/28 05:18:46
3	47	303.26644605556487	263.8915456679688	20/04/28 05:18:46
3	47	303.1368530635314	264.0418315258353	20/04/28 05:18:46
3	47	302.9985395578455	264.2022303524259	20/04/28 05:18:47
3	47	302.81292981802903	264.4174774775906	20/04/28 05:18:47
3	47	302.7148506497325	264.5312175164228	20/04/28 05:18:47
3	47	302.60409198894297	264.6596616559686	20/04/28 05:18:47
3	47	302.4645387836338	264.8214981322226	20/04/28 05:18:47
1	98	302.39113057166526	265.0044497900694	20/04/28 05:18:47
1	98	302.39384021627103	265.1992772141826	20/04/28 05:18:47
1	98	302.39769534073247	265.47646632114527	20/04/28 05:18:47
1	98	302.4013568734987	265.7397359010894	20/04/28 05:18:47
1	98	302.4049791703389	266.000184360363	20/04/28 05:18:47
1	98	302.4090605103526	266.29363869755633	20/04/28 05:18:48
1	98	302.41232483678687	266.5283485592494	20/04/28 05:18:48
1	98	302.4162590598243	266.8112249699207	20/04/28 05:18:48
1	98	302.41906997997285	267.01333425420415	20/04/28 05:18:48
1	98	302.4230672886886	267.3007466177408	20/04/28 05:18:48
1	98	302.4270120865416	267.5843833731717	20/04/28 05:18:48
1	98	302.4292043366065	267.74200937041724	20/04/28 05:18:48
1	98	302.4324513671829	267.97547563454617	20/04/28 05:18:48
1	98	302.43561077110394	268.2026414135398	20/04/28 05:18:48
1	98	302.4383146454155	268.3970539450332	20/04/28 05:18:49
