stationId	t_start	t_end	t_max	timeStamp
109	20/04/28 05:16:03	20/04/28 05:16:04	20/04/28 05:16:03
140	20/04/28 05:16:06	20/04/28 05:16:06	20/04/28 05:16:06
2	20/04/28 05:16:08	20/04/28 05:16:08	20/04/28 05:16:08
109	20/04/28 05:16:10	20/04/28 05:16:10	20/04/28 05:16:10
77	20/04/28 05:16:12	20/04/28 05:16:12	20/04/28 05:16:12
37	20/04/28 05:16:14	20/04/28 05:16:14	20/04/28 05:16:14
56	20/04/28 05:16:16	20/04/28 05:16:16	20/04/28 05:16:16
63	20/04/28 05:16:18	20/04/28 05:16:18	20/04/28 05:16:18
140	20/04/28 05:16:20	20/04/28 05:16:20	20/04/28 05:16:20
109	20/04/28 05:16:22	20/04/28 05:16:22	20/04/28 05:16:22
159	20/04/28 05:16:24	20/04/28 05:16:25	20/04/28 05:16:25
37	20/04/28 05:16:27	20/04/28 05:16:27	20/04/28 05:16:27
70	20/04/28 05:16:29	20/04/28 05:16:29	20/04/28 05:16:29
70	20/04/28 05:16:31	20/04/28 05:16:32	20/04/28 05:16:32
77	20/04/28 05:16:34	20/04/28 05:16:34	20/04/28 05:16:34
70	20/04/28 05:16:36	20/04/28 05:16:37	20/04/28 05:16:36
70	20/04/28 05:16:39	20/04/28 05:16:39	20/04/28 05:16:39
2	20/04/28 05:16:41	20/04/28 05:16:42	20/04/28 05:16:42
70	20/04/28 05:16:44	20/04/28 05:16:45	20/04/28 05:16:45
2	20/04/28 05:16:47	20/04/28 05:16:47	20/04/28 05:16:47
129	20/04/28 05:16:49	20/04/28 05:16:49	20/04/28 05:16:49
70	20/04/28 05:16:51	20/04/28 05:16:51	20/04/28 05:16:51
2	20/04/28 05:16:53	20/04/28 05:16:53	20/04/28 05:16:53
77	20/04/28 05:16:55	20/04/28 05:16:55	20/04/28 05:16:55
77	20/04/28 05:16:57	20/04/28 05:16:58	20/04/28 05:16:58
70	20/04/28 05:17:00	20/04/28 05:17:01	20/04/28 05:17:01
70	20/04/28 05:17:03	20/04/28 05:17:03	20/04/28 05:17:03
2	20/04/28 05:17:05	20/04/28 05:17:05	20/04/28 05:17:05
77	20/04/28 05:17:07	20/04/28 05:17:07	20/04/28 05:17:07
112	20/04/28 05:17:09	20/04/28 05:17:09	20/04/28 05:17:09
63	20/04/28 05:17:11	20/04/28 05:17:11	20/04/28 05:17:11
129	20/04/28 05:17:13	20/04/28 05:17:13	20/04/28 05:17:13
77	20/04/28 05:17:15	20/04/28 05:17:15	20/04/28 05:17:15
70	20/04/28 05:17:17	20/04/28 05:17:18	20/04/28 05:17:18
2	20/04/28 05:17:20	20/04/28 05:17:20	20/04/28 05:17:20
63	20/04/28 05:17:22	20/04/28 05:17:22	20/04/28 05:17:22
144	20/04/28 05:17:24	20/04/28 05:17:24	20/04/28 05:17:24
112	20/04/28 05:17:26	20/04/28 05:17:27	20/04/28 05:17:26
109	20/04/28 05:17:29	20/04/28 05:17:29	20/04/28 05:17:29
70	20/04/28 05:17:31	20/04/28 05:17:31	20/04/28 05:17:31
129	20/04/28 05:17:33	20/04/28 05:17:33	20/04/28 05:17:33
109	20/04/28 05:13:31	20/04/28 05:17:35	20/04/28 05:13:31
70	20/04/28 05:17:37	20/04/28 05:17:37	20/04/28 05:17:37
77	20/04/28 05:17:39	20/04/28 05:17:40	20/04/28 05:17:40
51	20/04/28 05:17:42	20/04/28 05:17:42	20/04/28 05:17:42
160	20/04/28 05:17:44	20/04/28 05:17:44	20/04/28 05:17:44
160	20/04/28 05:17:46	20/04/28 05:17:47	20/04/28 05:17:47
77	20/04/28 05:17:49	20/04/28 05:17:50	20/04/28 05:17:49
160	20/04/28 05:17:52	20/04/28 05:17:52	20/04/28 05:17:52
13	20/04/28 05:17:54	20/04/28 05:17:55	20/04/28 05:17:55
162	20/04/28 05:13:43	20/04/28 05:17:57	20/04/28 05:13:43
77	20/04/28 05:17:59	20/04/28 05:17:59	20/04/28 05:17:59
13	20/04/28 05:18:01	20/04/28 05:18:02	20/04/28 05:18:02
70	20/04/28 05:18:04	20/04/28 05:18:04	20/04/28 05:18:04
129	20/04/28 05:18:06	20/04/28 05:18:06	20/04/28 05:18:06
77	20/04/28 05:12:44	20/04/28 05:12:44	20/04/28 05:12:44
63	20/04/28 05:18:11	20/04/28 05:18:11	20/04/28 05:18:11
77	20/04/28 05:18:13	20/04/28 05:18:13	20/04/28 05:18:13
129	20/04/28 05:18:15	20/04/28 05:18:15	20/04/28 05:18:15
129	20/04/28 05:18:17	20/04/28 05:18:17	20/04/28 05:18:17
109	20/04/28 05:18:19	20/04/28 05:18:19	20/04/28 05:18:19
63	20/04/28 05:18:21	20/04/28 05:18:21	20/04/28 05:18:21
109	20/04/28 05:18:23	20/04/28 05:18:24	20/04/28 05:18:24
160	20/04/28 05:18:26	20/04/28 05:18:26	20/04/28 05:18:26
160	20/04/28 05:18:28	20/04/28 05:18:28	20/04/28 05:18:28
160	20/04/28 05:18:30	20/04/28 05:18:30	20/04/28 05:18:30
77	20/04/28 05:18:32	20/04/28 05:18:32	20/04/28 05:18:32
109	20/04/28 05:18:34	20/04/28 05:18:34	20/04/28 05:18:34
64	20/04/28 05:18:36	20/04/28 05:18:36	20/04/28 05:18:36
109	20/04/28 05:18:38	20/04/28 05:18:38	20/04/28 05:18:38
77	20/04/28 05:18:40	20/04/28 05:18:41	20/04/28 05:18:41
108	20/04/28 05:18:43	20/04/28 05:18:43	20/04/28 05:18:43
108	20/04/28 05:18:45	20/04/28 05:18:45	20/04/28 05:18:45
56	20/04/28 05:18:47	20/04/28 05:18:47	20/04/28 05:18:47
