floorId	partitionId	location_x	location_y	timeStamp
1	39	323.0934417610824	276.80430912710955	20/04/28 05:11:22
1	39	323.0934417610824	276.80430912710955	20/04/28 05:11:23
1	39	323.0934417610824	276.80430912710955	20/04/28 05:11:24
1	39	323.0934417610824	276.80430912710955	20/04/28 05:11:25
1	39	323.3383314215366	280.86391247132065	20/04/28 05:11:26
1	39	323.0934417610824	276.80430912710955	20/04/28 05:11:27
1	39	323.0934417610824	276.80430912710955	20/04/28 05:11:28
1	39	323.3383314215366	280.86391247132065	20/04/28 05:11:29
1	39	323.3383314215366	280.86391247132065	20/04/28 05:11:30
1	39	323.3383314215366	280.86391247132065	20/04/28 05:11:31
1	39	323.3383314215366	280.86391247132065	20/04/28 05:11:32
1	39	323.3383314215366	280.8639124713207	20/04/28 05:11:33
1	39	323.3383314215366	280.8639124713207	20/04/28 05:11:34
1	39	323.3383314215366	280.8639124713207	20/04/28 05:11:35
1	59	326.05929279280866	283.41059588634107	20/04/28 05:11:36
1	39	323.3383314215366	280.8639124713207	20/04/28 05:11:37
1	39	323.3383314215366	280.8639124713207	20/04/28 05:11:38
1	59	326.05929279280866	283.41059588634107	20/04/28 05:11:39
1	39	323.3383314215366	280.8639124713207	20/04/28 05:11:40
1	39	323.3383314215366	280.8639124713207	20/04/28 05:11:41
1	39	323.3383314215366	280.8639124713207	20/04/28 05:11:42
1	39	323.3383314215366	280.8639124713207	20/04/28 05:11:43
1	39	323.3383314215366	280.8639124713207	20/04/28 05:11:44
1	39	323.3383314215366	280.8639124713207	20/04/28 05:11:45
1	39	323.3383314215366	280.86391247132065	20/04/28 05:11:46
1	39	323.3383314215366	280.8639124713207	20/04/28 05:11:47
1	39	323.3383314215366	280.8639124713207	20/04/28 05:11:48
1	39	323.3383314215366	280.8639124713207	20/04/28 05:11:49
1	39	323.3383314215366	280.8639124713207	20/04/28 05:11:50
1	39	323.3383314215366	280.8639124713207	20/04/28 05:11:51
1	39	323.3383314215366	280.8639124713207	20/04/28 05:11:52
1	39	323.3383314215366	280.8639124713207	20/04/28 05:11:53
1	39	323.3383314215366	280.8639124713207	20/04/28 05:11:54
1	39	323.3383314215366	280.8639124713207	20/04/28 05:11:55
1	39	323.3383314215366	280.8639124713207	20/04/28 05:11:56
1	39	323.3383314215366	280.8639124713207	20/04/28 05:11:57
1	39	323.3383314215366	280.8639124713207	20/04/28 05:11:58
1	39	323.3383314215366	280.8639124713207	20/04/28 05:11:59
1	39	323.3383314215366	280.86391247132065	20/04/28 05:12:00
1	39	323.0934417610824	276.80430912710955	20/04/28 05:12:01
1	39	323.3383314215366	280.86391247132065	20/04/28 05:12:02
1	39	323.0934417610824	276.80430912710955	20/04/28 05:12:03
1	39	323.0934417610824	276.80430912710955	20/04/28 05:12:04
1	39	323.0934417610824	276.80430912710955	20/04/28 05:12:05
1	39	323.0934417610824	276.80430912710955	20/04/28 05:12:06
1	39	323.0934417610824	276.80430912710955	20/04/28 05:12:07
1	39	323.0934417610824	276.80430912710955	20/04/28 05:12:09
1	39	323.0934417610824	276.80430912710955	20/04/28 05:12:10
1	39	323.0934417610824	276.80430912710955	20/04/28 05:12:11
1	39	323.0934417610824	276.80430912710955	20/04/28 05:12:12
1	39	323.0934417610824	276.80430912710955	20/04/28 05:12:13
1	NULL	322.91265801837744	273.45359404894276	20/04/28 05:12:14
1	39	323.0934417610824	276.80430912710955	20/04/28 05:12:15
1	39	323.0934417610824	276.80430912710955	20/04/28 05:12:16
1	39	323.0934417610824	276.80430912710955	20/04/28 05:12:17
1	39	323.0934417610824	276.80430912710955	20/04/28 05:12:18
1	39	323.0934417610824	276.80430912710955	20/04/28 05:12:19
1	39	323.0934417610824	276.80430912710955	20/04/28 05:12:20
1	101	322.98869492093166	274.61064813682924	20/04/28 05:12:21
1	39	323.0934417610824	276.80430912710955	20/04/28 05:12:22
1	39	323.0934417610824	276.80430912710955	20/04/28 05:12:23
1	39	323.0934417610824	276.80430912710955	20/04/28 05:12:24
1	39	323.0934417610824	276.80430912710955	20/04/28 05:12:25
1	39	323.0934417610824	276.80430912710955	20/04/28 05:12:26
1	39	323.0934417610824	276.80430912710955	20/04/28 05:12:27
1	39	323.0934417610824	276.80430912710955	20/04/28 05:12:28
1	39	323.0934417610824	276.80430912710955	20/04/28 05:12:29
1	39	323.0934417610824	276.80430912710955	20/04/28 05:12:30
1	39	323.0934417610824	276.80430912710955	20/04/28 05:12:31
1	39	323.0934417610824	276.80430912710955	20/04/28 05:12:32
1	39	323.0934417610824	276.80430912710955	20/04/28 05:12:33
1	39	323.0934417610824	276.80430912710955	20/04/28 05:12:34
1	39	323.0934417610824	276.80430912710955	20/04/28 05:12:35
1	39	323.0934417610824	276.80430912710955	20/04/28 05:12:36
1	39	323.0934417610824	276.80430912710955	20/04/28 05:12:37
1	39	323.0934417610824	276.80430912710955	20/04/28 05:12:38
1	39	323.0934417610824	276.80430912710955	20/04/28 05:12:39
1	39	323.0934417610824	276.80430912710955	20/04/28 05:12:40
1	39	323.0934417610824	276.80430912710955	20/04/28 05:12:41
1	39	323.0934417610824	276.80430912710955	20/04/28 05:12:42
1	39	323.0934417610824	276.80430912710955	20/04/28 05:12:43
1	39	323.0934417610824	276.80430912710955	20/04/28 05:12:44
1	39	323.0934417610824	276.80430912710955	20/04/28 05:12:45
1	39	323.0934417610824	276.80430912710955	20/04/28 05:12:46
1	39	323.11960286715964	277.42468672218996	20/04/28 05:12:47
1	39	323.0934417610824	276.80430912710955	20/04/28 05:12:48
1	39	323.0934417610824	276.80430912710955	20/04/28 05:12:49
1	39	323.0934417610824	276.80430912710955	20/04/28 05:12:50
1	39	323.0934417610824	276.80430912710955	20/04/28 05:12:51
1	39	323.0934417610824	276.80430912710955	20/04/28 05:12:52
1	39	323.0934417610824	276.80430912710955	20/04/28 05:12:53
1	39	323.0934417610824	276.80430912710955	20/04/28 05:12:54
1	39	323.0934417610824	276.80430912710955	20/04/28 05:12:55
1	39	323.0934417610824	276.80430912710955	20/04/28 05:12:56
1	39	323.0934417610824	276.80430912710955	20/04/28 05:12:57
1	39	323.0934417610824	276.80430912710955	20/04/28 05:12:58
1	39	323.0934417610824	276.80430912710955	20/04/28 05:12:59
1	39	323.0934417610824	276.80430912710955	20/04/28 05:13:00
1	39	323.0934417610824	276.80430912710955	20/04/28 05:13:01
1	39	323.0934417610824	276.80430912710955	20/04/28 05:13:02
1	39	323.0934417610824	276.80430912710955	20/04/28 05:13:03
1	39	323.0934417610824	276.80430912710955	20/04/28 05:13:04
1	39	323.0934417610824	276.80430912710955	20/04/28 05:13:05
1	39	323.0934417610824	276.80430912710955	20/04/28 05:13:06
1	101	322.98869492093166	274.61064813682924	20/04/28 05:13:07
1	NULL	322.91265801837744	273.45359404894276	20/04/28 05:13:08
