stationId	t_start	t_end	t_max	timeStamp
76	20/04/28 05:08:49	20/04/28 05:08:49	20/04/28 05:08:49
149	20/04/28 05:08:51	20/04/28 05:08:51	20/04/28 05:08:51
109	20/04/28 05:08:53	20/04/28 05:08:53	20/04/28 05:08:53
6	20/04/28 05:08:55	20/04/28 05:08:55	20/04/28 05:08:55
130	20/04/28 05:08:57	20/04/28 05:08:57	20/04/28 05:08:57
5	20/04/28 05:08:59	20/04/28 05:08:59	20/04/28 05:08:59
78	20/04/28 05:09:01	20/04/28 05:09:01	20/04/28 05:09:01
144	20/04/28 05:09:03	20/04/28 05:09:03	20/04/28 05:09:03
137	20/04/28 05:09:05	20/04/28 05:09:05	20/04/28 05:09:05
103	20/04/28 05:09:07	20/04/28 05:09:07	20/04/28 05:09:07
127	20/04/28 05:09:09	20/04/28 05:09:09	20/04/28 05:09:09
78	20/04/28 05:09:11	20/04/28 05:09:11	20/04/28 05:09:11
161	20/04/28 05:09:13	20/04/28 05:09:13	20/04/28 05:09:13
78	20/04/28 05:09:15	20/04/28 05:09:15	20/04/28 05:09:15
78	20/04/28 05:09:17	20/04/28 05:09:17	20/04/28 05:09:17
145	20/04/28 05:09:19	20/04/28 05:09:19	20/04/28 05:09:19
31	20/04/28 05:09:21	20/04/28 05:09:21	20/04/28 05:09:21
69	20/04/28 05:17:57	20/04/28 05:09:23	20/04/28 05:09:23
32	20/04/28 05:09:25	20/04/28 05:09:25	20/04/28 05:09:25
132	20/04/28 05:09:27	20/04/28 05:09:27	20/04/28 05:09:27
128	20/04/28 05:09:29	20/04/28 05:09:29	20/04/28 05:09:29
142	20/04/28 05:09:31	20/04/28 05:09:31	20/04/28 05:09:31
158	20/04/28 05:09:33	20/04/28 05:09:33	20/04/28 05:09:33
153	20/04/28 05:09:35	20/04/28 05:09:35	20/04/28 05:09:35
105	20/04/28 05:09:37	20/04/28 05:09:37	20/04/28 05:09:37
103	20/04/28 05:09:39	20/04/28 05:09:39	20/04/28 05:09:39
36	20/04/28 05:09:41	20/04/28 05:09:41	20/04/28 05:09:41
158	20/04/28 05:09:43	20/04/28 05:09:43	20/04/28 05:09:43
3	20/04/28 05:09:45	20/04/28 05:09:46	20/04/28 05:09:46
131	20/04/28 05:09:48	20/04/28 05:09:48	20/04/28 05:09:48
128	20/04/28 05:09:50	20/04/28 05:09:51	20/04/28 05:09:51
131	20/04/28 05:09:53	20/04/28 05:09:53	20/04/28 05:09:53
131	20/04/28 05:09:55	20/04/28 05:09:55	20/04/28 05:09:55
92	20/04/28 05:09:57	20/04/28 05:09:57	20/04/28 05:09:57
92	20/04/28 05:09:59	20/04/28 05:10:00	20/04/28 05:10:00
153	20/04/28 05:10:02	20/04/28 05:10:02	20/04/28 05:10:02
153	20/04/28 05:10:04	20/04/28 05:10:04	20/04/28 05:10:04
153	20/04/28 05:10:06	20/04/28 05:10:06	20/04/28 05:10:06
92	20/04/28 05:10:08	20/04/28 05:10:08	20/04/28 05:10:08
153	20/04/28 05:10:10	20/04/28 05:10:10	20/04/28 05:10:10
153	20/04/28 05:10:12	20/04/28 05:10:12	20/04/28 05:10:12
131	20/04/28 05:10:14	20/04/28 05:10:14	20/04/28 05:10:14
52	20/04/28 05:10:16	20/04/28 05:10:16	20/04/28 05:10:16
51	20/04/28 05:10:18	20/04/28 05:10:18	20/04/28 05:10:18
3	20/04/28 05:10:20	20/04/28 05:10:20	20/04/28 05:09:53
92	20/04/28 05:10:22	20/04/28 05:10:22	20/04/28 05:10:22
92	20/04/28 05:10:24	20/04/28 05:10:24	20/04/28 05:10:24
153	20/04/28 05:10:26	20/04/28 05:10:27	20/04/28 05:10:27
51	20/04/28 05:10:29	20/04/28 05:10:30	20/04/28 05:10:30
91	20/04/28 05:10:32	20/04/28 05:10:32	20/04/28 05:10:32
153	20/04/28 05:10:34	20/04/28 05:10:34	20/04/28 05:10:34
52	20/04/28 05:10:36	20/04/28 05:10:36	20/04/28 05:10:36
105	20/04/28 05:10:38	20/04/28 05:10:38	20/04/28 05:10:38
153	20/04/28 05:10:40	20/04/28 05:10:40	20/04/28 05:10:40
92	20/04/28 05:10:42	20/04/28 05:10:42	20/04/28 05:10:42
109	20/04/28 05:10:44	20/04/28 05:10:45	20/04/28 05:10:45
19	20/04/28 05:10:47	20/04/28 05:10:47	20/04/28 05:10:47
114	20/04/28 05:10:49	20/04/28 05:10:49	20/04/28 05:10:49
158	20/04/28 05:10:51	20/04/28 05:10:52	20/04/28 05:10:51
92	20/04/28 05:10:54	20/04/28 05:10:54	20/04/28 05:10:54
92	20/04/28 05:10:56	20/04/28 05:10:56	20/04/28 05:10:56
128	20/04/28 05:10:58	20/04/28 05:10:58	20/04/28 05:10:58
153	20/04/28 05:11:00	20/04/28 05:11:00	20/04/28 05:11:00
52	20/04/28 05:11:02	20/04/28 05:11:02	20/04/28 05:11:02
147	20/04/28 05:11:04	20/04/28 05:11:04	20/04/28 05:11:04
51	20/04/28 05:11:06	20/04/28 05:11:06	20/04/28 05:11:06
51	20/04/28 05:11:08	20/04/28 05:11:08	20/04/28 05:11:08
109	20/04/28 05:11:10	20/04/28 05:11:10	20/04/28 05:11:10
130	20/04/28 05:11:12	20/04/28 05:11:12	20/04/28 05:11:12
105	20/04/28 05:11:14	20/04/28 05:11:14	20/04/28 05:11:14
131	20/04/28 05:11:16	20/04/28 05:11:16	20/04/28 05:11:16
153	20/04/28 05:11:18	20/04/28 05:11:19	20/04/28 05:11:19
92	20/04/28 05:11:21	20/04/28 05:11:21	20/04/28 05:11:21
19	20/04/28 05:11:23	20/04/28 05:11:23	20/04/28 05:11:23
36	20/04/28 05:11:25	20/04/28 05:11:25	20/04/28 05:11:25
131	20/04/28 05:11:27	20/04/28 05:11:27	20/04/28 05:11:27
