stationId	t_start	t_end	t_max	timeStamp
1	20/04/28 05:09:48	20/04/28 05:09:49	20/04/28 05:09:48
152	20/04/28 05:10:51	20/04/28 05:09:52	20/04/28 05:09:52
13	20/04/28 05:09:54	20/04/28 05:09:54	20/04/28 05:09:54
1	20/04/28 05:09:56	20/04/28 05:09:56	20/04/28 05:09:56
95	20/04/28 05:09:58	20/04/28 05:09:58	20/04/28 05:09:58
94	20/04/28 05:10:00	20/04/28 05:10:00	20/04/28 05:10:00
1	20/04/28 05:10:02	20/04/28 05:10:02	20/04/28 05:10:02
94	20/04/28 05:10:04	20/04/28 05:10:04	20/04/28 05:10:04
26	20/04/28 05:10:06	20/04/28 05:10:06	20/04/28 05:10:06
151	20/04/28 05:10:08	20/04/28 05:10:08	20/04/28 05:10:08
151	20/04/28 05:10:10	20/04/28 05:10:11	20/04/28 05:10:10
1	20/04/28 05:10:13	20/04/28 05:10:13	20/04/28 05:10:13
95	20/04/28 05:10:15	20/04/28 05:10:15	20/04/28 05:10:15
6	20/04/28 05:10:17	20/04/28 05:10:17	20/04/28 05:10:17
41	20/04/28 05:10:19	20/04/28 05:10:19	20/04/28 05:10:19
28	20/04/28 05:10:21	20/04/28 05:10:21	20/04/28 05:10:21
16	20/04/28 05:10:23	20/04/28 05:10:23	20/04/28 05:10:23
67	20/04/28 05:10:25	20/04/28 05:10:25	20/04/28 05:10:25
5	20/04/28 05:10:27	20/04/28 05:10:27	20/04/28 05:10:27
117	20/04/28 05:10:29	20/04/28 05:10:29	20/04/28 05:10:29
117	20/04/28 05:10:31	20/04/28 05:10:31	20/04/28 05:10:31
117	20/04/28 05:10:33	20/04/28 05:10:34	20/04/28 05:10:34
5	20/04/28 05:10:36	20/04/28 05:10:36	20/04/28 05:10:36
19	20/04/28 05:10:38	20/04/28 05:10:38	20/04/28 05:10:38
73	20/04/28 05:10:25	20/04/28 05:17:25	20/04/28 05:10:40
147	20/04/28 05:10:42	20/04/28 05:10:42	20/04/28 05:10:42
81	20/04/28 05:10:44	20/04/28 05:10:44	20/04/28 05:10:44
147	20/04/28 05:10:46	20/04/28 05:10:47	20/04/28 05:10:47
39	20/04/28 05:10:49	20/04/28 05:10:49	20/04/28 05:10:49
10	20/04/28 05:09:47	20/04/28 05:09:50	20/04/28 05:09:50
39	20/04/28 05:10:54	20/04/28 05:10:54	20/04/28 05:10:54
147	20/04/28 05:10:56	20/04/28 05:10:56	20/04/28 05:10:56
24	20/04/28 05:10:58	20/04/28 05:10:58	20/04/28 05:10:58
120	20/04/28 05:11:00	20/04/28 05:11:00	20/04/28 05:11:00
39	20/04/28 05:11:02	20/04/28 05:11:02	20/04/28 05:11:02
143	20/04/28 05:11:04	20/04/28 05:11:04	20/04/28 05:11:04
119	20/04/28 05:11:06	20/04/28 05:11:06	20/04/28 05:11:06
10	20/04/28 05:11:08	20/04/28 05:11:08	20/04/28 05:11:08
143	20/04/28 05:11:10	20/04/28 05:11:10	20/04/28 05:11:10
143	20/04/28 05:11:12	20/04/28 05:11:12	20/04/28 05:11:12
95	20/04/28 05:11:14	20/04/28 05:11:14	20/04/28 05:11:14
62	20/04/28 05:11:16	20/04/28 05:11:16	20/04/28 05:11:16
158	20/04/28 05:11:18	20/04/28 05:11:18	20/04/28 05:11:18
19	20/04/28 05:11:20	20/04/28 05:11:20	20/04/28 05:11:20
143	20/04/28 05:11:22	20/04/28 05:11:22	20/04/28 05:11:22
156	20/04/28 05:11:24	20/04/28 05:11:24	20/04/28 05:11:24
78	20/04/28 05:11:26	20/04/28 05:11:26	20/04/28 05:11:26
158	20/04/28 05:11:28	20/04/28 05:11:28	20/04/28 05:11:28
158	20/04/28 05:11:30	20/04/28 05:11:30	20/04/28 05:11:30
158	20/04/28 05:11:32	20/04/28 05:11:32	20/04/28 05:11:32
158	20/04/28 05:11:34	20/04/28 05:11:34	20/04/28 05:11:34
41	20/04/28 05:11:36	20/04/28 05:11:36	20/04/28 05:11:36
94	20/04/28 05:11:38	20/04/28 05:10:45	20/04/28 05:11:38
95	20/04/28 05:11:40	20/04/28 05:11:40	20/04/28 05:11:40
156	20/04/28 05:11:42	20/04/28 05:11:42	20/04/28 05:11:42
95	20/04/28 05:11:44	20/04/28 05:11:45	20/04/28 05:11:44
