floorId	partitionId	location_x	location_y	timeStamp
3	17	359.30912913530244	254.14098767558707	20/04/28 05:12:39
3	17	359.5131266993644	254.01915491022825	20/04/28 05:12:39
3	17	359.654026122943	253.93500603084837	20/04/28 05:12:39
3	17	359.654026122943	253.93500603084837	20/04/28 05:12:39
3	17	359.90025977735814	253.78794875014137	20/04/28 05:12:39
3	17	360.1759485497973	253.62330009034443	20/04/28 05:12:39
3	17	360.37004387883786	253.50738120283722	20/04/28 05:12:40
3	17	360.5126465390609	253.4222151052792	20/04/28 05:12:40
3	17	360.5126465390609	253.4222151052792	20/04/28 05:12:40
3	17	360.8757952929823	253.20533302077837	20/04/28 05:12:40
3	17	361.04826749116313	253.10232804153506	20/04/28 05:12:40
3	17	361.29988515395553	252.95205528797507	20/04/28 05:12:40
3	17	361.29988515395553	252.95205528797507	20/04/28 05:12:40
3	17	361.70433607030594	252.7105064546963	20/04/28 05:12:40
3	17	361.70433607030594	252.7105064546963	20/04/28 05:12:40
3	17	362.07573214247907	252.48869885260888	20/04/28 05:12:40
3	17	362.07573214247907	252.48869885260888	20/04/28 05:12:41
3	17	362.5140805999036	252.22690550716194	20/04/28 05:12:41
3	17	362.72754362763106	252.09941971541	20/04/28 05:12:41
3	17	362.8733063156278	252.01236636530535	20/04/28 05:12:41
3	17	363.0820136771571	251.88772078376238	20/04/28 05:12:41
3	17	363.30977267572905	251.75169705838618	20/04/28 05:12:41
3	17	363.4735237823594	251.65390054673136	20/04/28 05:12:41
3	17	363.6566539621343	251.54453033770346	20/04/28 05:12:41
3	17	363.91288140689585	251.3915044998722	20/04/28 05:12:41
3	17	364.0517110468585	251.30859175026075	20/04/28 05:12:41
3	17	364.2063420625643	251.21624199922175	20/04/28 05:12:42
3	34	364.33608333333336	251.2065410751068	20/04/28 05:12:42
3	34	364.33608333333336	251.4551181063894	20/04/28 05:12:42
3	34	364.33608333333336	251.63949608303238	20/04/28 05:12:42
3	34	364.33608333333336	251.8339023342325	20/04/28 05:12:42
3	34	364.33608333333336	252.12985577775035	20/04/28 05:12:42
3	34	364.33608333333336	252.38960158735935	20/04/28 05:12:42
3	34	364.33608333333336	252.6333014865928	20/04/28 05:12:42
3	34	364.33608333333336	252.8787070117621	20/04/28 05:12:42
3	34	364.33608333333336	253.17304161974877	20/04/28 05:12:43
3	34	364.33608333333336	253.33531410442174	20/04/28 05:12:43
3	34	364.33608333333336	253.5165159218563	20/04/28 05:12:43
3	34	364.33608333333336	253.74583169224934	20/04/28 05:12:43
3	34	364.33608333333336	253.99988261969008	20/04/28 05:12:43
3	34	364.33608333333336	254.239992017948	20/04/28 05:12:43
3	34	364.33608333333336	254.49532336472865	20/04/28 05:12:43
3	34	364.33608333333336	254.7476622798707	20/04/28 05:12:43
3	34	364.33608333333336	254.99270160691842	20/04/28 05:12:43
3	34	364.33608333333336	255.2822080947736	20/04/28 05:12:43
3	34	364.3001367732443	255.57402625306437	20/04/28 05:12:44
3	34	364.2560910615468	255.74271984100173	20/04/28 05:12:44
3	34	364.1946251338661	255.9781322676998	20/04/28 05:12:44
3	34	364.14884523401577	256.1534677376818	20/04/28 05:12:44
3	34	364.0876889224066	256.38769434528496	20/04/28 05:12:44
3	34	364.03007870581763	256.60833952874765	20/04/28 05:12:44
3	34	363.9814396815303	256.7946253487422	20/04/28 05:12:44
3	34	363.92609946650543	257.00657650289514	20/04/28 05:12:44
3	34	363.8657544279754	257.23769596200987	20/04/28 05:12:44
3	34	363.80017227738887	257.4888733833914	20/04/28 05:12:45
3	34	363.7440616456274	257.7037752076207	20/04/28 05:12:45
3	34	363.7001289116784	257.8720360945979	20/04/28 05:12:45
3	34	363.64205121259647	258.0944717202172	20/04/28 05:12:45
3	34	363.5980706005775	258.26291597858494	20/04/28 05:12:45
3	34	363.55900749296035	258.4125263612069	20/04/28 05:12:45
3	34	363.48464157022727	258.6973453331939	20/04/28 05:12:45
3	34	363.4236882731863	258.9307944018585	20/04/28 05:12:45
3	34	363.3843370523471	259.08150824838845	20/04/28 05:12:45
3	34	363.30882466003675	259.37071816012883	20/04/28 05:12:45
3	34	363.235539559001	259.65139762152523	20/04/28 05:12:46
3	34	363.18382081380804	259.8494786685552	20/04/28 05:12:46
3	34	363.141732720141	260.0106746455642	20/04/28 05:12:46
3	34	363.07100268154255	260.2815683041357	20/04/28 05:12:46
3	34	363.0227295682728	260.4664526972933	20/04/28 05:12:46
3	15	363.0311778725008	260.5924749098162	20/04/28 05:12:46
3	15	363.2928114990924	260.61887066107874	20/04/28 05:12:46
3	15	363.5813794971218	260.647983773172	20/04/28 05:12:46
3	15	363.86080117249736	260.6761741290397	20/04/28 05:12:46
3	15	364.0310146595405	260.693346665017	20/04/28 05:12:46
3	15	364.3196894067655	260.7224705468467	20/04/28 05:12:47
3	15	364.5467350019248	260.745376773134	20/04/28 05:12:47
3	15	364.75629307635177	260.7665187145568	20/04/28 05:12:47
3	15	364.92664307809196	260.78370502325913	20/04/28 05:12:47
3	15	365.1075390661115	260.80195529776074	20/04/28 05:12:47
3	15	365.40157252285593	260.8316198102632	20/04/28 05:12:47
3	15	365.68610139867235	260.86032542250007	20/04/28 05:12:47
3	15	365.94847681493604	260.88679601160334	20/04/28 05:12:47
3	15	366.23716975220515	260.91592172859424	20/04/28 05:12:47
3	15	366.40879335308506	260.9332365284486	20/04/28 05:12:48
3	15	366.6804110758184	260.96063955741386	20/04/28 05:12:48
3	15	366.9295361063766	260.98577333866956	20/04/28 05:12:48
3	15	367.1203044378715	261.00501961634615	20/04/28 05:12:48
3	15	367.34861892712553	261.02805385910193	20/04/28 05:12:48
3	15	367.61607404478667	261.05503693024474	20/04/28 05:12:48
3	15	367.61607404478667	261.05503693024474	20/04/28 05:12:48
3	15	367.7736466800984	261.0709341531731	20/04/28 05:12:48
3	15	367.9853642811967	261.0922939654009	20/04/28 05:12:48
3	15	368.1783330716448	261.1117622434677	20/04/28 05:12:48
3	15	368.3569262407972	261.12978019066946	20/04/28 05:12:49
3	15	368.5524839557889	261.14950966072894	20/04/28 05:12:49
3	15	368.7463667263809	261.1690701486269	20/04/28 05:12:49
3	15	368.9540829606646	261.19002627007336	20/04/28 05:12:49
3	15	369.2099812649552	261.2158433948694	20/04/28 05:12:49
3	15	369.48750870946924	261.2438426451545	20/04/28 05:12:49
3	15	369.714189738082	261.2667120909713	20/04/28 05:12:49
3	15	369.98881952170296	261.2944190014024	20/04/28 05:12:49
3	15	370.1620988314292	261.31190084277756	20/04/28 05:12:49
3	15	370.444348699567	261.340376529983	20/04/28 05:12:50
3	15	370.74099736420055	261.3703048861582	20/04/28 05:12:50
3	15	370.96563526901315	261.3929682048486	20/04/28 05:12:50
3	15	371.2229551819708	261.4189287532147	20/04/28 05:12:50
3	15	371.50280011362577	261.44716181065564	20/04/28 05:12:50
3	15	371.743548734379	261.47145051082384	20/04/28 05:12:50
3	15	372.0250925540628	261.4998549660565	20/04/28 05:12:50
3	15	372.17869742971243	261.5153518887693	20/04/28 05:12:50
3	15	372.3312265661506	261.5307402820663	20/04/28 05:12:50
3	15	372.5808355318341	261.55592288667606	20/04/28 05:12:50
3	15	372.87881823371146	261.58598583149615	20/04/28 05:12:51
3	15	373.13226940509446	261.6115560694055	20/04/28 05:12:51
3	15	373.3156784284871	261.6300598795764	20/04/28 05:12:51
3	15	373.5269674839344	261.6513764565957	20/04/28 05:12:51
3	15	373.5269674839344	261.6513764565957	20/04/28 05:12:51
3	15	373.7509216819641	261.6739707973248	20/04/28 05:12:51
3	15	373.94800787309765	261.6938544726238	20/04/28 05:12:51
3	15	374.21563125144826	261.7208545192883	20/04/28 05:12:51
3	15	374.4835105429651	261.74788038457706	20/04/28 05:12:51
3	15	374.6598874637093	261.7656747384186	20/04/28 05:12:51
3	15	374.9077871492875	261.7906848967986	20/04/28 05:12:52
3	15	375.09030995730996	261.809099298277	20/04/28 05:12:52
3	15	375.28924838275566	261.82916984220145	20/04/28 05:12:52
3	15	375.4721150991657	261.8476189399854	20/04/28 05:12:52
3	15	375.6545840252382	261.8660279054097	20/04/28 05:12:52
3	15	375.9395070719215	261.89477328484423	20/04/28 05:12:52
3	15	376.1258882255357	261.91357694794715	20/04/28 05:12:52
3	15	376.388811336913	261.9401027930363	20/04/28 05:12:52
3	15	376.5484770228117	261.9562111801158	20/04/28 05:12:52
3	15	376.77416809756215	261.9789807512482	20/04/28 05:12:53
3	15	377.0232406219065	262.0041092352453	20/04/28 05:12:53
3	15	377.30895373866053	262.0329343234442	20/04/28 05:12:53
3	15	377.5247990024823	262.054710568223	20/04/28 05:12:53
3	15	377.72476808018115	262.07488509282024	20/04/28 05:12:53
3	15	378.0195262078295	262.10462271608134	20/04/28 05:12:53
3	15	378.2715202999137	262.1300459518517	20/04/28 05:12:53
3	15	378.54079686075676	262.15721278515764	20/04/28 05:12:53
3	54	378.7713550635471	262.216524984362	20/04/28 05:12:53
3	54	379.0272431675307	262.28706448234385	20/04/28 05:12:53
3	54	379.2407571347822	262.345922896735	20/04/28 05:12:54
3	54	379.38887397053	262.3867535843428	20/04/28 05:12:54
3	54	379.6015476936633	262.4453803724982	20/04/28 05:12:54
3	54	379.85433041247285	262.5150638232164	20/04/28 05:12:54
3	54	380.12543178614527	262.589797093358	20/04/28 05:12:54
3	54	380.32489020908423	262.6447808804248	20/04/28 05:12:54
3	54	380.52379899944066	262.6996131528027	20/04/28 05:12:54
3	54	380.80845508328184	262.77808298762125	20/04/28 05:12:54
3	54	381.0033954553937	262.8318213043741	20/04/28 05:12:54
3	54	381.2397021662991	262.8969628896901	20/04/28 05:12:54
3	54	381.40649432015846	262.94294171644043	20/04/28 05:12:55
3	54	381.67915865601424	263.0181058411863	20/04/28 05:12:55
3	54	381.9143830790951	263.08294907719016	20/04/28 05:12:55
3	15	382.2018257827627	263.1621870866935	20/04/28 05:12:55
3	15	382.33293930394285	263.25822481511807	20/04/28 05:12:55
3	15	382.3317663847239	263.2594960916415	20/04/28 05:12:55
3	15	382.36834893980966	263.2121172181517	20/04/28 05:12:55
3	15	382.5409861459484	263.26556074426003	20/04/28 05:12:55
3	15	382.29131443678483	263.1043731645502	20/04/28 05:12:55
3	15	382.25814673067515	263.1387489526633	20/04/28 05:12:56
3	15	381.9843343333523	263.25760744875913	20/04/28 05:12:56
3	15	382.04299717982724	263.26313932315855	20/04/28 05:12:56
3	15	382.092336193251	263.193573898611	20/04/28 05:12:56
3	15	382.0821883010802	263.1855644307818	20/04/28 05:12:56
3	15	382.2630831854406	263.05937814659296	20/04/28 05:12:56
3	15	381.9924641988474	263.15978250042116	20/04/28 05:12:56
3	15	381.8828223118511	262.9957437540023	20/04/28 05:12:56
3	15	381.9262171612233	263.1903605355009	20/04/28 05:12:56
3	15	382.0057913744099	263.0521919842131	20/04/28 05:12:56
3	15	382.01844044319625	263.0724437989662	20/04/28 05:12:57
3	15	382.1359287295573	263.2387886532885	20/04/28 05:12:57
3	15	382.11708996825706	263.235862043604	20/04/28 05:12:57
3	15	382.16824851046425	263.0468192851395	20/04/28 05:12:57
3	15	382.148525954311	263.04724819377776	20/04/28 05:12:57
3	15	381.99997611377853	262.9674638234142	20/04/28 05:12:57
3	15	381.8967362871339	262.82919539087464	20/04/28 05:12:57
3	15	381.78637169268933	262.56213490885096	20/04/28 05:12:57
3	15	381.7411719305867	262.6028595082977	20/04/28 05:12:57
3	15	381.7969285374833	262.5533718987703	20/04/28 05:12:57
3	15	381.80955195014764	262.5988865347894	20/04/28 05:12:58
3	15	381.7755446033711	262.763097061445	20/04/28 05:12:58
3	15	381.6547715352683	262.5551759419947	20/04/28 05:12:58
3	15	381.6536922830381	262.6702032296781	20/04/28 05:12:58
3	15	381.56743304547695	262.58991449250067	20/04/28 05:12:58
3	15	381.83329323541983	262.58284362356534	20/04/28 05:12:58
3	15	381.55781878429514	262.535914199893	20/04/28 05:12:58
3	15	381.5875694252582	262.391165714704	20/04/28 05:12:58
3	15	381.57640310043814	262.40128626860354	20/04/28 05:12:58
3	15	381.37563870231236	262.2395912944676	20/04/28 05:12:59
3	15	381.1653849504737	262.3897617225302	20/04/28 05:12:59
3	15	381.25450295882484	262.1690979881221	20/04/28 05:12:59
3	15	381.3332566249935	261.9673007440125	20/04/28 05:12:59
3	15	381.33413185235196	261.96726998039674	20/04/28 05:12:59
3	15	381.3270878618725	261.95679540202354	20/04/28 05:12:59
3	15	381.2894880168953	262.0813128789207	20/04/28 05:12:59
3	15	381.1396523406978	262.0514336995786	20/04/28 05:12:59
3	15	381.05607536542465	262.0982877612628	20/04/28 05:12:59
3	15	380.90395404478727	261.9577834390367	20/04/28 05:12:59
3	15	381.0159423844684	261.82577235367364	20/04/28 05:13:00
3	15	380.9747601775941	261.9024757402753	20/04/28 05:13:00
3	15	380.6876049949584	261.8307324950772	20/04/28 05:13:00
3	15	380.517729787904	261.8101333397288	20/04/28 05:13:00
3	15	380.6021990383245	261.9909751029181	20/04/28 05:13:00
3	15	380.6024177692551	261.99075934437474	20/04/28 05:13:00
3	15	380.88365654699606	261.90124570380453	20/04/28 05:13:00
3	15	380.8403573224818	261.88233219268665	20/04/28 05:13:00
3	15	380.8512791492616	261.94362915894055	20/04/28 05:13:00
3	15	380.84486625871074	261.92535757643066	20/04/28 05:13:00
3	15	380.848427556389	261.92766855058227	20/04/28 05:13:01
3	15	380.844804516051	261.9297441027438	20/04/28 05:13:01
3	15	380.8165405672899	261.92884243094886	20/04/28 05:13:01
3	15	380.82905524768603	261.9273303715929	20/04/28 05:13:01
3	15	380.8737152227171	261.98020546372055	20/04/28 05:13:01
3	15	380.69854694977755	262.0931236916462	20/04/28 05:13:01
3	15	380.77222570677054	261.9914234347147	20/04/28 05:13:01
3	15	380.7150407096554	261.7089337113633	20/04/28 05:13:01
3	15	380.7196309732128	261.7597891233172	20/04/28 05:13:01
3	15	380.43480584066936	261.83930493187904	20/04/28 05:13:02
3	15	380.2344193186344	261.6889466777815	20/04/28 05:13:02
3	15	380.19612147560764	261.419906544554	20/04/28 05:13:02
3	15	380.14206527727447	261.37232491515897	20/04/28 05:13:02
3	15	379.8779713943422	261.31172992191154	20/04/28 05:13:02
3	15	379.9245886043166	261.4842378742124	20/04/28 05:13:02
3	15	379.9850201928435	261.4625683959868	20/04/28 05:13:02
3	15	380.19278216240207	261.55305455850845	20/04/28 05:13:02
3	15	380.19733315954693	261.60432796104124	20/04/28 05:13:02
3	15	380.0903497891828	261.686468335749	20/04/28 05:13:02
3	15	380.2420540952943	261.7916334083973	20/04/28 05:13:03
3	15	380.4711385233674	261.9385351479426	20/04/28 05:13:03
3	15	380.3752548074828	261.9121523340298	20/04/28 05:13:03
3	15	380.41612415086087	261.7739823264298	20/04/28 05:13:03
3	15	380.54178858326566	261.67535391306495	20/04/28 05:13:03
3	15	380.52755694860144	261.6570317738405	20/04/28 05:13:03
3	15	380.4782038039984	261.8763557980946	20/04/28 05:13:03
3	15	380.57643956477887	261.9058111635857	20/04/28 05:13:03
3	15	380.60291838521084	261.8901943092592	20/04/28 05:13:03
3	15	380.77657339317165	261.827379271087	20/04/28 05:13:04
3	15	380.67694072914963	261.8783211861206	20/04/28 05:13:04
3	15	380.6844158319516	261.8540039905795	20/04/28 05:13:04
3	15	380.67063620949455	261.80751597334813	20/04/28 05:13:04
3	15	380.473305235722	261.8865962461626	20/04/28 05:13:04
3	15	380.35780675260213	261.917335647778	20/04/28 05:13:04
3	15	380.3085727560787	261.9494008782503	20/04/28 05:13:04
3	15	380.14258958413546	261.7791029181837	20/04/28 05:13:04
3	15	380.13588799425935	261.7470041215433	20/04/28 05:13:04
3	15	380.37996070495547	261.7341069777642	20/04/28 05:13:04
3	15	380.3136438801184	261.4880301081174	20/04/28 05:13:05
3	15	380.288189978182	261.2097439177996	20/04/28 05:13:05
3	15	380.5009966497444	261.2960738891991	20/04/28 05:13:05
3	15	380.49780110068747	261.3188781777329	20/04/28 05:13:05
3	15	380.32121387648294	261.2628350988864	20/04/28 05:13:05
3	15	380.37149928782344	261.3408581906904	20/04/28 05:13:05
3	15	380.6181091226652	261.38927646638086	20/04/28 05:13:05
3	15	380.5768770264653	261.4431819598733	20/04/28 05:13:05
3	15	380.7046828843311	261.69488934149814	20/04/28 05:13:05
3	15	380.7433504034933	261.4931230911172	20/04/28 05:13:05
3	15	380.8346152365009	261.285815758211	20/04/28 05:13:06
3	15	380.8153240471449	261.2972538861992	20/04/28 05:13:06
3	15	381.0202866375782	261.3081106936586	20/04/28 05:13:06
3	15	381.0196110117583	261.3081132679477	20/04/28 05:13:06
3	15	381.2747225690653	261.2644201762688	20/04/28 05:13:06
3	15	381.4271314357037	261.4391874107044	20/04/28 05:13:06
3	15	381.33987195334703	261.31722937677796	20/04/28 05:13:06
3	15	381.1063102746067	261.3209587350561	20/04/28 05:13:06
3	15	381.06332372854047	261.55019624651885	20/04/28 05:13:06
3	15	381.1523795816694	261.6912714626773	20/04/28 05:13:07
3	15	381.29324256289476	261.9189422195941	20/04/28 05:13:07
3	15	381.38801580767296	262.0365655114383	20/04/28 05:13:07
3	15	381.3234191561361	261.91845882749857	20/04/28 05:13:07
3	15	381.12416899562203	261.74790290840093	20/04/28 05:13:07
3	15	381.19132849072616	261.5841760333295	20/04/28 05:13:07
3	15	381.040890104237	261.53071970898696	20/04/28 05:13:07
3	15	381.1314627368593	261.39618152505255	20/04/28 05:13:07
3	15	381.0662856056751	261.1648322306934	20/04/28 05:13:07
3	15	381.0649299003137	261.1668077693399	20/04/28 05:13:07
3	15	381.0755641177833	261.1791576975934	20/04/28 05:13:08
3	15	380.8292248518342	261.1187339362686	20/04/28 05:13:08
3	15	380.56946690674476	261.0502539564578	20/04/28 05:13:08
3	15	380.52951459138814	260.9997915952603	20/04/28 05:13:08
3	15	380.4129274733458	260.8837998862852	20/04/28 05:13:08
3	15	380.3847347270184	260.7368121499255	20/04/28 05:13:08
3	15	380.1418882681654	260.7070292868694	20/04/28 05:13:08
3	15	380.1480058321624	260.73620919197873	20/04/28 05:13:08
3	15	380.2037052182313	260.78637031773184	20/04/28 05:13:08
3	15	380.10390732055254	260.78556043536423	20/04/28 05:13:08
3	15	380.1098825045832	260.9385089080922	20/04/28 05:13:09
3	15	380.0575763543896	261.02692653370497	20/04/28 05:13:09
3	15	380.0512465848862	261.02946860886954	20/04/28 05:13:09
3	15	380.17456101304253	261.05640759198417	20/04/28 05:13:09
3	15	380.20103746612557	261.06177006879625	20/04/28 05:13:09
3	15	380.2681041416479	261.261663518743	20/04/28 05:13:09
3	15	380.2681041416479	261.261663518743	20/04/28 05:13:09
3	15	380.2681041416479	261.261663518743	20/04/28 05:13:09
3	15	380.19783543768085	261.31878080625836	20/04/28 05:13:09
3	15	380.3516758288027	261.5302155092493	20/04/28 05:13:10
3	15	380.3516758288027	261.5302155092493	20/04/28 05:13:10
3	15	380.1603697923843	261.6850427941181	20/04/28 05:13:10
3	15	380.17366611586306	261.9706346705635	20/04/28 05:13:10
3	15	380.22123877802005	262.0313908048089	20/04/28 05:13:10
3	15	380.39394802323665	261.9544415121771	20/04/28 05:13:10
3	15	380.4673991671918	261.7601216298463	20/04/28 05:13:10
3	15	380.47499590278466	261.7583739554191	20/04/28 05:13:10
3	15	380.5717223300512	261.53750137909105	20/04/28 05:13:10
3	15	380.5840588302207	261.7431532467778	20/04/28 05:13:10
3	15	380.62400637563286	261.63374904824116	20/04/28 05:13:11
3	15	380.79282940964936	261.4629822955867	20/04/28 05:13:11
3	15	380.79282940964936	261.4629822955867	20/04/28 05:13:11
3	15	380.6592537738871	261.33199927902115	20/04/28 05:13:11
3	15	380.6448956924353	261.2727936319937	20/04/28 05:13:11
3	15	380.6673132158416	261.4271987508603	20/04/28 05:13:11
3	15	380.63960247821325	261.4934468795348	20/04/28 05:13:11
3	15	380.65081631722325	261.64104008730123	20/04/28 05:13:11
3	15	380.37896916504855	261.7436787944417	20/04/28 05:13:11
3	15	380.31767586185094	261.7916180980256	20/04/28 05:13:11
3	15	380.39665994736316	261.5560891068661	20/04/28 05:13:12
3	15	380.4446987096421	261.4178527291825	20/04/28 05:13:12
3	15	380.5804015848175	261.62902141178745	20/04/28 05:13:12
3	15	380.497253878841	261.7417634808653	20/04/28 05:13:12
3	15	380.3607015891309	261.89613125358767	20/04/28 05:13:12
3	15	380.35403283858903	261.8916657031362	20/04/28 05:13:12
3	15	380.4045321067552	261.97394831253706	20/04/28 05:13:12
3	15	380.2116242838033	262.1930021813692	20/04/28 05:13:12
3	15	380.0956296648292	262.1177774029922	20/04/28 05:13:12
3	15	380.06294304826116	262.1545977526033	20/04/28 05:13:13
3	15	380.06903422950313	262.0473684622074	20/04/28 05:13:13
3	15	379.9242407726315	261.8010546347932	20/04/28 05:13:13
3	15	379.9860868601314	261.71874913586197	20/04/28 05:13:13
3	15	379.9813045042422	261.73822370527364	20/04/28 05:13:13
3	15	380.01044373593203	261.6613387111977	20/04/28 05:13:13
3	15	379.99680212382884	261.7171489496598	20/04/28 05:13:13
3	15	380.1113730791848	261.822085561317	20/04/28 05:13:13
3	15	380.34819562077155	261.8902736988537	20/04/28 05:13:13
3	15	380.5042423116989	261.9010907094724	20/04/28 05:13:13
3	15	380.26829407042175	261.7457869312903	20/04/28 05:13:14
3	15	380.2462138592359	261.7804005953458	20/04/28 05:13:14
3	15	380.32385341260994	261.8298249537827	20/04/28 05:13:14
3	15	380.4159800160178	261.9419645342281	20/04/28 05:13:14
3	15	380.28381251993113	261.7057656362787	20/04/28 05:13:14
3	15	380.5033779381403	261.82166550860194	20/04/28 05:13:14
3	15	380.56292997682266	261.89588180677225	20/04/28 05:13:14
3	15	380.55933985219934	261.8979844911827	20/04/28 05:13:14
3	15	380.66399903820536	262.16584612264097	20/04/28 05:13:14
3	15	380.66006122336114	262.16828676646315	20/04/28 05:13:15
3	15	380.5378889064289	262.1982559882407	20/04/28 05:13:15
3	15	380.5285929923382	262.1750588726765	20/04/28 05:13:15
3	15	380.6236316469028	262.17398853864603	20/04/28 05:13:15
3	15	380.47346387805965	262.1010208955374	20/04/28 05:13:15
3	15	380.46534708075706	262.1222654356696	20/04/28 05:13:15
3	15	380.4326322504601	262.15362540683225	20/04/28 05:13:15
3	15	380.4326322504601	262.15362540683225	20/04/28 05:13:15
3	15	380.46061194323886	262.08007107713996	20/04/28 05:13:15
3	15	380.46061194323886	262.08007107713996	20/04/28 05:13:15
3	15	380.3557679765924	262.0652108976295	20/04/28 05:13:16
3	15	380.3841349847238	261.8486320821209	20/04/28 05:13:16
3	15	380.4851333831156	261.6509469370208	20/04/28 05:13:16
3	15	380.54651138193026	261.68870327056123	20/04/28 05:13:16
3	15	380.7075053363978	261.76302519037074	20/04/28 05:13:16
3	15	380.74992293552674	261.73679561205364	20/04/28 05:13:16
3	15	380.73189225550266	261.664345824375	20/04/28 05:13:16
3	15	380.62984725044606	261.6921271932292	20/04/28 05:13:16
3	15	380.55882989808424	261.7025227496577	20/04/28 05:13:16
3	15	380.5984814985271	261.6589435771865	20/04/28 05:13:16
3	15	380.4416058420368	261.59964361961767	20/04/28 05:13:17
3	15	380.44773023160883	261.6913099757386	20/04/28 05:13:17
3	15	380.44773023160883	261.6913099757386	20/04/28 05:13:17
3	15	380.57001747617795	261.7815109124047	20/04/28 05:13:17
3	15	380.7691282640824	261.65880806056066	20/04/28 05:13:17
3	15	380.78655864331097	261.8462313311399	20/04/28 05:13:17
3	15	380.82322244568405	262.08808715516244	20/04/28 05:13:17
3	15	381.0611393878129	262.0961070563491	20/04/28 05:13:17
3	15	381.06092834044716	262.087369480471	20/04/28 05:13:17
3	15	381.07149186190304	262.0795638963011	20/04/28 05:13:18
3	15	381.09394707511734	262.1680289954742	20/04/28 05:13:18
3	15	381.15943934246934	262.06794909716734	20/04/28 05:13:18
3	15	381.3192061013588	261.92107090472325	20/04/28 05:13:18
3	15	381.4113795980731	261.8300040556991	20/04/28 05:13:18
3	15	381.171044630193	261.71288783838946	20/04/28 05:13:18
3	15	381.1440864703477	261.6816760672033	20/04/28 05:13:18
3	15	381.24629775579785	261.678332234446	20/04/28 05:13:18
3	15	381.34555501622725	261.4732230132215	20/04/28 05:13:18
3	15	381.3409766743875	261.4698081423018	20/04/28 05:13:18
3	15	381.06797388723106	261.50103888159214	20/04/28 05:13:19
3	15	380.9270700986591	261.2707725476302	20/04/28 05:13:19
3	15	381.18225761590935	261.2353353001973	20/04/28 05:13:19
3	15	381.3982623690408	261.1495309325101	20/04/28 05:13:19
3	15	381.43561111667543	261.1374641985672	20/04/28 05:13:19
3	15	381.5696230415195	261.2200524971253	20/04/28 05:13:19
3	15	381.6617246425978	261.15893637896414	20/04/28 05:13:19
3	15	381.656386712681	261.14567566454184	20/04/28 05:13:19
3	15	381.6488208993204	261.1481948122198	20/04/28 05:13:19
3	15	381.7791669360678	261.0369580114929	20/04/28 05:13:19
3	15	381.7825307403804	261.05604247257213	20/04/28 05:13:20
3	15	381.78310121119017	261.03027478964225	20/04/28 05:13:20
3	15	381.753606949983	261.1737339848216	20/04/28 05:13:20
3	15	382.00528522259293	261.05343200328593	20/04/28 05:13:20
3	15	382.02452782276276	261.0383050713913	20/04/28 05:13:20
3	15	382.19478712708855	261.07826961500496	20/04/28 05:13:20
3	15	382.1542849232869	261.10181129410483	20/04/28 05:13:20
3	15	382.2689935411819	261.30601300080957	20/04/28 05:13:20
3	15	382.1916730061195	261.3266159880054	20/04/28 05:13:20
3	15	381.98227914517554	261.4786790915366	20/04/28 05:13:21
3	15	381.9907048966273	261.65075351043225	20/04/28 05:13:21
3	15	381.9764108689986	261.48286095299943	20/04/28 05:13:21
3	15	381.9705972351926	261.5857257498234	20/04/28 05:13:21
3	15	382.22223966999064	261.63177374702076	20/04/28 05:13:21
3	15	382.15325769272596	261.6541237331071	20/04/28 05:13:21
3	15	382.15005459778536	261.65159646810713	20/04/28 05:13:21
3	15	381.90462336570266	261.67356561328774	20/04/28 05:13:21
3	15	382.10381740176115	261.497678875255	20/04/28 05:13:21
3	15	382.2140923100371	261.5387907896967	20/04/28 05:13:21
3	15	382.21412406155116	261.6347849921129	20/04/28 05:13:22
3	15	382.3931856435642	261.5284069562459	20/04/28 05:13:22
3	15	382.42732672866543	261.4580250955775	20/04/28 05:13:22
3	15	382.56597977597386	261.6300120637036	20/04/28 05:13:22
3	15	382.62943853440447	261.64955013930745	20/04/28 05:13:22
3	15	382.663446765421	261.6701067505747	20/04/28 05:13:22
3	15	382.60934228693634	261.3753136767681	20/04/28 05:13:22
3	15	382.48586133524276	261.3070912592375	20/04/28 05:13:22
3	15	382.5704692387694	261.1579777630516	20/04/28 05:13:22
3	15	382.72839455076553	261.3246537313236	20/04/28 05:13:22
3	15	382.7318375634089	261.43332462459944	20/04/28 05:13:23
3	15	382.6846684196812	261.27538737131584	20/04/28 05:13:23
3	15	382.5378031617715	261.4998229598676	20/04/28 05:13:23
3	15	382.31032723951824	261.50176641149403	20/04/28 05:13:23
3	15	382.24980622571445	261.51876135079516	20/04/28 05:13:23
3	15	382.21937135501844	261.5590833845754	20/04/28 05:13:23
3	15	382.43758951212976	261.67749731283857	20/04/28 05:13:23
3	15	382.4138988104016	261.6888604140632	20/04/28 05:13:23
3	15	382.39820996287233	261.71264714751266	20/04/28 05:13:23
3	15	382.6870862220001	261.7834952672892	20/04/28 05:13:24
3	15	382.68783323425686	261.7659710578867	20/04/28 05:13:24
3	15	382.6842289737016	261.7519300754843	20/04/28 05:13:24
3	15	382.6571818096716	261.52035253144516	20/04/28 05:13:24
3	15	382.8672823006423	261.56518401691096	20/04/28 05:13:24
3	15	382.924593020424	261.3527824685194	20/04/28 05:13:24
3	15	382.83797331400103	261.63016444938825	20/04/28 05:13:24
3	15	382.6957728476947	261.4505544682484	20/04/28 05:13:24
3	15	382.4891917274952	261.4150041602273	20/04/28 05:13:24
3	15	382.2639120416927	261.2384733029927	20/04/28 05:13:24
3	15	382.2584758308548	261.31381273718154	20/04/28 05:13:25
3	15	382.323366340935	261.28394692926895	20/04/28 05:13:25
3	15	382.10782080847787	261.14925154913703	20/04/28 05:13:25
3	15	381.9379925669688	261.12603725268133	20/04/28 05:13:25
3	15	382.0133468588664	261.16149133674617	20/04/28 05:13:25
3	15	382.11162537384064	261.2412908151559	20/04/28 05:13:25
3	15	382.02622845180855	261.3793022358599	20/04/28 05:13:25
3	15	382.00857675493114	261.56940043006745	20/04/28 05:13:25
3	15	382.0371729723522	261.5645094662747	20/04/28 05:13:25
3	15	382.2444130285207	261.48341246349844	20/04/28 05:13:25
3	15	382.3494634246577	261.4181953475501	20/04/28 05:13:26
3	15	382.3501544619541	261.4376133730057	20/04/28 05:13:26
3	15	382.2178397250219	261.4431968662147	20/04/28 05:13:26
3	15	382.3861022179806	261.3660628214211	20/04/28 05:13:26
3	15	382.4040102647561	261.35835065020603	20/04/28 05:13:26
3	15	382.418325241698	261.3276849448172	20/04/28 05:13:26
3	15	382.55050207025437	261.2629411972463	20/04/28 05:13:26
3	15	382.4746033416054	261.25673478359545	20/04/28 05:13:26
3	15	382.46245275638506	261.2421241573241	20/04/28 05:13:26
3	15	382.5316503943339	261.38404684172406	20/04/28 05:13:27
3	15	382.6576546874558	261.1130521529566	20/04/28 05:13:27
3	15	382.5624901841385	261.3895600430533	20/04/28 05:13:27
3	15	382.7873131271197	261.34259599776004	20/04/28 05:13:27
3	15	382.88388878352	261.3479833105335	20/04/28 05:13:27
3	15	383.05946474884075	261.3394287387285	20/04/28 05:13:27
3	15	382.9329890731962	261.1791038057216	20/04/28 05:13:27
3	15	382.94187656854245	261.1644255842148	20/04/28 05:13:27
3	15	383.17399969543584	261.1989291282869	20/04/28 05:13:27
3	15	382.98722344801854	261.0984001119314	20/04/28 05:13:27
3	15	382.98577036337053	261.39181500688045	20/04/28 05:13:28
3	15	382.9842801441997	261.3758972468812	20/04/28 05:13:28
3	15	382.80133247930553	261.5445908200984	20/04/28 05:13:28
3	15	382.9041767540805	261.46823153903637	20/04/28 05:13:28
3	15	382.86889909994153	261.19848786000375	20/04/28 05:13:28
3	15	382.7493824888065	261.24366360934346	20/04/28 05:13:28
3	15	382.8763156599908	261.03356022345554	20/04/28 05:13:28
3	15	382.81527756581056	261.14784039403565	20/04/28 05:13:28
3	15	382.9753626010553	261.3178773936956	20/04/28 05:13:28
3	15	382.82035427279493	261.22030200768717	20/04/28 05:13:28
3	15	382.76423912701796	261.21953974187574	20/04/28 05:13:29
3	15	382.72375050124566	261.14142688485003	20/04/28 05:13:29
3	15	382.54504385493806	260.9862931996605	20/04/28 05:13:29
3	15	382.5900642067029	260.9737311357902	20/04/28 05:13:29
3	15	382.7070046502312	260.96909828164144	20/04/28 05:13:29
3	15	382.5468768403808	260.78703162078494	20/04/28 05:13:29
3	15	382.3679326679607	260.6377359715414	20/04/28 05:13:29
3	15	382.34492722736263	260.61331340123746	20/04/28 05:13:29
3	15	382.47540821326254	260.79549640857215	20/04/28 05:13:29
3	15	382.41767779344434	260.75884365068157	20/04/28 05:13:30
3	15	382.529628181084	260.63078724633243	20/04/28 05:13:30
3	15	382.3493103956427	260.8526205500086	20/04/28 05:13:30
3	15	382.34044271151316	260.66311801217427	20/04/28 05:13:30
3	15	382.35498382386766	260.69410362134136	20/04/28 05:13:30
3	15	382.3413856666473	260.6655395208141	20/04/28 05:13:30
3	15	382.3327019763752	260.64810506602913	20/04/28 05:13:30
3	15	382.3623507767509	260.61268806321925	20/04/28 05:13:30
3	15	382.163433030433	260.6959744831762	20/04/28 05:13:30
3	15	382.1278853617133	260.77292811004105	20/04/28 05:13:30
3	15	382.1349719302914	260.74925563345477	20/04/28 05:13:31
3	15	382.0491329578519	260.7991753165372	20/04/28 05:13:31
3	15	382.0964704093904	260.77497770952914	20/04/28 05:13:31
3	15	381.9180650948002	260.6017142962892	20/04/28 05:13:31
3	15	381.89578401771826	260.59173967469985	20/04/28 05:13:31
3	15	381.92341626136374	260.6002218028592	20/04/28 05:13:31
3	15	381.7683288548146	260.79588013834535	20/04/28 05:13:31
3	15	381.76390813141694	260.80237449417	20/04/28 05:13:31
3	15	381.72846112861305	260.8470217479691	20/04/28 05:13:31
3	15	381.91635033042917	261.0697397871439	20/04/28 05:13:31
3	15	382.06046030231164	260.9665448593363	20/04/28 05:13:32
3	15	382.07648395603945	260.9765539840415	20/04/28 05:13:32
3	15	382.07648395603945	260.9765539840415	20/04/28 05:13:32
3	15	382.08361089289446	260.9469626135057	20/04/28 05:13:32
3	15	382.11367213343317	260.69669384080896	20/04/28 05:13:32
3	15	381.97428640821386	260.62001850563524	20/04/28 05:13:32
3	15	381.97428640821386	260.62001850563524	20/04/28 05:13:32
3	15	382.10225366843554	260.8587583064145	20/04/28 05:13:32
3	15	381.9119326909136	260.91481049422293	20/04/28 05:13:32
3	15	382.0139432099457	260.742847572775	20/04/28 05:13:33
3	15	382.0337051239708	260.9936119679608	20/04/28 05:13:33
3	15	382.0338465070049	261.20193793422874	20/04/28 05:13:33
3	15	382.187511711809	261.34401132782403	20/04/28 05:13:33
3	15	382.2563682084089	261.30709023886806	20/04/28 05:13:33
3	15	382.4242367444406	261.297584815128	20/04/28 05:13:33
3	15	382.539893975575	261.25181692651284	20/04/28 05:13:33
3	15	382.51181298996505	261.4758822633302	20/04/28 05:13:33
3	15	382.41031440789936	261.49472015163695	20/04/28 05:13:33
3	15	382.4146289419346	261.5605699000663	20/04/28 05:13:33
3	15	382.3226385079758	261.7783680327213	20/04/28 05:13:34
3	15	382.25385898349657	261.8175233106555	20/04/28 05:13:34
3	15	382.23719983383864	261.8128833279163	20/04/28 05:13:34
3	15	382.48267779284305	261.6668822549406	20/04/28 05:13:34
3	15	382.48775010795123	261.66382378751547	20/04/28 05:13:34
3	15	382.60876112661634	261.7517345168408	20/04/28 05:13:34
3	15	382.5450142831963	261.57141837571646	20/04/28 05:13:34
3	15	382.7915777848194	261.51272863088826	20/04/28 05:13:34
3	15	382.9857279207718	261.572029139307	20/04/28 05:13:34
3	15	382.99359360684275	261.6349873705396	20/04/28 05:13:34
3	15	383.0826312723501	261.6436074999769	20/04/28 05:13:35
3	15	383.1831131363238	261.5086825901107	20/04/28 05:13:35
3	15	383.17878861569625	261.49672615013844	20/04/28 05:13:35
3	15	383.35418681006473	261.700782187722	20/04/28 05:13:35
3	15	383.11967361908324	261.7842598155194	20/04/28 05:13:35
3	15	383.02988470544517	261.87059648078815	20/04/28 05:13:35
3	15	383.05782279528586	262.0788486994547	20/04/28 05:13:35
3	15	383.1295524768571	261.9593977733985	20/04/28 05:13:35
3	15	383.0262198746581	262.0403490617429	20/04/28 05:13:35
3	15	383.005781350065	262.0797330046271	20/04/28 05:13:36
3	15	383.0740756631637	262.17409372019614	20/04/28 05:13:36
3	15	382.7994646714782	262.2235451304458	20/04/28 05:13:36
3	15	382.84296519313	262.2881303481395	20/04/28 05:13:36
3	15	382.7568322683859	262.2253578112537	20/04/28 05:13:36
3	15	382.6161059934495	262.0439003758158	20/04/28 05:13:36
3	15	382.62554130298025	262.061250751541	20/04/28 05:13:36
3	15	382.690713972987	262.0840257958799	20/04/28 05:13:36
3	15	382.59019624957716	262.07512084429806	20/04/28 05:13:36
3	15	382.59387319433404	261.7804178981373	20/04/28 05:13:36
3	15	382.7737823619512	261.93574879128374	20/04/28 05:13:37
3	15	382.8083901600107	261.94823004101653	20/04/28 05:13:37
3	15	383.0034581751019	261.8769804223948	20/04/28 05:13:37
3	15	383.03654807493865	262.02785013915286	20/04/28 05:13:37
3	15	382.9592753119219	262.0175499482115	20/04/28 05:13:37
3	15	383.0243463436624	262.3034799103987	20/04/28 05:13:37
3	15	383.05158183355695	262.35978775262	20/04/28 05:13:37
3	15	383.17490484540093	262.3581514939971	20/04/28 05:13:37
3	15	383.16981809187234	262.35259915535687	20/04/28 05:13:37
3	15	383.0758921299507	262.3922973057084	20/04/28 05:13:38
3	15	383.01524518637166	262.4068144626291	20/04/28 05:13:38
3	15	382.75055447790567	262.443196510989	20/04/28 05:13:38
3	15	382.94409404490295	262.5161202385314	20/04/28 05:13:38
3	15	382.90703158092674	262.5021619142197	20/04/28 05:13:38
3	15	382.91259582873454	262.25809516827997	20/04/28 05:13:38
3	15	382.789227403456	262.07586819303197	20/04/28 05:13:38
3	15	382.8799018574872	262.0064418804295	20/04/28 05:13:38
3	15	382.9752024873901	261.99852754909324	20/04/28 05:13:38
3	15	383.1648676248153	262.1255071413105	20/04/28 05:13:38
3	15	383.1492207151059	262.24794938498815	20/04/28 05:13:39
3	15	382.98964439630646	262.4179459022502	20/04/28 05:13:39
3	15	382.80224660964035	262.59646160290305	20/04/28 05:13:39
3	15	382.8789139390837	262.6704147121505	20/04/28 05:13:39
3	15	382.8789139390837	262.6704147121505	20/04/28 05:13:39
3	15	382.8789139390837	262.6704147121505	20/04/28 05:13:39
3	15	382.9010566156205	262.6077198102401	20/04/28 05:13:39
3	15	382.9329037629225	262.72409784161044	20/04/28 05:13:39
3	15	383.2235526901126	262.6940241242609	20/04/28 05:13:39
3	15	383.2681313060736	262.64929354626867	20/04/28 05:13:40
3	15	383.4785887189687	262.4458663271987	20/04/28 05:13:40
3	15	383.40742781027274	262.43725776448383	20/04/28 05:13:40
3	15	383.4232248952188	262.2544479433063	20/04/28 05:13:40
3	15	383.2447792375392	262.16918027666355	20/04/28 05:13:40
3	15	383.23824604545274	262.1595252453643	20/04/28 05:13:40
3	15	383.3751706559918	261.9041684603966	20/04/28 05:13:40
3	15	383.35149561528067	261.92047649256335	20/04/28 05:13:40
3	15	383.28749979929165	261.98438187859773	20/04/28 05:13:40
3	15	383.0892615941329	261.8063724370453	20/04/28 05:13:40
3	15	383.0175429999014	261.85327341848404	20/04/28 05:13:41
3	15	383.0298412529907	261.951162619478	20/04/28 05:13:41
3	15	383.04503179128733	261.8688039794334	20/04/28 05:13:41
3	15	383.31371962118624	261.90832757738264	20/04/28 05:13:41
3	15	383.2373726573299	262.10922965697745	20/04/28 05:13:41
3	15	383.10711801787323	262.1139498255238	20/04/28 05:13:41
3	15	383.0835325421151	262.1358667783831	20/04/28 05:13:41
3	15	383.1425558873656	262.1930769718225	20/04/28 05:13:41
3	15	383.07399362793143	262.1889844029581	20/04/28 05:13:41
3	15	383.31447214939993	262.23472293882526	20/04/28 05:13:41
3	15	383.24743750745114	262.26935810410686	20/04/28 05:13:42
3	15	383.2421423977778	261.9858827590028	20/04/28 05:13:42
3	15	383.1464185355653	261.75975576612495	20/04/28 05:13:42
3	15	382.91113114606475	261.60163445190534	20/04/28 05:13:42
3	15	382.913194184979	261.49555029239997	20/04/28 05:13:42
3	15	382.6652501822897	261.41573256997265	20/04/28 05:13:42
3	15	382.5706773627801	261.45815800777206	20/04/28 05:13:42
3	15	382.47961554357556	261.40551241804803	20/04/28 05:13:42
3	15	382.5991799492229	261.4182216082461	20/04/28 05:13:42
3	15	382.8711788358462	261.480676349009	20/04/28 05:13:43
3	15	382.83640235337185	261.58588895467096	20/04/28 05:13:43
3	15	382.86402765847066	261.79481169693014	20/04/28 05:13:43
3	15	382.92076721983483	261.80247401857105	20/04/28 05:13:43
3	15	383.15617967940517	261.8594953203553	20/04/28 05:13:43
3	15	383.2957249170791	261.8410173938819	20/04/28 05:13:43
3	15	383.51012195937267	261.7052462960772	20/04/28 05:13:43
3	15	383.5934536299345	261.7687587418271	20/04/28 05:13:43
3	15	383.67041383410213	261.7397210857766	20/04/28 05:13:43
3	15	383.5966966618444	261.82959757486316	20/04/28 05:13:43
3	15	383.7099923379871	261.9682845858396	20/04/28 05:13:44
3	15	383.61938040408734	262.1134107198181	20/04/28 05:13:44
3	15	383.68659943300077	262.21222761813937	20/04/28 05:13:44
3	15	383.66879221044945	262.21098177526494	20/04/28 05:13:44
3	15	383.7116202437408	262.19352410477313	20/04/28 05:13:44
3	15	383.6872168748755	262.10276882135173	20/04/28 05:13:44
3	15	383.5907732755721	261.95086732659985	20/04/28 05:13:44
3	15	383.59350213985175	261.94779653995687	20/04/28 05:13:44
3	15	383.4894050247402	261.9192163100905	20/04/28 05:13:44
3	15	383.4346833685056	261.93363057315395	20/04/28 05:13:45
3	15	383.2668651757652	261.88384860611427	20/04/28 05:13:45
3	15	383.2762341573012	261.77165672339936	20/04/28 05:13:45
3	15	383.0400713393433	261.9048464733511	20/04/28 05:13:45
3	15	383.0266643539315	261.9031046154337	20/04/28 05:13:45
3	15	383.06513142855965	261.97467839086744	20/04/28 05:13:45
3	15	383.08493259251094	261.7294506331578	20/04/28 05:13:45
3	15	383.12766023852714	261.7371256367344	20/04/28 05:13:45
3	15	383.2157777812271	261.7467514110038	20/04/28 05:13:45
3	15	383.23513574613327	261.50806881741204	20/04/28 05:13:45
3	15	383.22317358842815	261.5904214282129	20/04/28 05:13:46
3	15	383.00668816689495	261.4283308078922	20/04/28 05:13:46
3	15	382.8829567733944	261.27010935098997	20/04/28 05:13:46
3	15	382.8681255218065	261.20344121500744	20/04/28 05:13:46
3	15	383.0778862667207	261.15668038117394	20/04/28 05:13:46
3	15	382.9875919097646	261.1383644284274	20/04/28 05:13:46
3	15	382.9911051783505	261.04036470104427	20/04/28 05:13:46
3	15	383.08382849812705	261.2798094619157	20/04/28 05:13:46
3	15	382.7889610732907	261.24469742237693	20/04/28 05:13:46
3	15	382.902984855594	261.22406258443283	20/04/28 05:13:46
3	15	382.8808761115906	261.2472677936303	20/04/28 05:13:47
3	15	382.90710255744006	261.156294361219	20/04/28 05:13:47
3	15	382.91459299438316	261.1716632191519	20/04/28 05:13:47
3	15	382.91459299438316	261.1716632191519	20/04/28 05:13:47
3	15	382.91459299438316	261.1716632191519	20/04/28 05:13:47
3	15	382.85686374712327	261.3720865169966	20/04/28 05:13:47
3	15	382.8041140844256	261.5552217882825	20/04/28 05:13:47
3	15	382.72841260312543	261.81804074494767	20/04/28 05:13:47
3	15	382.65215970730435	262.0827740920131	20/04/28 05:13:47
3	15	382.59956959066864	262.26535545432887	20/04/28 05:13:48
3	15	382.53856105131786	262.47716373581096	20/04/28 05:13:48
3	15	382.4650895024848	262.732240855535	20/04/28 05:13:48
3	15	382.4112121064838	262.91929136976034	20/04/28 05:13:48
3	15	382.35705535929384	263.1073117301072	20/04/28 05:13:48
3	15	382.29813782334793	263.31186050591236	20/04/28 05:13:48
3	15	382.2354106283294	263.5296355833106	20/04/28 05:13:48
3	15	382.1817177331656	263.71604555105404	20/04/28 05:13:48
3	15	382.1315483282299	263.8902227327321	20/04/28 05:13:48
3	15	382.06634642712237	264.11658944745625	20/04/28 05:13:48
3	15	381.9984237622157	264.35240205796396	20/04/28 05:13:49
3	15	381.94083641688104	264.55233270341546	20/04/28 05:13:49
3	15	381.8845356764485	264.7477965385457	20/04/28 05:13:49
1	33	381.80792170000325	264.90552921510823	20/04/28 05:13:49
1	33	381.6123774380558	264.6850308335139	20/04/28 05:13:49
1	33	381.4852982129149	264.54173456289595	20/04/28 05:13:49
1	33	381.34048607263105	264.37844241486874	20/04/28 05:13:49
1	33	381.1628024752499	264.1780839626789	20/04/28 05:13:49
1	33	381.0095311481613	264.0052531200283	20/04/28 05:13:49
1	33	380.88283589552475	263.86238982205265	20/04/28 05:13:49
1	33	380.7373528857834	263.6983411924587	20/04/28 05:13:50
1	33	380.6154342868525	263.56086411446734	20/04/28 05:13:50
1	33	380.5069690248149	263.4385572029767	20/04/28 05:13:50
1	33	380.3786525945146	263.2938658429164	20/04/28 05:13:50
1	33	380.25365772347783	263.1529199184657	20/04/28 05:13:50
1	33	380.05585933818713	262.9298797565903	20/04/28 05:13:50
1	33	379.90082992553823	262.75506647264035	20/04/28 05:13:50
1	33	379.7275623997437	262.55968764311064	20/04/28 05:13:50
1	33	379.5887528697059	262.40316412041363	20/04/28 05:13:50
1	33	379.4055130320958	262.1965403758238	20/04/28 05:13:51
1	33	379.2265645997803	261.99475567847986	20/04/28 05:13:51
1	33	379.0563406533655	261.80280883064466	20/04/28 05:13:51
1	33	378.91842240142523	261.6472903253084	20/04/28 05:13:51
1	33	378.7800697049689	261.4912819343998	20/04/28 05:13:51
1	33	378.6401327121048	261.33348706921475	20/04/28 05:13:51
1	69	378.5201808862467	261.27306632346017	20/04/28 05:13:51
1	69	378.3494985274406	261.36507757182596	20/04/28 05:13:51
1	69	378.12354720689484	261.4868831480949	20/04/28 05:13:51
1	69	377.8821511264359	261.61701466765555	20/04/28 05:13:51
1	69	377.65184090256633	261.74117003648144	20/04/28 05:13:52
1	69	377.5145328683725	261.8151898925767	20/04/28 05:13:52
1	69	377.2559640656529	261.9545788633707	20/04/28 05:13:52
1	69	377.0256376021769	262.07874298662483	20/04/28 05:13:52
1	69	376.8866498115397	262.15366836387875	20/04/28 05:13:52
1	69	376.6418928220306	262.2856116783988	20/04/28 05:13:52
1	69	376.46087203420717	262.38319615510926	20/04/28 05:13:52
1	69	376.3173339491876	262.46057449979037	20/04/28 05:13:52
1	69	376.11513012702966	262.5695783021237	20/04/28 05:13:52
1	69	375.89160795747273	262.69007437449005	20/04/28 05:13:52
1	69	375.70018915768327	262.7932641994521	20/04/28 05:13:53
1	69	375.4708875122125	262.9168758650025	20/04/28 05:13:53
1	69	375.28239368212957	263.01848890068175	20/04/28 05:13:53
1	69	375.084973240239	263.12491408391884	20/04/28 05:13:53
1	69	374.8377029053905	263.2582122897345	20/04/28 05:13:53
1	69	374.69187018328466	263.3368276247193	20/04/28 05:13:53
1	69	374.5132574172353	263.4331139878398	20/04/28 05:13:53
1	69	374.25273344885284	263.57355694707564	20/04/28 05:13:53
1	69	373.99893445175695	263.7103746165766	20/04/28 05:13:53
1	69	373.83493981931605	263.7987806531566	20/04/28 05:13:54
1	69	373.5959760635858	263.9276009579187	20/04/28 05:13:54
1	74	373.416831140959	264.0160320371763	20/04/28 05:13:54
1	74	373.19254388632834	264.1262213977761	20/04/28 05:13:54
1	74	372.93979325230595	264.25039444006495	20/04/28 05:13:54
1	74	372.7896528752345	264.32415642077564	20/04/28 05:13:54
1	74	372.9527990652495	264.4820956354621	20/04/28 05:13:54
1	74	373.0035626997605	264.4890757790466	20/04/28 05:13:54
1	74	373.21704717200316	264.43516292199587	20/04/28 05:13:54
1	74	373.15375248248176	264.3196718361149	20/04/28 05:13:54
1	74	373.376471555453	264.25630438231275	20/04/28 05:13:55
1	74	373.30758293135045	264.14546996555305	20/04/28 05:13:55
1	74	373.2998788377631	264.1776276985142	20/04/28 05:13:55
1	74	373.31611777048954	264.3019972697176	20/04/28 05:13:55
1	74	373.51464758583376	264.2800205525703	20/04/28 05:13:55
1	74	373.4295894259061	264.2951442250163	20/04/28 05:13:55
1	74	373.5735527653887	264.23131002109375	20/04/28 05:13:55
1	74	373.53826809321015	264.2761568364721	20/04/28 05:13:55
1	74	373.5361538452834	264.27917743779864	20/04/28 05:13:55
1	74	373.6076788401812	264.3090988669504	20/04/28 05:13:55
1	74	373.5505639808179	264.54820230391687	20/04/28 05:13:56
1	74	373.4843660255733	264.4015410354225	20/04/28 05:13:56
1	74	373.51870572270496	264.4011291495698	20/04/28 05:13:56
1	74	373.51900947373827	264.40021958481276	20/04/28 05:13:56
1	74	373.50177401612507	264.40970851086877	20/04/28 05:13:56
1	74	373.501692513791	264.4097386077046	20/04/28 05:13:56
1	74	373.2845415354072	264.42127537075095	20/04/28 05:13:56
1	74	373.104173674883	264.2833719507551	20/04/28 05:13:56
1	74	373.2403255669114	264.3175997650481	20/04/28 05:13:56
1	74	373.204095121229	264.26169332781456	20/04/28 05:13:57
1	74	373.090493339649	264.30418317352724	20/04/28 05:13:57
1	74	372.9661068800515	264.2729309256678	20/04/28 05:13:57
1	74	373.2122477127512	264.3891841371358	20/04/28 05:13:57
1	74	373.24926890735907	264.5958426847743	20/04/28 05:13:57
1	74	373.24323663298503	264.62894743526596	20/04/28 05:13:57
1	74	373.26792399261495	264.6809942284827	20/04/28 05:13:57
1	74	373.361893710666	264.55550985624814	20/04/28 05:13:57
1	74	373.2649674080452	264.542181465189	20/04/28 05:13:57
1	74	373.2686981415358	264.53237291167784	20/04/28 05:13:57
1	74	373.3483904355252	264.5590096576963	20/04/28 05:13:58
1	74	373.22312323674413	264.28815681118596	20/04/28 05:13:58
1	74	373.10513296993355	264.4427190500871	20/04/28 05:13:58
1	74	373.23228602264624	264.47090931719765	20/04/28 05:13:58
1	74	373.3229941982243	264.44975990247013	20/04/28 05:13:58
1	74	373.2780598640272	264.4968375087526	20/04/28 05:13:58
1	74	373.1936956865796	264.2684574675719	20/04/28 05:13:58
1	74	373.2585916158331	264.50682261740394	20/04/28 05:13:58
1	74	373.27431377907016	264.4005621875969	20/04/28 05:13:58
1	74	373.04644057805314	264.31457080889555	20/04/28 05:13:59
1	74	373.2132217441363	264.2833346771399	20/04/28 05:13:59
1	74	373.0290358132559	264.19270417920376	20/04/28 05:13:59
1	74	372.94615060634186	264.32774165065945	20/04/28 05:13:59
1	74	372.963730047837	264.2341809066686	20/04/28 05:13:59
1	74	373.21269820189184	264.2627547335198	20/04/28 05:13:59
1	74	373.1998165370644	264.2826980248305	20/04/28 05:13:59
1	74	373.3658355138325	264.40037000682474	20/04/28 05:13:59
1	74	373.4975722032078	264.6432523391967	20/04/28 05:13:59
1	74	373.49116375458067	264.64554425594525	20/04/28 05:13:59
1	74	373.2221240594078	264.68761631247645	20/04/28 05:14:00
1	74	373.1999447346958	264.8767773651564	20/04/28 05:14:00
1	74	372.9480392451672	264.8810277486132	20/04/28 05:14:00
1	74	373.0228781950771	264.88773003883193	20/04/28 05:14:00
1	74	373.18906397064995	264.9521836849014	20/04/28 05:14:00
1	74	373.1939658161795	264.9487878089032	20/04/28 05:14:00
1	74	372.9691518262954	264.8208662133028	20/04/28 05:14:00
1	74	372.8748927855796	264.63430484066333	20/04/28 05:14:00
1	74	372.9532406654029	264.66656551481356	20/04/28 05:14:00
1	74	372.85361511294246	264.45617706554634	20/04/28 05:14:00
1	74	372.97897273008925	264.3596295536025	20/04/28 05:14:01
1	74	372.94555091231115	264.29319082803636	20/04/28 05:14:01
1	74	372.94573903331883	264.29370808067785	20/04/28 05:14:01
1	74	372.9479071699466	264.29768405866054	20/04/28 05:14:01
1	74	372.7271691518021	264.32802865728416	20/04/28 05:14:01
1	74	372.7440761736929	264.55250388161187	20/04/28 05:14:01
1	74	372.71618677796414	264.4737026556848	20/04/28 05:14:01
1	74	372.6140663658581	264.4929156735642	20/04/28 05:14:01
1	74	372.71122972549205	264.749438160867	20/04/28 05:14:01
1	74	372.8370019593194	264.7726148262588	20/04/28 05:14:02
1	74	372.80754834643193	264.94754583646454	20/04/28 05:14:02
1	74	372.7117005893828	264.92536650856493	20/04/28 05:14:02
1	74	372.66548447844855	265.13946858864176	20/04/28 05:14:02
1	74	372.6684943667615	265.14666487075465	20/04/28 05:14:02
1	74	372.4611513488324	264.9874838118668	20/04/28 05:14:02
1	74	372.48636935302727	264.9314187619592	20/04/28 05:14:02
1	74	372.53876262065666	264.90616538363645	20/04/28 05:14:02
1	74	372.5207189766959	264.85929992903334	20/04/28 05:14:02
1	74	372.51412631136174	264.88375061090284	20/04/28 05:14:02
1	74	372.5427697351963	264.8201866690915	20/04/28 05:14:03
1	74	372.69059633108157	265.042746600591	20/04/28 05:14:03
1	74	372.6419229534298	265.2722901720112	20/04/28 05:14:03
1	74	372.67151283151003	265.42856406886636	20/04/28 05:14:03
1	74	372.4162811815872	265.42813224167844	20/04/28 05:14:03
1	74	372.30463862717914	265.53412522751165	20/04/28 05:14:03
1	74	372.5137189172958	265.7067691722537	20/04/28 05:14:03
1	74	372.4825767300361	265.5315317331414	20/04/28 05:14:03
1	74	372.58831915631845	265.72978713839086	20/04/28 05:14:03
1	74	372.66650434279404	265.83880636438704	20/04/28 05:14:04
1	74	372.86073143591324	265.88727937529944	20/04/28 05:14:04
1	74	372.9022051129443	265.94586820687016	20/04/28 05:14:04
1	74	373.07591842678517	265.8076882155547	20/04/28 05:14:04
1	74	372.88425949901506	265.74831373750305	20/04/28 05:14:04
1	74	372.879295138095	265.9515732518373	20/04/28 05:14:04
1	74	373.02876685022824	265.9188939541188	20/04/28 05:14:04
1	74	373.0380753359358	265.9110408419876	20/04/28 05:14:04
1	74	373.2160068335222	265.8629706555374	20/04/28 05:14:04
1	74	373.3297943544174	265.7780469059678	20/04/28 05:14:04
1	74	373.1948302540485	265.6334622626027	20/04/28 05:14:05
1	74	373.15918302586863	265.7475392229052	20/04/28 05:14:05
1	74	373.26916468131515	265.875708598841	20/04/28 05:14:05
1	74	373.41130281364445	265.7579680186703	20/04/28 05:14:05
1	74	373.31490633136207	265.482416605738	20/04/28 05:14:05
1	74	373.4102838040919	265.58063725443975	20/04/28 05:14:05
1	74	373.3879214170696	265.5470019518339	20/04/28 05:14:05
1	74	373.5369117325425	265.46839206674264	20/04/28 05:14:05
1	74	373.58711593437465	265.46478830626467	20/04/28 05:14:05
1	74	373.5351701978952	265.3765829692069	20/04/28 05:14:05
1	74	373.3893127959562	265.48471089721266	20/04/28 05:14:06
1	74	373.3301346755935	265.67895753514455	20/04/28 05:14:06
1	74	373.19739564061933	265.67344587629424	20/04/28 05:14:06
1	74	373.347319576885	265.9302695704127	20/04/28 05:14:06
1	74	373.2845551986671	266.1717349729604	20/04/28 05:14:06
1	74	373.3152159420606	266.1592989937603	20/04/28 05:14:06
1	74	373.2745830299159	266.37967117751333	20/04/28 05:14:06
1	74	373.1331093318652	266.57330777021986	20/04/28 05:14:06
1	74	373.2102294449026	266.69799228540245	20/04/28 05:14:06
1	74	373.18692373947016	266.7069656411482	20/04/28 05:14:07
1	74	373.060410991369	266.66052399321654	20/04/28 05:14:07
1	74	372.81127874742435	266.70997938155966	20/04/28 05:14:07
1	74	372.9374255520314	266.7503989930594	20/04/28 05:14:07
1	74	372.9968634856626	266.90267968077654	20/04/28 05:14:07
1	74	373.0360729517316	266.91679417287924	20/04/28 05:14:07
1	74	373.00368738836755	266.71129881782053	20/04/28 05:14:07
1	74	373.010900464091	266.55747105927503	20/04/28 05:14:07
1	74	372.91414150564333	266.56681374815423	20/04/28 05:14:07
1	74	373.1027052061116	266.61876692676765	20/04/28 05:14:07
1	74	372.96844186873216	266.5956890797737	20/04/28 05:14:08
1	74	373.02960735850183	266.54269948579247	20/04/28 05:14:08
1	74	372.94197616197806	266.41048279477315	20/04/28 05:14:08
1	74	372.83972150886893	266.2085356252924	20/04/28 05:14:08
1	74	372.729393949185	266.1049910639869	20/04/28 05:14:08
1	74	372.7018466527718	266.00386967619596	20/04/28 05:14:08
1	74	372.8578621419065	265.89169378327153	20/04/28 05:14:08
1	74	372.79990517742186	265.7072224589678	20/04/28 05:14:08
1	74	372.92118306140094	265.7938524886346	20/04/28 05:14:08
1	74	373.17499791056173	265.647088489942	20/04/28 05:14:09
1	74	373.3616782385683	265.8535749630017	20/04/28 05:14:09
1	74	373.40682238606	266.0012967338827	20/04/28 05:14:09
1	74	373.4065679376996	266.00295494532355	20/04/28 05:14:09
1	74	373.5388675038204	266.01675419430643	20/04/28 05:14:09
1	74	373.8098755602138	265.89579897801895	20/04/28 05:14:09
1	74	373.98893977710054	265.9566235677833	20/04/28 05:14:09
1	74	374.0983303472794	265.903615458934	20/04/28 05:14:09
1	74	374.06260398442754	265.9964225121137	20/04/28 05:14:09
1	74	373.8172051938749	265.8602061585615	20/04/28 05:14:09
1	74	373.988545338709	265.9667746190739	20/04/28 05:14:10
1	74	373.9660979195983	265.91931642402835	20/04/28 05:14:10
1	74	373.74355881975237	265.8387008669175	20/04/28 05:14:10
1	74	373.6075627873991	265.7798493707419	20/04/28 05:14:10
1	74	373.6230110169103	265.7860483694216	20/04/28 05:14:10
1	74	373.63657258447984	265.78252623060206	20/04/28 05:14:10
1	74	373.63476902309486	265.78434567217704	20/04/28 05:14:10
1	74	373.6249021972708	265.80669012945964	20/04/28 05:14:10
1	74	373.6422001734146	265.84510997126466	20/04/28 05:14:10
1	74	373.4258736032743	265.8392821165121	20/04/28 05:14:10
1	74	373.58425999065446	266.0096029807135	20/04/28 05:14:11
1	74	373.44427786178903	265.9008718088693	20/04/28 05:14:11
1	74	373.55666917773493	266.0182470131582	20/04/28 05:14:11
1	74	373.79364362050666	265.85344590982726	20/04/28 05:14:11
1	74	373.7013133583794	266.09553581586965	20/04/28 05:14:11
1	74	373.74327955222	265.8325068837758	20/04/28 05:14:11
1	74	373.64610466878173	265.78883454451665	20/04/28 05:14:11
1	74	373.6534510716076	265.792453506033	20/04/28 05:14:11
1	74	373.4387163799525	265.8705909411845	20/04/28 05:14:11
1	74	373.46401117274917	265.58825946161005	20/04/28 05:14:11
1	74	373.46401117274917	265.58825946161005	20/04/28 05:14:12
1	74	373.46401117274917	265.58825946161005	20/04/28 05:14:12
1	74	373.3355322771959	265.361164568138	20/04/28 05:14:12
1	74	373.41085407427954	265.44576317366875	20/04/28 05:14:12
1	74	373.2944855047148	265.5485125626242	20/04/28 05:14:12
1	74	373.2255119903913	265.5660567479018	20/04/28 05:14:12
1	74	373.25459845847837	265.54558589161155	20/04/28 05:14:12
1	74	373.3712292127648	265.72611304730395	20/04/28 05:14:12
1	74	373.28271460685505	265.8688318096626	20/04/28 05:14:12
1	74	373.270201216597	265.85023218431354	20/04/28 05:14:13
1	74	373.2832477056097	265.8593165943496	20/04/28 05:14:13
1	74	373.431994297341	266.1123294033138	20/04/28 05:14:13
1	74	373.43040419726714	265.8451626861775	20/04/28 05:14:13
1	74	373.39225615657483	265.9292781856488	20/04/28 05:14:13
1	74	373.3840419669008	266.00446883080315	20/04/28 05:14:13
1	74	373.37147319868706	265.98651190061054	20/04/28 05:14:13
1	74	373.2153806462586	266.0006989899673	20/04/28 05:14:13
1	74	373.1373363217932	266.0265344824034	20/04/28 05:14:13
1	74	373.07622523971656	265.96554242405847	20/04/28 05:14:13
1	74	372.97330227538845	265.8971582470141	20/04/28 05:14:14
1	74	373.09634565690317	265.9858405854246	20/04/28 05:14:14
1	74	373.1563855741271	266.04368318168156	20/04/28 05:14:14
1	74	373.0533303909525	266.2130199819809	20/04/28 05:14:14
1	74	373.19038634214996	265.99296832861614	20/04/28 05:14:14
1	74	373.04167408699254	265.75456126677653	20/04/28 05:14:14
1	74	373.10166850374964	265.57487364397093	20/04/28 05:14:14
1	74	372.9507686503187	265.5420325355826	20/04/28 05:14:14
1	74	372.80299949297097	265.50965356995994	20/04/28 05:14:14
1	74	372.79705407867937	265.5003069659513	20/04/28 05:14:14
1	74	372.6365028768467	265.65862680278366	20/04/28 05:14:15
1	74	372.63692969846124	265.60977400054065	20/04/28 05:14:15
1	74	372.85351994414333	265.6810789215891	20/04/28 05:14:15
1	74	372.85351994414333	265.6810789215891	20/04/28 05:14:15
1	74	372.85351994414333	265.6810789215891	20/04/28 05:14:15
1	74	372.85351994414333	265.6810789215891	20/04/28 05:14:15
1	74	373.08965154172427	265.75197514940635	20/04/28 05:14:15
1	74	373.0127479833896	265.6724550335721	20/04/28 05:14:15
1	74	373.01493279307704	265.6741051817873	20/04/28 05:14:15
1	74	372.7778030410005	265.63023081230983	20/04/28 05:14:16
1	74	372.81299304089606	265.63348988232815	20/04/28 05:14:16
1	74	372.86825551651754	265.687953407811	20/04/28 05:14:16
1	74	372.86825551651754	265.687953407811	20/04/28 05:14:16
1	74	372.86825551651754	265.687953407811	20/04/28 05:14:16
1	74	372.880776196797	265.7275183251191	20/04/28 05:14:16
1	74	372.9557406224736	265.6213874752805	20/04/28 05:14:16
1	74	372.9513497387467	265.61582217558185	20/04/28 05:14:16
1	74	372.9513497387467	265.61582217558185	20/04/28 05:14:16
1	74	372.98923115875255	265.63101318813517	20/04/28 05:14:16
1	74	372.9786896602053	265.8226312912332	20/04/28 05:14:17
1	74	373.1168475298409	265.6375836528061	20/04/28 05:14:17
1	74	373.02582462229736	265.792204068499	20/04/28 05:14:17
1	74	372.88396016312925	265.650586893847	20/04/28 05:14:17
1	74	372.6241741380968	265.68230985484394	20/04/28 05:14:17
1	74	372.6241741380968	265.68230985484394	20/04/28 05:14:17
1	74	372.643726596875	265.8094410059729	20/04/28 05:14:17
1	74	372.74059047688957	265.62426672007985	20/04/28 05:14:17
1	74	372.75314127765967	265.537255528014	20/04/28 05:14:17
1	74	372.5071101178386	265.43582145545105	20/04/28 05:14:18
1	74	372.6413651310065	265.47923377541485	20/04/28 05:14:18
1	74	372.8285440580458	265.4010307150237	20/04/28 05:14:18
1	74	372.67651474478237	265.420906585589	20/04/28 05:14:18
1	74	372.47142914668603	265.3905256290061	20/04/28 05:14:18
1	74	372.3768151089134	265.5437052457007	20/04/28 05:14:18
1	74	372.4394145370857	265.7924566746059	20/04/28 05:14:18
1	74	372.7740239303206	265.60391835629696	20/04/28 05:14:18
1	74	373.00030599828807	265.5381042764097	20/04/28 05:14:18
1	74	372.83523987130917	265.48881994768635	20/04/28 05:14:18
1	74	372.6499767480677	265.6979431749633	20/04/28 05:14:19
1	74	372.6499767480677	265.6979431749633	20/04/28 05:14:19
1	74	372.8597240775683	265.72612394233994	20/04/28 05:14:19
1	74	372.88093841004604	265.49024050597535	20/04/28 05:14:19
1	74	372.87572690152575	265.4875526656805	20/04/28 05:14:19
1	74	372.635896651086	265.32203804103835	20/04/28 05:14:19
1	74	372.6384586502773	265.3194145963837	20/04/28 05:14:19
1	74	372.7020284337582	265.4424297417161	20/04/28 05:14:19
1	74	372.6692119901775	265.6087577721761	20/04/28 05:14:19
1	74	372.83148128221154	265.7673971930918	20/04/28 05:14:19
1	74	373.0069782119059	265.7282524217685	20/04/28 05:14:20
1	74	373.16791888358136	265.5883254764534	20/04/28 05:14:20
1	74	373.1698565348993	265.6501536502602	20/04/28 05:14:20
1	74	373.1159102995442	265.71608452215713	20/04/28 05:14:20
1	74	373.1159102995442	265.71608452215713	20/04/28 05:14:20
1	74	373.40615491744165	265.6101530298601	20/04/28 05:14:20
1	74	373.31493517915357	265.55969417879913	20/04/28 05:14:20
1	74	373.024401113223	265.5029742747899	20/04/28 05:14:20
1	74	372.9978414216664	265.4905992675767	20/04/28 05:14:20
1	74	372.82752830053255	265.3926083107836	20/04/28 05:14:21
1	74	372.7778272836619	265.4835410775715	20/04/28 05:14:21
1	74	372.72669115755946	265.3983690156671	20/04/28 05:14:21
1	74	372.86726289516713	265.4009437001666	20/04/28 05:14:21
1	74	372.79315206929294	265.3672207852277	20/04/28 05:14:21
1	74	372.732340131873	265.31202249365987	20/04/28 05:14:21
1	74	372.5567643081281	265.15745806836577	20/04/28 05:14:21
1	74	372.5567643081281	265.15745806836577	20/04/28 05:14:21
1	74	372.37419110448684	265.1438124544143	20/04/28 05:14:21
1	74	372.50202847985724	265.0672108535147	20/04/28 05:14:21
1	74	372.4252300880997	264.84371597750413	20/04/28 05:14:22
1	74	372.2546476421896	264.81195165477544	20/04/28 05:14:22
1	74	372.0055942236501	264.85816885621995	20/04/28 05:14:22
1	74	371.9692541548971	264.81721932858665	20/04/28 05:14:22
1	74	372.0997183922899	264.84042920973815	20/04/28 05:14:22
1	74	372.2567628717914	264.6592982314655	20/04/28 05:14:22
1	74	372.2567628717914	264.6592982314655	20/04/28 05:14:22
1	74	372.0040584073439	264.65867428029514	20/04/28 05:14:22
1	74	372.23367088650645	264.7877548760676	20/04/28 05:14:22
1	74	372.2863836073133	264.7895234556667	20/04/28 05:14:22
1	74	372.27081604530457	264.8010692812798	20/04/28 05:14:23
1	74	372.3544721137566	264.6135095261084	20/04/28 05:14:23
1	74	372.40069268091145	264.38262040524427	20/04/28 05:14:23
1	74	372.17521016342516	264.53604695549797	20/04/28 05:14:23
1	74	372.3723337595121	264.65768272786636	20/04/28 05:14:23
1	74	372.2210391363518	264.62587359511775	20/04/28 05:14:23
1	74	372.43386671337515	264.78165150958614	20/04/28 05:14:23
1	74	372.2598685319403	264.98211532539796	20/04/28 05:14:23
1	74	372.4096130219162	265.08710182630307	20/04/28 05:14:23
1	74	372.30248983772424	265.1846184973248	20/04/28 05:14:24
1	74	372.3011134727656	265.1863576578895	20/04/28 05:14:24
1	74	372.31853015827926	265.2080642763919	20/04/28 05:14:24
1	74	372.1015113319927	265.03691336735756	20/04/28 05:14:24
1	74	372.10578492712	265.05369909833956	20/04/28 05:14:24
1	74	372.0124843307674	265.09722283935366	20/04/28 05:14:24
1	74	371.98610366598615	265.12595990729	20/04/28 05:14:24
1	74	371.94663277684475	265.36752622815067	20/04/28 05:14:24
1	74	372.0848162403021	265.38535605779873	20/04/28 05:14:24
1	74	372.1353128286731	265.19393471369744	20/04/28 05:14:24
1	74	372.09007461852036	264.97910379919654	20/04/28 05:14:25
1	74	372.0876976770965	265.0349897282703	20/04/28 05:14:25
1	74	372.1188953422907	265.26114614099873	20/04/28 05:14:25
1	74	372.1795518520288	265.34979213712415	20/04/28 05:14:25
1	74	372.1725651690566	265.35627135586	20/04/28 05:14:25
1	74	372.35038504135633	265.37383424266585	20/04/28 05:14:25
1	74	372.3845033584558	265.4293982491267	20/04/28 05:14:25
1	74	372.3089781506036	265.4972182440253	20/04/28 05:14:25
1	74	372.13856628785464	265.38434489570625	20/04/28 05:14:25
1	74	372.2603115445898	265.17062675552023	20/04/28 05:14:26
1	74	372.3758317335924	264.92324534046367	20/04/28 05:14:26
1	74	372.5422590235358	264.70778542464757	20/04/28 05:14:26
1	74	372.62983097756745	264.88110225362203	20/04/28 05:14:26
1	74	372.6083675927333	264.92697246637687	20/04/28 05:14:26
1	74	372.50396459145134	265.00431377802886	20/04/28 05:14:26
1	74	372.4824051091098	264.98712024579777	20/04/28 05:14:26
1	74	372.42131711588104	265.03999115562357	20/04/28 05:14:26
1	74	372.3456464949713	264.93629774591517	20/04/28 05:14:26
1	74	372.2670439104488	265.1483627086339	20/04/28 05:14:26
1	74	371.9708082384389	265.11776473053084	20/04/28 05:14:27
1	74	371.99342004734297	265.1349279858634	20/04/28 05:14:27
1	74	371.94418291802094	265.07963488835196	20/04/28 05:14:27
1	74	372.14591215651075	264.9683099778549	20/04/28 05:14:27
1	74	372.0923108957824	265.0731159475222	20/04/28 05:14:27
1	74	372.10233619418557	265.16388945489257	20/04/28 05:14:27
1	74	372.3310037012584	265.21958354098007	20/04/28 05:14:27
1	74	372.1041355117396	265.24626340837455	20/04/28 05:14:27
1	74	372.06746677371257	264.95837116491526	20/04/28 05:14:27
1	74	372.2397742773721	265.1411181981558	20/04/28 05:14:27
1	74	372.28523120385006	265.16695548451645	20/04/28 05:14:28
1	74	372.5007817944801	265.20747034218675	20/04/28 05:14:28
1	74	372.60017673277247	265.3214834341182	20/04/28 05:14:28
1	74	372.6618904494309	265.4821126435088	20/04/28 05:14:28
1	74	372.64244003894044	265.4593141686782	20/04/28 05:14:28
1	74	372.66446913924716	265.4036683270373	20/04/28 05:14:28
1	74	372.727323000734	265.1187557342661	20/04/28 05:14:28
1	74	372.66018894766086	265.1947157102121	20/04/28 05:14:28
1	74	372.53340254141284	265.29680907838025	20/04/28 05:14:28
1	74	372.37368656217905	265.4118364827724	20/04/28 05:14:28
1	74	372.36645357011935	265.44901376359985	20/04/28 05:14:29
1	74	372.4107205480712	265.6161648048988	20/04/28 05:14:29
1	74	372.4033070050607	265.61956531177566	20/04/28 05:14:29
1	74	372.41028857983173	265.60193761189913	20/04/28 05:14:29
1	74	372.59804644228075	265.4843840349995	20/04/28 05:14:29
1	74	372.5979845384171	265.4844199584035	20/04/28 05:14:29
1	74	372.6160692127569	265.29476763296077	20/04/28 05:14:29
1	74	372.52456390311113	265.20754826390953	20/04/28 05:14:29
1	74	372.4218959553884	265.1967119426793	20/04/28 05:14:29
1	74	372.43032023222963	265.23127754799	20/04/28 05:14:30
1	74	372.29179966763076	265.2474238962197	20/04/28 05:14:30
1	74	372.13316282683536	265.3977876108386	20/04/28 05:14:30
1	74	372.0122477511815	265.3625233639589	20/04/28 05:14:30
1	74	372.1168766795533	265.2953859844323	20/04/28 05:14:30
1	74	372.12613939372517	265.24899792307804	20/04/28 05:14:30
1	74	372.11811987273546	265.22247082149914	20/04/28 05:14:30
1	74	372.1237411466126	265.2894071412425	20/04/28 05:14:30
1	74	372.11033499022665	265.3146880599127	20/04/28 05:14:30
1	74	372.0652518804462	265.27491372744436	20/04/28 05:14:30
1	74	372.19401008500097	265.21578556516823	20/04/28 05:14:31
1	74	372.2614387772473	265.1473768634911	20/04/28 05:14:31
1	74	372.25857478822655	265.13061006233715	20/04/28 05:14:31
1	74	372.2999571264399	265.29993547605346	20/04/28 05:14:31
1	74	372.3138386551658	265.31342224360077	20/04/28 05:14:31
1	74	372.2860797963186	265.16425887995115	20/04/28 05:14:31
1	74	372.3198969289788	265.15352887409057	20/04/28 05:14:31
1	74	372.2430061580601	265.391546547135	20/04/28 05:14:31
1	74	372.20076574776954	265.1157404556216	20/04/28 05:14:31
1	74	372.0137028640471	264.9032330659583	20/04/28 05:14:31
1	74	372.10041701129035	264.8980861464081	20/04/28 05:14:32
1	74	372.1315304850828	264.9139908819499	20/04/28 05:14:32
1	74	372.07258592002194	265.1084546027586	20/04/28 05:14:32
1	74	372.2868672463876	264.94451410692136	20/04/28 05:14:32
1	74	372.20749886813934	264.9451586135014	20/04/28 05:14:32
1	74	372.09052017329077	264.82692733595064	20/04/28 05:14:32
1	74	372.1493372602883	264.5583976221438	20/04/28 05:14:32
1	74	371.95254049248746	264.6016565821943	20/04/28 05:14:32
1	74	371.9450863062832	264.4610276035232	20/04/28 05:14:32
1	74	372.22574714376213	264.4125365275761	20/04/28 05:14:33
1	74	372.0785228817706	264.3106621485424	20/04/28 05:14:33
1	74	372.1883933384009	264.31988531510575	20/04/28 05:14:33
1	74	372.3356717763497	264.24740355457004	20/04/28 05:14:33
1	74	372.41794659708677	264.27862785455375	20/04/28 05:14:33
1	74	372.32894770742803	264.3403029996555	20/04/28 05:14:33
1	74	372.36911532590733	264.37022940484627	20/04/28 05:14:33
1	74	372.4250306429818	264.28765522553226	20/04/28 05:14:33
1	74	372.325385171879	264.1671725649242	20/04/28 05:14:33
1	74	372.3250946820017	264.16727395784613	20/04/28 05:14:33
1	74	372.366012032189	264.27286697425575	20/04/28 05:14:34
1	74	372.15097713107286	264.38556786919736	20/04/28 05:14:34
1	74	372.21086913873677	264.3487738182702	20/04/28 05:14:34
1	74	372.24678261976317	264.43611199831486	20/04/28 05:14:34
1	74	372.3445357139423	264.4164054873786	20/04/28 05:14:34
1	74	372.29995898148496	264.41713227749165	20/04/28 05:14:34
1	74	372.29138634469115	264.31763010742856	20/04/28 05:14:34
1	74	372.04218116150463	264.3751013433941	20/04/28 05:14:34
1	74	372.02366250891885	264.2727477181791	20/04/28 05:14:34
1	74	372.0339141294204	264.2668500445294	20/04/28 05:14:34
1	74	372.042033908723	264.27284260364155	20/04/28 05:14:35
1	74	371.9443482623569	264.3157195550202	20/04/28 05:14:35
1	74	372.1095742723888	264.4204227580288	20/04/28 05:14:35
1	74	372.15336668927915	264.30293035523096	20/04/28 05:14:35
1	74	372.0435627636308	264.419737548392	20/04/28 05:14:35
1	74	372.28925362481675	264.57593472929597	20/04/28 05:14:35
1	74	372.3363079744588	264.479608946864	20/04/28 05:14:35
1	74	372.515495041575	264.69527269155714	20/04/28 05:14:35
1	74	372.6629155810586	264.61743456886313	20/04/28 05:14:35
1	74	372.603173539419	264.5671957836721	20/04/28 05:14:36
1	74	372.76028989321867	264.55501449546614	20/04/28 05:14:36
1	74	372.49973415079415	264.51939642526924	20/04/28 05:14:36
1	74	372.5072502057629	264.60804872321086	20/04/28 05:14:36
1	74	372.6317640050447	264.5847914726406	20/04/28 05:14:36
1	74	372.6917206435722	264.4320028785927	20/04/28 05:14:36
1	74	372.6917206435722	264.4320028785927	20/04/28 05:14:36
