floorId	partitionId	location_x	location_y	timeStamp
3	42	346.20430074593787	254.65002161092139	20/04/28 05:09:39
3	42	346.2893251967725	254.71135534028005	20/04/28 05:09:39
3	42	346.537329360291	254.61545804472016	20/04/28 05:09:39
3	42	346.46524632006145	254.8927583143145	20/04/28 05:09:39
3	42	346.263954658277	254.9273549942117	20/04/28 05:09:39
3	42	346.30732242670695	254.85709656980148	20/04/28 05:09:39
3	42	346.30140470903854	254.84304283862585	20/04/28 05:09:39
3	42	346.2374685768359	254.84510328876587	20/04/28 05:09:39
3	42	346.23792968312614	254.86510894088883	20/04/28 05:09:40
3	42	346.11427735751715	254.84825617038436	20/04/28 05:09:40
3	42	346.0289191193017	254.71379757746814	20/04/28 05:09:40
3	42	346.0702473587397	254.56413743640613	20/04/28 05:09:40
3	42	346.2722102036918	254.39302441876723	20/04/28 05:09:40
3	42	346.00928917993633	254.33872425793354	20/04/28 05:09:40
3	42	346.03973936353657	254.34561487002267	20/04/28 05:09:40
3	42	346.03973936353657	254.34561487002267	20/04/28 05:09:40
3	42	346.1374925807372	254.56491422832067	20/04/28 05:09:40
3	42	346.1581932636633	254.8137923599277	20/04/28 05:09:40
3	42	346.1575126934509	254.8098428555153	20/04/28 05:09:41
3	42	346.1575126934509	254.8098428555153	20/04/28 05:09:41
3	42	346.249694356899	254.70157149907905	20/04/28 05:09:41
3	42	346.2794556603422	254.6001679288747	20/04/28 05:09:41
3	42	346.46630897565905	254.74749607541543	20/04/28 05:09:41
3	42	346.4961813984341	254.77481134030148	20/04/28 05:09:41
3	42	346.5277050327188	254.7599518424476	20/04/28 05:09:41
3	42	346.30257229010635	254.57461135204633	20/04/28 05:09:41
3	42	346.5026538689752	254.73916285431724	20/04/28 05:09:41
3	42	346.53260921494285	254.7398911802404	20/04/28 05:09:42
3	42	346.42899308239663	254.9954043591519	20/04/28 05:09:42
3	42	346.32288708092926	254.88592183131271	20/04/28 05:09:42
3	42	346.2222757668392	255.11082770642707	20/04/28 05:09:42
3	42	346.2811450038233	254.8340624306171	20/04/28 05:09:42
3	42	346.26534791586977	254.8252165754322	20/04/28 05:09:42
3	42	346.21267419188007	255.02319284125983	20/04/28 05:09:42
3	42	346.22688801268384	255.06705379398142	20/04/28 05:09:42
3	42	346.23735516655637	255.2181477600834	20/04/28 05:09:42
3	42	346.23690080630325	255.21935245343238	20/04/28 05:09:42
3	42	346.3877954516174	255.2885273513031	20/04/28 05:09:43
3	42	346.1907099502583	255.3270923786164	20/04/28 05:09:43
3	42	346.2473377227664	255.0366497653288	20/04/28 05:09:43
3	42	346.35690825736674	255.01390465623942	20/04/28 05:09:43
3	42	346.43958556794695	254.82720993478262	20/04/28 05:09:43
3	42	346.4508195605643	254.68494280761496	20/04/28 05:09:43
3	42	346.45433671144406	254.6777298062158	20/04/28 05:09:43
3	42	346.38908080138134	254.8039683553947	20/04/28 05:09:43
3	42	346.2943197975431	255.02980459562627	20/04/28 05:09:43
3	42	346.3761713227238	255.11033735492887	20/04/28 05:09:43
3	42	346.2723623534782	255.22652825202962	20/04/28 05:09:44
3	42	346.39015851511783	255.34221692698176	20/04/28 05:09:44
3	42	346.32864083523623	255.41607909183892	20/04/28 05:09:44
3	42	346.26822758579846	255.37410441842064	20/04/28 05:09:44
3	42	346.20011705280297	255.5225876432254	20/04/28 05:09:44
3	42	346.28277379352386	255.41514220548538	20/04/28 05:09:44
3	42	346.2892195097274	255.22278681774085	20/04/28 05:09:44
3	42	346.25305503769596	255.3108017573092	20/04/28 05:09:44
3	42	346.43023206723404	255.30264261839002	20/04/28 05:09:44
3	42	346.34492086191767	255.38890708153713	20/04/28 05:09:45
3	42	346.2054730868451	255.4422319363866	20/04/28 05:09:45
3	42	346.1780188332722	255.66418287601863	20/04/28 05:09:45
3	42	346.25089890917076	255.47558952368067	20/04/28 05:09:45
3	42	346.0939966854325	255.71108671337117	20/04/28 05:09:45
3	42	346.0700864975616	255.57571697270362	20/04/28 05:09:45
3	42	346.03357012182784	255.61045201300493	20/04/28 05:09:45
3	42	346.13296223133284	255.56723687475107	20/04/28 05:09:45
3	42	346.2080127362656	255.85015561282682	20/04/28 05:09:45
3	42	346.0034865350173	255.86262499290515	20/04/28 05:09:45
3	42	346.0124260767671	255.9736457546741	20/04/28 05:09:46
3	42	346.0724342709643	255.89696471225642	20/04/28 05:09:46
3	42	346.10033015566165	255.91947063313614	20/04/28 05:09:46
3	42	346.2729997710066	255.96411742572297	20/04/28 05:09:46
3	42	346.42344647880014	255.89312417060614	20/04/28 05:09:46
3	42	346.67688055870497	256.00387105110906	20/04/28 05:09:46
3	42	346.893499249431	255.9415106325141	20/04/28 05:09:46
3	42	346.95206001098256	255.9684807002567	20/04/28 05:09:46
3	42	346.9693219108037	255.94653845097258	20/04/28 05:09:46
3	42	346.85818434021485	255.76489581235774	20/04/28 05:09:46
3	42	346.83136969876176	255.6525116734554	20/04/28 05:09:47
3	42	346.8415090370543	255.658152860137	20/04/28 05:09:47
3	42	346.8781510003676	255.65862117683162	20/04/28 05:09:47
3	42	347.1252277295559	255.60745404641514	20/04/28 05:09:47
3	42	347.26533731873593	255.60061766445588	20/04/28 05:09:47
3	42	347.2962648418368	255.57613009415883	20/04/28 05:09:47
3	42	347.3036101477602	255.56743483675018	20/04/28 05:09:47
3	42	347.01408704847205	255.6293317257623	20/04/28 05:09:47
3	42	347.11496625787504	255.48748213615102	20/04/28 05:09:47
3	42	346.9951468908413	255.45349736181808	20/04/28 05:09:48
3	42	346.94996955429133	255.4285727207717	20/04/28 05:09:48
3	42	347.01251547370924	255.3428833869162	20/04/28 05:09:48
3	42	347.0000086151964	255.32822726761208	20/04/28 05:09:48
3	42	347.2317936300386	255.17100670070653	20/04/28 05:09:48
3	42	347.41902141891404	254.9616236895257	20/04/28 05:09:48
3	42	347.44269506464803	255.0796072963985	20/04/28 05:09:48
3	42	347.4415246229296	254.91890907494104	20/04/28 05:09:48
3	42	347.5293665308598	255.18486992859147	20/04/28 05:09:48
3	42	347.4528095600479	254.9704464829229	20/04/28 05:09:48
3	42	347.35056648418504	254.98214391207193	20/04/28 05:09:49
3	42	347.3438067908743	255.10388579551253	20/04/28 05:09:49
3	42	347.4788973215008	255.2243058682057	20/04/28 05:09:49
3	42	347.21605618965265	255.2692409520759	20/04/28 05:09:49
3	42	347.1141647205844	255.2211239497531	20/04/28 05:09:49
3	42	347.04656653888827	255.1915162588364	20/04/28 05:09:49
3	42	347.1780354639949	254.94418732659048	20/04/28 05:09:49
3	42	346.913788188846	254.91353277583937	20/04/28 05:09:49
3	42	346.8778800449059	255.17305620517357	20/04/28 05:09:49
3	42	346.99552961260986	255.10978138573245	20/04/28 05:09:49
3	42	347.12237361203853	254.88644186065895	20/04/28 05:09:50
3	42	346.9552854389948	254.75683011817912	20/04/28 05:09:50
3	42	346.753430516313	254.88813930177187	20/04/28 05:09:50
3	42	346.663106366408	254.6846698264006	20/04/28 05:09:50
3	42	346.6770513524853	254.58561999783382	20/04/28 05:09:50
3	42	346.6894783552757	254.63307871244518	20/04/28 05:09:50
3	42	346.6894783552757	254.63307871244518	20/04/28 05:09:50
3	42	346.6894783552757	254.63307871244518	20/04/28 05:09:50
3	42	346.6629352227155	254.61223723294194	20/04/28 05:09:50
3	42	346.55666547184177	254.44756163049834	20/04/28 05:09:51
3	42	346.47118218911606	254.67432277702073	20/04/28 05:09:51
3	42	346.6183339173178	254.4713614640963	20/04/28 05:09:51
3	42	346.60802324063957	254.34815987273294	20/04/28 05:09:51
3	42	346.8786002205125	254.4614450847387	20/04/28 05:09:51
3	42	346.8779227378074	254.57559821271124	20/04/28 05:09:51
3	42	347.15942837289555	254.6405731876765	20/04/28 05:09:51
3	42	347.160706619585	254.66284730007544	20/04/28 05:09:51
3	42	347.16266163636186	254.7241531777872	20/04/28 05:09:51
3	42	347.18974883686064	254.83672932523623	20/04/28 05:09:51
3	42	347.2529338486809	255.02090186053277	20/04/28 05:09:52
3	42	347.20041646383476	255.07249626918957	20/04/28 05:09:52
3	42	347.2016216635762	255.08450889449188	20/04/28 05:09:52
3	42	347.1857964473991	255.10120293261028	20/04/28 05:09:52
3	42	347.02011716588106	254.9950145889907	20/04/28 05:09:52
3	42	346.91306528538865	255.04041083200846	20/04/28 05:09:52
3	42	346.90321977512406	255.30356560209677	20/04/28 05:09:52
3	42	346.9371088289084	255.29312776986038	20/04/28 05:09:52
3	42	346.7627279045364	255.14602551368895	20/04/28 05:09:52
3	42	346.7161306318457	255.08938958197817	20/04/28 05:09:52
3	42	346.7913400216027	255.31610167667398	20/04/28 05:09:53
3	42	346.91749255304535	255.57953579543144	20/04/28 05:09:53
3	42	346.94581537549095	255.54057009212545	20/04/28 05:09:53
3	42	346.89046282657034	255.3205673399736	20/04/28 05:09:53
3	42	346.947295464088	255.46988393247932	20/04/28 05:09:53
3	42	347.0436223786575	255.57851029358042	20/04/28 05:09:53
3	42	347.2712985547732	255.77520286181374	20/04/28 05:09:53
3	42	347.24317730583397	255.79338463718213	20/04/28 05:09:53
3	42	347.24317730583397	255.79338463718213	20/04/28 05:09:53
3	42	347.24102994242367	255.6423192326138	20/04/28 05:09:54
3	42	347.2083890486297	255.7197797705084	20/04/28 05:09:54
3	42	347.4654237711292	255.61023829335187	20/04/28 05:09:54
3	42	347.35716268170125	255.5955173663285	20/04/28 05:09:54
3	42	347.4500498453658	255.41427845871885	20/04/28 05:09:54
3	42	347.40017666720627	255.3971683075408	20/04/28 05:09:54
3	42	347.32044135673397	255.17717972136379	20/04/28 05:09:54
3	42	347.21528002791746	255.36827956709496	20/04/28 05:09:54
3	42	347.21528002791746	255.36827956709496	20/04/28 05:09:54
3	42	347.1223479565976	255.5030091509603	20/04/28 05:09:54
3	42	347.0201361238156	255.57089456669678	20/04/28 05:09:55
3	42	347.06790426406775	255.77211962405292	20/04/28 05:09:55
3	42	347.0031796866069	255.8685191999296	20/04/28 05:09:55
3	42	347.075792716628	256.02015793514533	20/04/28 05:09:55
3	42	347.1072522456658	255.77462746576097	20/04/28 05:09:55
3	42	347.2726585830315	255.77797835638196	20/04/28 05:09:55
3	42	347.3674652675969	255.68311076157164	20/04/28 05:09:55
3	42	347.0836014474356	255.6857199579783	20/04/28 05:09:55
3	42	347.16292937647205	255.7142836624109	20/04/28 05:09:55
3	42	347.23711913604194	255.80849400788634	20/04/28 05:09:56
3	42	347.3910580720214	255.8738248118291	20/04/28 05:09:56
3	42	347.42430847124757	256.09222062172887	20/04/28 05:09:56
3	42	347.21771909999603	255.9762318001743	20/04/28 05:09:56
3	42	347.1276699188344	255.8534794850706	20/04/28 05:09:56
3	42	347.3846984627873	255.77009909709724	20/04/28 05:09:56
3	42	347.3497338352216	255.7856275056072	20/04/28 05:09:56
3	42	347.38166989892017	255.65880136187593	20/04/28 05:09:56
3	42	347.3033096682308	255.6410692715478	20/04/28 05:09:56
3	42	347.2846965830576	255.66843397084605	20/04/28 05:09:56
3	42	347.1270085182486	255.53358068150928	20/04/28 05:09:57
3	42	347.35179658003176	255.56794890798244	20/04/28 05:09:57
3	42	347.31200593434346	255.53136046678048	20/04/28 05:09:57
3	42	347.22822017496617	255.75599976817543	20/04/28 05:09:57
3	42	347.250065911384	255.71638097745432	20/04/28 05:09:57
3	42	347.3280058825364	255.69413324498984	20/04/28 05:09:57
3	42	347.3088826140911	255.72815656000117	20/04/28 05:09:57
3	42	347.2638532653463	255.62741981382163	20/04/28 05:09:57
3	42	347.1195954717426	255.68600256874737	20/04/28 05:09:57
3	42	347.25781484577135	255.6385500546272	20/04/28 05:09:58
3	42	347.2290809832458	255.67508697550778	20/04/28 05:09:58
3	42	347.1673821066949	255.611182304334	20/04/28 05:09:58
3	42	347.0181102123011	255.70181312068271	20/04/28 05:09:58
3	42	347.0204655141942	255.71180175999865	20/04/28 05:09:58
3	42	346.84886874517963	255.7862730658254	20/04/28 05:09:58
3	42	346.95479880973943	255.8491783506971	20/04/28 05:09:58
3	42	347.1834220830571	255.81305977585683	20/04/28 05:09:58
3	42	347.15885598458647	255.7806981383077	20/04/28 05:09:58
3	42	347.1659469319228	255.78210690393223	20/04/28 05:09:58
3	42	347.1074602297838	255.7843385205551	20/04/28 05:09:59
3	42	347.307830019165	255.7285024052685	20/04/28 05:09:59
3	42	347.3282262617605	255.7408548203872	20/04/28 05:09:59
3	42	347.33735077045736	255.7144353456603	20/04/28 05:09:59
3	42	347.3489386173241	255.72255659382284	20/04/28 05:09:59
3	42	347.4833002409521	255.71457568427294	20/04/28 05:09:59
3	42	347.40247535286244	255.46702679739198	20/04/28 05:09:59
3	42	347.50007715075765	255.37521325964522	20/04/28 05:09:59
3	42	347.7712595098033	255.5034901684622	20/04/28 05:09:59
3	42	347.7471509639455	255.52919717820512	20/04/28 05:10:00
3	42	347.56291361908654	255.5089238725252	20/04/28 05:10:00
3	42	347.7667589005874	255.6105168205672	20/04/28 05:10:00
3	42	347.9373094534735	255.8267505046949	20/04/28 05:10:00
3	42	347.92712209651	255.7368922871452	20/04/28 05:10:00
3	42	348.0633603621148	255.76550761782514	20/04/28 05:10:00
3	42	348.3277018202478	255.71972899731261	20/04/28 05:10:00
3	42	348.2226645158466	255.60631394732528	20/04/28 05:10:00
3	42	348.21722693104334	255.61679373186212	20/04/28 05:10:00
3	42	348.4338795329517	255.73739880054563	20/04/28 05:10:00
3	42	348.2858833298446	255.70464920114745	20/04/28 05:10:01
3	42	348.12618942670923	255.82499430518521	20/04/28 05:10:01
3	42	348.12618942670923	255.82499430518521	20/04/28 05:10:01
3	42	348.0281628440246	255.63930563188597	20/04/28 05:10:01
3	42	347.7972530885828	255.81391904318886	20/04/28 05:10:01
3	42	348.0768815174566	255.89214744028664	20/04/28 05:10:01
3	42	348.0768815174566	255.89214744028664	20/04/28 05:10:01
3	42	348.12579062111547	255.7463525228472	20/04/28 05:10:01
3	42	348.08547342533836	255.85926672242337	20/04/28 05:10:01
3	42	347.97030252548706	255.93773520007835	20/04/28 05:10:01
3	42	347.8366519705929	256.02623801825763	20/04/28 05:10:02
3	42	347.91492665856475	255.93980090681833	20/04/28 05:10:02
3	42	347.71807775568266	255.85184439278407	20/04/28 05:10:02
3	42	347.7957039389448	255.833612601652	20/04/28 05:10:02
3	42	347.71254986719447	255.82502307821173	20/04/28 05:10:02
3	42	347.71254986719447	255.82502307821173	20/04/28 05:10:02
3	42	347.65127521178374	255.98067532929483	20/04/28 05:10:02
3	42	347.65127521178374	255.98067532929483	20/04/28 05:10:02
3	42	347.64955290518816	255.98507138926522	20/04/28 05:10:02
3	42	347.775328265444	255.95802989406351	20/04/28 05:10:03
3	42	347.7351280685202	256.0595950716072	20/04/28 05:10:03
3	42	347.7351280685202	256.0595950716072	20/04/28 05:10:03
3	42	348.03411697065906	256.07391322674613	20/04/28 05:10:03
3	42	348.0386813676019	256.1146738348581	20/04/28 05:10:03
3	42	348.0400541268645	256.36058341548255	20/04/28 05:10:03
3	42	348.1956267356311	256.13153536027744	20/04/28 05:10:03
3	42	347.9930453997478	256.21970574260973	20/04/28 05:10:03
3	42	347.9926126857158	255.98478080431408	20/04/28 05:10:03
3	42	348.17667394099334	256.1835770592323	20/04/28 05:10:03
3	42	348.11218265598006	256.37606399674746	20/04/28 05:10:04
3	42	347.99718605000794	256.22986990774524	20/04/28 05:10:04
3	42	348.14085827021995	256.10677085941563	20/04/28 05:10:04
3	42	348.2636151207225	255.9471315396647	20/04/28 05:10:04
3	42	348.32987927666755	255.84079346601408	20/04/28 05:10:04
3	42	348.08783022712976	255.82008332364194	20/04/28 05:10:04
3	42	347.8280379383934	255.82990297982312	20/04/28 05:10:04
3	42	347.8467456119757	255.8969082363175	20/04/28 05:10:04
3	42	347.8406054223671	256.103526480996	20/04/28 05:10:04
3	42	347.84930551023564	256.1069503946875	20/04/28 05:10:05
3	42	347.8301333257164	256.03308080119456	20/04/28 05:10:05
3	42	347.9511520623503	256.0575504133703	20/04/28 05:10:05
3	42	347.78775954744293	256.01154152780447	20/04/28 05:10:05
3	42	347.7978477572394	256.05929836636335	20/04/28 05:10:05
3	42	347.711413369783	256.13919821266734	20/04/28 05:10:05
3	42	347.711413369783	256.13919821266734	20/04/28 05:10:05
3	42	347.711413369783	256.13919821266734	20/04/28 05:10:05
3	42	347.83495707270737	256.28600774258746	20/04/28 05:10:05
3	42	348.0000543690213	256.4821962644562	20/04/28 05:10:05
3	42	348.18818825718165	256.7057596434797	20/04/28 05:10:06
3	42	348.35653159027345	256.9058054977918	20/04/28 05:10:06
3	42	348.45903472716407	257.02761208919253	20/04/28 05:10:06
3	42	348.5697619175198	257.1591914929234	20/04/28 05:10:06
3	42	348.7240896613107	257.3425823334378	20/04/28 05:10:06
3	42	348.86973241304264	257.5156526187855	20/04/28 05:10:06
3	42	349.0000605758831	257.67052426233386	20/04/28 05:10:06
3	42	349.1004704600574	257.7898433983645	20/04/28 05:10:06
3	42	349.27253207799635	257.99430776723943	20/04/28 05:10:06
3	42	349.43705928145096	258.1898188360069	20/04/28 05:10:06
3	42	349.56895662258074	258.3465551664763	20/04/28 05:10:07
3	42	349.6717410655325	258.4686960396707	20/04/28 05:10:07
3	42	349.8454205040348	258.675082898084	20/04/28 05:10:07
3	42	349.8454205040348	258.675082898084	20/04/28 05:10:07
3	42	349.9880042571849	258.84451811233384	20/04/28 05:10:07
3	42	350.13312659036444	259.01696997358357	20/04/28 05:10:07
3	42	350.27895462937306	259.19026043962316	20/04/28 05:10:07
3	42	350.4211858574357	259.35927674104175	20/04/28 05:10:07
3	42	350.6074876388714	259.5806629898624	20/04/28 05:10:07
3	42	350.72592141550336	259.72140028899156	20/04/28 05:10:08
3	42	350.91501383796657	259.9461027140942	20/04/28 05:10:08
3	42	351.0170917794868	260.0674040370679	20/04/28 05:10:08
3	42	351.1903418117131	260.27328062314814	20/04/28 05:10:08
3	42	351.35891048272225	260.47359425115434	20/04/28 05:10:08
3	28	351.43491472824047	260.59260835833334	20/04/28 05:10:08
3	28	351.239503628943	260.6324031072434	20/04/28 05:10:08
3	28	351.07256740652497	260.66639905260683	20/04/28 05:10:08
3	28	350.8563478534903	260.71043136629527	20/04/28 05:10:08
3	28	350.6812966536936	260.7460798968412	20/04/28 05:10:08
3	28	350.389006844879	260.80560363726624	20/04/28 05:10:09
3	28	350.225105152777	260.83898161173437	20/04/28 05:10:09
3	28	349.95083243080586	260.89483623894324	20/04/28 05:10:09
3	28	349.7297233048489	260.93986429610493	20/04/28 05:10:09
3	28	349.52009981881366	260.98255334510173	20/04/28 05:10:09
3	28	349.35193589030916	261.016799308277	20/04/28 05:10:09
3	28	349.07447624311874	261.07330294104054	20/04/28 05:10:09
3	28	348.9172747573116	261.105316443234	20/04/28 05:10:09
3	28	348.9172747573116	261.105316443234	20/04/28 05:10:09
3	28	348.74622678166173	261.1401497319624	20/04/28 05:10:10
3	28	348.5055965841256	261.189153183279	20/04/28 05:10:10
3	28	348.2151251856192	261.24830661115845	20/04/28 05:10:10
3	28	347.7490839587937	261.3432141863676	20/04/28 05:10:10
3	28	347.4673804911142	261.4005820575055	20/04/28 05:10:10
3	28	347.245926335417	261.44568037869993	20/04/28 05:10:10
3	28	347.0021860125612	261.4953171955552	20/04/28 05:10:10
3	28	346.7155157574657	261.55369653461287	20/04/28 05:10:10
3	28	346.5484100672521	261.5877269914672	20/04/28 05:10:10
3	28	346.3063323032562	261.63702523434887	20/04/28 05:10:10
3	28	346.02201532245715	261.6949253377844	20/04/28 05:10:11
3	28	345.772338715983	261.74577105688167	20/04/28 05:10:11
3	28	345.772338715983	261.74577105688167	20/04/28 05:10:11
3	28	345.5773083280159	261.78548827533496	20/04/28 05:10:11
3	28	345.3480679514117	261.8321722316702	20/04/28 05:10:11
3	28	345.0766930027835	261.8874367380364	20/04/28 05:10:11
3	28	344.8537975731912	261.9328285693383	20/04/28 05:10:11
3	28	344.56959596041577	261.9907051785018	20/04/28 05:10:11
3	28	344.388841517854	262.02751515338036	20/04/28 05:10:11
3	28	344.195184277032	262.06695273548723	20/04/28 05:10:12
3	28	344.034745948074	262.09962540883794	20/04/28 05:10:12
3	28	343.8238626412866	262.14257101567966	20/04/28 05:10:12
3	28	343.6462073242005	262.17874986509713	20/04/28 05:10:12
3	28	343.3622183825426	262.2365831645727	20/04/28 05:10:12
3	28	343.12262545724803	262.28537537922693	20/04/28 05:10:12
3	28	342.8610746176343	262.33863924206315	20/04/28 05:10:12
3	28	342.8610746176343	262.33863924206315	20/04/28 05:10:12
3	28	342.6452816860416	262.38258467587	20/04/28 05:10:12
3	28	342.49811661716944	262.41255429880937	20/04/28 05:10:12
3	28	342.21131815693906	262.47095974636943	20/04/28 05:10:13
3	28	341.9715387677342	262.5197899337105	20/04/28 05:10:13
3	28	341.754318057853	262.56402612929446	20/04/28 05:10:13
3	28	341.4789900451321	262.62009566256836	20/04/28 05:10:13
3	28	341.21255901863424	262.6743533574458	20/04/28 05:10:13
3	28	340.9933719266921	262.71898999947655	20/04/28 05:10:13
3	28	340.75273535266075	262.7679947493428	20/04/28 05:10:13
3	28	340.56155833579635	262.80692724299774	20/04/28 05:10:13
3	28	340.3708187695948	262.84577065144026	20/04/28 05:10:13
3	28	340.21455087327877	262.8775940315807	20/04/28 05:10:13
3	28	340.0252393270982	262.9161466290183	20/04/28 05:10:14
3	28	339.78817342676643	262.9644242243686	20/04/28 05:10:14
3	28	339.53751512115304	263.0154698628711	20/04/28 05:10:14
3	28	339.3621855309119	263.0511750866032	20/04/28 05:10:14
3	28	339.21241598074687	263.0816751025421	20/04/28 05:10:14
3	28	338.9835417773368	263.1282844890582	20/04/28 05:10:14
3	28	338.7797490017875	263.1697861353917	20/04/28 05:10:14
3	28	338.5272674169516	263.22120307797627	20/04/28 05:10:14
3	28	338.27617167636794	263.27233779849547	20/04/28 05:10:14
3	28	338.08119087538887	263.3120449187417	20/04/28 05:10:15
3	28	337.85103818411557	263.35891466459105	20/04/28 05:10:15
3	28	337.55966196978864	263.4182523548717	20/04/28 05:10:15
3	28	337.40711153018384	263.4493186886778	20/04/28 05:10:15
3	28	337.25973144515535	263.47933209886355	20/04/28 05:10:15
3	28	337.0774125927788	263.5164606600251	20/04/28 05:10:15
3	28	336.8715350387271	263.5583868638035	20/04/28 05:10:15
3	28	336.7234247623472	263.58854897476203	20/04/28 05:10:15
3	28	336.55247253953803	263.62336276377795	20/04/28 05:10:15
3	28	336.32365316015347	263.6699609855837	20/04/28 05:10:15
3	28	336.0446083570216	263.72678742950234	20/04/28 05:10:16
3	28	335.8627753501521	263.76381705002007	20/04/28 05:10:16
3	28	335.63861877789327	263.8094657083699	20/04/28 05:10:16
3	28	335.4141702211135	263.85517382828937	20/04/28 05:10:16
3	28	335.4141702211135	263.85517382828937	20/04/28 05:10:16
3	28	334.8800552357331	263.9639443730985	20/04/28 05:10:16
3	28	334.7150658469678	263.9975438529763	20/04/28 05:10:16
3	28	334.43550916308567	264.05447453951984	20/04/28 05:10:16
3	28	334.20033970427363	264.1023659315564	20/04/28 05:10:16
3	28	334.0121611243038	264.14068780460804	20/04/28 05:10:17
3	28	333.74169021423535	264.1957682068593	20/04/28 05:10:17
3	28	333.49208129591227	264.24660014151453	20/04/28 05:10:17
3	28	333.49208129591227	264.24660014151453	20/04/28 05:10:17
3	28	333.1338332367649	264.31955603610066	20/04/28 05:10:17
3	28	332.91375894508434	264.36437335308256	20/04/28 05:10:17
3	28	332.91375894508434	264.36437335308256	20/04/28 05:10:17
3	28	332.64242894164596	264.4196287065268	20/04/28 05:10:17
3	28	332.45683532402313	264.45742416154025	20/04/28 05:10:17
3	54	332.40517737471936	264.62067747259846	20/04/28 05:10:17
3	54	332.47416934565615	264.8093835640081	20/04/28 05:10:18
3	54	332.5706411639212	265.0732522360983	20/04/28 05:10:18
3	54	332.6343418881216	265.2474857667628	20/04/28 05:10:18
3	54	332.73681685175944	265.52777417703544	20/04/28 05:10:18
3	54	332.80675084749276	265.71905688446225	20/04/28 05:10:18
3	54	332.9053702968131	265.98879973374636	20/04/28 05:10:18
3	54	332.998793516674	266.2443299125119	20/04/28 05:10:18
3	54	333.10143239384513	266.5250666573047	20/04/28 05:10:18
3	54	333.16896593322167	266.70978366251217	20/04/28 05:10:18
3	54	333.24884158993547	266.9282586933393	20/04/28 05:10:18
3	54	333.30832001726685	267.0909434433543	20/04/28 05:10:19
3	54	333.4029469093516	267.3497658933452	20/04/28 05:10:19
3	54	333.4853035283672	267.5750268253801	20/04/28 05:10:19
3	54	333.5454594192096	267.73956456625046	20/04/28 05:10:19
3	54	333.60424823606894	267.9003631011741	20/04/28 05:10:19
3	54	333.70496241638097	268.1758354359713	20/04/28 05:10:19
3	54	333.78788211649317	268.40263650132096	20/04/28 05:10:19
3	54	333.8577104125112	268.59363010003165	20/04/28 05:10:19
3	54	333.95636077928765	268.8634575144067	20/04/28 05:10:19
3	54	334.02482371968784	269.0507166072245	20/04/28 05:10:20
3	54	334.12254638878375	269.31800659295493	20/04/28 05:10:20
3	54	334.2253478249513	269.5991879673536	20/04/28 05:10:20
3	54	334.2253478249513	269.5991879673536	20/04/28 05:10:20
3	54	334.3174468767227	269.8510962959075	20/04/28 05:10:20
3	54	334.45326076313586	270.22257296654294	20/04/28 05:10:20
3	54	334.45326076313586	270.22257296654294	20/04/28 05:10:20
3	54	334.5219865890224	270.41055110089474	20/04/28 05:10:20
3	54	334.6152474242807	270.6656371270546	20/04/28 05:10:20
3	54	334.69419177107295	270.88156484907455	20/04/28 05:10:20
3	54	334.77965394970255	271.1153200741183	20/04/28 05:10:21
3	54	334.8336262404204	271.2629444989246	20/04/28 05:10:21
3	54	334.9135815981183	271.4816375270199	20/04/28 05:10:21
3	54	334.9135815981183	271.4816375270199	20/04/28 05:10:21
3	54	334.99390905953226	271.7013483291679	20/04/28 05:10:21
3	54	335.0936000954764	271.9740221705752	20/04/28 05:10:21
3	54	335.1875935954904	272.23111217343666	20/04/28 05:10:21
3	54	335.2511544454966	272.4049631217207	20/04/28 05:10:21
3	54	335.3275754066864	272.6139889067807	20/04/28 05:10:21
3	28	335.37496320534274	272.74360350024034	20/04/28 05:10:22
3	28	335.210194739611	272.54095907929525	20/04/28 05:10:22
3	28	335.21504859021695	272.454792987276	20/04/28 05:10:22
3	28	335.23569196023107	272.73488052538164	20/04/28 05:10:22
3	28	335.202281868795	272.68451254679553	20/04/28 05:10:22
3	28	335.0381980917929	272.44602803918866	20/04/28 05:10:22
3	28	335.0028975353668	272.23550886123775	20/04/28 05:10:22
3	28	335.0028975353668	272.23550886123775	20/04/28 05:10:22
3	28	335.1993853008987	272.4314964926083	20/04/28 05:10:22
3	28	335.1642500566918	272.35915435814536	20/04/28 05:10:22
3	28	335.2352963805844	272.3742853026212	20/04/28 05:10:23
3	28	335.071289281895	272.613478806421	20/04/28 05:10:23
3	28	334.88779927968125	272.7161030821646	20/04/28 05:10:23
3	28	334.9635130817416	272.6339389263222	20/04/28 05:10:23
3	28	334.88662676374383	272.5985575708876	20/04/28 05:10:23
3	28	334.9408964906004	272.5937261881116	20/04/28 05:10:23
3	28	334.944497843548	272.62526707392186	20/04/28 05:10:23
3	28	334.9059341713422	272.56011453244054	20/04/28 05:10:23
3	28	335.04326805882823	272.8192332558093	20/04/28 05:10:23
3	28	334.904335563046	272.6966585412314	20/04/28 05:10:23
3	28	334.933487489754	272.8024687604958	20/04/28 05:10:24
3	28	334.94583486446385	272.96353544006166	20/04/28 05:10:24
3	28	335.1538299607548	272.97202316734246	20/04/28 05:10:24
3	28	335.1823232326448	272.78888041040653	20/04/28 05:10:24
3	28	335.11530983506566	272.7432523294922	20/04/28 05:10:24
3	28	335.1134244124027	272.7515644519851	20/04/28 05:10:24
3	28	335.13345686212693	272.7495720675352	20/04/28 05:10:24
3	28	334.9388043938225	272.71098638942726	20/04/28 05:10:24
3	28	334.945373387176	272.9230584420393	20/04/28 05:10:24
3	28	334.7899693411638	272.9456719169435	20/04/28 05:10:25
3	28	334.58449178885917	273.04084648498184	20/04/28 05:10:25
3	28	334.67181911099954	272.85351602538475	20/04/28 05:10:25
3	28	334.68746429685655	272.9278158681001	20/04/28 05:10:25
3	28	334.68744233655343	272.92788855476635	20/04/28 05:10:25
3	28	334.64661032780566	272.8048914718101	20/04/28 05:10:25
3	28	334.752913398143	272.80657734761655	20/04/28 05:10:25
3	28	334.7388122394161	272.9108566968829	20/04/28 05:10:25
3	28	334.45775666614867	272.9311699364349	20/04/28 05:10:25
3	28	334.46250222767674	273.051503537444	20/04/28 05:10:25
3	28	334.45613074535504	273.06165824449903	20/04/28 05:10:26
3	28	334.5386353551964	272.7896688131244	20/04/28 05:10:26
3	28	334.7664716480752	272.7344045853913	20/04/28 05:10:26
3	28	334.6044468628758	272.8767169082632	20/04/28 05:10:26
3	28	334.7490097584002	272.76200013387023	20/04/28 05:10:26
3	28	334.6902717963028	272.8990144036963	20/04/28 05:10:26
3	28	334.51557542391885	272.7413419216625	20/04/28 05:10:26
3	28	334.5446961083477	272.9411933226628	20/04/28 05:10:26
3	28	334.5446961083477	272.9411933226628	20/04/28 05:10:26
3	28	334.5446961083477	272.9411933226628	20/04/28 05:10:27
3	28	334.55341920259843	272.94767877781806	20/04/28 05:10:27
3	28	334.7852432342596	272.83518993349605	20/04/28 05:10:27
3	28	334.55956880160926	273.02690211010645	20/04/28 05:10:27
3	28	334.6737249456925	273.0323473971408	20/04/28 05:10:27
3	28	334.8626693357485	273.0725560345502	20/04/28 05:10:27
3	28	334.864080931092	273.0729934761752	20/04/28 05:10:27
3	28	335.12543336231374	273.0246613245018	20/04/28 05:10:27
3	28	335.12142625386446	273.03055111716725	20/04/28 05:10:27
3	28	335.2008173017778	272.77523008362266	20/04/28 05:10:27
3	28	335.201431126271	272.783771717771	20/04/28 05:10:28
3	28	335.4458744231863	272.7123798285677	20/04/28 05:10:28
3	28	335.4301444155856	272.7453010757108	20/04/28 05:10:28
3	28	335.434566594217	272.6807947462818	20/04/28 05:10:28
3	28	335.5159757277725	272.62552875253186	20/04/28 05:10:28
3	28	335.5214515611416	272.6881638200718	20/04/28 05:10:28
3	28	335.6526730924834	272.6488441925018	20/04/28 05:10:28
3	28	335.65184316627676	272.6546481338199	20/04/28 05:10:28
3	28	335.6704358847757	272.79103753623843	20/04/28 05:10:28
3	28	335.6762854414299	272.76561656197686	20/04/28 05:10:28
3	28	335.6317446707108	272.8006689994459	20/04/28 05:10:29
3	28	335.840904444361	272.93776254361774	20/04/28 05:10:29
3	28	335.9874155226998	273.1569719751082	20/04/28 05:10:29
3	28	335.89616958263395	272.94494274000033	20/04/28 05:10:29
3	28	335.9228492389817	272.93917676716563	20/04/28 05:10:29
3	28	335.910647545075	272.93613693924067	20/04/28 05:10:29
3	28	335.7006068662821	272.78969841624274	20/04/28 05:10:29
3	28	335.57517233280316	272.9730968017316	20/04/28 05:10:29
3	28	335.6023268109174	273.2113349777156	20/04/28 05:10:29
3	28	335.8182138711785	273.24354881021117	20/04/28 05:10:30
3	28	335.76892589570775	273.311267826278	20/04/28 05:10:30
3	28	335.8064436714988	273.2565378062692	20/04/28 05:10:30
3	28	335.6637754356585	273.3539431006682	20/04/28 05:10:30
3	28	335.6162004347539	273.29720570161396	20/04/28 05:10:30
3	28	335.6621496533541	273.4024945314833	20/04/28 05:10:30
3	28	335.74907667276597	273.30891393112495	20/04/28 05:10:30
3	28	335.84127525157527	273.3930212299939	20/04/28 05:10:30
3	28	335.63974658219513	273.53312035311035	20/04/28 05:10:30
3	28	335.5363374228231	273.54360538965267	20/04/28 05:10:30
3	28	335.43697525657143	273.6735977646117	20/04/28 05:10:31
3	28	335.556879187486	273.613802003312	20/04/28 05:10:31
3	28	335.46570379866154	273.49126144333957	20/04/28 05:10:31
3	28	335.28458750492655	273.5662835907259	20/04/28 05:10:31
3	28	335.2046822075932	273.31052278982776	20/04/28 05:10:31
3	28	335.36543027814844	273.23698513314423	20/04/28 05:10:31
3	28	335.3773274415246	273.2865151229851	20/04/28 05:10:31
3	28	335.42029996924043	273.3819913629883	20/04/28 05:10:31
3	28	335.43000409198146	273.62004877329025	20/04/28 05:10:31
3	28	335.3162763596775	273.62486941899647	20/04/28 05:10:32
3	28	335.25562702664627	273.64523215995405	20/04/28 05:10:32
3	28	335.2918737049539	273.562093589495	20/04/28 05:10:32
3	28	335.1760576897054	273.751659001191	20/04/28 05:10:32
3	28	335.28221253659206	273.7735010848352	20/04/28 05:10:32
3	28	335.25675423905295	273.4986428246466	20/04/28 05:10:32
3	28	335.43949632056996	273.61559631487796	20/04/28 05:10:32
3	28	335.58649429419586	273.5440732620306	20/04/28 05:10:32
3	28	335.32980617084496	273.684052844019	20/04/28 05:10:32
3	28	335.3354192933646	273.7303267906942	20/04/28 05:10:32
3	28	335.26444847660053	273.69675162248456	20/04/28 05:10:33
3	28	335.2252571991901	273.94247549172445	20/04/28 05:10:33
3	28	335.0374356969562	273.8476840239508	20/04/28 05:10:33
3	28	335.0123120688377	273.96320876629034	20/04/28 05:10:33
3	28	335.0107324565985	273.9590696699397	20/04/28 05:10:33
3	28	335.1193270129199	273.76652392164	20/04/28 05:10:33
3	28	335.1239072522419	273.70432656691804	20/04/28 05:10:33
3	28	334.944000010756	273.84625682340675	20/04/28 05:10:33
3	28	335.03092218825253	273.97717797505663	20/04/28 05:10:33
3	28	335.0161767485285	274.0312181091603	20/04/28 05:10:33
3	28	334.99548518134344	274.0285069633885	20/04/28 05:10:34
3	28	334.9378690649726	274.1785746474457	20/04/28 05:10:34
3	28	334.7896839933064	274.0736713038086	20/04/28 05:10:34
3	28	334.8092137550646	274.05583861461866	20/04/28 05:10:34
3	28	334.72013842006317	273.794969626698	20/04/28 05:10:34
3	28	334.79170708180357	273.8691863139226	20/04/28 05:10:34
3	28	334.7954239011792	273.84604002458053	20/04/28 05:10:34
3	28	335.0326103697855	273.90201003689054	20/04/28 05:10:34
3	28	335.203583472382	273.8026434383779	20/04/28 05:10:34
3	28	335.1885604530694	273.8091858542036	20/04/28 05:10:35
3	28	335.2676389557108	273.9351369204363	20/04/28 05:10:35
3	28	335.28453662329184	273.8392063037071	20/04/28 05:10:35
3	28	335.14876674728265	273.7146395614225	20/04/28 05:10:35
3	28	334.94197577642296	273.7150371552258	20/04/28 05:10:35
3	28	334.8286062662643	273.6736697936183	20/04/28 05:10:35
3	28	334.8719886484476	273.40732137880275	20/04/28 05:10:35
3	28	334.88142651397027	273.24539509099833	20/04/28 05:10:35
3	28	334.9065211696347	273.21983938743	20/04/28 05:10:35
3	28	334.9021100410149	273.0987882847654	20/04/28 05:10:35
3	28	335.1365115277073	273.0552163011227	20/04/28 05:10:36
3	28	335.1864472260956	272.9418076036818	20/04/28 05:10:36
3	28	335.25434855566425	272.8106384056612	20/04/28 05:10:36
3	28	335.2717660171339	272.8611507738043	20/04/28 05:10:36
3	28	335.44726901898144	272.79297637361464	20/04/28 05:10:36
3	28	335.4802469072911	272.79580696602574	20/04/28 05:10:36
3	28	335.2554588175246	272.7830586375979	20/04/28 05:10:36
3	28	335.1756832343817	272.771250157661	20/04/28 05:10:36
3	28	335.1572913798848	272.7749691961373	20/04/28 05:10:36
3	28	335.1894044081315	272.8379395119274	20/04/28 05:10:36
3	28	335.2053308198004	272.9168094094823	20/04/28 05:10:37
3	28	335.1457351853142	272.84957223808954	20/04/28 05:10:37
3	28	335.19177783645046	272.6675043729503	20/04/28 05:10:37
3	28	335.2019286983976	272.6903208304571	20/04/28 05:10:37
3	28	335.24143904621735	272.69522546634965	20/04/28 05:10:37
3	28	335.32178259058196	272.49938875715367	20/04/28 05:10:37
3	28	335.3037857999907	272.5054016984422	20/04/28 05:10:37
3	28	335.4446768442608	272.6276812217817	20/04/28 05:10:37
3	28	335.39402141613004	272.7741479223076	20/04/28 05:10:37
3	28	335.23716733273875	272.8612476175244	20/04/28 05:10:38
3	28	335.0167171221556	272.8277489003382	20/04/28 05:10:38
3	28	335.02261593617555	272.6016041991515	20/04/28 05:10:38
3	28	335.25338325408825	272.70012640722797	20/04/28 05:10:38
3	28	335.1591932943471	272.456259209788	20/04/28 05:10:38
3	28	335.0253058720168	272.6957961042101	20/04/28 05:10:38
3	28	335.04440189153144	272.6611865875154	20/04/28 05:10:38
3	28	335.12116045840503	272.90065911580734	20/04/28 05:10:38
3	28	335.1783024210161	272.8660613587038	20/04/28 05:10:38
3	28	335.02671040865994	272.85516708153546	20/04/28 05:10:38
3	28	335.0070602200238	272.8928359451889	20/04/28 05:10:39
3	28	335.02067571034684	272.8811350346007	20/04/28 05:10:39
3	28	334.8915258099244	272.88090667970084	20/04/28 05:10:39
3	28	334.9037792360709	272.99993555162547	20/04/28 05:10:39
3	28	334.7792780633831	272.9714201049895	20/04/28 05:10:39
3	28	334.7832145862205	272.96609584329667	20/04/28 05:10:39
3	28	334.6932787039188	272.92782141770505	20/04/28 05:10:39
3	28	334.566309071719	273.0356632445568	20/04/28 05:10:39
3	28	334.7125849726821	272.91913390704343	20/04/28 05:10:39
3	28	334.61105019991567	272.96684400933265	20/04/28 05:10:39
3	28	334.68370414812716	272.7863919204925	20/04/28 05:10:40
3	28	334.65124297369096	272.79717679406394	20/04/28 05:10:40
3	28	334.63171774873774	272.7976355404352	20/04/28 05:10:40
3	28	334.3622557543313	272.7331527517601	20/04/28 05:10:40
3	28	334.16176120740886	272.7292283347983	20/04/28 05:10:40
3	28	334.1624862873607	272.66397272482783	20/04/28 05:10:40
3	28	334.19236525071176	272.61036113336894	20/04/28 05:10:40
3	28	334.07192477554315	272.38485618289303	20/04/28 05:10:40
3	28	334.0645164280203	272.23600671871753	20/04/28 05:10:40
3	28	334.073679799152	272.135960197003	20/04/28 05:10:41
3	28	334.0003275101459	272.080074015987	20/04/28 05:10:41
3	28	333.813306576755	271.987556296668	20/04/28 05:10:41
3	28	333.64969240106075	272.01912350700513	20/04/28 05:10:41
3	28	333.8425142516921	272.1448111969984	20/04/28 05:10:41
3	28	333.96318252358344	272.1705328132632	20/04/28 05:10:41
3	28	333.99227149026547	272.1667613155534	20/04/28 05:10:41
3	28	333.9913124876903	272.10383324776245	20/04/28 05:10:41
3	28	334.0834314257862	272.14872446810483	20/04/28 05:10:41
3	28	334.3311242281118	271.98008488022987	20/04/28 05:10:41
3	28	334.2046146853208	272.22809799893025	20/04/28 05:10:42
3	28	334.2703014320796	272.30425331282646	20/04/28 05:10:42
3	28	334.3574968910246	272.5904318008457	20/04/28 05:10:42
3	28	334.1755904162072	272.71990764839194	20/04/28 05:10:42
3	28	334.14905009142745	272.6898786563354	20/04/28 05:10:42
3	28	333.8872116528551	272.7702820668305	20/04/28 05:10:42
3	28	333.6755110229929	272.90178599785446	20/04/28 05:10:42
3	28	333.6574212227043	273.08849074096463	20/04/28 05:10:42
3	28	333.78641417634935	273.0503336444674	20/04/28 05:10:42
3	28	333.78493178382075	272.96392429676195	20/04/28 05:10:43
3	28	333.5504280973789	272.84063348920415	20/04/28 05:10:43
3	28	333.61523267259554	273.07959677882053	20/04/28 05:10:43
3	28	333.5910628069732	273.18947404086947	20/04/28 05:10:43
3	28	333.57391036790847	273.18793210716336	20/04/28 05:10:43
3	28	333.5634330991841	273.1712618631376	20/04/28 05:10:43
3	28	333.53342002886683	273.2380368441356	20/04/28 05:10:43
3	28	333.6857780693135	273.20727398911333	20/04/28 05:10:43
3	28	333.73454232553405	273.2369628679562	20/04/28 05:10:43
3	28	333.6898242725038	273.3462539938538	20/04/28 05:10:43
3	28	333.74216884599144	273.4100633090346	20/04/28 05:10:44
3	28	333.7896928447967	273.34720517252197	20/04/28 05:10:44
3	28	333.561576269677	273.3246604812215	20/04/28 05:10:44
3	28	333.54854704455744	273.55959908576693	20/04/28 05:10:44
3	28	333.4923003867939	273.68284470271817	20/04/28 05:10:44
3	28	333.3336815840082	273.8296390154251	20/04/28 05:10:44
3	28	333.3111160883186	273.65995242023143	20/04/28 05:10:44
3	28	333.38268553944215	273.55826506352133	20/04/28 05:10:44
3	28	333.35737109899185	273.2909996319667	20/04/28 05:10:44
3	28	333.55502875189705	273.0945248561189	20/04/28 05:10:45
3	28	333.3384837742208	272.92856995674265	20/04/28 05:10:45
3	28	333.4949095189051	272.85073847562774	20/04/28 05:10:45
3	28	333.23324300160687	272.90363468668926	20/04/28 05:10:45
3	28	333.33902306384533	273.0564560738425	20/04/28 05:10:45
3	28	333.5451637907913	273.1455085616907	20/04/28 05:10:45
3	28	333.76827993851805	273.3057094256989	20/04/28 05:10:45
3	28	333.72536789378	273.4303416225086	20/04/28 05:10:45
3	28	333.7130129091746	273.4826550437553	20/04/28 05:10:45
3	28	333.8108387439951	273.4515605967349	20/04/28 05:10:45
3	28	333.8555180356436	273.52812034577806	20/04/28 05:10:46
3	28	333.9176168199358	273.3057493802901	20/04/28 05:10:46
3	28	334.027105805229	273.3520891901249	20/04/28 05:10:46
3	28	334.064429404598	273.36088266177666	20/04/28 05:10:46
3	28	334.0910652640318	273.3405787286519	20/04/28 05:10:46
3	28	333.96896035080624	273.35525806569024	20/04/28 05:10:46
3	28	334.0556132038539	273.58622299452867	20/04/28 05:10:46
3	28	334.0883404938402	273.5198507796794	20/04/28 05:10:46
3	28	334.15975467104374	273.53125383044795	20/04/28 05:10:46
3	28	334.1411437852442	273.54007008899157	20/04/28 05:10:47
3	28	334.0208119406767	273.36938653191174	20/04/28 05:10:47
3	28	333.84590117498607	273.30272544399315	20/04/28 05:10:47
3	28	333.93763055939877	273.23415459070844	20/04/28 05:10:47
3	28	333.8285528778762	273.00505777754233	20/04/28 05:10:47
3	28	334.0374280885666	273.01543094092926	20/04/28 05:10:47
3	28	334.08379477280107	272.8002426642922	20/04/28 05:10:47
3	28	334.11124503818786	272.64758355529653	20/04/28 05:10:47
3	28	334.2403889328055	272.49420803147115	20/04/28 05:10:47
3	28	334.26539288098894	272.60996755116844	20/04/28 05:10:47
3	28	334.2459635275063	272.5827550568882	20/04/28 05:10:48
3	28	334.24749465796884	272.5848664345313	20/04/28 05:10:48
3	28	334.03044117291984	272.39841870256544	20/04/28 05:10:48
3	28	334.0450752804705	272.3937397648894	20/04/28 05:10:48
3	28	333.75599089116076	272.40616899797044	20/04/28 05:10:48
3	28	333.63544772795007	272.4959688484641	20/04/28 05:10:48
3	28	333.61839579547194	272.6304326272518	20/04/28 05:10:48
3	28	333.7483292123086	272.70546669371976	20/04/28 05:10:48
3	28	333.7734478096878	272.9809651255327	20/04/28 05:10:48
3	28	333.54342234433386	272.8649603008393	20/04/28 05:10:48
3	28	333.70896586002533	272.8474204084255	20/04/28 05:10:49
3	28	333.81092671417287	272.8990759302811	20/04/28 05:10:49
3	28	333.7761011418753	272.86395222488824	20/04/28 05:10:49
3	28	333.72590751174937	272.8519153581845	20/04/28 05:10:49
3	28	333.78467338300254	273.0733312448199	20/04/28 05:10:49
3	28	333.83070333952827	273.04405016095643	20/04/28 05:10:49
3	28	333.91265470299135	272.9818606348054	20/04/28 05:10:49
3	28	333.6599160888442	272.8858873572415	20/04/28 05:10:49
3	28	333.56436323088684	272.6436366449947	20/04/28 05:10:49
3	28	333.67541875585033	272.6010405030164	20/04/28 05:10:50
3	28	333.66635813217573	272.7500420487896	20/04/28 05:10:50
3	28	333.4659852152681	272.85034004364525	20/04/28 05:10:50
3	28	333.4640658723032	272.8454119138289	20/04/28 05:10:50
3	28	333.2638256584424	273.061484062093	20/04/28 05:10:50
3	28	333.273178016688	273.1013134111371	20/04/28 05:10:50
3	28	333.2329073955721	272.90230248185	20/04/28 05:10:50
3	28	333.22526127853587	272.9590841730323	20/04/28 05:10:50
3	28	333.3713056362095	273.0151393476509	20/04/28 05:10:50
3	28	333.5810787729515	273.000565581063	20/04/28 05:10:50
3	28	333.66767566818004	272.99289181196474	20/04/28 05:10:51
3	28	333.6641650130275	272.96555992205367	20/04/28 05:10:51
3	28	333.6713858269529	273.1677786690785	20/04/28 05:10:51
3	28	333.6104059429525	273.22641474101437	20/04/28 05:10:51
3	28	333.52015200036277	273.0410309972612	20/04/28 05:10:51
3	28	333.72435280585427	273.23625589388695	20/04/28 05:10:51
3	28	333.7621654373475	273.23796763484677	20/04/28 05:10:51
3	28	333.86358960576234	273.1746727894012	20/04/28 05:10:51
3	28	333.89633242478544	273.04120137629656	20/04/28 05:10:51
3	28	333.7482604293926	272.8321614599863	20/04/28 05:10:52
3	28	333.7482604293926	272.8321614599863	20/04/28 05:10:52
3	28	333.6900590426754	273.0378880819793	20/04/28 05:10:52
3	28	333.6441801050812	272.95647269102835	20/04/28 05:10:52
3	28	333.4634812012533	272.9380130423909	20/04/28 05:10:52
3	28	333.47115389209085	272.86934953697335	20/04/28 05:10:52
3	28	333.6127279737627	272.7313280466499	20/04/28 05:10:52
3	28	333.6833121321972	272.9141964261615	20/04/28 05:10:52
3	28	333.66086211495013	272.9131939044288	20/04/28 05:10:52
3	28	333.6624612672152	272.84823314225815	20/04/28 05:10:52
3	28	333.71631517835806	273.06702028446284	20/04/28 05:10:53
3	28	333.9969988186322	273.1633877649524	20/04/28 05:10:53
3	28	333.8951319146203	272.93840604932177	20/04/28 05:10:53
3	28	333.9066674412634	272.9488250165448	20/04/28 05:10:53
3	28	333.7879271804828	273.03477588884294	20/04/28 05:10:53
3	28	333.83887585480335	272.8277386444133	20/04/28 05:10:53
3	28	333.83887585480335	272.8277386444133	20/04/28 05:10:53
3	28	333.83887585480335	272.8277386444133	20/04/28 05:10:53
3	28	333.8502633271194	272.82793753488437	20/04/28 05:10:53
3	28	333.84256038138057	272.87264134668845	20/04/28 05:10:54
3	28	333.84256038138057	272.87264134668845	20/04/28 05:10:54
3	28	333.6194925873326	272.82706086528185	20/04/28 05:10:54
3	28	333.7144586927709	273.02771246437993	20/04/28 05:10:54
3	28	333.86332788006	273.0686691112533	20/04/28 05:10:54
3	28	333.91259947768435	272.88948250141885	20/04/28 05:10:54
3	28	334.1007769461744	272.88945601048664	20/04/28 05:10:54
3	28	334.1026838222128	273.04357941233974	20/04/28 05:10:54
3	28	334.05340191143625	272.84336265821867	20/04/28 05:10:54
3	28	334.0680124819423	272.8568518278843	20/04/28 05:10:54
3	28	333.88305515053924	272.99519586487946	20/04/28 05:10:55
3	28	333.9282794490224	272.9936101467036	20/04/28 05:10:55
3	28	333.95479012470616	273.0164939934989	20/04/28 05:10:55
3	28	334.0816072497773	272.9388986122733	20/04/28 05:10:55
3	28	334.04679050905924	273.08919151224313	20/04/28 05:10:55
3	28	334.32684789533096	273.1555179807401	20/04/28 05:10:55
3	28	334.3268343624579	273.09959010436467	20/04/28 05:10:55
3	28	334.3392282265075	273.2648272292093	20/04/28 05:10:55
3	28	334.3397107101808	273.31628812382826	20/04/28 05:10:55
3	28	334.42342344724005	273.3946969879574	20/04/28 05:10:55
3	28	334.53900218424906	273.3076061993283	20/04/28 05:10:56
3	28	334.4427291215215	273.4040759407998	20/04/28 05:10:56
3	28	334.5161481973283	273.4656502490195	20/04/28 05:10:56
3	28	334.5598958770699	273.4898038558174	20/04/28 05:10:56
3	28	334.6392614291615	273.2967818874111	20/04/28 05:10:56
3	28	334.64134370868544	273.233945314061	20/04/28 05:10:56
3	28	334.44770044594463	273.35522045597685	20/04/28 05:10:56
3	28	334.42496209352254	273.39370390492195	20/04/28 05:10:56
3	28	334.625635339558	273.17578059732705	20/04/28 05:10:56
3	28	334.5834501710041	273.15212371996915	20/04/28 05:10:57
3	28	334.4903074643136	273.2407293685909	20/04/28 05:10:57
3	28	334.34798514191897	273.03453150420546	20/04/28 05:10:57
3	28	334.1866104451215	272.94220777060065	20/04/28 05:10:57
3	28	334.19019471625654	272.84785391599814	20/04/28 05:10:57
3	28	333.990524087416	272.9480728800911	20/04/28 05:10:57
3	28	333.86648516855416	273.08170651900906	20/04/28 05:10:57
3	28	333.860635204991	273.1086366510112	20/04/28 05:10:57
3	28	333.90113612315037	272.96706171836115	20/04/28 05:10:57
3	28	334.0888469774926	273.0354797125947	20/04/28 05:10:57
3	28	334.1442294670805	273.1466525645011	20/04/28 05:10:58
3	28	334.10013235765626	272.8514626008588	20/04/28 05:10:58
3	28	334.0674491877613	272.9104917633941	20/04/28 05:10:58
3	28	334.15156363554155	272.90525387664474	20/04/28 05:10:58
3	28	334.06267082032963	272.77419998970333	20/04/28 05:10:58
3	28	334.1625553614464	272.9884283893508	20/04/28 05:10:58
3	28	334.0030841410933	272.8178555743635	20/04/28 05:10:58
3	28	334.1231831412211	272.8485432710246	20/04/28 05:10:58
3	28	334.0640881263192	272.8769352676498	20/04/28 05:10:58
3	28	333.9116854167247	272.89119348515317	20/04/28 05:10:59
3	28	333.89624182743444	272.98484086372025	20/04/28 05:10:59
3	28	333.9190643582775	273.067294169973	20/04/28 05:10:59
3	28	333.91380740954685	273.1114447530259	20/04/28 05:10:59
3	28	334.0482049979686	273.11008358783033	20/04/28 05:10:59
3	28	334.06986285748053	272.8268099162041	20/04/28 05:10:59
3	28	334.1780200460116	272.842183712014	20/04/28 05:10:59
3	28	334.19270920531653	272.74158663484377	20/04/28 05:10:59
3	28	334.21429048517587	272.6442971248732	20/04/28 05:10:59
3	28	334.3002035294435	272.5584276413637	20/04/28 05:10:59
3	28	334.2848565255667	272.54916259921225	20/04/28 05:11:00
3	28	334.098206551141	272.75395356919614	20/04/28 05:11:00
3	28	333.85242124543754	272.6054362735822	20/04/28 05:11:00
3	28	333.7272030906045	272.77432199056835	20/04/28 05:11:00
3	28	333.98977748534156	272.8134039327613	20/04/28 05:11:00
3	28	333.9554732599755	272.83157702541024	20/04/28 05:11:00
3	28	333.96500687877784	272.84085302321535	20/04/28 05:11:00
3	28	333.93728615367286	272.8239639862659	20/04/28 05:11:00
3	28	333.80222535615826	272.6317404400581	20/04/28 05:11:00
3	28	333.59433030250136	272.4168096443192	20/04/28 05:11:00
3	28	333.72660479498353	272.2531304399157	20/04/28 05:11:01
3	28	333.61893313926237	272.2895607297974	20/04/28 05:11:01
3	28	333.59750606056116	272.28892880242347	20/04/28 05:11:01
3	28	333.76884957409	272.45953622674034	20/04/28 05:11:01
3	28	333.8436306003175	272.4431920212549	20/04/28 05:11:01
3	28	333.7858704697465	272.17875985468606	20/04/28 05:11:01
3	28	333.7081998025828	272.2789340849268	20/04/28 05:11:01
3	28	333.7088841101657	272.28500918925175	20/04/28 05:11:01
3	28	333.7168535954295	272.28645642724246	20/04/28 05:11:01
3	28	333.62814706173606	272.5140749649243	20/04/28 05:11:02
3	28	333.6025366553386	272.53908539482717	20/04/28 05:11:02
3	28	333.6551711285329	272.65045475264264	20/04/28 05:11:02
3	28	333.7333574826798	272.9111478780688	20/04/28 05:11:02
3	28	333.44727069394855	272.83308742432115	20/04/28 05:11:02
3	28	333.4285873060782	272.7831965152772	20/04/28 05:11:02
3	28	333.33471285117963	272.9872891069783	20/04/28 05:11:02
3	28	333.3829929710498	272.96047218606697	20/04/28 05:11:02
3	28	333.36989551637294	272.9603827351989	20/04/28 05:11:02
3	28	333.52518426286537	272.7999674239834	20/04/28 05:11:02
3	28	333.47111531465464	272.68005097887925	20/04/28 05:11:03
3	28	333.31328816464367	272.55881471699945	20/04/28 05:11:03
3	28	333.1470421821754	272.7446128555803	20/04/28 05:11:03
3	28	333.1554128968902	272.707491552462	20/04/28 05:11:03
3	28	332.9187457080809	272.7111844011897	20/04/28 05:11:03
3	28	332.8439522654246	272.7658344135551	20/04/28 05:11:03
3	28	332.8381390043209	272.710914577866	20/04/28 05:11:03
3	28	332.9305383918343	272.71377954418074	20/04/28 05:11:03
3	28	332.92553338622696	272.7966133788356	20/04/28 05:11:03
3	28	332.9442905751149	273.02561144732397	20/04/28 05:11:04
3	28	332.9926819228563	272.97734667050923	20/04/28 05:11:04
3	28	332.93873003264457	273.022894526331	20/04/28 05:11:04
3	28	332.9830732450267	272.91832773587333	20/04/28 05:11:04
3	28	332.8084883215935	272.70832541067153	20/04/28 05:11:04
3	28	332.9004661233399	272.73954988416466	20/04/28 05:11:04
3	28	332.79979024394254	272.8163632133317	20/04/28 05:11:04
3	28	332.97272787833026	272.9708674801144	20/04/28 05:11:04
3	28	333.0142260078623	273.0048239431368	20/04/28 05:11:04
3	28	332.9982766147939	273.02836231378933	20/04/28 05:11:04
3	28	332.946158249036	273.01234877637967	20/04/28 05:11:05
3	28	333.03004095622384	272.9429649684333	20/04/28 05:11:05
3	28	333.03011740830306	272.9428191508411	20/04/28 05:11:05
3	28	332.9571409362756	272.9515644106083	20/04/28 05:11:05
3	28	333.1217165484862	272.9132271416584	20/04/28 05:11:05
3	28	333.0750032888163	272.88620954367235	20/04/28 05:11:05
3	28	333.0781675064674	272.88460123759444	20/04/28 05:11:05
3	28	333.12582926196137	272.9584142099401	20/04/28 05:11:05
3	28	332.98024609880474	273.09691512861525	20/04/28 05:11:05
3	28	333.26094287761475	273.0696368203379	20/04/28 05:11:05
3	28	333.1989275696065	272.84859531731774	20/04/28 05:11:06
3	28	333.34802568182005	272.8157444339345	20/04/28 05:11:06
3	28	333.1315916089957	272.8104517696942	20/04/28 05:11:06
3	28	333.1783375455043	272.65360349237454	20/04/28 05:11:06
3	28	333.2006362440259	272.50984457783335	20/04/28 05:11:06
3	28	333.26196181237634	272.23385922618763	20/04/28 05:11:06
3	28	333.1861689965576	272.0682311411955	20/04/28 05:11:06
3	28	333.1885976580809	272.0781821846025	20/04/28 05:11:06
3	28	333.4586083371355	272.0691999094068	20/04/28 05:11:06
3	28	333.392708017158	272.1267911785786	20/04/28 05:11:07
3	28	333.5971176980889	271.9167657652483	20/04/28 05:11:07
3	28	333.74794976434316	271.9283737242054	20/04/28 05:11:07
3	28	333.6371025413432	272.03319100012305	20/04/28 05:11:07
3	28	333.6571805590619	271.9274115846677	20/04/28 05:11:07
3	28	333.71571660349986	271.72467977285083	20/04/28 05:11:07
3	28	333.7450069279871	271.79023104905826	20/04/28 05:11:07
3	28	333.5126173562564	271.8584251580843	20/04/28 05:11:07
3	28	333.4126455976184	271.8942000514929	20/04/28 05:11:07
3	28	333.46244975726177	271.9068112239814	20/04/28 05:11:07
3	28	333.40204313812285	271.90537381824953	20/04/28 05:11:08
3	28	333.34717854815347	271.64568861033854	20/04/28 05:11:08
3	28	333.2336852144162	271.4701484614927	20/04/28 05:11:08
3	28	333.08109527913723	271.59118374946064	20/04/28 05:11:08
3	28	332.9068144691359	271.6594678042311	20/04/28 05:11:08
3	28	332.90243805039034	271.6572695800004	20/04/28 05:11:08
3	28	332.94056738622567	271.47307671114606	20/04/28 05:11:08
3	28	332.83870097923034	271.2095358646974	20/04/28 05:11:08
3	28	332.72452730175684	270.9913332163355	20/04/28 05:11:08
3	28	332.6344483188366	270.9685745114587	20/04/28 05:11:08
3	28	332.6574638635215	270.9460579858822	20/04/28 05:11:09
3	28	332.61671226602846	270.92963835794717	20/04/28 05:11:09
3	28	332.7034685573681	271.1639391281187	20/04/28 05:11:09
3	28	332.68059096714205	271.1901861871238	20/04/28 05:11:09
3	28	332.4391507287545	271.2279697655108	20/04/28 05:11:09
3	28	332.44132368041	271.20535290413613	20/04/28 05:11:09
3	28	332.27548744623954	271.3938061961308	20/04/28 05:11:09
3	28	332.3077203313477	271.45399383022607	20/04/28 05:11:09
3	28	332.48022088160343	271.6829365405238	20/04/28 05:11:09
3	28	332.29012723038807	271.7814146078882	20/04/28 05:11:10
3	28	332.2628184608505	271.75624835740416	20/04/28 05:11:10
3	28	332.1382502227187	271.4890605436392	20/04/28 05:11:10
3	28	332.1364401149355	271.59950591167035	20/04/28 05:11:10
3	28	332.12603241739913	271.5910289562378	20/04/28 05:11:10
3	28	332.01854766875124	271.4469593550352	20/04/28 05:11:10
3	28	332.01854766875124	271.4469593550352	20/04/28 05:11:10
3	28	332.0260375295508	271.4478310092226	20/04/28 05:11:10
3	28	331.9390636310345	271.44950821577316	20/04/28 05:11:10
3	28	332.00900519039845	271.57349948565763	20/04/28 05:11:10
3	28	332.1621396098298	271.6807446674736	20/04/28 05:11:11
3	28	332.4018694845435	271.6654547172081	20/04/28 05:11:11
3	28	332.22928019835905	271.66079825378745	20/04/28 05:11:11
3	28	332.30456269575103	271.6976758271018	20/04/28 05:11:11
3	28	332.30418398967714	271.87469600366376	20/04/28 05:11:11
3	28	332.1938036691242	271.9614950796011	20/04/28 05:11:11
3	28	332.1867690204044	271.77573975967704	20/04/28 05:11:11
3	28	332.1966083673856	271.8676675745769	20/04/28 05:11:11
3	28	332.0771909088906	271.66300181717634	20/04/28 05:11:11
3	28	332.3137040741041	271.7460212354823	20/04/28 05:11:11
3	28	332.06175561083603	271.8286327566184	20/04/28 05:11:12
3	28	332.05738026075505	271.8114805944524	20/04/28 05:11:12
3	28	332.0207424662558	271.8373867953878	20/04/28 05:11:12
3	28	332.18881574672963	271.84974950809647	20/04/28 05:11:12
3	28	332.2815504732894	272.0132695334358	20/04/28 05:11:12
3	28	332.39958224735585	272.17139221108977	20/04/28 05:11:12
3	28	332.40877174292035	272.17404452971385	20/04/28 05:11:12
3	28	332.39430312721817	271.90876311406925	20/04/28 05:11:12
3	28	332.1899437243274	271.8967633762479	20/04/28 05:11:12
3	28	332.1918986329452	272.17014401085055	20/04/28 05:11:13
3	28	332.16860257980534	272.1768702624585	20/04/28 05:11:13
3	28	332.4048465371268	272.06970659817046	20/04/28 05:11:13
3	28	332.43330991023055	272.1366471377418	20/04/28 05:11:13
3	28	332.43089133522085	272.2221155169197	20/04/28 05:11:13
3	28	332.40698010020526	271.949043227428	20/04/28 05:11:13
3	28	332.433262793554	272.2082139276364	20/04/28 05:11:13
3	28	332.39014696573184	272.14143791153947	20/04/28 05:11:13
3	28	332.4384968843756	272.0954458031533	20/04/28 05:11:13
3	28	332.35372746947746	272.1106012321447	20/04/28 05:11:13
3	28	332.12471231790875	271.9292506033801	20/04/28 05:11:14
3	28	332.1908664321824	271.9575904630139	20/04/28 05:11:14
3	28	332.4266336022179	271.83725302473846	20/04/28 05:11:14
3	28	332.3763008607938	271.83176108545865	20/04/28 05:11:14
3	28	332.3753779228027	271.8351153808142	20/04/28 05:11:14
3	28	332.40865630200994	271.8376695553051	20/04/28 05:11:14
3	28	332.6355485635675	271.8144773357524	20/04/28 05:11:14
3	28	332.63141209343956	271.8502483362211	20/04/28 05:11:14
3	28	332.5152255070321	271.73665820612564	20/04/28 05:11:14
3	28	332.4416461273732	271.5490727315017	20/04/28 05:11:15
3	28	332.7195660456141	271.53175764373805	20/04/28 05:11:15
3	28	332.9425433754899	271.67509544882967	20/04/28 05:11:15
3	28	332.86469667007844	271.5819701423657	20/04/28 05:11:15
3	28	332.92154265377195	271.5921883950956	20/04/28 05:11:15
3	28	332.8385876432214	271.80986661525753	20/04/28 05:11:15
3	28	332.75143816278506	272.04952196112913	20/04/28 05:11:15
3	28	332.6962588678638	272.0147365097561	20/04/28 05:11:15
3	28	332.5825061655782	272.17255606570484	20/04/28 05:11:15
3	28	332.5098234671701	272.22651656834347	20/04/28 05:11:15
3	28	332.61953372673173	272.17326187130055	20/04/28 05:11:16
3	28	332.6834822348157	272.02901512117154	20/04/28 05:11:16
3	28	332.6925156150788	272.08325021253603	20/04/28 05:11:16
3	28	332.67567212382875	272.30404657788523	20/04/28 05:11:16
3	28	332.60931236455116	272.531728935406	20/04/28 05:11:16
3	28	332.61248218179145	272.5283827959028	20/04/28 05:11:16
3	28	332.59784989815336	272.4554808963179	20/04/28 05:11:16
3	28	332.66968088599646	272.65603044546293	20/04/28 05:11:16
3	28	332.55712185461175	272.6788738436207	20/04/28 05:11:16
3	28	332.7657457153019	272.571663824775	20/04/28 05:11:17
3	28	332.7860700411719	272.54714515510284	20/04/28 05:11:17
3	28	332.8420025223036	272.4715673324095	20/04/28 05:11:17
3	28	332.7947136981551	272.23279067760194	20/04/28 05:11:17
3	28	332.7259804780698	272.2154096799049	20/04/28 05:11:17
3	28	332.5984703057464	272.4755872504904	20/04/28 05:11:17
3	28	332.7169311105878	272.5496522959635	20/04/28 05:11:17
3	28	332.51236719089985	272.61117063342056	20/04/28 05:11:17
3	28	332.51146364872113	272.6805547979367	20/04/28 05:11:17
3	28	332.5903778006896	272.6861545679704	20/04/28 05:11:17
3	28	332.5741744514949	272.69103276387557	20/04/28 05:11:18
3	28	332.53381353382	272.61242257928916	20/04/28 05:11:18
3	28	332.64581222752867	272.8698303400526	20/04/28 05:11:18
3	28	332.6264659741542	273.00740010405207	20/04/28 05:11:18
3	28	332.6931438951031	272.88694018575626	20/04/28 05:11:18
3	28	332.9051460282299	272.946041091947	20/04/28 05:11:18
3	28	332.9197456760978	273.1416153138337	20/04/28 05:11:18
3	28	332.8866686476101	273.1309995869394	20/04/28 05:11:18
3	28	332.9558057693218	273.11342487497717	20/04/28 05:11:18
3	28	333.1061362934488	273.31071582191214	20/04/28 05:11:18
3	28	333.2414245094964	273.5488441207794	20/04/28 05:11:19
3	28	333.23643407971633	273.549237282754	20/04/28 05:11:19
3	28	333.34400926824617	273.74925806518013	20/04/28 05:11:19
3	28	333.17319806814976	273.5426752851296	20/04/28 05:11:19
3	28	333.3013989111843	273.4845157171508	20/04/28 05:11:19
3	28	333.12459305960635	273.26938799318697	20/04/28 05:11:19
3	28	333.1595089807262	273.3026823399863	20/04/28 05:11:19
3	28	333.0889796432383	273.2479276437336	20/04/28 05:11:19
3	28	333.09714148574153	273.2201430447432	20/04/28 05:11:19
3	28	332.8588343886486	273.0419269172861	20/04/28 05:11:20
3	28	332.840844921226	272.9287118638209	20/04/28 05:11:20
3	28	332.69607627213287	272.762721360264	20/04/28 05:11:20
3	28	332.6929386951601	272.66315744056556	20/04/28 05:11:20
3	28	332.93816736001156	272.64462406856876	20/04/28 05:11:20
3	28	332.9990374938935	272.63390272872067	20/04/28 05:11:20
3	28	333.1448003332798	272.55417341984247	20/04/28 05:11:20
3	28	333.17770491937625	272.56842342224564	20/04/28 05:11:20
3	28	333.04144239478535	272.3592018727051	20/04/28 05:11:20
3	28	333.2758392496181	272.53747232588364	20/04/28 05:11:20
3	28	333.1689964914842	272.4901222133182	20/04/28 05:11:21
3	28	333.1085447213719	272.50099862258355	20/04/28 05:11:21
3	28	333.26668486464064	272.4441549020677	20/04/28 05:11:21
3	28	333.1082157026483	272.26948212607414	20/04/28 05:11:21
3	28	333.0809239284295	272.3026479138966	20/04/28 05:11:21
3	28	333.30524758696293	272.49346441125596	20/04/28 05:11:21
3	28	333.52055397037424	272.44968080894535	20/04/28 05:11:21
3	28	333.5101313264542	272.3671252529879	20/04/28 05:11:21
3	28	333.3900836583565	272.48830183598585	20/04/28 05:11:21
3	28	333.3802363522645	272.50246384104656	20/04/28 05:11:22
3	28	333.23523614982116	272.6927946117237	20/04/28 05:11:22
3	28	333.2813766909299	272.6824579861607	20/04/28 05:11:22
3	28	333.2806612847681	272.65778688554764	20/04/28 05:11:22
3	28	333.28965117383274	272.7110394865941	20/04/28 05:11:22
3	28	333.32077927011323	272.704854426091	20/04/28 05:11:22
3	28	333.4226622096327	272.7899670816958	20/04/28 05:11:22
3	28	333.51851276058966	272.8529915672155	20/04/28 05:11:22
3	28	333.38387505779946	272.91461322923124	20/04/28 05:11:22
3	28	333.4087712176094	272.93308061378264	20/04/28 05:11:22
3	28	333.59615507862793	272.7205943207405	20/04/28 05:11:23
3	28	333.5289893758966	272.63995445009954	20/04/28 05:11:23
3	28	333.5776396626509	272.65633635559163	20/04/28 05:11:23
3	28	333.4193193097524	272.6602302969925	20/04/28 05:11:23
3	28	333.6692805271458	272.6792317327444	20/04/28 05:11:23
3	28	333.59422462514647	272.7525475597805	20/04/28 05:11:23
3	28	333.6340122090174	272.9206157830929	20/04/28 05:11:23
3	28	333.7173569788644	272.94637562613576	20/04/28 05:11:23
3	28	333.59647186800566	273.12650459788955	20/04/28 05:11:23
3	28	333.58509401137223	273.4173108325005	20/04/28 05:11:23
3	28	333.5993806508963	273.38442803211547	20/04/28 05:11:24
3	28	333.59379465957363	273.4181765565637	20/04/28 05:11:24
3	28	333.59379465957363	273.4181765565637	20/04/28 05:11:24
