floorId	partitionId	location_x	location_y	timeStamp
3	17	362.3945272480641	251.57317905073432	20/04/28 05:14:46
3	17	362.3945272480641	251.57317905073432	20/04/28 05:14:47
3	17	362.3945272480641	251.57317905073432	20/04/28 05:14:48
3	17	363.0633788732786	253.76883669815365	20/04/28 05:14:49
3	34	361.2642468288334	255.55936173685845	20/04/28 05:14:50
3	34	361.2642468288334	255.55936173685845	20/04/28 05:14:51
3	34	362.2167196060361	259.70189758364177	20/04/28 05:14:52
3	34	362.2167196060361	259.70189758364177	20/04/28 05:14:53
3	54	358.23287936641947	263.0061707425011	20/04/28 05:14:54
3	54	356.6246500946648	261.03418528583234	20/04/28 05:14:55
3	54	354.234919707304	261.84276408583725	20/04/28 05:14:56
3	42	351.2362894892158	259.98472696547645	20/04/28 05:14:57
3	54	350.37914153837863	260.97432627346046	20/04/28 05:14:58
3	54	350.37914153837863	260.97432627346046	20/04/28 05:14:59
3	42	347.94554835318087	258.6717142733518	20/04/28 05:15:00
3	42	346.32423194001075	259.3686329834299	20/04/28 05:15:01
3	99	339.59375125487367	258.8166372045796	20/04/28 05:15:02
3	99	339.59375125487367	258.8166372045796	20/04/28 05:15:03
3	54	334.4407240787428	261.4032786809491	20/04/28 05:15:04
3	54	334.4407240787428	261.4032786809491	20/04/28 05:15:05
3	54	334.4407240787428	261.4032786809491	20/04/28 05:15:06
3	54	334.4407240787428	261.4032786809491	20/04/28 05:15:07
3	25	331.1647001544473	259.0572050353964	20/04/28 05:15:08
3	99	334.49013108893786	257.17835859344024	20/04/28 05:15:09
3	25	331.1647001544473	259.0572050353964	20/04/28 05:15:10
3	25	330.99787587585735	256.71297684363395	20/04/28 05:15:11
3	25	331.1647001544473	259.0572050353964	20/04/28 05:15:12
3	25	330.9896871367029	255.56420365298158	20/04/28 05:15:13
3	99	332.23758638197745	255.93954433646732	20/04/28 05:15:14
3	25	331.1647001544473	259.0572050353964	20/04/28 05:15:15
3	25	330.99787587585735	256.71297684363395	20/04/28 05:15:16
3	99	334.49013108893786	257.17835859344024	20/04/28 05:15:17
3	99	334.49013108893786	257.17835859344024	20/04/28 05:15:18
3	25	331.1647001544473	259.0572050353964	20/04/28 05:15:19
3	99	334.49013108893786	257.17835859344024	20/04/28 05:15:20
3	25	331.1647001544473	259.0572050353964	20/04/28 05:15:21
3	25	331.1647001544473	259.0572050353964	20/04/28 05:15:22
3	99	334.49013108893786	257.17835859344024	20/04/28 05:15:23
3	99	334.49013108893786	257.17835859344024	20/04/28 05:15:24
3	25	331.1647001544473	259.0572050353964	20/04/28 05:15:25
3	99	334.49013108893786	257.17835859344024	20/04/28 05:15:26
3	99	334.49013108893786	257.17835859344024	20/04/28 05:15:27
3	99	334.49013108893786	257.17835859344024	20/04/28 05:15:28
3	99	334.49013108893786	257.17835859344024	20/04/28 05:15:29
3	99	334.49013108893786	257.17835859344024	20/04/28 05:15:30
3	99	334.49013108893786	257.17835859344024	20/04/28 05:15:31
3	99	332.23758638197745	255.93954433646732	20/04/28 05:15:32
3	99	334.49013108893786	257.17835859344024	20/04/28 05:15:33
3	25	331.1647001544473	259.0572050353964	20/04/28 05:15:34
3	73	330.69506327800235	252.38655177918363	20/04/28 05:15:35
3	99	332.23758638197745	255.93954433646732	20/04/28 05:15:36
3	25	330.99787587585735	256.71297684363395	20/04/28 05:15:37
3	25	330.99787587585735	256.71297684363395	20/04/28 05:15:38
3	25	330.99787587585735	256.71297684363395	20/04/28 05:15:39
3	73	329.18371733020103	252.66974251895917	20/04/28 05:15:40
3	25	328.11083110267094	255.78740321788823	20/04/28 05:15:41
3	25	328.11083110267094	255.78740321788823	20/04/28 05:15:42
3	25	331.1647001544473	259.0572050353964	20/04/28 05:15:43
3	25	330.99787587585735	256.71297684363395	20/04/28 05:15:44
3	25	331.1647001544473	259.0572050353964	20/04/28 05:15:45
3	25	331.1647001544473	259.0572050353964	20/04/28 05:15:46
3	25	331.1647001544473	259.0572050353964	20/04/28 05:15:47
3	25	331.1647001544473	259.0572050353964	20/04/28 05:15:48
3	25	327.25467987903363	260.112943188232	20/04/28 05:15:49
3	54	327.3540763805351	261.1072377077433	20/04/28 05:15:50
3	25	328.11083110267094	255.78740321788823	20/04/28 05:15:51
3	25	327.25467987903363	260.11294318823207	20/04/28 05:15:52
3	25	327.25467987903363	260.11294318823207	20/04/28 05:15:53
3	25	331.1647001544473	259.0572050353964	20/04/28 05:15:54
3	25	331.1647001544473	259.0572050353964	20/04/28 05:15:55
3	25	331.1647001544473	259.0572050353964	20/04/28 05:15:56
3	25	331.1647001544473	259.0572050353964	20/04/28 05:15:57
3	25	331.1647001544473	259.0572050353964	20/04/28 05:15:58
3	25	331.1647001544473	259.0572050353964	20/04/28 05:15:59
3	25	331.1647001544473	259.0572050353964	20/04/28 05:16:00
3	25	331.1647001544473	259.0572050353964	20/04/28 05:16:01
3	25	331.1647001544473	259.0572050353964	20/04/28 05:16:02
3	25	330.99787587585735	256.71297684363395	20/04/28 05:16:03
3	99	332.23758638197745	255.93954433646732	20/04/28 05:16:04
3	25	328.11083110267094	255.78740321788817	20/04/28 05:16:05
3	25	331.1647001544473	259.0572050353964	20/04/28 05:16:06
3	25	331.1647001544473	259.0572050353964	20/04/28 05:16:07
3	54	334.4407240787428	261.4032786809491	20/04/28 05:16:08
3	54	334.4407240787428	261.4032786809491	20/04/28 05:16:09
3	54	334.4407240787428	261.4032786809491	20/04/28 05:16:10
3	NULL	337.70753542622793	260.4595329480968	20/04/28 05:16:11
3	99	338.72849302958224	257.33962041953436	20/04/28 05:16:12
3	42	340.39847756944295	257.5774165717636	20/04/28 05:16:13
3	42	343.19179870246967	259.9647561276533	20/04/28 05:16:14
3	54	347.6038246023418	261.16234003976894	20/04/28 05:16:15
3	54	350.37914153837863	260.97432627346046	20/04/28 05:16:16
3	54	350.37914153837863	260.97432627346046	20/04/28 05:16:17
3	42	351.2362894892158	259.98472696547645	20/04/28 05:16:18
3	54	354.93110780732565	263.85962413987545	20/04/28 05:16:19
3	54	358.23287936641947	263.00617074250107	20/04/28 05:16:20
3	54	359.56855835216805	263.2279362811352	20/04/28 05:16:21
3	54	359.5685583521681	263.2279362811352	20/04/28 05:16:22
3	34	362.2167196060361	259.70189758364177	20/04/28 05:16:23
3	57	365.8336784609425	258.9548948604074	20/04/28 05:16:24
3	54	368.9169651830857	261.65782172430613	20/04/28 05:16:25
3	54	372.48785670166836	262.3595943162643	20/04/28 05:16:26
3	54	372.48785670166836	262.3595943162643	20/04/28 05:16:27
3	54	372.48785670166836	262.3595943162643	20/04/28 05:16:28
3	57	374.26377240687094	258.097817872792	20/04/28 05:16:29
3	15	379.8755906118027	262.6421307240284	20/04/28 05:16:30
3	15	380.97239583354167	266.94453563659977	20/04/28 05:16:31
3	15	380.97239583354167	266.94453563659977	20/04/28 05:16:32
1	33	381.6109766893215	266.73786054806715	20/04/28 05:16:33
1	33	379.51825801393375	263.17204603967434	20/04/28 05:16:34
1	69	376.18075636557654	261.96517202151136	20/04/28 05:16:35
1	69	372.48785670166836	262.3595943162643	20/04/28 05:16:36
1	69	372.48785670166836	262.3595943162643	20/04/28 05:16:37
1	69	372.48785670166836	262.3595943162643	20/04/28 05:16:38
1	69	368.9169651830857	261.65782172430613	20/04/28 05:16:39
1	69	367.80245440868674	262.5455232582413	20/04/28 05:16:40
3	34	362.2167196060361	259.70189758364177	20/04/28 05:16:41
3	54	362.3135202758802	260.86679869831846	20/04/28 05:16:42
1	64	358.87237025214637	261.21107622709695	20/04/28 05:16:43
1	64	354.49328963180795	262.3471616487957	20/04/28 05:16:44
1	64	354.49328963180795	262.3471616487957	20/04/28 05:16:45
1	41	352.7251685521831	260.56227788261185	20/04/28 05:16:46
1	41	351.1038521390131	261.25919659269	20/04/28 05:16:47
1	41	351.1038521390131	261.25919659268993	20/04/28 05:16:48
1	22	346.48253983850464	261.2777688197779	20/04/28 05:16:49
1	22	343.1917987024697	259.9647561276533	20/04/28 05:16:50
1	22	343.1917987024697	259.9647561276533	20/04/28 05:16:51
1	69	340.1854692097293	258.18142547541174	20/04/28 05:16:52
1	69	338.1583683683643	258.3517387010974	20/04/28 05:16:53
1	69	338.1583683683643	258.3517387010974	20/04/28 05:16:54
1	5	334.954212400308	260.21600824778375	20/04/28 05:16:55
3	54	333.7145018941879	260.9894407549504	20/04/28 05:16:56
3	54	329.2127636639186	262.6803906369539	20/04/28 05:16:57
1	37	326.9602189569582	261.44157637998103	20/04/28 05:16:58
1	37	324.68376661124154	261.38954335341236	20/04/28 05:16:59
1	37	323.9780902572864	261.641853061257	20/04/28 05:17:00
1	72	321.10779110724695	264.3050039939337	20/04/28 05:17:01
1	72	319.38681167013016	260.8850686419972	20/04/28 05:17:02
1	81	317.4633882763735	263.93806291016494	20/04/28 05:17:03
1	81	317.4633882763735	263.93806291016494	20/04/28 05:17:04
1	81	316.8584991431141	264.5437756453438	20/04/28 05:17:05
1	81	316.8584991431141	264.5437756453438	20/04/28 05:17:06
1	56	319.89662212153377	266.1573209564685	20/04/28 05:17:07
1	56	319.89662212153377	266.1573209564685	20/04/28 05:17:08
1	56	319.89662212153377	266.1573209564685	20/04/28 05:17:09
1	56	319.89662212153377	266.1573209564685	20/04/28 05:17:10
1	56	322.1133542424002	268.2357308438957	20/04/28 05:17:11
1	56	322.1133542424002	268.2357308438957	20/04/28 05:17:12
1	56	322.1133542424002	268.2357308438957	20/04/28 05:17:13
1	101	322.533707924491	270.7462440268079	20/04/28 05:17:14
1	101	322.533707924491	270.74624402680786	20/04/28 05:17:15
1	101	323.1385970577505	270.14053129162903	20/04/28 05:17:16
1	56	322.1133542424002	268.2357308438957	20/04/28 05:17:17
1	101	323.1385970577505	270.14053129162903	20/04/28 05:17:18
1	NULL	331.9249996219656	268.73042370731713	20/04/28 05:17:19
1	NULL	331.9249996219656	268.73042370731713	20/04/28 05:17:20
1	NULL	331.9249996219656	268.73042370731713	20/04/28 05:17:21
1	56	333.50170633168455	266.97796434330365	20/04/28 05:17:22
1	NULL	331.9249996219656	268.73042370731713	20/04/28 05:17:23
1	29	332.3707929514742	270.8583422158162	20/04/28 05:17:24
1	29	332.11202638116566	272.3894277766605	20/04/28 05:17:25
1	29	332.11202638116566	272.3894277766605	20/04/28 05:17:26
1	29	333.41684249911117	274.9598401222384	20/04/28 05:17:27
1	29	333.41684249911117	274.9598401222384	20/04/28 05:17:28
1	29	332.11202638116566	272.3894277766605	20/04/28 05:17:29
1	29	333.41684249911117	274.9598401222384	20/04/28 05:17:30
1	29	332.11202638116566	272.3894277766605	20/04/28 05:17:31
1	29	333.41684249911117	274.9598401222384	20/04/28 05:17:32
1	29	333.41684249911117	274.9598401222384	20/04/28 05:17:33
1	29	333.41684249911117	274.9598401222384	20/04/28 05:17:34
1	29	333.41684249911117	274.9598401222384	20/04/28 05:17:35
1	29	333.41684249911117	274.9598401222384	20/04/28 05:17:36
1	29	333.41684249911117	274.9598401222384	20/04/28 05:17:37
1	29	333.41684249911117	274.9598401222384	20/04/28 05:17:38
1	29	333.41684249911117	274.9598401222384	20/04/28 05:17:39
1	29	333.41684249911117	274.9598401222384	20/04/28 05:17:40
1	29	333.41684249911117	274.9598401222384	20/04/28 05:17:41
1	29	333.41684249911117	274.9598401222384	20/04/28 05:17:42
1	29	333.41684249911117	274.9598401222384	20/04/28 05:17:43
1	29	333.41684249911117	274.9598401222384	20/04/28 05:17:44
1	29	333.41684249911117	274.9598401222384	20/04/28 05:17:45
1	29	333.41684249911117	274.9598401222384	20/04/28 05:17:46
1	29	333.41684249911117	274.9598401222384	20/04/28 05:17:47
1	29	333.41684249911117	274.9598401222384	20/04/28 05:17:48
1	29	333.41684249911117	274.9598401222384	20/04/28 05:17:49
1	29	333.41684249911117	274.9598401222384	20/04/28 05:17:50
1	29	333.41684249911117	274.9598401222384	20/04/28 05:17:51
1	29	331.53643314824757	274.0223057673639	20/04/28 05:17:52
1	29	331.53643314824757	274.0223057673639	20/04/28 05:17:53
1	29	331.53643314824757	274.0223057673639	20/04/28 05:17:54
1	29	333.41684249911117	274.9598401222384	20/04/28 05:17:55
1	29	333.41684249911117	274.9598401222384	20/04/28 05:17:56
1	29	333.41684249911117	274.9598401222384	20/04/28 05:17:57
1	29	333.41684249911117	274.9598401222384	20/04/28 05:17:58
1	29	333.41684249911117	274.9598401222384	20/04/28 05:17:59
1	29	333.41684249911117	274.9598401222384	20/04/28 05:18:00
1	29	333.41684249911117	274.9598401222384	20/04/28 05:18:01
1	29	333.41684249911117	274.9598401222384	20/04/28 05:18:02
1	29	333.41684249911117	274.9598401222384	20/04/28 05:18:03
1	29	333.41684249911117	274.9598401222384	20/04/28 05:18:04
1	29	331.53643314824757	274.0223057673639	20/04/28 05:18:05
1	29	333.41684249911117	274.9598401222384	20/04/28 05:18:06
1	29	333.41684249911117	274.9598401222384	20/04/28 05:18:07
1	29	333.41684249911117	274.9598401222384	20/04/28 05:18:08
1	29	331.53643314824757	274.0223057673639	20/04/28 05:18:09
1	29	333.41684249911117	274.9598401222384	20/04/28 05:18:10
1	29	331.53643314824757	274.0223057673639	20/04/28 05:18:11
1	29	331.69286809267174	275.97981690209605	20/04/28 05:18:12
1	29	331.69286809267174	275.97981690209605	20/04/28 05:18:13
1	29	333.41684249911117	274.9598401222384	20/04/28 05:18:14
1	29	331.69286809267174	275.97981690209605	20/04/28 05:18:15
1	29	332.7456299918409	278.40940910115313	20/04/28 05:18:16
1	29	332.7456299918409	278.40940910115313	20/04/28 05:18:17
