floorId	partitionId	location_x	location_y	timeStamp
1	98	303.28594423312194	264.61216223098285	20/04/28 05:12:14
1	98	305.14384176673207	266.22087392439636	20/04/28 05:12:15
1	98	303.28594423312194	264.61216223098285	20/04/28 05:12:16
1	98	303.28594423312194	264.61216223098285	20/04/28 05:12:17
1	98	303.28594423312194	264.61216223098285	20/04/28 05:12:18
1	98	303.28594423312194	264.61216223098285	20/04/28 05:12:19
1	98	303.28594423312194	264.61216223098285	20/04/28 05:12:20
1	98	303.28594423312194	264.61216223098285	20/04/28 05:12:21
1	98	303.28594423312194	264.61216223098285	20/04/28 05:12:22
1	98	303.28594423312194	264.61216223098285	20/04/28 05:12:23
1	98	303.28594423312194	264.61216223098285	20/04/28 05:12:24
1	56	307.159840217744	263.3357311024059	20/04/28 05:12:25
1	56	307.159840217744	263.3357311024059	20/04/28 05:12:26
1	98	303.28594423312194	264.61216223098285	20/04/28 05:12:27
1	98	303.28594423312194	264.61216223098285	20/04/28 05:12:28
1	98	303.28594423312194	264.61216223098285	20/04/28 05:12:29
1	98	303.28594423312194	264.61216223098285	20/04/28 05:12:30
1	98	303.28594423312194	264.61216223098285	20/04/28 05:12:31
1	98	303.28594423312194	264.61216223098285	20/04/28 05:12:32
1	98	303.28594423312194	264.61216223098285	20/04/28 05:12:33
1	98	303.28594423312194	264.61216223098285	20/04/28 05:12:34
1	98	305.14384176673207	266.22087392439636	20/04/28 05:12:35
1	98	303.28594423312194	264.61216223098285	20/04/28 05:12:36
1	98	303.28594423312194	264.61216223098285	20/04/28 05:12:37
1	98	305.14384176673207	266.22087392439636	20/04/28 05:12:38
1	98	303.28594423312194	264.61216223098285	20/04/28 05:12:39
1	98	303.28594423312194	264.61216223098285	20/04/28 05:12:40
1	98	305.14384176673207	266.22087392439636	20/04/28 05:12:41
1	98	305.14384176673207	266.22087392439636	20/04/28 05:12:42
1	98	303.28594423312194	264.61216223098285	20/04/28 05:12:43
1	98	303.28594423312194	264.61216223098285	20/04/28 05:12:44
1	98	303.28594423312194	264.61216223098285	20/04/28 05:12:45
1	98	303.28594423312194	264.61216223098285	20/04/28 05:12:46
1	98	303.28594423312194	264.61216223098285	20/04/28 05:12:47
1	98	303.28594423312194	264.61216223098285	20/04/28 05:12:48
1	98	303.28594423312194	264.61216223098285	20/04/28 05:12:49
1	98	303.28594423312194	264.61216223098285	20/04/28 05:12:50
1	98	303.28594423312194	264.61216223098285	20/04/28 05:12:51
3	47	302.3157990937455	265.96754816044853	20/04/28 05:12:52
3	47	302.8570592601016	265.6207358146814	20/04/28 05:12:53
3	47	303.28594423312194	264.61216223098285	20/04/28 05:12:54
3	47	305.42047124180004	265.2616066172563	20/04/28 05:12:55
3	NULL	309.29436722642214	263.9851754886794	20/04/28 05:12:56
1	81	313.37765885306834	261.0920988121665	20/04/28 05:12:57
1	81	317.5263569831538	260.75405889490565	20/04/28 05:12:58
3	54	317.5263569831538	260.75405889490565	20/04/28 05:12:59
3	54	321.27015631552865	262.1152944981856	20/04/28 05:13:00
3	54	324.01518066743233	262.76750572012435	20/04/28 05:13:01
3	54	324.6837666112415	261.38954335341236	20/04/28 05:13:02
3	54	324.6837666112415	261.38954335341236	20/04/28 05:13:03
3	54	327.3540763805351	261.1072377077433	20/04/28 05:13:04
3	54	327.3540763805351	261.1072377077433	20/04/28 05:13:05
3	54	332.9065526505472	263.50534437986465	20/04/28 05:13:06
3	54	334.4407240787428	261.4032786809491	20/04/28 05:13:07
3	54	334.4407240787428	261.4032786809491	20/04/28 05:13:08
3	NULL	337.70753542622793	260.45953294809686	20/04/28 05:13:09
3	NULL	337.70753542622793	260.4595329480968	20/04/28 05:13:10
3	42	343.19179870246967	259.9647561276533	20/04/28 05:13:11
3	42	343.19179870246967	259.9647561276533	20/04/28 05:13:12
3	54	349.17477120857285	262.4807721885283	20/04/28 05:13:13
3	54	350.37914153837863	260.97432627346046	20/04/28 05:13:14
3	54	350.37914153837863	260.97432627346046	20/04/28 05:13:15
3	42	351.2362894892158	259.98472696547645	20/04/28 05:13:16
3	54	354.93110780732565	263.85962413987545	20/04/28 05:13:17
3	54	354.93110780732565	263.85962413987545	20/04/28 05:13:18
3	54	358.23287936641947	263.0061707425011	20/04/28 05:13:19
3	54	358.23287936641947	263.0061707425011	20/04/28 05:13:20
3	46	361.6170319482885	264.17422801455785	20/04/28 05:13:21
3	54	365.2339908031949	263.4272252913235	20/04/28 05:13:22
3	54	365.2339908031949	263.4272252913235	20/04/28 05:13:23
3	54	367.80245440868674	262.5455232582413	20/04/28 05:13:24
3	54	372.48785670166836	262.3595943162643	20/04/28 05:13:25
3	54	372.48785670166836	262.3595943162643	20/04/28 05:13:26
3	54	372.48785670166836	262.3595943162643	20/04/28 05:13:27
3	54	375.1867774942457	263.7731434229599	20/04/28 05:13:28
1	33	379.8755906118027	262.6421307240284	20/04/28 05:13:29
3	15	380.97239583354167	266.94453563659977	20/04/28 05:13:31
1	33	381.6109766893215	266.73786054806715	20/04/28 05:13:32
1	33	381.6109766893215	266.73786054806715	20/04/28 05:13:33
1	86	378.091951274268	265.65817665109427	20/04/28 05:13:34
1	86	377.91614244309534	266.0609018455502	20/04/28 05:13:35
1	86	377.91614244309534	266.0609018455502	20/04/28 05:13:36
1	86	376.4088055113555	269.3162468994009	20/04/28 05:13:37
1	86	375.77022465557565	269.52292198793356	20/04/28 05:13:38
1	86	376.4088055113555	269.3162468994009	20/04/28 05:13:39
1	74	373.24711269417094	267.706647686782	20/04/28 05:13:40
1	86	375.77022465557565	269.52292198793356	20/04/28 05:13:41
1	86	376.4088055113555	269.3162468994009	20/04/28 05:13:42
1	86	376.4088055113555	269.3162468994009	20/04/28 05:13:43
1	86	376.4088055113555	269.3162468994009	20/04/28 05:13:44
1	86	375.77022465557565	269.52292198793356	20/04/28 05:13:45
1	74	373.24711269417094	267.706647686782	20/04/28 05:13:46
1	86	376.4088055113555	269.3162468994009	20/04/28 05:13:47
1	86	376.4088055113555	269.3162468994009	20/04/28 05:13:48
1	86	375.77022465557565	269.52292198793356	20/04/28 05:13:49
1	86	376.4088055113555	269.3162468994009	20/04/28 05:13:50
1	86	376.4088055113555	269.3162468994009	20/04/28 05:13:51
1	33	380.6150632356726	267.4744509522458	20/04/28 05:13:52
1	74	374.7544496259107	264.45130263293123	20/04/28 05:13:53
1	74	374.7544496259107	264.45130263293123	20/04/28 05:13:54
1	69	372.48785670166836	262.3595943162643	20/04/28 05:13:55
1	69	372.48785670166836	262.3595943162643	20/04/28 05:13:56
1	69	367.80245440868674	262.5455232582413	20/04/28 05:13:57
3	46	368.31727752533806	266.1301521552222	20/04/28 05:13:58
3	46	361.61703194828846	264.17422801455785	20/04/28 05:13:59
3	8	359.3871933687977	264.79570512407787	20/04/28 05:14:00
1	64	354.49328963180795	262.3471616487957	20/04/28 05:14:01
1	41	352.7251685521831	260.56227788261185	20/04/28 05:14:02
1	41	352.7251685521831	260.56227788261185	20/04/28 05:14:03
1	41	351.1038521390131	261.25919659269	20/04/28 05:14:04
1	41	350.03191915941005	261.4911728805443	20/04/28 05:14:05
1	22	346.48253983850464	261.2777688197779	20/04/28 05:14:06
1	22	346.48253983850464	261.2777688197779	20/04/28 05:14:07
1	22	343.1917987024697	259.9647561276533	20/04/28 05:14:08
1	NULL	341.75641581596034	259.4998576241711	20/04/28 05:14:09
1	69	340.1854692097293	258.18142547541174	20/04/28 05:14:10
1	69	338.1583683683643	258.3517387010974	20/04/28 05:14:11
1	69	338.1583683683643	258.3517387010974	20/04/28 05:14:12
1	5	333.7145018941879	260.98944075495035	20/04/28 05:14:13
3	54	329.63052872625184	261.159270734312	20/04/28 05:14:14
1	37	329.2127636639186	262.6803906369539	20/04/28 05:14:15
1	37	329.2127636639186	262.6803906369539	20/04/28 05:14:16
1	37	329.2127636639186	262.68039063695386	20/04/28 05:14:17
1	37	329.2127636639186	262.6803906369539	20/04/28 05:14:18
1	37	329.2127636639186	262.68039063695386	20/04/28 05:14:19
1	37	329.2127636639186	262.6803906369539	20/04/28 05:14:20
1	37	329.2127636639186	262.68039063695386	20/04/28 05:14:21
1	37	329.2127636639186	262.6803906369539	20/04/28 05:14:22
3	54	329.2127636639186	262.68039063695386	20/04/28 05:14:23
1	37	329.2127636639186	262.6803906369539	20/04/28 05:14:24
1	37	329.2127636639186	262.6803906369539	20/04/28 05:14:25
3	54	329.2127636639186	262.6803906369539	20/04/28 05:14:26
1	37	329.2127636639186	262.68039063695386	20/04/28 05:14:27
1	37	329.2127636639186	262.68039063695386	20/04/28 05:14:28
1	37	329.2127636639186	262.6803906369539	20/04/28 05:14:29
1	37	329.2127636639186	262.6803906369539	20/04/28 05:14:30
1	37	329.2127636639186	262.68039063695386	20/04/28 05:14:31
1	37	329.2127636639186	262.6803906369539	20/04/28 05:14:32
1	37	329.2127636639186	262.6803906369539	20/04/28 05:14:33
1	37	329.2127636639186	262.6803906369539	20/04/28 05:14:34
1	5	332.9065526505472	263.50534437986465	20/04/28 05:14:35
1	37	329.2127636639186	262.6803906369539	20/04/28 05:14:36
1	5	333.7145018941879	260.9894407549504	20/04/28 05:14:37
1	5	333.1227839393323	261.62465248411826	20/04/28 05:14:38
1	37	329.2127636639186	262.6803906369539	20/04/28 05:14:39
1	37	329.2127636639186	262.6803906369539	20/04/28 05:14:40
1	37	329.2127636639186	262.6803906369539	20/04/28 05:14:41
1	5	333.7145018941879	260.9894407549504	20/04/28 05:14:42
1	5	332.9065526505472	263.50534437986465	20/04/28 05:14:43
1	5	333.1227839393323	261.62465248411826	20/04/28 05:14:44
1	5	332.9065526505472	263.50534437986465	20/04/28 05:14:45
1	5	332.9065526505472	263.50534437986465	20/04/28 05:14:46
1	5	333.1227839393323	261.62465248411826	20/04/28 05:14:47
1	37	329.2127636639186	262.6803906369539	20/04/28 05:14:48
1	5	332.9065526505472	263.50534437986465	20/04/28 05:14:49
1	5	333.1227839393323	261.62465248411826	20/04/28 05:14:50
1	5	333.1227839393323	261.62465248411826	20/04/28 05:14:51
1	5	333.7145018941879	260.9894407549504	20/04/28 05:14:52
1	5	333.1227839393323	261.62465248411826	20/04/28 05:14:53
1	5	333.7145018941879	260.9894407549504	20/04/28 05:14:54
1	5	333.1227839393323	261.62465248411826	20/04/28 05:14:55
1	37	329.2127636639186	262.6803906369539	20/04/28 05:14:56
1	5	333.1227839393323	261.62465248411826	20/04/28 05:14:57
1	5	333.7145018941879	260.9894407549504	20/04/28 05:14:58
1	5	333.1227839393323	261.62465248411826	20/04/28 05:14:59
1	5	334.95421240030805	260.2160082477838	20/04/28 05:15:00
1	69	338.1583683683643	258.3517387010974	20/04/28 05:15:01
1	69	338.1583683683643	258.3517387010974	20/04/28 05:15:02
1	69	340.1854692097293	258.18142547541174	20/04/28 05:15:03
1	22	343.1917987024697	259.9647561276533	20/04/28 05:15:04
1	22	346.48253983850464	261.2777688197779	20/04/28 05:15:05
1	41	349.2732493252067	263.17227144197165	20/04/28 05:15:06
1	41	350.03191915941005	261.4911728805443	20/04/28 05:15:07
1	41	352.7251685521831	260.56227788261185	20/04/28 05:15:08
1	41	351.1038521390131	261.25919659269	20/04/28 05:15:09
1	64	354.3333978239378	262.53426333928064	20/04/28 05:15:10
1	64	354.49328963180795	262.3471616487957	20/04/28 05:15:11
1	64	357.3387197726774	263.8494133906552	20/04/28 05:15:12
3	54	359.5685583521681	263.2279362811352	20/04/28 05:15:13
1	13	364.70031867043167	266.8771548784566	20/04/28 05:15:14
1	13	368.31727752533806	266.1301521552222	20/04/28 05:15:15
1	13	368.31727752533806	266.1301521552222	20/04/28 05:15:16
1	13	368.31727752533806	266.1301521552222	20/04/28 05:15:17
1	13	368.31727752533806	266.1301521552222	20/04/28 05:15:18
1	74	373.5846619234073	266.66199922883567	20/04/28 05:15:19
1	74	373.24711269417094	267.706647686782	20/04/28 05:15:20
1	NULL	369.15505395524525	268.76260300101654	20/04/28 05:15:21
1	NULL	369.15505395524525	268.76260300101654	20/04/28 05:15:22
1	NULL	369.15505395524525	268.76260300101654	20/04/28 05:15:23
1	74	373.24711269417094	267.706647686782	20/04/28 05:15:24
1	13	368.31727752533806	266.1301521552222	20/04/28 05:15:25
1	NULL	369.15505395524525	268.76260300101654	20/04/28 05:15:26
1	13	368.31727752533806	266.1301521552222	20/04/28 05:15:27
1	NULL	369.15505395524525	268.76260300101654	20/04/28 05:15:28
1	13	368.31727752533806	266.1301521552222	20/04/28 05:15:29
1	13	368.31727752533806	266.1301521552222	20/04/28 05:15:30
1	NULL	369.15505395524525	268.76260300101654	20/04/28 05:15:31
1	13	368.31727752533806	266.1301521552222	20/04/28 05:15:32
1	NULL	369.15505395524525	268.76260300101654	20/04/28 05:15:33
1	13	368.31727752533806	266.1301521552222	20/04/28 05:15:34
1	13	368.31727752533806	266.1301521552222	20/04/28 05:15:35
1	13	368.31727752533806	266.1301521552222	20/04/28 05:15:36
1	13	368.31727752533806	266.1301521552222	20/04/28 05:15:37
1	13	368.31727752533806	266.1301521552222	20/04/28 05:15:38
1	13	368.31727752533806	266.1301521552222	20/04/28 05:15:39
1	13	368.31727752533806	266.1301521552222	20/04/28 05:15:40
1	13	368.31727752533806	266.1301521552222	20/04/28 05:15:41
1	69	367.80245440868674	262.5455232582413	20/04/28 05:15:42
1	13	368.31727752533806	266.1301521552222	20/04/28 05:15:43
1	13	368.31727752533806	266.1301521552222	20/04/28 05:15:44
3	46	364.70031867043167	266.8771548784566	20/04/28 05:15:45
3	8	359.3871933687977	264.79570512407787	20/04/28 05:15:46
1	64	357.17882796480734	264.0365150811401	20/04/28 05:15:47
1	64	354.49328963180795	262.3471616487957	20/04/28 05:15:48
1	64	354.3333978239378	262.53426333928064	20/04/28 05:15:49
1	41	352.7251685521831	260.56227788261185	20/04/28 05:15:50
1	41	351.1038521390131	261.25919659269	20/04/28 05:15:51
1	41	350.03191915941005	261.4911728805443	20/04/28 05:15:52
1	41	349.2732493252067	263.17227144197165	20/04/28 05:15:53
1	22	346.48253983850464	261.2777688197779	20/04/28 05:15:54
1	22	343.1917987024697	259.9647561276533	20/04/28 05:15:55
1	69	340.1854692097293	258.18142547541174	20/04/28 05:15:56
1	69	338.1583683683643	258.3517387010974	20/04/28 05:15:57
1	69	338.1583683683643	258.3517387010974	20/04/28 05:15:58
1	5	334.954212400308	260.21600824778375	20/04/28 05:15:59
1	37	329.2127636639186	262.6803906369539	20/04/28 05:16:00
1	37	329.2127636639186	262.6803906369539	20/04/28 05:16:01
1	37	326.9602189569582	261.441576379981	20/04/28 05:16:02
1	37	323.9780902572864	261.641853061257	20/04/28 05:16:03
1	72	322.34915620924	265.0152899264337	20/04/28 05:16:04
1	72	321.2330659053827	260.98964183931827	20/04/28 05:16:05
1	81	318.06966812882723	262.69145868280907	20/04/28 05:16:06
1	81	315.74240883925677	260.5181275582284	20/04/28 05:16:07
1	81	314.50318194109644	265.02915212402996	20/04/28 05:16:08
1	81	315.74240883925677	260.5181275582284	20/04/28 05:16:09
1	81	314.50318194109644	265.02915212402996	20/04/28 05:16:10
1	81	313.2523840549325	264.4074609667819	20/04/28 05:16:11
1	81	314.50318194109644	265.02915212402996	20/04/28 05:16:12
1	81	314.50318194109644	265.02915212402996	20/04/28 05:16:13
1	81	311.6591172126105	263.4112042347413	20/04/28 05:16:14
1	81	314.50318194109644	265.02915212402996	20/04/28 05:16:15
1	81	314.50318194109644	265.02915212402996	20/04/28 05:16:16
1	81	313.2523840549325	264.4074609667819	20/04/28 05:16:17
1	81	315.74240883925677	260.5181275582284	20/04/28 05:16:18
1	81	315.74240883925677	260.5181275582284	20/04/28 05:16:19
1	81	311.6591172126105	263.4112042347413	20/04/28 05:16:20
1	81	314.50318194109644	265.02915212402996	20/04/28 05:16:21
1	81	311.6591172126105	263.4112042347413	20/04/28 05:16:22
1	81	311.65911721261057	263.4112042347413	20/04/28 05:16:23
1	81	315.74240883925677	260.5181275582284	20/04/28 05:16:24
1	81	311.6591172126105	263.4112042347413	20/04/28 05:16:25
1	81	311.6591172126105	263.4112042347413	20/04/28 05:16:26
1	81	311.65911721261057	263.4112042347413	20/04/28 05:16:27
1	81	315.74240883925677	260.5181275582284	20/04/28 05:16:28
1	81	315.74240883925677	260.5181275582284	20/04/28 05:16:29
1	81	315.74240883925677	260.5181275582284	20/04/28 05:16:30
1	69	322.25711082016966	258.22191770932045	20/04/28 05:16:31
1	37	323.9780902572864	261.641853061257	20/04/28 05:16:32
1	37	323.9780902572864	261.641853061257	20/04/28 05:16:33
1	37	326.9602189569582	261.44157637998103	20/04/28 05:16:34
1	37	329.2127636639186	262.68039063695386	20/04/28 05:16:35
1	NULL	329.63052872625184	261.159270734312	20/04/28 05:16:36
1	5	333.1227839393323	261.62465248411826	20/04/28 05:16:37
1	69	335.24867332238347	258.8873750560348	20/04/28 05:16:38
1	69	338.1583683683643	258.3517387010974	20/04/28 05:16:39
1	69	340.1854692097293	258.18142547541174	20/04/28 05:16:40
1	69	340.1854692097293	258.18142547541174	20/04/28 05:16:41
1	22	343.1917987024697	259.9647561276533	20/04/28 05:16:42
1	22	343.1917987024697	259.9647561276533	20/04/28 05:16:43
1	41	350.03191915941005	261.4911728805443	20/04/28 05:16:44
1	41	351.1038521390131	261.25919659268993	20/04/28 05:16:45
1	41	352.7251685521831	260.56227788261185	20/04/28 05:16:46
1	41	352.7251685521831	260.56227788261185	20/04/28 05:16:47
1	64	354.3333978239378	262.53426333928064	20/04/28 05:16:48
1	64	358.87237025214637	261.21107622709695	20/04/28 05:16:49
1	64	358.87237025214637	261.21107622709695	20/04/28 05:16:50
3	54	358.87237025214637	261.21107622709695	20/04/28 05:16:51
3	57	365.6578696297699	259.3576200548633	20/04/28 05:16:52
1	69	367.80245440868674	262.5455232582413	20/04/28 05:16:53
1	69	368.9169651830857	261.65782172430613	20/04/28 05:16:54
1	69	372.48785670166836	262.3595943162643	20/04/28 05:16:55
1	69	372.48785670166836	262.35959431626424	20/04/28 05:16:56
1	69	376.18075636557654	261.96517202151136	20/04/28 05:16:57
1	69	376.18075636557654	261.96517202151136	20/04/28 05:16:58
1	33	381.6109766893215	266.73786054806715	20/04/28 05:16:59
1	33	381.6109766893215	266.73786054806715	20/04/28 05:17:00
3	15	380.97239583354167	266.94453563659977	20/04/28 05:17:01
1	33	380.97239583354167	266.94453563659977	20/04/28 05:17:02
3	54	376.35656519674916	261.5624468270555	20/04/28 05:17:03
3	54	372.48785670166836	262.3595943162643	20/04/28 05:17:04
3	54	372.48785670166836	262.3595943162643	20/04/28 05:17:05
3	54	372.48785670166836	262.3595943162643	20/04/28 05:17:06
3	54	372.48785670166836	262.3595943162643	20/04/28 05:17:07
3	57	365.8336784609425	258.95489486040736	20/04/28 05:17:08
3	46	361.61703194828846	264.17422801455785	20/04/28 05:17:09
3	46	361.6170319482885	264.17422801455785	20/04/28 05:17:10
3	46	361.61703194828846	264.17422801455785	20/04/28 05:17:11
3	95	335.7070915104406	247.86709193957077	20/04/28 05:17:12
3	54	354.93110780732565	263.85962413987545	20/04/28 05:17:13
3	54	354.93110780732565	263.85962413987545	20/04/28 05:17:14
3	54	350.37914153837863	260.97432627346046	20/04/28 05:17:15
3	54	350.37914153837863	260.97432627346046	20/04/28 05:17:16
3	54	350.37914153837863	260.97432627346046	20/04/28 05:17:17
3	54	345.98250818917177	261.859258749847	20/04/28 05:17:18
3	54	344.0544452814365	260.94893597900256	20/04/28 05:17:19
3	99	339.59375125487367	258.8166372045796	20/04/28 05:17:20
3	NULL	337.70753542622793	260.4595329480968	20/04/28 05:17:21
3	54	334.4407240787428	261.4032786809491	20/04/28 05:17:22
3	54	334.4407240787428	261.4032786809491	20/04/28 05:17:23
3	54	334.4407240787428	261.4032786809491	20/04/28 05:17:24
3	54	333.1227839393323	261.62465248411826	20/04/28 05:17:25
3	54	327.3540763805351	261.1072377077433	20/04/28 05:17:26
3	54	327.3540763805351	261.1072377077433	20/04/28 05:17:27
3	54	324.0151806674323	262.76750572012435	20/04/28 05:17:28
3	54	320.8837118146334	260.6124411653196	20/04/28 05:17:29
3	54	324.0151806674323	262.76750572012435	20/04/28 05:17:30
3	54	317.52635698315385	260.7540588949056	20/04/28 05:17:31
1	81	313.37765885306834	261.0920988121665	20/04/28 05:17:32
1	81	315.74240883925677	260.5181275582284	20/04/28 05:17:33
1	81	313.37765885306834	261.0920988121665	20/04/28 05:17:34
3	20	308.1866193271433	264.1749199815553	20/04/28 05:17:35
3	47	305.42047124180004	265.2616066172563	20/04/28 05:17:36
3	47	302.8570592601016	265.6207358146814	20/04/28 05:17:37
3	47	302.8570592601016	265.6207358146814	20/04/28 05:17:38
3	47	302.3157990937455	265.96754816044853	20/04/28 05:17:39
1	98	303.28594423312194	264.61216223098285	20/04/28 05:17:40
1	98	303.28594423312194	264.61216223098285	20/04/28 05:17:41
1	56	307.159840217744	263.3357311024059	20/04/28 05:17:42
1	56	308.4512500184315	264.78737494292824	20/04/28 05:17:43
1	81	312.13843195490807	265.60312337796796	20/04/28 05:17:44
1	81	314.50318194109644	265.02915212402996	20/04/28 05:17:45
1	81	314.50318194109644	265.02915212402996	20/04/28 05:17:46
1	56	319.89662212153377	266.1573209564685	20/04/28 05:17:47
1	56	319.89662212153377	266.1573209564685	20/04/28 05:17:48
1	56	319.89662212153377	266.1573209564685	20/04/28 05:17:49
1	72	322.34915620924	265.0152899264337	20/04/28 05:17:50
1	56	323.4239197296148	267.3777084008722	20/04/28 05:17:51
1	37	325.93617404217133	264.2093005099789	20/04/28 05:17:52
1	56	328.7589326730361	266.5344039090585	20/04/28 05:17:53
1	NULL	331.9249996219656	268.73042370731713	20/04/28 05:17:54
1	NULL	331.9249996219656	268.73042370731713	20/04/28 05:17:55
1	56	333.50170633168455	266.97796434330365	20/04/28 05:17:56
1	NULL	331.9249996219656	268.73042370731713	20/04/28 05:17:57
1	NULL	331.9249996219656	268.73042370731713	20/04/28 05:17:58
1	29	332.11202638116566	272.3894277766605	20/04/28 05:17:59
1	29	332.11202638116566	272.3894277766605	20/04/28 05:18:00
1	29	332.11202638116566	272.3894277766605	20/04/28 05:18:01
1	29	331.53643314824757	274.0223057673639	20/04/28 05:18:02
1	29	332.11202638116566	272.3894277766605	20/04/28 05:18:03
1	29	333.41684249911117	274.9598401222384	20/04/28 05:18:04
1	29	333.41684249911117	274.9598401222384	20/04/28 05:18:05
1	29	331.53643314824757	274.0223057673639	20/04/28 05:18:06
1	29	332.11202638116566	272.3894277766605	20/04/28 05:18:07
1	29	333.41684249911117	274.9598401222384	20/04/28 05:18:08
1	29	333.41684249911117	274.9598401222384	20/04/28 05:18:09
1	29	333.41684249911117	274.9598401222384	20/04/28 05:18:10
1	29	333.41684249911117	274.9598401222384	20/04/28 05:18:11
1	29	333.41684249911117	274.9598401222384	20/04/28 05:18:12
1	29	331.53643314824757	274.0223057673639	20/04/28 05:18:13
1	29	331.53643314824757	274.0223057673639	20/04/28 05:18:14
1	29	333.41684249911117	274.9598401222384	20/04/28 05:18:15
