floorId	partitionId	location_x	location_y	timeStamp
21	962	335.9061167518121	274.04579276282294	21/02/24 15:39:59
21	962	335.9061167518121	274.04579276282294	21/02/24 15:40:00
21	962	340.35445811124504	268.8676821963595	21/02/24 15:40:01
21	962	339.0352058930359	273.3587161799046	21/02/24 15:40:02
21	962	335.9061167518121	274.04579276282294	21/02/24 15:40:03
21	962	335.9061167518121	274.04579276282294	21/02/24 15:40:04
21	962	335.906116751812	274.04579276282294	21/02/24 15:40:05
21	962	335.906116751812	274.04579276282294	21/02/24 15:40:06
21	962	335.9061167518121	274.04579276282294	21/02/24 15:40:07
21	962	335.906116751812	274.04579276282294	21/02/24 15:40:08
21	962	335.9061167518121	274.04579276282294	21/02/24 15:40:09
21	962	335.9061167518121	274.04579276282294	21/02/24 15:40:10
21	962	335.9061167518121	274.04579276282294	21/02/24 15:40:11
21	962	339.0352058930359	273.3587161799046	21/02/24 15:40:12
21	962	335.9061167518121	274.04579276282294	21/02/24 15:40:13
21	962	335.9061167518121	274.04579276282294	21/02/24 15:40:14
21	962	335.9061167518121	274.04579276282294	21/02/24 15:40:15
21	962	335.9061167518121	274.04579276282294	21/02/24 15:40:16
21	962	335.906116751812	274.04579276282294	21/02/24 15:40:17
21	962	335.906116751812	274.04579276282294	21/02/24 15:40:18
21	962	335.906116751812	274.04579276282294	21/02/24 15:40:19
21	962	335.9061167518121	274.04579276282294	21/02/24 15:40:20
21	962	335.9061167518121	274.04579276282294	21/02/24 15:40:21
21	962	335.906116751812	274.04579276282294	21/02/24 15:40:22
21	962	335.9061167518121	274.04579276282294	21/02/24 15:40:23
21	962	335.9061167518121	274.04579276282294	21/02/24 15:40:24
21	962	335.9061167518121	274.04579276282294	21/02/24 15:40:25
21	962	335.906116751812	274.04579276282294	21/02/24 15:40:26
21	962	335.9061167518121	274.04579276282294	21/02/24 15:40:27
21	962	335.906116751812	274.04579276282294	21/02/24 15:40:28
21	962	335.906116751812	274.04579276282294	21/02/24 15:40:29
21	962	335.906116751812	274.04579276282294	21/02/24 15:40:30
21	962	335.906116751812	274.04579276282294	21/02/24 15:40:31
21	962	335.906116751812	274.04579276282294	21/02/24 15:40:32
21	962	335.906116751812	274.04579276282294	21/02/24 15:40:33
21	962	335.906116751812	274.04579276282294	21/02/24 15:40:34
21	962	335.9061167518121	274.04579276282294	21/02/24 15:40:35
21	962	335.9061167518121	274.04579276282294	21/02/24 15:40:36
21	962	335.9061167518121	274.04579276282294	21/02/24 15:40:37
21	962	335.9061167518121	274.04579276282294	21/02/24 15:40:38
21	962	335.9061167518121	274.04579276282294	21/02/24 15:40:39
21	962	335.9061167518121	274.04579276282294	21/02/24 15:40:40
21	962	335.9061167518121	274.04579276282294	21/02/24 15:40:41
21	962	335.9061167518121	274.04579276282294	21/02/24 15:40:42
21	962	335.9061167518121	274.04579276282294	21/02/24 15:40:43
21	962	335.9061167518121	274.04579276282294	21/02/24 15:40:44
21	962	335.906116751812	274.04579276282294	21/02/24 15:40:45
21	962	335.9061167518121	274.04579276282294	21/02/24 15:40:46
21	962	335.9061167518121	274.04579276282294	21/02/24 15:40:47
21	962	335.9061167518121	274.04579276282294	21/02/24 15:40:48
21	962	335.9061167518121	274.04579276282294	21/02/24 15:40:49
21	962	335.9061167518121	274.04579276282294	21/02/24 15:40:50
21	962	335.9061167518121	274.04579276282294	21/02/24 15:40:51
21	962	335.9061167518121	274.04579276282294	21/02/24 15:40:52
21	962	335.9061167518121	274.04579276282294	21/02/24 15:40:53
21	962	335.906116751812	274.04579276282294	21/02/24 15:40:54
21	962	335.9061167518121	274.04579276282294	21/02/24 15:40:55
21	962	335.906116751812	274.04579276282294	21/02/24 15:40:56
21	962	335.9061167518121	274.04579276282294	21/02/24 15:40:57
21	962	340.35445811124504	268.8676821963595	21/02/24 15:40:58
21	962	335.9061167518121	274.04579276282294	21/02/24 15:40:59
21	962	335.9061167518121	274.04579276282294	21/02/24 15:41:00
21	962	335.9061167518121	274.04579276282294	21/02/24 15:41:01
21	962	335.9061167518121	274.04579276282294	21/02/24 15:41:02
21	962	340.35445811124504	268.8676821963595	21/02/24 15:41:03
21	962	335.9061167518121	274.04579276282294	21/02/24 15:41:04
21	962	340.35445811124504	268.8676821963595	21/02/24 15:41:05
21	962	335.9061167518121	274.04579276282294	21/02/24 15:41:06
21	962	335.9061167518121	274.04579276282294	21/02/24 15:41:07
21	962	335.9061167518121	274.04579276282294	21/02/24 15:41:08
21	962	335.9061167518121	274.04579276282294	21/02/24 15:41:09
21	962	335.9061167518121	274.04579276282294	21/02/24 15:41:10
21	962	335.9061167518121	274.04579276282294	21/02/24 15:41:11
21	962	335.9061167518121	274.04579276282294	21/02/24 15:41:12
21	962	335.9061167518121	274.04579276282294	21/02/24 15:41:13
21	962	335.9061167518121	274.04579276282294	21/02/24 15:41:14
21	962	335.9061167518121	274.04579276282294	21/02/24 15:41:15
21	962	335.9061167518121	274.04579276282294	21/02/24 15:41:16
21	962	341.06978309421794	269.64197422349145	21/02/24 15:41:17
21	962	335.9061167518121	274.04579276282294	21/02/24 15:41:18
21	962	340.35445811124504	268.8676821963595	21/02/24 15:41:19
21	962	340.35445811124504	268.8676821963595	21/02/24 15:41:20
21	962	335.9061167518121	274.04579276282294	21/02/24 15:41:21
21	962	335.9061167518121	274.04579276282294	21/02/24 15:41:22
21	962	335.9061167518121	274.04579276282294	21/02/24 15:41:23
21	962	335.9061167518121	274.04579276282294	21/02/24 15:41:24
21	962	335.9061167518121	274.04579276282294	21/02/24 15:41:25
21	962	335.9061167518121	274.04579276282294	21/02/24 15:41:26
21	962	340.35445811124504	268.8676821963595	21/02/24 15:41:27
21	962	335.9061167518121	274.04579276282294	21/02/24 15:41:28
21	962	335.9061167518121	274.04579276282294	21/02/24 15:41:29
21	962	335.9061167518121	274.04579276282294	21/02/24 15:41:30
21	962	340.35445811124504	268.8676821963595	21/02/24 15:41:31
21	962	335.9061167518121	274.04579276282294	21/02/24 15:41:32
21	962	335.9061167518121	274.04579276282294	21/02/24 15:41:33
21	962	335.9061167518121	274.04579276282294	21/02/24 15:41:34
21	962	335.9061167518121	274.04579276282294	21/02/24 15:41:35
21	962	335.9061167518121	274.04579276282294	21/02/24 15:41:36
21	962	335.9061167518121	274.04579276282294	21/02/24 15:41:37
21	962	340.35445811124504	268.8676821963595	21/02/24 15:41:38
21	962	340.35445811124504	268.8676821963595	21/02/24 15:41:39
21	962	335.9061167518121	274.04579276282294	21/02/24 15:41:40
21	962	335.9061167518121	274.04579276282294	21/02/24 15:41:41
21	962	340.35445811124504	268.8676821963595	21/02/24 15:41:42
21	962	340.35445811124504	268.8676821963595	21/02/24 15:41:43
21	962	340.35445811124504	268.8676821963595	21/02/24 15:41:44
21	962	335.9061167518121	274.04579276282294	21/02/24 15:41:45
21	962	340.35445811124504	268.8676821963595	21/02/24 15:41:46
21	962	340.35445811124504	268.8676821963595	21/02/24 15:41:47
21	962	335.9061167518121	274.04579276282294	21/02/24 15:41:48
21	962	335.9061167518121	274.04579276282294	21/02/24 15:41:49
21	962	340.35445811124504	268.8676821963595	21/02/24 15:41:50
21	962	335.9061167518121	274.04579276282294	21/02/24 15:41:51
21	962	335.9061167518121	274.04579276282294	21/02/24 15:41:52
21	962	335.9061167518121	274.04579276282294	21/02/24 15:41:53
21	962	340.35445811124504	268.8676821963595	21/02/24 15:41:54
21	962	339.0352058930359	273.3587161799046	21/02/24 15:41:55
21	962	335.9061167518121	274.04579276282294	21/02/24 15:41:56
21	962	335.9061167518121	274.04579276282294	21/02/24 15:41:57
21	962	335.9061167518121	274.04579276282294	21/02/24 15:41:58
21	962	335.9061167518121	274.04579276282294	21/02/24 15:41:59
