floorId	partitionId	location_x	location_y	timeStamp
21	988	359.18700863322107	291.25609656574426	21/02/21 12:29:07
21	988	359.26287549570264	291.01235594623785	21/02/21 12:29:07
21	988	359.3161886043321	290.84107470828855	21/02/21 12:29:07
21	988	359.3978904302397	290.5785878594833	21/02/21 12:29:08
21	988	359.46026833412907	290.3781837773823	21/02/21 12:29:08
21	988	359.54020638409884	290.1213634847743	21/02/21 12:29:08
21	988	359.58929352396655	289.9636591921516	21/02/21 12:29:08
21	988	359.6625668277357	289.7282510064194	21/02/21 12:29:08
21	988	359.73688139431357	289.4894975124227	21/02/21 12:29:08
21	988	359.78817256855615	289.32471222704015	21/02/21 12:29:08
21	988	359.86772670341475	289.06912535445207	21/02/21 12:29:08
21	988	359.948819123157	288.80859637014004	21/02/21 12:29:08
21	988	360.0079839511394	288.61851507042996	21/02/21 12:29:08
21	988	360.0662327937112	288.43137659508534	21/02/21 12:29:09
21	988	360.1185372891247	288.2633357706983	21/02/21 12:29:09
21	898	360.18775330446067	287.98924671322175	21/02/21 12:29:09
21	898	360.07368447531724	287.83093703011525	21/02/21 12:29:09
21	898	360.07368447531724	287.83093703011525	21/02/21 12:29:09
21	898	359.95664208081394	287.66850050365156	21/02/21 12:29:09
21	898	359.6692747040242	287.26967955759346	21/02/21 12:29:09
21	898	359.52098684247716	287.0638792127812	21/02/21 12:29:09
21	898	359.36746926442936	286.8508208399153	21/02/21 12:29:09
21	898	359.24420795134324	286.67975342771786	21/02/21 12:29:09
21	898	359.0783179364223	286.44952404875545	21/02/21 12:29:10
21	898	358.9654284931371	286.29285116864656	21/02/21 12:29:10
21	898	358.8480707562845	286.1299769963531	21/02/21 12:29:10
21	898	358.72350411831235	285.9570979974969	21/02/21 12:29:10
21	898	358.58409489153337	285.76361980823845	21/02/21 12:29:10
21	898	358.416205708599	285.53061589694266	21/02/21 12:29:10
21	898	358.27122641339776	285.3294073244285	21/02/21 12:29:10
21	898	358.1304084268084	285.1339739970238	21/02/21 12:29:10
21	898	358.017715374376	284.97757367668356	21/02/21 12:29:10
21	898	357.84245048003754	284.734333432256	21/02/21 12:29:11
21	898	357.72698721850554	284.5740884952225	21/02/21 12:29:11
21	898	357.5555186535632	284.33611696187205	21/02/21 12:29:11
21	898	357.46335903219324	284.2082138303694	21/02/21 12:29:11
21	898	357.37138098232055	284.08056269168907	21/02/21 12:29:11
21	898	357.22357914142077	283.8754368674731	21/02/21 12:29:11
21	898	357.09448841122776	283.6962791366338	21/02/21 12:29:11
21	898	356.94214812688165	283.48485466317965	21/02/21 12:29:11
21	898	356.8335746187785	283.3341716256607	21/02/21 12:29:11
21	898	356.6880375148776	283.1321889019683	21/02/21 12:29:11
21	898	356.5719121972436	282.9710251346769	21/02/21 12:29:12
21	898	356.4503046324435	282.8022528662893	21/02/21 12:29:12
21	898	356.2760915560353	282.56047238053964	21/02/21 12:29:12
21	898	356.13257061504726	282.3612877754413	21/02/21 12:29:12
21	898	355.9935992563821	282.1684172785986	21/02/21 12:29:12
21	898	355.9935992563821	282.1684172785986	21/02/21 12:29:12
21	898	355.8336450835207	281.94642591945694	21/02/21 12:29:12
21	898	355.6964361455484	281.75600138671746	21/02/21 12:29:12
21	898	355.53063652557233	281.52589746179177	21/02/21 12:29:12
21	898	355.3718061841975	281.30546580487413	21/02/21 12:29:12
21	898	355.21729145851606	281.09102354714605	21/02/21 12:29:13
21	898	355.0726811098854	280.89032701473184	21/02/21 12:29:13
21	898	354.9241393748719	280.68417433327926	21/02/21 12:29:13
21	898	354.8079432980704	280.5229123633371	21/02/21 12:29:13
21	898	354.7104779882001	280.38764576653494	21/02/21 12:29:13
21	898	354.5823544693647	280.20983037369155	21/02/21 12:29:13
21	898	354.4666561272815	280.04925918164304	21/02/21 12:29:13
21	898	354.37501091029816	279.9220699629248	21/02/21 12:29:13
21	898	354.20866785654846	279.6912118369685	21/02/21 12:29:13
21	898	354.1111463515173	279.55586725007754	21/02/21 12:29:14
21	898	354.00351560760106	279.4064926217076	21/02/21 12:29:14
21	898	353.914493068417	279.2829432693264	21/02/21 12:29:14
21	898	353.79332648715126	279.11478301707064	21/02/21 12:29:14
21	898	353.79332648715126	279.11478301707064	21/02/21 12:29:14
21	898	353.6407085261043	278.902973171812	21/02/21 12:29:14
21	898	353.52576019146863	278.7434428727247	21/02/21 12:29:14
21	898	353.52576019146863	278.7434428727247	21/02/21 12:29:14
21	898	353.4243074910877	278.6026424019194	21/02/21 12:29:14
21	898	353.1596977726283	278.2354055240558	21/02/21 12:29:14
21	898	353.029565788331	278.05480269547576	21/02/21 12:29:15
21	898	352.88140363510456	277.8491768141391	21/02/21 12:29:15
21	898	352.88140363510456	277.8491768141391	21/02/21 12:29:15
21	898	352.77270472336005	277.69831973599156	21/02/21 12:29:15
21	898	352.5144832515818	277.3399487447622	21/02/21 12:29:15
21	898	352.36053676473483	277.12629511360717	21/02/21 12:29:15
21	898	352.245570248668	276.96673958153883	21/02/21 12:29:15
21	898	352.0873213903224	276.7471149320638	21/02/21 12:29:15
21	898	352.0873213903224	276.7471149320638	21/02/21 12:29:15
21	898	351.7903045174388	276.3349019955712	21/02/21 12:29:15
21	898	351.6717837723395	276.1704137498417	21/02/21 12:29:16
21	898	351.51419947951763	275.9517114133093	21/02/21 12:29:16
21	898	351.36971685699353	275.7511921447418	21/02/21 12:29:16
21	898	351.22365712675963	275.54848409749013	21/02/21 12:29:16
21	898	351.12935231362206	275.41760377553595	21/02/21 12:29:16
21	898	351.0211719328714	275.26746633725793	21/02/21 12:29:16
21	898	350.84958454449054	275.02932989557064	21/02/21 12:29:16
21	898	350.71554004727915	274.84329711137315	21/02/21 12:29:16
21	898	350.71554004727915	274.84329711137315	21/02/21 12:29:16
21	898	350.60206358535925	274.68580954126764	21/02/21 12:29:16
21	898	350.4753578001263	274.50996174078955	21/02/21 12:29:17
21	898	350.3700745412216	274.3638450542348	21/02/21 12:29:17
21	898	350.3700745412216	274.3638450542348	21/02/21 12:29:17
21	898	350.04739297833953	273.91601354454224	21/02/21 12:29:17
21	898	349.89166752144394	273.69989098136807	21/02/21 12:29:17
21	898	349.77382776075564	273.56343759943013	21/02/21 12:29:17
21	898	349.6644883540936	273.43766556078543	21/02/21 12:29:17
21	898	349.52288506732657	273.27478069979	21/02/21 12:29:17
21	898	349.52288506732657	273.27478069979	21/02/21 12:29:17
21	898	349.2893648935269	273.0061647522551	21/02/21 12:29:18
21	898	349.2893648935269	273.0061647522551	21/02/21 12:29:18
21	898	349.0514037396891	272.73244038928203	21/02/21 12:29:18
21	898	348.9278262746945	272.59029045288315	21/02/21 12:29:18
21	898	348.7507665657706	272.3866204199735	21/02/21 12:29:18
21	898	348.6283513978075	272.24580746236035	21/02/21 12:29:18
21	898	348.4752725529539	272.06972238033586	21/02/21 12:29:18
21	898	348.3058524670749	271.87484013029564	21/02/21 12:29:18
21	898	348.3058524670749	271.87484013029564	21/02/21 12:29:18
21	898	348.15156681510524	271.697366869975	21/02/21 12:29:18
21	898	347.86070012857317	271.36278579572405	21/02/21 12:29:19
21	898	347.86070012857317	271.36278579572405	21/02/21 12:29:19
21	898	347.75385838348745	271.23988679250084	21/02/21 12:29:19
21	931	347.56052241136496	271.0218703358418	21/02/21 12:29:19
21	931	347.3149600214916	270.7449604491758	21/02/21 12:29:19
21	931	347.12026397733024	270.52541029920843	21/02/21 12:29:19
21	931	347.12026397733024	270.52541029920843	21/02/21 12:29:19
21	931	346.97657840116227	270.36338240628584	21/02/21 12:29:19
21	931	346.711623775737	270.0646047500821	21/02/21 12:29:19
21	931	346.5746889648317	269.9101893976823	21/02/21 12:29:19
21	931	346.40610367487534	269.72008319469467	21/02/21 12:29:20
21	931	346.2660931575651	269.5621995037091	21/02/21 12:29:20
21	931	346.2660931575651	269.5621995037091	21/02/21 12:29:20
