floorId	partitionId	location_x	location_y	timeStamp
18	979	341.3179542174323	279.8134374747344	21/02/24 15:40:32
18	979	341.3179542174323	279.8134374747344	21/02/24 15:40:33
18	979	341.3179542174323	279.8134374747344	21/02/24 15:40:34
18	979	341.3179542174323	279.8134374747344	21/02/24 15:40:35
18	979	341.3179542174323	279.8134374747344	21/02/24 15:40:36
18	979	341.3179542174323	279.8134374747344	21/02/24 15:40:37
18	979	341.3179542174323	279.8134374747344	21/02/24 15:40:38
18	979	341.3179542174323	279.8134374747344	21/02/24 15:40:39
18	979	341.3179542174323	279.8134374747344	21/02/24 15:40:40
18	979	341.3179542174323	279.8134374747344	21/02/24 15:40:41
18	979	341.3179542174323	279.8134374747344	21/02/24 15:40:42
18	979	341.3179542174323	279.8134374747344	21/02/24 15:40:43
18	979	341.3179542174323	279.8134374747344	21/02/24 15:40:44
18	979	341.3179542174323	279.8134374747344	21/02/24 15:40:45
18	979	341.3179542174323	279.8134374747344	21/02/24 15:40:46
18	979	341.3179542174323	279.8134374747344	21/02/24 15:40:47
18	979	341.3179542174323	279.8134374747344	21/02/24 15:40:48
18	979	341.3179542174323	279.8134374747344	21/02/24 15:40:49
18	982	335.5707947754775	282.66660998132573	21/02/24 15:40:50
18	979	341.3179542174323	279.8134374747344	21/02/24 15:40:51
18	979	341.3179542174323	279.8134374747344	21/02/24 15:40:52
18	982	335.5707947754775	282.66660998132573	21/02/24 15:40:53
18	979	341.3179542174323	279.8134374747344	21/02/24 15:40:54
18	979	341.3179542174323	279.8134374747344	21/02/24 15:40:55
18	982	335.5707947754775	282.66660998132573	21/02/24 15:40:56
18	979	341.3179542174323	279.8134374747344	21/02/24 15:40:57
18	979	341.3179542174323	279.8134374747344	21/02/24 15:40:58
18	979	341.3179542174323	279.8134374747344	21/02/24 15:40:59
18	979	341.3179542174323	279.8134374747344	21/02/24 15:41:00
18	979	341.3179542174323	279.8134374747344	21/02/24 15:41:01
18	979	341.3179542174323	279.8134374747344	21/02/24 15:41:02
18	979	341.3179542174323	279.8134374747344	21/02/24 15:41:03
18	982	335.5707947754775	282.66660998132573	21/02/24 15:41:04
18	979	341.3179542174323	279.8134374747344	21/02/24 15:41:05
18	979	341.3179542174323	279.8134374747344	21/02/24 15:41:06
18	979	341.3179542174323	279.8134374747344	21/02/24 15:41:07
18	979	341.3179542174323	279.8134374747344	21/02/24 15:41:08
18	982	335.5707947754775	282.66660998132573	21/02/24 15:41:09
18	979	341.3179542174323	279.8134374747344	21/02/24 15:41:10
18	979	341.3179542174323	279.8134374747344	21/02/24 15:41:11
18	982	335.5707947754775	282.66660998132573	21/02/24 15:41:12
18	982	335.5707947754775	282.66660998132573	21/02/24 15:41:13
18	982	335.5707947754775	282.66660998132573	21/02/24 15:41:14
18	979	341.3179542174323	279.8134374747344	21/02/24 15:41:15
18	979	341.3179542174323	279.8134374747344	21/02/24 15:41:16
18	982	335.5707947754775	282.66660998132573	21/02/24 15:41:17
18	982	335.5707947754775	282.66660998132573	21/02/24 15:41:18
18	982	335.5707947754775	282.66660998132573	21/02/24 15:41:19
18	979	341.3179542174323	279.8134374747344	21/02/24 15:41:20
18	982	335.5707947754775	282.66660998132573	21/02/24 15:41:21
18	982	335.5707947754775	282.66660998132573	21/02/24 15:41:22
18	982	335.5707947754775	282.66660998132573	21/02/24 15:41:23
18	982	335.5707947754775	282.66660998132573	21/02/24 15:41:24
18	982	335.5707947754775	282.66660998132573	21/02/24 15:41:25
18	982	335.5707947754775	282.66660998132573	21/02/24 15:41:26
18	982	335.5707947754775	282.66660998132573	21/02/24 15:41:27
18	982	335.5707947754775	282.66660998132573	21/02/24 15:41:28
18	982	335.5707947754775	282.66660998132573	21/02/24 15:41:29
18	982	335.5707947754775	282.66660998132573	21/02/24 15:41:30
18	982	335.5707947754775	282.66660998132573	21/02/24 15:41:31
18	982	335.5707947754775	282.66660998132573	21/02/24 15:41:32
18	982	335.5707947754775	282.66660998132573	21/02/24 15:41:33
18	982	335.5707947754775	282.66660998132573	21/02/24 15:41:34
18	982	335.5707947754775	282.66660998132573	21/02/24 15:41:35
18	982	335.5707947754775	282.66660998132573	21/02/24 15:41:36
18	979	341.3179542174323	279.8134374747344	21/02/24 15:41:37
18	982	335.5707947754775	282.66660998132573	21/02/24 15:41:39
18	979	341.3179542174323	279.8134374747344	21/02/24 15:41:40
18	982	336.8789610560853	282.55920847249035	21/02/24 15:41:41
18	979	341.3179542174323	279.8134374747344	21/02/24 15:41:42
18	982	335.5707947754775	282.66660998132573	21/02/24 15:41:43
18	982	335.5707947754775	282.66660998132573	21/02/24 15:41:44
18	982	335.5707947754775	282.66660998132573	21/02/24 15:41:45
18	982	335.5707947754775	282.66660998132573	21/02/24 15:41:46
18	979	341.3179542174323	279.8134374747344	21/02/24 15:41:47
18	982	335.5707947754775	282.66660998132573	21/02/24 15:41:48
18	982	335.5707947754775	282.66660998132573	21/02/24 15:41:49
18	982	335.5707947754775	282.66660998132573	21/02/24 15:41:50
18	982	335.5707947754775	282.66660998132573	21/02/24 15:41:51
18	982	335.5707947754775	282.66660998132573	21/02/24 15:41:52
18	982	335.5707947754775	282.66660998132573	21/02/24 15:41:53
18	982	335.5707947754775	282.66660998132573	21/02/24 15:41:54
18	979	341.3179542174323	279.8134374747344	21/02/24 15:41:55
18	979	341.3179542174323	279.8134374747344	21/02/24 15:41:56
18	982	335.5707947754775	282.66660998132573	21/02/24 15:41:57
18	982	335.5707947754775	282.66660998132573	21/02/24 15:41:58
18	979	341.3179542174323	279.8134374747344	21/02/24 15:41:59
18	982	335.5707947754775	282.66660998132573	21/02/24 15:42:00
18	982	335.5707947754775	282.66660998132573	21/02/24 15:42:01
18	982	335.5707947754775	282.66660998132573	21/02/24 15:42:02
18	982	335.5707947754775	282.66660998132573	21/02/24 15:42:03
18	982	335.5707947754775	282.66660998132573	21/02/24 15:42:04
18	982	335.5707947754775	282.66660998132573	21/02/24 15:42:05
18	982	335.5707947754775	282.66660998132573	21/02/24 15:42:06
18	982	335.5707947754775	282.66660998132573	21/02/24 15:42:07
18	982	335.5707947754775	282.66660998132573	21/02/24 15:42:08
18	982	335.5707947754775	282.66660998132573	21/02/24 15:42:12
18	982	335.5707947754775	282.66660998132573	21/02/24 15:42:13
18	982	335.5707947754775	282.66660998132573	21/02/24 15:42:14
18	982	335.5707947754775	282.66660998132573	21/02/24 15:42:15
18	982	335.5707947754775	282.66660998132573	21/02/24 15:42:16
18	979	341.3179542174323	279.8134374747344	21/02/24 15:42:17
18	982	335.5707947754775	282.66660998132573	21/02/24 15:42:18
18	979	341.3179542174323	279.8134374747344	21/02/24 15:42:19
18	979	341.3179542174323	279.8134374747344	21/02/24 15:42:20
18	979	341.3179542174323	279.8134374747344	21/02/24 15:42:21
18	979	341.3179542174323	279.8134374747344	21/02/24 15:42:22
18	979	341.3179542174323	279.8134374747344	21/02/24 15:42:23
18	979	341.3179542174323	279.8134374747344	21/02/24 15:42:24
18	979	341.3179542174323	279.8134374747344	21/02/24 15:42:25
18	982	335.5707947754775	282.66660998132573	21/02/24 15:42:26
18	982	335.5707947754775	282.66660998132573	21/02/24 15:42:27
18	982	335.5707947754775	282.66660998132573	21/02/24 15:42:28
18	979	341.3179542174323	279.8134374747344	21/02/24 15:42:29
18	979	341.3179542174323	279.8134374747344	21/02/24 15:42:30
18	979	341.3179542174323	279.8134374747344	21/02/24 15:42:31
18	979	341.3179542174323	279.8134374747344	21/02/24 15:42:32
18	979	341.3179542174323	279.8134374747344	21/02/24 15:42:33
18	979	341.3179542174323	279.8134374747344	21/02/24 15:42:34
18	979	341.3179542174323	279.8134374747344	21/02/24 15:42:35
18	979	341.3179542174323	279.8134374747344	21/02/24 15:42:36
18	979	341.3179542174323	279.8134374747344	21/02/24 15:42:37
18	979	341.3179542174323	279.8134374747344	21/02/24 15:42:38
18	979	341.3179542174323	279.8134374747344	21/02/24 15:42:39
18	979	341.3179542174323	279.8134374747344	21/02/24 15:42:40
18	979	341.3179542174323	279.8134374747344	21/02/24 15:42:41
18	979	341.3179542174323	279.8134374747344	21/02/24 15:42:42
18	979	341.3179542174323	279.8134374747344	21/02/24 15:42:43
18	979	341.3179542174323	279.8134374747344	21/02/24 15:42:44
18	979	341.3179542174323	279.8134374747344	21/02/24 15:42:45
18	979	341.3179542174323	279.8134374747344	21/02/24 15:42:46
18	979	341.3179542174323	279.8134374747344	21/02/24 15:42:47
18	979	341.3179542174323	279.8134374747344	21/02/24 15:42:48
18	979	341.3179542174323	279.8134374747344	21/02/24 15:42:49
18	979	341.3179542174323	279.8134374747344	21/02/24 15:42:50
18	979	341.3179542174323	279.8134374747344	21/02/24 15:42:51
18	979	341.3179542174323	279.8134374747344	21/02/24 15:42:52
18	979	341.3179542174323	279.8134374747344	21/02/24 15:42:53
18	979	341.3179542174323	279.8134374747344	21/02/24 15:42:54
18	979	341.3179542174323	279.8134374747344	21/02/24 15:42:55
18	979	341.3179542174323	279.8134374747344	21/02/24 15:42:56
18	979	341.3179542174323	279.8134374747344	21/02/24 15:42:57
18	979	341.3179542174323	279.8134374747344	21/02/24 15:42:58
18	979	341.3179542174323	279.8134374747344	21/02/24 15:42:59
18	979	341.3179542174323	279.8134374747344	21/02/24 15:43:00
18	979	341.3179542174323	279.8134374747344	21/02/24 15:43:01
