floorId	partitionId	location_x	location_y	timeStamp
3	42	352.0898782617341	257.6816897320676	20/04/28 05:08:58
3	42	352.0898782617341	257.6816897320676	20/04/28 05:08:59
3	42	352.0898782617341	257.6816897320676	20/04/28 05:09:00
3	42	352.0898782617341	257.6816897320676	20/04/28 05:09:01
3	42	352.0898782617341	257.6816897320676	20/04/28 05:09:02
3	42	352.0898782617341	257.6816897320676	20/04/28 05:09:03
3	42	352.0898782617341	257.6816897320676	20/04/28 05:09:04
3	42	352.0898782617341	257.6816897320676	20/04/28 05:09:05
3	42	352.0898782617341	257.6816897320676	20/04/28 05:09:06
3	42	352.0898782617341	257.6816897320676	20/04/28 05:09:07
3	42	352.0898782617341	257.6816897320676	20/04/28 05:09:08
3	42	352.0898782617341	257.6816897320676	20/04/28 05:09:09
3	42	352.0898782617341	257.6816897320676	20/04/28 05:09:10
3	42	352.0898782617341	257.6816897320676	20/04/28 05:09:11
3	42	352.0898782617341	257.6816897320676	20/04/28 05:09:12
3	42	352.20974435218506	259.0612514241787	20/04/28 05:09:13
3	42	352.0898782617341	257.6816897320676	20/04/28 05:09:14
3	42	352.0898782617341	257.6816897320676	20/04/28 05:09:15
3	68	353.5787573247015	258.259240649203	20/04/28 05:09:16
3	68	353.5787573247015	258.2592406492029	20/04/28 05:09:17
3	42	352.0898782617341	257.6816897320676	20/04/28 05:09:18
3	54	352.9059324522066	261.07811147821695	20/04/28 05:09:19
3	42	352.0898782617341	257.6816897320676	20/04/28 05:09:20
3	68	353.5787573247015	258.2592406492029	20/04/28 05:09:21
3	68	353.5787573247015	258.2592406492029	20/04/28 05:09:22
3	42	352.0898782617341	257.6816897320676	20/04/28 05:09:23
3	42	352.0898782617341	257.6816897320676	20/04/28 05:09:24
3	42	352.0898782617341	257.6816897320676	20/04/28 05:09:25
3	42	352.0898782617341	257.6816897320676	20/04/28 05:09:26
3	42	352.0898782617341	257.6816897320676	20/04/28 05:09:27
3	42	352.0898782617341	257.6816897320676	20/04/28 05:09:28
3	68	354.4982598253989	256.5424320855769	20/04/28 05:09:29
3	42	352.0898782617341	257.6816897320676	20/04/28 05:09:30
3	68	354.0813137420346	255.73290488058717	20/04/28 05:09:31
3	68	355.5701928050021	256.31045579772257	20/04/28 05:09:32
3	68	354.4982598253989	256.5424320855769	20/04/28 05:09:33
3	68	354.4982598253989	256.5424320855769	20/04/28 05:09:34
3	68	354.0813137420346	255.73290488058717	20/04/28 05:09:35
3	42	352.0898782617341	257.6816897320676	20/04/28 05:09:36
3	68	354.0813137420346	255.73290488058717	20/04/28 05:09:37
3	68	354.0813137420346	255.73290488058717	20/04/28 05:09:38
3	68	354.4982598253989	256.5424320855769	20/04/28 05:09:39
3	68	354.0813137420346	255.73290488058717	20/04/28 05:09:40
3	68	354.0813137420346	255.73290488058717	20/04/28 05:09:41
3	68	354.4982598253989	256.5424320855769	20/04/28 05:09:43
3	68	354.0813137420346	255.73290488058717	20/04/28 05:09:44
3	68	354.08131374203464	255.73290488058714	20/04/28 05:09:45
3	68	354.08131374203464	255.73290488058714	20/04/28 05:09:46
3	68	354.0813137420346	255.73290488058717	20/04/28 05:09:47
3	68	354.0813137420346	255.73290488058717	20/04/28 05:09:48
3	68	354.4982598253989	256.5424320855769	20/04/28 05:09:49
3	68	354.08131374203464	255.73290488058714	20/04/28 05:09:50
3	68	354.08131374203464	255.73290488058714	20/04/28 05:09:51
3	68	354.0813137420346	255.73290488058717	20/04/28 05:09:52
3	68	354.08131374203464	255.73290488058714	20/04/28 05:09:53
3	42	352.0898782617341	257.6816897320676	20/04/28 05:09:54
3	68	354.08131374203464	255.73290488058714	20/04/28 05:09:55
3	42	352.0898782617341	257.6816897320676	20/04/28 05:09:56
3	68	354.08131374203464	255.73290488058714	20/04/28 05:09:57
3	68	354.08131374203464	255.73290488058714	20/04/28 05:09:58
3	42	352.0898782617341	257.6816897320676	20/04/28 05:09:59
3	42	352.0898782617341	257.6816897320676	20/04/28 05:10:00
3	42	352.0898782617341	257.6816897320676	20/04/28 05:10:01
3	42	352.0898782617341	257.6816897320676	20/04/28 05:10:02
3	42	352.0898782617341	257.6816897320676	20/04/28 05:10:03
3	42	352.0898782617341	257.6816897320676	20/04/28 05:10:04
3	68	354.0813137420346	255.73290488058717	20/04/28 05:10:05
3	68	354.0813137420346	255.73290488058717	20/04/28 05:10:06
3	68	354.0813137420346	255.73290488058717	20/04/28 05:10:07
3	68	354.08131374203464	255.73290488058714	20/04/28 05:10:08
3	68	354.08131374203464	255.73290488058714	20/04/28 05:10:09
3	68	354.0813137420346	255.73290488058717	20/04/28 05:10:10
3	68	354.0813137420346	255.73290488058717	20/04/28 05:10:11
3	68	354.0813137420346	255.73290488058717	20/04/28 05:10:12
3	68	354.0813137420346	255.73290488058717	20/04/28 05:10:13
3	68	354.0813137420346	255.73290488058717	20/04/28 05:10:14
3	68	354.0813137420346	255.73290488058717	20/04/28 05:10:15
3	68	354.0813137420346	255.73290488058717	20/04/28 05:10:16
3	68	354.0813137420346	255.73290488058717	20/04/28 05:10:17
3	68	354.0813137420346	255.73290488058717	20/04/28 05:10:18
3	68	357.80003138449274	255.68897868820252	20/04/28 05:10:19
3	68	357.80003138449274	255.68897868820252	20/04/28 05:10:20
3	68	354.4982598253989	256.5424320855769	20/04/28 05:10:21
3	68	357.80003138449274	255.68897868820252	20/04/28 05:10:22
3	68	357.80003138449274	255.68897868820252	20/04/28 05:10:23
3	68	357.80003138449274	255.68897868820252	20/04/28 05:10:24
3	68	354.0813137420346	255.73290488058717	20/04/28 05:10:25
3	42	352.0898782617341	257.6816897320676	20/04/28 05:10:26
3	42	352.20974435218506	259.0612514241787	20/04/28 05:10:27
3	54	354.93110780732565	263.85962413987545	20/04/28 05:10:28
3	34	358.6160855749653	259.08540043435187	20/04/28 05:10:29
3	54	358.23287936641947	263.0061707425011	20/04/28 05:10:30
3	54	359.408666544298	263.4150379716201	20/04/28 05:10:31
3	34	362.2167196060361	259.70189758364177	20/04/28 05:10:32
3	57	365.8336784609425	258.95489486040736	20/04/28 05:10:33
3	57	365.8336784609425	258.9548948604074	20/04/28 05:10:34
3	54	372.48785670166836	262.3595943162643	20/04/28 05:10:35
3	54	372.48785670166836	262.3595943162643	20/04/28 05:10:36
3	54	372.48785670166836	262.3595943162643	20/04/28 05:10:37
3	54	376.18269094789457	263.03655301878126	20/04/28 05:10:38
3	NULL	378.7058029092993	264.85282731993277	20/04/28 05:10:39
1	33	379.8755906118027	262.6421307240284	20/04/28 05:10:40
3	15	380.97239583354167	266.94453563659977	20/04/28 05:10:41
1	33	381.6109766893215	266.73786054806715	20/04/28 05:10:42
1	33	380.6150632356726	267.4744509522458	20/04/28 05:10:43
1	69	376.18075636557654	261.96517202151136	20/04/28 05:10:44
3	57	377.9566720707791	257.7033955780391	20/04/28 05:10:45
3	57	377.9566720707791	257.7033955780391	20/04/28 05:10:46
3	57	374.26377240687106	258.09781787279195	20/04/28 05:10:47
3	57	372.1191876279541	254.90991466941398	20/04/28 05:10:48
3	57	372.1191876279541	254.90991466941398	20/04/28 05:10:49
3	57	367.9225813006244	252.20998711858013	20/04/28 05:10:50
3	30	365.53445097535786	248.80973562593917	20/04/28 05:10:51
3	17	362.3945272480641	251.57317905073432	20/04/28 05:10:52
3	30	363.7510885757444	247.501779512455	20/04/28 05:10:53
3	23	361.39171706234237	243.1777661478346	20/04/28 05:10:54
3	30	361.5359815708335	246.73539932578205	20/04/28 05:10:55
3	23	364.04513168379253	243.80216821811885	20/04/28 05:10:56
3	30	363.12031496140963	247.33199182958694	20/04/28 05:10:57
3	30	361.5359815708335	246.73539932578205	20/04/28 05:10:58
3	23	364.04513168379253	243.80216821811885	20/04/28 05:10:59
3	30	363.12031496140963	247.33199182958694	20/04/28 05:11:00
3	30	363.7510885757444	247.501779512455	20/04/28 05:11:01
3	30	363.12031496140963	247.33199182958694	20/04/28 05:11:02
3	23	366.2602386887034	244.5685484047918	20/04/28 05:11:03
3	30	363.12031496140963	247.33199182958694	20/04/28 05:11:04
3	30	363.12031496140963	247.33199182958694	20/04/28 05:11:05
3	30	363.12031496140963	247.33199182958694	20/04/28 05:11:06
3	30	363.7510885757444	247.501779512455	20/04/28 05:11:07
3	23	362.97605045291857	243.77435865163943	20/04/28 05:11:08
3	23	366.2602386887035	244.5685484047918	20/04/28 05:11:09
3	30	363.7510885757444	247.501779512455	20/04/28 05:11:10
3	30	363.31934397044705	248.04335543926626	20/04/28 05:11:11
3	30	363.12031496140963	247.33199182958694	20/04/28 05:11:12
3	30	363.12031496140963	247.33199182958694	20/04/28 05:11:13
3	30	363.12031496140963	247.33199182958694	20/04/28 05:11:14
3	30	363.12031496140963	247.33199182958694	20/04/28 05:11:15
3	30	363.12031496140963	247.33199182958694	20/04/28 05:11:16
3	23	366.2602386887035	244.5685484047918	20/04/28 05:11:17
3	30	363.12031496140963	247.33199182958694	20/04/28 05:11:18
3	23	366.2602386887035	244.5685484047918	20/04/28 05:11:19
3	23	366.2602386887035	244.5685484047918	20/04/28 05:11:20
3	23	366.2602386887034	244.5685484047918	20/04/28 05:11:21
3	23	366.2602386887034	244.5685484047918	20/04/28 05:11:22
3	23	366.2602386887035	244.5685484047918	20/04/28 05:11:23
3	23	366.2602386887034	244.5685484047918	20/04/28 05:11:24
3	23	366.2602386887035	244.5685484047918	20/04/28 05:11:25
3	23	364.04513168379253	243.80216821811885	20/04/28 05:11:26
3	23	366.2602386887034	244.5685484047918	20/04/28 05:11:27
3	23	366.2602386887034	244.5685484047918	20/04/28 05:11:28
3	30	363.7510885757444	247.501779512455	20/04/28 05:11:29
3	23	366.2602386887035	244.5685484047918	20/04/28 05:11:30
3	30	363.7510885757444	247.501779512455	20/04/28 05:11:31
3	23	366.2602386887035	244.5685484047918	20/04/28 05:11:32
3	23	366.2602386887035	244.5685484047918	20/04/28 05:11:33
3	23	366.2602386887035	244.5685484047918	20/04/28 05:11:34
3	23	366.2602386887035	244.5685484047918	20/04/28 05:11:35
3	23	366.2602386887035	244.5685484047918	20/04/28 05:11:36
3	23	366.2602386887034	244.5685484047918	20/04/28 05:11:37
3	23	366.2602386887034	244.5685484047918	20/04/28 05:11:38
3	23	366.2602386887035	244.5685484047918	20/04/28 05:11:39
3	23	366.2602386887035	244.5685484047918	20/04/28 05:11:40
3	23	366.0274078202198	241.72892363871526	20/04/28 05:11:41
3	23	366.2602386887035	244.5685484047918	20/04/28 05:11:42
3	23	366.0274078202198	241.72892363871526	20/04/28 05:11:43
3	23	366.0274078202198	241.72892363871526	20/04/28 05:11:44
3	23	366.0274078202198	241.72892363871526	20/04/28 05:11:45
3	23	366.0274078202198	241.72892363871526	20/04/28 05:11:46
3	23	366.2602386887035	244.5685484047918	20/04/28 05:11:47
3	23	366.2602386887035	244.5685484047918	20/04/28 05:11:48
3	23	366.2602386887035	244.5685484047918	20/04/28 05:11:49
3	23	366.2602386887035	244.5685484047918	20/04/28 05:11:50
3	23	366.2602386887035	244.5685484047918	20/04/28 05:11:51
3	23	366.2602386887035	244.5685484047918	20/04/28 05:11:52
3	23	366.2602386887035	244.5685484047918	20/04/28 05:11:53
