floorId	partitionId	location_x	location_y	timeStamp
1	93	344.7301279798078	297.37843376747077	20/04/28 05:08:49
1	93	348.110653888928	295.4770984714876	20/04/28 05:08:50
1	93	346.99481232810876	294.3976869066291	20/04/28 05:08:51
1	93	346.99481232810876	294.3976869066291	20/04/28 05:08:52
1	93	344.7301279798078	297.37843376747077	20/04/28 05:08:53
1	93	346.99481232810876	294.3976869066291	20/04/28 05:08:54
1	93	346.9948123281087	294.3976869066291	20/04/28 05:08:55
1	93	346.9948123281087	294.3976869066291	20/04/28 05:08:56
1	93	346.9948123281087	294.3976869066291	20/04/28 05:08:57
1	93	346.9948123281087	294.3976869066291	20/04/28 05:08:58
1	82	348.29017066752317	292.7898006956261	20/04/28 05:08:59
1	82	348.29017066752317	292.7898006956261	20/04/28 05:09:00
1	93	346.9948123281087	294.3976869066291	20/04/28 05:09:01
1	82	348.472876999285	291.26365117910296	20/04/28 05:09:02
3	77	346.99481232810876	294.3976869066291	20/04/28 05:09:03
1	93	348.7911421417008	294.923012164702	20/04/28 05:09:04
1	93	346.99481232810876	294.3976869066291	20/04/28 05:09:05
1	82	348.29017066752317	292.7898006956261	20/04/28 05:09:06
1	82	348.29017066752317	292.7898006956261	20/04/28 05:09:07
1	82	348.29017066752317	292.7898006956261	20/04/28 05:09:08
1	82	348.29017066752317	292.7898006956261	20/04/28 05:09:09
3	36	348.29017066752317	292.7898006956261	20/04/28 05:09:10
1	82	348.29017066752317	292.7898006956261	20/04/28 05:09:11
1	82	348.29017066752317	292.7898006956261	20/04/28 05:09:12
1	93	346.9948123281087	294.3976869066291	20/04/28 05:09:13
1	82	348.29017066752317	292.7898006956261	20/04/28 05:09:14
1	82	348.472876999285	291.26365117910296	20/04/28 05:09:15
1	82	348.472876999285	291.26365117910296	20/04/28 05:09:16
1	82	348.29017066752317	292.7898006956261	20/04/28 05:09:17
1	82	348.472876999285	291.26365117910296	20/04/28 05:09:18
1	82	348.29017066752317	292.7898006956261	20/04/28 05:09:19
1	82	348.472876999285	291.26365117910296	20/04/28 05:09:20
1	82	348.472876999285	291.26365117910296	20/04/28 05:09:21
1	82	348.29017066752317	292.7898006956261	20/04/28 05:09:22
1	82	348.29017066752317	292.7898006956261	20/04/28 05:09:23
1	82	348.472876999285	291.26365117910296	20/04/28 05:09:24
1	82	348.29017066752317	292.7898006956261	20/04/28 05:09:25
1	82	348.472876999285	291.26365117910296	20/04/28 05:09:26
1	82	348.29017066752317	292.7898006956261	20/04/28 05:09:27
1	82	346.05498604687926	292.08927636913313	20/04/28 05:09:28
1	82	348.472876999285	291.26365117910296	20/04/28 05:09:29
1	82	348.472876999285	291.26365117910296	20/04/28 05:09:30
1	82	350.70087249709155	291.4730387824524	20/04/28 05:09:31
1	82	348.472876999285	291.26365117910296	20/04/28 05:09:32
1	82	348.472876999285	291.26365117910296	20/04/28 05:09:33
1	82	348.472876999285	291.26365117910296	20/04/28 05:09:34
1	82	348.29017066752317	292.7898006956261	20/04/28 05:09:35
1	82	348.472876999285	291.26365117910296	20/04/28 05:09:36
1	82	348.472876999285	291.26365117910296	20/04/28 05:09:37
1	82	348.472876999285	291.26365117910296	20/04/28 05:09:38
1	82	348.472876999285	291.26365117910296	20/04/28 05:09:39
1	82	348.472876999285	291.26365117910296	20/04/28 05:09:40
1	82	348.29017066752317	292.7898006956261	20/04/28 05:09:41
1	93	346.9948123281087	294.3976869066291	20/04/28 05:09:42
1	82	345.34511821306813	292.1393708426793	20/04/28 05:09:43
1	82	345.34511821306813	292.1393708426793	20/04/28 05:09:44
1	83	343.2895913836919	291.76684736212025	20/04/28 05:09:45
1	83	342.55544985905226	291.2309163740584	20/04/28 05:09:46
1	97	336.93802742136114	291.11775827377863	20/04/28 05:09:47
1	16	332.69684747555283	292.85469640213324	20/04/28 05:09:48
1	16	332.8122687465561	289.8560550768475	20/04/28 05:09:49
1	16	332.8122687465561	289.8560550768475	20/04/28 05:09:50
1	16	332.8122687465561	289.8560550768475	20/04/28 05:09:51
1	16	332.8122687465561	289.8560550768475	20/04/28 05:09:52
1	16	330.7112852509547	290.02883889396327	20/04/28 05:09:53
1	16	332.8122687465561	289.8560550768475	20/04/28 05:09:54
1	16	330.7112852509547	290.02883889396327	20/04/28 05:09:55
1	16	330.7112852509547	290.02883889396327	20/04/28 05:09:56
1	16	332.8122687465561	289.8560550768475	20/04/28 05:09:57
1	16	332.8122687465561	289.8560550768475	20/04/28 05:09:58
1	16	330.7112852509547	290.02883889396327	20/04/28 05:09:59
1	16	332.8122687465561	289.8560550768475	20/04/28 05:10:00
1	16	332.8122687465561	289.8560550768475	20/04/28 05:10:01
1	16	332.8122687465561	289.8560550768475	20/04/28 05:10:02
1	16	332.8122687465561	289.8560550768475	20/04/28 05:10:03
1	16	332.8122687465561	289.8560550768475	20/04/28 05:10:04
1	16	332.8122687465561	289.8560550768475	20/04/28 05:10:05
1	16	330.7112852509547	290.02883889396327	20/04/28 05:10:06
1	16	330.7112852509547	290.02883889396327	20/04/28 05:10:07
1	16	330.7112852509547	290.02883889396327	20/04/28 05:10:08
1	16	332.8122687465561	289.8560550768475	20/04/28 05:10:09
1	16	330.7112852509547	290.02883889396327	20/04/28 05:10:10
1	16	332.8122687465561	289.8560550768475	20/04/28 05:10:11
1	16	330.7112852509547	290.02883889396327	20/04/28 05:10:12
1	16	330.7112852509547	290.02883889396327	20/04/28 05:10:13
1	16	330.7112852509547	290.02883889396327	20/04/28 05:10:14
1	16	332.8122687465561	289.8560550768475	20/04/28 05:10:15
1	16	330.7112852509547	290.02883889396327	20/04/28 05:10:16
1	16	330.7112852509547	290.02883889396327	20/04/28 05:10:17
1	16	330.7112852509547	290.02883889396327	20/04/28 05:10:18
1	16	330.7112852509547	290.02883889396327	20/04/28 05:10:19
1	16	330.7112852509547	290.02883889396327	20/04/28 05:10:20
1	16	332.8122687465561	289.8560550768475	20/04/28 05:10:21
1	16	330.7112852509547	290.02883889396327	20/04/28 05:10:22
1	16	330.7112852509547	290.02883889396327	20/04/28 05:10:23
1	16	330.7112852509547	290.02883889396327	20/04/28 05:10:24
1	16	330.7112852509547	290.02883889396327	20/04/28 05:10:25
1	16	330.7112852509547	290.02883889396327	20/04/28 05:10:26
1	16	330.7112852509547	290.02883889396327	20/04/28 05:10:27
1	16	330.7112852509547	290.02883889396327	20/04/28 05:10:28
1	16	330.7112852509547	290.02883889396327	20/04/28 05:10:29
1	16	333.6120509508386	288.24272462152425	20/04/28 05:10:30
1	16	330.7112852509547	290.02883889396327	20/04/28 05:10:31
1	16	330.7112852509547	290.02883889396327	20/04/28 05:10:32
1	16	330.7112852509547	290.02883889396327	20/04/28 05:10:33
1	16	330.7112852509547	290.02883889396327	20/04/28 05:10:34
1	16	330.7112852509547	290.02883889396327	20/04/28 05:10:35
1	16	330.7112852509547	290.02883889396327	20/04/28 05:10:36
1	16	330.7112852509547	290.02883889396327	20/04/28 05:10:37
1	16	330.7112852509547	290.02883889396327	20/04/28 05:10:38
1	16	333.6120509508386	288.24272462152425	20/04/28 05:10:39
1	16	330.7112852509547	290.02883889396327	20/04/28 05:10:40
1	16	330.7112852509547	290.02883889396327	20/04/28 05:10:41
1	16	333.6120509508386	288.24272462152425	20/04/28 05:10:42
1	16	330.7112852509547	290.02883889396327	20/04/28 05:10:43
1	16	333.6120509508386	288.24272462152425	20/04/28 05:10:44
1	16	333.6120509508386	288.24272462152425	20/04/28 05:10:45
1	16	330.7112852509547	290.02883889396327	20/04/28 05:10:46
1	16	330.7112852509547	290.02883889396327	20/04/28 05:10:47
1	16	330.7112852509547	290.02883889396327	20/04/28 05:10:48
1	16	333.6120509508386	288.24272462152425	20/04/28 05:10:49
1	16	333.6120509508386	288.24272462152425	20/04/28 05:10:50
1	16	332.7077691920645	288.6453460671986	20/04/28 05:10:51
1	16	333.6120509508386	288.24272462152425	20/04/28 05:10:52
1	16	333.6120509508386	288.24272462152425	20/04/28 05:10:53
1	16	330.7112852509547	290.02883889396327	20/04/28 05:10:54
1	16	330.7112852509547	290.02883889396327	20/04/28 05:10:55
1	16	333.6120509508386	288.24272462152425	20/04/28 05:10:56
1	16	333.6120509508386	288.24272462152425	20/04/28 05:10:57
1	16	333.6120509508386	288.24272462152425	20/04/28 05:10:58
1	16	330.7112852509547	290.02883889396327	20/04/28 05:10:59
1	16	332.8122687465561	289.8560550768475	20/04/28 05:11:00
1	16	333.6120509508386	288.24272462152425	20/04/28 05:11:01
1	16	330.7112852509547	290.02883889396327	20/04/28 05:11:02
