floorId	partitionId	location_x	location_y	timeStamp
3	36	350.70087249709167	291.4730387824524	20/04/28 05:08:49
1	82	350.70087249709155	291.4730387824524	20/04/28 05:08:50
1	82	350.70087249709155	291.4730387824524	20/04/28 05:08:51
3	36	350.70087249709167	291.4730387824524	20/04/28 05:08:52
1	82	350.70087249709155	291.4730387824524	20/04/28 05:08:53
1	82	350.70087249709167	291.4730387824524	20/04/28 05:08:54
1	82	350.70087249709167	291.4730387824524	20/04/28 05:08:55
3	36	350.70087249709167	291.4730387824524	20/04/28 05:08:56
1	82	350.70087249709155	291.4730387824524	20/04/28 05:08:57
1	82	351.7764171888766	290.7732575814182	20/04/28 05:08:58
1	82	351.7764171888766	290.7732575814182	20/04/28 05:08:59
1	82	355.0234475282757	292.22188160108976	20/04/28 05:09:00
3	36	352.89225874969594	291.8526691462767	20/04/28 05:09:01
3	36	353.94790283649064	292.921662802124	20/04/28 05:09:02
3	36	350.70087249709155	291.4730387824524	20/04/28 05:09:03
3	24	350.5213557184964	294.16033655831393	20/04/28 05:09:04
3	NULL	348.110653888928	295.4770984714876	20/04/28 05:09:05
3	24	349.22280782591537	294.60707450997853	20/04/28 05:09:06
1	93	349.22280782591537	294.60707450997853	20/04/28 05:09:07
3	36	349.58871856010427	292.3430627439615	20/04/28 05:09:08
3	24	349.22280782591537	294.60707450997853	20/04/28 05:09:09
3	36	350.70087249709167	291.4730387824524	20/04/28 05:09:10
3	36	348.29017066752317	292.7898006956261	20/04/28 05:09:11
3	36	351.5937108571149	292.29940709794136	20/04/28 05:09:12
1	93	349.22280782591537	294.60707450997853	20/04/28 05:09:13
1	93	349.22280782591537	294.60707450997853	20/04/28 05:09:14
1	93	349.22280782591537	294.60707450997853	20/04/28 05:09:15
1	93	346.9948123281087	294.3976869066291	20/04/28 05:09:16
1	93	346.9948123281087	294.3976869066291	20/04/28 05:09:17
1	93	346.9948123281087	294.3976869066291	20/04/28 05:09:18
1	83	344.22577515324355	292.51825808104485	20/04/28 05:09:19
1	97	340.7799935809384	292.30431416119154	20/04/28 05:09:20
3	100	340.06293662429005	291.86327191159415	20/04/28 05:09:21
1	16	334.92107324599436	291.9053892024602	20/04/28 05:09:22
1	16	332.6968474755529	292.85469640213324	20/04/28 05:09:23
1	16	332.8122687465561	289.8560550768475	20/04/28 05:09:24
1	16	330.7112852509547	290.02883889396327	20/04/28 05:09:25
1	16	330.7112852509547	290.02883889396327	20/04/28 05:09:26
1	16	330.7112852509547	290.02883889396327	20/04/28 05:09:27
1	16	331.4676744232893	287.4418968722384	20/04/28 05:09:28
1	16	333.6120509508386	288.24272462152425	20/04/28 05:09:29
1	16	331.4676744232893	287.4418968722384	20/04/28 05:09:30
1	16	331.4676744232893	287.4418968722384	20/04/28 05:09:31
1	16	333.6120509508386	288.24272462152425	20/04/28 05:09:32
1	16	333.6120509508386	288.24272462152425	20/04/28 05:09:33
1	16	331.4676744232893	287.4418968722384	20/04/28 05:09:34
1	16	331.4676744232892	287.44189687223826	20/04/28 05:09:35
1	16	330.7112852509547	290.02883889396327	20/04/28 05:09:36
1	16	331.4676744232892	287.44189687223826	20/04/28 05:09:37
1	16	331.4676744232893	287.4418968722384	20/04/28 05:09:38
1	NULL	329.51418849486976	287.81038907531865	20/04/28 05:09:39
1	16	331.4676744232893	287.4418968722384	20/04/28 05:09:40
1	16	330.7112852509547	290.02883889396327	20/04/28 05:09:41
1	NULL	329.51418849486976	287.81038907531865	20/04/28 05:09:42
1	16	330.71128525095463	290.0288388939632	20/04/28 05:09:43
1	16	330.7112852509547	290.02883889396327	20/04/28 05:09:44
1	16	330.71128525095463	290.0288388939632	20/04/28 05:09:45
1	16	330.7112852509547	290.02883889396327	20/04/28 05:09:46
1	16	330.7112852509547	290.02883889396327	20/04/28 05:09:47
1	16	330.71128525095463	290.0288388939632	20/04/28 05:09:48
1	16	330.7112852509547	290.02883889396327	20/04/28 05:09:49
1	16	330.7112852509547	290.02883889396327	20/04/28 05:09:50
1	16	330.7112852509547	290.02883889396327	20/04/28 05:09:51
1	16	330.7112852509547	290.02883889396327	20/04/28 05:09:52
1	16	330.7112852509547	290.02883889396327	20/04/28 05:09:53
1	16	330.7112852509547	290.02883889396327	20/04/28 05:09:54
1	16	330.7112852509547	290.02883889396327	20/04/28 05:09:55
1	16	330.7112852509547	290.02883889396327	20/04/28 05:09:56
1	16	330.7112852509547	290.02883889396327	20/04/28 05:09:57
1	16	330.71128525095463	290.0288388939632	20/04/28 05:09:58
1	16	330.71128525095463	290.0288388939632	20/04/28 05:09:59
1	16	330.71128525095463	290.0288388939632	20/04/28 05:10:00
1	16	330.7112852509547	290.02883889396327	20/04/28 05:10:01
1	16	330.71128525095463	290.0288388939632	20/04/28 05:10:02
1	16	330.71128525095463	290.0288388939632	20/04/28 05:10:03
1	16	330.71128525095463	290.0288388939632	20/04/28 05:10:04
1	16	330.7112852509547	290.02883889396327	20/04/28 05:10:05
1	16	330.71128525095463	290.0288388939632	20/04/28 05:10:06
1	16	330.71128525095463	290.0288388939632	20/04/28 05:10:07
1	16	330.7112852509547	290.02883889396327	20/04/28 05:10:08
1	16	330.7112852509547	290.02883889396327	20/04/28 05:10:09
1	16	330.7112852509547	290.02883889396327	20/04/28 05:10:10
1	16	330.7112852509547	290.02883889396327	20/04/28 05:10:11
1	16	331.4676744232893	287.4418968722384	20/04/28 05:10:12
1	16	331.4676744232893	287.4418968722384	20/04/28 05:10:13
1	16	331.4676744232892	287.44189687223826	20/04/28 05:10:14
1	NULL	329.51418849486976	287.81038907531865	20/04/28 05:10:15
1	16	331.4676744232892	287.44189687223826	20/04/28 05:10:16
1	16	331.4676744232892	287.44189687223826	20/04/28 05:10:17
1	16	331.4676744232893	287.4418968722384	20/04/28 05:10:18
1	16	330.7112852509547	290.02883889396327	20/04/28 05:10:19
1	16	331.4676744232893	287.4418968722384	20/04/28 05:10:20
1	59	328.4407986778504	285.9338174083828	20/04/28 05:10:21
1	16	331.4676744232892	287.44189687223826	20/04/28 05:10:22
1	16	331.4676744232892	287.44189687223826	20/04/28 05:10:23
1	9	330.97608613091967	284.75697995058835	20/04/28 05:10:24
1	9	330.97608613091967	284.75697995058835	20/04/28 05:10:25
1	9	330.97608613091967	284.75697995058835	20/04/28 05:10:26
1	9	330.97608613091967	284.75697995058835	20/04/28 05:10:27
1	16	332.41495419475365	286.0242748028796	20/04/28 05:10:28
