floorId	partitionId	location_x	location_y	timeStamp
1	93	348.110653888928	295.4770984714876	20/04/28 05:08:49
1	93	346.99481232810876	294.3976869066291	20/04/28 05:08:50
1	93	346.99481232810876	294.3976869066291	20/04/28 05:08:51
1	82	348.472876999285	291.26365117910296	20/04/28 05:08:52
1	93	346.9948123281087	294.3976869066291	20/04/28 05:08:53
1	82	348.29017066752317	292.7898006956261	20/04/28 05:08:54
1	82	348.472876999285	291.26365117910296	20/04/28 05:08:55
1	82	348.29017066752317	292.7898006956261	20/04/28 05:08:56
1	82	348.472876999285	291.26365117910296	20/04/28 05:08:57
1	82	348.472876999285	291.26365117910296	20/04/28 05:08:58
1	82	348.29017066752317	292.7898006956261	20/04/28 05:08:59
1	82	348.472876999285	291.26365117910296	20/04/28 05:09:00
1	93	346.9948123281087	294.3976869066291	20/04/28 05:09:01
1	93	346.9948123281087	294.3976869066291	20/04/28 05:09:02
1	82	346.05498604687926	292.08927636913313	20/04/28 05:09:03
1	82	348.29017066752317	292.7898006956261	20/04/28 05:09:04
1	93	346.9948123281087	294.3976869066291	20/04/28 05:09:05
1	93	346.9948123281087	294.3976869066291	20/04/28 05:09:06
1	82	348.29017066752317	292.7898006956261	20/04/28 05:09:07
1	82	348.29017066752317	292.7898006956261	20/04/28 05:09:08
1	93	348.7911421417008	294.923012164702	20/04/28 05:09:09
1	93	346.99481232810876	294.3976869066291	20/04/28 05:09:10
1	93	346.9948123281087	294.3976869066291	20/04/28 05:09:11
1	93	346.9948123281087	294.3976869066291	20/04/28 05:09:12
1	93	346.99481232810876	294.3976869066291	20/04/28 05:09:13
1	82	348.29017066752317	292.7898006956261	20/04/28 05:09:14
1	93	349.22280782591537	294.60707450997853	20/04/28 05:09:15
1	82	348.29017066752317	292.7898006956261	20/04/28 05:09:16
1	82	348.29017066752317	292.7898006956261	20/04/28 05:09:17
1	93	348.110653888928	295.4770984714876	20/04/28 05:09:18
1	93	346.9948123281087	294.3976869066291	20/04/28 05:09:19
1	93	346.9948123281087	294.3976869066291	20/04/28 05:09:20
1	93	346.99481232810876	294.3976869066291	20/04/28 05:09:21
1	93	346.99481232810876	294.3976869066291	20/04/28 05:09:22
1	93	346.99481232810876	294.3976869066291	20/04/28 05:09:23
1	93	348.110653888928	295.4770984714876	20/04/28 05:09:24
3	NULL	348.110653888928	295.4770984714876	20/04/28 05:09:25
1	93	346.99481232810876	294.3976869066291	20/04/28 05:09:26
1	93	348.110653888928	295.4770984714876	20/04/28 05:09:27
1	93	346.9948123281087	294.3976869066291	20/04/28 05:09:28
1	93	346.99481232810876	294.3976869066291	20/04/28 05:09:29
1	93	346.99481232810876	294.3976869066291	20/04/28 05:09:30
1	93	346.99481232810876	294.3976869066291	20/04/28 05:09:31
1	93	346.99481232810876	294.3976869066291	20/04/28 05:09:32
1	93	345.16560143447305	294.82666861854074	20/04/28 05:09:33
3	NULL	348.110653888928	295.4770984714876	20/04/28 05:09:34
1	93	344.7301279798078	297.37843376747077	20/04/28 05:09:35
1	93	346.99481232810876	294.3976869066291	20/04/28 05:09:36
1	93	346.99481232810876	294.3976869066291	20/04/28 05:09:37
1	93	346.99481232810876	294.3976869066291	20/04/28 05:09:38
1	93	346.99481232810876	294.3976869066291	20/04/28 05:09:39
3	77	346.99481232810876	294.3976869066291	20/04/28 05:09:40
1	93	344.7301279798078	297.37843376747077	20/04/28 05:09:41
3	77	346.99481232810876	294.3976869066291	20/04/28 05:09:42
3	77	344.7301279798078	297.37843376747077	20/04/28 05:09:43
1	93	344.7301279798078	297.37843376747077	20/04/28 05:09:44
3	77	346.99481232810876	294.3976869066291	20/04/28 05:09:45
1	93	348.110653888928	295.4770984714876	20/04/28 05:09:46
1	93	348.110653888928	295.4770984714876	20/04/28 05:09:47
1	93	344.7301279798078	297.37843376747077	20/04/28 05:09:48
3	77	346.99481232810876	294.3976869066291	20/04/28 05:09:49
3	77	346.99481232810876	294.3976869066291	20/04/28 05:09:50
3	77	344.7301279798078	297.37843376747077	20/04/28 05:09:51
3	77	344.7301279798078	297.37843376747077	20/04/28 05:09:52
3	77	344.7301279798078	297.37843376747077	20/04/28 05:09:53
1	93	345.8754692682841	294.7765741449946	20/04/28 05:09:54
1	93	344.7301279798078	297.37843376747077	20/04/28 05:09:55
1	93	344.7301279798078	297.37843376747077	20/04/28 05:09:56
1	93	344.7301279798078	297.37843376747077	20/04/28 05:09:57
3	77	344.7301279798078	297.37843376747077	20/04/28 05:09:58
3	77	344.7301279798077	297.37843376747077	20/04/28 05:09:59
1	93	344.7301279798078	297.37843376747077	20/04/28 05:10:00
1	93	344.7301279798078	297.37843376747077	20/04/28 05:10:01
3	NULL	348.110653888928	295.4770984714876	20/04/28 05:10:02
3	77	344.7301279798078	297.37843376747077	20/04/28 05:10:03
3	77	344.7301279798078	297.37843376747077	20/04/28 05:10:04
3	77	344.7301279798078	297.37843376747077	20/04/28 05:10:05
3	77	344.7301279798078	297.37843376747077	20/04/28 05:10:06
