deviceId	device_location_x	device_location_y	rssi_measurement	timeStamp
8	335.18908653775424	273.64277610272416	-67	21/02/21 12:24:02
23	330.6764275924185	279.5887246759348	-66	21/02/21 12:24:02
25	323.1833154830733	277.6040507255065	-60	21/02/21 12:24:02
10	323.0502130932265	281.62588160894785	-65	21/02/21 12:24:02
6	337.04454004665996	273.25643905156295	-68	21/02/21 12:24:02
7	327.7449897754536	270.4181144613178	-56	21/02/21 12:24:02
14	339.94288768566685	270.20726744103035	-71	21/02/21 12:24:02
20	331.61914505200315	268.4880246133412	-62	21/02/21 12:24:02
30	328.07937707734857	267.3032546469616	-55	21/02/21 12:24:02
21	333.7333032313522	265.34260958227395	-64	21/02/21 12:24:02
29	322.1123294790049	269.2232534149863	-35	21/02/21 12:24:02
24	321.10158544309553	278.01477212573917	-60	21/02/21 12:24:02
28	319.26031784491215	284.64721387467006	-69	21/02/21 12:24:02
11	316.7021736546535	282.6227620614726	-66	21/02/21 12:24:02
38	314.8977849114711	286.85646554275206	-69	21/02/21 12:24:02
39	310.81308531710044	284.506294925849	-72	21/02/21 12:24:02
41	309.82870033354214	266.4102080744689	-62	21/02/21 12:24:02
43	309.3127830305578	276.2289980291384	-68	21/02/21 12:24:02
42	308.5311189694193	268.2749847222526	-67	21/02/21 12:24:02

8	335.18908653775424	273.64277610272416	-63	21/02/21 12:24:03
23	330.6764275924185	279.5887246759348	-65	21/02/21 12:24:03
25	323.1833154830733	277.6040507255065	-58	21/02/21 12:24:03
10	323.0502130932265	281.62588160894785	-65	21/02/21 12:24:03
17	322.8754502998156	289.2268238104236	-72	21/02/21 12:24:03
6	337.04454004665996	273.25643905156295	-65	21/02/21 12:24:03
7	327.7449897754536	270.4181144613178	-52	21/02/21 12:24:03
14	339.94288768566685	270.20726744103035	-68	21/02/21 12:24:03
20	331.61914505200315	268.4880246133412	-58	21/02/21 12:24:03
30	328.07937707734857	267.3032546469616	-52	21/02/21 12:24:03
21	333.7333032313522	265.34260958227395	-64	21/02/21 12:24:03
29	322.1123294790049	269.2232534149863	-29	21/02/21 12:24:03
24	321.10158544309553	278.01477212573917	-61	21/02/21 12:24:03
28	319.26031784491215	284.64721387467006	-68	21/02/21 12:24:03
11	316.7021736546535	282.6227620614726	-65	21/02/21 12:24:03
38	314.8977849114711	286.85646554275206	-69	21/02/21 12:24:03
39	310.81308531710044	284.506294925849	-70	21/02/21 12:24:03
41	309.82870033354214	266.4102080744689	-65	21/02/21 12:24:03
43	309.3127830305578	276.2289980291384	-68	21/02/21 12:24:03
42	308.5311189694193	268.2749847222526	-66	21/02/21 12:24:03

45	341.6241027740285	277.6995631173448	-68	21/02/21 12:24:04
8	335.18908653775424	273.64277610272416	-63	21/02/21 12:24:04
23	330.6764275924185	279.5887246759348	-64	21/02/21 12:24:04
25	323.1833154830733	277.6040507255065	-58	21/02/21 12:24:04
10	323.0502130932265	281.62588160894785	-64	21/02/21 12:24:04
17	322.8754502998156	289.2268238104236	-70	21/02/21 12:24:04
6	337.04454004665996	273.25643905156295	-64	21/02/21 12:24:04
7	327.7449897754536	270.4181144613178	-46	21/02/21 12:24:04
14	339.94288768566685	270.20726744103035	-67	21/02/21 12:24:04
20	331.61914505200315	268.4880246133412	-57	21/02/21 12:24:04
13	343.2999250966318	267.57435812307386	-71	21/02/21 12:24:04
30	328.07937707734857	267.3032546469616	-48	21/02/21 12:24:04
21	333.7333032313522	265.34260958227395	-60	21/02/21 12:24:04
29	322.1123294790049	269.2232534149863	-45	21/02/21 12:24:04
24	321.10158544309553	278.01477212573917	-59	21/02/21 12:24:04
28	319.26031784491215	284.64721387467006	-68	21/02/21 12:24:04
11	316.7021736546535	282.6227620614726	-66	21/02/21 12:24:04
41	309.82870033354214	266.4102080744689	-69	21/02/21 12:24:04
43	309.3127830305578	276.2289980291384	-69	21/02/21 12:24:04
42	308.5311189694193	268.2749847222526	-70	21/02/21 12:24:04

45	341.6241027740285	277.6995631173448	-67	21/02/21 12:24:05
8	335.18908653775424	273.64277610272416	-61	21/02/21 12:24:05
23	330.6764275924185	279.5887246759348	-62	21/02/21 12:24:05
25	323.1833154830733	277.6040507255065	-62	21/02/21 12:24:05
10	323.0502130932265	281.62588160894785	-64	21/02/21 12:24:05
17	322.8754502998156	289.2268238104236	-72	21/02/21 12:24:05
6	337.04454004665996	273.25643905156295	-61	21/02/21 12:24:05
7	327.7449897754536	270.4181144613178	-28	21/02/21 12:24:05
14	339.94288768566685	270.20726744103035	-63	21/02/21 12:24:05
20	331.61914505200315	268.4880246133412	-50	21/02/21 12:24:05
13	343.2999250966318	267.57435812307386	-68	21/02/21 12:24:05
30	328.07937707734857	267.3032546469616	-43	21/02/21 12:24:05
21	333.7333032313522	265.34260958227395	-58	21/02/21 12:24:05
31	345.2775751581305	263.5870918256099	-68	21/02/21 12:24:05
29	322.1123294790049	269.2232534149863	-52	21/02/21 12:24:05
24	321.10158544309553	278.01477212573917	-62	21/02/21 12:24:05
28	319.26031784491215	284.64721387467006	-68	21/02/21 12:24:05
11	316.7021736546535	282.6227620614726	-70	21/02/21 12:24:05
41	309.82870033354214	266.4102080744689	-69	21/02/21 12:24:05
43	309.3127830305578	276.2289980291384	-71	21/02/21 12:24:05
42	308.5311189694193	268.2749847222526	-70	21/02/21 12:24:05

45	341.6241027740285	277.6995631173448	-65	21/02/21 12:24:06
8	335.18908653775424	273.64277610272416	-54	21/02/21 12:24:06
23	330.6764275924185	279.5887246759348	-63	21/02/21 12:24:06
25	323.1833154830733	277.6040507255065	-63	21/02/21 12:24:06
10	323.0502130932265	281.62588160894785	-64	21/02/21 12:24:06
6	337.04454004665996	273.25643905156295	-58	21/02/21 12:24:06
7	327.7449897754536	270.4181144613178	-43	21/02/21 12:24:06
14	339.94288768566685	270.20726744103035	-63	21/02/21 12:24:06
20	331.61914505200315	268.4880246133412	-41	21/02/21 12:24:06
13	343.2999250966318	267.57435812307386	-65	21/02/21 12:24:06
30	328.07937707734857	267.3032546469616	-45	21/02/21 12:24:06
21	333.7333032313522	265.34260958227395	-55	21/02/21 12:24:06
31	345.2775751581305	263.5870918256099	-70	21/02/21 12:24:06
29	322.1123294790049	269.2232534149863	-57	21/02/21 12:24:06
24	321.10158544309553	278.01477212573917	-63	21/02/21 12:24:06
28	319.26031784491215	284.64721387467006	-69	21/02/21 12:24:06
11	316.7021736546535	282.6227620614726	-68	21/02/21 12:24:06

22	348.76402647654106	277.5698827491972	-71	21/02/21 12:24:07
45	341.6241027740285	277.6995631173448	-67	21/02/21 12:24:07
8	335.18908653775424	273.64277610272416	-55	21/02/21 12:24:07
23	330.6764275924185	279.5887246759348	-60	21/02/21 12:24:07
25	323.1833154830733	277.6040507255065	-62	21/02/21 12:24:07
10	323.0502130932265	281.62588160894785	-65	21/02/21 12:24:07
6	337.04454004665996	273.25643905156295	-59	21/02/21 12:24:07
7	327.7449897754536	270.4181144613178	-45	21/02/21 12:24:07
14	339.94288768566685	270.20726744103035	-60	21/02/21 12:24:07
20	331.61914505200315	268.4880246133412	-33	21/02/21 12:24:07
13	343.2999250966318	267.57435812307386	-63	21/02/21 12:24:07
30	328.07937707734857	267.3032546469616	-45	21/02/21 12:24:07
21	333.7333032313522	265.34260958227395	-53	21/02/21 12:24:07
31	345.2775751581305	263.5870918256099	-65	21/02/21 12:24:07
29	322.1123294790049	269.2232534149863	-61	21/02/21 12:24:07
24	321.10158544309553	278.01477212573917	-66	21/02/21 12:24:07
28	319.26031784491215	284.64721387467006	-71	21/02/21 12:24:07
11	316.7021736546535	282.6227620614726	-72	21/02/21 12:24:07

