deviceId	device_location_x	device_location_y	rssi_measurement	timeStamp
27	361.7760445803703	289.2690199455797	-70	21/02/24 15:47:21
37	359.5903712498935	284.92420131943135	-67	21/02/24 15:47:21
40	360.29771601412074	275.17301637315114	-69	21/02/24 15:47:21
47	353.57917457908314	286.3943403818769	-64	21/02/24 15:47:21
22	353.27733584284437	275.76541045955213	-60	21/02/24 15:47:21
45	342.3105096677226	291.9842245930836	-63	21/02/24 15:47:21
46	340.76419739931424	294.4321023101609	-67	21/02/24 15:47:21
8	337.0569612312978	272.24137590202855	-63	21/02/24 15:47:21
24	330.2572237413254	276.8419321591195	-66	21/02/24 15:47:21
25	329.08778489613	275.87564892517275	-68	21/02/24 15:47:21
11	327.4246457091771	282.6323525733639	-68	21/02/24 15:47:21
7	334.07657006354464	270.8835908324035	-65	21/02/24 15:47:21
33	361.5531569646988	270.2693072733871	-69	21/02/24 15:47:21
32	356.7839379367616	268.70688981904533	-69	21/02/24 15:47:21
31	346.4179037622539	268.10202267794875	-61	21/02/24 15:47:21
13	342.0775229118143	267.91244197819304	-65	21/02/24 15:47:21
21	334.5994402908936	265.9434918767382	-69	21/02/24 15:47:21
14	341.6082252010515	265.6547772450898	-68	21/02/24 15:47:21
20	334.99735462161357	264.77807460530994	-70	21/02/24 15:47:21

27	361.7760445803703	289.2690199455797	-71	21/02/24 15:47:22
37	359.5903712498935	284.92420131943135	-66	21/02/24 15:47:22
40	360.29771601412074	275.17301637315114	-69	21/02/24 15:47:22
47	353.57917457908314	286.3943403818769	-63	21/02/24 15:47:22
22	353.27733584284437	275.76541045955213	-60	21/02/24 15:47:22
45	342.3105096677226	291.9842245930836	-65	21/02/24 15:47:22
46	340.76419739931424	294.4321023101609	-68	21/02/24 15:47:22
8	337.0569612312978	272.24137590202855	-61	21/02/24 15:47:22
24	330.2572237413254	276.8419321591195	-65	21/02/24 15:47:22
25	329.08778489613	275.87564892517275	-66	21/02/24 15:47:22
11	327.4246457091771	282.6323525733639	-67	21/02/24 15:47:22
7	334.07657006354464	270.8835908324035	-64	21/02/24 15:47:22
33	361.5531569646988	270.2693072733871	-70	21/02/24 15:47:22
32	356.7839379367616	268.70688981904533	-66	21/02/24 15:47:22
31	346.4179037622539	268.10202267794875	-61	21/02/24 15:47:22
13	342.0775229118143	267.91244197819304	-62	21/02/24 15:47:22
21	334.5994402908936	265.9434918767382	-67	21/02/24 15:47:22
14	341.6082252010515	265.6547772450898	-67	21/02/24 15:47:22
20	334.99735462161357	264.77807460530994	-70	21/02/24 15:47:22

27	361.7760445803703	289.2690199455797	-71	21/02/24 15:47:23
37	359.5903712498935	284.92420131943135	-67	21/02/24 15:47:23
40	360.29771601412074	275.17301637315114	-67	21/02/24 15:47:23
47	353.57917457908314	286.3943403818769	-60	21/02/24 15:47:23
22	353.27733584284437	275.76541045955213	-58	21/02/24 15:47:23
45	342.3105096677226	291.9842245930836	-64	21/02/24 15:47:23
46	340.76419739931424	294.4321023101609	-69	21/02/24 15:47:23
8	337.0569612312978	272.24137590202855	-62	21/02/24 15:47:23
24	330.2572237413254	276.8419321591195	-68	21/02/24 15:47:23
25	329.08778489613	275.87564892517275	-68	21/02/24 15:47:23
11	327.4246457091771	282.6323525733639	-70	21/02/24 15:47:23
7	334.07657006354464	270.8835908324035	-69	21/02/24 15:47:23
33	361.5531569646988	270.2693072733871	-69	21/02/24 15:47:23
32	356.7839379367616	268.70688981904533	-66	21/02/24 15:47:23
31	346.4179037622539	268.10202267794875	-62	21/02/24 15:47:23
13	342.0775229118143	267.91244197819304	-66	21/02/24 15:47:23
21	334.5994402908936	265.9434918767382	-68	21/02/24 15:47:23
14	341.6082252010515	265.6547772450898	-68	21/02/24 15:47:23
20	334.99735462161357	264.77807460530994	-71	21/02/24 15:47:23

27	361.7760445803703	289.2690199455797	-66	21/02/24 15:47:24
26	365.69275229012084	288.9526077496502	-72	21/02/24 15:47:24
37	359.5903712498935	284.92420131943135	-65	21/02/24 15:47:24
40	360.29771601412074	275.17301637315114	-66	21/02/24 15:47:24
47	353.57917457908314	286.3943403818769	-58	21/02/24 15:47:24
22	353.27733584284437	275.76541045955213	-56	21/02/24 15:47:24
45	342.3105096677226	291.9842245930836	-65	21/02/24 15:47:24
46	340.76419739931424	294.4321023101609	-69	21/02/24 15:47:24
8	337.0569612312978	272.24137590202855	-64	21/02/24 15:47:24
24	330.2572237413254	276.8419321591195	-69	21/02/24 15:47:24
25	329.08778489613	275.87564892517275	-71	21/02/24 15:47:24
7	334.07657006354464	270.8835908324035	-67	21/02/24 15:47:24
33	361.5531569646988	270.2693072733871	-67	21/02/24 15:47:24
32	356.7839379367616	268.70688981904533	-65	21/02/24 15:47:24
31	346.4179037622539	268.10202267794875	-62	21/02/24 15:47:24
13	342.0775229118143	267.91244197819304	-67	21/02/24 15:47:24
21	334.5994402908936	265.9434918767382	-69	21/02/24 15:47:24
14	341.6082252010515	265.6547772450898	-67	21/02/24 15:47:24

27	361.7760445803703	289.2690199455797	-65	21/02/24 15:47:25
26	365.69275229012084	288.9526077496502	-70	21/02/24 15:47:25
9	369.1884989117563	287.5678363426809	-70	21/02/24 15:47:25
37	359.5903712498935	284.92420131943135	-59	21/02/24 15:47:25
40	360.29771601412074	275.17301637315114	-62	21/02/24 15:47:25
47	353.57917457908314	286.3943403818769	-56	21/02/24 15:47:25
22	353.27733584284437	275.76541045955213	-52	21/02/24 15:47:25
45	342.3105096677226	291.9842245930836	-68	21/02/24 15:47:25
46	340.76419739931424	294.4321023101609	-68	21/02/24 15:47:25
8	337.0569612312978	272.24137590202855	-69	21/02/24 15:47:25
7	334.07657006354464	270.8835908324035	-70	21/02/24 15:47:25
33	361.5531569646988	270.2693072733871	-68	21/02/24 15:47:25
32	356.7839379367616	268.70688981904533	-63	21/02/24 15:47:25
31	346.4179037622539	268.10202267794875	-65	21/02/24 15:47:25
13	342.0775229118143	267.91244197819304	-67	21/02/24 15:47:25
14	341.6082252010515	265.6547772450898	-71	21/02/24 15:47:25

27	361.7760445803703	289.2690199455797	-65	21/02/24 15:47:26
26	365.69275229012084	288.9526077496502	-68	21/02/24 15:47:26
9	369.1884989117563	287.5678363426809	-70	21/02/24 15:47:26
37	359.5903712498935	284.92420131943135	-59	21/02/24 15:47:26
12	371.0513379138651	279.4455722502708	-70	21/02/24 15:47:26
40	360.29771601412074	275.17301637315114	-59	21/02/24 15:47:26
47	353.57917457908314	286.3943403818769	-54	21/02/24 15:47:26
22	353.27733584284437	275.76541045955213	-52	21/02/24 15:47:26
45	342.3105096677226	291.9842245930836	-67	21/02/24 15:47:26
46	340.76419739931424	294.4321023101609	-70	21/02/24 15:47:26
8	337.0569612312978	272.24137590202855	-69	21/02/24 15:47:26
33	361.5531569646988	270.2693072733871	-66	21/02/24 15:47:26
32	356.7839379367616	268.70688981904533	-64	21/02/24 15:47:26
31	346.4179037622539	268.10202267794875	-67	21/02/24 15:47:26
13	342.0775229118143	267.91244197819304	-69	21/02/24 15:47:26
14	341.6082252010515	265.6547772450898	-68	21/02/24 15:47:26

27	361.7760445803703	289.2690199455797	-62	21/02/24 15:47:27
26	365.69275229012084	288.9526077496502	-64	21/02/24 15:47:27
9	369.1884989117563	287.5678363426809	-67	21/02/24 15:47:27
37	359.5903712498935	284.92420131943135	-53	21/02/24 15:47:27
34	374.2599083722957	283.9138922785015	-71	21/02/24 15:47:27
12	371.0513379138651	279.4455722502708	-69	21/02/24 15:47:27
40	360.29771601412074	275.17301637315114	-59	21/02/24 15:47:27
47	353.57917457908314	286.3943403818769	-54	21/02/24 15:47:27
22	353.27733584284437	275.76541045955213	-54	21/02/24 15:47:27
45	342.3105096677226	291.9842245930836	-66	21/02/24 15:47:27
46	340.76419739931424	294.4321023101609	-71	21/02/24 15:47:27
33	361.5531569646988	270.2693072733871	-66	21/02/24 15:47:27
32	356.7839379367616	268.70688981904533	-66	21/02/24 15:47:27
31	346.4179037622539	268.10202267794875	-68	21/02/24 15:47:27
13	342.0775229118143	267.91244197819304	-70	21/02/24 15:47:27

27	361.7760445803703	289.2690199455797	-59	21/02/24 15:47:28
26	365.69275229012084	288.9526077496502	-64	21/02/24 15:47:28
36	375.5585779585396	288.8705845625357	-68	21/02/24 15:47:28
35	375.6269429107988	288.30982657685854	-72	21/02/24 15:47:28
9	369.1884989117563	287.5678363426809	-64	21/02/24 15:47:28
37	359.5903712498935	284.92420131943135	-47	21/02/24 15:47:28
34	374.2599083722957	283.9138922785015	-68	21/02/24 15:47:28
41	375.39943266704637	281.4134213737185	-70	21/02/24 15:47:28
12	371.0513379138651	279.4455722502708	-67	21/02/24 15:47:28
40	360.29771601412074	275.17301637315114	-58	21/02/24 15:47:28
47	353.57917457908314	286.3943403818769	-56	21/02/24 15:47:28
22	353.27733584284437	275.76541045955213	-60	21/02/24 15:47:28
45	342.3105096677226	291.9842245930836	-69	21/02/24 15:47:28
33	361.5531569646988	270.2693072733871	-65	21/02/24 15:47:28
32	356.7839379367616	268.70688981904533	-67	21/02/24 15:47:28
31	346.4179037622539	268.10202267794875	-71	21/02/24 15:47:28

27	361.7760445803703	289.2690199455797	-59	21/02/24 15:47:29
26	365.69275229012084	288.9526077496502	-59	21/02/24 15:47:29
36	375.5585779585396	288.8705845625357	-67	21/02/24 15:47:29
35	375.6269429107988	288.30982657685854	-70	21/02/24 15:47:29
9	369.1884989117563	287.5678363426809	-62	21/02/24 15:47:29
37	359.5903712498935	284.92420131943135	-45	21/02/24 15:47:29
34	374.2599083722957	283.9138922785015	-65	21/02/24 15:47:29
41	375.39943266704637	281.4134213737185	-65	21/02/24 15:47:29
12	371.0513379138651	279.4455722502708	-62	21/02/24 15:47:29
19	377.44631063296276	276.33039616173164	-68	21/02/24 15:47:29
40	360.29771601412074	275.17301637315114	-55	21/02/24 15:47:29
47	353.57917457908314	286.3943403818769	-58	21/02/24 15:47:29
22	353.27733584284437	275.76541045955213	-61	21/02/24 15:47:29
33	361.5531569646988	270.2693072733871	-65	21/02/24 15:47:29
32	356.7839379367616	268.70688981904533	-66	21/02/24 15:47:29
31	346.4179037622539	268.10202267794875	-70	21/02/24 15:47:29

27	361.7760445803703	289.2690199455797	-57	21/02/24 15:47:30
26	365.69275229012084	288.9526077496502	-57	21/02/24 15:47:30
36	375.5585779585396	288.8705845625357	-68	21/02/24 15:47:30
35	375.6269429107988	288.30982657685854	-65	21/02/24 15:47:30
9	369.1884989117563	287.5678363426809	-59	21/02/24 15:47:30
37	359.5903712498935	284.92420131943135	-47	21/02/24 15:47:30
34	374.2599083722957	283.9138922785015	-62	21/02/24 15:47:30
41	375.39943266704637	281.4134213737185	-63	21/02/24 15:47:30
12	371.0513379138651	279.4455722502708	-62	21/02/24 15:47:30
19	377.44631063296276	276.33039616173164	-67	21/02/24 15:47:30
40	360.29771601412074	275.17301637315114	-57	21/02/24 15:47:30
47	353.57917457908314	286.3943403818769	-62	21/02/24 15:47:30
22	353.27733584284437	275.76541045955213	-64	21/02/24 15:47:30
33	361.5531569646988	270.2693072733871	-63	21/02/24 15:47:30
32	356.7839379367616	268.70688981904533	-67	21/02/24 15:47:30

27	361.7760445803703	289.2690199455797	-58	21/02/24 15:47:31
26	365.69275229012084	288.9526077496502	-57	21/02/24 15:47:31
36	375.5585779585396	288.8705845625357	-64	21/02/24 15:47:31
35	375.6269429107988	288.30982657685854	-66	21/02/24 15:47:31
9	369.1884989117563	287.5678363426809	-56	21/02/24 15:47:31
37	359.5903712498935	284.92420131943135	-54	21/02/24 15:47:31
34	374.2599083722957	283.9138922785015	-61	21/02/24 15:47:31
41	375.39943266704637	281.4134213737185	-64	21/02/24 15:47:31
12	371.0513379138651	279.4455722502708	-56	21/02/24 15:47:31
19	377.44631063296276	276.33039616173164	-67	21/02/24 15:47:31
40	360.29771601412074	275.17301637315114	-61	21/02/24 15:47:31
47	353.57917457908314	286.3943403818769	-64	21/02/24 15:47:31
22	353.27733584284437	275.76541045955213	-65	21/02/24 15:47:31
33	361.5531569646988	270.2693072733871	-63	21/02/24 15:47:31
32	356.7839379367616	268.70688981904533	-68	21/02/24 15:47:31

27	361.7760445803703	289.2690199455797	-60	21/02/24 15:47:32
26	365.69275229012084	288.9526077496502	-54	21/02/24 15:47:32
36	375.5585779585396	288.8705845625357	-63	21/02/24 15:47:32
35	375.6269429107988	288.30982657685854	-64	21/02/24 15:47:32
9	369.1884989117563	287.5678363426809	-55	21/02/24 15:47:32
37	359.5903712498935	284.92420131943135	-60	21/02/24 15:47:32
34	374.2599083722957	283.9138922785015	-57	21/02/24 15:47:32
41	375.39943266704637	281.4134213737185	-58	21/02/24 15:47:32
12	371.0513379138651	279.4455722502708	-52	21/02/24 15:47:32
19	377.44631063296276	276.33039616173164	-65	21/02/24 15:47:32
40	360.29771601412074	275.17301637315114	-61	21/02/24 15:47:32
47	353.57917457908314	286.3943403818769	-65	21/02/24 15:47:32
22	353.27733584284437	275.76541045955213	-68	21/02/24 15:47:32
33	361.5531569646988	270.2693072733871	-65	21/02/24 15:47:32
32	356.7839379367616	268.70688981904533	-68	21/02/24 15:47:32

27	361.7760445803703	289.2690199455797	-62	21/02/24 15:47:33
26	365.69275229012084	288.9526077496502	-56	21/02/24 15:47:33
36	375.5585779585396	288.8705845625357	-61	21/02/24 15:47:33
35	375.6269429107988	288.30982657685854	-58	21/02/24 15:47:33
9	369.1884989117563	287.5678363426809	-50	21/02/24 15:47:33
37	359.5903712498935	284.92420131943135	-62	21/02/24 15:47:33
34	374.2599083722957	283.9138922785015	-53	21/02/24 15:47:33
41	375.39943266704637	281.4134213737185	-58	21/02/24 15:47:33
12	371.0513379138651	279.4455722502708	-50	21/02/24 15:47:33
19	377.44631063296276	276.33039616173164	-63	21/02/24 15:47:33
40	360.29771601412074	275.17301637315114	-63	21/02/24 15:47:33
47	353.57917457908314	286.3943403818769	-69	21/02/24 15:47:33
22	353.27733584284437	275.76541045955213	-70	21/02/24 15:47:33
33	361.5531569646988	270.2693072733871	-68	21/02/24 15:47:33
32	356.7839379367616	268.70688981904533	-71	21/02/24 15:47:33

27	361.7760445803703	289.2690199455797	-62	21/02/24 15:47:34
26	365.69275229012084	288.9526077496502	-55	21/02/24 15:47:34
36	375.5585779585396	288.8705845625357	-58	21/02/24 15:47:34
35	375.6269429107988	288.30982657685854	-55	21/02/24 15:47:34
9	369.1884989117563	287.5678363426809	-45	21/02/24 15:47:34
37	359.5903712498935	284.92420131943135	-61	21/02/24 15:47:34
34	374.2599083722957	283.9138922785015	-53	21/02/24 15:47:34
41	375.39943266704637	281.4134213737185	-57	21/02/24 15:47:34
12	371.0513379138651	279.4455722502708	-52	21/02/24 15:47:34
19	377.44631063296276	276.33039616173164	-63	21/02/24 15:47:34
40	360.29771601412074	275.17301637315114	-64	21/02/24 15:47:34
47	353.57917457908314	286.3943403818769	-68	21/02/24 15:47:34
22	353.27733584284437	275.76541045955213	-72	21/02/24 15:47:34
33	361.5531569646988	270.2693072733871	-68	21/02/24 15:47:34

27	361.7760445803703	289.2690199455797	-61	21/02/24 15:47:35
26	365.69275229012084	288.9526077496502	-53	21/02/24 15:47:35
36	375.5585779585396	288.8705845625357	-53	21/02/24 15:47:35
35	375.6269429107988	288.30982657685854	-53	21/02/24 15:47:35
9	369.1884989117563	287.5678363426809	-41	21/02/24 15:47:35
37	359.5903712498935	284.92420131943135	-64	21/02/24 15:47:35
34	374.2599083722957	283.9138922785015	-51	21/02/24 15:47:35
41	375.39943266704637	281.4134213737185	-57	21/02/24 15:47:35
12	371.0513379138651	279.4455722502708	-55	21/02/24 15:47:35
19	377.44631063296276	276.33039616173164	-62	21/02/24 15:47:35
40	360.29771601412074	275.17301637315114	-65	21/02/24 15:47:35
47	353.57917457908314	286.3943403818769	-66	21/02/24 15:47:35
22	353.27733584284437	275.76541045955213	-69	21/02/24 15:47:35
33	361.5531569646988	270.2693072733871	-68	21/02/24 15:47:35

27	361.7760445803703	289.2690199455797	-59	21/02/24 15:47:36
26	365.69275229012084	288.9526077496502	-54	21/02/24 15:47:36
36	375.5585779585396	288.8705845625357	-55	21/02/24 15:47:36
35	375.6269429107988	288.30982657685854	-54	21/02/24 15:47:36
9	369.1884989117563	287.5678363426809	-42	21/02/24 15:47:36
37	359.5903712498935	284.92420131943135	-63	21/02/24 15:47:36
34	374.2599083722957	283.9138922785015	-53	21/02/24 15:47:36
41	375.39943266704637	281.4134213737185	-58	21/02/24 15:47:36
12	371.0513379138651	279.4455722502708	-57	21/02/24 15:47:36
19	377.44631063296276	276.33039616173164	-62	21/02/24 15:47:36
40	360.29771601412074	275.17301637315114	-67	21/02/24 15:47:36
47	353.57917457908314	286.3943403818769	-69	21/02/24 15:47:36
22	353.27733584284437	275.76541045955213	-71	21/02/24 15:47:36
33	361.5531569646988	270.2693072733871	-71	21/02/24 15:47:36

27	361.7760445803703	289.2690199455797	-62	21/02/24 15:47:37
26	365.69275229012084	288.9526077496502	-54	21/02/24 15:47:37
36	375.5585779585396	288.8705845625357	-53	21/02/24 15:47:37
35	375.6269429107988	288.30982657685854	-54	21/02/24 15:47:37
9	369.1884989117563	287.5678363426809	-36	21/02/24 15:47:37
37	359.5903712498935	284.92420131943135	-63	21/02/24 15:47:37
34	374.2599083722957	283.9138922785015	-52	21/02/24 15:47:37
41	375.39943266704637	281.4134213737185	-58	21/02/24 15:47:37
12	371.0513379138651	279.4455722502708	-59	21/02/24 15:47:37
19	377.44631063296276	276.33039616173164	-63	21/02/24 15:47:37
40	360.29771601412074	275.17301637315114	-66	21/02/24 15:47:37
47	353.57917457908314	286.3943403818769	-70	21/02/24 15:47:37
33	361.5531569646988	270.2693072733871	-68	21/02/24 15:47:37

27	361.7760445803703	289.2690199455797	-63	21/02/24 15:47:38
26	365.69275229012084	288.9526077496502	-54	21/02/24 15:47:38
36	375.5585779585396	288.8705845625357	-54	21/02/24 15:47:38
35	375.6269429107988	288.30982657685854	-51	21/02/24 15:47:38
9	369.1884989117563	287.5678363426809	-44	21/02/24 15:47:38
37	359.5903712498935	284.92420131943135	-62	21/02/24 15:47:38
34	374.2599083722957	283.9138922785015	-50	21/02/24 15:47:38
41	375.39943266704637	281.4134213737185	-55	21/02/24 15:47:38
12	371.0513379138651	279.4455722502708	-57	21/02/24 15:47:38
19	377.44631063296276	276.33039616173164	-62	21/02/24 15:47:38
40	360.29771601412074	275.17301637315114	-66	21/02/24 15:47:38
47	353.57917457908314	286.3943403818769	-67	21/02/24 15:47:38
33	361.5531569646988	270.2693072733871	-68	21/02/24 15:47:38

27	361.7760445803703	289.2690199455797	-63	21/02/24 15:47:39
26	365.69275229012084	288.9526077496502	-56	21/02/24 15:47:39
36	375.5585779585396	288.8705845625357	-50	21/02/24 15:47:39
35	375.6269429107988	288.30982657685854	-50	21/02/24 15:47:39
9	369.1884989117563	287.5678363426809	-47	21/02/24 15:47:39
37	359.5903712498935	284.92420131943135	-63	21/02/24 15:47:39
34	374.2599083722957	283.9138922785015	-46	21/02/24 15:47:39
41	375.39943266704637	281.4134213737185	-55	21/02/24 15:47:39
12	371.0513379138651	279.4455722502708	-59	21/02/24 15:47:39
19	377.44631063296276	276.33039616173164	-63	21/02/24 15:47:39
40	360.29771601412074	275.17301637315114	-67	21/02/24 15:47:39
47	353.57917457908314	286.3943403818769	-67	21/02/24 15:47:39
33	361.5531569646988	270.2693072733871	-70	21/02/24 15:47:39

27	361.7760445803703	289.2690199455797	-63	21/02/24 15:47:40
26	365.69275229012084	288.9526077496502	-57	21/02/24 15:47:40
36	375.5585779585396	288.8705845625357	-53	21/02/24 15:47:40
35	375.6269429107988	288.30982657685854	-53	21/02/24 15:47:40
9	369.1884989117563	287.5678363426809	-47	21/02/24 15:47:40
37	359.5903712498935	284.92420131943135	-66	21/02/24 15:47:40
34	374.2599083722957	283.9138922785015	-47	21/02/24 15:47:40
41	375.39943266704637	281.4134213737185	-53	21/02/24 15:47:40
12	371.0513379138651	279.4455722502708	-58	21/02/24 15:47:40
19	377.44631063296276	276.33039616173164	-62	21/02/24 15:47:40
40	360.29771601412074	275.17301637315114	-66	21/02/24 15:47:40
47	353.57917457908314	286.3943403818769	-68	21/02/24 15:47:40
33	361.5531569646988	270.2693072733871	-68	21/02/24 15:47:40

27	361.7760445803703	289.2690199455797	-64	21/02/24 15:47:41
26	365.69275229012084	288.9526077496502	-55	21/02/24 15:47:41
36	375.5585779585396	288.8705845625357	-53	21/02/24 15:47:41
35	375.6269429107988	288.30982657685854	-53	21/02/24 15:47:41
9	369.1884989117563	287.5678363426809	-48	21/02/24 15:47:41
37	359.5903712498935	284.92420131943135	-63	21/02/24 15:47:41
34	374.2599083722957	283.9138922785015	-45	21/02/24 15:47:41
41	375.39943266704637	281.4134213737185	-53	21/02/24 15:47:41
12	371.0513379138651	279.4455722502708	-55	21/02/24 15:47:41
19	377.44631063296276	276.33039616173164	-64	21/02/24 15:47:41
40	360.29771601412074	275.17301637315114	-69	21/02/24 15:47:41
47	353.57917457908314	286.3943403818769	-68	21/02/24 15:47:41
33	361.5531569646988	270.2693072733871	-69	21/02/24 15:47:41

27	361.7760445803703	289.2690199455797	-62	21/02/24 15:47:42
26	365.69275229012084	288.9526077496502	-57	21/02/24 15:47:42
36	375.5585779585396	288.8705845625357	-51	21/02/24 15:47:42
35	375.6269429107988	288.30982657685854	-51	21/02/24 15:47:42
9	369.1884989117563	287.5678363426809	-45	21/02/24 15:47:42
37	359.5903712498935	284.92420131943135	-64	21/02/24 15:47:42
34	374.2599083722957	283.9138922785015	-49	21/02/24 15:47:42
41	375.39943266704637	281.4134213737185	-53	21/02/24 15:47:42
12	371.0513379138651	279.4455722502708	-57	21/02/24 15:47:42
19	377.44631063296276	276.33039616173164	-65	21/02/24 15:47:42
40	360.29771601412074	275.17301637315114	-69	21/02/24 15:47:42
47	353.57917457908314	286.3943403818769	-70	21/02/24 15:47:42
33	361.5531569646988	270.2693072733871	-68	21/02/24 15:47:42

27	361.7760445803703	289.2690199455797	-61	21/02/24 15:47:43
26	365.69275229012084	288.9526077496502	-54	21/02/24 15:47:43
36	375.5585779585396	288.8705845625357	-51	21/02/24 15:47:43
35	375.6269429107988	288.30982657685854	-48	21/02/24 15:47:43
9	369.1884989117563	287.5678363426809	-45	21/02/24 15:47:43
37	359.5903712498935	284.92420131943135	-65	21/02/24 15:47:43
34	374.2599083722957	283.9138922785015	-49	21/02/24 15:47:43
41	375.39943266704637	281.4134213737185	-55	21/02/24 15:47:43
12	371.0513379138651	279.4455722502708	-58	21/02/24 15:47:43
19	377.44631063296276	276.33039616173164	-63	21/02/24 15:47:43
40	360.29771601412074	275.17301637315114	-68	21/02/24 15:47:43
47	353.57917457908314	286.3943403818769	-68	21/02/24 15:47:43
33	361.5531569646988	270.2693072733871	-72	21/02/24 15:47:43

27	361.7760445803703	289.2690199455797	-62	21/02/24 15:47:44
26	365.69275229012084	288.9526077496502	-56	21/02/24 15:47:44
36	375.5585779585396	288.8705845625357	-49	21/02/24 15:47:44
35	375.6269429107988	288.30982657685854	-50	21/02/24 15:47:44
9	369.1884989117563	287.5678363426809	-44	21/02/24 15:47:44
37	359.5903712498935	284.92420131943135	-66	21/02/24 15:47:44
34	374.2599083722957	283.9138922785015	-51	21/02/24 15:47:44
41	375.39943266704637	281.4134213737185	-55	21/02/24 15:47:44
12	371.0513379138651	279.4455722502708	-58	21/02/24 15:47:44
19	377.44631063296276	276.33039616173164	-64	21/02/24 15:47:44
40	360.29771601412074	275.17301637315114	-69	21/02/24 15:47:44
47	353.57917457908314	286.3943403818769	-68	21/02/24 15:47:44

27	361.7760445803703	289.2690199455797	-62	21/02/24 15:47:45
26	365.69275229012084	288.9526077496502	-54	21/02/24 15:47:45
36	375.5585779585396	288.8705845625357	-49	21/02/24 15:47:45
35	375.6269429107988	288.30982657685854	-50	21/02/24 15:47:45
9	369.1884989117563	287.5678363426809	-42	21/02/24 15:47:45
37	359.5903712498935	284.92420131943135	-64	21/02/24 15:47:45
34	374.2599083722957	283.9138922785015	-54	21/02/24 15:47:45
41	375.39943266704637	281.4134213737185	-57	21/02/24 15:47:45
12	371.0513379138651	279.4455722502708	-60	21/02/24 15:47:45
19	377.44631063296276	276.33039616173164	-64	21/02/24 15:47:45
40	360.29771601412074	275.17301637315114	-68	21/02/24 15:47:45
47	353.57917457908314	286.3943403818769	-69	21/02/24 15:47:45

27	361.7760445803703	289.2690199455797	-61	21/02/24 15:47:46
26	365.69275229012084	288.9526077496502	-51	21/02/24 15:47:46
36	375.5585779585396	288.8705845625357	-51	21/02/24 15:47:46
35	375.6269429107988	288.30982657685854	-52	21/02/24 15:47:46
9	369.1884989117563	287.5678363426809	-40	21/02/24 15:47:46
37	359.5903712498935	284.92420131943135	-62	21/02/24 15:47:46
34	374.2599083722957	283.9138922785015	-55	21/02/24 15:47:46
41	375.39943266704637	281.4134213737185	-57	21/02/24 15:47:46
12	371.0513379138651	279.4455722502708	-59	21/02/24 15:47:46
19	377.44631063296276	276.33039616173164	-64	21/02/24 15:47:46
40	360.29771601412074	275.17301637315114	-70	21/02/24 15:47:46
47	353.57917457908314	286.3943403818769	-69	21/02/24 15:47:46

27	361.7760445803703	289.2690199455797	-60	21/02/24 15:47:47
26	365.69275229012084	288.9526077496502	-52	21/02/24 15:47:47
36	375.5585779585396	288.8705845625357	-52	21/02/24 15:47:47
35	375.6269429107988	288.30982657685854	-53	21/02/24 15:47:47
9	369.1884989117563	287.5678363426809	-36	21/02/24 15:47:47
37	359.5903712498935	284.92420131943135	-63	21/02/24 15:47:47
34	374.2599083722957	283.9138922785015	-55	21/02/24 15:47:47
41	375.39943266704637	281.4134213737185	-60	21/02/24 15:47:47
12	371.0513379138651	279.4455722502708	-59	21/02/24 15:47:47
19	377.44631063296276	276.33039616173164	-67	21/02/24 15:47:47
40	360.29771601412074	275.17301637315114	-67	21/02/24 15:47:47
47	353.57917457908314	286.3943403818769	-67	21/02/24 15:47:47

27	361.7760445803703	289.2690199455797	-59	21/02/24 15:47:48
26	365.69275229012084	288.9526077496502	-55	21/02/24 15:47:48
36	375.5585779585396	288.8705845625357	-50	21/02/24 15:47:48
35	375.6269429107988	288.30982657685854	-53	21/02/24 15:47:48
9	369.1884989117563	287.5678363426809	-39	21/02/24 15:47:48
37	359.5903712498935	284.92420131943135	-62	21/02/24 15:47:48
34	374.2599083722957	283.9138922785015	-55	21/02/24 15:47:48
41	375.39943266704637	281.4134213737185	-57	21/02/24 15:47:48
12	371.0513379138651	279.4455722502708	-58	21/02/24 15:47:48
19	377.44631063296276	276.33039616173164	-67	21/02/24 15:47:48
40	360.29771601412074	275.17301637315114	-70	21/02/24 15:47:48
47	353.57917457908314	286.3943403818769	-70	21/02/24 15:47:48

27	361.7760445803703	289.2690199455797	-61	21/02/24 15:47:49
26	365.69275229012084	288.9526077496502	-56	21/02/24 15:47:49
36	375.5585779585396	288.8705845625357	-48	21/02/24 15:47:49
35	375.6269429107988	288.30982657685854	-50	21/02/24 15:47:49
9	369.1884989117563	287.5678363426809	-45	21/02/24 15:47:49
37	359.5903712498935	284.92420131943135	-64	21/02/24 15:47:49
34	374.2599083722957	283.9138922785015	-50	21/02/24 15:47:49
41	375.39943266704637	281.4134213737185	-57	21/02/24 15:47:49
12	371.0513379138651	279.4455722502708	-59	21/02/24 15:47:49
19	377.44631063296276	276.33039616173164	-65	21/02/24 15:47:49
40	360.29771601412074	275.17301637315114	-70	21/02/24 15:47:49
47	353.57917457908314	286.3943403818769	-71	21/02/24 15:47:49

27	361.7760445803703	289.2690199455797	-60	21/02/24 15:47:50
26	365.69275229012084	288.9526077496502	-53	21/02/24 15:47:50
36	375.5585779585396	288.8705845625357	-50	21/02/24 15:47:50
35	375.6269429107988	288.30982657685854	-52	21/02/24 15:47:50
9	369.1884989117563	287.5678363426809	-42	21/02/24 15:47:50
37	359.5903712498935	284.92420131943135	-66	21/02/24 15:47:50
34	374.2599083722957	283.9138922785015	-51	21/02/24 15:47:50
41	375.39943266704637	281.4134213737185	-57	21/02/24 15:47:50
12	371.0513379138651	279.4455722502708	-61	21/02/24 15:47:50
19	377.44631063296276	276.33039616173164	-65	21/02/24 15:47:50
40	360.29771601412074	275.17301637315114	-69	21/02/24 15:47:50
47	353.57917457908314	286.3943403818769	-68	21/02/24 15:47:50
33	361.5531569646988	270.2693072733871	-69	21/02/24 15:47:50

27	361.7760445803703	289.2690199455797	-62	21/02/24 15:47:51
26	365.69275229012084	288.9526077496502	-54	21/02/24 15:47:51
36	375.5585779585396	288.8705845625357	-52	21/02/24 15:47:51
35	375.6269429107988	288.30982657685854	-48	21/02/24 15:47:51
9	369.1884989117563	287.5678363426809	-41	21/02/24 15:47:51
37	359.5903712498935	284.92420131943135	-62	21/02/24 15:47:51
34	374.2599083722957	283.9138922785015	-52	21/02/24 15:47:51
41	375.39943266704637	281.4134213737185	-56	21/02/24 15:47:51
12	371.0513379138651	279.4455722502708	-59	21/02/24 15:47:51
19	377.44631063296276	276.33039616173164	-66	21/02/24 15:47:51
40	360.29771601412074	275.17301637315114	-66	21/02/24 15:47:51
47	353.57917457908314	286.3943403818769	-70	21/02/24 15:47:51
33	361.5531569646988	270.2693072733871	-70	21/02/24 15:47:51

27	361.7760445803703	289.2690199455797	-61	21/02/24 15:47:52
26	365.69275229012084	288.9526077496502	-58	21/02/24 15:47:52
36	375.5585779585396	288.8705845625357	-48	21/02/24 15:47:52
35	375.6269429107988	288.30982657685854	-50	21/02/24 15:47:52
9	369.1884989117563	287.5678363426809	-45	21/02/24 15:47:52
37	359.5903712498935	284.92420131943135	-66	21/02/24 15:47:52
34	374.2599083722957	283.9138922785015	-47	21/02/24 15:47:52
41	375.39943266704637	281.4134213737185	-55	21/02/24 15:47:52
12	371.0513379138651	279.4455722502708	-59	21/02/24 15:47:52
19	377.44631063296276	276.33039616173164	-64	21/02/24 15:47:52
40	360.29771601412074	275.17301637315114	-68	21/02/24 15:47:52
47	353.57917457908314	286.3943403818769	-69	21/02/24 15:47:52
33	361.5531569646988	270.2693072733871	-70	21/02/24 15:47:52

27	361.7760445803703	289.2690199455797	-62	21/02/24 15:47:53
26	365.69275229012084	288.9526077496502	-55	21/02/24 15:47:53
36	375.5585779585396	288.8705845625357	-51	21/02/24 15:47:53
35	375.6269429107988	288.30982657685854	-50	21/02/24 15:47:53
9	369.1884989117563	287.5678363426809	-45	21/02/24 15:47:53
37	359.5903712498935	284.92420131943135	-64	21/02/24 15:47:53
34	374.2599083722957	283.9138922785015	-49	21/02/24 15:47:53
41	375.39943266704637	281.4134213737185	-56	21/02/24 15:47:53
12	371.0513379138651	279.4455722502708	-57	21/02/24 15:47:53
19	377.44631063296276	276.33039616173164	-64	21/02/24 15:47:53
40	360.29771601412074	275.17301637315114	-66	21/02/24 15:47:53
47	353.57917457908314	286.3943403818769	-68	21/02/24 15:47:53
33	361.5531569646988	270.2693072733871	-72	21/02/24 15:47:53

27	361.7760445803703	289.2690199455797	-61	21/02/24 15:47:54
26	365.69275229012084	288.9526077496502	-56	21/02/24 15:47:54
36	375.5585779585396	288.8705845625357	-51	21/02/24 15:47:54
35	375.6269429107988	288.30982657685854	-49	21/02/24 15:47:54
9	369.1884989117563	287.5678363426809	-42	21/02/24 15:47:54
37	359.5903712498935	284.92420131943135	-62	21/02/24 15:47:54
34	374.2599083722957	283.9138922785015	-48	21/02/24 15:47:54
41	375.39943266704637	281.4134213737185	-56	21/02/24 15:47:54
12	371.0513379138651	279.4455722502708	-58	21/02/24 15:47:54
19	377.44631063296276	276.33039616173164	-65	21/02/24 15:47:54
40	360.29771601412074	275.17301637315114	-67	21/02/24 15:47:54
47	353.57917457908314	286.3943403818769	-69	21/02/24 15:47:54
33	361.5531569646988	270.2693072733871	-68	21/02/24 15:47:54

27	361.7760445803703	289.2690199455797	-59	21/02/24 15:47:55
26	365.69275229012084	288.9526077496502	-56	21/02/24 15:47:55
36	375.5585779585396	288.8705845625357	-55	21/02/24 15:47:55
35	375.6269429107988	288.30982657685854	-55	21/02/24 15:47:55
9	369.1884989117563	287.5678363426809	-47	21/02/24 15:47:55
37	359.5903712498935	284.92420131943135	-61	21/02/24 15:47:55
34	374.2599083722957	283.9138922785015	-50	21/02/24 15:47:55
41	375.39943266704637	281.4134213737185	-55	21/02/24 15:47:55
12	371.0513379138651	279.4455722502708	-54	21/02/24 15:47:55
19	377.44631063296276	276.33039616173164	-63	21/02/24 15:47:55
40	360.29771601412074	275.17301637315114	-64	21/02/24 15:47:55
47	353.57917457908314	286.3943403818769	-68	21/02/24 15:47:55
22	353.27733584284437	275.76541045955213	-70	21/02/24 15:47:55
33	361.5531569646988	270.2693072733871	-68	21/02/24 15:47:55

27	361.7760445803703	289.2690199455797	-62	21/02/24 15:47:56
26	365.69275229012084	288.9526077496502	-55	21/02/24 15:47:56
36	375.5585779585396	288.8705845625357	-58	21/02/24 15:47:56
35	375.6269429107988	288.30982657685854	-58	21/02/24 15:47:56
9	369.1884989117563	287.5678363426809	-50	21/02/24 15:47:56
37	359.5903712498935	284.92420131943135	-60	21/02/24 15:47:56
34	374.2599083722957	283.9138922785015	-55	21/02/24 15:47:56
41	375.39943266704637	281.4134213737185	-57	21/02/24 15:47:56
12	371.0513379138651	279.4455722502708	-50	21/02/24 15:47:56
19	377.44631063296276	276.33039616173164	-63	21/02/24 15:47:56
40	360.29771601412074	275.17301637315114	-62	21/02/24 15:47:56
47	353.57917457908314	286.3943403818769	-67	21/02/24 15:47:56
22	353.27733584284437	275.76541045955213	-67	21/02/24 15:47:56
33	361.5531569646988	270.2693072733871	-67	21/02/24 15:47:56
32	356.7839379367616	268.70688981904533	-70	21/02/24 15:47:56

27	361.7760445803703	289.2690199455797	-58	21/02/24 15:47:57
26	365.69275229012084	288.9526077496502	-54	21/02/24 15:47:57
36	375.5585779585396	288.8705845625357	-63	21/02/24 15:47:57
35	375.6269429107988	288.30982657685854	-61	21/02/24 15:47:57
9	369.1884989117563	287.5678363426809	-54	21/02/24 15:47:57
37	359.5903712498935	284.92420131943135	-59	21/02/24 15:47:57
34	374.2599083722957	283.9138922785015	-59	21/02/24 15:47:57
41	375.39943266704637	281.4134213737185	-61	21/02/24 15:47:57
12	371.0513379138651	279.4455722502708	-54	21/02/24 15:47:57
19	377.44631063296276	276.33039616173164	-63	21/02/24 15:47:57
40	360.29771601412074	275.17301637315114	-61	21/02/24 15:47:57
47	353.57917457908314	286.3943403818769	-67	21/02/24 15:47:57
22	353.27733584284437	275.76541045955213	-65	21/02/24 15:47:57
33	361.5531569646988	270.2693072733871	-66	21/02/24 15:47:57
32	356.7839379367616	268.70688981904533	-68	21/02/24 15:47:57

27	361.7760445803703	289.2690199455797	-56	21/02/24 15:47:58
26	365.69275229012084	288.9526077496502	-56	21/02/24 15:47:58
36	375.5585779585396	288.8705845625357	-66	21/02/24 15:47:58
35	375.6269429107988	288.30982657685854	-66	21/02/24 15:47:58
9	369.1884989117563	287.5678363426809	-55	21/02/24 15:47:58
37	359.5903712498935	284.92420131943135	-53	21/02/24 15:47:58
34	374.2599083722957	283.9138922785015	-61	21/02/24 15:47:58
41	375.39943266704637	281.4134213737185	-61	21/02/24 15:47:58
12	371.0513379138651	279.4455722502708	-58	21/02/24 15:47:58
19	377.44631063296276	276.33039616173164	-66	21/02/24 15:47:58
40	360.29771601412074	275.17301637315114	-61	21/02/24 15:47:58
47	353.57917457908314	286.3943403818769	-63	21/02/24 15:47:58
22	353.27733584284437	275.76541045955213	-67	21/02/24 15:47:58
33	361.5531569646988	270.2693072733871	-64	21/02/24 15:47:58
32	356.7839379367616	268.70688981904533	-68	21/02/24 15:47:58

27	361.7760445803703	289.2690199455797	-56	21/02/24 15:47:59
26	365.69275229012084	288.9526077496502	-56	21/02/24 15:47:59
36	375.5585779585396	288.8705845625357	-68	21/02/24 15:47:59
35	375.6269429107988	288.30982657685854	-68	21/02/24 15:47:59
9	369.1884989117563	287.5678363426809	-59	21/02/24 15:47:59
37	359.5903712498935	284.92420131943135	-50	21/02/24 15:47:59
34	374.2599083722957	283.9138922785015	-62	21/02/24 15:47:59
41	375.39943266704637	281.4134213737185	-63	21/02/24 15:47:59
12	371.0513379138651	279.4455722502708	-58	21/02/24 15:47:59
19	377.44631063296276	276.33039616173164	-68	21/02/24 15:47:59
40	360.29771601412074	275.17301637315114	-59	21/02/24 15:47:59
47	353.57917457908314	286.3943403818769	-63	21/02/24 15:47:59
22	353.27733584284437	275.76541045955213	-63	21/02/24 15:47:59
33	361.5531569646988	270.2693072733871	-63	21/02/24 15:47:59
32	356.7839379367616	268.70688981904533	-66	21/02/24 15:47:59

