floorId	partitionId	location_x	location_y	timeStamp
1	59	328.5945802458779	282.23375842854654	20/04/28 05:13:07
1	59	328.5945802458779	282.23375842854654	20/04/28 05:13:08
1	59	328.5945802458779	282.23375842854654	20/04/28 05:13:09
1	59	328.5945802458779	282.23375842854654	20/04/28 05:13:10
1	59	328.5945802458779	282.23375842854654	20/04/28 05:13:11
1	59	328.5945802458779	282.23375842854654	20/04/28 05:13:12
1	59	328.5945802458779	282.23375842854654	20/04/28 05:13:13
1	59	328.5945802458779	282.23375842854654	20/04/28 05:13:14
1	59	326.0592927928086	283.41059588634107	20/04/28 05:13:15
1	59	328.5945802458779	282.23375842854654	20/04/28 05:13:16
1	59	328.5945802458779	282.23375842854654	20/04/28 05:13:17
1	59	328.5945802458779	282.23375842854654	20/04/28 05:13:18
1	59	328.5945802458779	282.23375842854654	20/04/28 05:13:19
1	59	328.5945802458779	282.23375842854654	20/04/28 05:13:20
1	59	328.5945802458779	282.23375842854654	20/04/28 05:13:21
1	59	328.5945802458779	282.23375842854654	20/04/28 05:13:22
1	59	328.5945802458779	282.23375842854654	20/04/28 05:13:23
1	59	328.5945802458779	282.23375842854654	20/04/28 05:13:24
1	59	328.5945802458779	282.23375842854654	20/04/28 05:13:25
1	59	328.5945802458779	282.23375842854654	20/04/28 05:13:26
1	59	326.0592927928086	283.41059588634107	20/04/28 05:13:27
1	59	328.5945802458779	282.23375842854654	20/04/28 05:13:28
1	59	326.0592927928086	283.41059588634107	20/04/28 05:13:29
1	59	328.5945802458779	282.23375842854654	20/04/28 05:13:30
1	59	326.0592927928086	283.41059588634107	20/04/28 05:13:31
1	59	328.5945802458779	282.23375842854654	20/04/28 05:13:32
1	59	328.5945802458779	282.23375842854654	20/04/28 05:13:33
1	59	328.5945802458779	282.23375842854654	20/04/28 05:13:34
1	59	328.5945802458779	282.23375842854654	20/04/28 05:13:35
1	59	328.5945802458779	282.23375842854654	20/04/28 05:13:36
1	59	327.4971270661714	282.632451151298	20/04/28 05:13:37
1	59	328.5945802458779	282.23375842854654	20/04/28 05:13:38
1	59	328.5945802458779	282.23375842854654	20/04/28 05:13:39
1	39	328.5632049091355	280.29920674728515	20/04/28 05:13:40
1	59	328.5945802458779	282.23375842854654	20/04/28 05:13:42
1	59	328.5945802458779	282.23375842854654	20/04/28 05:13:43
1	39	328.5632049091355	280.29920674728515	20/04/28 05:13:44
1	39	329.26871337285087	279.8327396442798	20/04/28 05:13:45
1	39	325.81440313235436	279.3509925421299	20/04/28 05:13:46
1	39	325.1681104108905	280.1535421165315	20/04/28 05:13:47
1	59	328.5945802458779	282.23375842854654	20/04/28 05:13:48
1	59	328.5945802458779	282.23375842854654	20/04/28 05:13:49
1	59	328.5945802458779	282.23375842854654	20/04/28 05:13:50
1	59	328.5945802458779	282.23375842854654	20/04/28 05:13:51
1	59	328.5945802458779	282.23375842854654	20/04/28 05:13:52
1	59	328.5945802458779	282.23375842854654	20/04/28 05:13:53
1	59	328.5945802458779	282.23375842854654	20/04/28 05:13:54
1	59	326.0592927928086	283.41059588634107	20/04/28 05:13:55
1	59	328.5945802458779	282.23375842854654	20/04/28 05:13:56
1	59	326.0592927928086	283.41059588634107	20/04/28 05:13:57
1	39	325.1681104108905	280.1535421165315	20/04/28 05:13:58
1	59	328.5945802458779	282.23375842854654	20/04/28 05:13:59
1	59	328.5945802458779	282.23375842854654	20/04/28 05:14:00
1	59	328.5945802458779	282.23375842854654	20/04/28 05:14:01
1	59	328.5945802458779	282.23375842854654	20/04/28 05:14:02
1	59	328.5945802458779	282.23375842854654	20/04/28 05:14:03
1	39	328.5632049091355	280.29920674728515	20/04/28 05:14:04
1	59	326.0592927928086	283.41059588634107	20/04/28 05:14:05
1	59	327.4971270661714	282.632451151298	20/04/28 05:14:06
1	59	328.5945802458779	282.23375842854654	20/04/28 05:14:07
1	59	326.0592927928086	283.41059588634107	20/04/28 05:14:08
1	59	328.5945802458779	282.23375842854654	20/04/28 05:14:09
1	59	327.4971270661714	282.632451151298	20/04/28 05:14:10
1	59	328.5945802458779	282.23375842854654	20/04/28 05:14:11
1	59	328.5945802458779	282.23375842854654	20/04/28 05:14:12
1	59	328.5945802458779	282.23375842854654	20/04/28 05:14:13
1	59	328.5945802458779	282.23375842854654	20/04/28 05:14:14
1	59	328.5945802458779	282.23375842854654	20/04/28 05:14:15
1	59	328.5945802458779	282.23375842854654	20/04/28 05:14:16
1	59	328.5945802458779	282.23375842854654	20/04/28 05:14:17
1	59	328.5945802458779	282.23375842854654	20/04/28 05:14:18
1	59	326.0592927928086	283.41059588634107	20/04/28 05:14:19
1	59	326.0592927928086	283.41059588634107	20/04/28 05:14:20
1	59	328.5945802458779	282.23375842854654	20/04/28 05:14:21
1	59	328.5945802458779	282.23375842854654	20/04/28 05:14:22
1	59	326.0592927928086	283.41059588634107	20/04/28 05:14:23
1	59	328.5945802458779	282.23375842854654	20/04/28 05:14:24
1	59	328.5945802458779	282.23375842854654	20/04/28 05:14:25
1	59	328.5945802458779	282.23375842854654	20/04/28 05:14:26
1	59	328.5945802458779	282.23375842854654	20/04/28 05:14:27
1	59	328.5945802458779	282.23375842854654	20/04/28 05:14:28
1	59	328.5945802458779	282.23375842854654	20/04/28 05:14:29
1	59	328.5945802458779	282.23375842854654	20/04/28 05:14:30
1	59	328.5945802458779	282.23375842854654	20/04/28 05:14:31
1	59	328.5945802458779	282.23375842854654	20/04/28 05:14:32
1	59	328.5945802458779	282.23375842854654	20/04/28 05:14:33
1	59	328.5945802458779	282.23375842854654	20/04/28 05:14:34
1	59	328.5945802458779	282.23375842854654	20/04/28 05:14:35
1	59	328.5945802458779	282.23375842854654	20/04/28 05:14:36
1	9	331.2124740764311	280.36793404834106	20/04/28 05:14:37
1	59	328.5945802458779	282.23375842854654	20/04/28 05:14:38
1	59	328.5945802458779	282.23375842854654	20/04/28 05:14:39
1	59	328.5945802458779	282.23375842854654	20/04/28 05:14:40
1	59	328.5945802458779	282.23375842854654	20/04/28 05:14:41
1	59	328.5945802458779	282.23375842854654	20/04/28 05:14:42
1	59	328.5945802458779	282.23375842854654	20/04/28 05:14:43
1	59	328.5945802458779	282.23375842854654	20/04/28 05:14:44
1	59	326.0592927928086	283.41059588634107	20/04/28 05:14:45
1	59	328.70856196010413	283.4793231873969	20/04/28 05:14:46
1	59	328.70856196010413	283.4793231873969	20/04/28 05:14:47
1	59	328.5945802458779	282.23375842854654	20/04/28 05:14:48
1	59	328.5945802458779	282.23375842854654	20/04/28 05:14:49
1	9	331.2124740764311	280.36793404834106	20/04/28 05:14:50
1	59	328.5945802458779	282.23375842854654	20/04/28 05:14:51
1	59	328.5945802458779	282.23375842854654	20/04/28 05:14:52
1	59	328.5945802458779	282.23375842854654	20/04/28 05:14:53
1	9	332.07149686486787	280.81042788541987	20/04/28 05:14:54
1	9	331.2124740764311	280.36793404834106	20/04/28 05:14:55
1	9	331.2124740764311	280.36793404834106	20/04/28 05:14:56
1	59	328.5945802458779	282.23375842854654	20/04/28 05:14:57
1	59	328.5945802458779	282.23375842854654	20/04/28 05:14:58
1	59	328.5945802458779	282.23375842854654	20/04/28 05:14:59
1	59	328.5945802458779	282.23375842854654	20/04/28 05:15:00
1	9	331.2124740764311	280.36793404834106	20/04/28 05:15:01
1	9	331.2124740764311	280.36793404834106	20/04/28 05:15:02
1	59	328.5945802458779	282.23375842854654	20/04/28 05:15:03
1	59	326.0592927928086	283.41059588634107	20/04/28 05:15:04
1	39	323.3383314215366	280.86391247132065	20/04/28 05:15:05
1	59	326.05929279280866	283.41059588634107	20/04/28 05:15:06
1	59	324.73584925764595	284.2133517267792	20/04/28 05:15:07
1	59	326.05929279280866	283.41059588634107	20/04/28 05:15:08
1	59	326.0592927928086	283.41059588634107	20/04/28 05:15:09
1	59	326.0592927928086	283.41059588634107	20/04/28 05:15:10
1	59	328.70856196010413	283.4793231873969	20/04/28 05:15:11
1	59	326.0592927928086	283.41059588634107	20/04/28 05:15:12
1	59	328.5945802458779	282.23375842854654	20/04/28 05:15:13
1	59	328.5945802458779	282.23375842854654	20/04/28 05:15:14
1	59	328.70856196010413	283.4793231873969	20/04/28 05:15:15
1	59	328.5945802458779	282.23375842854654	20/04/28 05:15:16
1	59	326.0592927928086	283.41059588634107	20/04/28 05:15:17
1	59	326.0592927928086	283.41059588634107	20/04/28 05:15:18
1	59	328.70856196010413	283.4793231873969	20/04/28 05:15:19
1	59	326.0592927928086	283.41059588634107	20/04/28 05:15:20
1	59	326.0592927928086	283.41059588634107	20/04/28 05:15:21
1	59	326.0592927928086	283.41059588634107	20/04/28 05:15:22
1	59	328.5945802458779	282.23375842854654	20/04/28 05:15:23
1	59	326.0592927928086	283.41059588634107	20/04/28 05:15:24
1	59	326.0592927928086	283.41059588634107	20/04/28 05:15:25
1	59	326.0592927928086	283.41059588634107	20/04/28 05:15:26
1	59	326.0592927928086	283.41059588634107	20/04/28 05:15:27
1	59	328.5945802458779	282.23375842854654	20/04/28 05:15:28
1	59	326.0592927928086	283.41059588634107	20/04/28 05:15:29
1	59	326.0592927928086	283.41059588634107	20/04/28 05:15:30
1	59	326.0592927928086	283.41059588634107	20/04/28 05:15:31
1	59	326.0592927928086	283.41059588634107	20/04/28 05:15:32
1	59	326.05929279280866	283.41059588634107	20/04/28 05:15:33
1	59	326.05929279280866	283.41059588634107	20/04/28 05:15:34
1	59	326.0592927928086	283.41059588634107	20/04/28 05:15:35
1	59	326.0592927928086	283.41059588634107	20/04/28 05:15:36
1	59	326.0592927928086	283.41059588634107	20/04/28 05:15:37
1	59	326.0592927928086	283.41059588634107	20/04/28 05:15:38
1	59	326.0592927928086	283.41059588634107	20/04/28 05:15:39
1	59	326.05929279280866	283.41059588634107	20/04/28 05:15:40
1	59	326.05929279280866	283.41059588634107	20/04/28 05:15:41
1	59	326.05929279280866	283.41059588634107	20/04/28 05:15:42
1	59	326.05929279280866	283.41059588634107	20/04/28 05:15:43
1	59	326.05929279280866	283.41059588634107	20/04/28 05:15:44
1	59	326.0592927928086	283.41059588634107	20/04/28 05:15:45
1	59	326.05929279280866	283.41059588634107	20/04/28 05:15:46
1	59	326.05929279280866	283.41059588634107	20/04/28 05:15:47
1	59	326.0592927928086	283.41059588634107	20/04/28 05:15:48
1	59	326.0592927928086	283.41059588634107	20/04/28 05:15:49
1	59	326.05929279280866	283.41059588634107	20/04/28 05:15:50
1	59	326.0592927928086	283.41059588634107	20/04/28 05:15:51
1	59	326.0592927928086	283.41059588634107	20/04/28 05:15:52
1	59	326.0592927928086	283.41059588634107	20/04/28 05:15:53
1	59	326.0592927928086	283.41059588634107	20/04/28 05:15:54
1	59	326.0592927928086	283.41059588634107	20/04/28 05:15:55
1	59	326.0592927928086	283.41059588634107	20/04/28 05:15:56
1	59	326.0592927928086	283.41059588634107	20/04/28 05:15:57
1	59	326.0592927928086	283.41059588634107	20/04/28 05:15:58
1	59	326.05929279280866	283.41059588634107	20/04/28 05:15:59
1	59	326.05929279280866	283.41059588634107	20/04/28 05:16:00
1	59	326.0592927928086	283.41059588634107	20/04/28 05:16:01
1	59	326.0592927928086	283.41059588634107	20/04/28 05:16:02
1	59	326.05929279280866	283.41059588634107	20/04/28 05:16:03
1	59	326.68716144902965	283.2680691244666	20/04/28 05:16:04
1	59	326.0592927928086	283.41059588634107	20/04/28 05:16:05
1	59	326.0592927928086	283.41059588634107	20/04/28 05:16:06
1	59	326.0592927928086	283.41059588634107	20/04/28 05:16:07
1	59	326.0592927928086	283.41059588634107	20/04/28 05:16:08
1	59	327.6111087803976	283.87801591014846	20/04/28 05:16:09
1	59	328.70856196010413	283.4793231873969	20/04/28 05:16:10
1	59	326.0592927928086	283.41059588634107	20/04/28 05:16:11
1	59	326.0592927928086	283.41059588634107	20/04/28 05:16:12
1	59	326.0592927928086	283.41059588634107	20/04/28 05:16:13
1	59	326.0592927928086	283.41059588634107	20/04/28 05:16:14
1	59	326.68716144902965	283.2680691244666	20/04/28 05:16:15
1	59	326.0592927928086	283.41059588634107	20/04/28 05:16:16
1	59	326.68716144902965	283.2680691244666	20/04/28 05:16:17
1	59	326.68716144902965	283.2680691244666	20/04/28 05:16:18
1	59	326.05929279280866	283.41059588634107	20/04/28 05:16:19
1	59	326.05929279280866	283.41059588634107	20/04/28 05:16:20
1	59	326.05929279280866	283.41059588634107	20/04/28 05:16:21
1	59	326.05929279280866	283.41059588634107	20/04/28 05:16:22
1	59	326.05929279280866	283.41059588634107	20/04/28 05:16:23
1	59	326.05929279280866	283.41059588634107	20/04/28 05:16:24
1	59	326.05929279280866	283.41059588634107	20/04/28 05:16:25
1	59	326.05929279280866	283.41059588634107	20/04/28 05:16:26
1	59	326.05929279280866	283.41059588634107	20/04/28 05:16:27
1	59	326.05929279280866	283.41059588634107	20/04/28 05:16:28
1	59	326.05929279280866	283.41059588634107	20/04/28 05:16:29
1	59	324.73584925764595	284.2133517267792	20/04/28 05:16:30
1	59	324.73584925764595	284.2133517267792	20/04/28 05:16:31
1	39	323.3383314215366	280.8639124713207	20/04/28 05:16:32
