floorId	partitionId	location_x	location_y	timeStamp
1	NULL	338.7950920964135	285.0161233311299	20/04/28 05:15:41
1	NULL	338.7950920964135	285.0161233311299	20/04/28 05:15:42
1	NULL	338.7950920964135	285.0161233311299	20/04/28 05:15:43
1	NULL	338.7950920964135	285.0161233311299	20/04/28 05:15:44
1	NULL	338.7950920964135	285.0161233311299	20/04/28 05:15:45
1	NULL	338.7950920964135	285.0161233311299	20/04/28 05:15:46
1	NULL	338.7950920964135	285.0161233311299	20/04/28 05:15:47
1	97	337.5607221213916	286.380934101518	20/04/28 05:15:48
1	NULL	338.7950920964135	285.0161233311299	20/04/28 05:15:49
1	NULL	338.7950920964135	285.0161233311299	20/04/28 05:15:50
1	NULL	338.7950920964135	285.0161233311299	20/04/28 05:15:51
1	NULL	338.7950920964135	285.0161233311299	20/04/28 05:15:52
1	NULL	338.7950920964135	285.0161233311299	20/04/28 05:15:53
1	97	336.53585426801055	287.8812247794712	20/04/28 05:15:54
1	97	336.53585426801055	287.8812247794712	20/04/28 05:15:55
1	97	340.57867932717687	286.3898102144678	20/04/28 05:15:56
1	97	339.4344475351989	287.82523322481603	20/04/28 05:15:57
1	97	340.629387065862	286.9381600623282	20/04/28 05:15:58
1	97	339.4344475351989	287.82523322481603	20/04/28 05:15:59
1	97	336.53585426801055	287.8812247794712	20/04/28 05:16:00
1	97	339.4344475351989	287.82523322481603	20/04/28 05:16:01
1	97	336.53585426801055	287.8812247794712	20/04/28 05:16:02
1	97	336.53585426801055	287.8812247794712	20/04/28 05:16:03
1	97	339.4344475351989	287.82523322481603	20/04/28 05:16:04
1	97	340.57867932717687	286.3898102144678	20/04/28 05:16:05
1	83	341.89063738411534	284.94233083548517	20/04/28 05:16:06
1	NULL	338.7950920964135	285.0161233311299	20/04/28 05:16:07
1	9	338.38423916717994	283.3768680817603	20/04/28 05:16:08
1	9	336.1390520614952	282.923128952197	20/04/28 05:16:09
1	9	336.1390520614952	282.923128952197	20/04/28 05:16:10
1	9	334.9046820864733	284.287939722585	20/04/28 05:16:11
1	9	336.1390520614952	282.923128952197	20/04/28 05:16:12
1	9	334.9046820864733	284.287939722585	20/04/28 05:16:13
1	9	336.1390520614952	282.923128952197	20/04/28 05:16:14
1	9	332.6827174770074	283.56978058189367	20/04/28 05:16:15
1	9	333.60947624861177	282.8999185116639	20/04/28 05:16:16
1	9	332.6827174770074	283.56978058189367	20/04/28 05:16:17
1	9	332.6827174770074	283.56978058189367	20/04/28 05:16:18
1	9	336.1390520614952	282.923128952197	20/04/28 05:16:19
1	9	336.1390520614952	282.923128952197	20/04/28 05:16:20
1	9	336.9666995131897	281.43107110801446	20/04/28 05:16:21
1	9	336.13905206149525	282.923128952197	20/04/28 05:16:22
1	9	336.9666995131897	281.43107110801446	20/04/28 05:16:23
1	9	336.96669951318967	281.43107110801446	20/04/28 05:16:24
1	9	336.1390520614952	282.92312895219703	20/04/28 05:16:25
1	9	336.1390520614952	282.92312895219703	20/04/28 05:16:26
1	9	335.52783144935574	280.16377625572323	20/04/28 05:16:27
1	9	335.52783144935574	280.16377625572323	20/04/28 05:16:28
1	9	334.2158733924172	281.61125563470574	20/04/28 05:16:29
1	9	334.2158733924172	281.61125563470574	20/04/28 05:16:30
1	9	336.9666995131897	281.43107110801446	20/04/28 05:16:31
1	9	338.38423916717994	283.3768680817603	20/04/28 05:16:32
1	83	342.84443575605496	281.7858825394988	20/04/28 05:16:33
1	83	342.84443575605496	281.7858825394988	20/04/28 05:16:34
1	83	342.14651366105164	278.29653465123357	20/04/28 05:16:35
1	83	342.6670378776471	277.6234596462452	20/04/28 05:16:36
1	83	343.4681836212453	274.2098025486005	20/04/28 05:16:37
1	83	343.69483647092005	272.9774109340353	20/04/28 05:16:38
1	45	346.0263005853995	276.0152105791595	20/04/28 05:16:39
1	45	349.6923172262812	276.405277260681	20/04/28 05:16:40
1	45	347.9463939510875	275.91409157595893	20/04/28 05:16:41
1	21	350.86523352569907	278.2096248770342	20/04/28 05:16:42
1	21	350.86523352569907	278.2096248770342	20/04/28 05:16:43
1	45	351.57441812307843	276.42112783411807	20/04/28 05:16:44
1	21	350.86523352569907	278.2096248770342	20/04/28 05:16:45
1	45	347.9463939510875	275.91409157595893	20/04/28 05:16:46
1	45	349.6923172262812	276.405277260681	20/04/28 05:16:47
1	45	348.65557854846685	274.12559453304283	20/04/28 05:16:48
1	45	352.2637601833551	274.60835422172534	20/04/28 05:16:49
1	45	348.65557854846685	274.12559453304283	20/04/28 05:16:50
1	45	350.3816592865578	274.5925036482883	20/04/28 05:16:51
1	45	349.6923172262812	276.40527726068103	20/04/28 05:16:52
1	45	351.57441812307843	276.42112783411807	20/04/28 05:16:53
1	45	350.3816592865578	274.5925036482883	20/04/28 05:16:54
1	45	351.55457558597567	276.3968512646414	20/04/28 05:16:55
1	45	353.3004988611694	276.8880369493635	20/04/28 05:16:56
1	45	353.3004988611694	276.88803694936354	20/04/28 05:16:57
1	45	353.3004988611694	276.88803694936354	20/04/28 05:16:58
1	45	353.3004988611694	276.8880369493635	20/04/28 05:16:59
1	45	353.3004988611694	276.8880369493635	20/04/28 05:17:00
1	45	352.26376018335503	274.6083542217253	20/04/28 05:17:01
1	45	353.3004988611694	276.8880369493635	20/04/28 05:17:02
1	45	353.3004988611694	276.8880369493635	20/04/28 05:17:03
1	45	352.2637601833551	274.60835422172534	20/04/28 05:17:04
1	45	353.3004988611694	276.8880369493635	20/04/28 05:17:05
1	45	353.46592153432107	276.10652058020696	20/04/28 05:17:06
1	45	352.26376018335503	274.6083542217253	20/04/28 05:17:07
1	45	353.3004988611694	276.8880369493635	20/04/28 05:17:08
1	45	353.3004988611694	276.8880369493635	20/04/28 05:17:09
1	45	353.3004988611694	276.88803694936354	20/04/28 05:17:10
1	45	353.3004988611694	276.88803694936354	20/04/28 05:17:11
1	45	353.3004988611694	276.8880369493635	20/04/28 05:17:12
1	45	353.3004988611694	276.8880369493635	20/04/28 05:17:13
1	45	353.3004988611694	276.8880369493635	20/04/28 05:17:14
1	45	353.3004988611694	276.8880369493635	20/04/28 05:17:15
1	45	353.3004988611694	276.8880369493635	20/04/28 05:17:16
1	45	353.3004988611694	276.8880369493635	20/04/28 05:17:17
1	45	353.3004988611694	276.8880369493635	20/04/28 05:17:18
1	45	352.26376018335503	274.6083542217253	20/04/28 05:17:19
1	45	352.26376018335503	274.6083542217253	20/04/28 05:17:20
1	45	352.26376018335503	274.6083542217253	20/04/28 05:17:21
1	45	352.26376018335503	274.6083542217253	20/04/28 05:17:22
1	45	354.79530148656744	274.7767083531221	20/04/28 05:17:23
1	45	352.26376018335503	274.6083542217253	20/04/28 05:17:24
1	45	354.79530148656744	274.7767083531221	20/04/28 05:17:25
1	45	352.26376018335503	274.6083542217253	20/04/28 05:17:26
1	45	353.3004988611694	276.8880369493635	20/04/28 05:17:27
1	45	354.79530148656744	274.7767083531221	20/04/28 05:17:28
1	45	354.79530148656744	274.7767083531221	20/04/28 05:17:29
1	45	354.79530148656744	274.7767083531221	20/04/28 05:17:30
1	45	352.26376018335503	274.6083542217253	20/04/28 05:17:31
1	45	354.79530148656744	274.7767083531221	20/04/28 05:17:32
1	45	354.79530148656744	274.7767083531221	20/04/28 05:17:33
1	45	354.79530148656744	274.7767083531221	20/04/28 05:17:34
1	45	352.26376018335503	274.6083542217253	20/04/28 05:17:35
1	45	354.79530148656744	274.7767083531221	20/04/28 05:17:36
1	45	353.3004988611694	276.8880369493635	20/04/28 05:17:37
1	45	354.79530148656744	274.7767083531221	20/04/28 05:17:38
1	45	353.3004988611694	276.8880369493635	20/04/28 05:17:39
1	45	354.79530148656744	274.7767083531221	20/04/28 05:17:41
1	45	354.79530148656744	274.7767083531221	20/04/28 05:17:42
1	45	354.79530148656744	274.7767083531221	20/04/28 05:17:43
1	45	354.79530148656744	274.7767083531221	20/04/28 05:17:44
1	45	354.79530148656744	274.7767083531221	20/04/28 05:17:45
1	45	352.26376018335503	274.6083542217253	20/04/28 05:17:46
1	45	352.26376018335503	274.6083542217253	20/04/28 05:17:47
1	45	345.96843404291235	273.484822871877	20/04/28 05:17:48
1	45	345.96843404291235	273.484822871877	20/04/28 05:17:49
1	83	343.4681836212453	274.2098025486005	20/04/28 05:17:50
1	83	343.4681836212453	274.2098025486005	20/04/28 05:17:51
1	83	342.6670378776471	277.6234596462452	20/04/28 05:17:52
1	83	342.84443575605496	281.7858825394988	20/04/28 05:17:53
1	91	344.6787307255034	283.7079192706971	20/04/28 05:17:54
1	83	343.819718439418	284.5911886610593	20/04/28 05:17:55
1	91	347.5102048256884	286.1350340184951	20/04/28 05:17:56
1	91	347.5102048256884	286.1350340184951	20/04/28 05:17:57
1	91	349.0351725639923	282.6047482202111	20/04/28 05:17:58
1	21	350.8877918777577	279.83313763105457	20/04/28 05:17:59
1	21	350.8652335256991	278.2096248770342	20/04/28 05:18:00
1	21	350.86523352569907	278.2096248770342	20/04/28 05:18:01
1	21	350.86523352569907	278.2096248770342	20/04/28 05:18:02
1	91	348.12379182949536	280.07651446921267	20/04/28 05:18:03
3	75	350.88779187775776	279.8331376310545	20/04/28 05:18:04
1	32	350.200938783207	283.7197945784561	20/04/28 05:18:05
1	91	348.9451401600111	278.3107438802347	20/04/28 05:18:06
1	21	349.869715104689	280.5677001539347	20/04/28 05:18:07
1	32	350.200938783207	283.7197945784562	20/04/28 05:18:08
1	21	351.7766142601961	280.73785862803265	20/04/28 05:18:09
1	32	350.200938783207	283.7197945784562	20/04/28 05:18:10
1	91	347.5102048256884	286.13503401849505	20/04/28 05:18:11
1	91	348.47757386007197	284.8521216477545	20/04/28 05:18:12
1	91	348.47757386007197	284.8521216477545	20/04/28 05:18:13
1	32	351.2190155562757	282.985232055576	20/04/28 05:18:14
1	91	348.47757386007197	284.8521216477545	20/04/28 05:18:15
1	91	347.5102048256884	286.13503401849505	20/04/28 05:18:16
1	91	347.5102048256884	286.13503401849505	20/04/28 05:18:17
1	32	350.200938783207	283.7197945784561	20/04/28 05:18:18
1	32	351.2190155562757	282.985232055576	20/04/28 05:18:19
1	NULL	413.68738474091515	376.630477100049	20/04/28 05:18:20
1	91	349.3121164007687	282.81507358147803	20/04/28 05:18:21
1	91	347.5102048256884	286.1350340184951	20/04/28 05:18:22
1	91	348.47757386007197	284.8521216477545	20/04/28 05:18:23
1	91	348.47757386007197	284.8521216477545	20/04/28 05:18:24
1	32	350.200938783207	283.7197945784561	20/04/28 05:18:25
1	32	350.200938783207	283.7197945784561	20/04/28 05:18:26
1	91	348.47757386007197	284.8521216477545	20/04/28 05:18:27
1	21	351.7766142601961	280.73785862803265	20/04/28 05:18:28
1	91	348.5282815987571	285.4004714956149	20/04/28 05:18:29
1	91	348.7990436763643	281.34492591527015	20/04/28 05:18:30
1	32	350.200938783207	283.7197945784562	20/04/28 05:18:31
1	21	351.7766142601961	280.73785862803265	20/04/28 05:18:32
1	91	347.5102048256884	286.13503401849505	20/04/28 05:18:33
1	91	348.47757386007197	284.8521216477545	20/04/28 05:18:34
1	91	347.5102048256884	286.13503401849505	20/04/28 05:18:35
1	91	347.5102048256884	286.1350340184951	20/04/28 05:18:36
1	91	347.5102048256884	286.1350340184951	20/04/28 05:18:37
1	91	347.5102048256884	286.13503401849505	20/04/28 05:18:38
1	91	347.5102048256884	286.13503401849505	20/04/28 05:18:39
1	91	347.5102048256884	286.13503401849505	20/04/28 05:18:40
1	91	347.5102048256884	286.1350340184951	20/04/28 05:18:41
1	91	347.5102048256884	286.13503401849505	20/04/28 05:18:42
1	91	347.5102048256884	286.1350340184951	20/04/28 05:18:43
1	91	347.5102048256884	286.13503401849505	20/04/28 05:18:44
1	91	347.5102048256884	286.1350340184951	20/04/28 05:18:45
1	82	346.51460070757975	287.77282203530444	20/04/28 05:18:46
1	83	343.819718439418	284.5911886610593	20/04/28 05:18:47
1	83	343.819718439418	284.5911886610593	20/04/28 05:18:48
