floorId	partitionId	location_x	location_y	timeStamp
1	93	325.32504216255245	294.1232464693243	20/04/28 05:08:49
1	93	325.32504216255245	294.1232464693243	20/04/28 05:08:50
1	93	325.32504216255245	294.1232464693243	20/04/28 05:08:51
1	93	325.32504216255245	294.1232464693243	20/04/28 05:08:52
1	93	325.32504216255245	294.1232464693243	20/04/28 05:08:53
1	93	325.32504216255245	294.1232464693243	20/04/28 05:08:54
1	93	325.32504216255245	294.1232464693243	20/04/28 05:08:55
1	93	325.32504216255245	294.1232464693243	20/04/28 05:08:56
1	93	325.32504216255245	294.1232464693243	20/04/28 05:08:57
1	93	325.32504216255245	294.1232464693243	20/04/28 05:08:58
1	93	325.32504216255245	294.1232464693243	20/04/28 05:08:59
1	93	325.32504216255245	294.1232464693243	20/04/28 05:09:00
1	93	325.32504216255245	294.1232464693243	20/04/28 05:09:01
1	93	325.32504216255245	294.1232464693243	20/04/28 05:09:02
1	93	325.32504216255245	294.1232464693243	20/04/28 05:09:03
1	93	325.32504216255245	294.1232464693243	20/04/28 05:09:04
1	93	325.32504216255245	294.1232464693243	20/04/28 05:09:05
1	50	328.0892907075774	291.9473090105973	20/04/28 05:09:06
1	93	325.32504216255245	294.1232464693243	20/04/28 05:09:07
1	93	325.32504216255245	294.1232464693243	20/04/28 05:09:08
1	50	328.0892907075774	291.9473090105973	20/04/28 05:09:09
1	50	328.0892907075774	291.9473090105973	20/04/28 05:09:10
1	50	327.6844095055158	288.5207594301078	20/04/28 05:09:11
1	50	325.82176653676186	290.66965224740585	20/04/28 05:09:12
1	50	328.0892907075774	291.9473090105973	20/04/28 05:09:13
1	50	327.6844095055158	288.5207594301078	20/04/28 05:09:14
1	50	328.0892907075774	291.9473090105973	20/04/28 05:09:15
1	50	328.0892907075774	291.9473090105973	20/04/28 05:09:16
1	50	327.6844095055158	288.52075943010783	20/04/28 05:09:17
1	50	327.6844095055158	288.52075943010783	20/04/28 05:09:18
1	50	327.6844095055158	288.52075943010783	20/04/28 05:09:19
1	50	325.82176653676186	290.66965224740585	20/04/28 05:09:20
1	93	325.32504216255245	294.1232464693243	20/04/28 05:09:21
1	50	328.0892907075774	291.9473090105973	20/04/28 05:09:22
1	50	328.0892907075774	291.9473090105973	20/04/28 05:09:23
1	50	328.0892907075774	291.9473090105973	20/04/28 05:09:24
1	50	328.0892907075774	291.9473090105973	20/04/28 05:09:25
1	50	328.0892907075774	291.9473090105973	20/04/28 05:09:26
1	50	328.0892907075774	291.9473090105973	20/04/28 05:09:27
1	50	328.0892907075774	291.9473090105973	20/04/28 05:09:28
1	50	328.0892907075774	291.9473090105973	20/04/28 05:09:29
1	50	328.0892907075774	291.9473090105973	20/04/28 05:09:30
1	50	328.0892907075774	291.9473090105973	20/04/28 05:09:31
1	50	328.0892907075774	291.9473090105973	20/04/28 05:09:32
1	50	328.0892907075774	291.9473090105973	20/04/28 05:09:33
1	50	328.0892907075774	291.9473090105973	20/04/28 05:09:34
1	50	328.0892907075774	291.9473090105973	20/04/28 05:09:35
1	50	328.0892907075774	291.9473090105973	20/04/28 05:09:36
1	50	328.0892907075774	291.9473090105973	20/04/28 05:09:37
1	50	328.0892907075774	291.9473090105973	20/04/28 05:09:38
1	50	328.0892907075774	291.9473090105973	20/04/28 05:09:39
1	50	328.0892907075774	291.9473090105973	20/04/28 05:09:40
1	50	328.0892907075774	291.9473090105973	20/04/28 05:09:41
1	50	328.0892907075774	291.9473090105973	20/04/28 05:09:42
1	93	325.32504216255245	294.1232464693243	20/04/28 05:09:43
1	93	325.32504216255245	294.1232464693243	20/04/28 05:09:44
1	93	325.32504216255245	294.1232464693243	20/04/28 05:09:45
1	93	325.32504216255245	294.1232464693243	20/04/28 05:09:46
1	50	328.0892907075774	291.9473090105973	20/04/28 05:09:47
1	50	328.0892907075774	291.9473090105973	20/04/28 05:09:48
1	50	328.0892907075774	291.9473090105973	20/04/28 05:09:49
1	93	325.32504216255245	294.1232464693243	20/04/28 05:09:50
1	93	325.32504216255245	294.1232464693243	20/04/28 05:09:51
1	93	325.32504216255245	294.1232464693243	20/04/28 05:09:52
1	93	325.32504216255245	294.1232464693243	20/04/28 05:09:53
1	50	328.0892907075774	291.9473090105973	20/04/28 05:09:54
1	50	328.0892907075774	291.9473090105973	20/04/28 05:09:55
1	50	328.0892907075774	291.9473090105973	20/04/28 05:09:56
1	50	328.0892907075774	291.9473090105973	20/04/28 05:09:57
1	50	328.0892907075774	291.9473090105973	20/04/28 05:09:58
1	16	330.71128525095463	290.0288388939632	20/04/28 05:09:59
1	16	330.71128525095463	290.0288388939632	20/04/28 05:10:00
1	50	328.0892907075774	291.9473090105973	20/04/28 05:10:01
1	16	330.71128525095463	290.0288388939632	20/04/28 05:10:02
1	16	330.71128525095463	290.0288388939632	20/04/28 05:10:03
1	50	328.0892907075774	291.9473090105973	20/04/28 05:10:04
1	16	330.71128525095463	290.0288388939632	20/04/28 05:10:05
1	16	330.71128525095463	290.0288388939632	20/04/28 05:10:06
1	50	328.0892907075774	291.9473090105973	20/04/28 05:10:07
1	16	330.71128525095463	290.0288388939632	20/04/28 05:10:08
1	16	330.71128525095463	290.0288388939632	20/04/28 05:10:09
1	16	330.71128525095463	290.0288388939632	20/04/28 05:10:10
1	50	328.0892907075774	291.9473090105973	20/04/28 05:10:11
1	16	330.71128525095463	290.0288388939632	20/04/28 05:10:12
1	16	330.71128525095463	290.0288388939632	20/04/28 05:10:13
1	16	330.71128525095463	290.0288388939632	20/04/28 05:10:14
1	50	328.8486422822007	292.1777317112613	20/04/28 05:10:15
1	50	328.0892907075774	291.9473090105973	20/04/28 05:10:16
1	50	328.0892907075774	291.9473090105973	20/04/28 05:10:17
1	50	328.0892907075774	291.9473090105973	20/04/28 05:10:18
1	50	328.0892907075774	291.9473090105973	20/04/28 05:10:19
1	50	328.0892907075774	291.9473090105973	20/04/28 05:10:20
1	50	328.0892907075774	291.9473090105973	20/04/28 05:10:21
1	50	328.0892907075774	291.9473090105973	20/04/28 05:10:22
1	93	325.32504216255245	294.1232464693243	20/04/28 05:10:23
1	93	325.32504216255245	294.1232464693243	20/04/28 05:10:24
1	93	325.32504216255245	294.1232464693243	20/04/28 05:10:25
1	93	325.32504216255245	294.1232464693243	20/04/28 05:10:26
1	93	325.32504216255245	294.1232464693243	20/04/28 05:10:27
1	93	325.32504216255245	294.1232464693243	20/04/28 05:10:28
1	93	325.32504216255245	294.1232464693243	20/04/28 05:10:29
1	93	325.32504216255245	294.1232464693243	20/04/28 05:10:30
1	93	325.32504216255245	294.1232464693243	20/04/28 05:10:31
1	93	325.32504216255245	294.1232464693243	20/04/28 05:10:32
1	50	328.0892907075774	291.9473090105973	20/04/28 05:10:33
1	50	328.0892907075774	291.9473090105973	20/04/28 05:10:34
1	93	325.32504216255245	294.1232464693243	20/04/28 05:10:35
1	50	328.0892907075774	291.9473090105973	20/04/28 05:10:36
1	50	328.0892907075774	291.9473090105973	20/04/28 05:10:37
1	50	328.0892907075774	291.9473090105973	20/04/28 05:10:38
1	50	328.0892907075774	291.9473090105973	20/04/28 05:10:39
1	50	328.0892907075774	291.9473090105973	20/04/28 05:10:40
1	50	328.0892907075774	291.9473090105973	20/04/28 05:10:41
1	16	330.71128525095463	290.0288388939632	20/04/28 05:10:42
1	16	330.71128525095463	290.0288388939632	20/04/28 05:10:43
1	50	328.0892907075774	291.9473090105973	20/04/28 05:10:44
1	50	327.6844095055158	288.5207594301078	20/04/28 05:10:45
1	50	325.82176653676186	290.6696522474059	20/04/28 05:10:46
1	50	324.9201609604908	290.69669688883477	20/04/28 05:10:47
1	50	325.82176653676186	290.6696522474059	20/04/28 05:10:48
1	50	324.9201609604908	290.69669688883477	20/04/28 05:10:49
1	59	325.9232207888915	287.3354881525654	20/04/28 05:10:50
1	50	324.9201609604908	290.69669688883477	20/04/28 05:10:51
1	50	324.9201609604908	290.69669688883477	20/04/28 05:10:52
1	50	324.9201609604908	290.69669688883477	20/04/28 05:10:53
1	50	325.82176653676186	290.66965224740585	20/04/28 05:10:54
1	50	324.9201609604908	290.69669688883477	20/04/28 05:10:55
1	50	324.9201609604908	290.69669688883477	20/04/28 05:10:56
1	50	324.9201609604908	290.69669688883477	20/04/28 05:10:57
1	93	325.32504216255245	294.1232464693243	20/04/28 05:10:58
1	93	325.32504216255245	294.1232464693243	20/04/28 05:10:59
1	93	325.3250421625525	294.12324646932433	20/04/28 05:11:00
1	93	325.3250421625525	294.12324646932433	20/04/28 05:11:01
1	93	325.32504216255245	294.1232464693243	20/04/28 05:11:02
