floorId	partitionId	location_x	location_y	timeStamp
19	980	309.9047960730351	287.66028925659873	21/02/24 15:38:59
19	980	309.9089640095596	287.48643498948474	21/02/24 15:39:00
19	980	309.91285246539485	287.32423850797437	21/02/24 15:39:00
19	980	309.9178904072962	287.1140943054751	21/02/24 15:39:00
19	980	309.9178904072962	287.1140943054751	21/02/24 15:39:00
19	980	309.92249665265405	286.9219571637237	21/02/24 15:39:00
19	980	309.928446023039	286.67379517229995	21/02/24 15:39:00
19	980	309.9344164680078	286.42475411126725	21/02/24 15:39:00
19	980	309.94021632383806	286.18282871753985	21/02/24 15:39:00
19	980	309.94670901232104	285.91200367230255	21/02/24 15:39:00
19	980	309.95074159227846	285.7437954404972	21/02/24 15:39:00
19	980	309.95562888575233	285.53993513215045	21/02/24 15:39:01
19	980	309.96376690826185	285.2004794012856	21/02/24 15:39:01
19	980	309.96376690826185	285.2004794012856	21/02/24 15:39:01
19	980	309.9744250774688	284.7559025260538	21/02/24 15:39:01
19	980	309.97952871220133	284.5430181237112	21/02/24 15:39:01
19	980	309.97952871220133	284.5430181237112	21/02/24 15:39:01
19	980	309.9885931596471	284.16491906721313	21/02/24 15:39:01
19	980	309.9927328751192	283.99224196543486	21/02/24 15:39:01
19	980	309.9927328751192	283.99224196543486	21/02/24 15:39:01
19	980	309.99982881826753	283.696253773613	21/02/24 15:39:01
19	980	310.00602690244693	283.4377173548897	21/02/24 15:39:02
19	980	310.00970734514226	283.2841975822934	21/02/24 15:39:02
19	980	310.0159327835632	283.02452015492327	21/02/24 15:39:02
19	911	309.8406279873198	282.9870863029075	21/02/24 15:39:02
19	911	309.64221637860913	282.9870863028302	21/02/24 15:39:02
19	911	309.36613381314544	282.9870863027227	21/02/24 15:39:02
19	911	309.1244449450045	282.98708630262854	21/02/24 15:39:02
19	911	308.86244723484936	282.98708630252645	21/02/24 15:39:02
19	911	308.6552759670982	282.98708630244573	21/02/24 15:39:02
19	911	308.46286327361923	282.98708630237076	21/02/24 15:39:03
19	911	308.29625026247965	282.98708630230584	21/02/24 15:39:03
19	911	308.13462070741576	282.98708630224286	21/02/24 15:39:03
19	911	307.88101270184524	282.98708630214406	21/02/24 15:39:03
19	911	307.6404490747174	282.98708630205033	21/02/24 15:39:03
19	911	307.39820702527567	282.98708630195597	21/02/24 15:39:03
19	911	307.17555955085675	282.9870863018692	21/02/24 15:39:03
19	911	306.93054199017377	282.9870863017738	21/02/24 15:39:03
19	911	306.6439688317722	282.98708630166215	21/02/24 15:39:03
19	911	306.4749746071717	282.9870863015963	21/02/24 15:39:03
19	911	306.2779572988726	282.9870863015196	21/02/24 15:39:04
19	911	306.03555468889886	282.9870863014251	21/02/24 15:39:04
19	911	305.87773400871754	282.98708630136366	21/02/24 15:39:04
19	929	305.7973592711907	283.05840290802644	21/02/24 15:39:04
19	929	305.8078643292942	283.3052745646656	21/02/24 15:39:04
19	929	305.81785950683286	283.54016389255577	21/02/24 15:39:04
19	929	305.82747064935245	283.7660282954586	21/02/24 15:39:04
19	929	305.8361922654764	283.9709885917162	21/02/24 15:39:04
19	929	305.84353412344797	284.14352420478855	21/02/24 15:39:04
19	929	305.85423281044024	284.3949461917624	21/02/24 15:39:04
19	929	305.8667032502646	284.68800484104764	21/02/24 15:39:05
19	929	305.875375150052	284.89179679018645	21/02/24 15:39:05
19	929	305.88471843131583	285.1113663824092	21/02/24 15:39:05
19	929	305.8946744974471	285.3453365818331	21/02/24 15:39:05
19	929	305.9033811523338	285.549945285039	21/02/24 15:39:05
19	929	305.91350253203876	285.7878003973691	21/02/24 15:39:05
19	929	305.9225272222027	285.99988301409303	21/02/24 15:39:05
19	929	305.929052541852	286.1532297596376	21/02/24 15:39:05
19	929	305.94132855785125	286.4417193973729	21/02/24 15:39:05
19	929	305.9521598186875	286.6962569049048	21/02/24 15:39:05
19	929	305.96444613189004	286.98498852965355	21/02/24 15:39:06
19	929	305.9758544314026	287.25308659939753	21/02/24 15:39:06
19	929	305.9825896572736	287.4113661969244	21/02/24 15:39:06
19	929	305.9917192719498	287.62591456756576	21/02/24 15:39:06
19	929	306.00204413155245	287.8685515115566	21/02/24 15:39:06
19	929	306.0092616367066	288.0381648003785	21/02/24 15:39:06
19	929	306.0159925873648	288.1963439292688	21/02/24 15:39:06
19	929	306.0278225959897	288.47435227520265	21/02/24 15:39:06
19	929	306.04009314730615	288.7627134914419	21/02/24 15:39:06
19	929	306.04907534459903	288.9737975144062	21/02/24 15:39:07
19	929	306.0609026568894	289.25174249576276	21/02/24 15:39:07
19	929	306.06877479069675	289.4367397318714	21/02/24 15:39:07
19	929	306.077434298261	289.6402404604732	21/02/24 15:39:07
19	929	306.0877256114153	289.8820890540142	21/02/24 15:39:07
19	929	306.099689692384	290.16324813565075	21/02/24 15:39:07
19	929	306.10418510586953	290.2688915469973	21/02/24 15:39:07
19	929	305.94243844250536	290.3008180176165	21/02/24 15:39:07
19	929	305.75052530323063	290.2304249064936	21/02/24 15:39:07
19	929	305.89418008363157	289.9934991510205	21/02/24 15:39:07
19	929	306.09201823561597	289.4761871246556	21/02/24 15:39:08
19	929	306.09201823561597	289.4761871246556	21/02/24 15:39:08
19	929	306.23276224984147	289.50770474760753	21/02/24 15:39:08
19	929	306.3396807862779	289.4575538701022	21/02/24 15:39:08
19	929	306.33714740792135	289.43796217828896	21/02/24 15:39:08
19	929	306.4374355204254	289.5670074993537	21/02/24 15:39:08
19	929	306.33589244448484	289.4832472471075	21/02/24 15:39:08
19	929	306.4070602063261	289.5382343836903	21/02/24 15:39:08
19	929	306.37418761558956	289.3988135143473	21/02/24 15:39:08
19	929	306.37418761558956	289.3988135143473	21/02/24 15:39:09
19	929	306.50864299025284	289.32973604169086	21/02/24 15:39:09
19	929	306.6162927521261	289.458650476689	21/02/24 15:39:09
19	929	306.6182818481587	289.4592116140676	21/02/24 15:39:09
19	929	306.60748275787415	289.45279149291133	21/02/24 15:39:09
19	929	306.3624946048434	289.3530404739646	21/02/24 15:39:09
19	929	306.3638623902028	289.4928885357352	21/02/24 15:39:09
19	929	306.35267618577745	289.52853482440196	21/02/24 15:39:09
19	929	306.3732359224106	289.4658098834754	21/02/24 15:39:09
19	929	306.3732359224106	289.4658098834754	21/02/24 15:39:09
19	929	306.6266658440639	289.6160181429759	21/02/24 15:39:10
19	929	306.580763897105	289.43982008956283	21/02/24 15:39:10
19	929	306.580763897105	289.43982008956283	21/02/24 15:39:10
19	929	306.509233954192	289.3926138182995	21/02/24 15:39:10
19	929	306.54575445188766	289.56870250453113	21/02/24 15:39:10
19	929	306.48591275550507	289.36261138149655	21/02/24 15:39:10
19	929	306.48591275550507	289.36261138149655	21/02/24 15:39:10
19	929	306.66608879491196	289.4346563893793	21/02/24 15:39:10
19	929	306.9462513678033	289.521267216735	21/02/24 15:39:10
19	929	306.89120212158576	289.4656521760897	21/02/24 15:39:10
19	929	307.0257184924977	289.45850972949665	21/02/24 15:39:11
19	929	306.9722650846387	289.4573251695266	21/02/24 15:39:11
19	929	306.8386269444319	289.3045382457248	21/02/24 15:39:11
19	929	306.912209772947	289.18184575422356	21/02/24 15:39:11
19	929	306.94510447868555	289.32907571052294	21/02/24 15:39:11
19	929	306.94510447868555	289.32907571052294	21/02/24 15:39:11
19	929	307.1124691674056	289.5051524748579	21/02/24 15:39:11
19	929	307.062638658971	289.5162860991195	21/02/24 15:39:11
19	929	307.11035462421523	289.8003480065074	21/02/24 15:39:11
19	929	307.13050564667213	290.0806802758878	21/02/24 15:39:12
19	929	307.37513195099524	290.0540237825626	21/02/24 15:39:12
19	929	307.36219778491176	290.1375339096031	21/02/24 15:39:12
19	929	307.4054886640736	290.0461967200327	21/02/24 15:39:12
19	929	307.6830087623076	289.9739985628343	21/02/24 15:39:12
19	929	307.6990260169689	289.87578033339497	21/02/24 15:39:12
19	929	307.51121274325965	289.7883071749286	21/02/24 15:39:12
19	929	307.51121274325965	289.7883071749286	21/02/24 15:39:12
19	929	307.5752843214443	289.81993106191084	21/02/24 15:39:12
19	929	307.55537104732963	289.64612934800425	21/02/24 15:39:12
19	929	307.5984740735631	289.65180417766186	21/02/24 15:39:13
19	929	307.66474423465735	289.70024253446644	21/02/24 15:39:13
19	929	307.60953161188274	289.7961819140154	21/02/24 15:39:13
19	929	307.67382391665944	289.93256286036063	21/02/24 15:39:13
19	929	307.7820044799412	290.0076173836195	21/02/24 15:39:13
19	929	307.7703723073894	289.97819258241486	21/02/24 15:39:13
19	929	307.5752876780044	290.1242137244929	21/02/24 15:39:13
19	929	307.50396231075456	290.03765710704226	21/02/24 15:39:13
19	929	307.7291227842255	289.907159163344	21/02/24 15:39:13
19	929	307.7270541156756	289.99071605442344	21/02/24 15:39:13
19	929	307.51676421621744	290.0796264346569	21/02/24 15:39:14
19	929	307.7236637433222	289.9156046426266	21/02/24 15:39:14
19	929	307.7264202835201	289.9196293011625	21/02/24 15:39:14
19	929	307.47160614852186	289.99322173136795	21/02/24 15:39:14
19	929	307.54479851856877	290.06647270069925	21/02/24 15:39:14
19	929	307.54479851856877	290.06647270069925	21/02/24 15:39:14
19	929	307.42384858078907	290.27630634631277	21/02/24 15:39:14
19	929	307.4266241216103	290.27384627753344	21/02/24 15:39:14
19	929	307.4971227507966	290.3799123817083	21/02/24 15:39:14
19	929	307.4587254006609	290.42325170833277	21/02/24 15:39:15
19	929	307.3339056980331	290.4576928206326	21/02/24 15:39:15
19	929	307.34820780256916	290.4686311943737	21/02/24 15:39:15
19	929	307.3041331408157	290.58714357371696	21/02/24 15:39:15
19	929	307.4470364189729	290.41292358264036	21/02/24 15:39:15
19	929	307.46281310278226	290.425597916266	21/02/24 15:39:15
19	929	307.4467761320003	290.409856694656	21/02/24 15:39:15
19	929	307.485673931079	290.58887291332803	21/02/24 15:39:15
19	929	307.3986779553445	290.6272883163888	21/02/24 15:39:15
19	929	307.3077267540596	290.5222674520752	21/02/24 15:39:15
19	929	307.23894272480544	290.33609126221006	21/02/24 15:39:16
19	929	307.1921800725921	290.47354563681256	21/02/24 15:39:16
19	929	307.1789613472388	290.60746848245583	21/02/24 15:39:16
19	929	307.2420575865949	290.36681252425086	21/02/24 15:39:16
19	929	307.24110210833106	290.3697259880451	21/02/24 15:39:16
19	929	307.33112814566033	290.31367676273584	21/02/24 15:39:16
19	929	307.4673131537061	290.3001873986609	21/02/24 15:39:16
19	929	307.19589128775374	290.3553830777566	21/02/24 15:39:16
19	929	307.1944430720777	290.35272048543646	21/02/24 15:39:16
19	929	306.9976273169377	290.45977989819477	21/02/24 15:39:16
19	929	307.12933496341566	290.43780956883234	21/02/24 15:39:17
19	929	307.24614230248955	290.3542645415526	21/02/24 15:39:17
19	929	307.23771564877273	290.3435248081464	21/02/24 15:39:17
19	929	307.3192658434763	290.28232121827443	21/02/24 15:39:17
19	929	307.3482466239286	290.3563674129521	21/02/24 15:39:17
19	929	307.14389933457755	290.28777926983645	21/02/24 15:39:17
19	929	307.0377089393062	290.2808196924037	21/02/24 15:39:17
19	929	307.0375603497097	290.4546525715494	21/02/24 15:39:17
19	929	306.9440212791198	290.3336380726325	21/02/24 15:39:17
19	929	306.82884841064106	290.3919762563328	21/02/24 15:39:17
19	929	306.94188341859723	290.20806321254133	21/02/24 15:39:18
19	929	306.9415184188508	290.20894097148476	21/02/24 15:39:18
19	929	306.82769608967556	290.036758689969	21/02/24 15:39:18
19	929	306.79328189909006	289.9829693176934	21/02/24 15:39:18
19	929	306.94355156231995	289.8770747950402	21/02/24 15:39:18
19	929	307.1771900827185	289.95516017168	21/02/24 15:39:18
19	929	307.1771900827185	289.95516017168	21/02/24 15:39:18
19	929	307.20129985946863	289.9701662126887	21/02/24 15:39:18
19	929	307.31635671440864	289.9602541147346	21/02/24 15:39:18
19	929	307.3153514331936	289.98180455069837	21/02/24 15:39:19
19	929	307.55469832879135	289.8865048622275	21/02/24 15:39:19
19	929	307.6764953247325	289.81829704007004	21/02/24 15:39:19
19	929	307.86677340712333	289.8840430417534	21/02/24 15:39:19
19	929	308.0096917479712	289.9397777211059	21/02/24 15:39:19
19	929	307.9830956091831	289.9431405062907	21/02/24 15:39:19
19	929	307.85587728111324	290.0619640700922	21/02/24 15:39:19
19	929	307.62114694259	290.21322147973876	21/02/24 15:39:19
19	929	307.62114694259	290.21322147973876	21/02/24 15:39:19
19	929	307.10764189892126	290.0565450559699	21/02/24 15:39:19
19	929	307.25973580744585	289.88836267857283	21/02/24 15:39:20
19	929	307.25973580744585	289.88836267857283	21/02/24 15:39:20
19	929	307.2352173934063	289.8624429372423	21/02/24 15:39:20
19	929	307.24511270237696	289.8599932271876	21/02/24 15:39:20
19	929	307.0367986587635	290.0549307718846	21/02/24 15:39:20
19	929	306.99594737820246	290.0732191127118	21/02/24 15:39:20
19	929	307.17207837926173	290.0223715002454	21/02/24 15:39:20
19	929	307.35214407784787	290.108321767671	21/02/24 15:39:20
19	929	307.4110533067397	290.04612649606474	21/02/24 15:39:20
19	929	307.5315173218237	290.1749858759728	21/02/24 15:39:21
19	929	307.3976387450678	290.06480386295607	21/02/24 15:39:21
19	929	307.3427857826755	290.18468475664014	21/02/24 15:39:21
19	929	307.30741464274104	290.2785203383974	21/02/24 15:39:21
19	929	307.34257372191655	290.4357863422921	21/02/24 15:39:21
19	929	307.3255160609639	290.4221312539437	21/02/24 15:39:21
19	929	307.2740499682895	290.70585671467876	21/02/24 15:39:21
19	929	307.2708838051772	290.4609115057994	21/02/24 15:39:21
19	929	307.21272123665904	290.4592807888401	21/02/24 15:39:21
19	929	307.4217777324939	290.3239203170901	21/02/24 15:39:21
19	929	307.5490404975688	290.1721458939305	21/02/24 15:39:22
19	929	307.5490404975688	290.1721458939305	21/02/24 15:39:22
19	929	307.5319955886146	290.1820252988132	21/02/24 15:39:22
19	929	307.6290305572891	290.25162913042703	21/02/24 15:39:22
19	929	307.46161204902575	290.4153354772972	21/02/24 15:39:22
19	929	307.46161204902575	290.4153354772972	21/02/24 15:39:22
19	929	307.33073950101107	290.71694924081805	21/02/24 15:39:22
19	929	307.12118161174567	290.6746039380999	21/02/24 15:39:22
19	929	307.25139707199685	290.6711117263534	21/02/24 15:39:22
19	929	307.4336905536265	290.7488619303482	21/02/24 15:39:22
19	929	307.4585942906293	290.67941202691674	21/02/24 15:39:23
19	929	307.54872212157176	290.7062515971529	21/02/24 15:39:23
19	929	307.4827281713753	290.72757974555554	21/02/24 15:39:23
19	929	307.56134357378414	290.594028786492	21/02/24 15:39:23
19	929	307.5586225879516	290.58717509729064	21/02/24 15:39:23
19	929	307.5562200435364	290.5757070738645	21/02/24 15:39:23
19	929	307.6645915739066	290.618814785044	21/02/24 15:39:23
19	929	307.66701812831315	290.5747937975136	21/02/24 15:39:23
19	929	307.6285005227115	290.56454269512955	21/02/24 15:39:23
19	929	307.5794945521796	290.4677155425394	21/02/24 15:39:24
19	929	307.5556648108573	290.73807085502165	21/02/24 15:39:24
19	929	307.54130481432287	290.7562884756777	21/02/24 15:39:24
19	929	307.70465778086043	290.70468563631744	21/02/24 15:39:24
19	929	307.44472559302295	290.7628225867159	21/02/24 15:39:24
19	929	307.44919426012797	290.5083556073966	21/02/24 15:39:24
19	929	307.51293765909344	290.21674884461083	21/02/24 15:39:24
19	929	307.7571781041007	290.1808754419403	21/02/24 15:39:24
19	929	307.69701645719607	290.08693212208243	21/02/24 15:39:24
19	929	307.42677610165777	290.0773585999456	21/02/24 15:39:24
19	929	307.42677610165777	290.0773585999456	21/02/24 15:39:25
19	929	307.614077942691	290.04382117236094	21/02/24 15:39:25
19	929	307.6211968253388	290.04838687298405	21/02/24 15:39:25
19	929	307.6211968253388	290.04838687298405	21/02/24 15:39:25
19	929	307.6211968253388	290.04838687298405	21/02/24 15:39:25
19	929	307.5532107608568	289.84824511181944	21/02/24 15:39:25
19	929	307.5013404572064	289.69554596672504	21/02/24 15:39:25
19	929	307.4397878540899	289.5143434440336	21/02/24 15:39:25
19	929	307.3521210648893	289.25626429619734	21/02/24 15:39:25
19	929	307.25731374086484	288.97716438144096	21/02/24 15:39:25
19	929	307.17461906578086	288.7337224638017	21/02/24 15:39:26
19	929	307.17461906578086	288.7337224638017	21/02/24 15:39:26
19	929	307.12514552728607	288.5880790705441	21/02/24 15:39:26
19	929	307.03646112079167	288.3270041952905	21/02/24 15:39:26
19	929	306.86334831559986	287.81738355501346	21/02/24 15:39:26
19	929	306.7728762821838	287.5510461483406	21/02/24 15:39:26
19	929	306.7025845330106	287.3441167638845	21/02/24 15:39:26
19	929	306.7025845330106	287.3441167638845	21/02/24 15:39:26
19	929	306.6386281902887	287.1558379575212	21/02/24 15:39:26
19	929	306.6386281902887	287.1558379575212	21/02/24 15:39:27
19	929	306.56597467728886	286.9419558603976	21/02/24 15:39:27
19	929	306.44860024111034	286.5964214254888	21/02/24 15:39:27
19	929	306.3583320068326	286.33068397586266	21/02/24 15:39:27
19	929	306.26435818721774	286.0540377851413	21/02/24 15:39:27
19	929	306.1816231960871	285.8104771825239	21/02/24 15:39:27
19	929	306.10295546031244	285.578890028528	21/02/24 15:39:27
19	929	306.0367100601216	285.3838725471624	21/02/24 15:39:27
19	929	305.9775912566656	285.20983480087165	21/02/24 15:39:27
19	929	305.9269067308494	285.06062642503855	21/02/24 15:39:27
19	929	305.9269067308494	285.06062642503855	21/02/24 15:39:28
19	929	305.79728337769046	284.6790328383683	21/02/24 15:39:28
19	929	305.79728337769046	284.6790328383683	21/02/24 15:39:28
19	929	305.71513230677056	284.4371912177253	21/02/24 15:39:28
19	929	305.5621426994722	283.98681054518795	21/02/24 15:39:28
19	929	305.4950993614193	283.7894440428836	21/02/24 15:39:28
19	929	305.42485415161565	283.58265166402487	21/02/24 15:39:28
19	929	305.35610068428366	283.38025077285937	21/02/24 15:39:28
19	929	305.35610068428366	283.38025077285937	21/02/24 15:39:28
19	911	305.37129196618883	282.9767508685068	21/02/24 15:39:29
19	911	305.55625195493127	282.96389907724114	21/02/24 15:39:29
19	911	305.79155269893727	282.94754940038837	21/02/24 15:39:29
19	911	306.07132003842355	282.9281099990644	21/02/24 15:39:29
19	911	306.22670026158875	282.91731353325304	21/02/24 15:39:29
19	911	306.4714833189795	282.90030498572685	21/02/24 15:39:29
19	911	306.4714833189795	282.90030498572685	21/02/24 15:39:29
19	911	306.74465987951174	282.8813235392069	21/02/24 15:39:29
19	911	307.0060259048283	282.8631627379214	21/02/24 15:39:29
19	911	307.1584430588026	282.8525721585128	21/02/24 15:39:29
19	911	307.35647768805563	282.8388118867057	21/02/24 15:39:30
19	911	307.5298702707098	282.8267638470489	21/02/24 15:39:30
19	911	307.70950134594295	282.81428233091435	21/02/24 15:39:30
19	911	307.9621412989261	282.7967278535207	21/02/24 15:39:30
19	911	308.1330924500863	282.7848494547044	21/02/24 15:39:30
19	911	308.28770409585223	282.7741063928555	21/02/24 15:39:30
19	911	308.5745716676286	282.7541736377854	21/02/24 15:39:30
19	911	308.7507583717566	282.74193145091766	21/02/24 15:39:30
19	911	309.002227809112	282.72445830583064	21/02/24 15:39:30
19	911	309.259572780474	282.70657690414095	21/02/24 15:39:30
19	911	309.55706120450634	282.6859061679692	21/02/24 15:39:31
19	911	309.83248080617784	282.6667688655979	21/02/24 15:39:31
19	911	310.07439698857667	282.6499595205005	21/02/24 15:39:31
19	911	310.29523881089375	282.6346145098176	21/02/24 15:39:31
19	911	310.5372929815907	282.61779557671787	21/02/24 15:39:31
19	911	310.8139238972261	282.5985741072014	21/02/24 15:39:31
19	911	310.9831930435833	282.58681258109243	21/02/24 15:39:31
19	911	311.2024272767964	282.5715792724038	21/02/24 15:39:31
19	911	311.3981835748004	282.5579773085521	21/02/24 15:39:31
19	911	311.5989793887707	282.5440251781172	21/02/24 15:39:32
19	911	311.7769066879863	282.5316620474448	21/02/24 15:39:32
19	911	311.96926699695933	282.51829605107156	21/02/24 15:39:32
19	911	312.1529981469499	282.50552964464634	21/02/24 15:39:32
19	911	312.31087465628815	282.49455972646257	21/02/24 15:39:32
19	911	312.5050462099338	282.4810678772569	21/02/24 15:39:32
19	911	312.9918832373553	282.4472404105742	21/02/24 15:39:32
19	911	313.16585671006317	282.43515200825425	21/02/24 15:39:32
19	911	313.16585671006317	282.43515200825425	21/02/24 15:39:32
19	911	313.41915980441684	282.41755145303296	21/02/24 15:39:32
19	911	313.69729368407104	282.39822555130934	21/02/24 15:39:33
19	911	313.8823096703112	282.385369869104	21/02/24 15:39:33
19	911	314.3895099441573	282.3501274791488	21/02/24 15:39:33
19	911	314.3895099441573	282.3501274791488	21/02/24 15:39:33
19	911	314.6299765595848	282.33341885600896	21/02/24 15:39:33
19	911	315.08263298621915	282.3019663999955	21/02/24 15:39:33
19	911	315.08263298621915	282.3019663999955	21/02/24 15:39:33
19	911	315.35590932733516	282.28297802030454	21/02/24 15:39:33
19	911	315.7538155807034	282.25532983462733	21/02/24 15:39:33
19	911	315.7538155807034	282.25532983462733	21/02/24 15:39:34
19	911	316.0200720205051	282.23682922695133	21/02/24 15:39:34
19	911	316.40128571336555	282.210340909983	21/02/24 15:39:34
19	911	316.40128571336555	282.210340909983	21/02/24 15:39:34
19	911	316.84499288110965	282.1795102857939	21/02/24 15:39:34
19	911	317.07980703973874	282.1631944189221	21/02/24 15:39:34
19	911	317.07980703973874	282.1631944189221	21/02/24 15:39:34
19	911	317.5169729068717	282.1328183115755	21/02/24 15:39:34
19	911	317.7325812442976	282.1178369452455	21/02/24 15:39:34
19	911	317.90644029426153	282.1057564934949	21/02/24 15:39:34
19	911	318.19497530651734	282.08570787770736	21/02/24 15:39:35
19	911	318.47966941495946	282.0659261439327	21/02/24 15:39:35
19	911	318.7325860643011	282.04835244052225	21/02/24 15:39:35
19	911	318.9895285298196	282.03049900661694	21/02/24 15:39:35
19	911	319.2799025570586	282.0103226084001	21/02/24 15:39:35
19	911	319.2799025570586	282.0103226084001	21/02/24 15:39:35
19	911	319.79913063100656	281.9742444767402	21/02/24 15:39:35
19	911	320.0902785243848	281.9540143070771	21/02/24 15:39:35
19	911	320.3441247800931	281.93637601074005	21/02/24 15:39:35
19	911	320.3441247800931	281.93637601074005	21/02/24 15:39:35
19	911	320.57135162854445	281.92058734181705	21/02/24 15:39:36
19	911	320.8101611950687	281.90399385734463	21/02/24 15:39:36
19	911	321.0660595026435	281.8862129758872	21/02/24 15:39:36
19	911	321.2622696745702	281.87257947498273	21/02/24 15:39:36
19	911	321.5332430050247	281.85375111807565	21/02/24 15:39:36
19	911	321.79170641017794	281.8357920029425	21/02/24 15:39:36
19	911	322.05525724554127	281.81747939194474	21/02/24 15:39:36
19	911	322.27224631155565	281.80240208683506	21/02/24 15:39:36
19	911	322.4930185748919	281.7870619094002	21/02/24 15:39:36
19	911	322.72368722903263	281.77103408946624	21/02/24 15:39:37
19	911	322.92967408020667	281.7567212641208	21/02/24 15:39:37
19	911	323.19959683162796	281.73796590582566	21/02/24 15:39:37
19	911	323.36449429884874	281.7265081422122	21/02/24 15:39:37
19	911	323.5663546397837	281.7124820440049	21/02/24 15:39:37
19	911	323.71884343655	281.70188648655636	21/02/24 15:39:37
19	911	323.9463064169136	281.6860814102034	21/02/24 15:39:37
19	911	324.17033397680353	281.6705150411901	21/02/24 15:39:37
19	911	324.40677967278367	281.6540858082999	21/02/24 15:39:37
19	911	324.6367874284861	281.6381039103452	21/02/24 15:39:37
19	911	324.87332373690947	281.62166838132464	21/02/24 15:39:38
19	911	325.03086622936706	281.61072167202656	21/02/24 15:39:38
19	911	325.3204391863015	281.5906009355148	21/02/24 15:39:38
19	911	325.5545000986588	281.57433740733484	21/02/24 15:39:38
19	911	325.78689095347244	281.55818992171686	21/02/24 15:39:38
19	911	325.99951655747105	281.5434158081428	21/02/24 15:39:38
19	911	326.21642299720764	281.52834424425146	21/02/24 15:39:38
19	911	326.41266524080675	281.51470851487346	21/02/24 15:39:38
19	911	326.61216178031214	281.5008466634461	21/02/24 15:39:38
19	911	326.8297230136727	281.48572960176335	21/02/24 15:39:38
19	911	327.0508999139429	281.4703613084671	21/02/24 15:39:39
19	911	327.25133492195056	281.456434248335	21/02/24 15:39:39
19	911	327.40376269463246	281.4458429310943	21/02/24 15:39:39
19	911	327.6146231291535	281.431191468856	21/02/24 15:39:39
19	911	327.80510670619367	281.4179558756431	21/02/24 15:39:39
19	911	328.03145479837895	281.40222826636966	21/02/24 15:39:39
19	911	328.3030575704533	281.3833561732342	21/02/24 15:39:39
19	911	328.4531032714227	281.37293037226885	21/02/24 15:39:39
19	911	328.71824997411187	281.3545068737548	21/02/24 15:39:39
19	911	328.92615835056523	281.3400605328206	21/02/24 15:39:40
19	911	329.1884964583029	281.3218321871951	21/02/24 15:39:40
19	911	329.4314002422364	281.304954219425	21/02/24 15:39:40
19	911	329.6999021760618	281.28629758546094	21/02/24 15:39:40
19	911	329.9113608992515	281.2716045516312	21/02/24 15:39:40
19	911	330.1299008452294	281.2564194849147	21/02/24 15:39:40
19	964	330.3166862063061	281.2331896143036	21/02/24 15:39:40
19	964	330.5557921915392	281.2011917797308	21/02/24 15:39:40
19	964	330.78298708941463	281.1707879203254	21/02/24 15:39:40
19	964	331.00843619709156	281.1406176874682	21/02/24 15:39:40
19	964	331.27155838121337	281.10540593770054	21/02/24 15:39:41
19	964	331.4363955159593	281.08334696931496	21/02/24 15:39:41
19	964	331.6637728903638	281.0529186903879	21/02/24 15:39:41
19	964	331.9506681685034	281.01452555840217	21/02/24 15:39:41
19	964	332.1259854799564	280.9910641033317	21/02/24 15:39:41
19	964	332.3437015543532	280.9619287267095	21/02/24 15:39:41
19	964	332.5886620949745	280.92914741908965	21/02/24 15:39:41
19	964	332.86581274589776	280.8920583404898	21/02/24 15:39:41
19	964	333.1011142549879	280.8605696316009	21/02/24 15:39:41
19	964	333.2871818358449	280.8356695452822	21/02/24 15:39:41
19	964	333.5080977700627	280.80610595443056	21/02/24 15:39:42
19	964	333.6866295670591	280.78221432787547	21/02/24 15:39:42
19	964	333.85556573298527	280.7596068156235	21/02/24 15:39:42
19	964	334.0446351937579	280.73430500930243	21/02/24 15:39:42
19	964	334.2706194871197	280.7040631563936	21/02/24 15:39:42
19	964	334.2706194871197	280.7040631563936	21/02/24 15:39:42
19	964	334.4213209135166	280.68389586820535	21/02/24 15:39:42
19	964	334.5720978800891	280.66371847101857	21/02/24 15:39:42
19	964	334.84883340559617	280.626684945668	21/02/24 15:39:42
19	964	335.1264467068027	280.58953395390773	21/02/24 15:39:42
19	964	335.4013281827519	280.5527485426769	21/02/24 15:39:43
19	964	335.55101109383463	280.5327175550689	21/02/24 15:39:43
19	964	335.73390346544323	280.5082423841707	21/02/24 15:39:43
19	964	336.01877444405613	280.4701201496337	21/02/24 15:39:43
19	964	336.2465918120916	280.4396329895231	21/02/24 15:39:43
19	964	336.42083005165244	280.4163159388843	21/02/24 15:39:43
19	964	336.6189253913694	280.38980626408994	21/02/24 15:39:43
19	964	336.7948928648986	280.3662578025042	21/02/24 15:39:43
19	964	337.04903307647476	280.33224804553225	21/02/24 15:39:43
19	964	337.2279118249576	280.3083099889547	21/02/24 15:39:44
19	964	337.4899782049871	280.27323952985637	21/02/24 15:39:44
19	964	337.6847052113596	280.24718061489153	21/02/24 15:39:44
19	964	337.83512983458144	280.22705036928164	21/02/24 15:39:44
19	964	338.0196050729434	280.20236337470834	21/02/24 15:39:44
19	964	338.18789415495814	280.17984245704304	21/02/24 15:39:44
19	964	338.33764412947437	280.159802494818	21/02/24 15:39:44
19	964	338.5833474421762	280.12692178735193	21/02/24 15:39:44
19	964	338.7476267647885	280.10493746695295	21/02/24 15:39:44
19	964	338.95011345398217	280.0778401294367	21/02/24 15:39:44
19	964	339.2322815137672	280.0400796070895	21/02/24 15:39:45
19	964	339.4370269093735	280.0126800031366	21/02/24 15:39:45
19	964	339.72755974973734	279.9738000823564	21/02/24 15:39:45
19	964	339.9404393469429	279.9453119366971	21/02/24 15:39:45
19	964	340.1127481197318	279.92225309272146	21/02/24 15:39:45
19	964	340.1127481197318	279.92225309272146	21/02/24 15:39:45
19	964	340.1127481197318	279.92225309272146	21/02/24 15:39:45
19	964	340.3643578486187	279.88858197205093	21/02/24 15:39:45
19	964	340.54895822150456	279.86387823162414	21/02/24 15:39:45
19	915	340.42145447204445	279.88921097475503	21/02/24 15:39:45
19	915	340.2571366372823	279.91802192465383	21/02/24 15:39:46
19	915	340.1091041371126	279.94397745742947	21/02/24 15:39:46
19	915	339.8864050297367	279.98302478807625	21/02/24 15:39:46
19	915	339.5998123341017	280.0332750108062	21/02/24 15:39:46
19	915	339.43181737724865	280.06273069522507	21/02/24 15:39:46
19	915	339.39770945374863	279.987391662575	21/02/24 15:39:46
19	915	339.4463015862417	280.0944340489427	21/02/24 15:39:46
19	915	339.43656998868886	280.10176546291626	21/02/24 15:39:46
19	915	339.3117877175707	279.9522018091353	21/02/24 15:39:46
19	915	339.43016546426435	280.0159707389421	21/02/24 15:39:47
19	915	339.42655564908335	280.2282896622359	21/02/24 15:39:47
19	915	339.4477145650693	280.3032559728314	21/02/24 15:39:47
19	915	339.4419533839785	280.28784172537075	21/02/24 15:39:47
19	915	339.531231058518	280.0734927655697	21/02/24 15:39:47
19	915	339.33331181213396	280.11950940970365	21/02/24 15:39:47
19	915	339.22208305537134	280.14624252515523	21/02/24 15:39:47
19	915	339.236168882725	280.144393293621	21/02/24 15:39:47
19	915	339.2389392362215	280.14780245855906	21/02/24 15:39:47
19	915	339.2252850709064	280.1529317904739	21/02/24 15:39:47
19	915	339.44728743275937	280.1330937003098	21/02/24 15:39:48
19	915	339.43660535201036	280.203788628455	21/02/24 15:39:48
19	915	339.46822564904465	280.10136666245825	21/02/24 15:39:48
19	915	339.3485068426898	280.0042956830632	21/02/24 15:39:48
19	915	339.4853282462098	280.0933677587945	21/02/24 15:39:48
19	915	339.5446737897306	279.818982198038	21/02/24 15:39:48
19	915	339.4027264627283	279.7752071726305	21/02/24 15:39:48
19	915	339.27295350617345	279.85253839745627	21/02/24 15:39:48
19	915	339.2688384231623	280.0651745589676	21/02/24 15:39:48
19	915	339.1441543555437	280.2370762497581	21/02/24 15:39:48
19	915	339.40430744710653	280.1934062879555	21/02/24 15:39:49
19	915	339.5114282531398	280.05514728431694	21/02/24 15:39:49
19	915	339.5638483904976	280.0519732641204	21/02/24 15:39:49
19	915	339.6065977016261	280.0777350802061	21/02/24 15:39:49
19	915	339.62391686319324	280.0305734994759	21/02/24 15:39:49
19	915	339.7282007568805	280.1365919636383	21/02/24 15:39:49
19	915	339.7075047562425	280.1213652980532	21/02/24 15:39:49
19	915	339.7238426461165	280.3087088534354	21/02/24 15:39:49
19	915	339.7605697697044	280.1888689278411	21/02/24 15:39:49
19	915	339.5212573319385	280.22681265179136	21/02/24 15:39:50
19	915	339.3003201069636	280.0426317418563	21/02/24 15:39:50
19	915	339.34234820096657	279.92538772452804	21/02/24 15:39:50
19	915	339.3085515914935	279.9900752736481	21/02/24 15:39:50
19	915	339.4994352290655	280.1212202917282	21/02/24 15:39:50
19	915	339.4568517921458	280.153672962669	21/02/24 15:39:50
19	915	339.58184099732097	280.2281461991694	21/02/24 15:39:50
19	915	339.4380696890821	280.0320325200229	21/02/24 15:39:50
19	915	339.64447497380763	279.978227287624	21/02/24 15:39:50
19	915	339.5748383086118	280.0142716168373	21/02/24 15:39:50
19	915	339.3654927944342	280.01122663650204	21/02/24 15:39:51
19	915	339.352155333165	279.85616814497865	21/02/24 15:39:51
19	915	339.6202952405774	279.82066738618323	21/02/24 15:39:51
19	915	339.42995662991177	279.7626406649884	21/02/24 15:39:51
19	915	339.1806423084438	279.71620327416514	21/02/24 15:39:51
19	915	339.1001800983576	279.72659193360465	21/02/24 15:39:51
19	915	339.1659880064435	279.9227719813522	21/02/24 15:39:51
19	915	339.0352756725121	279.8223131684237	21/02/24 15:39:51
19	915	338.97217439841006	279.7443032783495	21/02/24 15:39:51
19	915	338.9510954023549	279.78005617045176	21/02/24 15:39:51
19	915	338.8107721166498	279.78804116888193	21/02/24 15:39:52
19	915	338.80834613422843	280.0610752343403	21/02/24 15:39:52
19	915	338.5390221939044	279.9503470333567	21/02/24 15:39:52
19	915	338.51449114679804	279.94002386609395	21/02/24 15:39:52
19	915	338.3059746702109	279.8859574556671	21/02/24 15:39:52
19	915	338.50474220577877	279.8290280060726	21/02/24 15:39:52
19	915	338.44057613432375	279.7636989226355	21/02/24 15:39:52
19	915	338.2908556161395	279.6608697143986	21/02/24 15:39:52
19	915	338.49662144595123	279.8174291188644	21/02/24 15:39:52
19	915	338.78434525375457	279.7641101821429	21/02/24 15:39:53
19	915	338.78322442235856	279.76385361650426	21/02/24 15:39:53
19	915	338.8384562664975	279.9732657972345	21/02/24 15:39:53
19	915	339.01612180098175	279.8387059474422	21/02/24 15:39:53
19	915	338.973054942219	279.82782585779444	21/02/24 15:39:53
19	915	339.1763372586673	279.64074431724185	21/02/24 15:39:53
19	915	339.16029004003997	279.6630801076234	21/02/24 15:39:53
19	915	338.9152732546408	279.75777240449315	21/02/24 15:39:53
19	915	338.86985486730487	279.7358639132711	21/02/24 15:39:53
19	915	338.7184391321636	279.51604777418424	21/02/24 15:39:53
19	915	338.77718610023237	279.5055867604315	21/02/24 15:39:54
19	915	338.55731409884754	279.3662504890054	21/02/24 15:39:54
19	915	338.69421261596204	279.3652986221791	21/02/24 15:39:54
19	915	338.9039062903376	279.29420472888347	21/02/24 15:39:54
19	915	338.9846793950509	279.14009068516435	21/02/24 15:39:54
19	915	338.9819880549784	279.1604241573087	21/02/24 15:39:54
19	915	338.9255367366307	279.0184697338804	21/02/24 15:39:54
19	915	338.63595490066075	279.0778144627526	21/02/24 15:39:54
19	915	338.3569518214195	279.070889862445	21/02/24 15:39:54
19	915	338.18880179863413	279.20238742472486	21/02/24 15:39:54
19	915	338.1758814214295	279.18329563088395	21/02/24 15:39:55
19	915	338.24484669218805	279.16279528852283	21/02/24 15:39:55
19	915	338.4140373018159	279.2383241966515	21/02/24 15:39:55
19	915	338.51109385250555	279.165663706102	21/02/24 15:39:55
19	915	338.76039026304124	279.2345693591114	21/02/24 15:39:55
19	915	338.80006873436645	279.3220073717609	21/02/24 15:39:55
19	915	338.9958800226321	279.3214955439063	21/02/24 15:39:55
19	915	339.0922165608138	279.25390020562827	21/02/24 15:39:55
19	915	339.00360560887145	279.4027114642612	21/02/24 15:39:55
19	915	339.02909041584627	279.2404042057233	21/02/24 15:39:56
19	915	338.9538120540394	279.3311156944168	21/02/24 15:39:56
19	915	338.96883237202906	279.251423167541	21/02/24 15:39:56
19	915	338.92956409287984	279.0642664377018	21/02/24 15:39:56
19	915	339.03371696072503	278.8820541582621	21/02/24 15:39:56
19	915	338.9455663202715	278.822788426954	21/02/24 15:39:56
19	915	339.104782404257	278.7256126951942	21/02/24 15:39:56
19	915	338.9209025369017	278.74284121201964	21/02/24 15:39:56
19	915	338.92067289786223	278.7282568294187	21/02/24 15:39:56
19	915	338.7857559032851	278.8312644339152	21/02/24 15:39:56
19	915	338.79822453872833	278.8221683223634	21/02/24 15:39:57
19	915	339.0180219911068	278.9818570916241	21/02/24 15:39:57
19	915	339.2596073232233	279.13153959441644	21/02/24 15:39:57
19	915	339.25797270704965	279.1332427273759	21/02/24 15:39:57
19	915	339.28795323698165	279.21240528456116	21/02/24 15:39:57
19	915	339.20614929241765	279.2213868022648	21/02/24 15:39:57
19	915	339.46253690578317	279.29782795632474	21/02/24 15:39:57
19	915	339.55864663803226	279.4069839116847	21/02/24 15:39:57
19	915	339.76503928128824	279.42603571825794	21/02/24 15:39:57
19	915	339.47820643591706	279.47935040312484	21/02/24 15:39:57
19	915	339.43981230246493	279.4122957614864	21/02/24 15:39:58
19	915	339.52949837139096	279.6016456357634	21/02/24 15:39:58
19	915	339.43884319140204	279.63621637428	21/02/24 15:39:58
19	915	339.4722003436905	279.5907294663164	21/02/24 15:39:58
19	915	339.6386508181382	279.76392470224863	21/02/24 15:39:58
19	915	339.75228331435216	279.74285367555314	21/02/24 15:39:58
19	915	339.7553470037776	279.6844811124227	21/02/24 15:39:58
19	915	339.739911879061	279.7158938473052	21/02/24 15:39:58
19	915	339.6394776984818	279.7050960504769	21/02/24 15:39:58
19	915	339.64516410169495	279.8971408805916	21/02/24 15:39:58
19	915	339.6556133080181	280.01042229583254	21/02/24 15:39:59
19	915	339.71526446184936	280.09233015145423	21/02/24 15:39:59
19	915	339.6685386198802	280.12575819201203	21/02/24 15:39:59
19	915	339.81889159310765	280.0410049415451	21/02/24 15:39:59
19	915	339.73164641297103	280.11878606089033	21/02/24 15:39:59
19	915	339.8870791099084	280.20832354034974	21/02/24 15:39:59
19	915	339.9544007784528	280.05857458968785	21/02/24 15:39:59
19	915	340.072583025102	280.0041424984614	21/02/24 15:39:59
19	915	340.00699886715216	279.81914706388596	21/02/24 15:39:59
19	915	340.0313926325757	279.77624777565256	21/02/24 15:40:00
19	915	340.06482126863216	279.75284397402356	21/02/24 15:40:00
19	915	340.2221597253194	279.6609957851949	21/02/24 15:40:00
19	915	340.1620022241282	279.5963561315413	21/02/24 15:40:00
19	915	340.1304887970715	279.5539431310138	21/02/24 15:40:00
19	915	340.23607365965347	279.5832594486409	21/02/24 15:40:00
19	915	340.3098771478763	279.38529810102995	21/02/24 15:40:00
19	915	340.36068306766697	279.27455294208846	21/02/24 15:40:00
19	915	340.58994684844646	279.23722612016775	21/02/24 15:40:00
19	915	340.4997295737122	279.0096652905809	21/02/24 15:40:00
19	915	340.54668189937314	278.98918155893205	21/02/24 15:40:01
19	915	340.27279861586453	279.03133725972947	21/02/24 15:40:01
19	915	340.2437904218928	278.74407921165897	21/02/24 15:40:01
19	915	340.2984306006506	278.5642565304491	21/02/24 15:40:01
19	915	340.3107866952141	278.57689916809875	21/02/24 15:40:01
19	915	340.30752593886575	278.2829689155704	21/02/24 15:40:01
19	915	340.2913098799541	278.2780464445563	21/02/24 15:40:01
19	915	340.1783104076578	278.26853103938794	21/02/24 15:40:01
19	915	340.07800421264767	278.05746976586175	21/02/24 15:40:01
19	915	339.98513644303364	278.1009246826797	21/02/24 15:40:01
19	915	340.0544969252301	278.30952907951706	21/02/24 15:40:02
19	915	339.96922900788155	278.0672491027276	21/02/24 15:40:02
19	915	340.0044918310876	278.08373825579804	21/02/24 15:40:02
19	915	340.077800856285	278.09030568691446	21/02/24 15:40:02
19	915	339.9456242520436	278.09080256651896	21/02/24 15:40:02
19	915	339.9416848466587	278.1568704352118	21/02/24 15:40:02
19	915	340.02974345968863	278.33407643842116	21/02/24 15:40:02
19	915	340.02565934591155	278.3405972990155	21/02/24 15:40:02
19	915	339.918113637566	278.44156535626786	21/02/24 15:40:02
19	915	339.88465439127424	278.3831489829245	21/02/24 15:40:03
19	915	340.0147842897965	278.3816741559721	21/02/24 15:40:03
19	915	339.80891474146455	278.46285006394965	21/02/24 15:40:03
19	915	339.9606045008833	278.5882629930497	21/02/24 15:40:03
19	915	339.87738664976285	278.628161801159	21/02/24 15:40:03
19	915	339.88743983131275	278.58920848211415	21/02/24 15:40:03
19	915	339.8533176279301	278.49470856988296	21/02/24 15:40:03
19	915	339.8939433785195	278.56686526169136	21/02/24 15:40:03
19	915	339.8939433785195	278.56686526169136	21/02/24 15:40:03
19	915	339.8939433785195	278.56686526169136	21/02/24 15:40:03
19	915	339.97590202841275	278.6930606457833	21/02/24 15:40:04
19	915	340.12131202202033	278.9169548902349	21/02/24 15:40:04
19	915	340.24544873420416	279.10809371565915	21/02/24 15:40:04
19	915	340.39049470892735	279.3314274640191	21/02/24 15:40:04
19	915	340.5373005495489	279.55747095629613	21/02/24 15:40:04
19	964	340.74243935692823	279.7063852112742	21/02/24 15:40:04
19	964	340.95350217662326	279.7420205021175	21/02/24 15:40:04
19	964	341.1914846150336	279.78220083051735	21/02/24 15:40:04
19	964	341.3526022183643	279.80940350251313	21/02/24 15:40:04
19	964	341.51470801598924	279.836773018632	21/02/24 15:40:04
19	964	341.6769011807694	279.86415728559143	21/02/24 15:40:05
19	964	341.96337446081355	279.912524680038	21/02/24 15:40:05
19	964	342.2450892437866	279.9600886623661	21/02/24 15:40:05
19	964	342.4769897126848	279.9992421270446	21/02/24 15:40:05
19	964	342.6289984041518	280.02490687434096	21/02/24 15:40:05
19	964	342.8802437961286	280.06732648490555	21/02/24 15:40:05
19	964	343.08886872506525	280.10255016869104	21/02/24 15:40:05
19	964	343.3267141257264	280.1427073599981	21/02/24 15:40:05
19	964	343.5002623257034	280.1720087812074	21/02/24 15:40:05
19	964	343.684160215413	280.2030576167851	21/02/24 15:40:06
19	964	343.9103684355579	280.24125001716925	21/02/24 15:40:06
19	964	344.20036028782266	280.29021147808675	21/02/24 15:40:06
19	964	344.42631548480506	280.32836115870623	21/02/24 15:40:06
19	964	344.6397833381353	280.3644025090971	21/02/24 15:40:06
19	964	344.8339061100787	280.39717768687353	21/02/24 15:40:06
19	964	345.10178780095293	280.44240612634803	21/02/24 15:40:06
19	964	345.3139224805687	280.47822238719857	21/02/24 15:40:06
19	964	345.5803646738764	280.52320778569344	21/02/24 15:40:06
19	964	345.5803646738764	280.52320778569344	21/02/24 15:40:06
19	964	345.76247831731945	280.55395537382856	21/02/24 15:40:07
19	964	345.9370471409811	280.58342911445396	21/02/24 15:40:07
19	964	346.1724525496998	280.6231743439448	21/02/24 15:40:07
19	964	346.4668017835417	280.67287149369673	21/02/24 15:40:07
19	964	346.7080821478736	280.7136086352272	21/02/24 15:40:07
19	964	346.91779198618167	280.7490154922549	21/02/24 15:40:07
19	964	346.91779198618167	280.7490154922549	21/02/24 15:40:07
19	964	347.14917892908306	280.788082254556	21/02/24 15:40:07
19	964	347.3324323768056	280.8190222842451	21/02/24 15:40:07
19	964	347.5275300042885	280.8519620540645	21/02/24 15:40:07
19	964	347.7910038943995	280.89644629206185	21/02/24 15:40:08
19	964	347.9583436600019	280.92469949755537	21/02/24 15:40:08
19	964	348.1165354241449	280.9514081785651	21/02/24 15:40:08
19	964	348.267127461011	280.97683374162807	21/02/24 15:40:08
19	964	348.52306050366036	281.02004480279174	21/02/24 15:40:08
19	964	348.7804424889079	281.06350049960923	21/02/24 15:40:08
19	964	348.95921609729584	281.0936841650185	21/02/24 15:40:08
19	964	349.12514507213774	281.121699176314	21/02/24 15:40:08
19	964	349.35138487593053	281.1598969091981	21/02/24 15:40:08
19	964	349.64426874631056	281.20934665084076	21/02/24 15:40:09
19	964	349.8567631196919	281.2452236414398	21/02/24 15:40:09
19	964	350.0867038919819	281.28404623610203	21/02/24 15:40:09
19	964	350.33076637331425	281.3252531029428	21/02/24 15:40:09
19	964	350.52241982501175	281.3576113671895	21/02/24 15:40:09
19	964	350.75916502398036	281.3975828033391	21/02/24 15:40:09
19	964	350.95652915828674	281.43090524420387	21/02/24 15:40:09
19	964	351.1773985432477	281.46819624971033	21/02/24 15:40:09
19	964	351.45947010349187	281.51582046937364	21/02/24 15:40:09
19	964	351.74236816892443	281.5635842339972	21/02/24 15:40:09
19	964	351.93170795951755	281.59555186579394	21/02/24 15:40:10
19	964	352.1536641222212	281.6330263599935	21/02/24 15:40:10
19	964	352.4222989283153	281.6783819534591	21/02/24 15:40:10
19	964	352.62233586577486	281.71215566337196	21/02/24 15:40:10
19	964	352.8831596501276	281.7561924644897	21/02/24 15:40:10
19	964	353.14971649446125	281.801197220362	21/02/24 15:40:10
19	964	353.3917541639612	281.8420622233034	21/02/24 15:40:10
19	964	353.59377991390846	281.876171719081	21/02/24 15:40:10
19	964	353.8349461211002	281.91688958662047	21/02/24 15:40:10
19	964	354.0051257602043	281.9456222688799	21/02/24 15:40:10
19	964	354.29404025608324	281.99440183178143	21/02/24 15:40:11
19	964	354.52886466413	282.03404896664836	21/02/24 15:40:11
19	964	354.6964878889497	282.0623500306499	21/02/24 15:40:11
19	964	354.89587629170325	282.0960142436703	21/02/24 15:40:11
19	964	355.07202667520386	282.12575501069534	21/02/24 15:40:11
19	964	355.2563432434766	282.1568745348594	21/02/24 15:40:11
19	964	355.53063568741464	282.20318534900457	21/02/24 15:40:11
19	964	355.6840504420002	282.22908749229634	21/02/24 15:40:11
19	964	355.8397494148483	282.25537529698624	21/02/24 15:40:11
19	964	356.09260403485973	282.2980666053758	21/02/24 15:40:12
19	964	356.32340280806466	282.33703406265374	21/02/24 15:40:12
19	918	356.5513918616815	282.41222737570746	21/02/24 15:40:12
19	918	356.7364069119635	282.5862965161058	21/02/24 15:40:12
19	918	356.89297837348664	282.73360485495004	21/02/24 15:40:12
19	918	357.0866694344511	282.91583671356653	21/02/24 15:40:12
19	918	357.2177492422653	283.0391615427359	21/02/24 15:40:12
19	990	357.3202552197077	283.2619607560581	21/02/24 15:40:12
19	990	357.37153819572626	283.46099366944424	21/02/24 15:40:12
19	990	357.446027702904	283.7500927970949	21/02/24 15:40:12
19	990	357.5066146972689	283.98523527395497	21/02/24 15:40:13
19	990	357.5741380512665	284.24729826076145	21/02/24 15:40:13
19	990	357.6136717869587	284.4007315285386	21/02/24 15:40:13
19	990	357.658572344422	284.57499381708726	21/02/24 15:40:13
19	990	357.73254914294546	284.8621030856247	21/02/24 15:40:13
19	990	357.7986110377415	285.11849404429915	21/02/24 15:40:13
19	990	357.8456114299436	285.300905942292	21/02/24 15:40:13
19	990	357.9132588791494	285.56345055151496	21/02/24 15:40:13
19	990	357.95455710207	285.7237319209617	21/02/24 15:40:13
19	990	358.0000383790643	285.90024802372113	21/02/24 15:40:13
19	990	358.0467141821194	286.08140016792066	21/02/24 15:40:14
19	990	358.11337959582175	286.34013342681874	21/02/24 15:40:14
19	990	358.1656969525625	286.5431808460833	21/02/24 15:40:14
19	990	358.23334041779077	286.8057099932032	21/02/24 15:40:14
19	990	358.30196032793083	287.07202879316	21/02/24 15:40:14
19	990	358.35404351912933	287.2741673991359	21/02/24 15:40:14
19	990	358.4252747816532	287.5506210452574	21/02/24 15:40:14
19	990	358.4935458317823	287.8155858944544	21/02/24 15:40:14
19	990	358.5486994079809	288.02964088514966	21/02/24 15:40:14
19	990	358.62057389656223	288.30859093780094	21/02/24 15:40:15
19	990	358.6782495281348	288.53243420655207	21/02/24 15:40:15
19	990	358.7309450476291	288.73694930262513	21/02/24 15:40:15
19	990	358.7983509539952	288.99855646673797	21/02/24 15:40:15
19	990	358.85035870711346	289.2004022921059	21/02/24 15:40:15
19	990	358.90867634860183	289.42673724745345	21/02/24 15:40:15
19	918	358.9795035704244	289.7016227825928	21/02/24 15:40:15
19	918	358.91656455049736	289.7566033050513	21/02/24 15:40:15
19	918	358.8145424295736	289.75281168510696	21/02/24 15:40:15
19	918	358.9021669440674	289.71992532050666	21/02/24 15:40:15
19	918	358.70550771622965	289.5561019618306	21/02/24 15:40:16
19	918	358.66808907678325	289.49566761734934	21/02/24 15:40:16
19	918	358.63551356919396	289.2644708289747	21/02/24 15:40:16
19	918	358.72900004876453	289.4189819609443	21/02/24 15:40:16
19	918	358.5699721715609	289.4600270630158	21/02/24 15:40:16
19	918	358.7672552617832	289.5836786591199	21/02/24 15:40:16
19	918	358.97044106556757	289.64601099176423	21/02/24 15:40:16
19	918	358.97375628647	289.568352645517	21/02/24 15:40:16
19	918	358.9114822556125	289.29997163818655	21/02/24 15:40:16
19	918	359.060757830887	289.22763956437234	21/02/24 15:40:17
19	918	359.22687516721726	289.2971871693336	21/02/24 15:40:17
19	918	359.2637784777334	289.3258701219509	21/02/24 15:40:17
19	918	359.4867470105419	289.2598833548409	21/02/24 15:40:17
19	918	359.4441238804018	289.396206776279	21/02/24 15:40:17
19	918	359.5201834144044	289.2768959414851	21/02/24 15:40:17
19	918	359.4498883612798	289.3687078188799	21/02/24 15:40:17
19	918	359.2372423512763	289.32973330699616	21/02/24 15:40:17
19	918	359.1059919752367	289.26209460464634	21/02/24 15:40:17
19	918	359.07742136656816	289.18600349328204	21/02/24 15:40:17
19	918	359.21353304216217	289.3012445521854	21/02/24 15:40:18
19	918	358.9929374796246	289.3871552825964	21/02/24 15:40:18
19	918	358.9613330160165	289.2475062262645	21/02/24 15:40:18
19	918	359.2092004957332	289.1379783735318	21/02/24 15:40:18
19	918	359.4093579868483	289.32568740905964	21/02/24 15:40:18
19	918	359.27419454410045	289.2743794149824	21/02/24 15:40:18
19	918	358.99744919268176	289.3045510430933	21/02/24 15:40:18
19	918	359.0467085430416	289.1828018549014	21/02/24 15:40:18
19	918	359.02876769353816	289.20926180639367	21/02/24 15:40:18
19	918	358.91665491414557	289.2696353005678	21/02/24 15:40:18
19	918	359.0197244030194	289.0698239357206	21/02/24 15:40:19
19	918	359.2252238609293	289.0623961620675	21/02/24 15:40:19
19	918	359.2620241428731	289.0832220780202	21/02/24 15:40:19
19	918	359.4328029238433	289.23509575579453	21/02/24 15:40:19
19	918	359.1851899876063	289.3788313406887	21/02/24 15:40:19
19	918	359.1146895434157	289.4214114409863	21/02/24 15:40:19
19	918	359.1423006479841	289.58159067206225	21/02/24 15:40:19
19	918	359.1382508919232	289.6118595488004	21/02/24 15:40:19
19	918	359.26245797112114	289.46781602662526	21/02/24 15:40:19
19	918	359.3262672530836	289.43820597283826	21/02/24 15:40:20
19	918	359.48552079564064	289.53991884294754	21/02/24 15:40:20
19	918	359.44133893558507	289.4919006675953	21/02/24 15:40:20
19	918	359.320293871387	289.3214266686464	21/02/24 15:40:20
19	918	359.45973380920316	289.35123619075	21/02/24 15:40:20
19	918	359.4298793119287	289.38115241759385	21/02/24 15:40:20
19	918	359.433570081985	289.3849768174014	21/02/24 15:40:20
19	918	359.5107639329347	289.4571030438427	21/02/24 15:40:20
19	918	359.3875282137007	289.562141007321	21/02/24 15:40:20
19	918	359.2039420750361	289.6262709124621	21/02/24 15:40:20
19	918	359.38420416915625	289.759952760525	21/02/24 15:40:21
19	918	359.42252206566025	289.6661284682295	21/02/24 15:40:21
19	918	359.4772358146872	289.7359192228463	21/02/24 15:40:21
19	918	359.50585316945575	289.76875358233036	21/02/24 15:40:21
19	918	359.5438591410812	289.6893857189345	21/02/24 15:40:21
19	918	359.5063611931481	289.65877053177394	21/02/24 15:40:21
19	918	359.37584482688857	289.79892736439933	21/02/24 15:40:21
19	918	359.36247976766384	289.7945992645311	21/02/24 15:40:21
19	918	359.19981161549316	289.8630717681375	21/02/24 15:40:21
19	918	359.2342533460954	289.7839999294268	21/02/24 15:40:21
19	918	359.18876279565836	289.8283229164211	21/02/24 15:40:22
19	918	359.0867411131766	289.8966056901134	21/02/24 15:40:22
19	918	359.04747419421494	289.84586770564596	21/02/24 15:40:22
19	918	359.2422791778	290.0178608581125	21/02/24 15:40:22
19	918	359.2368514370306	289.84418508784614	21/02/24 15:40:22
19	918	359.2699774724456	289.8093171218706	21/02/24 15:40:22
19	918	359.5171383338758	289.6455832951029	21/02/24 15:40:22
19	918	359.4977541005913	289.6207930916725	21/02/24 15:40:22
19	918	359.42799697799217	289.66068722507106	21/02/24 15:40:22
19	918	359.4180656329117	289.6543885426586	21/02/24 15:40:23
19	918	359.252848308297	289.478415196164	21/02/24 15:40:23
19	918	359.3540775414328	289.61851924860497	21/02/24 15:40:23
19	918	359.0854590633706	289.66009653157874	21/02/24 15:40:23
19	918	359.1872681372064	289.61893039516264	21/02/24 15:40:23
19	918	359.42516115392965	289.7637925786395	21/02/24 15:40:23
19	918	359.4818030488213	289.9065860322625	21/02/24 15:40:23
19	918	359.4682091055941	290.01258234870306	21/02/24 15:40:23
19	918	359.2134946552375	289.92845204196664	21/02/24 15:40:23
19	918	359.34473389749013	289.90239113801795	21/02/24 15:40:23
19	918	359.34473389749013	289.90239113801795	21/02/24 15:40:24
19	918	359.36499339518554	289.93639435180813	21/02/24 15:40:24
19	918	359.60873618845955	289.94211918420365	21/02/24 15:40:24
19	918	359.60873618845955	289.94211918420365	21/02/24 15:40:24
19	918	359.604688953718	289.9531170919117	21/02/24 15:40:24
19	918	359.54072895812493	289.91800406977484	21/02/24 15:40:24
19	918	359.45982280887216	289.87071498047544	21/02/24 15:40:24
19	918	359.44059890384335	289.8529160810833	21/02/24 15:40:24
19	918	359.6577923411654	290.11397928889716	21/02/24 15:40:24
19	918	359.6653239189323	289.9474100875143	21/02/24 15:40:24
19	918	359.7188296746264	289.66492071222785	21/02/24 15:40:25
19	918	359.72281727675806	289.6635940760397	21/02/24 15:40:25
19	918	359.8500155337213	289.70397430711165	21/02/24 15:40:25
19	918	359.85459274301803	289.6754204937585	21/02/24 15:40:25
19	918	359.83297997440746	289.71582165947825	21/02/24 15:40:25
19	918	359.78307111024407	289.6379550554546	21/02/24 15:40:25
19	918	359.78307111024407	289.6379550554546	21/02/24 15:40:25
19	918	359.7475073392302	289.74468076745086	21/02/24 15:40:25
19	918	359.99083360337823	289.7220581025051	21/02/24 15:40:25
19	918	359.99083360337823	289.7220581025051	21/02/24 15:40:26
19	918	360.142124673494	289.86020454335073	21/02/24 15:40:26
19	918	360.1644203225532	290.01333179595713	21/02/24 15:40:26
19	918	360.13217117516075	290.03530618732435	21/02/24 15:40:26
19	918	360.02195971421696	289.9151897486436	21/02/24 15:40:26
19	918	359.98268830277414	289.98859460603234	21/02/24 15:40:26
19	918	360.14781966527516	289.9019325658956	21/02/24 15:40:26
19	918	360.25097000040336	290.2981948927083	21/02/24 15:40:26
19	918	360.25097000040336	290.2981948927083	21/02/24 15:40:26
19	918	360.3843382880037	290.47193318279415	21/02/24 15:40:26
19	918	360.3843382880037	290.47193318279415	21/02/24 15:40:27
19	918	360.16926370882396	290.589415265029	21/02/24 15:40:27
19	918	360.16926370882396	290.589415265029	21/02/24 15:40:27
19	918	360.23911814464776	290.47229547373695	21/02/24 15:40:27
19	918	360.31609025971477	290.43208719611584	21/02/24 15:40:27
19	918	360.36086585864206	290.19399871895735	21/02/24 15:40:27
19	918	360.36086585864206	290.19399871895735	21/02/24 15:40:27
19	918	360.3940930156351	290.13279526114445	21/02/24 15:40:27
19	918	360.1334704310138	290.00927872942316	21/02/24 15:40:27
19	918	360.1334704310138	290.00927872942316	21/02/24 15:40:27
19	918	359.94904297783256	289.79850769719224	21/02/24 15:40:28
19	918	359.8352466889695	289.85432352480086	21/02/24 15:40:28
19	918	359.7627795216267	289.9585499061282	21/02/24 15:40:28
19	918	360.00643897625804	289.9185866330539	21/02/24 15:40:28
19	918	360.20823351939305	290.0732614876798	21/02/24 15:40:28
19	918	360.232560402028	290.09716204436756	21/02/24 15:40:28
19	918	360.3840277059509	290.0469177578342	21/02/24 15:40:28
19	918	360.2991878750092	290.127717880802	21/02/24 15:40:28
19	918	360.2991878750092	290.127717880802	21/02/24 15:40:28
19	918	360.2991878750092	290.127717880802	21/02/24 15:40:29
19	918	360.1829757580651	290.21714545618426	21/02/24 15:40:29
19	918	360.1829757580651	290.21714545618426	21/02/24 15:40:29
19	918	360.1880283607315	290.2422352765657	21/02/24 15:40:29
19	918	360.1880283607315	290.2422352765657	21/02/24 15:40:29
19	918	360.27355239587536	290.2461315327646	21/02/24 15:40:29
19	918	360.3248393127496	290.26317191378257	21/02/24 15:40:29
19	918	360.25463237918626	290.0109568857626	21/02/24 15:40:29
19	918	360.0021375922636	289.99223772064164	21/02/24 15:40:29
19	918	360.1639298483006	289.84678563709946	21/02/24 15:40:29
19	918	360.13202802985586	290.0332446109195	21/02/24 15:40:30
19	918	360.0525017700048	289.9873155894831	21/02/24 15:40:30
19	918	360.0525017700048	289.9873155894831	21/02/24 15:40:30
19	918	360.15477594958895	290.23295494582595	21/02/24 15:40:30
19	918	359.76486980722564	290.3763088372079	21/02/24 15:40:30
19	918	359.88300003434455	290.34787035332965	21/02/24 15:40:30
19	918	359.89348559037586	290.5887725356221	21/02/24 15:40:30
19	918	359.89348559037586	290.5887725356221	21/02/24 15:40:30
19	918	359.9065067089022	290.65771239085717	21/02/24 15:40:30
19	918	359.9592544557371	290.7157888315032	21/02/24 15:40:31
19	918	360.14699317759505	290.6704291096176	21/02/24 15:40:31
19	918	360.01808969623585	290.4269526151859	21/02/24 15:40:31
19	918	360.01808969623585	290.4269526151859	21/02/24 15:40:31
19	918	359.8363296648664	290.3497526543706	21/02/24 15:40:31
19	918	359.8363296648664	290.3497526543706	21/02/24 15:40:31
19	918	359.74330996798614	290.3445280512314	21/02/24 15:40:31
19	918	359.78124208954375	290.27764060871516	21/02/24 15:40:31
19	918	359.6657105363135	290.25611263652354	21/02/24 15:40:31
19	918	359.6546005716539	290.4068414609733	21/02/24 15:40:31
19	918	359.6546005716539	290.4068414609733	21/02/24 15:40:32
19	918	359.58107855925186	290.48322107970984	21/02/24 15:40:32
19	918	359.58562970373634	290.4651135143256	21/02/24 15:40:32
19	918	359.5857946692398	290.3941591544133	21/02/24 15:40:32
19	918	359.58104648539864	290.3910239463943	21/02/24 15:40:32
19	918	359.340994114997	290.2114899026786	21/02/24 15:40:32
19	918	359.4083379411404	290.2693553333667	21/02/24 15:40:32
19	918	359.5049071751454	290.3703059625919	21/02/24 15:40:32
19	918	359.5049071751454	290.3703059625919	21/02/24 15:40:32
19	918	359.4700758178053	290.3105888879493	21/02/24 15:40:32
19	918	359.30318616382215	290.36207248596696	21/02/24 15:40:33
19	918	359.19655654692997	290.6106266386663	21/02/24 15:40:33
19	918	359.44558410119544	290.6185153327142	21/02/24 15:40:33
19	918	359.1783445977634	290.6683912840873	21/02/24 15:40:33
19	918	359.0497747010064	290.6811920138375	21/02/24 15:40:33
19	918	359.05753906021664	290.5716951864587	21/02/24 15:40:33
19	918	359.07836997219295	290.60249250620166	21/02/24 15:40:33
19	918	359.07836997219295	290.60249250620166	21/02/24 15:40:33
19	918	359.2081570045863	290.6522884253848	21/02/24 15:40:33
19	918	359.1379813197	290.3842859914793	21/02/24 15:40:34
19	918	359.1519134854626	290.34558303971136	21/02/24 15:40:34
19	918	359.10897303384763	290.33869895285545	21/02/24 15:40:34
19	918	359.04592700150465	290.448544283332	21/02/24 15:40:34
19	918	359.04592700150465	290.448544283332	21/02/24 15:40:34
19	918	358.79656065158343	290.3673900711425	21/02/24 15:40:34
19	918	358.61299223789354	290.40690458730353	21/02/24 15:40:34
19	918	358.87758196626345	290.28593792244266	21/02/24 15:40:34
19	918	358.87758196626345	290.28593792244266	21/02/24 15:40:34
19	918	358.85225230578186	290.3554501090706	21/02/24 15:40:34
19	918	358.86985068250505	290.35082064510124	21/02/24 15:40:35
19	918	358.94182019909306	290.09679280158514	21/02/24 15:40:35
19	918	359.08001460728826	290.1541749247015	21/02/24 15:40:35
19	918	359.11456227351334	289.9810987115459	21/02/24 15:40:35
19	918	359.11456227351334	289.9810987115459	21/02/24 15:40:35
19	918	359.2335050798488	290.0202094873397	21/02/24 15:40:35
19	918	359.2969286766791	289.9216760826487	21/02/24 15:40:35
19	918	359.295122585837	289.9137953233445	21/02/24 15:40:35
19	918	359.2500689262832	289.91379560690274	21/02/24 15:40:35
19	918	359.2208112852385	289.6755001323261	21/02/24 15:40:35
19	918	359.40476601400604	289.4689106181628	21/02/24 15:40:36
19	918	359.40476601400604	289.4689106181628	21/02/24 15:40:36
19	918	359.2714595511505	289.5678512997577	21/02/24 15:40:36
19	918	359.2714595511505	289.5678512997577	21/02/24 15:40:36
19	918	359.14931754414437	289.5227785912422	21/02/24 15:40:36
19	918	359.2531857870926	289.58347025366305	21/02/24 15:40:36
19	918	359.3462938966143	289.7503275040932	21/02/24 15:40:36
19	918	359.3462938966143	289.7503275040932	21/02/24 15:40:36
19	918	359.3781862594057	289.6234964187926	21/02/24 15:40:36
19	918	359.6037673074917	289.34252664286834	21/02/24 15:40:37
19	918	359.4693146572904	289.22305442808937	21/02/24 15:40:37
19	918	359.4693146572904	289.22305442808937	21/02/24 15:40:37
19	918	359.48138871564197	289.2518825807439	21/02/24 15:40:37
19	918	359.5900082037712	289.186038407114	21/02/24 15:40:37
19	918	359.5998130934441	289.18304258075494	21/02/24 15:40:37
19	918	359.42835180278206	289.05998910078046	21/02/24 15:40:37
19	918	359.42835180278206	289.05998910078046	21/02/24 15:40:37
19	918	359.33190959764664	288.978834070553	21/02/24 15:40:37
19	918	359.33649805097946	288.9723002178153	21/02/24 15:40:37
19	918	359.06846981165677	289.07125372584466	21/02/24 15:40:38
19	918	359.27846785397026	289.07811052565216	21/02/24 15:40:38
19	918	359.3250783654686	289.1904767369923	21/02/24 15:40:38
19	918	359.3267626432002	289.19573932803974	21/02/24 15:40:38
19	918	359.3418692818838	289.18532861779397	21/02/24 15:40:38
19	918	359.44363044520077	289.39777219109027	21/02/24 15:40:38
19	918	359.4706813661476	289.6460776909872	21/02/24 15:40:38
19	918	359.44661237978806	289.6496369006102	21/02/24 15:40:38
19	918	359.44676806281694	289.6523554723283	21/02/24 15:40:38
19	918	359.4439954431456	289.7244388497705	21/02/24 15:40:38
19	918	359.4111555258801	289.6313605326259	21/02/24 15:40:39
19	918	359.4156335772939	289.6362286940023	21/02/24 15:40:39
19	918	359.4188188853929	289.63795488036925	21/02/24 15:40:39
19	918	359.61520123558523	289.59107162191873	21/02/24 15:40:39
19	918	359.73816183340597	289.6110816867969	21/02/24 15:40:39
19	918	359.7231679943304	289.5921001787669	21/02/24 15:40:39
19	918	359.6009029774974	289.6797174720256	21/02/24 15:40:39
19	918	359.5616476469676	289.7604595184952	21/02/24 15:40:39
19	918	359.59272192153367	289.7437942634484	21/02/24 15:40:39
19	918	359.7793129457771	289.5411847836163	21/02/24 15:40:39
19	918	359.7775968516311	289.48372846982977	21/02/24 15:40:40
19	918	359.6249714000056	289.5600344193322	21/02/24 15:40:40
19	918	359.4192965091834	289.6916730097339	21/02/24 15:40:40
19	918	359.4192965091834	289.6916730097339	21/02/24 15:40:40
19	918	359.1026766160306	289.8125783709385	21/02/24 15:40:40
19	918	359.19143431702537	290.0227410828062	21/02/24 15:40:40
19	918	359.19460218390896	289.997149298443	21/02/24 15:40:40
19	918	358.91919728418037	289.94310565937633	21/02/24 15:40:40
19	918	358.8871947435817	289.9239655388434	21/02/24 15:40:40
19	918	358.9268019601784	289.90910984360744	21/02/24 15:40:41
19	918	359.03934456199954	290.00084161263663	21/02/24 15:40:41
19	918	359.06223081963566	290.18128972569593	21/02/24 15:40:41
19	918	359.05684039148684	290.18308514169917	21/02/24 15:40:41
19	918	359.2296369572546	290.03052645091225	21/02/24 15:40:41
19	918	359.11869720092903	290.0483898277107	21/02/24 15:40:41
19	918	359.0379948331651	289.9291586760809	21/02/24 15:40:41
19	918	359.19956147455406	289.9135264425045	21/02/24 15:40:41
19	918	359.2476949682425	289.88473799436815	21/02/24 15:40:41
19	918	359.1042390690656	289.67533579486394	21/02/24 15:40:41
19	918	358.8862609136736	289.6492477640697	21/02/24 15:40:42
19	918	358.8862609136736	289.6492477640697	21/02/24 15:40:42
19	918	358.7083160982921	289.5149922144563	21/02/24 15:40:42
19	918	358.62067430789546	289.24030754605934	21/02/24 15:40:42
19	918	358.4663121770942	289.19047866767215	21/02/24 15:40:42
19	918	358.65511127041725	289.3991629013893	21/02/24 15:40:42
19	918	358.6359158327531	289.39622745239285	21/02/24 15:40:42
19	918	358.4245406213593	289.53473976349926	21/02/24 15:40:42
19	918	358.59892685851435	289.5754468290212	21/02/24 15:40:42
19	918	358.59892685851435	289.5754468290212	21/02/24 15:40:42
19	918	358.45916961705234	289.30312905749497	21/02/24 15:40:43
19	918	358.495142941628	289.30556743829914	21/02/24 15:40:43
19	918	358.4829106437023	289.4312195727557	21/02/24 15:40:43
19	918	358.3802222180972	289.217219706872	21/02/24 15:40:43
19	918	358.3147755998905	289.47119156650655	21/02/24 15:40:43
19	918	358.2759216461935	289.29499537248233	21/02/24 15:40:43
19	918	358.330341609143	289.3838505233773	21/02/24 15:40:43
19	918	358.1126622529373	289.44670503430643	21/02/24 15:40:43
19	918	358.1734086895354	289.45574749640707	21/02/24 15:40:43
19	918	358.1734086895354	289.45574749640707	21/02/24 15:40:44
19	918	358.16551878687415	289.4726438225445	21/02/24 15:40:44
19	918	358.07336339715533	289.40469973391924	21/02/24 15:40:44
19	918	358.1895108557964	289.4920367786335	21/02/24 15:40:44
19	918	358.30184441745223	289.49404284537945	21/02/24 15:40:44
19	918	358.21660544293866	289.37280898580343	21/02/24 15:40:44
19	918	358.12491485932287	289.36316895222456	21/02/24 15:40:44
19	918	358.11001614353137	289.3350073918404	21/02/24 15:40:44
19	918	358.16668751798926	289.2451215623803	21/02/24 15:40:44
19	918	357.89685060646	289.29509326657404	21/02/24 15:40:44
19	918	357.7786512968962	289.3458550375131	21/02/24 15:40:45
19	918	357.74585979380436	289.5074820345776	21/02/24 15:40:45
19	918	357.98335201679237	289.43587631057466	21/02/24 15:40:45
19	918	358.00666544805557	289.23316005875694	21/02/24 15:40:45
19	918	358.0280544133644	289.19499176967537	21/02/24 15:40:45
19	918	358.10498072501116	289.2843275862849	21/02/24 15:40:45
19	918	358.0409330595396	289.00714074818234	21/02/24 15:40:45
19	918	357.9568660066195	288.8214078175783	21/02/24 15:40:45
19	918	357.97364331765914	288.8410431766222	21/02/24 15:40:45
19	918	358.12394669755747	288.65030241136213	21/02/24 15:40:46
19	918	358.211675937876	288.4010569991298	21/02/24 15:40:46
19	918	357.9736737681529	288.54302993056723	21/02/24 15:40:46
19	918	358.0892035055411	288.6704196717939	21/02/24 15:40:46
19	918	358.055063113488	288.7761451838444	21/02/24 15:40:46
19	918	358.055063113488	288.7761451838444	21/02/24 15:40:46
19	918	357.91921542980543	288.6182700641812	21/02/24 15:40:46
19	918	357.71533111570926	288.61356036931244	21/02/24 15:40:46
19	918	357.7103270624583	288.6041801547493	21/02/24 15:40:46
19	918	357.6142997995614	288.4487996208855	21/02/24 15:40:46
19	918	357.4378233147558	288.538853793277	21/02/24 15:40:47
19	918	357.5284786139415	288.76498208136957	21/02/24 15:40:47
19	918	357.4249615141011	288.8152945096458	21/02/24 15:40:47
19	918	357.50412383601594	289.09070622738756	21/02/24 15:40:47
19	918	357.6238289562643	289.01412450789144	21/02/24 15:40:47
19	918	357.74533511668164	289.2710702582405	21/02/24 15:40:47
19	918	357.7796134867008	289.290464230518	21/02/24 15:40:47
19	918	357.99440724165964	289.0875627690203	21/02/24 15:40:47
19	918	357.9074690026304	289.0782130525964	21/02/24 15:40:47
19	918	358.0913092436647	289.12334821857377	21/02/24 15:40:47
19	918	358.160765041793	289.2330231131783	21/02/24 15:40:48
19	918	358.1582378973319	289.2309372251429	21/02/24 15:40:48
19	918	358.1568565208888	289.2366913025076	21/02/24 15:40:48
19	918	358.1568565208888	289.2366913025076	21/02/24 15:40:48
19	918	358.1568565208888	289.2366913025076	21/02/24 15:40:48
19	918	358.11258416932907	289.23450394599627	21/02/24 15:40:48
19	918	358.1429400538911	289.2765078095983	21/02/24 15:40:48
19	918	357.98632207772437	289.192851267589	21/02/24 15:40:48
19	918	357.9954528322138	289.2818199672656	21/02/24 15:40:48
19	918	357.9214925480216	289.3432919420805	21/02/24 15:40:48
19	918	358.0930635337822	289.5401244495402	21/02/24 15:40:49
19	918	358.08055817672914	289.6274222557446	21/02/24 15:40:49
19	918	357.9288419204234	289.45916451228607	21/02/24 15:40:49
19	918	357.8515351591456	289.42066134247057	21/02/24 15:40:49
19	918	357.6403718227413	289.55234082385624	21/02/24 15:40:49
19	918	357.77107801060885	289.59083076502657	21/02/24 15:40:49
19	918	357.7887255029245	289.6419605104338	21/02/24 15:40:49
19	918	358.0870614770954	289.61667019943457	21/02/24 15:40:49
19	918	358.03133708353323	289.8501514731004	21/02/24 15:40:49
19	918	358.03133708353323	289.8501514731004	21/02/24 15:40:50
19	918	357.89494035311156	289.8980921598317	21/02/24 15:40:50
19	918	357.68029656154766	289.76485303417047	21/02/24 15:40:50
19	918	357.6801267530281	289.7680554579938	21/02/24 15:40:50
19	918	357.67704066359914	289.65969647177985	21/02/24 15:40:50
19	918	357.84282807884284	289.42012577233095	21/02/24 15:40:50
19	918	357.91369775877354	289.4105994387429	21/02/24 15:40:50
19	918	357.7042499236494	289.40821282533346	21/02/24 15:40:50
19	918	357.74879180937955	289.32399840428116	21/02/24 15:40:50
19	918	357.58291249513593	289.2504705083954	21/02/24 15:40:50
19	918	357.48672338350167	289.34654926792643	21/02/24 15:40:51
19	918	357.72021235578524	289.4823428685489	21/02/24 15:40:51
19	918	357.76426268021027	289.4749716528021	21/02/24 15:40:51
19	918	357.99145263406785	289.33703234961484	21/02/24 15:40:51
19	918	358.0643883042188	289.5043141561466	21/02/24 15:40:51
19	918	358.3538673163767	289.544600676966	21/02/24 15:40:51
19	918	358.3795941357048	289.6657032162326	21/02/24 15:40:51
19	918	358.31104406503437	289.78727213447786	21/02/24 15:40:51
19	918	358.4080358618517	289.73240798021266	21/02/24 15:40:51
19	918	358.3239846112825	289.77491213859923	21/02/24 15:40:52
19	918	358.28735772127425	289.95870472772964	21/02/24 15:40:52
19	918	358.2642135639493	290.03144990593046	21/02/24 15:40:52
19	918	358.25940345189844	290.0346784495927	21/02/24 15:40:52
19	918	358.17876479580644	290.0045449225773	21/02/24 15:40:52
19	918	358.205461527707	289.765712592486	21/02/24 15:40:52
19	918	358.0906845214287	289.7360560583257	21/02/24 15:40:52
19	918	358.0751752198105	289.7563475612029	21/02/24 15:40:52
19	918	358.0550074576865	289.7168076935635	21/02/24 15:40:52
19	918	357.8821467000756	289.7074242570427	21/02/24 15:40:52
19	918	357.8867439430085	289.80502702942914	21/02/24 15:40:53
19	918	357.8337780436913	289.88501329183043	21/02/24 15:40:53
19	918	357.7815758298972	289.974652787265	21/02/24 15:40:53
19	918	357.90874172346554	290.20559996691054	21/02/24 15:40:53
19	918	358.1843847835965	290.1481089416589	21/02/24 15:40:53
19	918	358.07654984866986	290.1084060990844	21/02/24 15:40:53
19	918	357.9680442224078	290.0836549717532	21/02/24 15:40:53
19	918	358.14048904969366	290.16616364128305	21/02/24 15:40:53
19	918	358.0731645337039	290.1078907974627	21/02/24 15:40:53
19	918	357.94967479132964	290.23665789217523	21/02/24 15:40:53
19	918	357.9096334786208	290.20896448983154	21/02/24 15:40:54
19	918	357.88470403679776	290.04144104175305	21/02/24 15:40:54
19	918	357.7815942991076	289.88522486631064	21/02/24 15:40:54
19	918	357.6824964619922	289.6042265926094	21/02/24 15:40:54
19	918	357.7477921415761	289.4722194714461	21/02/24 15:40:54
19	918	357.92720416667674	289.63547268686375	21/02/24 15:40:54
19	918	357.926785397512	289.6463586536315	21/02/24 15:40:54
19	918	357.92471355087304	289.642247482348	21/02/24 15:40:54
19	918	357.80807728057846	289.6759385467052	21/02/24 15:40:54
19	918	357.8528812162441	289.7335897741104	21/02/24 15:40:55
19	918	357.85313837609436	289.7566151169212	21/02/24 15:40:55
19	918	358.0548731173915	289.67860372337054	21/02/24 15:40:55
19	918	357.76988697827426	289.62369711975475	21/02/24 15:40:55
19	918	357.79892134967827	289.82961280663943	21/02/24 15:40:55
19	918	357.74771815652593	290.08187137175605	21/02/24 15:40:55
19	918	357.74153177573237	290.052883802895	21/02/24 15:40:55
19	918	357.75323724856275	290.1766684557871	21/02/24 15:40:55
19	918	357.7688317420728	290.1498899846148	21/02/24 15:40:55
19	918	357.8552283150888	290.0868296330487	21/02/24 15:40:55
19	918	357.61064722085933	290.0249275302877	21/02/24 15:40:56
19	918	357.72626168418697	290.0271014988059	21/02/24 15:40:56
19	918	357.8498925311146	289.8567393491522	21/02/24 15:40:56
19	918	357.99535281000124	289.79583678567053	21/02/24 15:40:56
19	918	358.0432737843471	289.8030002962159	21/02/24 15:40:56
19	918	358.0490431828868	289.8385431510954	21/02/24 15:40:56
19	918	358.0770230029462	289.77389620625286	21/02/24 15:40:56
19	918	358.10828254153785	289.73521305067203	21/02/24 15:40:56
19	918	358.10694737525375	289.8775122533301	21/02/24 15:40:56
19	918	358.1640807269402	289.9083982549935	21/02/24 15:40:56
19	918	358.23222281158587	289.8433916260844	21/02/24 15:40:57
19	918	358.3398480263919	289.900329364662	21/02/24 15:40:57
19	918	358.27108516885727	289.9009879127169	21/02/24 15:40:57
19	918	358.08146925172537	290.0505932803166	21/02/24 15:40:57
19	918	358.09343536616865	290.08339683155856	21/02/24 15:40:57
19	918	358.08400167455034	290.07627865730433	21/02/24 15:40:57
19	918	358.04872999465704	289.8449942257435	21/02/24 15:40:57
19	918	357.83324526962423	289.6368066769951	21/02/24 15:40:57
19	918	357.7876608427223	289.6434405257698	21/02/24 15:40:57
19	918	357.79166646338666	289.75522440054175	21/02/24 15:40:57
19	918	357.83965859277964	289.7399199653297	21/02/24 15:40:58
19	918	357.764823967707	289.6955157017333	21/02/24 15:40:58
19	918	357.84208253982325	289.9536540895403	21/02/24 15:40:58
19	918	358.03548655182544	289.9632298898662	21/02/24 15:40:58
19	918	358.27374358210966	290.095798640869	21/02/24 15:40:58
19	918	358.0783085917042	290.0564850151364	21/02/24 15:40:58
19	918	358.18952517196965	289.95172839665827	21/02/24 15:40:58
19	918	358.2166624333695	290.04194831733247	21/02/24 15:40:58
19	918	358.0504570335167	290.12245532564907	21/02/24 15:40:58
19	918	357.96793088387363	289.9880048448412	21/02/24 15:40:59
19	918	357.9848405757284	289.9717770792313	21/02/24 15:40:59
19	918	357.8048775209196	290.11498148444224	21/02/24 15:40:59
19	918	357.66407771060335	289.93159571158594	21/02/24 15:40:59
19	918	357.71320261931527	289.94980075835406	21/02/24 15:40:59
19	918	357.71320261931527	289.94980075835406	21/02/24 15:40:59
19	918	357.74638526970494	289.6698151094826	21/02/24 15:40:59
19	918	357.8845367719894	289.7753676244504	21/02/24 15:40:59
19	918	357.85491353441927	290.03515550311033	21/02/24 15:40:59
19	918	357.94445193659044	290.0138364499538	21/02/24 15:40:59
19	918	357.94629886861014	290.01739591335297	21/02/24 15:41:00
19	918	357.89671284241314	289.81322853303	21/02/24 15:41:00
19	918	357.94755128354467	289.97592864668144	21/02/24 15:41:00
19	918	358.1756473018134	290.0979139191915	21/02/24 15:41:00
19	918	358.1664280789411	290.0366750555774	21/02/24 15:41:00
19	918	358.1718885983961	290.0364891831838	21/02/24 15:41:00
19	918	358.237891342832	290.1827013663075	21/02/24 15:41:00
19	918	358.33884191754817	289.9999906317386	21/02/24 15:41:00
19	918	358.33884191754817	289.9999906317386	21/02/24 15:41:00
