floorId	partitionId	location_x	location_y	timeStamp
3	14	325.86848871342477	268.57487977953787	20/04/28 05:17:35
3	14	325.7144978820088	266.8660387296905	20/04/28 05:17:36
3	NULL	326.2677253743927	264.00631997709723	20/04/28 05:17:37
3	54	330.6301003048306	263.453311353296	20/04/28 05:17:38
3	54	332.9065526505472	263.50534437986465	20/04/28 05:17:39
3	28	332.6477860802388	265.03642994070896	20/04/28 05:17:40
3	54	334.4407240787428	261.4032786809491	20/04/28 05:17:41
3	NULL	337.70753542622793	260.45953294809686	20/04/28 05:17:42
3	54	339.3775199660886	260.697329100326	20/04/28 05:17:43
3	54	339.37751996608864	260.69732910032604	20/04/28 05:17:44
3	54	345.98250818917177	261.859258749847	20/04/28 05:17:45
3	54	349.2732493252067	263.17227144197165	20/04/28 05:17:46
3	54	350.89456573837674	262.47535273189357	20/04/28 05:17:47
3	54	352.5642087013677	263.56873724463406	20/04/28 05:17:48
3	43	354.1724379731224	265.54072270130285	20/04/28 05:17:49
3	8	357.87501606482897	266.0533751351783	20/04/28 05:17:50
3	8	357.87501606482897	266.0533751351783	20/04/28 05:17:51
3	8	357.87501606482897	266.0533751351783	20/04/28 05:17:52
3	8	357.87501606482897	266.0533751351783	20/04/28 05:17:53
3	8	357.87501606482897	266.0533751351783	20/04/28 05:17:54
3	8	357.87501606482897	266.0533751351783	20/04/28 05:17:55
3	8	357.87501606482897	266.0533751351783	20/04/28 05:17:56
3	8	357.87501606482897	266.0533751351783	20/04/28 05:17:57
3	8	357.87501606482897	266.0533751351783	20/04/28 05:17:58
3	8	357.87501606482897	266.0533751351783	20/04/28 05:17:59
3	8	357.87501606482897	266.0533751351783	20/04/28 05:18:00
3	8	357.87501606482897	266.0533751351783	20/04/28 05:18:01
3	8	357.87501606482897	266.0533751351783	20/04/28 05:18:02
3	8	357.87501606482897	266.0533751351783	20/04/28 05:18:03
3	8	357.87501606482897	266.0533751351783	20/04/28 05:18:04
3	8	357.87501606482897	266.0533751351783	20/04/28 05:18:05
3	8	357.87501606482897	266.0533751351783	20/04/28 05:18:06
3	8	357.87501606482897	266.0533751351783	20/04/28 05:18:07
3	8	357.8750160648289	266.0533751351783	20/04/28 05:18:08
3	8	357.8750160648289	266.0533751351783	20/04/28 05:18:09
3	8	357.8750160648289	266.0533751351783	20/04/28 05:18:10
3	8	357.8750160648289	266.0533751351783	20/04/28 05:18:11
3	8	357.87501606482897	266.0533751351783	20/04/28 05:18:12
3	8	358.2529906203945	267.1341790482113	20/04/28 05:18:13
3	8	357.8750160648289	266.0533751351783	20/04/28 05:18:14
3	8	357.8750160648289	266.0533751351783	20/04/28 05:18:15
3	8	357.8750160648289	266.0533751351783	20/04/28 05:18:16
3	8	357.8750160648289	266.0533751351783	20/04/28 05:18:17
3	8	357.87501606482897	266.0533751351783	20/04/28 05:18:18
3	8	357.87501606482897	266.0533751351783	20/04/28 05:18:19
3	8	357.87501606482897	266.0533751351783	20/04/28 05:18:20
3	8	357.8750160648289	266.0533751351783	20/04/28 05:18:21
3	8	357.8750160648289	266.0533751351783	20/04/28 05:18:22
3	8	357.8750160648289	266.0533751351783	20/04/28 05:18:23
3	8	357.8750160648289	266.0533751351783	20/04/28 05:18:24
3	8	357.87501606482897	266.0533751351783	20/04/28 05:18:25
3	8	357.87501606482897	266.0533751351783	20/04/28 05:18:26
3	8	357.87501606482897	266.0533751351783	20/04/28 05:18:27
3	8	357.87501606482897	266.0533751351783	20/04/28 05:18:28
3	8	357.87501606482897	266.0533751351783	20/04/28 05:18:29
3	8	357.87501606482897	266.0533751351783	20/04/28 05:18:30
3	8	357.87501606482897	266.0533751351783	20/04/28 05:18:31
3	8	357.87501606482897	266.0533751351783	20/04/28 05:18:32
3	8	357.87501606482897	266.0533751351783	20/04/28 05:18:33
3	8	357.87501606482897	266.0533751351783	20/04/28 05:18:34
3	8	357.87501606482897	266.0533751351783	20/04/28 05:18:35
3	8	357.87501606482897	266.0533751351783	20/04/28 05:18:36
3	8	357.87501606482897	266.0533751351783	20/04/28 05:18:37
3	8	357.87501606482897	266.0533751351783	20/04/28 05:18:38
3	8	357.87501606482897	266.0533751351783	20/04/28 05:18:39
3	8	357.87501606482897	266.0533751351783	20/04/28 05:18:40
3	8	357.87501606482897	266.0533751351783	20/04/28 05:18:41
3	8	357.87501606482897	266.0533751351783	20/04/28 05:18:42
3	8	357.87501606482897	266.0533751351783	20/04/28 05:18:43
3	8	357.87501606482897	266.0533751351783	20/04/28 05:18:44
3	8	357.87501606482897	266.0533751351783	20/04/28 05:18:45
3	8	357.87501606482897	266.0533751351783	20/04/28 05:18:46
3	8	357.8750160648289	266.0533751351783	20/04/28 05:18:47
3	8	357.8750160648289	266.0533751351783	20/04/28 05:18:48
