stationId	t_start	t_end	t_max	timeStamp
109	20/04/28 05:13:04	20/04/28 05:15:16	20/04/28 05:15:16
2	20/04/28 05:08:49	20/04/28 05:15:18	20/04/28 05:15:18
2	20/04/28 05:15:20	20/04/28 05:15:20	20/04/28 05:15:20
70	20/04/28 05:15:22	20/04/28 05:15:22	20/04/28 05:15:22
2	20/04/28 05:15:24	20/04/28 05:15:24	20/04/28 05:15:24
140	20/04/28 05:15:26	20/04/28 05:15:26	20/04/28 05:15:26
109	20/04/28 05:15:28	20/04/28 05:15:28	20/04/28 05:15:28
77	20/04/28 05:15:30	20/04/28 05:15:30	20/04/28 05:15:30
160	20/04/28 05:15:32	20/04/28 05:15:32	20/04/28 05:15:32
140	20/04/28 05:15:34	20/04/28 05:15:34	20/04/28 05:15:34
70	20/04/28 05:15:36	20/04/28 05:15:36	20/04/28 05:15:36
160	20/04/28 05:15:38	20/04/28 05:15:38	20/04/28 05:15:38
129	20/04/28 05:15:40	20/04/28 05:15:40	20/04/28 05:15:40
109	20/04/28 05:15:42	20/04/28 05:15:42	20/04/28 05:15:42
2	20/04/28 05:15:44	20/04/28 05:15:44	20/04/28 05:15:44
140	20/04/28 05:15:46	20/04/28 05:15:46	20/04/28 05:15:46
63	20/04/28 05:15:48	20/04/28 05:15:49	20/04/28 05:15:49
77	20/04/28 05:15:51	20/04/28 05:15:51	20/04/28 05:15:51
108	20/04/28 05:15:53	20/04/28 05:15:53	20/04/28 05:15:53
77	20/04/28 05:15:55	20/04/28 05:15:55	20/04/28 05:15:55
108	20/04/28 05:15:57	20/04/28 05:15:57	20/04/28 05:15:57
14	20/04/28 05:15:59	20/04/28 05:15:59	20/04/28 05:15:59
109	20/04/28 05:16:01	20/04/28 05:16:01	20/04/28 05:16:01
77	20/04/28 05:16:03	20/04/28 05:16:03	20/04/28 05:16:03
140	20/04/28 05:16:05	20/04/28 05:16:05	20/04/28 05:16:05
160	20/04/28 05:16:07	20/04/28 05:16:07	20/04/28 05:16:07
108	20/04/28 05:16:09	20/04/28 05:16:09	20/04/28 05:16:09
12	20/04/28 05:16:11	20/04/28 05:16:11	20/04/28 05:16:11
129	20/04/28 05:16:13	20/04/28 05:16:13	20/04/28 05:16:13
160	20/04/28 05:16:15	20/04/28 05:16:16	20/04/28 05:16:16
2	20/04/28 05:16:18	20/04/28 05:16:18	20/04/28 05:16:18
64	20/04/28 05:16:20	20/04/28 05:16:20	20/04/28 05:16:20
109	20/04/28 05:16:22	20/04/28 05:16:22	20/04/28 05:16:22
140	20/04/28 05:16:24	20/04/28 05:16:24	20/04/28 05:16:24
160	20/04/28 05:16:26	20/04/28 05:16:26	20/04/28 05:16:26
160	20/04/28 05:16:28	20/04/28 05:16:28	20/04/28 05:16:28
108	20/04/28 05:16:30	20/04/28 05:16:30	20/04/28 05:16:30
108	20/04/28 05:16:33	20/04/28 05:16:33	20/04/28 05:16:33
159	20/04/28 05:16:35	20/04/28 05:16:35	20/04/28 05:16:35
64	20/04/28 05:16:37	20/04/28 05:16:37	20/04/28 05:16:37
159	20/04/28 05:16:39	20/04/28 05:16:39	20/04/28 05:16:39
109	20/04/28 05:16:41	20/04/28 05:16:42	20/04/28 05:16:42
109	20/04/28 05:16:44	20/04/28 05:16:44	20/04/28 05:16:44
159	20/04/28 05:16:46	20/04/28 05:16:46	20/04/28 05:16:46
56	20/04/28 05:16:48	20/04/28 05:16:48	20/04/28 05:16:48
109	20/04/28 05:16:50	20/04/28 05:16:50	20/04/28 05:16:50
108	20/04/28 05:16:52	20/04/28 05:16:52	20/04/28 05:16:52
46	20/04/28 05:16:54	20/04/28 05:16:54	20/04/28 05:16:54
109	20/04/28 05:16:56	20/04/28 05:16:56	20/04/28 05:16:56
159	20/04/28 05:16:58	20/04/28 05:16:59	20/04/28 05:16:58
108	20/04/28 05:17:01	20/04/28 05:17:01	20/04/28 05:17:01
108	20/04/28 05:17:03	20/04/28 05:17:03	20/04/28 05:17:03
109	20/04/28 05:17:05	20/04/28 05:17:05	20/04/28 05:17:05
108	20/04/28 05:17:07	20/04/28 05:17:07	20/04/28 05:17:07
64	20/04/28 05:17:09	20/04/28 05:10:58	20/04/28 05:10:58
109	20/04/28 05:17:11	20/04/28 05:17:12	20/04/28 05:17:12
46	20/04/28 05:17:14	20/04/28 05:17:14	20/04/28 05:17:14
159	20/04/28 05:17:16	20/04/28 05:17:16	20/04/28 05:17:16
46	20/04/28 05:17:18	20/04/28 05:17:18	20/04/28 05:17:18
108	20/04/28 05:17:20	20/04/28 05:17:21	20/04/28 05:17:21
46	20/04/28 05:17:23	20/04/28 05:17:24	20/04/28 05:17:24
