floorId	partitionId	location_x	location_y	timeStamp
19	919	336.8452140083579	267.0699839475802	21/02/24 15:41:23
19	919	337.00201748128137	267.2860959668603	21/02/24 15:41:23
19	919	337.1028601145978	267.4250808037979	21/02/24 15:41:23
19	919	337.2371795889346	267.610204591469	21/02/24 15:41:23
19	919	337.3485420725437	267.7636882532534	21/02/24 15:41:24
19	919	337.4790622908849	267.9435757737062	21/02/24 15:41:24
19	919	337.5926864162182	268.1001765090528	21/02/24 15:41:24
19	919	337.70715547852853	268.2579417660319	21/02/24 15:41:24
19	919	337.80911659775006	268.3984681392824	21/02/24 15:41:24
19	919	337.9200656745163	268.5513820293268	21/02/24 15:41:24
19	919	338.0641729036097	268.7499956422244	21/02/24 15:41:24
19	919	338.1766959566902	268.90507884136156	21/02/24 15:41:24
19	919	338.32815539506356	269.11382552570234	21/02/24 15:41:24
19	919	338.44769517721335	269.278579425747	21/02/24 15:41:24
19	919	338.57872481289695	269.45916904296126	21/02/24 15:41:25
19	919	338.72033691005345	269.6543437779361	21/02/24 15:41:25
19	919	338.8702816962647	269.8610029158014	21/02/24 15:41:25
19	919	339.0206915845445	270.06830307357086	21/02/24 15:41:25
19	919	339.152084656849	270.24939359182105	21/02/24 15:41:25
19	909	339.28415000899184	270.387156445014	21/02/24 15:41:25
19	909	339.4157285431138	270.51168835433816	21/02/24 15:41:25
19	909	339.62437683039747	270.7091625834443	21/02/24 15:41:25
19	909	339.78472943283987	270.8609275797677	21/02/24 15:41:25
19	909	339.9916911585266	271.056805570268	21/02/24 15:41:25
19	909	340.1494526205852	271.2061181934784	21/02/24 15:41:26
19	909	340.34160067503575	271.38797585174564	21/02/24 15:41:26
19	909	340.4659630247364	271.50567803591736	21/02/24 15:41:26
19	909	340.61736247139436	271.64896935838686	21/02/24 15:41:26
19	909	340.61736247139436	271.64896935838686	21/02/24 15:41:26
19	909	340.9160955816854	271.9317039613458	21/02/24 15:41:26
19	909	341.0437563249606	272.0525278952184	21/02/24 15:41:26
19	909	341.21502161738255	272.214621157684	21/02/24 15:41:26
19	909	341.33367117915026	272.32691649951926	21/02/24 15:41:26
19	909	341.33367117915026	272.32691649951926	21/02/24 15:41:27
19	909	341.6674731658262	272.6428418821385	21/02/24 15:41:27
19	909	341.8438056539325	272.80973096907275	21/02/24 15:41:27
19	909	341.99769002676464	272.95537413869624	21/02/24 15:41:27
19	909	342.1327566429313	273.08320732751713	21/02/24 15:41:27
19	909	342.3351555751998	273.27476688279535	21/02/24 15:41:27
19	909	342.44896682743996	273.3824830284313	21/02/24 15:41:27
19	909	342.6056454511039	273.5307708041339	21/02/24 15:41:27
19	909	342.6056454511039	273.5307708041339	21/02/24 15:41:27
19	909	342.77476028645754	273.6908287762201	21/02/24 15:41:27
19	964	343.28555506624565	273.98837320433194	21/02/24 15:41:28
19	964	343.28555506624565	273.98837320433194	21/02/24 15:41:28
19	964	343.71593431897156	274.2369705211253	21/02/24 15:41:28
19	964	343.9707036794782	274.3841313775605	21/02/24 15:41:28
19	964	344.2018792174978	274.51766387964074	21/02/24 15:41:28
19	964	344.2018792174978	274.51766387964074	21/02/24 15:41:28
19	964	344.4522183690071	274.66226574174107	21/02/24 15:41:28
19	964	344.84805204115344	274.8909087076107	21/02/24 15:41:28
19	964	345.08011727281695	275.02495511795036	21/02/24 15:41:28
19	964	345.08011727281695	275.02495511795036	21/02/24 15:41:28
19	964	345.25045058103706	275.1233436975946	21/02/24 15:41:29
19	964	345.50589188295555	275.27089268340865	21/02/24 15:41:29
19	964	345.95906001373385	275.53265339946125	21/02/24 15:41:29
19	964	345.95906001373385	275.53265339946125	21/02/24 15:41:29
19	964	346.13051708434125	275.6316910910513	21/02/24 15:41:29
19	964	346.5041712188166	275.8475226271929	21/02/24 15:41:29
19	964	346.5041712188166	275.8475226271929	21/02/24 15:41:29
19	964	346.72604847252325	275.97568421857903	21/02/24 15:41:29
19	964	346.8640323212131	276.0553869791741	21/02/24 15:41:29
19	964	347.3513547245829	276.3368760173275	21/02/24 15:41:30
19	964	347.3513547245829	276.3368760173275	21/02/24 15:41:30
19	964	347.5521343909616	276.4528511392978	21/02/24 15:41:30
19	964	347.75558200990133	276.57036733427253	21/02/24 15:41:30
19	964	347.9341321848128	276.6735021720112	21/02/24 15:41:30
19	964	348.0794772848575	276.7574569668841	21/02/24 15:41:30
19	964	348.0794772848575	276.7574569668841	21/02/24 15:41:30
19	964	348.29379256532303	276.8812505822456	21/02/24 15:41:30
19	964	348.42731619776725	276.95837701560384	21/02/24 15:41:30
19	964	348.6676618486308	277.09720639348205	21/02/24 15:41:30
19	964	348.8829516763553	277.22156293057395	21/02/24 15:41:31
19	964	349.05669530979793	277.3219213953703	21/02/24 15:41:31
19	964	349.05669530979793	277.3219213953703	21/02/24 15:41:31
19	964	349.25341195027937	277.43554961671816	21/02/24 15:41:31
19	964	349.48505407471106	277.56935163023365	21/02/24 15:41:31
19	964	349.67277593137624	277.6777842500099	21/02/24 15:41:31
19	964	349.8124716409374	277.7584758222557	21/02/24 15:41:31
19	964	350.01171543333464	277.8735637867985	21/02/24 15:41:31
19	964	350.2533545714906	278.0131403137741	21/02/24 15:41:31
19	964	350.4544315737902	278.129287184061	21/02/24 15:41:31
19	964	350.65426409987367	278.2447152152166	21/02/24 15:41:32
19	964	350.8715017773957	278.3701968767891	21/02/24 15:41:32
19	964	351.0227292286807	278.45754945797614	21/02/24 15:41:32
19	964	351.24770400493406	278.5875002522315	21/02/24 15:41:32
19	964	351.4158511303676	278.68462604057873	21/02/24 15:41:32
19	964	351.65830678580704	278.8246742074033	21/02/24 15:41:32
19	964	351.8701404513238	278.94703438280766	21/02/24 15:41:32
19	964	352.09466800855864	279.076726852696	21/02/24 15:41:32
19	964	352.2880495513825	279.18842864212684	21/02/24 15:41:32
19	964	352.53318279768706	279.33002344926996	21/02/24 15:41:33
19	964	352.74258734354316	279.45098050724715	21/02/24 15:41:33
19	964	352.9504301326323	279.5710354572828	21/02/24 15:41:33
19	964	353.13380626346355	279.67695788221346	21/02/24 15:41:33
19	964	353.2742852168482	279.75810187476463	21/02/24 15:41:33
19	964	353.42025226241464	279.84241592019833	21/02/24 15:41:33
19	964	353.6383115195082	279.96837214571815	21/02/24 15:41:33
19	964	353.8096174717702	280.0673225477492	21/02/24 15:41:33
19	964	353.8096174717702	280.0673225477492	21/02/24 15:41:33
19	964	353.95485590119887	280.1512157271312	21/02/24 15:41:33
19	964	354.20305893526336	280.2945837168695	21/02/24 15:41:34
19	964	354.36883688515707	280.39034101294277	21/02/24 15:41:34
19	964	354.5985616886677	280.5230355361845	21/02/24 15:41:34
19	964	354.8545942865369	280.67092606863645	21/02/24 15:41:34
19	964	355.05674250734586	280.78769170027266	21/02/24 15:41:34
19	964	355.214507015788	280.87882024151975	21/02/24 15:41:34
19	964	355.35139216287786	280.9578883658772	21/02/24 15:41:34
19	964	355.5168163980501	281.05344134789465	21/02/24 15:41:34
19	964	355.6673763665107	281.14040837508924	21/02/24 15:41:34
19	964	355.876048088478	281.26094213651743	21/02/24 15:41:34
19	964	356.06487550529613	281.37001335419507	21/02/24 15:41:35
19	964	356.210243187218	281.4539811928986	21/02/24 15:41:35
19	964	356.4529561107459	281.5941779639045	21/02/24 15:41:35
19	918	356.5394026095925	281.7579099227986	21/02/24 15:41:35
19	918	356.6019860963009	281.9943949686386	21/02/24 15:41:35
19	918	356.6552263107017	282.1955744683007	21/02/24 15:41:35
19	918	356.6988700363793	282.3604915895787	21/02/24 15:41:35
19	918	356.74927015293605	282.5509391740958	21/02/24 15:41:35
19	918	356.8180266526508	282.81075026552	21/02/24 15:41:35
19	918	356.8923889382234	283.0917440138283	21/02/24 15:41:36
19	990	357.12131113035997	283.17862004407993	21/02/24 15:41:36
19	990	357.2826865110511	283.2376807524635	21/02/24 15:41:36
19	990	357.4346999643042	283.29331515093565	21/02/24 15:41:36
19	990	357.672057370378	283.38018401831044	21/02/24 15:41:36
19	990	357.9487802841919	283.481460007534	21/02/24 15:41:36
19	990	358.2040293370962	283.5748769204125	21/02/24 15:41:36
19	990	358.39166710653035	283.6435492267757	21/02/24 15:41:36
19	990	358.5503060948157	283.7016084609988	21/02/24 15:41:36
19	990	358.7832268870732	283.7868536014228	21/02/24 15:41:36
19	918	359.0575161011964	283.8872388969909	21/02/24 15:41:37
19	918	359.0498649595772	283.94264999688966	21/02/24 15:41:37
19	918	359.21548724302255	283.9073194810345	21/02/24 15:41:37
19	918	359.3705527445166	283.8025653821472	21/02/24 15:41:37
19	918	359.4921416183421	283.89366493686924	21/02/24 15:41:37
19	918	359.6691100086705	283.7806446516649	21/02/24 15:41:37
19	918	359.5746106933475	283.6752043281498	21/02/24 15:41:37
19	918	359.58666519824123	283.68294009951086	21/02/24 15:41:37
19	918	359.3952240697639	283.5721861462634	21/02/24 15:41:37
19	918	359.16447020795124	283.47827477110616	21/02/24 15:41:37
19	918	359.1814004536215	283.546615415743	21/02/24 15:41:38
19	918	359.12666975781565	283.6100099327762	21/02/24 15:41:38
19	918	359.2261430811657	283.511483024324	21/02/24 15:41:38
19	918	359.4885519953541	283.392866733511	21/02/24 15:41:38
19	918	359.64122559140617	283.6478900766935	21/02/24 15:41:38
19	918	359.6061586146481	283.75041209436773	21/02/24 15:41:38
19	918	359.73649322868164	283.7956685867814	21/02/24 15:41:38
19	918	359.5886769472308	283.63553959698487	21/02/24 15:41:38
19	918	359.6712429262089	283.622665304118	21/02/24 15:41:38
19	918	359.7785874456561	283.71047369265085	21/02/24 15:41:39
19	918	359.6121369932095	283.8848066114971	21/02/24 15:41:39
19	918	359.787072291337	283.9087121924423	21/02/24 15:41:39
19	918	359.72870016120106	283.7227470863311	21/02/24 15:41:39
19	918	359.93573601994285	283.5126174886923	21/02/24 15:41:39
19	918	359.7795069671894	283.6209392885996	21/02/24 15:41:39
19	918	359.59686190607727	283.61040254332585	21/02/24 15:41:39
19	918	359.59135130187605	283.7295439463348	21/02/24 15:41:39
19	918	359.5193275382683	283.93806502111676	21/02/24 15:41:39
19	918	359.7225555374954	283.79410193232246	21/02/24 15:41:39
19	918	359.9035259043357	284.00702651375843	21/02/24 15:41:40
19	918	359.9278642051641	283.9515206978546	21/02/24 15:41:40
19	918	359.915195118958	283.9546910496412	21/02/24 15:41:40
19	918	360.0517287911808	284.04529003246705	21/02/24 15:41:40
19	918	360.0947477558308	284.3021095051121	21/02/24 15:41:40
19	918	359.8673676973653	284.1674353149061	21/02/24 15:41:40
19	918	359.86664143606714	284.1704726459113	21/02/24 15:41:40
19	918	359.8030762906239	284.1729532117801	21/02/24 15:41:40
19	918	359.8466849679816	284.4591338261521	21/02/24 15:41:40
19	918	359.70340106364546	284.36847992702536	21/02/24 15:41:40
19	918	359.79577781158	284.1278565234822	21/02/24 15:41:41
19	918	359.79186208012584	284.12931821834354	21/02/24 15:41:41
19	918	360.0061668547464	284.302962505211	21/02/24 15:41:41
19	918	359.9804647620474	284.31592570788473	21/02/24 15:41:41
19	918	359.8517140035738	284.0590303809337	21/02/24 15:41:41
19	918	359.8586950108955	283.84182715201484	21/02/24 15:41:41
19	918	359.7684959941331	283.6692709162479	21/02/24 15:41:41
19	918	359.713621455539	283.7975412226928	21/02/24 15:41:41
19	918	359.7227899376703	283.7981688271363	21/02/24 15:41:41
19	918	359.66112523761524	283.95034385600457	21/02/24 15:41:41
19	918	359.61737777993454	283.9827684068369	21/02/24 15:41:42
19	918	359.4798957999737	284.06995995873143	21/02/24 15:41:42
19	918	359.35351233370204	284.0085756112694	21/02/24 15:41:42
19	918	359.3971633649205	284.01028451246174	21/02/24 15:41:42
19	918	359.31417588337126	284.14436038763057	21/02/24 15:41:42
19	918	359.23779424519137	284.1018788349762	21/02/24 15:41:42
19	918	359.24888033252313	284.1771887460748	21/02/24 15:41:42
19	918	359.26609321770223	284.09475855391395	21/02/24 15:41:42
19	918	359.40288761439933	284.20007124965673	21/02/24 15:41:42
19	918	359.313206877551	284.09421382202805	21/02/24 15:41:43
19	918	359.30262136767556	284.0669780921219	21/02/24 15:41:43
19	918	359.405824663842	284.04156852844045	21/02/24 15:41:43
19	918	359.3101747578534	283.9320288363961	21/02/24 15:41:43
19	918	359.41554088394105	283.94703113480506	21/02/24 15:41:43
19	918	359.6015830348764	284.0325324783944	21/02/24 15:41:43
19	918	359.6498352067851	284.0701084198406	21/02/24 15:41:43
19	918	359.7530554695827	284.1075384571962	21/02/24 15:41:43
19	918	359.7547298068862	284.154168539904	21/02/24 15:41:43
19	918	359.72404170530535	284.20696685727626	21/02/24 15:41:43
19	918	359.692626161525	284.0905813611982	21/02/24 15:41:44
19	918	359.65430001790367	283.9848027779137	21/02/24 15:41:44
19	918	359.5108606039821	284.1215560231371	21/02/24 15:41:44
19	918	359.33308093649663	284.20870547593057	21/02/24 15:41:44
19	918	359.1598367490609	284.0122340611247	21/02/24 15:41:44
19	918	359.06818590057816	283.9693709206339	21/02/24 15:41:44
19	918	359.14999925074176	284.03265502547407	21/02/24 15:41:44
19	918	359.1687481113176	284.0065290488631	21/02/24 15:41:44
19	918	359.2361736623153	283.9751928114914	21/02/24 15:41:44
19	918	359.1150610621487	284.2360212774586	21/02/24 15:41:44
19	918	359.20664479813854	284.2954923679357	21/02/24 15:41:45
19	918	359.0357229100328	284.0930939183951	21/02/24 15:41:45
19	918	359.2450111683276	284.12797188930233	21/02/24 15:41:45
19	918	359.13233163779296	284.03522248023023	21/02/24 15:41:45
19	918	359.17202676626124	283.75560571716755	21/02/24 15:41:45
19	918	359.336380928281	283.654115714974	21/02/24 15:41:45
19	918	359.112899532741	283.7203008671945	21/02/24 15:41:45
19	918	359.0638838099782	283.6192699142385	21/02/24 15:41:45
19	918	359.03943758379853	283.5141142866591	21/02/24 15:41:45
19	918	359.03943758379853	283.5141142866591	21/02/24 15:41:46
19	918	359.03943758379853	283.5141142866591	21/02/24 15:41:46
19	918	358.88985761032603	283.45770898311	21/02/24 15:41:46
19	918	358.74163986724693	283.4018173647627	21/02/24 15:41:46
19	918	358.5840373775179	283.3423868402955	21/02/24 15:41:46
19	918	358.35445321180526	283.25581265354805	21/02/24 15:41:46
19	918	358.1041141215145	283.16141196574046	21/02/24 15:41:46
19	964	357.92382118973967	283.08926464544504	21/02/24 15:41:46
19	964	357.8029731182787	282.9350495655623	21/02/24 15:41:46
19	964	357.6198191828794	282.7013255314342	21/02/24 15:41:46
19	964	357.450601242172	282.4853853188324	21/02/24 15:41:47
19	964	357.33273234996784	282.3349719906989	21/02/24 15:41:47
19	964	357.1780450538401	282.1375744365567	21/02/24 15:41:47
19	964	357.0476205940029	281.9711388596434	21/02/24 15:41:47
19	964	356.89837988416025	281.7806917328344	21/02/24 15:41:47
19	964	356.77530930851333	281.6236404996193	21/02/24 15:41:47
19	964	356.59784125147746	281.3971722551404	21/02/24 15:41:47
19	964	356.4141074177657	281.2610620983625	21/02/24 15:41:47
19	964	356.223337972495	281.2266883923708	21/02/24 15:41:47
19	964	356.02420526155555	281.1908077551469	21/02/24 15:41:47
19	964	355.81121933427835	281.15243098241893	21/02/24 15:41:48
19	964	355.5739152823536	281.1096724594284	21/02/24 15:41:48
19	964	355.330430501584	281.0658002646136	21/02/24 15:41:48
19	964	355.1587429164701	281.03486481494156	21/02/24 15:41:48
19	964	354.87883906558005	280.98443046649135	21/02/24 15:41:48
19	964	354.65800470634116	280.94463952760924	21/02/24 15:41:48
19	964	354.44161923218456	280.9056502090683	21/02/24 15:41:48
19	964	354.2136338263192	280.86457076209246	21/02/24 15:41:48
19	964	353.99053039746036	280.8243709719298	21/02/24 15:41:48
19	964	353.8021528358935	280.7904282464187	21/02/24 15:41:49
19	964	353.5598641847145	280.7467715756718	21/02/24 15:41:49
19	964	353.3126940060015	280.7022353290997	21/02/24 15:41:49
19	964	353.05569379009756	280.65592786173386	21/02/24 15:41:49
19	964	352.7686207855803	280.6042017425882	21/02/24 15:41:49
19	964	352.52174203250576	280.55971800641265	21/02/24 15:41:49
19	964	352.3556568267312	280.5297920189215	21/02/24 15:41:49
19	964	352.1558787693468	280.4937951002411	21/02/24 15:41:49
19	964	351.87575333129575	280.44332082520873	21/02/24 15:41:49
19	964	351.6004790235136	280.39372064888414	21/02/24 15:41:49
19	954	351.46001882755684	280.1789759566475	21/02/24 15:41:50
19	954	351.35267650687297	279.96556318310616	21/02/24 15:41:50
19	954	351.26544015816444	279.7921241237221	21/02/24 15:41:50
19	954	351.1589292493414	279.5803643227458	21/02/24 15:41:50
19	954	351.0524446598161	279.36865684851546	21/02/24 15:41:50
19	954	350.9715242643186	279.20777485966744	21/02/24 15:41:50
19	954	350.86780620114547	279.0015676583781	21/02/24 15:41:50
19	954	350.75369858501995	278.77470445396443	21/02/24 15:41:50
19	954	350.6643997251903	278.59716481043046	21/02/24 15:41:50
19	954	350.59379173177336	278.4567854371013	21/02/24 15:41:50
19	954	350.4915052521927	278.2534244405809	21/02/24 15:41:51
19	954	350.3709128038434	278.01366840860385	21/02/24 15:41:51
19	954	350.2812914599313	277.8354876179247	21/02/24 15:41:51
19	954	350.20574865257726	277.68529708789123	21/02/24 15:41:51
19	954	350.11573346928293	277.50633328493547	21/02/24 15:41:51
19	954	350.0359462447691	277.34770421144253	21/02/24 15:41:51
19	954	349.9280527849349	277.1331956898875	21/02/24 15:41:51
19	954	349.82321074610337	276.92475385494095	21/02/24 15:41:51
19	954	349.7415825616989	276.76246467466325	21/02/24 15:41:51
19	954	349.6431295671191	276.5667252262997	21/02/24 15:41:52
19	954	349.57260430734095	276.4265103399614	21/02/24 15:41:52
19	954	349.49925636391134	276.28068353147484	21/02/24 15:41:52
19	954	349.39435809012514	276.07212989293043	21/02/24 15:41:52
19	954	349.3261403314042	275.9365026678	21/02/24 15:41:52
19	954	349.19179940887557	275.669412589122	21/02/24 15:41:52
19	954	349.09344259187503	275.4738643563369	21/02/24 15:41:52
19	954	348.96394471331564	275.2164029817829	21/02/24 15:41:52
19	954	348.96394471331564	275.2164029817829	21/02/24 15:41:52
19	954	348.8364842382786	274.962992273674	21/02/24 15:41:52
19	954	348.76149708561246	274.8139064692261	21/02/24 15:41:53
19	954	348.72432752583575	274.7558156181016	21/02/24 15:41:53
19	954	348.7922800364114	274.6141911734617	21/02/24 15:41:53
19	954	349.0701751303004	274.52317169982337	21/02/24 15:41:53
19	954	348.98666888773505	274.4125109666461	21/02/24 15:41:53
19	954	349.04393114252974	274.3865841337105	21/02/24 15:41:53
19	954	349.1312918891484	274.35843189213705	21/02/24 15:41:53
19	954	349.2499089331912	274.204930163288	21/02/24 15:41:53
19	954	349.28924525558665	274.3065986282671	21/02/24 15:41:53
19	954	349.03629237715586	274.32342473087704	21/02/24 15:41:53
19	954	349.07739415888983	274.380230718758	21/02/24 15:41:54
19	954	349.2625807804281	274.1746182936156	21/02/24 15:41:54
19	954	349.3538315042563	274.317968612289	21/02/24 15:41:54
19	954	349.3962872001752	274.2999025898392	21/02/24 15:41:54
19	954	349.3604326742782	274.0084511144455	21/02/24 15:41:54
19	954	349.4265981547915	274.2135116582837	21/02/24 15:41:54
19	954	349.39898955345046	274.05739166827914	21/02/24 15:41:54
19	954	349.3748044521945	274.063220300057	21/02/24 15:41:54
19	954	349.65256229295557	274.1573978396183	21/02/24 15:41:54
19	954	349.7382239387862	274.0399245462113	21/02/24 15:41:55
19	954	349.79336915849456	274.16143901803616	21/02/24 15:41:55
19	954	349.77978176125407	274.2616597427769	21/02/24 15:41:55
19	954	349.7815620176809	274.2677038166955	21/02/24 15:41:55
19	954	349.5479436761075	274.3672379681974	21/02/24 15:41:55
19	954	349.41020927916026	274.11562375082787	21/02/24 15:41:55
19	954	349.39691941759355	274.1602439542959	21/02/24 15:41:55
19	954	349.3627576117518	274.0729671692969	21/02/24 15:41:55
19	954	349.31047402666826	274.07872144958714	21/02/24 15:41:55
19	954	349.16817758623824	274.01594152957523	21/02/24 15:41:55
19	954	349.0567734089054	274.05000765190226	21/02/24 15:41:56
19	954	349.0813658822735	274.0747577964948	21/02/24 15:41:56
19	954	349.0877617126005	274.04874072614695	21/02/24 15:41:56
19	954	349.16896337542266	274.282287045526	21/02/24 15:41:56
19	954	349.18346644104037	274.3461339175817	21/02/24 15:41:56
19	954	349.3442704543133	274.44402299661306	21/02/24 15:41:56
19	954	349.34331099984246	274.44340971568255	21/02/24 15:41:56
19	954	349.2404345760641	274.2441097257865	21/02/24 15:41:56
19	954	349.0739941111558	274.3688640999928	21/02/24 15:41:56
19	954	349.1352921884913	274.4036332434817	21/02/24 15:41:56
19	954	349.382105331419	274.4052787380333	21/02/24 15:41:57
19	954	349.33082428985324	274.42513908268023	21/02/24 15:41:57
19	954	349.5014407962798	274.53835702973686	21/02/24 15:41:57
19	954	349.68191410120727	274.33198430363683	21/02/24 15:41:57
19	954	349.62646200087465	274.4917351695967	21/02/24 15:41:57
19	954	349.4992428552281	274.32313707244975	21/02/24 15:41:57
19	954	349.79048557992155	274.27079438156005	21/02/24 15:41:57
19	954	349.56532808225194	274.2547173149028	21/02/24 15:41:57
19	954	349.4225940750778	274.33785362923396	21/02/24 15:41:57
19	954	349.2415451690676	274.4890172544666	21/02/24 15:41:57
19	954	349.42687664785433	274.4322942944832	21/02/24 15:41:58
19	954	349.61418780144135	274.4142007811519	21/02/24 15:41:58
19	954	349.603161154376	274.3908146107653	21/02/24 15:41:58
19	954	349.54814526413077	274.3928750777353	21/02/24 15:41:58
19	954	349.5403850620202	274.3041861299139	21/02/24 15:41:58
19	954	349.41937564249093	274.56807448314544	21/02/24 15:41:58
19	954	349.3402931656576	274.37687019123183	21/02/24 15:41:58
19	954	349.19811421261284	274.4754432673032	21/02/24 15:41:58
19	954	349.18082611901053	274.62682256386364	21/02/24 15:41:58
19	954	349.1487998829229	274.8923637964888	21/02/24 15:41:59
19	954	349.21340712741346	274.96623666177754	21/02/24 15:41:59
19	954	349.3521560342031	274.9429322150929	21/02/24 15:41:59
19	954	349.3177413710137	274.71865494452584	21/02/24 15:41:59
19	954	349.2957034513782	274.73299862365565	21/02/24 15:41:59
19	954	349.3312502393944	274.9874241748716	21/02/24 15:41:59
19	954	349.12651773038885	275.0948980732083	21/02/24 15:41:59
19	954	349.2642366268815	275.1338147689183	21/02/24 15:41:59
19	954	349.22186272480843	274.9466232216073	21/02/24 15:41:59
19	954	349.0198243844145	275.11120932829294	21/02/24 15:41:59
19	954	349.193933034157	275.2669046819984	21/02/24 15:42:00
19	954	349.1171300775177	275.3596971301885	21/02/24 15:42:00
19	954	348.96610780665293	275.33316326986187	21/02/24 15:42:00
19	954	348.7439438040648	275.39462909135017	21/02/24 15:42:00
19	954	348.808698757379	275.4286435517049	21/02/24 15:42:00
19	954	348.8009339040872	275.4493170486114	21/02/24 15:42:00
19	954	348.8360737499332	275.68093478537963	21/02/24 15:42:00
19	954	348.7459267091618	275.42813707115783	21/02/24 15:42:00
19	954	348.89734860055324	275.1692716580923	21/02/24 15:42:00
19	954	348.7898465404262	275.28372513816987	21/02/24 15:42:00
19	954	348.7168540969008	275.37083157754057	21/02/24 15:42:01
19	954	348.70896235327507	275.37490799768125	21/02/24 15:42:01
19	954	348.73190502722235	275.4059590929207	21/02/24 15:42:01
19	954	348.72742640532863	275.3730056667499	21/02/24 15:42:01
19	954	348.89563898845023	275.436682732223	21/02/24 15:42:01
19	954	348.88834004530565	275.3449227959569	21/02/24 15:42:01
19	954	348.88261482100944	275.3660223087258	21/02/24 15:42:01
19	954	348.98714951068945	275.4905441410887	21/02/24 15:42:01
19	954	348.98079838736845	275.42771470453334	21/02/24 15:42:01
19	954	348.9000132836855	275.2277515356972	21/02/24 15:42:02
19	954	348.8485500027928	275.01828554680776	21/02/24 15:42:02
19	954	349.01343982300966	274.8204608722779	21/02/24 15:42:02
19	954	348.8973677908302	274.7169436766146	21/02/24 15:42:02
19	954	348.8778978707708	274.8571587560005	21/02/24 15:42:02
19	954	348.8159856376003	274.91773105778924	21/02/24 15:42:02
19	954	348.96945205513225	274.9963873004071	21/02/24 15:42:02
19	954	348.857070459588	274.86525082694476	21/02/24 15:42:02
19	954	348.8756302893691	275.14220831354635	21/02/24 15:42:02
19	954	349.1052372561472	275.20553887471857	21/02/24 15:42:02
19	954	348.8574653523907	275.19520038151694	21/02/24 15:42:03
19	954	348.7979846714105	275.2520167976133	21/02/24 15:42:03
19	954	348.7918043502203	275.1907199479736	21/02/24 15:42:03
19	954	348.8948694196407	275.2446594421085	21/02/24 15:42:03
19	954	348.76969407688574	275.4144413651755	21/02/24 15:42:03
19	954	348.69178156075355	275.1723731767639	21/02/24 15:42:03
19	954	348.6333335359343	275.36061671939456	21/02/24 15:42:03
19	954	348.72611257944214	275.1959253968817	21/02/24 15:42:03
19	954	348.73660606420793	275.1060207655175	21/02/24 15:42:03
19	954	348.6546352484684	275.2286648524797	21/02/24 15:42:03
19	954	348.7905710021433	275.0562635498476	21/02/24 15:42:04
19	954	348.84608238799035	275.0838175236514	21/02/24 15:42:04
19	954	348.6394234495184	274.9822331296641	21/02/24 15:42:04
19	954	348.64629507153523	275.18471286299797	21/02/24 15:42:04
19	954	348.6854355900894	275.08817309164897	21/02/24 15:42:04
19	954	348.7512924247295	275.2665706734471	21/02/24 15:42:04
19	954	348.7549926500636	275.2251642013235	21/02/24 15:42:04
19	954	348.7404633265622	275.2324658847184	21/02/24 15:42:04
19	954	348.7404633265622	275.2324658847184	21/02/24 15:42:04
19	954	348.7404633265622	275.2324658847184	21/02/24 15:42:04
19	954	348.79577449801116	275.3734194896875	21/02/24 15:42:05
19	954	348.87206382972204	275.56783331321765	21/02/24 15:42:05
19	954	348.9334950705427	275.72438314979775	21/02/24 15:42:05
19	954	349.0249139269583	275.9573526754172	21/02/24 15:42:05
19	954	349.08971111312104	276.1224802028629	21/02/24 15:42:05
19	954	349.1565307900479	276.292761795152	21/02/24 15:42:05
19	954	349.21437803088713	276.4401782558814	21/02/24 15:42:05
19	954	349.3151130412768	276.69688883511964	21/02/24 15:42:05
19	954	349.4222162729947	276.9698280302043	21/02/24 15:42:05
19	954	349.5199895548896	277.21899101467386	21/02/24 15:42:06
19	954	349.59637047258593	277.41363823363696	21/02/24 15:42:06
19	954	349.6738337312225	277.61104366316295	21/02/24 15:42:06
19	954	349.78159610075716	277.8856625885626	21/02/24 15:42:06
19	954	349.85945684508636	278.0840809606792	21/02/24 15:42:06
19	954	349.92279830823117	278.24549876002027	21/02/24 15:42:06
19	954	349.92279830823117	278.24549876002027	21/02/24 15:42:06
19	954	349.9791833661766	278.3891890304591	21/02/24 15:42:06
19	954	350.0437819662148	278.55381048599514	21/02/24 15:42:06
19	954	350.1515948122858	278.82855804453663	21/02/24 15:42:06
19	954	350.22814797101455	279.0236441982359	21/02/24 15:42:07
19	954	350.2852287918676	279.16910753345473	21/02/24 15:42:07
19	954	350.3921897817226	279.4416842429359	21/02/24 15:42:07
19	954	350.48995699071475	279.6908317513721	21/02/24 15:42:07
19	954	350.58876510701435	279.94263188193844	21/02/24 15:42:07
19	954	350.65261690817835	280.1053502139146	21/02/24 15:42:07
19	954	350.7513390467878	280.3569312410871	21/02/24 15:42:07
19	964	350.9892330932864	280.387291363373	21/02/24 15:42:07
19	964	351.2187213407296	280.3872913790821	21/02/24 15:42:07
19	964	351.4515031244629	280.3872913950167	21/02/24 15:42:07
19	964	351.639084269436	280.38729140785716	21/02/24 15:42:08
19	964	351.93666694062625	280.3872914282275	21/02/24 15:42:08
19	964	352.14926099668224	280.38729144278017	21/02/24 15:42:08
19	964	352.30955701562715	280.3872914537529	21/02/24 15:42:08
19	964	352.5376780388976	280.3872914693684	21/02/24 15:42:08
19	964	352.7490364369097	280.38729148383646	21/02/24 15:42:08
19	964	352.7490364369097	280.38729148383646	21/02/24 15:42:08
19	964	353.00290535542587	280.3872915012145	21/02/24 15:42:08
19	964	353.28072871029354	280.3872915202323	21/02/24 15:42:08
19	964	353.56118072237086	280.38729153943	21/02/24 15:42:09
19	964	353.75550235928677	280.3872915527319	21/02/24 15:42:09
19	964	353.94064714521204	280.3872915654056	21/02/24 15:42:09
19	964	354.1673058357966	280.387291580921	21/02/24 15:42:09
19	964	354.46254780363216	280.3872916011311	21/02/24 15:42:09
19	964	354.66344925144455	280.38729161488334	21/02/24 15:42:09
19	968	354.8992136176885	280.2592244093289	21/02/24 15:42:09
19	968	355.0606482810158	280.0994962963028	21/02/24 15:42:09
19	968	355.2605419476697	279.901715735905	21/02/24 15:42:09
19	968	355.4416770748224	279.7224954156434	21/02/24 15:42:09
19	968	355.6274395311312	279.53869668242373	21/02/24 15:42:10
19	968	355.8072283862057	279.36080840259405	21/02/24 15:42:10
19	968	356.00230112596495	279.16779780634175	21/02/24 15:42:10
19	968	356.17681684723567	278.99512691721895	21/02/24 15:42:10
19	968	356.2579265788345	279.0720720173018	21/02/24 15:42:10
19	968	356.16569489926684	279.1935258537528	21/02/24 15:42:10
19	968	356.2452867777285	279.1123374032304	21/02/24 15:42:10
19	968	356.2514974258062	278.9844185582232	21/02/24 15:42:10
19	968	356.0724889448745	278.9715778049609	21/02/24 15:42:10
19	968	356.0468227188161	278.9654486697529	21/02/24 15:42:10
19	968	355.76347725162725	278.9989950230169	21/02/24 15:42:11
19	968	355.89995315200497	279.2355350303188	21/02/24 15:42:11
19	968	356.0112530053318	279.1044143792102	21/02/24 15:42:11
19	968	356.20763828706123	279.11128860458837	21/02/24 15:42:11
19	968	356.1322751940549	278.99692870073676	21/02/24 15:42:11
19	968	356.0243083711363	279.148024334318	21/02/24 15:42:11
19	968	355.9860396826095	278.99875782022224	21/02/24 15:42:11
19	968	355.89812370319186	279.0979191356466	21/02/24 15:42:11
19	968	356.06196766283995	279.1877883080586	21/02/24 15:42:11
19	968	356.07565330959375	279.18991298077424	21/02/24 15:42:12
19	968	355.920145468858	279.2720770206612	21/02/24 15:42:12
19	968	355.8963284758253	279.287667743801	21/02/24 15:42:12
19	968	355.6873349163989	279.4480516835299	21/02/24 15:42:12
19	968	355.6586188668042	279.50562037463106	21/02/24 15:42:12
19	968	355.6570456599159	279.5583297721865	21/02/24 15:42:12
19	968	355.74946978940494	279.73347177902133	21/02/24 15:42:12
19	968	355.632668416657	279.7359394383058	21/02/24 15:42:12
19	968	355.45826128939126	279.7357951357968	21/02/24 15:42:12
19	968	355.4236859316921	279.4724005108657	21/02/24 15:42:12
19	968	355.4267311994845	279.4768677349327	21/02/24 15:42:13
19	968	355.3920893154085	279.42134150465364	21/02/24 15:42:13
19	968	355.46623139117537	279.351588774094	21/02/24 15:42:13
19	968	355.4093903762814	279.17069435362606	21/02/24 15:42:13
19	968	355.6534866345582	279.0530668094734	21/02/24 15:42:13
19	968	355.60583265450543	279.10149115102485	21/02/24 15:42:13
19	968	355.598503334422	279.07839002674524	21/02/24 15:42:13
19	968	355.33379610581414	279.10216116542426	21/02/24 15:42:13
19	968	355.20824617029774	279.2100223128794	21/02/24 15:42:13
19	968	355.0567413385434	279.23186877048016	21/02/24 15:42:14
19	968	355.20226639474225	279.3779437640816	21/02/24 15:42:14
19	968	355.0834087525354	279.53458216314874	21/02/24 15:42:14
19	968	355.02700838924585	279.53362398598637	21/02/24 15:42:14
19	968	354.9641110210086	279.74092915464854	21/02/24 15:42:14
19	968	354.90777956450046	279.68029887036624	21/02/24 15:42:14
19	968	355.00506584221534	279.5825982616519	21/02/24 15:42:14
19	968	355.1488447325	279.75723330966736	21/02/24 15:42:14
19	968	355.01699237952573	279.8616979486951	21/02/24 15:42:14
19	968	354.98195713125443	279.86451678011827	21/02/24 15:42:14
19	968	354.9753668852515	280.0392937340492	21/02/24 15:42:15
19	968	355.0061494451084	280.0524406661568	21/02/24 15:42:15
19	968	354.76347280602977	280.10496651606564	21/02/24 15:42:15
19	968	354.54896966306416	280.0228377140657	21/02/24 15:42:15
19	968	354.53536690791225	280.2244768764027	21/02/24 15:42:15
19	968	354.3472947164623	280.03420061580357	21/02/24 15:42:15
19	968	354.5361432511903	280.23537387144256	21/02/24 15:42:15
19	968	354.53639254058913	280.2060626920927	21/02/24 15:42:15
19	968	354.61847304890756	280.25837931670094	21/02/24 15:42:15
19	968	354.7079881015894	280.26547097339613	21/02/24 15:42:15
19	968	354.66981838343264	280.3611895333398	21/02/24 15:42:16
19	968	354.6730737984259	280.3573969554823	21/02/24 15:42:16
19	968	354.62791052649277	280.3081511389774	21/02/24 15:42:16
19	968	354.4085309468436	280.26606064007854	21/02/24 15:42:16
19	968	354.5932423643817	280.33498353515813	21/02/24 15:42:16
19	968	354.5845329806527	280.08610085352706	21/02/24 15:42:16
19	968	354.7367394502324	280.2632650443386	21/02/24 15:42:16
19	968	354.7367394502324	280.2632650443386	21/02/24 15:42:16
19	968	354.7367394502324	280.2632650443386	21/02/24 15:42:16
19	968	354.74839482041415	280.02964673914727	21/02/24 15:42:17
19	968	354.7569586094927	279.8579955724011	21/02/24 15:42:17
19	968	354.7655363077207	279.6860656129726	21/02/24 15:42:17
19	968	354.7767932039108	279.46043425432447	21/02/24 15:42:17
19	968	354.7852692186594	279.29054242167865	21/02/24 15:42:17
19	968	354.79449955469136	279.10553109844227	21/02/24 15:42:17
19	968	354.8046701534424	278.9016733053436	21/02/24 15:42:17
19	968	354.8195645897507	278.60313169637874	21/02/24 15:42:17
19	968	354.8335579770766	278.32265056364855	21/02/24 15:42:17
19	968	354.8335579770766	278.32265056364855	21/02/24 15:42:17
19	968	354.8462993664189	278.06726427067656	21/02/24 15:42:18
19	968	354.85589704639824	277.874889966336	21/02/24 15:42:18
19	968	354.7795135038881	277.75849660515394	21/02/24 15:42:18
19	968	354.6218966724736	277.91044598721163	21/02/24 15:42:18
19	968	354.6956647616188	277.9122454429044	21/02/24 15:42:18
19	968	354.6673327880381	277.96714880734163	21/02/24 15:42:18
19	968	354.69330641109224	278.06942055540526	21/02/24 15:42:18
19	968	354.6904279763536	278.0688766081651	21/02/24 15:42:18
19	968	354.76605462604397	277.96731357108035	21/02/24 15:42:18
19	968	354.7350698944078	278.08254051414207	21/02/24 15:42:18
19	968	354.4793325194793	278.1631033286294	21/02/24 15:42:19
19	968	354.25797493876286	278.2023501691979	21/02/24 15:42:19
19	968	354.21883979989	278.1938683745272	21/02/24 15:42:19
19	968	354.2065009661493	278.23820906330394	21/02/24 15:42:19
19	968	354.40662436010865	278.40279783201686	21/02/24 15:42:19
19	968	354.61356277708956	278.33421565990676	21/02/24 15:42:19
19	968	354.7065351337852	278.45358043163435	21/02/24 15:42:19
19	968	354.81389904499343	278.5127136377517	21/02/24 15:42:19
19	968	355.0370574556154	278.3598914288033	21/02/24 15:42:19
19	968	355.060087506473	278.3014304721788	21/02/24 15:42:20
19	968	355.1341427568381	278.5143380397643	21/02/24 15:42:20
19	968	355.2840008264623	278.2709061303349	21/02/24 15:42:20
19	968	355.17622916577585	278.31007454647045	21/02/24 15:42:20
19	968	355.09455578630656	278.11157769775804	21/02/24 15:42:20
19	968	355.1024215146993	278.1110744924447	21/02/24 15:42:20
19	968	355.171045585574	278.10628817561246	21/02/24 15:42:20
19	968	355.043046343296	277.88960783769187	21/02/24 15:42:20
19	968	355.30575824044234	278.0093530584724	21/02/24 15:42:20
19	968	355.33994918868797	277.9135095287741	21/02/24 15:42:20
19	968	355.3761156955856	277.86871489600117	21/02/24 15:42:21
19	968	355.28506039086426	277.8805286901279	21/02/24 15:42:21
19	968	355.2063866682892	277.9624534832667	21/02/24 15:42:21
19	968	355.2063866682892	277.9624534832667	21/02/24 15:42:21
19	968	354.9653144052119	277.91178070835724	21/02/24 15:42:21
19	968	354.94669606234135	277.9719760718542	21/02/24 15:42:21
19	968	354.94669606234135	277.9719760718542	21/02/24 15:42:21
19	968	354.94450887011163	277.9600259055071	21/02/24 15:42:21
19	968	354.6655026508603	277.9994520962668	21/02/24 15:42:21
19	968	354.5929291321788	278.0867315395515	21/02/24 15:42:21
19	968	354.84561985142955	277.932254144258	21/02/24 15:42:22
19	968	354.8257346379965	277.9184684034406	21/02/24 15:42:22
19	968	354.8257346379965	277.9184684034406	21/02/24 15:42:22
19	968	354.8888056202268	277.9331134646563	21/02/24 15:42:22
19	968	354.60152405076303	278.1395538816297	21/02/24 15:42:22
19	968	354.60152405076303	278.1395538816297	21/02/24 15:42:22
19	968	354.3951672462471	278.09455600986826	21/02/24 15:42:22
19	968	354.3951672462471	278.09455600986826	21/02/24 15:42:22
19	968	354.4414500499475	277.98978219502385	21/02/24 15:42:22
19	968	354.5154878235478	277.81838506711176	21/02/24 15:42:23
19	968	354.29404888927894	277.91991406831465	21/02/24 15:42:23
19	968	354.2924562256686	277.91869147394084	21/02/24 15:42:23
19	968	354.28116163402126	278.21226404280594	21/02/24 15:42:23
19	968	354.23648920748667	278.28954958063724	21/02/24 15:42:23
19	968	354.23712371864895	278.38884088045245	21/02/24 15:42:23
19	968	354.2955526058929	278.4248839122218	21/02/24 15:42:23
19	968	354.23716719413926	278.6051804088047	21/02/24 15:42:23
19	968	353.96016925255714	278.55251291166314	21/02/24 15:42:23
19	968	353.96016925255714	278.55251291166314	21/02/24 15:42:23
19	968	354.0038660323485	278.78789956606334	21/02/24 15:42:24
19	968	354.0985122982284	278.9473007700674	21/02/24 15:42:24
19	968	354.03704752382527	279.2298219663207	21/02/24 15:42:24
19	968	354.3092930891417	279.187906113096	21/02/24 15:42:24
19	968	354.3092930891417	279.187906113096	21/02/24 15:42:24
19	968	354.30465046767245	279.18153626733425	21/02/24 15:42:24
19	968	354.47775820909226	278.9629938152139	21/02/24 15:42:24
19	968	354.60341692035973	279.00440673802456	21/02/24 15:42:24
19	968	354.74160537020276	278.72780680194245	21/02/24 15:42:24
19	968	354.5246028602093	278.9260609664079	21/02/24 15:42:24
19	968	354.4661988119572	279.14792685790945	21/02/24 15:42:25
19	968	354.442395204308	279.0867535348805	21/02/24 15:42:25
19	968	354.4403529146087	279.37869349885887	21/02/24 15:42:25
19	968	354.4403529146087	279.37869349885887	21/02/24 15:42:25
19	968	354.8224667150177	279.57932911925957	21/02/24 15:42:25
19	968	354.8250654052269	279.3847011632015	21/02/24 15:42:25
19	968	354.78640718564304	279.65009040371524	21/02/24 15:42:25
19	968	354.78640718564304	279.65009040371524	21/02/24 15:42:25
19	968	354.806870771777	279.7529271816832	21/02/24 15:42:25
19	968	354.74517047637426	279.98769492412157	21/02/24 15:42:26
19	968	354.74517047637426	279.98769492412157	21/02/24 15:42:26
19	968	354.80599516776033	279.83312332442773	21/02/24 15:42:26
19	968	355.06687391117487	279.8447597134253	21/02/24 15:42:26
19	968	355.0515682402758	279.84728023859986	21/02/24 15:42:26
19	968	355.28971156946756	279.7526016470104	21/02/24 15:42:26
19	968	355.5666878818006	279.6612356187594	21/02/24 15:42:26
19	968	355.76617517124	279.8353379470462	21/02/24 15:42:26
19	968	356.00865455046016	279.8976819209076	21/02/24 15:42:26
19	968	356.01240031506984	279.9098825367519	21/02/24 15:42:26
19	968	356.03761808418983	279.80562665998417	21/02/24 15:42:27
19	968	356.02391588680393	279.569201498252	21/02/24 15:42:27
19	968	355.8226681841084	279.4119560999213	21/02/24 15:42:27
19	968	355.6868691628249	279.27393337625233	21/02/24 15:42:27
19	968	355.4213153992428	279.3815687111701	21/02/24 15:42:27
19	968	355.5421726627142	279.37284692989164	21/02/24 15:42:27
19	968	355.47228372178006	279.41560917826695	21/02/24 15:42:27
19	968	355.50218078022596	279.7130673728851	21/02/24 15:42:27
19	968	355.41955343806063	279.76359134741466	21/02/24 15:42:27
19	968	355.28524762534937	279.719408544128	21/02/24 15:42:28
19	968	355.1702032349099	279.66247924131864	21/02/24 15:42:28
19	968	355.4569688423754	279.7359893295586	21/02/24 15:42:28
19	968	355.54981801173955	279.6152087201648	21/02/24 15:42:28
19	968	355.64509840780363	279.71002734549245	21/02/24 15:42:28
19	968	355.71088185159584	279.676933975278	21/02/24 15:42:28
19	968	355.7572097275151	279.75265145944326	21/02/24 15:42:28
19	968	355.91189336863704	279.8219933480821	21/02/24 15:42:28
19	968	355.92151149113107	279.6263350069629	21/02/24 15:42:28
19	968	355.93752933138285	279.63640728864783	21/02/24 15:42:28
19	968	355.9412250587321	279.55080513029867	21/02/24 15:42:29
19	968	356.0218691667638	279.3575221622008	21/02/24 15:42:29
19	968	356.0842166869181	279.2895745604557	21/02/24 15:42:29
19	968	356.11313142972347	279.27389016616735	21/02/24 15:42:29
19	968	356.1622895421026	279.34702616889246	21/02/24 15:42:29
19	968	356.1531354530319	279.412703387334	21/02/24 15:42:29
19	968	356.0156393730922	279.4230835404035	21/02/24 15:42:29
19	968	356.0106615358841	279.51968030073544	21/02/24 15:42:29
19	968	356.0365955120987	279.6373848128892	21/02/24 15:42:29
19	968	355.9734912760993	279.5250054322954	21/02/24 15:42:29
19	968	356.12062080857146	279.66120703674636	21/02/24 15:42:30
19	968	356.08643036030867	279.91877940854505	21/02/24 15:42:30
19	968	356.16071688215806	279.82090222689743	21/02/24 15:42:30
19	968	355.89866764400665	279.93500539973326	21/02/24 15:42:30
19	968	355.91642031720755	280.0733993219167	21/02/24 15:42:30
19	968	356.0231497681773	280.11636587474476	21/02/24 15:42:30
19	968	355.8797205647708	279.96630927155087	21/02/24 15:42:30
19	968	356.138893404052	280.092254221757	21/02/24 15:42:30
19	968	356.14313402648503	280.09206402875554	21/02/24 15:42:30
19	968	356.20038820598546	279.98498347836585	21/02/24 15:42:30
19	968	356.0398376293719	279.8996534687175	21/02/24 15:42:31
19	968	356.04656962019436	279.88797465960187	21/02/24 15:42:31
19	968	355.9738968909577	279.6706168250178	21/02/24 15:42:31
19	968	355.96161375635205	279.5100336197308	21/02/24 15:42:31
19	968	355.9626664644346	279.5153095392361	21/02/24 15:42:31
19	968	356.0614265186907	279.4376067058561	21/02/24 15:42:31
19	968	356.10282307198065	279.3743568345925	21/02/24 15:42:31
19	968	356.2195785897439	279.6406615701742	21/02/24 15:42:31
19	968	356.1477236336897	279.65110734762584	21/02/24 15:42:31
19	968	356.1240001277832	279.7108413896792	21/02/24 15:42:32
19	968	356.1575132365806	279.75535361778526	21/02/24 15:42:32
19	968	355.9186603532686	279.86306683192726	21/02/24 15:42:32
19	968	355.9101740219798	279.87061243512807	21/02/24 15:42:32
19	968	355.9037867715308	279.86953342201065	21/02/24 15:42:32
19	968	356.08199639964937	279.9145670034903	21/02/24 15:42:32
19	968	356.0502186304732	279.77213021293403	21/02/24 15:42:32
19	968	355.98929029116016	279.69029821818003	21/02/24 15:42:32
19	968	356.1357320774727	279.47148793542084	21/02/24 15:42:32
19	968	356.22801942121646	279.524880738073	21/02/24 15:42:32
19	968	356.0935179622152	279.72066471037164	21/02/24 15:42:33
19	968	355.88956025338945	279.72580759659064	21/02/24 15:42:33
19	968	356.07058143043025	279.903033890563	21/02/24 15:42:33
19	968	356.0061005883401	279.8673191366895	21/02/24 15:42:33
19	968	355.8184386361281	280.05827173443663	21/02/24 15:42:33
19	968	355.7336338600205	280.080498214384	21/02/24 15:42:33
19	968	355.6521030944467	280.34387564736676	21/02/24 15:42:33
19	968	355.6029351654176	280.2629154305294	21/02/24 15:42:33
19	968	355.5731268894613	280.08842053999496	21/02/24 15:42:33
19	968	355.45797150002295	280.31815613423953	21/02/24 15:42:33
19	968	355.51777486514857	280.09475305252784	21/02/24 15:42:34
19	968	355.3967526468371	279.9960551178625	21/02/24 15:42:34
19	968	355.39553596393006	280.18869405071865	21/02/24 15:42:34
19	968	355.22949340346617	279.96080846099545	21/02/24 15:42:34
19	968	355.23470590393737	279.8283287456611	21/02/24 15:42:34
19	968	355.16489361213945	279.8179696713623	21/02/24 15:42:34
19	968	355.38276671571685	280.0147405030068	21/02/24 15:42:34
19	968	355.3596753903763	279.99645306205343	21/02/24 15:42:34
19	968	355.3558712807776	280.12928609260496	21/02/24 15:42:34
19	968	355.339723768452	280.1834295175645	21/02/24 15:42:35
19	968	355.3947981874304	280.18797465961325	21/02/24 15:42:35
19	968	355.2826545184768	280.21866357556235	21/02/24 15:42:35
19	968	355.3052376483235	280.1862863841252	21/02/24 15:42:35
19	968	355.16047608654475	279.9469738793133	21/02/24 15:42:35
19	968	355.3982147518823	279.9910054166297	21/02/24 15:42:35
19	968	355.4735371470139	279.90269761445103	21/02/24 15:42:35
19	968	355.5919376993106	280.0482885275305	21/02/24 15:42:35
19	968	355.5926161708583	280.0392717899024	21/02/24 15:42:35
19	968	355.59072705446516	280.0408605340519	21/02/24 15:42:35
19	968	355.4959113540158	279.7640434238379	21/02/24 15:42:36
19	968	355.50635150526637	279.8435445429494	21/02/24 15:42:36
19	968	355.5491008399973	279.67161000185723	21/02/24 15:42:36
19	968	355.62344679740363	279.6941498421923	21/02/24 15:42:36
19	968	355.5872562781435	279.5242623523333	21/02/24 15:42:36
19	968	355.54956737409407	279.54915655370144	21/02/24 15:42:36
19	968	355.5033217853374	279.4873035866595	21/02/24 15:42:36
19	968	355.49410551533606	279.47974712150415	21/02/24 15:42:36
19	968	355.60490023254	279.2564022298395	21/02/24 15:42:36
19	968	355.596291005821	279.2737050982401	21/02/24 15:42:36
19	968	355.3668601307727	279.4318516756756	21/02/24 15:42:37
19	968	355.4784010930113	279.2911619530421	21/02/24 15:42:37
19	968	355.4170434119643	279.09692240236154	21/02/24 15:42:37
19	968	355.30949470646965	278.9884292775786	21/02/24 15:42:37
19	968	355.5518459807253	279.09528882685674	21/02/24 15:42:37
19	968	355.5483248344781	279.0284642968388	21/02/24 15:42:37
19	968	355.56655695083583	279.0239238674521	21/02/24 15:42:37
19	968	355.4241644729194	279.2668135339748	21/02/24 15:42:37
19	968	355.1910799266353	279.2714353541842	21/02/24 15:42:37
19	968	355.2132579168813	279.2515481376187	21/02/24 15:42:37
19	968	355.4427553914326	279.29385021986616	21/02/24 15:42:38
19	968	355.4485442714828	279.29458408255175	21/02/24 15:42:38
19	968	355.5912730967652	279.42838300317766	21/02/24 15:42:38
19	968	355.5607215848217	279.5812082917231	21/02/24 15:42:38
19	968	355.62976828298684	279.55463485289124	21/02/24 15:42:38
19	968	355.67944419524514	279.5200634256503	21/02/24 15:42:38
19	968	355.7310972109137	279.4803651747012	21/02/24 15:42:38
19	968	355.9826812167367	279.5732488406256	21/02/24 15:42:38
19	968	355.96960739623705	279.5791637048991	21/02/24 15:42:38
19	968	355.955075431957	279.5657343001572	21/02/24 15:42:39
19	968	356.0467628909039	279.55563876881973	21/02/24 15:42:39
19	968	356.1408365501425	279.5287336955373	21/02/24 15:42:39
19	968	356.2452707683294	279.51293859081164	21/02/24 15:42:39
19	968	356.22042346526655	279.55896522866146	21/02/24 15:42:39
19	968	356.2079873422167	279.5517573329344	21/02/24 15:42:39
19	968	356.1140717867039	279.5680777905666	21/02/24 15:42:39
19	968	356.2332715750891	279.6146794690513	21/02/24 15:42:39
19	968	356.10650265850944	279.7859851228501	21/02/24 15:42:39
19	968	355.9232779541782	279.8684842058619	21/02/24 15:42:39
19	968	355.77064281443705	279.87207141160303	21/02/24 15:42:40
19	968	355.8783276943075	279.92867704466704	21/02/24 15:42:40
19	968	355.92206075451946	279.9323045086487	21/02/24 15:42:40
19	968	356.0367047458326	279.786712839748	21/02/24 15:42:40
19	968	356.03823237153983	279.7634212400064	21/02/24 15:42:40
19	968	356.0567324585164	280.0091535468957	21/02/24 15:42:40
19	968	355.83889649073154	279.93070543796733	21/02/24 15:42:40
19	968	355.8786874529058	280.2118899806575	21/02/24 15:42:40
19	968	356.08801901990927	280.1432442398224	21/02/24 15:42:40
19	968	356.08801901990927	280.1432442398224	21/02/24 15:42:40
19	968	356.15624611670216	280.2810298327291	21/02/24 15:42:41
19	968	355.8673881443592	280.35876043272833	21/02/24 15:42:41
19	968	356.089336099539	280.3136256026182	21/02/24 15:42:41
19	968	356.1966076202552	280.12424547881824	21/02/24 15:42:41
19	968	355.989369948708	280.3139590071678	21/02/24 15:42:41
19	968	355.97244488944705	280.11551660934845	21/02/24 15:42:41
19	968	356.1433929792625	280.1269100694015	21/02/24 15:42:41
19	968	356.1439351927002	279.83668559969044	21/02/24 15:42:41
19	968	356.00834799852083	279.6638386213709	21/02/24 15:42:41
19	968	356.1195898331981	279.67580312455044	21/02/24 15:42:41
19	968	356.1188784604727	279.46515558801474	21/02/24 15:42:42
19	968	355.9510227814371	279.39953242537587	21/02/24 15:42:42
19	968	355.8755194833471	279.31491419744617	21/02/24 15:42:42
19	968	355.81381774161105	279.40124204641756	21/02/24 15:42:42
19	968	355.8657496862764	279.3662367488315	21/02/24 15:42:42
19	968	355.9259215131562	279.4365996530914	21/02/24 15:42:42
19	968	355.98324646704424	279.4405469889821	21/02/24 15:42:42
19	968	355.9502436082664	279.5024016569978	21/02/24 15:42:42
19	968	355.8783047708408	279.51360344158667	21/02/24 15:42:42
19	968	355.94145287986214	279.67827638845915	21/02/24 15:42:43
19	968	355.7435523581341	279.64135369644356	21/02/24 15:42:43
19	968	355.78727443664485	279.4960676110026	21/02/24 15:42:43
19	968	355.61857642042577	279.65430880239575	21/02/24 15:42:43
19	968	355.61857642042577	279.65430880239575	21/02/24 15:42:43
19	968	355.61857642042577	279.65430880239575	21/02/24 15:42:43
19	968	355.5834350007232	279.88882008274095	21/02/24 15:42:43
19	968	355.54652010335514	280.135166414758	21/02/24 15:42:43
19	968	355.51522318439197	280.3440219646771	21/02/24 15:42:43
19	964	355.6436204646411	280.540614216409	21/02/24 15:42:43
19	964	355.77527377729916	280.69026757306017	21/02/24 15:42:44
19	964	355.9659378558218	280.90699982815977	21/02/24 15:42:44
19	964	356.1990976685325	281.17203796433597	21/02/24 15:42:44
19	964	356.3420992753766	281.3345911886997	21/02/24 15:42:44
19	964	356.4862009180853	281.49839484919937	21/02/24 15:42:44
19	990	356.7575888177391	281.50797043190244	21/02/24 15:42:44
19	990	357.0180322053506	281.4972035307292	21/02/24 15:42:44
19	990	357.1762077609822	281.4906644490842	21/02/24 15:42:44
19	990	357.375865422459	281.48241046986317	21/02/24 15:42:44
19	990	357.5687696622238	281.4744356815436	21/02/24 15:42:44
19	990	357.8414745093758	281.4631618835575	21/02/24 15:42:45
19	990	358.05152735153746	281.45447816072067	21/02/24 15:42:45
19	990	358.2350071769381	281.44689298389784	21/02/24 15:42:45
19	990	358.38732407804554	281.44059610288934	21/02/24 15:42:45
19	990	358.38732407804554	281.44059610288934	21/02/24 15:42:45
19	990	358.66821574378076	281.42898385643116	21/02/24 15:42:45
19	990	358.9678530112374	281.41659665445184	21/02/24 15:42:45
19	990	359.40114148404433	281.39868422361997	21/02/24 15:42:45
19	990	359.61539226016566	281.3898269554284	21/02/24 15:42:45
19	990	359.61539226016566	281.3898269554284	21/02/24 15:42:46
19	990	360.1806873206411	281.3664572853221	21/02/24 15:42:46
19	990	360.1806873206411	281.3664572853221	21/02/24 15:42:46
19	990	360.3553751216206	281.3592355765793	21/02/24 15:42:46
19	990	360.9123625405042	281.3362093498479	21/02/24 15:42:46
19	990	361.10856630914276	281.3280981568315	21/02/24 15:42:46
19	990	361.10856630914276	281.3280981568315	21/02/24 15:42:46
19	990	361.31594158347116	281.3195251264124	21/02/24 15:42:46
19	990	361.76921222926626	281.3007866193888	21/02/24 15:42:46
19	990	361.76921222926626	281.3007866193888	21/02/24 15:42:46
19	990	362.0069452074441	281.2909585814988	21/02/24 15:42:47
19	990	362.23116803718085	281.28168906204314	21/02/24 15:42:47
19	990	362.50721423796824	281.27027713029713	21/02/24 15:42:47
19	990	362.7473793914243	281.26034854467923	21/02/24 15:42:47
19	990	362.9524173334286	281.2518721411177	21/02/24 15:42:47
19	990	363.1812697256152	281.24241123250135	21/02/24 15:42:47
19	990	363.4722783836407	281.2303807429188	21/02/24 15:42:47
19	990	363.76709990008266	281.2181926272581	21/02/24 15:42:47
19	990	363.97716242721003	281.20950850403835	21/02/24 15:42:47
19	990	364.2479110886173	281.1983155760593	21/02/24 15:42:47
19	990	364.4927468820329	281.1881939031094	21/02/24 15:42:48
19	990	364.67731805349916	281.18056360932144	21/02/24 15:42:48
19	990	364.9715951357929	281.168398000927	21/02/24 15:42:48
19	990	365.13679744950605	281.16156842847505	21/02/24 15:42:48
19	990	365.3051842214371	281.15460720842304	21/02/24 15:42:48
19	990	365.47113298784285	281.1477467771251	21/02/24 15:42:48
19	990	365.73278746223923	281.1369298088266	21/02/24 15:42:48
19	990	365.91410581565873	281.12943398867907	21/02/24 15:42:48
19	990	366.1987336070666	281.1176672883249	21/02/24 15:42:48
19	990	366.40778365044315	281.1090250218503	21/02/24 15:42:49
19	990	366.671912689078	281.09810575343636	21/02/24 15:42:49
19	990	366.920882874665	281.08781316199116	21/02/24 15:42:49
19	990	367.11637070527036	281.07973156632465	21/02/24 15:42:49
19	990	367.2762191325913	281.0731233270622	21/02/24 15:42:49
19	990	367.4919501919377	281.06420486298725	21/02/24 15:42:49
19	990	367.72438030416396	281.05459604906815	21/02/24 15:42:49
19	990	368.00687730272267	281.04291743709376	21/02/24 15:42:49
19	990	368.21220040609217	281.0344292447736	21/02/24 15:42:49
19	990	368.4921767155469	281.0228548397469	21/02/24 15:42:49
19	990	368.7893343273349	281.01057014836607	21/02/24 15:42:50
19	990	369.00735222604453	281.0015571448457	21/02/24 15:42:50
19	990	369.1994729430622	280.9936147478725	21/02/24 15:42:50
19	990	369.37586814558534	280.9863224540254	21/02/24 15:42:50
19	990	369.62504099135145	280.9760214844749	21/02/24 15:42:50
19	990	369.8781178233995	280.9655591215603	21/02/24 15:42:50
19	990	370.07454289581875	280.95743877969994	21/02/24 15:42:50
19	990	370.34568987073465	280.9462293851781	21/02/24 15:42:50
19	990	370.55752658042536	280.93747191608276	21/02/24 15:42:50
19	990	370.783469859929	280.92813127210064	21/02/24 15:42:50
19	990	370.97573790897155	280.9201827843245	21/02/24 15:42:51
19	990	371.13431831464135	280.9136269659122	21/02/24 15:42:51
19	990	371.42900720212236	280.9014443332201	21/02/24 15:42:51
19	990	371.6252432519019	280.89333180568013	21/02/24 15:42:51
19	990	371.88875581730946	280.88243802267544	21/02/24 15:42:51
19	990	372.15020107137764	280.8716297036831	21/02/24 15:42:51
19	990	372.3950786721108	280.8615063023911	21/02/24 15:42:51
19	990	372.64084877187634	280.85134600460134	21/02/24 15:42:51
19	990	372.8418685673956	280.84303571386187	21/02/24 15:42:51
19	990	373.12756991370634	280.83122463204097	21/02/24 15:42:51
19	990	373.38024211529637	280.82077899681605	21/02/24 15:42:52
19	990	373.6079307322621	280.8113661994338	21/02/24 15:42:52
19	990	373.8660304661987	280.800696186447	21/02/24 15:42:52
19	990	374.1600545293794	280.78854103802934	21/02/24 15:42:52
19	990	374.33340810201923	280.73008187621537	21/02/24 15:42:52
19	990	374.4559829492808	280.81733905138304	21/02/24 15:42:52
19	990	374.4442649327959	280.7540133313867	21/02/24 15:42:52
19	990	374.3477280411963	280.8048213373278	21/02/24 15:42:52
19	990	374.18744013515715	280.70612567349315	21/02/24 15:42:52
19	990	374.045668479747	280.950245166107	21/02/24 15:42:53
19	990	374.13707614337926	280.977289019798	21/02/24 15:42:53
19	990	374.1817849862602	281.00167765457974	21/02/24 15:42:53
19	990	374.2181933491202	281.0360824581545	21/02/24 15:42:53
19	990	374.2951939087664	280.78996888706644	21/02/24 15:42:53
19	990	374.2321302487913	281.05360160243697	21/02/24 15:42:53
19	990	374.4419571724273	281.24112363662687	21/02/24 15:42:53
19	990	374.44503896110854	281.238611426203	21/02/24 15:42:53
19	990	374.1825841794385	281.1917609734601	21/02/24 15:42:53
19	990	374.23182081004967	281.17303180295966	21/02/24 15:42:53
19	990	374.2889699444511	281.16655998727714	21/02/24 15:42:54
19	990	374.34347943597504	280.9845417014424	21/02/24 15:42:54
19	990	374.3824947745481	280.9997685832221	21/02/24 15:42:54
19	990	374.6173637797189	281.0047103427331	21/02/24 15:42:54
19	990	374.6778754185823	281.0310731990829	21/02/24 15:42:54
19	990	374.55671714833994	281.1946819226016	21/02/24 15:42:54
19	990	374.63692893749345	280.90678413176494	21/02/24 15:42:54
19	990	374.5525933899309	281.03617835946216	21/02/24 15:42:54
19	990	374.6147559174459	281.32642459600635	21/02/24 15:42:54
19	990	374.8464585527989	281.496208945011	21/02/24 15:42:54
19	990	374.72707722309576	281.3167121414572	21/02/24 15:42:55
19	990	374.7852097958595	281.3247833286699	21/02/24 15:42:55
19	990	374.6407695845602	281.5082391903289	21/02/24 15:42:55
19	990	374.7712342906395	281.7391302394819	21/02/24 15:42:55
19	990	374.88549710636727	281.53985263498765	21/02/24 15:42:55
19	990	374.6456000536508	281.4416752058474	21/02/24 15:42:55
19	990	374.61210723903093	281.46782143349446	21/02/24 15:42:55
19	990	374.4842038871768	281.3668651671112	21/02/24 15:42:55
19	990	374.490224164229	281.4416521563869	21/02/24 15:42:55
19	990	374.263300241771	281.4408220812013	21/02/24 15:42:56
19	990	374.1199668771795	281.179290882165	21/02/24 15:42:56
19	990	374.0021192871178	281.0220194956031	21/02/24 15:42:56
19	990	374.2373834284923	281.18291432626495	21/02/24 15:42:56
19	990	374.2896859659359	281.0357288302269	21/02/24 15:42:56
19	990	374.34911569169196	281.12564025636453	21/02/24 15:42:56
19	990	374.3927562281308	281.0066231385973	21/02/24 15:42:56
19	990	374.3927562281308	281.0066231385973	21/02/24 15:42:56
19	990	374.3814654230123	281.0133314945372	21/02/24 15:42:56
19	990	374.2328720221146	281.009325604592	21/02/24 15:42:56
19	990	374.0089798320325	281.05039052686953	21/02/24 15:42:57
19	990	373.9058041719726	281.12177580111694	21/02/24 15:42:57
19	990	373.63273706134913	281.0765909678762	21/02/24 15:42:57
19	990	373.35784175818617	281.1724510717572	21/02/24 15:42:57
19	990	373.3664012004553	281.1614440927569	21/02/24 15:42:57
19	990	373.65815179871373	281.0804509661839	21/02/24 15:42:57
19	990	373.6373129957197	280.8603506985846	21/02/24 15:42:57
19	990	373.6376574187969	280.86192545514075	21/02/24 15:42:57
19	990	373.7070185052665	281.0674638573856	21/02/24 15:42:57
19	990	373.72660677677266	281.0352749490372	21/02/24 15:42:57
19	990	373.63217252487453	280.9287042163879	21/02/24 15:42:58
19	990	373.57924553611184	281.1065477993501	21/02/24 15:42:58
19	990	373.57924553611184	281.1065477993501	21/02/24 15:42:58
19	990	373.58089448177964	281.11099262620786	21/02/24 15:42:58
19	990	373.60425986016486	281.04129950738326	21/02/24 15:42:58
19	990	373.570811605325	281.07296207049154	21/02/24 15:42:58
19	990	373.30478581473574	280.9539243836827	21/02/24 15:42:58
19	990	373.0695157863797	280.7878092422171	21/02/24 15:42:58
19	990	372.9562197283479	280.68565095526725	21/02/24 15:42:58
19	990	372.97023681175665	280.6972635818814	21/02/24 15:42:58
19	990	372.69064848971584	280.84355871137734	21/02/24 15:42:59
19	990	372.42750911366306	280.73794982985083	21/02/24 15:42:59
19	990	372.210997460433	280.73386958517074	21/02/24 15:42:59
19	990	372.22637464340323	281.0189011802447	21/02/24 15:42:59
19	990	372.0449747777902	281.2568129003913	21/02/24 15:42:59
19	990	372.0233369310452	280.99122947898	21/02/24 15:42:59
19	990	372.02775261375047	281.07831394099827	21/02/24 15:42:59
19	990	372.0689617448825	280.8132495647169	21/02/24 15:42:59
19	990	372.069264072088	280.8134522315083	21/02/24 15:42:59
19	990	371.79609774786894	280.8757127729377	21/02/24 15:43:00
19	990	372.0846462334243	280.94227646267757	21/02/24 15:43:00
19	990	372.2504771906212	281.19132408574995	21/02/24 15:43:00
19	990	372.05762904704045	281.27466491934535	21/02/24 15:43:00
19	990	372.1977896394888	281.2242602821154	21/02/24 15:43:00
19	990	372.195060339841	281.2219634126806	21/02/24 15:43:00
19	990	372.0156942354676	281.41510125509336	21/02/24 15:43:00
19	990	372.09896563721776	281.19743554654855	21/02/24 15:43:00
19	990	372.1639418665652	281.0443038323489	21/02/24 15:43:00
19	990	372.10269295318346	281.06513217842223	21/02/24 15:43:00
19	990	371.8725781433783	281.11877102331925	21/02/24 15:43:01
19	990	371.73663869754574	281.19371958597577	21/02/24 15:43:01
19	990	371.96941811891844	281.0773158090499	21/02/24 15:43:01
19	990	371.8758840154924	281.308163067005	21/02/24 15:43:01
19	990	371.80691917739637	281.1983023727152	21/02/24 15:43:01
19	990	371.83238627260675	281.21467293361565	21/02/24 15:43:01
19	990	371.8616283558201	281.21910330338784	21/02/24 15:43:01
19	990	372.0418662508449	281.35947324196735	21/02/24 15:43:01
19	990	372.0438686781043	281.3543003251857	21/02/24 15:43:01
19	990	371.85622700530104	281.3217137243008	21/02/24 15:43:01
19	990	371.73384164520485	281.2383900725426	21/02/24 15:43:02
19	990	371.82561290260037	281.0258180881093	21/02/24 15:43:02
19	990	371.8103662987936	281.2970407255997	21/02/24 15:43:02
19	990	371.7000978458583	281.3242575442549	21/02/24 15:43:02
19	990	371.5736573172764	281.3733396515735	21/02/24 15:43:02
19	990	371.5020972560554	281.1742732903039	21/02/24 15:43:02
19	990	371.6370483254241	281.231745536792	21/02/24 15:43:02
19	990	371.65245971362606	281.1181313405159	21/02/24 15:43:02
19	990	371.5906380858036	281.2807318111408	21/02/24 15:43:02
19	990	371.7781691624873	281.4534898139697	21/02/24 15:43:03
19	990	371.609185094949	281.3188473870549	21/02/24 15:43:03
19	990	371.67886749621215	281.45591850518224	21/02/24 15:43:03
19	990	371.65037312568427	281.42340329413025	21/02/24 15:43:03
19	990	371.62613423815355	281.35637819705164	21/02/24 15:43:03
19	990	371.652672175215	281.3250066207114	21/02/24 15:43:03
19	990	371.82099866710615	281.39982909458035	21/02/24 15:43:03
19	990	371.6211739613053	281.4130587271004	21/02/24 15:43:03
19	990	371.66272597967344	281.29417946050097	21/02/24 15:43:03
19	990	371.6057519592636	281.3269320184988	21/02/24 15:43:03
19	990	371.7957183679404	281.2297088876127	21/02/24 15:43:04
19	990	371.85609698338277	281.25732093632143	21/02/24 15:43:04
19	990	371.6760398180091	281.02653016888047	21/02/24 15:43:04
19	990	371.6760398180091	281.02653016888047	21/02/24 15:43:04
19	990	371.7185611126404	280.7511075059582	21/02/24 15:43:04
19	990	372.0943560210195	280.700509007686	21/02/24 15:43:04
19	990	372.0943560210195	280.700509007686	21/02/24 15:43:04
19	990	371.86587219063045	280.7758474763946	21/02/24 15:43:04
19	990	371.934773081824	280.86462305560707	21/02/24 15:43:04
19	990	371.87624618622044	280.6902713665023	21/02/24 15:43:04
19	990	371.93313216310406	280.71181508745786	21/02/24 15:43:05
19	990	371.94101062988335	280.71526968397507	21/02/24 15:43:05
19	990	371.94101062988335	280.71526968397507	21/02/24 15:43:05
19	990	371.54157113849215	280.66170504180684	21/02/24 15:43:05
19	990	371.5142586163619	280.7517237393306	21/02/24 15:43:05
19	990	371.5130220079798	280.77263803063363	21/02/24 15:43:05
19	990	371.47160607151073	280.7972867085395	21/02/24 15:43:05
19	990	371.59237088491136	280.7419635571408	21/02/24 15:43:05
19	990	371.5992225307206	280.714288867507	21/02/24 15:43:05
19	990	371.6770328605802	280.67445980904665	21/02/24 15:43:06
19	990	371.7783153912582	280.8484499841585	21/02/24 15:43:06
19	990	371.78401416556886	280.8498115511615	21/02/24 15:43:06
19	990	371.8924125284922	280.9448966813261	21/02/24 15:43:06
19	990	372.1415347300315	280.8543115657412	21/02/24 15:43:06
19	990	372.1798612952867	280.7918984056037	21/02/24 15:43:06
19	990	372.30849316578934	280.87170443760766	21/02/24 15:43:06
19	990	372.0510371536346	280.740720015867	21/02/24 15:43:06
19	990	372.02096255132176	280.66474768117797	21/02/24 15:43:06
19	990	371.9954331438592	280.69041961070894	21/02/24 15:43:06
19	990	371.99626737869306	280.6863444303117	21/02/24 15:43:07
19	990	371.9853757366444	280.7543270717829	21/02/24 15:43:07
19	990	372.154376934722	280.96694003416445	21/02/24 15:43:07
19	990	372.3975535364364	280.90467855610746	21/02/24 15:43:07
19	990	372.1965422424429	280.9647395209044	21/02/24 15:43:07
19	990	372.38202677633694	280.93687701843885	21/02/24 15:43:07
19	990	372.60757013879504	281.1123843991057	21/02/24 15:43:07
19	990	372.60757013879504	281.1123843991057	21/02/24 15:43:07
19	990	372.8482419846838	281.03122745448235	21/02/24 15:43:07
19	990	372.8482419846838	281.03122745448235	21/02/24 15:43:07
19	990	372.85239193991544	281.0165794206416	21/02/24 15:43:08
19	990	373.007760475939	280.9104192573742	21/02/24 15:43:08
19	990	372.869730225771	280.9143147726287	21/02/24 15:43:08
19	990	372.869730225771	280.9143147726287	21/02/24 15:43:08
19	990	372.9137684764385	281.1458563694548	21/02/24 15:43:08
19	990	372.62167486808994	280.958961373012	21/02/24 15:43:08
19	990	372.59218769231074	280.988072691235	21/02/24 15:43:08
19	990	372.59378465464715	280.9907977301863	21/02/24 15:43:08
19	990	372.59378465464715	280.9907977301863	21/02/24 15:43:08
19	990	372.70453866006386	281.0498869481348	21/02/24 15:43:09
19	990	372.72389273661	281.06700438029065	21/02/24 15:43:09
19	990	372.51667136885777	280.92842583911636	21/02/24 15:43:09
19	990	372.5029435117076	280.9596857842888	21/02/24 15:43:09
19	990	372.7558115101713	280.8770841760444	21/02/24 15:43:09
19	990	373.0477547561491	280.72838959957454	21/02/24 15:43:09
19	990	372.7779485994485	280.76680544854133	21/02/24 15:43:09
19	990	372.5837717334763	280.68126113959994	21/02/24 15:43:09
19	990	372.52380512008443	280.64581356192343	21/02/24 15:43:09
19	990	372.46569338224975	280.695474987497	21/02/24 15:43:09
19	990	372.46569338224975	280.695474987497	21/02/24 15:43:10
19	990	372.5067830312873	280.7515680328938	21/02/24 15:43:10
19	990	372.44996510010736	280.9267575090242	21/02/24 15:43:10
19	990	372.45164757383844	280.92337040977077	21/02/24 15:43:10
19	990	372.4363173852727	280.98311804816075	21/02/24 15:43:10
19	990	372.43497367870344	280.9713091590733	21/02/24 15:43:10
19	990	372.42736100863203	280.8535605658206	21/02/24 15:43:10
19	990	372.31919452389945	280.7719860781053	21/02/24 15:43:10
19	990	372.460972244037	280.72225628701216	21/02/24 15:43:10
19	990	372.45972964551265	280.7658194588692	21/02/24 15:43:10
19	990	372.4609600267919	280.78035277544103	21/02/24 15:43:11
19	990	372.6788078033543	280.82862764613077	21/02/24 15:43:11
19	990	372.51977092578653	280.8034980950119	21/02/24 15:43:11
19	990	372.59260229139693	280.6421582940236	21/02/24 15:43:11
19	990	372.81435181680064	280.74133821053084	21/02/24 15:43:11
19	990	372.7827442657574	280.72383484865946	21/02/24 15:43:11
19	990	372.963757994232	280.7691826564557	21/02/24 15:43:11
19	990	373.15534994767063	280.91843458293124	21/02/24 15:43:11
19	990	372.9123912269595	280.9236067563833	21/02/24 15:43:11
19	990	372.83268725038084	280.9336947556806	21/02/24 15:43:11
19	990	372.56432927439835	280.82570201991473	21/02/24 15:43:12
19	990	372.55193006643736	281.10815242606344	21/02/24 15:43:12
19	990	372.7311255571566	281.0137715351214	21/02/24 15:43:12
19	990	372.50070675668553	281.1177176184619	21/02/24 15:43:12
19	990	372.4813611855839	281.30975007237356	21/02/24 15:43:12
19	990	372.59173160513575	281.5163493406028	21/02/24 15:43:12
19	990	372.42906846551205	281.7206742284074	21/02/24 15:43:12
19	990	372.5215056275096	281.65191023651977	21/02/24 15:43:12
19	990	372.6971810549509	281.80778363682117	21/02/24 15:43:12
19	990	372.8058601247456	281.7541022146241	21/02/24 15:43:13
19	990	372.88332842395096	281.70862578964216	21/02/24 15:43:13
19	990	372.874061222525	281.7553945551729	21/02/24 15:43:13
19	990	373.02125152642566	281.82172920421976	21/02/24 15:43:13
19	990	373.0306972707606	281.8265144243406	21/02/24 15:43:13
19	990	373.1172216047016	281.9274658139896	21/02/24 15:43:13
19	990	373.2354147226627	281.8873951355567	21/02/24 15:43:13
19	990	373.4377401970078	282.0875026578108	21/02/24 15:43:13
19	990	373.2832211875013	281.84053935300676	21/02/24 15:43:13
19	990	373.4420884719073	281.8648131029935	21/02/24 15:43:13
19	990	373.29875998809496	281.99386347132224	21/02/24 15:43:14
19	990	373.31327287606223	281.9790434081035	21/02/24 15:43:14
19	990	373.3184130926431	282.10554435403003	21/02/24 15:43:14
19	990	373.41687124095455	281.834958378497	21/02/24 15:43:14
19	990	373.33551993750046	282.06525906524564	21/02/24 15:43:14
19	990	373.47230456002455	281.80153614994117	21/02/24 15:43:14
19	990	373.4043985523605	281.8386528926394	21/02/24 15:43:14
19	990	373.47500975550565	281.84584584675133	21/02/24 15:43:14
19	990	373.47771377966586	281.7884734896527	21/02/24 15:43:14
19	990	373.54170841734845	281.9660871953744	21/02/24 15:43:14
19	990	373.40576943433575	282.13439501026284	21/02/24 15:43:15
19	990	373.4727495147192	282.2480201966545	21/02/24 15:43:15
19	990	373.3352006853398	282.1463321986534	21/02/24 15:43:15
19	990	373.3164648236209	282.05622664570024	21/02/24 15:43:15
19	990	373.47570968017476	282.0391898859541	21/02/24 15:43:15
19	990	373.3550497810691	282.2398725376645	21/02/24 15:43:15
19	990	373.10832216952366	282.3198908195276	21/02/24 15:43:15
19	990	372.96655963731985	282.10685735604704	21/02/24 15:43:15
19	990	373.04088139191975	281.9650543895559	21/02/24 15:43:15
19	990	373.0313612056268	281.9581485808301	21/02/24 15:43:15
19	990	372.9730040949796	282.02889023463405	21/02/24 15:43:16
19	990	372.82625853951015	281.77744602331904	21/02/24 15:43:16
19	990	372.6255072729828	281.8820015664944	21/02/24 15:43:16
19	990	372.6255072729828	281.8820015664944	21/02/24 15:43:16
19	990	372.55060588671375	281.91947244960886	21/02/24 15:43:16
19	990	372.71281269756173	281.95654953152496	21/02/24 15:43:16
19	990	372.51778154282607	281.86519955872177	21/02/24 15:43:16
19	990	372.2965441711694	281.96857387720354	21/02/24 15:43:16
19	990	372.2965441711694	281.96857387720354	21/02/24 15:43:16
19	990	372.25077212414305	281.9630923030583	21/02/24 15:43:17
19	990	372.0163509439875	282.13111776628654	21/02/24 15:43:17
19	990	372.4452531492513	282.140335827152	21/02/24 15:43:17
19	990	372.4452531492513	282.140335827152	21/02/24 15:43:17
19	990	372.5819699612175	282.06959681244336	21/02/24 15:43:17
19	990	372.5819699612175	282.06959681244336	21/02/24 15:43:17
19	990	372.57241136558486	282.34257914189715	21/02/24 15:43:17
19	990	372.67874516994493	282.2971662463236	21/02/24 15:43:17
19	990	372.7061673249369	282.2447220416508	21/02/24 15:43:17
19	990	372.71065531606985	282.2376065096777	21/02/24 15:43:17
19	990	372.721711573413	282.1784279470966	21/02/24 15:43:18
19	990	373.1446571074743	281.92939400333415	21/02/24 15:43:18
19	990	373.1398153368341	281.8510674417324	21/02/24 15:43:18
19	990	373.1261431319991	281.846840794262	21/02/24 15:43:18
19	990	372.9925748519749	281.8982808858741	21/02/24 15:43:18
19	990	372.884427342614	282.05381778978654	21/02/24 15:43:18
19	990	372.91090726279975	281.82676940823376	21/02/24 15:43:18
19	990	372.75506736648754	281.87481491321216	21/02/24 15:43:18
19	990	372.75506736648754	281.87481491321216	21/02/24 15:43:18
19	990	373.0497358823898	281.98218126792773	21/02/24 15:43:19
19	990	373.0497358823898	281.98218126792773	21/02/24 15:43:19
19	990	373.0489794866466	281.97863088277217	21/02/24 15:43:19
19	990	373.0300893316091	281.87058624677906	21/02/24 15:43:19
19	990	372.9312037034458	282.11956189187987	21/02/24 15:43:19
19	990	372.93252235372034	282.1568890938579	21/02/24 15:43:19
19	990	372.87961321185065	281.89207290880404	21/02/24 15:43:19
19	990	372.87961321185065	281.89207290880404	21/02/24 15:43:19
19	990	372.9194069301125	281.98657409082307	21/02/24 15:43:19
19	990	373.0829839581045	282.16230458060704	21/02/24 15:43:20
19	990	373.09851014687666	282.13902441114084	21/02/24 15:43:20
19	990	373.1733333346115	282.3109543669226	21/02/24 15:43:20
19	990	373.10342260230425	282.31137163606707	21/02/24 15:43:20
19	990	373.0899529726815	282.3399746985377	21/02/24 15:43:20
19	990	373.1496193999417	282.30271860772524	21/02/24 15:43:20
19	990	373.08598814775416	282.190349351551	21/02/24 15:43:20
19	990	373.213342988926	282.24141599328084	21/02/24 15:43:20
19	990	373.1699065572204	282.10923990838955	21/02/24 15:43:20
19	990	372.9034518476295	282.19579324881823	21/02/24 15:43:21
19	990	372.69659037573655	282.1741648731677	21/02/24 15:43:21
19	990	372.6229074753395	282.06366247833057	21/02/24 15:43:21
19	990	372.6264390614502	281.9679987562314	21/02/24 15:43:21
19	990	372.6337034329278	281.724401402498	21/02/24 15:43:21
19	990	372.6614949897131	281.6882869797707	21/02/24 15:43:21
19	990	372.58216093058275	281.68141572792	21/02/24 15:43:21
19	990	372.59106033436046	281.6971923087725	21/02/24 15:43:21
19	990	372.67328426353816	281.83259840869704	21/02/24 15:43:21
19	990	372.6747523709668	281.8155395044122	21/02/24 15:43:21
19	990	372.6747523709668	281.8155395044122	21/02/24 15:43:22
19	990	372.6747523709668	281.8155395044122	21/02/24 15:43:22
19	990	372.4646662826716	281.820710223284	21/02/24 15:43:22
19	990	372.2108175539856	281.8269580449396	21/02/24 15:43:22
19	990	371.931131579852	281.8338417827271	21/02/24 15:43:22
19	990	371.70433575185547	281.83942376808074	21/02/24 15:43:22
19	990	371.5140177484741	281.84410794731275	21/02/24 15:43:22
19	990	371.3366421470656	281.8484735832149	21/02/24 15:43:22
19	990	371.0999333613886	281.85429955006094	21/02/24 15:43:22
19	990	370.9418185295494	281.8581911325619	21/02/24 15:43:23
19	990	370.77423795186576	281.8623156896071	21/02/24 15:43:23
19	990	370.60399932066974	281.8665056676784	21/02/24 15:43:23
19	990	370.3500334626633	281.8727563721655	21/02/24 15:43:23
19	990	370.07458740178913	281.879535755592	21/02/24 15:43:23
19	990	369.7784847268825	281.88682354747556	21/02/24 15:43:23
19	990	369.4832765291818	281.8940893241452	21/02/24 15:43:23
19	990	369.29520393019726	281.8987182386285	21/02/24 15:43:23
19	990	369.07745179308296	281.90407763721544	21/02/24 15:43:23
19	990	368.91413193394084	281.9080973278321	21/02/24 15:43:24
19	990	368.7144923914114	281.9130109323382	21/02/24 15:43:24
19	990	368.5432201565988	281.9172263498556	21/02/24 15:43:24
19	990	368.38739432624607	281.92106159457956	21/02/24 15:43:24
19	990	368.1093308776746	281.92790539814956	21/02/24 15:43:24
19	990	367.826977909716	281.9348547770055	21/02/24 15:43:24
19	990	367.6740596163569	281.9386184603209	21/02/24 15:43:24
19	990	367.4348592346492	281.94450575127803	21/02/24 15:43:24
19	990	367.14092114461204	281.9517402675738	21/02/24 15:43:24
19	990	366.9468117931353	281.9565177609101	21/02/24 15:43:24
19	990	366.7076819459981	281.9624033158435	21/02/24 15:43:25
19	990	366.52849938701655	281.9668134252741	21/02/24 15:43:25
19	990	366.273423614758	281.9730914473938	21/02/24 15:43:25
19	990	365.97606415097135	281.9804101718443	21/02/24 15:43:25
19	990	365.69920283498107	281.9872243880691	21/02/24 15:43:25
19	990	365.40640898426045	281.9944307419108	21/02/24 15:43:25
19	990	365.1347056167891	282.00111800874083	21/02/24 15:43:25
19	990	364.9681481918726	282.0052173835602	21/02/24 15:43:25
19	990	364.73645582199885	282.01091988446865	21/02/24 15:43:25
19	990	364.5016613800243	282.0166987347579	21/02/24 15:43:26
19	990	364.32717735611953	282.02099320205247	21/02/24 15:43:26
19	990	364.0411169709324	282.0280338292742	21/02/24 15:43:26
19	990	363.85252821327435	282.03267544765146	21/02/24 15:43:26
19	990	363.5725930694724	282.0395653180978	21/02/24 15:43:26
19	990	363.4020095086859	282.0437637857076	21/02/24 15:43:26
19	990	363.1375124443565	282.0502736882583	21/02/24 15:43:26
19	990	362.98061003363506	282.05413543018864	21/02/24 15:43:26
19	990	362.68536055308215	282.0614022229276	21/02/24 15:43:26
19	990	362.455381776282	282.06706254823024	21/02/24 15:43:27
19	990	362.2194410105567	282.0728696122765	21/02/24 15:43:27
19	990	361.99167076811983	282.07847558028976	21/02/24 15:43:27
19	990	361.75358158322274	282.0843355220475	21/02/24 15:43:27
19	990	361.55198228803994	282.0892973607328	21/02/24 15:43:27
19	990	361.2551954779184	282.09660199081304	21/02/24 15:43:27
19	990	361.0652674732133	282.101276571249	21/02/24 15:43:27
19	990	360.8521699936505	282.1065214076304	21/02/24 15:43:27
19	990	360.67181940116734	282.1109602651467	21/02/24 15:43:27
19	990	360.38847483066826	282.1179340497023	21/02/24 15:43:27
19	990	360.2111977089172	282.12229726178555	21/02/24 15:43:28
19	990	359.9764017123806	282.12807615033626	21/02/24 15:43:28
19	990	359.8161176772967	282.13202112209416	21/02/24 15:43:28
19	990	359.5494240012684	282.1385850884892	21/02/24 15:43:28
19	990	359.28218627460024	282.1451624452659	21/02/24 15:43:28
19	990	358.98595826268956	282.1524533219916	21/02/24 15:43:28
19	990	358.8339832500044	282.15619378892353	21/02/24 15:43:28
19	990	358.65284708598625	282.16065198122584	21/02/24 15:43:28
19	990	358.4114159387323	282.16659417663476	21/02/24 15:43:28
19	990	358.21660643155894	282.1713889024699	21/02/24 15:43:29
19	990	358.21660643155894	282.1713889024699	21/02/24 15:43:29
19	990	358.0557078438413	282.1753489998315	21/02/24 15:43:29
19	990	357.80839946028107	282.18143584802027	21/02/24 15:43:29
19	990	357.56103670913666	282.1875240343248	21/02/24 15:43:29
19	990	357.33407344379054	282.1931101407103	21/02/24 15:43:29
19	990	357.14918349852815	282.1976607225072	21/02/24 15:43:29
19	990	357.14918349852815	282.1976607225072	21/02/24 15:43:29
19	990	356.8959424419442	282.20389358790544	21/02/24 15:43:29
19	990	356.6177838422254	282.2107397333718	21/02/24 15:43:29
19	911	356.3244939581973	282.2095769962919	21/02/24 15:43:30
19	911	355.8998244628061	282.20018463800227	21/02/24 15:43:30
19	911	355.8998244628061	282.20018463800227	21/02/24 15:43:30
19	911	355.68419413710546	282.1954155710006	21/02/24 15:43:30
19	911	355.23903771297535	282.1855701060549	21/02/24 15:43:30
19	911	354.9878033417922	282.1800135891531	21/02/24 15:43:30
19	911	354.9878033417922	282.1800135891531	21/02/24 15:43:30
19	911	354.5152325542953	282.16956180440854	21/02/24 15:43:30
19	911	354.3036409999454	282.1648820623713	21/02/24 15:43:30
19	911	354.3036409999454	282.1648820623713	21/02/24 15:43:31
19	911	353.95785999000014	282.1572344701368	21/02/24 15:43:31
19	911	353.95785999000014	282.1572344701368	21/02/24 15:43:31
19	911	353.7860881693988	282.1534354158118	21/02/24 15:43:31
19	911	353.231234151811	282.14116378389997	21/02/24 15:43:31
19	911	352.9501014914518	282.1349460105452	21/02/24 15:43:31
19	911	352.69991269530334	282.12941261848624	21/02/24 15:43:31
19	911	352.4071948754204	282.12293861771167	21/02/24 15:43:31
19	911	352.4071948754204	282.12293861771167	21/02/24 15:43:31
19	911	352.1864222171432	282.11805581842987	21/02/24 15:43:31
19	911	351.813412150352	282.10980600479604	21/02/24 15:43:32
19	911	351.813412150352	282.10980600479604	21/02/24 15:43:32
19	911	351.34869609729844	282.09952794216	21/02/24 15:43:32
19	911	351.34869609729844	282.09952794216	21/02/24 15:43:32
19	911	350.86300311015344	282.0887859354853	21/02/24 15:43:32
19	911	350.58900277484935	282.0827259068075	21/02/24 15:43:32
19	911	350.58900277484935	282.0827259068075	21/02/24 15:43:32
19	911	350.3031459631823	282.07640365003175	21/02/24 15:43:32
19	911	350.0146139882218	282.07002222702806	21/02/24 15:43:32
19	911	349.5142472988492	282.05895568404867	21/02/24 15:43:33
19	911	349.5142472988492	282.05895568404867	21/02/24 15:43:33
19	911	349.10223973252033	282.0498433679464	21/02/24 15:43:33
19	911	348.86235476626416	282.0445378643116	21/02/24 15:43:33
19	911	348.619485333113	282.0391663536227	21/02/24 15:43:33
19	911	348.4333457089199	282.0350495285121	21/02/24 15:43:33
19	911	348.1682026440226	282.0291853948963	21/02/24 15:43:33
19	911	348.0009664643484	282.0254866547335	21/02/24 15:43:33
19	911	347.7357828241827	282.01962162371996	21/02/24 15:43:33
19	911	347.4684044609074	282.01370805230965	21/02/24 15:43:34
19	911	347.3176775442023	282.01037444530243	21/02/24 15:43:34
19	911	347.0196393214117	282.0037827738901	21/02/24 15:43:34
19	911	346.79530112574173	281.9988211160959	21/02/24 15:43:34
19	911	346.6127427471071	281.99478349691316	21/02/24 15:43:34
19	911	346.3815110511046	281.98966937649635	21/02/24 15:43:34
19	911	346.17716691805646	281.9851499247043	21/02/24 15:43:34
19	911	345.99992173767305	281.98122981681485	21/02/24 15:43:34
19	911	345.72122056256416	281.97506582029337	21/02/24 15:43:34
19	911	345.42356813338773	281.9684826814267	21/02/24 15:43:34
19	911	345.2531772294201	281.9647141686497	21/02/24 15:43:35
19	911	345.02622058511173	281.95969459897805	21/02/24 15:43:35
19	911	345.02622058511173	281.95969459897805	21/02/24 15:43:35
19	911	344.830219611032	281.95535967171423	21/02/24 15:43:35
19	911	344.31588266213726	281.9439841503781	21/02/24 15:43:35
19	911	344.1598128288966	281.9405323748023	21/02/24 15:43:35
19	911	343.9815364595027	281.9365894602438	21/02/24 15:43:35
19	911	343.71180780559433	281.93062390777067	21/02/24 15:43:35
19	911	343.46099881765235	281.92507679901297	21/02/24 15:43:35
19	911	343.21161415300645	281.91956119182265	21/02/24 15:43:36
19	911	343.04276337361273	281.9158267417744	21/02/24 15:43:36
19	911	342.7697543685731	281.90978863821516	21/02/24 15:43:36
19	911	342.6106140901386	281.90626895401465	21/02/24 15:43:36
19	911	342.3962180780856	281.9015271861624	21/02/24 15:43:36
19	911	342.24444084720943	281.8981703494975	21/02/24 15:43:36
19	911	342.0532145755907	281.89394102368783	21/02/24 15:43:36
19	911	341.76120784249514	281.8874827499244	21/02/24 15:43:36
19	911	341.5465182256538	281.88273448845445	21/02/24 15:43:36
19	911	341.3504042118281	281.8783970611057	21/02/24 15:43:37
19	911	341.1880891431464	281.874807160495	21/02/24 15:43:37
19	911	341.0075794460236	281.87081485172655	21/02/24 15:43:37
19	911	341.0075794460236	281.87081485172655	21/02/24 15:43:37
19	911	340.8032213790483	281.8662950917597	21/02/24 15:43:37
19	911	340.65195913086893	281.86294964489804	21/02/24 15:43:37
19	911	340.65195913086893	281.86294964489804	21/02/24 15:43:37
19	911	340.23125742404045	281.853645041656	21/02/24 15:43:37
19	911	339.97609896524136	281.84800173623455	21/02/24 15:43:37
19	911	339.7383287150047	281.84274300349045	21/02/24 15:43:37
19	911	339.7383287150047	281.84274300349045	21/02/24 15:43:38
19	911	339.5611196769732	281.8388236949566	21/02/24 15:43:38
19	911	339.3586563804667	281.83434584137416	21/02/24 15:43:38
19	911	339.09282943229533	281.8284665824037	21/02/24 15:43:38
19	911	338.79632462031805	281.8219088252327	21/02/24 15:43:38
19	911	338.61182429366374	281.817828256246	21/02/24 15:43:38
19	911	338.4062958638551	281.8132826115213	21/02/24 15:43:38
19	911	338.1312748857715	281.807200009424	21/02/24 15:43:38
19	911	337.87034598116304	281.8014290798262	21/02/24 15:43:38
19	911	337.6502999757902	281.79656235182927	21/02/24 15:43:39
19	911	337.4580732618667	281.7923108993713	21/02/24 15:43:39
19	911	337.20738326823897	281.78676642239486	21/02/24 15:43:39
19	911	336.9742905880618	281.7816111428406	21/02/24 15:43:39
19	911	336.67810688904194	281.77506048768186	21/02/24 15:43:39
19	911	336.499087506182	281.7711011399942	21/02/24 15:43:39
19	911	336.2327789797521	281.7652112300219	21/02/24 15:43:39
19	911	336.0393885920398	281.7609340407468	21/02/24 15:43:39
19	911	335.84372544909434	281.7566065852489	21/02/24 15:43:39
19	911	335.66774392184146	281.75271442540634	21/02/24 15:43:40
19	911	335.4851866303712	281.74867683026827	21/02/24 15:43:40
19	911	335.25427067422584	281.74356969302755	21/02/24 15:43:40
19	911	334.9773731064343	281.7374455866473	21/02/24 15:43:40
19	911	334.68887076684416	281.73106481908513	21/02/24 15:43:40
19	911	334.442319268577	281.72561187265575	21/02/24 15:43:40
19	911	334.2212995624627	281.7207236094501	21/02/24 15:43:40
19	911	333.9978327072674	281.7157812229763	21/02/24 15:43:40
19	911	333.7102358783009	281.7094204824712	21/02/24 15:43:40
19	911	333.4689540698406	281.7040840850647	21/02/24 15:43:40
19	911	333.4689540698406	281.7040840850647	21/02/24 15:43:41
19	911	333.2542948816477	281.69933649658105	21/02/24 15:43:41
19	911	333.0921776732481	281.69575097201965	21/02/24 15:43:41
19	911	332.915928822532	281.6918528998199	21/02/24 15:43:41
19	911	332.6239960709609	281.6853962622959	21/02/24 15:43:41
19	911	332.4418739733112	281.6813682922812	21/02/24 15:43:41
19	911	332.14620531702406	281.6748290282535	21/02/24 15:43:41
19	911	331.9333895501058	281.67012221047105	21/02/24 15:43:41
19	911	331.6893520628614	281.6647248660863	21/02/24 15:43:41
19	911	331.44736829282334	281.6593729434897	21/02/24 15:43:42
19	911	331.21603215220324	281.6542565130853	21/02/24 15:43:42
19	911	331.01104544770607	281.64972284962664	21/02/24 15:43:42
19	911	330.7489667127186	281.64392648938457	21/02/24 15:43:42
19	911	330.4961761458862	281.6383355543122	21/02/24 15:43:42
19	911	330.2454857800806	281.6327910691044	21/02/24 15:43:42
19	911	330.01345175067183	281.64051954267563	21/02/24 15:43:42
19	911	329.532555436867	281.6728607699515	21/02/24 15:43:42
19	911	329.29879241436964	281.688581795092	21/02/24 15:43:42
19	911	329.1441711351567	281.6989803816254	21/02/24 15:43:43
19	911	328.96580821199893	281.71097564062376	21/02/24 15:43:43
19	911	328.8055155676708	281.7217556376669	21/02/24 15:43:43
19	911	328.646713353208	281.73243540035674	21/02/24 15:43:43
19	911	328.4792808533327	281.7436955667926	21/02/24 15:43:43
19	911	328.4792808533327	281.7436955667926	21/02/24 15:43:43
19	911	328.04397753098647	281.7729705753086	21/02/24 15:43:43
19	911	327.7503334646826	281.7927187189602	21/02/24 15:43:43
19	911	327.5301262468582	281.8075280894524	21/02/24 15:43:43
19	911	327.26427546543346	281.82540707978086	21/02/24 15:43:43
19	911	326.9943086109624	281.84356288415444	21/02/24 15:43:44
19	911	326.731033395288	281.86126866259735	21/02/24 15:43:44
19	911	326.57928977072515	281.8714737211698	21/02/24 15:43:44
19	911	326.57928977072515	281.8714737211698	21/02/24 15:43:44
19	911	326.33088854817737	281.88817919418636	21/02/24 15:43:44
19	911	326.16698995045795	281.8992016987198	21/02/24 15:43:44
19	911	326.16698995045795	281.8992016987198	21/02/24 15:43:44
19	911	325.71215258353016	281.92979041033004	21/02/24 15:43:44
19	911	325.46718704158866	281.9462648270375	21/02/24 15:43:44
19	911	325.24848421529236	281.960973024227	21/02/24 15:43:45
19	911	325.09852583286033	281.97105802173877	21/02/24 15:43:45
19	911	325.09852583286033	281.97105802173877	21/02/24 15:43:45
19	911	324.80001188384097	281.9911336746251	21/02/24 15:43:45
19	911	324.44014236578175	282.0153356107579	21/02/24 15:43:45
19	911	324.2170121638579	282.0303415577061	21/02/24 15:43:45
19	911	323.971761056216	282.0468351792711	21/02/24 15:43:45
19	911	323.74789730818156	282.0618904586446	21/02/24 15:43:45
19	911	323.49745544582544	282.07873316872025	21/02/24 15:43:45
19	911	323.49745544582544	282.07873316872025	21/02/24 15:43:45
19	911	323.12339863799303	282.10388922812206	21/02/24 15:43:46
19	911	323.12339863799303	282.10388922812206	21/02/24 15:43:46
19	911	322.8758578443687	282.12053683559344	21/02/24 15:43:46
19	911	322.6023814677662	282.13892866226456	21/02/24 15:43:46
19	911	322.1374875256787	282.17019369842444	21/02/24 15:43:46
19	911	321.9552359689717	282.1824504757123	21/02/24 15:43:46
19	911	321.67734002208323	282.20113952721755	21/02/24 15:43:46
19	911	321.4077334692427	282.21927110059454	21/02/24 15:43:46
19	911	321.21855109043975	282.2319939893625	21/02/24 15:43:46
19	911	320.99585079107896	282.24697102451387	21/02/24 15:43:47
19	911	320.796973146844	282.2603459390384	21/02/24 15:43:47
19	911	320.796973146844	282.2603459390384	21/02/24 15:43:47
19	911	320.57256528519576	282.2754378111275	21/02/24 15:43:47
19	911	320.30248977133414	282.2936009230598	21/02/24 15:43:47
19	911	320.0064391002839	282.3135109156357	21/02/24 15:43:47
19	911	319.76139218504045	282.3299908048585	21/02/24 15:43:47
19	911	319.54983172785	282.34421866361345	21/02/24 15:43:47
19	911	319.54983172785	282.34421866361345	21/02/24 15:43:47
19	911	319.3135082036593	282.3601118875519	21/02/24 15:43:48
19	911	319.04981902660256	282.3778455057157	21/02/24 15:43:48
19	911	318.76034000893725	282.39731354161694	21/02/24 15:43:48
19	911	318.55619031527516	282.41104301188216	21/02/24 15:43:48
19	911	318.3190074198497	282.42699403023414	21/02/24 15:43:48
19	911	318.08819743749126	282.44251645759056	21/02/24 15:43:48
19	911	317.92649100254283	282.45339153484633	21/02/24 15:43:48
19	911	317.73179294041796	282.46648536421577	21/02/24 15:43:48
19	911	317.5200215054694	282.4807274116418	21/02/24 15:43:48
19	911	317.36429811091887	282.4912001176093	21/02/24 15:43:49
19	911	317.15627778357367	282.50518989563744	21/02/24 15:43:49
19	911	316.9486301228531	282.51915461109877	21/02/24 15:43:49
19	911	316.7235609546494	282.5342909573604	21/02/24 15:43:49
19	911	316.56054450259325	282.54525413585503	21/02/24 15:43:49
19	911	316.27879754138235	282.5642021756824	21/02/24 15:43:49
19	911	316.07821403513196	282.577691812798	21/02/24 15:43:49
19	911	315.90283254176114	282.58948656475235	21/02/24 15:43:49
19	911	315.70112635357657	282.6030517044462	21/02/24 15:43:49
19	911	315.447033488639	282.62013995165927	21/02/24 15:43:49
19	911	315.1932211610569	282.6372093321808	21/02/24 15:43:50
19	911	315.0064275673518	282.6497715704311	21/02/24 15:43:50
19	911	314.7295295605712	282.6683935084923	21/02/24 15:43:50
19	911	314.4963561444897	282.68407488143635	21/02/24 15:43:50
19	911	314.2402000392377	282.7013018856371	21/02/24 15:43:50
19	911	313.9854238743061	282.7184360861248	21/02/24 15:43:50
19	911	313.7714717754653	282.7328247875063	21/02/24 15:43:50
19	911	313.607257352394	282.7438685319187	21/02/24 15:43:50
19	911	313.41530391374744	282.7567777799363	21/02/24 15:43:50
19	911	313.18137442415707	282.77251000031765	21/02/24 15:43:51
19	911	312.9601007158142	282.78739109440437	21/02/24 15:43:51
19	911	312.7720489949525	282.8000379441918	21/02/24 15:43:51
19	911	312.58179866863134	282.81283265454044	21/02/24 15:43:51
19	911	312.4047347453272	282.824740553232	21/02/24 15:43:51
19	911	312.16204662592116	282.8410618087741	21/02/24 15:43:51
19	911	311.86505513860385	282.8610350731028	21/02/24 15:43:51
19	911	311.57571834893884	282.88049354389	21/02/24 15:43:51
19	911	311.3619090991421	282.89487263839095	21/02/24 15:43:51
19	911	311.1742089025129	282.9074958474792	21/02/24 15:43:51
19	911	310.91788280424714	282.92473428404605	21/02/24 15:43:52
19	911	310.69771046416827	282.93954130894093	21/02/24 15:43:52
19	911	310.5199747157126	282.9514943892014	21/02/24 15:43:52
19	911	310.3149205985313	282.96528468373526	21/02/24 15:43:52
19	911	310.0242281801195	282.9848343232342	21/02/24 15:43:52
19	980	310.01008884824506	283.109350496501	21/02/24 15:43:52
19	980	310.03492965155084	283.26633811135343	21/02/24 15:43:52
19	980	310.0594341187666	283.4212001669028	21/02/24 15:43:52
19	980	310.0935632165926	283.6368874616658	21/02/24 15:43:52
19	980	310.12266098108074	283.82077799806655	21/02/24 15:43:53
19	980	310.15352812321726	284.01585055516813	21/02/24 15:43:53
19	980	310.198189924587	284.2981018811713	21/02/24 15:43:53
19	980	310.2385317836524	284.5530522608118	21/02/24 15:43:53
19	980	310.27064659851777	284.75600979503827	21/02/24 15:43:53
19	980	310.3140368404742	285.030225186093	21/02/24 15:43:53
19	980	310.34029314488174	285.196158411079	21/02/24 15:43:53
19	980	310.36715267778584	285.36590388809765	21/02/24 15:43:53
19	980	310.40882006444616	285.62923126798995	21/02/24 15:43:53
19	980	310.45404976615134	285.91507158095305	21/02/24 15:43:54
19	980	310.49710036427626	286.18714050861223	21/02/24 15:43:54
19	980	310.5407092055342	286.4627373921463	21/02/24 15:43:54
19	980	310.58551910442793	286.7459246571678	21/02/24 15:43:54
19	980	310.62447306522245	286.9921038696073	21/02/24 15:43:54
19	980	310.6481154997499	287.14151809587355	21/02/24 15:43:54
19	980	310.69049552457165	287.4093491692995	21/02/24 15:43:54
19	980	310.7281556510139	287.64735167479114	21/02/24 15:43:54
19	980	310.7577179421893	287.8341779027544	21/02/24 15:43:54
19	980	310.79250665370023	288.05403378972653	21/02/24 15:43:54
19	980	310.83403411583316	288.31647688187894	21/02/24 15:43:55
19	980	310.8633930456443	288.5020179172847	21/02/24 15:43:55
19	980	310.9072333467158	288.77907756849294	21/02/24 15:43:55
19	980	310.9461638688882	289.02510865474915	21/02/24 15:43:55
19	980	310.9718379748409	289.1873625322655	21/02/24 15:43:55
19	980	311.01794203477533	289.4787285688229	21/02/24 15:43:55
19	980	311.03678002289996	289.5977799049612	21/02/24 15:43:55
19	980	311.0977596957669	289.675875897331	21/02/24 15:43:55
19	980	311.1738745580081	289.65463392516784	21/02/24 15:43:55
19	980	311.2643649633471	289.6869001876134	21/02/24 15:43:56
19	980	311.14156260169244	289.57062020272787	21/02/24 15:43:56
19	980	310.91179081182656	289.4544892198997	21/02/24 15:43:56
19	980	310.9033053557221	289.48349385810116	21/02/24 15:43:56
19	980	310.66012479456793	289.59499679519877	21/02/24 15:43:56
19	980	310.598586783823	289.4366584653395	21/02/24 15:43:56
19	980	310.71246310630755	289.2562882829096	21/02/24 15:43:56
19	980	310.4311281354674	289.18115192986124	21/02/24 15:43:56
19	980	310.46095678342715	289.1504999699973	21/02/24 15:43:56
19	980	310.436704650556	289.0564621479136	21/02/24 15:43:57
19	980	310.6686127096565	288.9264667628766	21/02/24 15:43:57
19	980	310.598798961865	289.0209994338243	21/02/24 15:43:57
19	980	310.4282747334053	288.9983175127304	21/02/24 15:43:57
19	980	310.6428666359718	288.80898865206495	21/02/24 15:43:57
19	980	310.7484111185688	288.55997005875105	21/02/24 15:43:57
19	980	310.7827686613752	288.65725315866285	21/02/24 15:43:57
19	980	310.89923485505443	288.81535935451456	21/02/24 15:43:57
19	980	310.9221192152342	288.7636068512858	21/02/24 15:43:57
19	980	311.1593950947303	288.7708443334711	21/02/24 15:43:57
19	980	310.9559084773149	288.8215119906163	21/02/24 15:43:58
19	980	310.7677488728567	288.6062426136716	21/02/24 15:43:58
19	980	310.60094023112794	288.8503208349209	21/02/24 15:43:58
19	980	310.5290013827903	288.7617408852624	21/02/24 15:43:58
19	980	310.38074202831143	288.8896915839707	21/02/24 15:43:58
19	980	310.44382674704195	289.0419337442747	21/02/24 15:43:58
19	980	310.55181923841985	288.97015610413	21/02/24 15:43:58
19	980	310.80025592864814	288.907139378874	21/02/24 15:43:58
19	980	310.79212087379284	288.9122493950931	21/02/24 15:43:58
19	980	310.79364140301277	288.96245884668406	21/02/24 15:43:59
19	980	311.0045675888922	288.9975858738588	21/02/24 15:43:59
19	980	311.13323364145737	289.0861638991099	21/02/24 15:43:59
19	980	310.899059792736	289.1341041863935	21/02/24 15:43:59
19	980	311.01938892704936	289.0441556775726	21/02/24 15:43:59
19	980	311.1771459551423	288.8911517083912	21/02/24 15:43:59
19	980	311.1235758069815	289.0937422224485	21/02/24 15:43:59
19	980	311.2696305013516	289.30468029633585	21/02/24 15:43:59
19	980	311.2988234908894	289.1179476369703	21/02/24 15:43:59
19	980	311.35131954289835	289.1611637719252	21/02/24 15:43:59
19	980	311.5711005869808	289.24411033593674	21/02/24 15:44:00
19	980	311.8379226194924	289.1297215347087	21/02/24 15:44:00
19	980	311.57729679935613	289.1112562071095	21/02/24 15:44:00
19	980	311.6133570756862	289.0935217684004	21/02/24 15:44:00
19	980	311.5974968222263	289.01789399554474	21/02/24 15:44:00
19	980	311.8133813869399	289.0881287565358	21/02/24 15:44:00
19	980	311.6625788786312	288.9640406476804	21/02/24 15:44:00
19	980	311.5575653714714	289.08099194715743	21/02/24 15:44:00
19	980	311.4585271192842	289.07815530707205	21/02/24 15:44:00
19	980	311.4017038860212	288.99221100304874	21/02/24 15:44:01
19	980	311.67214925502185	288.9238717440747	21/02/24 15:44:01
19	980	311.6162512437729	288.819757363439	21/02/24 15:44:01
19	980	311.37093230416275	288.9274023064005	21/02/24 15:44:01
19	980	311.3925793359329	288.9816470448122	21/02/24 15:44:01
19	980	311.49942078092295	288.9499219022119	21/02/24 15:44:01
19	980	311.5988368634152	288.87990534343186	21/02/24 15:44:01
19	980	311.6952183146863	289.06919889843755	21/02/24 15:44:01
19	980	311.83045254372945	288.8377251527043	21/02/24 15:44:01
19	980	311.8480618211175	288.8797739693372	21/02/24 15:44:02
19	980	311.8480618211175	288.8797739693372	21/02/24 15:44:02
