floorId	partitionId	location_x	location_y	timeStamp
1	59	326.05929279280866	283.41059588634107	20/04/28 05:14:36
1	59	326.05929279280866	283.41059588634107	20/04/28 05:14:37
1	59	326.05929279280866	283.41059588634107	20/04/28 05:14:38
1	39	323.3383314215366	280.8639124713207	20/04/28 05:14:39
1	39	323.3383314215366	280.8639124713207	20/04/28 05:14:40
1	39	323.3383314215366	280.8639124713207	20/04/28 05:14:41
1	59	326.05929279280866	283.41059588634107	20/04/28 05:14:42
1	59	326.05929279280866	283.41059588634107	20/04/28 05:14:43
1	59	326.05929279280866	283.41059588634107	20/04/28 05:14:44
1	39	323.3383314215366	280.8639124713207	20/04/28 05:14:45
1	59	326.05929279280866	283.41059588634107	20/04/28 05:14:46
1	39	323.3383314215366	280.8639124713207	20/04/28 05:14:47
1	39	323.3383314215366	280.8639124713207	20/04/28 05:14:48
1	39	323.3383314215366	280.8639124713207	20/04/28 05:14:49
1	39	323.3383314215366	280.8639124713207	20/04/28 05:14:50
1	39	325.1681104108905	280.1535421165315	20/04/28 05:14:51
1	39	323.3383314215366	280.86391247132065	20/04/28 05:14:52
1	39	323.3383314215366	280.8639124713207	20/04/28 05:14:53
1	39	323.3383314215366	280.86391247132065	20/04/28 05:14:54
1	39	323.3383314215366	280.8639124713207	20/04/28 05:14:55
1	39	323.3383314215366	280.8639124713207	20/04/28 05:14:56
1	39	323.3383314215366	280.8639124713207	20/04/28 05:14:57
1	39	323.3383314215366	280.8639124713207	20/04/28 05:14:58
1	59	326.05929279280866	283.41059588634107	20/04/28 05:14:59
1	59	326.05929279280866	283.41059588634107	20/04/28 05:15:00
1	59	326.05929279280866	283.41059588634107	20/04/28 05:15:01
1	59	326.05929279280866	283.41059588634107	20/04/28 05:15:02
1	59	326.05929279280866	283.41059588634107	20/04/28 05:15:03
1	59	326.0592927928086	283.41059588634107	20/04/28 05:15:04
1	59	326.0592927928086	283.41059588634107	20/04/28 05:15:05
1	59	326.05929279280866	283.41059588634107	20/04/28 05:15:06
1	59	326.05929279280866	283.41059588634107	20/04/28 05:15:07
1	59	326.05929279280866	283.41059588634107	20/04/28 05:15:08
1	59	326.05929279280866	283.41059588634107	20/04/28 05:15:09
1	59	326.05929279280866	283.41059588634107	20/04/28 05:15:10
1	59	326.05929279280866	283.41059588634107	20/04/28 05:15:11
1	59	326.05929279280866	283.41059588634107	20/04/28 05:15:12
1	59	326.05929279280866	283.41059588634107	20/04/28 05:15:13
1	59	326.05929279280866	283.41059588634107	20/04/28 05:15:15
1	59	326.05929279280866	283.41059588634107	20/04/28 05:15:16
1	59	326.05929279280866	283.41059588634107	20/04/28 05:15:17
1	59	326.0592927928086	283.41059588634107	20/04/28 05:15:18
1	59	326.0592927928086	283.41059588634107	20/04/28 05:15:19
1	59	326.0592927928086	283.41059588634107	20/04/28 05:15:20
1	39	323.3383314215366	280.8639124713207	20/04/28 05:15:21
1	59	326.0592927928086	283.41059588634107	20/04/28 05:15:22
1	59	326.0592927928086	283.41059588634107	20/04/28 05:15:23
1	39	323.3383314215366	280.86391247132065	20/04/28 05:15:24
1	39	325.1681104108905	280.1535421165315	20/04/28 05:15:25
1	39	323.3383314215366	280.8639124713207	20/04/28 05:15:26
1	59	326.0592927928086	283.41059588634107	20/04/28 05:15:27
1	39	323.3383314215366	280.8639124713207	20/04/28 05:15:28
1	39	323.3383314215366	280.8639124713207	20/04/28 05:15:29
1	39	323.3383314215366	280.8639124713207	20/04/28 05:15:30
1	59	326.05929279280866	283.41059588634107	20/04/28 05:15:31
1	59	326.05929279280866	283.41059588634107	20/04/28 05:15:32
1	39	323.3383314215366	280.8639124713207	20/04/28 05:15:33
1	59	326.05929279280866	283.41059588634107	20/04/28 05:15:34
1	59	326.05929279280866	283.41059588634107	20/04/28 05:15:35
1	59	326.05929279280866	283.41059588634107	20/04/28 05:15:36
1	39	323.3383314215366	280.8639124713207	20/04/28 05:15:37
1	39	323.3383314215366	280.8639124713207	20/04/28 05:15:38
1	39	323.3383314215366	280.8639124713207	20/04/28 05:15:39
1	39	323.3383314215366	280.8639124713207	20/04/28 05:15:40
1	39	323.3383314215366	280.8639124713207	20/04/28 05:15:41
1	39	323.3383314215366	280.8639124713207	20/04/28 05:15:42
1	39	323.3383314215366	280.86391247132065	20/04/28 05:15:43
1	39	323.3383314215366	280.8639124713207	20/04/28 05:15:44
1	39	323.3383314215366	280.8639124713207	20/04/28 05:15:45
1	59	326.05929279280866	283.41059588634107	20/04/28 05:15:46
1	39	323.3383314215366	280.8639124713207	20/04/28 05:15:47
1	59	326.05929279280866	283.41059588634107	20/04/28 05:15:48
1	39	323.0934417610824	276.80430912710955	20/04/28 05:15:49
1	39	323.3383314215366	280.8639124713207	20/04/28 05:15:50
1	39	323.3383314215366	280.86391247132065	20/04/28 05:15:51
1	39	325.1681104108905	280.1535421165315	20/04/28 05:15:52
1	39	323.3383314215366	280.86391247132065	20/04/28 05:15:53
1	39	323.0934417610824	276.80430912710955	20/04/28 05:15:54
1	39	323.0934417610824	276.80430912710955	20/04/28 05:15:55
1	39	323.0934417610824	276.80430912710955	20/04/28 05:15:56
1	39	323.0934417610824	276.80430912710955	20/04/28 05:15:57
1	39	323.0934417610824	276.80430912710955	20/04/28 05:15:58
1	39	323.0934417610824	276.80430912710955	20/04/28 05:15:59
1	39	323.0934417610824	276.80430912710955	20/04/28 05:16:00
1	39	323.0934417610824	276.80430912710955	20/04/28 05:16:01
1	39	323.0934417610824	276.80430912710955	20/04/28 05:16:02
1	39	325.1681104108905	280.1535421165315	20/04/28 05:16:03
1	39	323.0934417610824	276.80430912710955	20/04/28 05:16:04
1	39	323.11960286715964	277.42468672218996	20/04/28 05:16:05
1	39	323.0934417610824	276.80430912710955	20/04/28 05:16:06
1	59	326.0592927928086	283.41059588634107	20/04/28 05:16:07
1	39	325.8736188746059	279.6870750135261	20/04/28 05:16:08
1	39	323.0934417610824	276.80430912710955	20/04/28 05:16:09
1	39	323.0934417610824	276.80430912710955	20/04/28 05:16:10
1	39	323.0934417610824	276.80430912710955	20/04/28 05:16:11
1	39	326.4885362593274	276.9499737578631	20/04/28 05:16:12
1	39	328.56320490913555	280.29920674728515	20/04/28 05:16:13
1	39	328.56320490913555	280.29920674728515	20/04/28 05:16:14
1	39	325.81440313235436	279.3509925421299	20/04/28 05:16:15
1	39	323.0934417610824	276.80430912710955	20/04/28 05:16:16
1	39	323.0934417610824	276.80430912710955	20/04/28 05:16:17
1	39	323.0934417610824	276.80430912710955	20/04/28 05:16:18
1	39	323.0934417610824	276.80430912710955	20/04/28 05:16:19
1	39	323.0934417610824	276.80430912710955	20/04/28 05:16:20
1	39	323.0934417610824	276.80430912710955	20/04/28 05:16:21
1	39	323.0934417610824	276.80430912710955	20/04/28 05:16:22
1	39	323.0934417610824	276.80430912710955	20/04/28 05:16:23
1	39	323.0934417610824	276.80430912710955	20/04/28 05:16:24
1	39	323.0934417610824	276.80430912710955	20/04/28 05:16:25
1	39	323.0934417610824	276.80430912710955	20/04/28 05:16:26
1	39	323.0934417610824	276.80430912710955	20/04/28 05:16:27
1	39	323.0934417610824	276.80430912710955	20/04/28 05:16:28
1	39	323.0934417610824	276.80430912710955	20/04/28 05:16:29
1	39	323.0934417610824	276.80430912710955	20/04/28 05:16:30
1	39	323.0934417610824	276.80430912710955	20/04/28 05:16:31
1	39	323.0934417610824	276.80430912710955	20/04/28 05:16:32
1	39	323.0934417610824	276.80430912710955	20/04/28 05:16:33
1	39	323.0934417610824	276.80430912710955	20/04/28 05:16:34
1	39	323.0934417610824	276.80430912710955	20/04/28 05:16:35
1	39	323.0934417610824	276.80430912710955	20/04/28 05:16:36
1	39	323.0934417610824	276.80430912710955	20/04/28 05:16:37
1	39	323.0934417610824	276.80430912710955	20/04/28 05:16:38
1	39	325.84224353786357	277.75252333226473	20/04/28 05:16:39
1	39	325.1681104108905	280.1535421165315	20/04/28 05:16:40
1	39	323.0934417610824	276.80430912710955	20/04/28 05:16:41
1	39	323.11960286715964	277.42468672218996	20/04/28 05:16:42
1	39	323.0934417610824	276.80430912710955	20/04/28 05:16:43
1	39	325.1681104108905	280.1535421165315	20/04/28 05:16:44
1	39	323.0934417610824	276.80430912710955	20/04/28 05:16:45
1	39	323.0934417610824	276.80430912710955	20/04/28 05:16:46
1	39	323.0934417610824	276.80430912710955	20/04/28 05:16:47
1	39	323.11960286715964	277.42468672218996	20/04/28 05:16:48
