stationId	t_start	t_end	t_max	timeStamp
44	20/04/28 05:08:49	20/04/28 05:10:03	20/04/28 05:08:49
160	20/04/28 05:08:51	20/04/28 05:08:51	20/04/28 05:08:51
141	20/04/28 05:08:53	20/04/28 05:08:53	20/04/28 05:08:53
44	20/04/28 05:08:55	20/04/28 05:08:55	20/04/28 05:08:55
46	20/04/28 05:08:57	20/04/28 05:08:57	20/04/28 05:08:57
76	20/04/28 05:11:33	20/04/28 05:11:33	20/04/28 05:08:59
39	20/04/28 05:09:01	20/04/28 05:09:01	20/04/28 05:09:01
141	20/04/28 05:09:03	20/04/28 05:09:03	20/04/28 05:09:03
141	20/04/28 05:09:05	20/04/28 05:09:05	20/04/28 05:09:05
126	20/04/28 05:09:07	20/04/28 05:09:07	20/04/28 05:09:07
39	20/04/28 05:09:09	20/04/28 05:09:09	20/04/28 05:09:09
141	20/04/28 05:09:11	20/04/28 05:09:11	20/04/28 05:09:11
141	20/04/28 05:09:13	20/04/28 05:09:14	20/04/28 05:09:14
114	20/04/28 05:09:16	20/04/28 05:09:17	20/04/28 05:09:17
76	20/04/28 05:09:19	20/04/28 05:09:19	20/04/28 05:09:19
86	20/04/28 05:09:21	20/04/28 05:09:21	20/04/28 05:09:21
111	20/04/28 05:09:23	20/04/28 05:09:23	20/04/28 05:09:23
86	20/04/28 05:09:25	20/04/28 05:09:25	20/04/28 05:09:25
78	20/04/28 05:09:27	20/04/28 05:09:27	20/04/28 05:09:27
79	20/04/28 05:09:29	20/04/28 05:09:29	20/04/28 05:09:29
78	20/04/28 05:09:31	20/04/28 05:09:31	20/04/28 05:09:31
78	20/04/28 05:09:33	20/04/28 05:09:33	20/04/28 05:09:33
40	20/04/28 05:09:35	20/04/28 05:09:35	20/04/28 05:09:35
78	20/04/28 05:09:37	20/04/28 05:09:37	20/04/28 05:09:37
78	20/04/28 05:09:39	20/04/28 05:09:39	20/04/28 05:09:39
18	20/04/28 05:09:41	20/04/28 05:09:41	20/04/28 05:09:41
111	20/04/28 05:09:43	20/04/28 05:09:43	20/04/28 05:09:43
111	20/04/28 05:09:45	20/04/28 05:09:45	20/04/28 05:09:45
18	20/04/28 05:09:47	20/04/28 05:09:47	20/04/28 05:09:47
30	20/04/28 05:09:49	20/04/28 05:09:49	20/04/28 05:09:49
71	20/04/28 05:09:51	20/04/28 05:09:51	20/04/28 05:09:51
18	20/04/28 05:09:53	20/04/28 05:09:53	20/04/28 05:09:53
111	20/04/28 05:09:55	20/04/28 05:09:55	20/04/28 05:09:55
79	20/04/28 05:09:57	20/04/28 05:09:57	20/04/28 05:09:57
30	20/04/28 05:09:59	20/04/28 05:10:00	20/04/28 05:10:00
111	20/04/28 05:10:02	20/04/28 05:10:02	20/04/28 05:10:02
79	20/04/28 05:10:04	20/04/28 05:10:04	20/04/28 05:10:04
78	20/04/28 05:10:06	20/04/28 05:10:06	20/04/28 05:10:06
111	20/04/28 05:10:08	20/04/28 05:10:09	20/04/28 05:10:08
18	20/04/28 05:10:11	20/04/28 05:10:12	20/04/28 05:10:11
40	20/04/28 05:10:14	20/04/28 05:10:14	20/04/28 05:10:14
111	20/04/28 05:10:16	20/04/28 05:10:16	20/04/28 05:10:16
141	20/04/28 05:10:18	20/04/28 05:10:18	20/04/28 05:10:18
111	20/04/28 05:10:20	20/04/28 05:10:20	20/04/28 05:10:20
79	20/04/28 05:10:22	20/04/28 05:10:22	20/04/28 05:10:22
78	20/04/28 05:10:24	20/04/28 05:10:24	20/04/28 05:10:24
111	20/04/28 05:10:26	20/04/28 05:10:28	20/04/28 05:10:28
141	20/04/28 05:10:30	20/04/28 05:10:31	20/04/28 05:10:31
111	20/04/28 05:10:33	20/04/28 05:10:34	20/04/28 05:10:33
129	20/04/28 05:10:36	20/04/28 05:10:36	20/04/28 05:10:36
77	20/04/28 05:10:38	20/04/28 05:10:38	20/04/28 05:10:38
144	20/04/28 05:10:40	20/04/28 05:10:40	20/04/28 05:10:40
44	20/04/28 05:10:42	20/04/28 05:10:42	20/04/28 05:10:42
43	20/04/28 05:10:44	20/04/28 05:10:44	20/04/28 05:10:44
75	20/04/28 05:10:46	20/04/28 05:10:46	20/04/28 05:10:46
160	20/04/28 05:10:48	20/04/28 05:10:48	20/04/28 05:10:48
126	20/04/28 05:10:50	20/04/28 05:10:50	20/04/28 05:10:50
75	20/04/28 05:10:52	20/04/28 05:10:52	20/04/28 05:10:52
71	20/04/28 05:10:54	20/04/28 05:10:54	20/04/28 05:10:54
162	20/04/28 05:10:56	20/04/28 05:10:56	20/04/28 05:10:56
71	20/04/28 05:10:58	20/04/28 05:10:58	20/04/28 05:10:58
39	20/04/28 05:11:00	20/04/28 05:11:00	20/04/28 05:11:00
76	20/04/28 05:11:02	20/04/28 05:11:02	20/04/28 05:11:02
75	20/04/28 05:11:04	20/04/28 05:11:04	20/04/28 05:11:04
75	20/04/28 05:11:06	20/04/28 05:11:06	20/04/28 05:11:06
75	20/04/28 05:11:08	20/04/28 05:11:08	20/04/28 05:11:08
75	20/04/28 05:11:10	20/04/28 05:15:52	20/04/28 05:11:10
71	20/04/28 05:11:12	20/04/28 05:11:12	20/04/28 05:11:12
71	20/04/28 05:11:14	20/04/28 05:11:14	20/04/28 05:11:14
160	20/04/28 05:11:16	20/04/28 05:11:16	20/04/28 05:11:16
71	20/04/28 05:11:18	20/04/28 05:11:18	20/04/28 05:11:18
126	20/04/28 05:11:20	20/04/28 05:11:20	20/04/28 05:11:20
159	20/04/28 05:11:22	20/04/28 05:11:22	20/04/28 05:11:22
71	20/04/28 05:11:24	20/04/28 05:11:24	20/04/28 05:11:24
