stationId	t_start	t_end	t_max	timeStamp
155	20/04/28 05:15:38	20/04/28 05:15:38	20/04/28 05:15:38
56	20/04/28 05:15:40	20/04/28 05:15:40	20/04/28 05:15:40
71	20/04/28 05:15:42	20/04/28 05:15:42	20/04/28 05:15:42
108	20/04/28 05:15:44	20/04/28 05:15:44	20/04/28 05:15:44
155	20/04/28 05:15:46	20/04/28 05:15:46	20/04/28 05:15:46
157	20/04/28 05:15:48	20/04/28 05:15:48	20/04/28 05:15:48
28	20/04/28 05:15:50	20/04/28 05:15:50	20/04/28 05:15:50
39	20/04/28 05:15:52	20/04/28 05:15:52	20/04/28 05:15:52
126	20/04/28 05:15:54	20/04/28 05:15:54	20/04/28 05:15:54
32	20/04/28 05:15:56	20/04/28 05:15:56	20/04/28 05:15:56
26	20/04/28 05:15:58	20/04/28 05:17:41	20/04/28 05:17:41
150	20/04/28 05:16:00	20/04/28 05:16:00	20/04/28 05:16:00
10	20/04/28 05:16:02	20/04/28 05:16:02	20/04/28 05:16:02
62	20/04/28 05:16:04	20/04/28 05:16:05	20/04/28 05:16:04
24	20/04/28 05:16:07	20/04/28 05:16:07	20/04/28 05:16:07
65	20/04/28 05:16:09	20/04/28 05:16:10	20/04/28 05:16:10
97	20/04/28 05:16:12	20/04/28 05:16:12	20/04/28 05:16:12
66	20/04/28 05:16:14	20/04/28 05:16:14	20/04/28 05:16:14
91	20/04/28 05:16:16	20/04/28 05:16:16	20/04/28 05:16:16
117	20/04/28 05:16:18	20/04/28 05:16:18	20/04/28 05:16:18
68	20/04/28 05:16:20	20/04/28 05:16:20	20/04/28 05:16:20
32	20/04/28 05:16:22	20/04/28 05:16:22	20/04/28 05:16:22
19	20/04/28 05:16:24	20/04/28 05:16:24	20/04/28 05:16:24
96	20/04/28 05:16:26	20/04/28 05:16:26	20/04/28 05:16:26
19	20/04/28 05:16:28	20/04/28 05:16:28	20/04/28 05:16:28
143	20/04/28 05:16:30	20/04/28 05:16:30	20/04/28 05:16:30
78	20/04/28 05:16:32	20/04/28 05:16:32	20/04/28 05:16:32
78	20/04/28 05:16:34	20/04/28 05:16:34	20/04/28 05:16:34
83	20/04/28 05:16:36	20/04/28 05:16:36	20/04/28 05:16:36
90	20/04/28 05:16:38	20/04/28 05:16:38	20/04/28 05:16:38
108	20/04/28 05:16:40	20/04/28 05:16:40	20/04/28 05:16:40
89	20/04/28 05:16:42	20/04/28 05:16:42	20/04/28 05:16:42
88	20/04/28 05:16:44	20/04/28 05:16:45	20/04/28 05:16:45
106	20/04/28 05:16:47	20/04/28 05:16:47	20/04/28 05:16:47
12	20/04/28 05:16:49	20/04/28 05:16:49	20/04/28 05:16:49
54	20/04/28 05:16:51	20/04/28 05:16:51	20/04/28 05:16:51
158	20/04/28 05:16:53	20/04/28 05:16:53	20/04/28 05:16:53
158	20/04/28 05:16:55	20/04/28 05:16:55	20/04/28 05:16:55
133	20/04/28 05:16:57	20/04/28 05:16:57	20/04/28 05:16:57
57	20/04/28 05:16:59	20/04/28 05:16:59	20/04/28 05:16:59
158	20/04/28 05:17:01	20/04/28 05:17:01	20/04/28 05:17:01
130	20/04/28 05:17:03	20/04/28 05:17:03	20/04/28 05:17:03
158	20/04/28 05:17:05	20/04/28 05:17:05	20/04/28 05:17:05
158	20/04/28 05:10:04	20/04/28 05:17:07	20/04/28 05:10:04
133	20/04/28 05:17:09	20/04/28 05:17:09	20/04/28 05:17:09
157	20/04/28 05:17:11	20/04/28 05:17:11	20/04/28 05:17:11
28	20/04/28 05:17:13	20/04/28 05:17:13	20/04/28 05:17:13
133	20/04/28 05:17:15	20/04/28 05:17:15	20/04/28 05:17:15
133	20/04/28 05:17:17	20/04/28 05:17:17	20/04/28 05:17:17
89	20/04/28 05:17:19	20/04/28 05:17:19	20/04/28 05:17:19
14	20/04/28 05:17:21	20/04/28 05:17:21	20/04/28 05:17:21
79	20/04/28 05:17:23	20/04/28 05:17:23	20/04/28 05:17:23
88	20/04/28 05:17:26	20/04/28 05:17:26	20/04/28 05:17:26
89	20/04/28 05:17:28	20/04/28 05:17:28	20/04/28 05:17:28
109	20/04/28 05:17:30	20/04/28 05:17:30	20/04/28 05:17:30
71	20/04/28 05:17:32	20/04/28 05:17:32	20/04/28 05:17:32
152	20/04/28 05:17:34	20/04/28 05:17:34	20/04/28 05:17:34
136	20/04/28 05:17:36	20/04/28 05:17:36	20/04/28 05:17:36
74	20/04/28 05:17:38	20/04/28 05:17:39	20/04/28 05:17:39
105	20/04/28 05:17:41	20/04/28 05:17:41	20/04/28 05:17:41
109	20/04/28 05:17:43	20/04/28 05:17:43	20/04/28 05:17:43
109	20/04/28 05:17:45	20/04/28 05:17:45	20/04/28 05:17:45
136	20/04/28 05:17:47	20/04/28 05:17:47	20/04/28 05:17:47
143	20/04/28 05:17:49	20/04/28 05:17:50	20/04/28 05:17:50
147	20/04/28 05:17:52	20/04/28 05:17:52	20/04/28 05:17:52
109	20/04/28 05:17:54	20/04/28 05:17:54	20/04/28 05:17:54
14	20/04/28 05:17:56	20/04/28 05:17:56	20/04/28 05:17:56
109	20/04/28 05:17:58	20/04/28 05:17:58	20/04/28 05:17:58
74	20/04/28 05:18:00	20/04/28 05:18:00	20/04/28 05:18:00
74	20/04/28 05:18:02	20/04/28 05:18:03	20/04/28 05:18:03
26	20/04/28 05:18:05	20/04/28 05:18:05	20/04/28 05:18:05
118	20/04/28 05:18:07	20/04/28 05:18:07	20/04/28 05:18:07
78	20/04/28 05:18:09	20/04/28 05:18:09	20/04/28 05:18:09
158	20/04/28 05:18:11	20/04/28 05:18:11	20/04/28 05:18:11
39	20/04/28 05:18:13	20/04/28 05:18:13	20/04/28 05:18:13
20	20/04/28 05:18:15	20/04/28 05:18:15	20/04/28 05:18:15
147	20/04/28 05:18:17	20/04/28 05:18:17	20/04/28 05:18:17
87	20/04/28 05:18:19	20/04/28 05:18:19	20/04/28 05:18:19
113	20/04/28 05:18:21	20/04/28 05:18:22	20/04/28 05:18:22
147	20/04/28 05:18:24	20/04/28 05:18:24	20/04/28 05:18:24
94	20/04/28 05:18:26	20/04/28 05:18:26	20/04/28 05:18:26
142	20/04/28 05:18:28	20/04/28 05:18:29	20/04/28 05:18:28
87	20/04/28 05:18:31	20/04/28 05:18:31	20/04/28 05:18:31
23	20/04/28 05:18:33	20/04/28 05:18:33	20/04/28 05:18:33
74	20/04/28 05:18:35	20/04/28 05:18:35	20/04/28 05:18:35
74	20/04/28 05:18:37	20/04/28 05:18:37	20/04/28 05:18:37
58	20/04/28 05:18:39	20/04/28 05:18:39	20/04/28 05:18:39
32	20/04/28 05:18:41	20/04/28 05:18:41	20/04/28 05:18:41
74	20/04/28 05:18:43	20/04/28 05:18:43	20/04/28 05:18:43
23	20/04/28 05:18:45	20/04/28 05:18:45	20/04/28 05:18:45
131	20/04/28 05:18:47	20/04/28 05:18:47	20/04/28 05:18:47
