floorId	partitionId	location_x	location_y	timeStamp
21	931	346.85767897953684	265.80619349150453	21/02/24 15:45:02
21	931	344.8231017783549	269.52293544791775	21/02/24 15:45:03
21	931	346.85767897953696	265.8061934915046	21/02/24 15:45:04
21	931	346.85767897953696	265.8061934915046	21/02/24 15:45:05
21	931	346.85767897953696	265.8061934915046	21/02/24 15:45:06
21	931	346.85767897953696	265.8061934915046	21/02/24 15:45:07
21	931	346.85767897953696	265.8061934915046	21/02/24 15:45:08
21	931	347.47131480237994	267.06283511097325	21/02/24 15:45:09
21	931	346.85767897953696	265.8061934915046	21/02/24 15:45:10
21	931	346.85767897953696	265.8061934915046	21/02/24 15:45:11
21	931	344.8231017783549	269.52293544791775	21/02/24 15:45:12
21	931	346.85767897953696	265.8061934915046	21/02/24 15:45:13
21	931	344.8231017783549	269.52293544791775	21/02/24 15:45:14
21	931	346.85767897953684	265.80619349150453	21/02/24 15:45:15
21	931	346.85767897953684	265.80619349150453	21/02/24 15:45:16
21	931	346.85767897953684	265.80619349150453	21/02/24 15:45:17
21	931	347.47131480237994	267.06283511097325	21/02/24 15:45:18
21	931	346.85767897953696	265.8061934915046	21/02/24 15:45:19
21	931	346.85767897953696	265.8061934915046	21/02/24 15:45:20
21	931	344.8231017783549	269.52293544791775	21/02/24 15:45:21
21	931	346.85767897953696	265.8061934915046	21/02/24 15:45:22
21	931	346.85767897953684	265.80619349150453	21/02/24 15:45:23
21	931	344.8231017783549	269.52293544791775	21/02/24 15:45:24
21	931	346.85767897953696	265.8061934915046	21/02/24 15:45:25
21	931	346.85767897953696	265.8061934915046	21/02/24 15:45:26
21	962	339.0352058930359	273.3587161799046	21/02/24 15:45:27
21	931	344.8231017783549	269.52293544791775	21/02/24 15:45:28
21	931	344.8231017783549	269.52293544791775	21/02/24 15:45:29
21	931	346.85767897953696	265.8061934915046	21/02/24 15:45:30
21	931	345.5384267613278	270.2972274750496	21/02/24 15:45:31
21	931	346.85767897953696	265.8061934915046	21/02/24 15:45:32
21	931	346.85767897953696	265.8061934915046	21/02/24 15:45:33
21	962	340.35445811124504	268.86768219635957	21/02/24 15:45:34
21	962	341.06978309421794	269.64197422349145	21/02/24 15:45:35
21	962	340.35445811124504	268.86768219635957	21/02/24 15:45:36
21	931	346.85767897953696	265.8061934915046	21/02/24 15:45:37
21	962	340.35445811124504	268.86768219635957	21/02/24 15:45:38
21	931	346.85767897953696	265.8061934915046	21/02/24 15:45:39
21	931	344.8231017783549	269.52293544791775	21/02/24 15:45:40
21	962	340.35445811124504	268.86768219635957	21/02/24 15:45:41
21	962	340.35445811124504	268.86768219635957	21/02/24 15:45:42
21	931	346.85767897953696	265.8061934915046	21/02/24 15:45:43
21	931	346.85767897953696	265.8061934915046	21/02/24 15:45:44
21	931	346.85767897953696	265.8061934915046	21/02/24 15:45:45
21	962	340.35445811124504	268.8676821963595	21/02/24 15:45:46
21	962	341.69401263713104	270.2100120308361	21/02/24 15:45:47
21	931	346.85767897953684	265.80619349150453	21/02/24 15:45:48
21	962	335.9061167518121	274.04579276282294	21/02/24 15:45:49
21	962	341.06978309421794	269.64197422349145	21/02/24 15:45:50
21	962	339.0352058930359	273.3587161799046	21/02/24 15:45:51
21	931	344.82310177835484	269.5229354479177	21/02/24 15:45:52
21	962	335.9061167518121	274.04579276282294	21/02/24 15:45:53
21	962	340.35445811124504	268.8676821963595	21/02/24 15:45:54
21	962	341.69401263713104	270.210012030836	21/02/24 15:45:55
21	962	340.35445811124504	268.8676821963595	21/02/24 15:45:56
21	962	339.0352058930359	273.3587161799046	21/02/24 15:45:58
21	962	339.0352058930359	273.3587161799046	21/02/24 15:45:59
21	962	340.35445811124504	268.8676821963595	21/02/24 15:46:00
21	962	341.06978309421794	269.64197422349145	21/02/24 15:46:01
21	931	346.85767897953696	265.8061934915046	21/02/24 15:46:02
21	962	340.35445811124504	268.8676821963595	21/02/24 15:46:03
21	962	340.35445811124504	268.8676821963595	21/02/24 15:46:04
21	962	340.35445811124504	268.8676821963595	21/02/24 15:46:05
21	962	335.9061167518121	274.04579276282294	21/02/24 15:46:06
21	962	335.9061167518121	274.04579276282294	21/02/24 15:46:07
21	962	340.35445811124504	268.8676821963595	21/02/24 15:46:08
21	962	335.9061167518121	274.04579276282294	21/02/24 15:46:09
21	962	341.06978309421794	269.64197422349145	21/02/24 15:46:10
21	962	335.9061167518121	274.04579276282294	21/02/24 15:46:11
21	962	340.35445811124504	268.8676821963595	21/02/24 15:46:12
21	962	335.9061167518121	274.04579276282294	21/02/24 15:46:13
21	962	335.9061167518121	274.04579276282294	21/02/24 15:46:14
21	962	335.9061167518121	274.04579276282294	21/02/24 15:46:15
21	962	335.9061167518121	274.04579276282294	21/02/24 15:46:16
21	962	339.0352058930359	273.3587161799046	21/02/24 15:46:17
21	962	340.35445811124504	268.8676821963595	21/02/24 15:46:18
21	962	335.9061167518121	274.04579276282294	21/02/24 15:46:19
21	962	340.35445811124504	268.8676821963595	21/02/24 15:46:20
21	962	340.35445811124504	268.8676821963595	21/02/24 15:46:21
21	962	335.9061167518121	274.04579276282294	21/02/24 15:46:22
21	962	340.35445811124504	268.8676821963595	21/02/24 15:46:23
21	962	335.9061167518121	274.04579276282294	21/02/24 15:46:24
21	962	335.9061167518121	274.04579276282294	21/02/24 15:46:25
21	962	335.9061167518121	274.04579276282294	21/02/24 15:46:26
21	962	335.9061167518121	274.04579276282294	21/02/24 15:46:27
21	962	335.9061167518121	274.04579276282294	21/02/24 15:46:28
21	962	335.9061167518121	274.04579276282294	21/02/24 15:46:29
21	962	341.06978309421794	269.64197422349145	21/02/24 15:46:30
21	962	335.9061167518121	274.04579276282294	21/02/24 15:46:31
21	962	340.35445811124504	268.8676821963595	21/02/24 15:46:32
21	962	335.9061167518121	274.04579276282294	21/02/24 15:46:33
21	962	340.35445811124504	268.86768219635957	21/02/24 15:46:34
