stationId	t_start	t_end	t_max	timeStamp
96	20/04/28 05:17:35	20/04/28 05:17:35	20/04/28 05:17:35
82	20/04/28 05:17:37	20/04/28 05:17:38	20/04/28 05:17:38
94	20/04/28 05:17:40	20/04/28 05:17:41	20/04/28 05:17:40
96	20/04/28 05:17:43	20/04/28 05:17:43	20/04/28 05:17:43
108	20/04/28 05:17:45	20/04/28 05:17:45	20/04/28 05:17:45
108	20/04/28 05:17:47	20/04/28 05:17:47	20/04/28 05:17:47
108	20/04/28 05:17:49	20/04/28 05:17:49	20/04/28 05:17:49
94	20/04/28 05:17:51	20/04/28 05:17:51	20/04/28 05:17:51
49	20/04/28 05:17:53	20/04/28 05:17:54	20/04/28 05:17:54
49	20/04/28 05:17:56	20/04/28 05:17:56	20/04/28 05:17:56
94	20/04/28 05:17:58	20/04/28 05:17:58	20/04/28 05:17:58
109	20/04/28 05:18:00	20/04/28 05:18:00	20/04/28 05:18:00
94	20/04/28 05:18:02	20/04/28 05:18:02	20/04/28 05:18:02
13	20/04/28 05:18:04	20/04/28 05:18:04	20/04/28 05:18:04
109	20/04/28 05:18:06	20/04/28 05:18:06	20/04/28 05:18:06
13	20/04/28 05:18:08	20/04/28 05:18:08	20/04/28 05:18:08
39	20/04/28 05:18:10	20/04/28 05:18:10	20/04/28 05:18:10
109	20/04/28 05:18:12	20/04/28 05:18:13	20/04/28 05:18:12
92	20/04/28 05:18:15	20/04/28 05:18:15	20/04/28 05:18:15
109	20/04/28 05:18:17	20/04/28 05:18:20	20/04/28 05:18:20
94	20/04/28 05:18:22	20/04/28 05:14:36	20/04/28 05:18:23
96	20/04/28 05:18:25	20/04/28 05:18:25	20/04/28 05:18:25
96	20/04/28 05:18:27	20/04/28 05:18:27	20/04/28 05:18:27
94	20/04/28 05:18:29	20/04/28 05:18:29	20/04/28 05:18:29
85	20/04/28 05:18:31	20/04/28 05:18:31	20/04/28 05:18:31
94	20/04/28 05:18:33	20/04/28 05:18:33	20/04/28 05:18:33
94	20/04/28 05:18:35	20/04/28 05:18:35	20/04/28 05:18:35
109	20/04/28 05:18:37	20/04/28 05:18:37	20/04/28 05:18:37
109	20/04/28 05:18:39	20/04/28 05:18:40	20/04/28 05:18:40
96	20/04/28 05:18:42	20/04/28 05:18:43	20/04/28 05:18:42
149	20/04/28 05:18:45	20/04/28 05:18:46	20/04/28 05:18:45
