stationId	t_start	t_end	t_max	timeStamp
95	20/04/28 05:12:17	20/04/28 05:12:17	20/04/28 05:12:17
92	20/04/28 05:12:19	20/04/28 05:12:19	20/04/28 05:12:19
74	20/04/28 05:12:21	20/04/28 05:12:21	20/04/28 05:12:21
73	20/04/28 05:12:23	20/04/28 05:12:23	20/04/28 05:12:23
87	20/04/28 05:12:25	20/04/28 05:12:28	20/04/28 05:12:25
39	20/04/28 05:12:30	20/04/28 05:12:30	20/04/28 05:12:30
24	20/04/28 05:12:32	20/04/28 05:12:32	20/04/28 05:12:32
120	20/04/28 05:12:34	20/04/28 05:12:34	20/04/28 05:12:34
73	20/04/28 05:12:36	20/04/28 05:12:37	20/04/28 05:12:37
87	20/04/28 05:12:39	20/04/28 05:12:39	20/04/28 05:12:39
16	20/04/28 05:12:41	20/04/28 05:12:41	20/04/28 05:12:41
92	20/04/28 05:12:43	20/04/28 05:12:44	20/04/28 05:12:43
87	20/04/28 05:11:09	20/04/28 05:12:46	20/04/28 05:12:46
87	20/04/28 05:12:48	20/04/28 05:12:48	20/04/28 05:12:48
92	20/04/28 05:12:50	20/04/28 05:12:50	20/04/28 05:12:50
92	20/04/28 05:12:52	20/04/28 05:12:52	20/04/28 05:12:52
73	20/04/28 05:12:54	20/04/28 05:12:54	20/04/28 05:12:54
39	20/04/28 05:12:56	20/04/28 05:12:56	20/04/28 05:12:56
99	20/04/28 05:12:58	20/04/28 05:12:58	20/04/28 05:12:58
16	20/04/28 05:13:00	20/04/28 05:13:01	20/04/28 05:13:01
116	20/04/28 05:13:03	20/04/28 05:13:03	20/04/28 05:13:03
17	20/04/28 05:13:05	20/04/28 05:13:05	20/04/28 05:13:05
117	20/04/28 05:13:07	20/04/28 05:13:07	20/04/28 05:13:07
92	20/04/28 05:13:09	20/04/28 05:13:09	20/04/28 05:13:09
74	20/04/28 05:13:11	20/04/28 05:13:11	20/04/28 05:13:11
147	20/04/28 05:13:13	20/04/28 05:13:13	20/04/28 05:13:13
75	20/04/28 05:13:15	20/04/28 05:13:15	20/04/28 05:13:15
134	20/04/28 05:13:17	20/04/28 05:13:17	20/04/28 05:13:17
135	20/04/28 05:13:19	20/04/28 05:13:19	20/04/28 05:13:19
79	20/04/28 05:13:21	20/04/28 05:13:21	20/04/28 05:13:21
54	20/04/28 05:13:23	20/04/28 05:13:23	20/04/28 05:13:23
22	20/04/28 05:13:25	20/04/28 05:13:25	20/04/28 05:13:25
111	20/04/28 05:13:27	20/04/28 05:13:27	20/04/28 05:13:27
61	20/04/28 05:13:29	20/04/28 05:13:29	20/04/28 05:13:29
111	20/04/28 05:13:31	20/04/28 05:13:31	20/04/28 05:13:31
56	20/04/28 05:10:59	20/04/28 05:10:59	20/04/28 05:13:33
70	20/04/28 05:13:35	20/04/28 05:13:35	20/04/28 05:13:35
63	20/04/28 05:13:37	20/04/28 05:13:37	20/04/28 05:13:37
1	20/04/28 05:13:39	20/04/28 05:13:39	20/04/28 05:13:39
90	20/04/28 05:13:41	20/04/28 05:13:41	20/04/28 05:13:41
106	20/04/28 05:13:43	20/04/28 05:13:43	20/04/28 05:13:43
28	20/04/28 05:13:45	20/04/28 05:13:45	20/04/28 05:13:45
24	20/04/28 05:13:47	20/04/28 05:13:47	20/04/28 05:13:47
96	20/04/28 05:13:49	20/04/28 05:13:49	20/04/28 05:13:49
64	20/04/28 05:13:51	20/04/28 05:13:51	20/04/28 05:13:51
74	20/04/28 05:13:53	20/04/28 05:13:53	20/04/28 05:13:53
151	20/04/28 05:13:55	20/04/28 05:13:55	20/04/28 05:13:55
10	20/04/28 05:13:58	20/04/28 05:13:58	20/04/28 05:13:58
41	20/04/28 05:14:00	20/04/28 05:14:00	20/04/28 05:14:00
26	20/04/28 05:14:02	20/04/28 05:14:02	20/04/28 05:14:02
19	20/04/28 05:14:04	20/04/28 05:14:05	20/04/28 05:14:05
65	20/04/28 05:14:07	20/04/28 05:14:07	20/04/28 05:14:07
67	20/04/28 05:14:09	20/04/28 05:14:09	20/04/28 05:14:09
91	20/04/28 05:14:11	20/04/28 05:14:11	20/04/28 05:14:11
118	20/04/28 05:14:13	20/04/28 05:14:13	20/04/28 05:14:13
91	20/04/28 05:14:15	20/04/28 05:14:15	20/04/28 05:14:15
65	20/04/28 05:14:17	20/04/28 05:14:17	20/04/28 05:14:17
80	20/04/28 05:14:19	20/04/28 05:14:19	20/04/28 05:14:19
101	20/04/28 05:14:21	20/04/28 05:14:21	20/04/28 05:14:21
16	20/04/28 05:14:23	20/04/28 05:14:25	20/04/28 05:14:25
16	20/04/28 05:14:27	20/04/28 05:14:29	20/04/28 05:14:27
16	20/04/28 05:14:31	20/04/28 05:14:31	20/04/28 05:14:31
99	20/04/28 05:14:33	20/04/28 05:14:33	20/04/28 05:14:33
99	20/04/28 05:14:35	20/04/28 05:14:35	20/04/28 05:14:35
97	20/04/28 05:14:37	20/04/28 05:14:37	20/04/28 05:14:37
97	20/04/28 05:14:39	20/04/28 05:14:39	20/04/28 05:14:39
97	20/04/28 05:14:41	20/04/28 05:14:41	20/04/28 05:14:41
100	20/04/28 05:14:43	20/04/28 05:14:43	20/04/28 05:14:43
101	20/04/28 05:14:45	20/04/28 05:14:49	20/04/28 05:14:49
73	20/04/28 05:14:51	20/04/28 05:14:51	20/04/28 05:14:51
100	20/04/28 05:14:53	20/04/28 05:14:54	20/04/28 05:14:54
105	20/04/28 05:14:56	20/04/28 05:14:57	20/04/28 05:14:57
131	20/04/28 05:14:59	20/04/28 05:14:59	20/04/28 05:14:59
17	20/04/28 05:15:01	20/04/28 05:15:01	20/04/28 05:15:01
131	20/04/28 05:15:03	20/04/28 05:15:03	20/04/28 05:15:03
73	20/04/28 05:15:05	20/04/28 05:15:06	20/04/28 05:15:06
72	20/04/28 05:15:08	20/04/28 05:15:08	20/04/28 05:15:08
68	20/04/28 05:15:10	20/04/28 05:15:10	20/04/28 05:15:10
105	20/04/28 05:15:12	20/04/28 05:15:13	20/04/28 05:15:13
105	20/04/28 05:15:15	20/04/28 05:15:15	20/04/28 05:15:15
105	20/04/28 05:15:17	20/04/28 05:15:17	20/04/28 05:15:17
105	20/04/28 05:15:19	20/04/28 05:15:19	20/04/28 05:15:19
32	20/04/28 05:15:21	20/04/28 05:15:21	20/04/28 05:15:21
131	20/04/28 05:15:23	20/04/28 05:15:23	20/04/28 05:15:23
131	20/04/28 05:15:25	20/04/28 05:15:25	20/04/28 05:15:25
32	20/04/28 05:15:27	20/04/28 05:15:28	20/04/28 05:15:27
32	20/04/28 05:15:30	20/04/28 05:15:30	20/04/28 05:15:30
32	20/04/28 05:15:32	20/04/28 05:15:33	20/04/28 05:15:33
131	20/04/28 05:15:35	20/04/28 05:15:35	20/04/28 05:15:35
131	20/04/28 05:15:39	20/04/28 05:14:39	20/04/28 05:15:37
131	20/04/28 05:15:39	20/04/28 05:15:43	20/04/28 05:15:40
131	20/04/28 05:15:45	20/04/28 05:15:46	20/04/28 05:15:46
131	20/04/28 05:15:48	20/04/28 05:15:49	20/04/28 05:15:49
100	20/04/28 05:15:51	20/04/28 05:15:51	20/04/28 05:15:51
41	20/04/28 05:15:53	20/04/28 05:15:53	20/04/28 05:15:53
67	20/04/28 05:15:55	20/04/28 05:15:55	20/04/28 05:15:55
97	20/04/28 05:15:57	20/04/28 05:15:57	20/04/28 05:15:57
11	20/04/28 05:15:59	20/04/28 05:15:59	20/04/28 05:15:59
11	20/04/28 05:16:01	20/04/28 05:16:01	20/04/28 05:16:01
87	20/04/28 05:16:03	20/04/28 05:16:03	20/04/28 05:16:03
10	20/04/28 05:16:12	20/04/28 05:16:05	20/04/28 05:16:05
26	20/04/28 05:17:32	20/04/28 05:16:07	20/04/28 05:17:32
117	20/04/28 05:16:09	20/04/28 05:16:09	20/04/28 05:16:09
117	20/04/28 05:16:11	20/04/28 05:16:11	20/04/28 05:16:11
58	20/04/28 05:16:13	20/04/28 05:16:14	20/04/28 05:16:14
26	20/04/28 05:16:16	20/04/28 05:16:16	20/04/28 05:16:16
16	20/04/28 05:16:18	20/04/28 05:16:18	20/04/28 05:16:18
16	20/04/28 05:16:20	20/04/28 05:16:20	20/04/28 05:16:20
73	20/04/28 05:16:22	20/04/28 05:16:22	20/04/28 05:16:22
