deviceId	device_location_x	device_location_y	rssi_measurement	timeStamp
27	361.7760445803703	289.2690199455797	-72	21/02/24 15:47:01
37	359.5903712498935	284.92420131943135	-67	21/02/24 15:47:01
40	360.29771601412074	275.17301637315114	-66	21/02/24 15:47:01
47	353.57917457908314	286.3943403818769	-63	21/02/24 15:47:01
22	353.27733584284437	275.76541045955213	-62	21/02/24 15:47:01
45	342.3105096677226	291.9842245930836	-64	21/02/24 15:47:01
46	340.76419739931424	294.4321023101609	-68	21/02/24 15:47:01
8	337.0569612312978	272.24137590202855	-63	21/02/24 15:47:01
24	330.2572237413254	276.8419321591195	-67	21/02/24 15:47:01
25	329.08778489613	275.87564892517275	-68	21/02/24 15:47:01
16	327.98603409324727	290.8054485105832	-68	21/02/24 15:47:01
11	327.4246457091771	282.6323525733639	-67	21/02/24 15:47:01
7	334.07657006354464	270.8835908324035	-65	21/02/24 15:47:01
32	356.7839379367616	268.70688981904533	-69	21/02/24 15:47:01
31	346.4179037622539	268.10202267794875	-62	21/02/24 15:47:01
13	342.0775229118143	267.91244197819304	-64	21/02/24 15:47:01
21	334.5994402908936	265.9434918767382	-70	21/02/24 15:47:01
14	341.6082252010515	265.6547772450898	-65	21/02/24 15:47:01
20	334.99735462161357	264.77807460530994	-68	21/02/24 15:47:01

37	359.5903712498935	284.92420131943135	-68	21/02/24 15:47:02
40	360.29771601412074	275.17301637315114	-69	21/02/24 15:47:02
47	353.57917457908314	286.3943403818769	-63	21/02/24 15:47:02
22	353.27733584284437	275.76541045955213	-60	21/02/24 15:47:02
45	342.3105096677226	291.9842245930836	-64	21/02/24 15:47:02
46	340.76419739931424	294.4321023101609	-67	21/02/24 15:47:02
8	337.0569612312978	272.24137590202855	-62	21/02/24 15:47:02
24	330.2572237413254	276.8419321591195	-67	21/02/24 15:47:02
25	329.08778489613	275.87564892517275	-68	21/02/24 15:47:02
16	327.98603409324727	290.8054485105832	-72	21/02/24 15:47:02
11	327.4246457091771	282.6323525733639	-66	21/02/24 15:47:02
7	334.07657006354464	270.8835908324035	-65	21/02/24 15:47:02
33	361.5531569646988	270.2693072733871	-70	21/02/24 15:47:02
32	356.7839379367616	268.70688981904533	-68	21/02/24 15:47:02
30	327.70079256672074	268.3508487639297	-70	21/02/24 15:47:02
31	346.4179037622539	268.10202267794875	-63	21/02/24 15:47:02
13	342.0775229118143	267.91244197819304	-63	21/02/24 15:47:02
21	334.5994402908936	265.9434918767382	-68	21/02/24 15:47:02
14	341.6082252010515	265.6547772450898	-64	21/02/24 15:47:02
20	334.99735462161357	264.77807460530994	-67	21/02/24 15:47:02

27	361.7760445803703	289.2690199455797	-72	21/02/24 15:47:03
37	359.5903712498935	284.92420131943135	-69	21/02/24 15:47:03
40	360.29771601412074	275.17301637315114	-69	21/02/24 15:47:03
47	353.57917457908314	286.3943403818769	-63	21/02/24 15:47:03
22	353.27733584284437	275.76541045955213	-64	21/02/24 15:47:03
45	342.3105096677226	291.9842245930836	-62	21/02/24 15:47:03
46	340.76419739931424	294.4321023101609	-64	21/02/24 15:47:03
8	337.0569612312978	272.24137590202855	-64	21/02/24 15:47:03
24	330.2572237413254	276.8419321591195	-67	21/02/24 15:47:03
25	329.08778489613	275.87564892517275	-69	21/02/24 15:47:03
16	327.98603409324727	290.8054485105832	-70	21/02/24 15:47:03
11	327.4246457091771	282.6323525733639	-68	21/02/24 15:47:03
7	334.07657006354464	270.8835908324035	-68	21/02/24 15:47:03
32	356.7839379367616	268.70688981904533	-68	21/02/24 15:47:03
31	346.4179037622539	268.10202267794875	-65	21/02/24 15:47:03
13	342.0775229118143	267.91244197819304	-65	21/02/24 15:47:03
21	334.5994402908936	265.9434918767382	-70	21/02/24 15:47:03
14	341.6082252010515	265.6547772450898	-69	21/02/24 15:47:03
20	334.99735462161357	264.77807460530994	-68	21/02/24 15:47:03

27	361.7760445803703	289.2690199455797	-68	21/02/24 15:47:04
37	359.5903712498935	284.92420131943135	-67	21/02/24 15:47:04
40	360.29771601412074	275.17301637315114	-68	21/02/24 15:47:04
47	353.57917457908314	286.3943403818769	-62	21/02/24 15:47:04
22	353.27733584284437	275.76541045955213	-63	21/02/24 15:47:04
45	342.3105096677226	291.9842245930836	-58	21/02/24 15:47:04
46	340.76419739931424	294.4321023101609	-61	21/02/24 15:47:04
8	337.0569612312978	272.24137590202855	-65	21/02/24 15:47:04
24	330.2572237413254	276.8419321591195	-68	21/02/24 15:47:04
25	329.08778489613	275.87564892517275	-66	21/02/24 15:47:04
16	327.98603409324727	290.8054485105832	-69	21/02/24 15:47:04
11	327.4246457091771	282.6323525733639	-68	21/02/24 15:47:04
7	334.07657006354464	270.8835908324035	-69	21/02/24 15:47:04
32	356.7839379367616	268.70688981904533	-72	21/02/24 15:47:04
31	346.4179037622539	268.10202267794875	-66	21/02/24 15:47:04
13	342.0775229118143	267.91244197819304	-69	21/02/24 15:47:04
14	341.6082252010515	265.6547772450898	-69	21/02/24 15:47:04

27	361.7760445803703	289.2690199455797	-71	21/02/24 15:47:05
37	359.5903712498935	284.92420131943135	-66	21/02/24 15:47:05
40	360.29771601412074	275.17301637315114	-71	21/02/24 15:47:05
47	353.57917457908314	286.3943403818769	-59	21/02/24 15:47:05
22	353.27733584284437	275.76541045955213	-64	21/02/24 15:47:05
45	342.3105096677226	291.9842245930836	-55	21/02/24 15:47:05
46	340.76419739931424	294.4321023101609	-62	21/02/24 15:47:05
8	337.0569612312978	272.24137590202855	-65	21/02/24 15:47:05
24	330.2572237413254	276.8419321591195	-69	21/02/24 15:47:05
25	329.08778489613	275.87564892517275	-68	21/02/24 15:47:05
16	327.98603409324727	290.8054485105832	-68	21/02/24 15:47:05
11	327.4246457091771	282.6323525733639	-68	21/02/24 15:47:05
7	334.07657006354464	270.8835908324035	-68	21/02/24 15:47:05
31	346.4179037622539	268.10202267794875	-70	21/02/24 15:47:05
13	342.0775229118143	267.91244197819304	-69	21/02/24 15:47:05

27	361.7760445803703	289.2690199455797	-70	21/02/24 15:47:06
37	359.5903712498935	284.92420131943135	-68	21/02/24 15:47:06
47	353.57917457908314	286.3943403818769	-63	21/02/24 15:47:06
22	353.27733584284437	275.76541045955213	-65	21/02/24 15:47:06
45	342.3105096677226	291.9842245930836	-50	21/02/24 15:47:06
46	340.76419739931424	294.4321023101609	-58	21/02/24 15:47:06
8	337.0569612312978	272.24137590202855	-67	21/02/24 15:47:06
24	330.2572237413254	276.8419321591195	-68	21/02/24 15:47:06
25	329.08778489613	275.87564892517275	-69	21/02/24 15:47:06
16	327.98603409324727	290.8054485105832	-68	21/02/24 15:47:06
11	327.4246457091771	282.6323525733639	-68	21/02/24 15:47:06
7	334.07657006354464	270.8835908324035	-70	21/02/24 15:47:06

27	361.7760445803703	289.2690199455797	-68	21/02/24 15:47:07
37	359.5903712498935	284.92420131943135	-70	21/02/24 15:47:07
47	353.57917457908314	286.3943403818769	-62	21/02/24 15:47:07
22	353.27733584284437	275.76541045955213	-68	21/02/24 15:47:07
45	342.3105096677226	291.9842245930836	-44	21/02/24 15:47:07
46	340.76419739931424	294.4321023101609	-52	21/02/24 15:47:07
8	337.0569612312978	272.24137590202855	-69	21/02/24 15:47:07
24	330.2572237413254	276.8419321591195	-70	21/02/24 15:47:07
16	327.98603409324727	290.8054485105832	-67	21/02/24 15:47:07
11	327.4246457091771	282.6323525733639	-70	21/02/24 15:47:07

27	361.7760445803703	289.2690199455797	-68	21/02/24 15:47:08
37	359.5903712498935	284.92420131943135	-67	21/02/24 15:47:08
47	353.57917457908314	286.3943403818769	-64	21/02/24 15:47:08
22	353.27733584284437	275.76541045955213	-71	21/02/24 15:47:08
45	342.3105096677226	291.9842245930836	-39	21/02/24 15:47:08
46	340.76419739931424	294.4321023101609	-48	21/02/24 15:47:08
16	327.98603409324727	290.8054485105832	-69	21/02/24 15:47:08
11	327.4246457091771	282.6323525733639	-69	21/02/24 15:47:08

27	361.7760445803703	289.2690199455797	-71	21/02/24 15:47:09
37	359.5903712498935	284.92420131943135	-70	21/02/24 15:47:09
47	353.57917457908314	286.3943403818769	-62	21/02/24 15:47:09
45	342.3105096677226	291.9842245930836	-47	21/02/24 15:47:09
46	340.76419739931424	294.4321023101609	-48	21/02/24 15:47:09
16	327.98603409324727	290.8054485105832	-67	21/02/24 15:47:09

27	361.7760445803703	289.2690199455797	-70	21/02/24 15:47:10
37	359.5903712498935	284.92420131943135	-70	21/02/24 15:47:10
47	353.57917457908314	286.3943403818769	-64	21/02/24 15:47:10
45	342.3105096677226	291.9842245930836	-51	21/02/24 15:47:10
46	340.76419739931424	294.4321023101609	-51	21/02/24 15:47:10
16	327.98603409324727	290.8054485105832	-71	21/02/24 15:47:10

27	361.7760445803703	289.2690199455797	-67	21/02/24 15:47:11
37	359.5903712498935	284.92420131943135	-68	21/02/24 15:47:11
47	353.57917457908314	286.3943403818769	-66	21/02/24 15:47:11
45	342.3105096677226	291.9842245930836	-51	21/02/24 15:47:11
46	340.76419739931424	294.4321023101609	-53	21/02/24 15:47:11
16	327.98603409324727	290.8054485105832	-70	21/02/24 15:47:11

27	361.7760445803703	289.2690199455797	-67	21/02/24 15:47:12
37	359.5903712498935	284.92420131943135	-70	21/02/24 15:47:12
47	353.57917457908314	286.3943403818769	-66	21/02/24 15:47:12
45	342.3105096677226	291.9842245930836	-52	21/02/24 15:47:12
46	340.76419739931424	294.4321023101609	-53	21/02/24 15:47:12
16	327.98603409324727	290.8054485105832	-69	21/02/24 15:47:12

27	361.7760445803703	289.2690199455797	-69	21/02/24 15:47:13
37	359.5903712498935	284.92420131943135	-69	21/02/24 15:47:13
47	353.57917457908314	286.3943403818769	-65	21/02/24 15:47:13
45	342.3105096677226	291.9842245930836	-54	21/02/24 15:47:13
46	340.76419739931424	294.4321023101609	-52	21/02/24 15:47:13
16	327.98603409324727	290.8054485105832	-68	21/02/24 15:47:13

27	361.7760445803703	289.2690199455797	-69	21/02/24 15:47:14
37	359.5903712498935	284.92420131943135	-67	21/02/24 15:47:14
47	353.57917457908314	286.3943403818769	-62	21/02/24 15:47:14
45	342.3105096677226	291.9842245930836	-50	21/02/24 15:47:14
46	340.76419739931424	294.4321023101609	-54	21/02/24 15:47:14
16	327.98603409324727	290.8054485105832	-68	21/02/24 15:47:14

27	361.7760445803703	289.2690199455797	-68	21/02/24 15:47:15
37	359.5903712498935	284.92420131943135	-69	21/02/24 15:47:15
47	353.57917457908314	286.3943403818769	-64	21/02/24 15:47:15
45	342.3105096677226	291.9842245930836	-53	21/02/24 15:47:15
46	340.76419739931424	294.4321023101609	-50	21/02/24 15:47:15
16	327.98603409324727	290.8054485105832	-70	21/02/24 15:47:15

27	361.7760445803703	289.2690199455797	-70	21/02/24 15:47:16
37	359.5903712498935	284.92420131943135	-70	21/02/24 15:47:16
47	353.57917457908314	286.3943403818769	-64	21/02/24 15:47:16
45	342.3105096677226	291.9842245930836	-52	21/02/24 15:47:16
46	340.76419739931424	294.4321023101609	-51	21/02/24 15:47:16
16	327.98603409324727	290.8054485105832	-70	21/02/24 15:47:16

27	361.7760445803703	289.2690199455797	-68	21/02/24 15:47:17
37	359.5903712498935	284.92420131943135	-68	21/02/24 15:47:17
47	353.57917457908314	286.3943403818769	-65	21/02/24 15:47:17
45	342.3105096677226	291.9842245930836	-54	21/02/24 15:47:17
46	340.76419739931424	294.4321023101609	-51	21/02/24 15:47:17
16	327.98603409324727	290.8054485105832	-69	21/02/24 15:47:17

27	361.7760445803703	289.2690199455797	-70	21/02/24 15:47:18
37	359.5903712498935	284.92420131943135	-69	21/02/24 15:47:18
47	353.57917457908314	286.3943403818769	-64	21/02/24 15:47:18
45	342.3105096677226	291.9842245930836	-51	21/02/24 15:47:18
46	340.76419739931424	294.4321023101609	-52	21/02/24 15:47:18
16	327.98603409324727	290.8054485105832	-68	21/02/24 15:47:18

27	361.7760445803703	289.2690199455797	-68	21/02/24 15:47:19
37	359.5903712498935	284.92420131943135	-70	21/02/24 15:47:19
47	353.57917457908314	286.3943403818769	-65	21/02/24 15:47:19
45	342.3105096677226	291.9842245930836	-54	21/02/24 15:47:19
46	340.76419739931424	294.4321023101609	-53	21/02/24 15:47:19
16	327.98603409324727	290.8054485105832	-69	21/02/24 15:47:19

27	361.7760445803703	289.2690199455797	-70	21/02/24 15:47:20
37	359.5903712498935	284.92420131943135	-68	21/02/24 15:47:20
47	353.57917457908314	286.3943403818769	-64	21/02/24 15:47:20
45	342.3105096677226	291.9842245930836	-50	21/02/24 15:47:20
46	340.76419739931424	294.4321023101609	-55	21/02/24 15:47:20
16	327.98603409324727	290.8054485105832	-69	21/02/24 15:47:20

27	361.7760445803703	289.2690199455797	-70	21/02/24 15:47:21
37	359.5903712498935	284.92420131943135	-68	21/02/24 15:47:21
47	353.57917457908314	286.3943403818769	-64	21/02/24 15:47:21
45	342.3105096677226	291.9842245930836	-51	21/02/24 15:47:21
46	340.76419739931424	294.4321023101609	-53	21/02/24 15:47:21
16	327.98603409324727	290.8054485105832	-71	21/02/24 15:47:21

27	361.7760445803703	289.2690199455797	-68	21/02/24 15:47:22
37	359.5903712498935	284.92420131943135	-70	21/02/24 15:47:22
47	353.57917457908314	286.3943403818769	-63	21/02/24 15:47:22
45	342.3105096677226	291.9842245930836	-50	21/02/24 15:47:22
46	340.76419739931424	294.4321023101609	-50	21/02/24 15:47:22
16	327.98603409324727	290.8054485105832	-71	21/02/24 15:47:22

27	361.7760445803703	289.2690199455797	-70	21/02/24 15:47:23
37	359.5903712498935	284.92420131943135	-68	21/02/24 15:47:23
47	353.57917457908314	286.3943403818769	-63	21/02/24 15:47:23
45	342.3105096677226	291.9842245930836	-49	21/02/24 15:47:23
46	340.76419739931424	294.4321023101609	-51	21/02/24 15:47:23
16	327.98603409324727	290.8054485105832	-67	21/02/24 15:47:23

27	361.7760445803703	289.2690199455797	-68	21/02/24 15:47:24
37	359.5903712498935	284.92420131943135	-70	21/02/24 15:47:24
47	353.57917457908314	286.3943403818769	-64	21/02/24 15:47:24
22	353.27733584284437	275.76541045955213	-70	21/02/24 15:47:24
45	342.3105096677226	291.9842245930836	-35	21/02/24 15:47:24
46	340.76419739931424	294.4321023101609	-48	21/02/24 15:47:24
16	327.98603409324727	290.8054485105832	-68	21/02/24 15:47:24
11	327.4246457091771	282.6323525733639	-70	21/02/24 15:47:24
17	323.82998850731616	295.6841920138939	-69	21/02/24 15:47:24

27	361.7760445803703	289.2690199455797	-70	21/02/24 15:47:25
37	359.5903712498935	284.92420131943135	-68	21/02/24 15:47:25
47	353.57917457908314	286.3943403818769	-64	21/02/24 15:47:25
22	353.27733584284437	275.76541045955213	-68	21/02/24 15:47:25
45	342.3105096677226	291.9842245930836	-35	21/02/24 15:47:25
46	340.76419739931424	294.4321023101609	-49	21/02/24 15:47:25
8	337.0569612312978	272.24137590202855	-71	21/02/24 15:47:25
24	330.2572237413254	276.8419321591195	-72	21/02/24 15:47:25
16	327.98603409324727	290.8054485105832	-65	21/02/24 15:47:25
11	327.4246457091771	282.6323525733639	-67	21/02/24 15:47:25
17	323.82998850731616	295.6841920138939	-70	21/02/24 15:47:25

27	361.7760445803703	289.2690199455797	-70	21/02/24 15:47:26
37	359.5903712498935	284.92420131943135	-67	21/02/24 15:47:26
47	353.57917457908314	286.3943403818769	-65	21/02/24 15:47:26
22	353.27733584284437	275.76541045955213	-70	21/02/24 15:47:26
45	342.3105096677226	291.9842245930836	-48	21/02/24 15:47:26
46	340.76419739931424	294.4321023101609	-54	21/02/24 15:47:26
8	337.0569612312978	272.24137590202855	-67	21/02/24 15:47:26
24	330.2572237413254	276.8419321591195	-70	21/02/24 15:47:26
25	329.08778489613	275.87564892517275	-71	21/02/24 15:47:26
16	327.98603409324727	290.8054485105832	-67	21/02/24 15:47:26
11	327.4246457091771	282.6323525733639	-68	21/02/24 15:47:26
7	334.07657006354464	270.8835908324035	-69	21/02/24 15:47:26

27	361.7760445803703	289.2690199455797	-71	21/02/24 15:47:27
37	359.5903712498935	284.92420131943135	-67	21/02/24 15:47:27
47	353.57917457908314	286.3943403818769	-62	21/02/24 15:47:27
22	353.27733584284437	275.76541045955213	-67	21/02/24 15:47:27
45	342.3105096677226	291.9842245930836	-53	21/02/24 15:47:27
46	340.76419739931424	294.4321023101609	-57	21/02/24 15:47:27
8	337.0569612312978	272.24137590202855	-67	21/02/24 15:47:27
24	330.2572237413254	276.8419321591195	-68	21/02/24 15:47:27
25	329.08778489613	275.87564892517275	-68	21/02/24 15:47:27
16	327.98603409324727	290.8054485105832	-65	21/02/24 15:47:27
11	327.4246457091771	282.6323525733639	-68	21/02/24 15:47:27
7	334.07657006354464	270.8835908324035	-68	21/02/24 15:47:27
31	346.4179037622539	268.10202267794875	-70	21/02/24 15:47:27
13	342.0775229118143	267.91244197819304	-71	21/02/24 15:47:27

37	359.5903712498935	284.92420131943135	-68	21/02/24 15:47:28
47	353.57917457908314	286.3943403818769	-64	21/02/24 15:47:28
22	353.27733584284437	275.76541045955213	-66	21/02/24 15:47:28
45	342.3105096677226	291.9842245930836	-56	21/02/24 15:47:28
46	340.76419739931424	294.4321023101609	-63	21/02/24 15:47:28
8	337.0569612312978	272.24137590202855	-65	21/02/24 15:47:28
24	330.2572237413254	276.8419321591195	-67	21/02/24 15:47:28
25	329.08778489613	275.87564892517275	-65	21/02/24 15:47:28
16	327.98603409324727	290.8054485105832	-68	21/02/24 15:47:28
11	327.4246457091771	282.6323525733639	-68	21/02/24 15:47:28
7	334.07657006354464	270.8835908324035	-68	21/02/24 15:47:28
31	346.4179037622539	268.10202267794875	-70	21/02/24 15:47:28
13	342.0775229118143	267.91244197819304	-69	21/02/24 15:47:28
14	341.6082252010515	265.6547772450898	-68	21/02/24 15:47:28

37	359.5903712498935	284.92420131943135	-70	21/02/24 15:47:29
47	353.57917457908314	286.3943403818769	-65	21/02/24 15:47:29
22	353.27733584284437	275.76541045955213	-67	21/02/24 15:47:29
45	342.3105096677226	291.9842245930836	-62	21/02/24 15:47:29
46	340.76419739931424	294.4321023101609	-65	21/02/24 15:47:29
8	337.0569612312978	272.24137590202855	-63	21/02/24 15:47:29
24	330.2572237413254	276.8419321591195	-65	21/02/24 15:47:29
25	329.08778489613	275.87564892517275	-64	21/02/24 15:47:29
16	327.98603409324727	290.8054485105832	-66	21/02/24 15:47:29
11	327.4246457091771	282.6323525733639	-67	21/02/24 15:47:29
7	334.07657006354464	270.8835908324035	-66	21/02/24 15:47:29
30	327.70079256672074	268.3508487639297	-70	21/02/24 15:47:29
31	346.4179037622539	268.10202267794875	-66	21/02/24 15:47:29
13	342.0775229118143	267.91244197819304	-68	21/02/24 15:47:29
21	334.5994402908936	265.9434918767382	-70	21/02/24 15:47:29
14	341.6082252010515	265.6547772450898	-70	21/02/24 15:47:29
20	334.99735462161357	264.77807460530994	-71	21/02/24 15:47:29
23	323.42288358729223	275.8341630458992	-69	21/02/24 15:47:29

37	359.5903712498935	284.92420131943135	-69	21/02/24 15:47:30
47	353.57917457908314	286.3943403818769	-67	21/02/24 15:47:30
22	353.27733584284437	275.76541045955213	-64	21/02/24 15:47:30
45	342.3105096677226	291.9842245930836	-63	21/02/24 15:47:30
46	340.76419739931424	294.4321023101609	-64	21/02/24 15:47:30
8	337.0569612312978	272.24137590202855	-61	21/02/24 15:47:30
24	330.2572237413254	276.8419321591195	-61	21/02/24 15:47:30
25	329.08778489613	275.87564892517275	-63	21/02/24 15:47:30
16	327.98603409324727	290.8054485105832	-67	21/02/24 15:47:30
11	327.4246457091771	282.6323525733639	-67	21/02/24 15:47:30
7	334.07657006354464	270.8835908324035	-64	21/02/24 15:47:30
32	356.7839379367616	268.70688981904533	-70	21/02/24 15:47:30
30	327.70079256672074	268.3508487639297	-68	21/02/24 15:47:30
31	346.4179037622539	268.10202267794875	-67	21/02/24 15:47:30
13	342.0775229118143	267.91244197819304	-65	21/02/24 15:47:30
21	334.5994402908936	265.9434918767382	-67	21/02/24 15:47:30
14	341.6082252010515	265.6547772450898	-66	21/02/24 15:47:30
20	334.99735462161357	264.77807460530994	-69	21/02/24 15:47:30
23	323.42288358729223	275.8341630458992	-71	21/02/24 15:47:30
10	321.1177375667231	282.04747788327467	-70	21/02/24 15:47:30

47	353.57917457908314	286.3943403818769	-68	21/02/24 15:47:31
22	353.27733584284437	275.76541045955213	-64	21/02/24 15:47:31
45	342.3105096677226	291.9842245930836	-66	21/02/24 15:47:31
46	340.76419739931424	294.4321023101609	-65	21/02/24 15:47:31
8	337.0569612312978	272.24137590202855	-59	21/02/24 15:47:31
24	330.2572237413254	276.8419321591195	-62	21/02/24 15:47:31
25	329.08778489613	275.87564892517275	-63	21/02/24 15:47:31
16	327.98603409324727	290.8054485105832	-68	21/02/24 15:47:31
11	327.4246457091771	282.6323525733639	-64	21/02/24 15:47:31
7	334.07657006354464	270.8835908324035	-63	21/02/24 15:47:31
30	327.70079256672074	268.3508487639297	-69	21/02/24 15:47:31
31	346.4179037622539	268.10202267794875	-65	21/02/24 15:47:31
13	342.0775229118143	267.91244197819304	-64	21/02/24 15:47:31
21	334.5994402908936	265.9434918767382	-66	21/02/24 15:47:31
14	341.6082252010515	265.6547772450898	-67	21/02/24 15:47:31
20	334.99735462161357	264.77807460530994	-67	21/02/24 15:47:31
23	323.42288358729223	275.8341630458992	-67	21/02/24 15:47:31
10	321.1177375667231	282.04747788327467	-68	21/02/24 15:47:31

47	353.57917457908314	286.3943403818769	-68	21/02/24 15:47:32
22	353.27733584284437	275.76541045955213	-66	21/02/24 15:47:32
45	342.3105096677226	291.9842245930836	-64	21/02/24 15:47:32
46	340.76419739931424	294.4321023101609	-66	21/02/24 15:47:32
8	337.0569612312978	272.24137590202855	-56	21/02/24 15:47:32
24	330.2572237413254	276.8419321591195	-60	21/02/24 15:47:32
25	329.08778489613	275.87564892517275	-62	21/02/24 15:47:32
16	327.98603409324727	290.8054485105832	-68	21/02/24 15:47:32
11	327.4246457091771	282.6323525733639	-62	21/02/24 15:47:32
7	334.07657006354464	270.8835908324035	-62	21/02/24 15:47:32
30	327.70079256672074	268.3508487639297	-67	21/02/24 15:47:32
31	346.4179037622539	268.10202267794875	-66	21/02/24 15:47:32
13	342.0775229118143	267.91244197819304	-64	21/02/24 15:47:32
21	334.5994402908936	265.9434918767382	-65	21/02/24 15:47:32
14	341.6082252010515	265.6547772450898	-68	21/02/24 15:47:32
20	334.99735462161357	264.77807460530994	-65	21/02/24 15:47:32
29	324.8804385762518	264.6870431160569	-72	21/02/24 15:47:32
23	323.42288358729223	275.8341630458992	-68	21/02/24 15:47:32
10	321.1177375667231	282.04747788327467	-69	21/02/24 15:47:32
28	319.76429243151256	284.17285383094054	-69	21/02/24 15:47:32

47	353.57917457908314	286.3943403818769	-69	21/02/24 15:47:33
22	353.27733584284437	275.76541045955213	-67	21/02/24 15:47:33
45	342.3105096677226	291.9842245930836	-67	21/02/24 15:47:33
46	340.76419739931424	294.4321023101609	-67	21/02/24 15:47:33
8	337.0569612312978	272.24137590202855	-57	21/02/24 15:47:33
24	330.2572237413254	276.8419321591195	-60	21/02/24 15:47:33
25	329.08778489613	275.87564892517275	-62	21/02/24 15:47:33
16	327.98603409324727	290.8054485105832	-65	21/02/24 15:47:33
11	327.4246457091771	282.6323525733639	-62	21/02/24 15:47:33
7	334.07657006354464	270.8835908324035	-61	21/02/24 15:47:33
30	327.70079256672074	268.3508487639297	-65	21/02/24 15:47:33
31	346.4179037622539	268.10202267794875	-66	21/02/24 15:47:33
13	342.0775229118143	267.91244197819304	-64	21/02/24 15:47:33
21	334.5994402908936	265.9434918767382	-66	21/02/24 15:47:33
14	341.6082252010515	265.6547772450898	-65	21/02/24 15:47:33
20	334.99735462161357	264.77807460530994	-65	21/02/24 15:47:33
29	324.8804385762518	264.6870431160569	-72	21/02/24 15:47:33
23	323.42288358729223	275.8341630458992	-67	21/02/24 15:47:33
10	321.1177375667231	282.04747788327467	-67	21/02/24 15:47:33
28	319.76429243151256	284.17285383094054	-71	21/02/24 15:47:33

47	353.57917457908314	286.3943403818769	-69	21/02/24 15:47:34
22	353.27733584284437	275.76541045955213	-66	21/02/24 15:47:34
45	342.3105096677226	291.9842245930836	-65	21/02/24 15:47:34
46	340.76419739931424	294.4321023101609	-68	21/02/24 15:47:34
8	337.0569612312978	272.24137590202855	-58	21/02/24 15:47:34
24	330.2572237413254	276.8419321591195	-59	21/02/24 15:47:34
25	329.08778489613	275.87564892517275	-62	21/02/24 15:47:34
16	327.98603409324727	290.8054485105832	-67	21/02/24 15:47:34
11	327.4246457091771	282.6323525733639	-64	21/02/24 15:47:34
7	334.07657006354464	270.8835908324035	-63	21/02/24 15:47:34
30	327.70079256672074	268.3508487639297	-66	21/02/24 15:47:34
31	346.4179037622539	268.10202267794875	-66	21/02/24 15:47:34
13	342.0775229118143	267.91244197819304	-66	21/02/24 15:47:34
21	334.5994402908936	265.9434918767382	-64	21/02/24 15:47:34
14	341.6082252010515	265.6547772450898	-66	21/02/24 15:47:34
20	334.99735462161357	264.77807460530994	-66	21/02/24 15:47:34
29	324.8804385762518	264.6870431160569	-71	21/02/24 15:47:34
23	323.42288358729223	275.8341630458992	-68	21/02/24 15:47:34
10	321.1177375667231	282.04747788327467	-67	21/02/24 15:47:34
28	319.76429243151256	284.17285383094054	-69	21/02/24 15:47:34

47	353.57917457908314	286.3943403818769	-68	21/02/24 15:47:35
22	353.27733584284437	275.76541045955213	-68	21/02/24 15:47:35
45	342.3105096677226	291.9842245930836	-66	21/02/24 15:47:35
46	340.76419739931424	294.4321023101609	-66	21/02/24 15:47:35
8	337.0569612312978	272.24137590202855	-58	21/02/24 15:47:35
24	330.2572237413254	276.8419321591195	-57	21/02/24 15:47:35
25	329.08778489613	275.87564892517275	-61	21/02/24 15:47:35
16	327.98603409324727	290.8054485105832	-65	21/02/24 15:47:35
11	327.4246457091771	282.6323525733639	-60	21/02/24 15:47:35
7	334.07657006354464	270.8835908324035	-60	21/02/24 15:47:35
30	327.70079256672074	268.3508487639297	-65	21/02/24 15:47:35
31	346.4179037622539	268.10202267794875	-66	21/02/24 15:47:35
13	342.0775229118143	267.91244197819304	-66	21/02/24 15:47:35
21	334.5994402908936	265.9434918767382	-65	21/02/24 15:47:35
14	341.6082252010515	265.6547772450898	-67	21/02/24 15:47:35
20	334.99735462161357	264.77807460530994	-67	21/02/24 15:47:35
29	324.8804385762518	264.6870431160569	-68	21/02/24 15:47:35
23	323.42288358729223	275.8341630458992	-65	21/02/24 15:47:35
10	321.1177375667231	282.04747788327467	-69	21/02/24 15:47:35
28	319.76429243151256	284.17285383094054	-69	21/02/24 15:47:35

47	353.57917457908314	286.3943403818769	-70	21/02/24 15:47:36
22	353.27733584284437	275.76541045955213	-69	21/02/24 15:47:36
45	342.3105096677226	291.9842245930836	-64	21/02/24 15:47:36
46	340.76419739931424	294.4321023101609	-65	21/02/24 15:47:36
8	337.0569612312978	272.24137590202855	-56	21/02/24 15:47:36
24	330.2572237413254	276.8419321591195	-56	21/02/24 15:47:36
25	329.08778489613	275.87564892517275	-59	21/02/24 15:47:36
16	327.98603409324727	290.8054485105832	-65	21/02/24 15:47:36
11	327.4246457091771	282.6323525733639	-60	21/02/24 15:47:36
7	334.07657006354464	270.8835908324035	-59	21/02/24 15:47:36
30	327.70079256672074	268.3508487639297	-65	21/02/24 15:47:36
31	346.4179037622539	268.10202267794875	-67	21/02/24 15:47:36
13	342.0775229118143	267.91244197819304	-64	21/02/24 15:47:36
21	334.5994402908936	265.9434918767382	-66	21/02/24 15:47:36
14	341.6082252010515	265.6547772450898	-65	21/02/24 15:47:36
20	334.99735462161357	264.77807460530994	-66	21/02/24 15:47:36
29	324.8804385762518	264.6870431160569	-68	21/02/24 15:47:36
23	323.42288358729223	275.8341630458992	-67	21/02/24 15:47:36
10	321.1177375667231	282.04747788327467	-65	21/02/24 15:47:36
28	319.76429243151256	284.17285383094054	-68	21/02/24 15:47:36

47	353.57917457908314	286.3943403818769	-70	21/02/24 15:47:37
22	353.27733584284437	275.76541045955213	-71	21/02/24 15:47:37
45	342.3105096677226	291.9842245930836	-65	21/02/24 15:47:37
46	340.76419739931424	294.4321023101609	-68	21/02/24 15:47:37
8	337.0569612312978	272.24137590202855	-57	21/02/24 15:47:37
24	330.2572237413254	276.8419321591195	-58	21/02/24 15:47:37
25	329.08778489613	275.87564892517275	-60	21/02/24 15:47:37
16	327.98603409324727	290.8054485105832	-65	21/02/24 15:47:37
11	327.4246457091771	282.6323525733639	-60	21/02/24 15:47:37
7	334.07657006354464	270.8835908324035	-62	21/02/24 15:47:37
30	327.70079256672074	268.3508487639297	-67	21/02/24 15:47:37
31	346.4179037622539	268.10202267794875	-69	21/02/24 15:47:37
13	342.0775229118143	267.91244197819304	-65	21/02/24 15:47:37
21	334.5994402908936	265.9434918767382	-64	21/02/24 15:47:37
14	341.6082252010515	265.6547772450898	-65	21/02/24 15:47:37
20	334.99735462161357	264.77807460530994	-67	21/02/24 15:47:37
29	324.8804385762518	264.6870431160569	-69	21/02/24 15:47:37
23	323.42288358729223	275.8341630458992	-65	21/02/24 15:47:37
10	321.1177375667231	282.04747788327467	-67	21/02/24 15:47:37
28	319.76429243151256	284.17285383094054	-70	21/02/24 15:47:37

47	353.57917457908314	286.3943403818769	-71	21/02/24 15:47:38
22	353.27733584284437	275.76541045955213	-70	21/02/24 15:47:38
45	342.3105096677226	291.9842245930836	-65	21/02/24 15:47:38
46	340.76419739931424	294.4321023101609	-66	21/02/24 15:47:38
8	337.0569612312978	272.24137590202855	-59	21/02/24 15:47:38
24	330.2572237413254	276.8419321591195	-58	21/02/24 15:47:38
25	329.08778489613	275.87564892517275	-61	21/02/24 15:47:38
16	327.98603409324727	290.8054485105832	-66	21/02/24 15:47:38
11	327.4246457091771	282.6323525733639	-63	21/02/24 15:47:38
7	334.07657006354464	270.8835908324035	-59	21/02/24 15:47:38
30	327.70079256672074	268.3508487639297	-68	21/02/24 15:47:38
31	346.4179037622539	268.10202267794875	-66	21/02/24 15:47:38
13	342.0775229118143	267.91244197819304	-65	21/02/24 15:47:38
21	334.5994402908936	265.9434918767382	-66	21/02/24 15:47:38
14	341.6082252010515	265.6547772450898	-68	21/02/24 15:47:38
20	334.99735462161357	264.77807460530994	-65	21/02/24 15:47:38
29	324.8804385762518	264.6870431160569	-68	21/02/24 15:47:38
23	323.42288358729223	275.8341630458992	-67	21/02/24 15:47:38
10	321.1177375667231	282.04747788327467	-68	21/02/24 15:47:38
28	319.76429243151256	284.17285383094054	-71	21/02/24 15:47:38

47	353.57917457908314	286.3943403818769	-70	21/02/24 15:47:39
22	353.27733584284437	275.76541045955213	-69	21/02/24 15:47:39
45	342.3105096677226	291.9842245930836	-66	21/02/24 15:47:39
46	340.76419739931424	294.4321023101609	-66	21/02/24 15:47:39
8	337.0569612312978	272.24137590202855	-59	21/02/24 15:47:39
24	330.2572237413254	276.8419321591195	-59	21/02/24 15:47:39
25	329.08778489613	275.87564892517275	-60	21/02/24 15:47:39
16	327.98603409324727	290.8054485105832	-67	21/02/24 15:47:39
11	327.4246457091771	282.6323525733639	-62	21/02/24 15:47:39
7	334.07657006354464	270.8835908324035	-62	21/02/24 15:47:39
30	327.70079256672074	268.3508487639297	-66	21/02/24 15:47:39
31	346.4179037622539	268.10202267794875	-66	21/02/24 15:47:39
13	342.0775229118143	267.91244197819304	-65	21/02/24 15:47:39
21	334.5994402908936	265.9434918767382	-68	21/02/24 15:47:39
14	341.6082252010515	265.6547772450898	-66	21/02/24 15:47:39
20	334.99735462161357	264.77807460530994	-68	21/02/24 15:47:39
29	324.8804385762518	264.6870431160569	-72	21/02/24 15:47:39
23	323.42288358729223	275.8341630458992	-67	21/02/24 15:47:39
10	321.1177375667231	282.04747788327467	-68	21/02/24 15:47:39
28	319.76429243151256	284.17285383094054	-69	21/02/24 15:47:39

47	353.57917457908314	286.3943403818769	-71	21/02/24 15:47:40
22	353.27733584284437	275.76541045955213	-70	21/02/24 15:47:40
45	342.3105096677226	291.9842245930836	-64	21/02/24 15:47:40
46	340.76419739931424	294.4321023101609	-68	21/02/24 15:47:40
8	337.0569612312978	272.24137590202855	-58	21/02/24 15:47:40
24	330.2572237413254	276.8419321591195	-58	21/02/24 15:47:40
25	329.08778489613	275.87564892517275	-58	21/02/24 15:47:40
16	327.98603409324727	290.8054485105832	-65	21/02/24 15:47:40
11	327.4246457091771	282.6323525733639	-62	21/02/24 15:47:40
7	334.07657006354464	270.8835908324035	-61	21/02/24 15:47:40
30	327.70079256672074	268.3508487639297	-67	21/02/24 15:47:40
31	346.4179037622539	268.10202267794875	-67	21/02/24 15:47:40
13	342.0775229118143	267.91244197819304	-66	21/02/24 15:47:40
21	334.5994402908936	265.9434918767382	-67	21/02/24 15:47:40
14	341.6082252010515	265.6547772450898	-67	21/02/24 15:47:40
20	334.99735462161357	264.77807460530994	-69	21/02/24 15:47:40
29	324.8804385762518	264.6870431160569	-69	21/02/24 15:47:40
23	323.42288358729223	275.8341630458992	-68	21/02/24 15:47:40
10	321.1177375667231	282.04747788327467	-69	21/02/24 15:47:40
28	319.76429243151256	284.17285383094054	-69	21/02/24 15:47:40

47	353.57917457908314	286.3943403818769	-69	21/02/24 15:47:41
22	353.27733584284437	275.76541045955213	-67	21/02/24 15:47:41
45	342.3105096677226	291.9842245930836	-64	21/02/24 15:47:41
46	340.76419739931424	294.4321023101609	-66	21/02/24 15:47:41
8	337.0569612312978	272.24137590202855	-59	21/02/24 15:47:41
24	330.2572237413254	276.8419321591195	-57	21/02/24 15:47:41
25	329.08778489613	275.87564892517275	-59	21/02/24 15:47:41
16	327.98603409324727	290.8054485105832	-66	21/02/24 15:47:41
11	327.4246457091771	282.6323525733639	-63	21/02/24 15:47:41
7	334.07657006354464	270.8835908324035	-62	21/02/24 15:47:41
30	327.70079256672074	268.3508487639297	-66	21/02/24 15:47:41
31	346.4179037622539	268.10202267794875	-67	21/02/24 15:47:41
13	342.0775229118143	267.91244197819304	-64	21/02/24 15:47:41
21	334.5994402908936	265.9434918767382	-67	21/02/24 15:47:41
14	341.6082252010515	265.6547772450898	-69	21/02/24 15:47:41
20	334.99735462161357	264.77807460530994	-66	21/02/24 15:47:41
29	324.8804385762518	264.6870431160569	-69	21/02/24 15:47:41
23	323.42288358729223	275.8341630458992	-66	21/02/24 15:47:41
10	321.1177375667231	282.04747788327467	-67	21/02/24 15:47:41
28	319.76429243151256	284.17285383094054	-68	21/02/24 15:47:41

47	353.57917457908314	286.3943403818769	-70	21/02/24 15:47:42
22	353.27733584284437	275.76541045955213	-67	21/02/24 15:47:42
45	342.3105096677226	291.9842245930836	-67	21/02/24 15:47:42
46	340.76419739931424	294.4321023101609	-65	21/02/24 15:47:42
8	337.0569612312978	272.24137590202855	-59	21/02/24 15:47:42
24	330.2572237413254	276.8419321591195	-56	21/02/24 15:47:42
25	329.08778489613	275.87564892517275	-58	21/02/24 15:47:42
16	327.98603409324727	290.8054485105832	-65	21/02/24 15:47:42
11	327.4246457091771	282.6323525733639	-62	21/02/24 15:47:42
7	334.07657006354464	270.8835908324035	-61	21/02/24 15:47:42
30	327.70079256672074	268.3508487639297	-68	21/02/24 15:47:42
31	346.4179037622539	268.10202267794875	-65	21/02/24 15:47:42
13	342.0775229118143	267.91244197819304	-64	21/02/24 15:47:42
21	334.5994402908936	265.9434918767382	-64	21/02/24 15:47:42
14	341.6082252010515	265.6547772450898	-68	21/02/24 15:47:42
20	334.99735462161357	264.77807460530994	-68	21/02/24 15:47:42
29	324.8804385762518	264.6870431160569	-70	21/02/24 15:47:42
23	323.42288358729223	275.8341630458992	-67	21/02/24 15:47:42
10	321.1177375667231	282.04747788327467	-68	21/02/24 15:47:42
28	319.76429243151256	284.17285383094054	-67	21/02/24 15:47:42

47	353.57917457908314	286.3943403818769	-69	21/02/24 15:47:43
22	353.27733584284437	275.76541045955213	-68	21/02/24 15:47:43
45	342.3105096677226	291.9842245930836	-67	21/02/24 15:47:43
46	340.76419739931424	294.4321023101609	-67	21/02/24 15:47:43
8	337.0569612312978	272.24137590202855	-58	21/02/24 15:47:43
24	330.2572237413254	276.8419321591195	-55	21/02/24 15:47:43
25	329.08778489613	275.87564892517275	-59	21/02/24 15:47:43
16	327.98603409324727	290.8054485105832	-66	21/02/24 15:47:43
11	327.4246457091771	282.6323525733639	-60	21/02/24 15:47:43
7	334.07657006354464	270.8835908324035	-60	21/02/24 15:47:43
30	327.70079256672074	268.3508487639297	-66	21/02/24 15:47:43
31	346.4179037622539	268.10202267794875	-66	21/02/24 15:47:43
13	342.0775229118143	267.91244197819304	-66	21/02/24 15:47:43
21	334.5994402908936	265.9434918767382	-66	21/02/24 15:47:43
14	341.6082252010515	265.6547772450898	-65	21/02/24 15:47:43
20	334.99735462161357	264.77807460530994	-69	21/02/24 15:47:43
29	324.8804385762518	264.6870431160569	-71	21/02/24 15:47:43
23	323.42288358729223	275.8341630458992	-67	21/02/24 15:47:43
10	321.1177375667231	282.04747788327467	-66	21/02/24 15:47:43
28	319.76429243151256	284.17285383094054	-68	21/02/24 15:47:43

47	353.57917457908314	286.3943403818769	-70	21/02/24 15:47:44
22	353.27733584284437	275.76541045955213	-70	21/02/24 15:47:44
45	342.3105096677226	291.9842245930836	-66	21/02/24 15:47:44
46	340.76419739931424	294.4321023101609	-69	21/02/24 15:47:44
8	337.0569612312978	272.24137590202855	-56	21/02/24 15:47:44
24	330.2572237413254	276.8419321591195	-57	21/02/24 15:47:44
25	329.08778489613	275.87564892517275	-59	21/02/24 15:47:44
16	327.98603409324727	290.8054485105832	-68	21/02/24 15:47:44
11	327.4246457091771	282.6323525733639	-60	21/02/24 15:47:44
7	334.07657006354464	270.8835908324035	-61	21/02/24 15:47:44
30	327.70079256672074	268.3508487639297	-67	21/02/24 15:47:44
31	346.4179037622539	268.10202267794875	-66	21/02/24 15:47:44
13	342.0775229118143	267.91244197819304	-67	21/02/24 15:47:44
21	334.5994402908936	265.9434918767382	-67	21/02/24 15:47:44
14	341.6082252010515	265.6547772450898	-66	21/02/24 15:47:44
20	334.99735462161357	264.77807460530994	-67	21/02/24 15:47:44
29	324.8804385762518	264.6870431160569	-69	21/02/24 15:47:44
23	323.42288358729223	275.8341630458992	-66	21/02/24 15:47:44
10	321.1177375667231	282.04747788327467	-68	21/02/24 15:47:44
28	319.76429243151256	284.17285383094054	-70	21/02/24 15:47:44

47	353.57917457908314	286.3943403818769	-69	21/02/24 15:47:45
22	353.27733584284437	275.76541045955213	-67	21/02/24 15:47:45
45	342.3105096677226	291.9842245930836	-64	21/02/24 15:47:45
46	340.76419739931424	294.4321023101609	-67	21/02/24 15:47:45
8	337.0569612312978	272.24137590202855	-58	21/02/24 15:47:45
24	330.2572237413254	276.8419321591195	-55	21/02/24 15:47:45
25	329.08778489613	275.87564892517275	-61	21/02/24 15:47:45
16	327.98603409324727	290.8054485105832	-66	21/02/24 15:47:45
11	327.4246457091771	282.6323525733639	-62	21/02/24 15:47:45
7	334.07657006354464	270.8835908324035	-61	21/02/24 15:47:45
30	327.70079256672074	268.3508487639297	-65	21/02/24 15:47:45
31	346.4179037622539	268.10202267794875	-65	21/02/24 15:47:45
13	342.0775229118143	267.91244197819304	-63	21/02/24 15:47:45
21	334.5994402908936	265.9434918767382	-64	21/02/24 15:47:45
14	341.6082252010515	265.6547772450898	-67	21/02/24 15:47:45
20	334.99735462161357	264.77807460530994	-65	21/02/24 15:47:45
29	324.8804385762518	264.6870431160569	-68	21/02/24 15:47:45
23	323.42288358729223	275.8341630458992	-67	21/02/24 15:47:45
10	321.1177375667231	282.04747788327467	-66	21/02/24 15:47:45
28	319.76429243151256	284.17285383094054	-69	21/02/24 15:47:45

47	353.57917457908314	286.3943403818769	-68	21/02/24 15:47:46
22	353.27733584284437	275.76541045955213	-70	21/02/24 15:47:46
45	342.3105096677226	291.9842245930836	-68	21/02/24 15:47:46
46	340.76419739931424	294.4321023101609	-69	21/02/24 15:47:46
8	337.0569612312978	272.24137590202855	-56	21/02/24 15:47:46
24	330.2572237413254	276.8419321591195	-57	21/02/24 15:47:46
25	329.08778489613	275.87564892517275	-60	21/02/24 15:47:46
16	327.98603409324727	290.8054485105832	-66	21/02/24 15:47:46
11	327.4246457091771	282.6323525733639	-61	21/02/24 15:47:46
7	334.07657006354464	270.8835908324035	-60	21/02/24 15:47:46
30	327.70079256672074	268.3508487639297	-68	21/02/24 15:47:46
31	346.4179037622539	268.10202267794875	-68	21/02/24 15:47:46
13	342.0775229118143	267.91244197819304	-63	21/02/24 15:47:46
21	334.5994402908936	265.9434918767382	-64	21/02/24 15:47:46
14	341.6082252010515	265.6547772450898	-66	21/02/24 15:47:46
20	334.99735462161357	264.77807460530994	-68	21/02/24 15:47:46
29	324.8804385762518	264.6870431160569	-69	21/02/24 15:47:46
23	323.42288358729223	275.8341630458992	-66	21/02/24 15:47:46
10	321.1177375667231	282.04747788327467	-67	21/02/24 15:47:46
28	319.76429243151256	284.17285383094054	-69	21/02/24 15:47:46

47	353.57917457908314	286.3943403818769	-68	21/02/24 15:47:47
22	353.27733584284437	275.76541045955213	-69	21/02/24 15:47:47
45	342.3105096677226	291.9842245930836	-67	21/02/24 15:47:47
46	340.76419739931424	294.4321023101609	-69	21/02/24 15:47:47
8	337.0569612312978	272.24137590202855	-57	21/02/24 15:47:47
24	330.2572237413254	276.8419321591195	-56	21/02/24 15:47:47
25	329.08778489613	275.87564892517275	-57	21/02/24 15:47:47
16	327.98603409324727	290.8054485105832	-65	21/02/24 15:47:47
11	327.4246457091771	282.6323525733639	-63	21/02/24 15:47:47
7	334.07657006354464	270.8835908324035	-60	21/02/24 15:47:47
30	327.70079256672074	268.3508487639297	-64	21/02/24 15:47:47
31	346.4179037622539	268.10202267794875	-68	21/02/24 15:47:47
13	342.0775229118143	267.91244197819304	-65	21/02/24 15:47:47
21	334.5994402908936	265.9434918767382	-66	21/02/24 15:47:47
14	341.6082252010515	265.6547772450898	-67	21/02/24 15:47:47
20	334.99735462161357	264.77807460530994	-68	21/02/24 15:47:47
29	324.8804385762518	264.6870431160569	-71	21/02/24 15:47:47
23	323.42288358729223	275.8341630458992	-66	21/02/24 15:47:47
10	321.1177375667231	282.04747788327467	-69	21/02/24 15:47:47
28	319.76429243151256	284.17285383094054	-68	21/02/24 15:47:47

47	353.57917457908314	286.3943403818769	-71	21/02/24 15:47:48
22	353.27733584284437	275.76541045955213	-70	21/02/24 15:47:48
45	342.3105096677226	291.9842245930836	-67	21/02/24 15:47:48
46	340.76419739931424	294.4321023101609	-67	21/02/24 15:47:48
8	337.0569612312978	272.24137590202855	-54	21/02/24 15:47:48
24	330.2572237413254	276.8419321591195	-56	21/02/24 15:47:48
25	329.08778489613	275.87564892517275	-59	21/02/24 15:47:48
16	327.98603409324727	290.8054485105832	-68	21/02/24 15:47:48
11	327.4246457091771	282.6323525733639	-60	21/02/24 15:47:48
7	334.07657006354464	270.8835908324035	-60	21/02/24 15:47:48
30	327.70079256672074	268.3508487639297	-65	21/02/24 15:47:48
31	346.4179037622539	268.10202267794875	-66	21/02/24 15:47:48
13	342.0775229118143	267.91244197819304	-65	21/02/24 15:47:48
21	334.5994402908936	265.9434918767382	-65	21/02/24 15:47:48
14	341.6082252010515	265.6547772450898	-66	21/02/24 15:47:48
20	334.99735462161357	264.77807460530994	-65	21/02/24 15:47:48
29	324.8804385762518	264.6870431160569	-67	21/02/24 15:47:48
23	323.42288358729223	275.8341630458992	-65	21/02/24 15:47:48
10	321.1177375667231	282.04747788327467	-67	21/02/24 15:47:48
28	319.76429243151256	284.17285383094054	-67	21/02/24 15:47:48

47	353.57917457908314	286.3943403818769	-70	21/02/24 15:47:49
22	353.27733584284437	275.76541045955213	-70	21/02/24 15:47:49
45	342.3105096677226	291.9842245930836	-65	21/02/24 15:47:49
46	340.76419739931424	294.4321023101609	-66	21/02/24 15:47:49
8	337.0569612312978	272.24137590202855	-58	21/02/24 15:47:49
24	330.2572237413254	276.8419321591195	-55	21/02/24 15:47:49
25	329.08778489613	275.87564892517275	-59	21/02/24 15:47:49
16	327.98603409324727	290.8054485105832	-64	21/02/24 15:47:49
11	327.4246457091771	282.6323525733639	-59	21/02/24 15:47:49
7	334.07657006354464	270.8835908324035	-61	21/02/24 15:47:49
30	327.70079256672074	268.3508487639297	-66	21/02/24 15:47:49
31	346.4179037622539	268.10202267794875	-68	21/02/24 15:47:49
13	342.0775229118143	267.91244197819304	-65	21/02/24 15:47:49
21	334.5994402908936	265.9434918767382	-66	21/02/24 15:47:49
14	341.6082252010515	265.6547772450898	-67	21/02/24 15:47:49
20	334.99735462161357	264.77807460530994	-66	21/02/24 15:47:49
29	324.8804385762518	264.6870431160569	-68	21/02/24 15:47:49
23	323.42288358729223	275.8341630458992	-65	21/02/24 15:47:49
10	321.1177375667231	282.04747788327467	-66	21/02/24 15:47:49
28	319.76429243151256	284.17285383094054	-69	21/02/24 15:47:49

47	353.57917457908314	286.3943403818769	-68	21/02/24 15:47:50
22	353.27733584284437	275.76541045955213	-69	21/02/24 15:47:50
45	342.3105096677226	291.9842245930836	-65	21/02/24 15:47:50
46	340.76419739931424	294.4321023101609	-67	21/02/24 15:47:50
8	337.0569612312978	272.24137590202855	-55	21/02/24 15:47:50
24	330.2572237413254	276.8419321591195	-57	21/02/24 15:47:50
25	329.08778489613	275.87564892517275	-58	21/02/24 15:47:50
16	327.98603409324727	290.8054485105832	-67	21/02/24 15:47:50
11	327.4246457091771	282.6323525733639	-62	21/02/24 15:47:50
7	334.07657006354464	270.8835908324035	-61	21/02/24 15:47:50
30	327.70079256672074	268.3508487639297	-66	21/02/24 15:47:50
31	346.4179037622539	268.10202267794875	-65	21/02/24 15:47:50
13	342.0775229118143	267.91244197819304	-66	21/02/24 15:47:50
21	334.5994402908936	265.9434918767382	-63	21/02/24 15:47:50
14	341.6082252010515	265.6547772450898	-67	21/02/24 15:47:50
20	334.99735462161357	264.77807460530994	-65	21/02/24 15:47:50
29	324.8804385762518	264.6870431160569	-71	21/02/24 15:47:50
23	323.42288358729223	275.8341630458992	-64	21/02/24 15:47:50
10	321.1177375667231	282.04747788327467	-67	21/02/24 15:47:50
28	319.76429243151256	284.17285383094054	-69	21/02/24 15:47:50

47	353.57917457908314	286.3943403818769	-69	21/02/24 15:47:51
22	353.27733584284437	275.76541045955213	-67	21/02/24 15:47:51
45	342.3105096677226	291.9842245930836	-65	21/02/24 15:47:51
46	340.76419739931424	294.4321023101609	-68	21/02/24 15:47:51
8	337.0569612312978	272.24137590202855	-54	21/02/24 15:47:51
24	330.2572237413254	276.8419321591195	-55	21/02/24 15:47:51
25	329.08778489613	275.87564892517275	-60	21/02/24 15:47:51
16	327.98603409324727	290.8054485105832	-66	21/02/24 15:47:51
11	327.4246457091771	282.6323525733639	-63	21/02/24 15:47:51
7	334.07657006354464	270.8835908324035	-59	21/02/24 15:47:51
30	327.70079256672074	268.3508487639297	-64	21/02/24 15:47:51
31	346.4179037622539	268.10202267794875	-66	21/02/24 15:47:51
13	342.0775229118143	267.91244197819304	-64	21/02/24 15:47:51
21	334.5994402908936	265.9434918767382	-66	21/02/24 15:47:51
14	341.6082252010515	265.6547772450898	-66	21/02/24 15:47:51
20	334.99735462161357	264.77807460530994	-64	21/02/24 15:47:51
29	324.8804385762518	264.6870431160569	-69	21/02/24 15:47:51
23	323.42288358729223	275.8341630458992	-65	21/02/24 15:47:51
10	321.1177375667231	282.04747788327467	-68	21/02/24 15:47:51
28	319.76429243151256	284.17285383094054	-70	21/02/24 15:47:51

47	353.57917457908314	286.3943403818769	-69	21/02/24 15:47:52
22	353.27733584284437	275.76541045955213	-69	21/02/24 15:47:52
45	342.3105096677226	291.9842245930836	-66	21/02/24 15:47:52
46	340.76419739931424	294.4321023101609	-68	21/02/24 15:47:52
8	337.0569612312978	272.24137590202855	-54	21/02/24 15:47:52
24	330.2572237413254	276.8419321591195	-56	21/02/24 15:47:52
25	329.08778489613	275.87564892517275	-56	21/02/24 15:47:52
16	327.98603409324727	290.8054485105832	-65	21/02/24 15:47:52
11	327.4246457091771	282.6323525733639	-60	21/02/24 15:47:52
7	334.07657006354464	270.8835908324035	-59	21/02/24 15:47:52
30	327.70079256672074	268.3508487639297	-64	21/02/24 15:47:52
31	346.4179037622539	268.10202267794875	-68	21/02/24 15:47:52
13	342.0775229118143	267.91244197819304	-62	21/02/24 15:47:52
21	334.5994402908936	265.9434918767382	-63	21/02/24 15:47:52
14	341.6082252010515	265.6547772450898	-65	21/02/24 15:47:52
20	334.99735462161357	264.77807460530994	-67	21/02/24 15:47:52
29	324.8804385762518	264.6870431160569	-71	21/02/24 15:47:52
23	323.42288358729223	275.8341630458992	-65	21/02/24 15:47:52
10	321.1177375667231	282.04747788327467	-68	21/02/24 15:47:52
28	319.76429243151256	284.17285383094054	-70	21/02/24 15:47:52

47	353.57917457908314	286.3943403818769	-71	21/02/24 15:47:53
22	353.27733584284437	275.76541045955213	-70	21/02/24 15:47:53
45	342.3105096677226	291.9842245930836	-65	21/02/24 15:47:53
46	340.76419739931424	294.4321023101609	-67	21/02/24 15:47:53
8	337.0569612312978	272.24137590202855	-54	21/02/24 15:47:53
24	330.2572237413254	276.8419321591195	-55	21/02/24 15:47:53
25	329.08778489613	275.87564892517275	-57	21/02/24 15:47:53
16	327.98603409324727	290.8054485105832	-67	21/02/24 15:47:53
11	327.4246457091771	282.6323525733639	-60	21/02/24 15:47:53
7	334.07657006354464	270.8835908324035	-58	21/02/24 15:47:53
30	327.70079256672074	268.3508487639297	-67	21/02/24 15:47:53
31	346.4179037622539	268.10202267794875	-65	21/02/24 15:47:53
13	342.0775229118143	267.91244197819304	-63	21/02/24 15:47:53
21	334.5994402908936	265.9434918767382	-65	21/02/24 15:47:53
14	341.6082252010515	265.6547772450898	-65	21/02/24 15:47:53
20	334.99735462161357	264.77807460530994	-66	21/02/24 15:47:53
29	324.8804385762518	264.6870431160569	-71	21/02/24 15:47:53
23	323.42288358729223	275.8341630458992	-66	21/02/24 15:47:53
10	321.1177375667231	282.04747788327467	-69	21/02/24 15:47:53
28	319.76429243151256	284.17285383094054	-69	21/02/24 15:47:53

47	353.57917457908314	286.3943403818769	-70	21/02/24 15:47:54
22	353.27733584284437	275.76541045955213	-68	21/02/24 15:47:54
45	342.3105096677226	291.9842245930836	-65	21/02/24 15:47:54
46	340.76419739931424	294.4321023101609	-69	21/02/24 15:47:54
8	337.0569612312978	272.24137590202855	-57	21/02/24 15:47:54
24	330.2572237413254	276.8419321591195	-57	21/02/24 15:47:54
25	329.08778489613	275.87564892517275	-60	21/02/24 15:47:54
16	327.98603409324727	290.8054485105832	-66	21/02/24 15:47:54
11	327.4246457091771	282.6323525733639	-62	21/02/24 15:47:54
7	334.07657006354464	270.8835908324035	-59	21/02/24 15:47:54
30	327.70079256672074	268.3508487639297	-66	21/02/24 15:47:54
31	346.4179037622539	268.10202267794875	-67	21/02/24 15:47:54
13	342.0775229118143	267.91244197819304	-64	21/02/24 15:47:54
21	334.5994402908936	265.9434918767382	-65	21/02/24 15:47:54
14	341.6082252010515	265.6547772450898	-65	21/02/24 15:47:54
20	334.99735462161357	264.77807460530994	-66	21/02/24 15:47:54
29	324.8804385762518	264.6870431160569	-71	21/02/24 15:47:54
23	323.42288358729223	275.8341630458992	-66	21/02/24 15:47:54
10	321.1177375667231	282.04747788327467	-66	21/02/24 15:47:54
28	319.76429243151256	284.17285383094054	-69	21/02/24 15:47:54

47	353.57917457908314	286.3943403818769	-70	21/02/24 15:47:55
22	353.27733584284437	275.76541045955213	-69	21/02/24 15:47:55
45	342.3105096677226	291.9842245930836	-68	21/02/24 15:47:55
46	340.76419739931424	294.4321023101609	-67	21/02/24 15:47:55
8	337.0569612312978	272.24137590202855	-57	21/02/24 15:47:55
24	330.2572237413254	276.8419321591195	-58	21/02/24 15:47:55
25	329.08778489613	275.87564892517275	-59	21/02/24 15:47:55
16	327.98603409324727	290.8054485105832	-67	21/02/24 15:47:55
11	327.4246457091771	282.6323525733639	-62	21/02/24 15:47:55
7	334.07657006354464	270.8835908324035	-60	21/02/24 15:47:55
30	327.70079256672074	268.3508487639297	-65	21/02/24 15:47:55
31	346.4179037622539	268.10202267794875	-66	21/02/24 15:47:55
13	342.0775229118143	267.91244197819304	-62	21/02/24 15:47:55
21	334.5994402908936	265.9434918767382	-64	21/02/24 15:47:55
14	341.6082252010515	265.6547772450898	-66	21/02/24 15:47:55
20	334.99735462161357	264.77807460530994	-68	21/02/24 15:47:55
29	324.8804385762518	264.6870431160569	-68	21/02/24 15:47:55
23	323.42288358729223	275.8341630458992	-67	21/02/24 15:47:55
10	321.1177375667231	282.04747788327467	-69	21/02/24 15:47:55
28	319.76429243151256	284.17285383094054	-70	21/02/24 15:47:55

47	353.57917457908314	286.3943403818769	-67	21/02/24 15:47:56
22	353.27733584284437	275.76541045955213	-66	21/02/24 15:47:56
45	342.3105096677226	291.9842245930836	-67	21/02/24 15:47:56
46	340.76419739931424	294.4321023101609	-66	21/02/24 15:47:56
8	337.0569612312978	272.24137590202855	-58	21/02/24 15:47:56
24	330.2572237413254	276.8419321591195	-60	21/02/24 15:47:56
25	329.08778489613	275.87564892517275	-61	21/02/24 15:47:56
16	327.98603409324727	290.8054485105832	-69	21/02/24 15:47:56
11	327.4246457091771	282.6323525733639	-67	21/02/24 15:47:56
7	334.07657006354464	270.8835908324035	-62	21/02/24 15:47:56
32	356.7839379367616	268.70688981904533	-69	21/02/24 15:47:56
30	327.70079256672074	268.3508487639297	-66	21/02/24 15:47:56
31	346.4179037622539	268.10202267794875	-64	21/02/24 15:47:56
13	342.0775229118143	267.91244197819304	-64	21/02/24 15:47:56
21	334.5994402908936	265.9434918767382	-64	21/02/24 15:47:56
14	341.6082252010515	265.6547772450898	-66	21/02/24 15:47:56
20	334.99735462161357	264.77807460530994	-65	21/02/24 15:47:56
23	323.42288358729223	275.8341630458992	-69	21/02/24 15:47:56
10	321.1177375667231	282.04747788327467	-71	21/02/24 15:47:56

37	359.5903712498935	284.92420131943135	-71	21/02/24 15:47:57
47	353.57917457908314	286.3943403818769	-65	21/02/24 15:47:57
22	353.27733584284437	275.76541045955213	-64	21/02/24 15:47:57
45	342.3105096677226	291.9842245930836	-64	21/02/24 15:47:57
46	340.76419739931424	294.4321023101609	-68	21/02/24 15:47:57
8	337.0569612312978	272.24137590202855	-61	21/02/24 15:47:57
24	330.2572237413254	276.8419321591195	-65	21/02/24 15:47:57
25	329.08778489613	275.87564892517275	-64	21/02/24 15:47:57
16	327.98603409324727	290.8054485105832	-69	21/02/24 15:47:57
11	327.4246457091771	282.6323525733639	-66	21/02/24 15:47:57
7	334.07657006354464	270.8835908324035	-63	21/02/24 15:47:57
32	356.7839379367616	268.70688981904533	-69	21/02/24 15:47:57
30	327.70079256672074	268.3508487639297	-71	21/02/24 15:47:57
31	346.4179037622539	268.10202267794875	-66	21/02/24 15:47:57
13	342.0775229118143	267.91244197819304	-64	21/02/24 15:47:57
21	334.5994402908936	265.9434918767382	-67	21/02/24 15:47:57
14	341.6082252010515	265.6547772450898	-67	21/02/24 15:47:57
20	334.99735462161357	264.77807460530994	-67	21/02/24 15:47:57
23	323.42288358729223	275.8341630458992	-70	21/02/24 15:47:57
10	321.1177375667231	282.04747788327467	-71	21/02/24 15:47:57

37	359.5903712498935	284.92420131943135	-68	21/02/24 15:47:58
47	353.57917457908314	286.3943403818769	-63	21/02/24 15:47:58
22	353.27733584284437	275.76541045955213	-64	21/02/24 15:47:58
45	342.3105096677226	291.9842245930836	-61	21/02/24 15:47:58
46	340.76419739931424	294.4321023101609	-64	21/02/24 15:47:58
8	337.0569612312978	272.24137590202855	-62	21/02/24 15:47:58
24	330.2572237413254	276.8419321591195	-64	21/02/24 15:47:58
25	329.08778489613	275.87564892517275	-66	21/02/24 15:47:58
16	327.98603409324727	290.8054485105832	-69	21/02/24 15:47:58
11	327.4246457091771	282.6323525733639	-67	21/02/24 15:47:58
7	334.07657006354464	270.8835908324035	-66	21/02/24 15:47:58
30	327.70079256672074	268.3508487639297	-71	21/02/24 15:47:58
31	346.4179037622539	268.10202267794875	-65	21/02/24 15:47:58
13	342.0775229118143	267.91244197819304	-64	21/02/24 15:47:58
21	334.5994402908936	265.9434918767382	-69	21/02/24 15:47:58
14	341.6082252010515	265.6547772450898	-69	21/02/24 15:47:58
20	334.99735462161357	264.77807460530994	-71	21/02/24 15:47:58
23	323.42288358729223	275.8341630458992	-68	21/02/24 15:47:58

37	359.5903712498935	284.92420131943135	-68	21/02/24 15:47:59
47	353.57917457908314	286.3943403818769	-63	21/02/24 15:47:59
22	353.27733584284437	275.76541045955213	-67	21/02/24 15:47:59
45	342.3105096677226	291.9842245930836	-57	21/02/24 15:47:59
46	340.76419739931424	294.4321023101609	-60	21/02/24 15:47:59
8	337.0569612312978	272.24137590202855	-63	21/02/24 15:47:59
24	330.2572237413254	276.8419321591195	-65	21/02/24 15:47:59
25	329.08778489613	275.87564892517275	-67	21/02/24 15:47:59
16	327.98603409324727	290.8054485105832	-67	21/02/24 15:47:59
11	327.4246457091771	282.6323525733639	-68	21/02/24 15:47:59
7	334.07657006354464	270.8835908324035	-69	21/02/24 15:47:59
31	346.4179037622539	268.10202267794875	-69	21/02/24 15:47:59
13	342.0775229118143	267.91244197819304	-67	21/02/24 15:47:59
21	334.5994402908936	265.9434918767382	-70	21/02/24 15:47:59
14	341.6082252010515	265.6547772450898	-70	21/02/24 15:47:59

