floorId	partitionId	location_x	location_y	timeStamp
20	956	303.5395461385907	277.4432498605996	21/02/21 12:33:05
20	956	303.7471966984528	277.3532138254566	21/02/21 12:33:05
20	956	303.9959776447614	277.2453439018713	21/02/21 12:33:05
20	956	304.18772910578525	277.16220162045903	21/02/21 12:33:05
20	956	304.3373088621649	277.097344736803	21/02/21 12:33:05
20	956	304.48345820099286	277.0339752615866	21/02/21 12:33:05
20	956	304.7367784224306	276.92413713557835	21/02/21 12:33:05
20	956	304.9674351660306	276.8241257573931	21/02/21 12:33:05
20	956	305.13504090322317	276.7514529167609	21/02/21 12:33:06
20	956	305.3779542290392	276.6461271581672	21/02/21 12:33:06
20	956	305.58473991382647	276.5564661276602	21/02/21 12:33:06
20	956	305.81605655596866	276.4561686214319	21/02/21 12:33:06
20	956	306.05486129703064	276.35262432050223	21/02/21 12:33:06
20	956	306.254962904355	276.26586146582366	21/02/21 12:33:06
20	956	306.49366571631714	276.1623613607392	21/02/21 12:33:06
20	956	306.6755100592143	276.0835147462224	21/02/21 12:33:06
20	956	306.9500583811772	275.96447224336987	21/02/21 12:33:06
20	956	306.9500583811772	275.96447224336987	21/02/21 12:33:07
20	956	307.1859846365509	275.86217603654	21/02/21 12:33:07
20	956	307.4160993658536	275.7623996724975	21/02/21 12:33:07
20	956	307.5691145289694	275.6960532171214	21/02/21 12:33:07
20	956	307.83264630489276	275.5817874224416	21/02/21 12:33:07
20	956	308.01062909350713	275.5046151546607	21/02/21 12:33:07
20	956	308.1966337362823	275.4239646591128	21/02/21 12:33:07
20	956	308.4449499768565	275.316296229142	21/02/21 12:33:07
20	972	308.7070009222774	275.37975154161967	21/02/21 12:33:07
20	972	308.90502138959886	275.4423407073578	21/02/21 12:33:07
20	972	309.1816386438073	275.5297722915969	21/02/21 12:33:08
20	972	309.3518084833371	275.58355859174065	21/02/21 12:33:08
20	972	309.54123590347393	275.6434317167497	21/02/21 12:33:08
20	972	309.7022386082165	275.69432052187034	21/02/21 12:33:08
20	972	309.945509353228	275.77121213405934	21/02/21 12:33:08
20	972	310.1714401915511	275.84262304868065	21/02/21 12:33:08
20	972	310.33912779282304	275.8956247772909	21/02/21 12:33:08
20	972	310.48604675784935	275.94206207529595	21/02/21 12:33:08
20	972	310.48604675784935	275.94206207529595	21/02/21 12:33:08
20	972	310.95647131777685	276.09075115348503	21/02/21 12:33:09
20	972	310.95647131777685	276.09075115348503	21/02/21 12:33:09
20	972	311.15511914233605	276.15353861067587	21/02/21 12:33:09
20	972	311.5306129092377	276.27222251203284	21/02/21 12:33:09
20	972	311.81414732797555	276.3618404336896	21/02/21 12:33:09
20	972	312.07642173567484	276.4447386138344	21/02/21 12:33:09
20	972	312.07642173567484	276.4447386138344	21/02/21 12:33:09
20	972	312.5193364077861	276.58473252555274	21/02/21 12:33:09
20	972	312.5193364077861	276.58473252555274	21/02/21 12:33:09
20	972	312.6723320258525	276.6330904969579	21/02/21 12:33:09
20	972	313.14153564953347	276.78139366866907	21/02/21 12:33:10
20	972	313.400078606147	276.86311243330385	21/02/21 12:33:10
20	972	313.64372402008087	276.9401224686821	21/02/21 12:33:10
20	972	313.86022565411525	277.0085530548657	21/02/21 12:33:10
20	972	314.0546675733075	277.0700111337773	21/02/21 12:33:10
20	972	314.3187952333753	277.15349507922815	21/02/21 12:33:10
20	972	314.4842294526895	277.2057845718825	21/02/21 12:33:10
20	972	314.74671419210966	277.2887492324629	21/02/21 12:33:10
20	972	314.9714679882155	277.35978811437764	21/02/21 12:33:10
20	972	315.244239532461	277.4460041688207	21/02/21 12:33:11
20	972	315.44235595857043	277.5086236646584	21/02/21 12:33:11
20	972	315.6758613124533	277.58242868841484	21/02/21 12:33:11
20	972	315.9194858562644	277.6594321272852	21/02/21 12:33:11
20	972	316.065267714566	277.7055100151635	21/02/21 12:33:11
20	972	316.2117770846826	277.7518178507749	21/02/21 12:33:11
20	972	316.3788080869496	277.8046120453635	21/02/21 12:33:11
20	972	316.5400376791702	277.85557256376796	21/02/21 12:33:11
20	972	316.75075367637413	277.92217445927434	21/02/21 12:33:11
20	972	317.00187626312294	278.0015478362551	21/02/21 12:33:11
20	972	317.2461737723941	278.0787639821617	21/02/21 12:33:12
20	972	317.4701521074803	278.14955776083565	21/02/21 12:33:12
20	972	317.6354660723593	278.2018092441626	21/02/21 12:33:12
20	972	317.8762194084558	278.27790516827986	21/02/21 12:33:12
20	972	318.0489254358131	278.33249309202563	21/02/21 12:33:12
20	972	318.21029059330425	278.3834964591179	21/02/21 12:33:12
20	972	318.41752125332704	278.448996729376	21/02/21 12:33:12
20	972	318.62209921192243	278.51365854908636	21/02/21 12:33:12
20	972	318.894267265244	278.59968385560336	21/02/21 12:33:12
20	972	319.08135234509325	278.6588166272214	21/02/21 12:33:13
20	972	319.3650335272687	278.748480937018	21/02/21 12:33:13
20	972	319.5181480651631	278.7968764959156	21/02/21 12:33:13
20	972	319.67651008284827	278.8469306479212	21/02/21 12:33:13
20	972	319.8617901704198	278.905492908004	21/02/21 12:33:13
20	972	320.0628107705622	278.96903033839834	21/02/21 12:33:13
20	972	320.281685048564	279.03821085618506	21/02/21 12:33:13
20	972	320.50149967410346	279.107688593591	21/02/21 12:33:13
20	972	320.66516193123084	279.15941801467045	21/02/21 12:33:13
20	972	320.9476638282131	279.24870958281355	21/02/21 12:33:14
20	972	321.22594919127573	279.3366684132659	21/02/21 12:33:14
20	972	321.386334311143	279.3873620157257	21/02/21 12:33:14
20	972	321.6696155110409	279.4768999014339	21/02/21 12:33:14
20	972	321.91604513513954	279.55478995388216	21/02/21 12:33:14
20	972	322.16492208456407	279.63345354278607	21/02/21 12:33:14
20	972	322.40133074693046	279.7081762275213	21/02/21 12:33:14
20	972	322.6276475477007	279.7797091349239	21/02/21 12:33:14
20	972	322.78991542900707	279.8309978297464	21/02/21 12:33:14
20	972	323.0548111456456	279.91472453808257	21/02/21 12:33:14
20	972	323.3123241319622	279.996117755654	21/02/21 12:33:15
20	972	323.5840310455453	280.08199730778557	21/02/21 12:33:15
20	972	323.7344093263074	280.12952800633076	21/02/21 12:33:15
20	972	323.92114505822343	280.18855035807155	21/02/21 12:33:15
20	972	324.16026464438505	280.26412989594434	21/02/21 12:33:15
20	972	324.31015987959523	280.3115079162411	21/02/21 12:33:15
20	972	324.4868606248545	280.3673584673517	21/02/21 12:33:15
20	972	324.75360243662544	280.4516686787761	21/02/21 12:33:15
20	972	324.9739636396964	280.5213191752517	21/02/21 12:33:15
20	972	325.1185407393881	280.5670162699861	21/02/21 12:33:16
20	972	325.39812758466604	280.655386465421	21/02/21 12:33:16
20	972	325.6626472249954	280.7389943057292	21/02/21 12:33:16
20	972	325.8921609154141	280.8115376675498	21/02/21 12:33:16
20	972	326.1001164744735	280.87726705970914	21/02/21 12:33:16
20	972	326.2484206454032	280.92414218559657	21/02/21 12:33:16
20	972	326.7659201653931	281.0877104453031	21/02/21 12:33:16
20	972	326.9554704432123	281.1476224024589	21/02/21 12:33:16
20	972	326.9554704432123	281.1476224024589	21/02/21 12:33:16
20	972	327.42509679441423	281.2960591874437	21/02/21 12:33:16
20	972	327.64485361499226	281.3655186541912	21/02/21 12:33:17
20	972	327.64485361499226	281.3655186541912	21/02/21 12:33:17
20	972	328.08768084900953	281.50548492898173	21/02/21 12:33:17
20	972	328.2974166606117	281.57177701308376	21/02/21 12:33:17
20	972	328.49307689678875	281.63362017059217	21/02/21 12:33:17
20	972	328.64570951174505	281.68186340607065	21/02/21 12:33:17
20	972	328.64570951174505	281.68186340607065	21/02/21 12:33:17
20	972	329.00737257612053	281.79617577884585	21/02/21 12:33:17
20	972	329.00737257612053	281.79617577884585	21/02/21 12:33:17
20	972	329.30582000138105	281.8905073174813	21/02/21 12:33:18
20	972	329.51779622094114	281.95750753679226	21/02/21 12:33:18
20	972	329.79370452587307	282.04471504043823	21/02/21 12:33:18
20	972	329.9495072757874	282.0939602738666	21/02/21 12:33:18
20	972	329.9495072757874	282.0939602738666	21/02/21 12:33:18
20	972	330.13154475874944	282.15149763021054	21/02/21 12:33:18
20	972	330.63112801041706	282.1689579586863	21/02/21 12:33:18
20	972	330.63112801041706	282.1689579586863	21/02/21 12:33:18
20	972	330.8268057817902	282.16696929367174	21/02/21 12:33:18
20	972	330.9813295153786	282.16539887542365	21/02/21 12:33:18
20	972	331.30759561037667	282.1620830467324	21/02/21 12:33:19
20	972	331.30759561037667	282.1620830467324	21/02/21 12:33:19
20	972	331.53912630180616	282.15973000998935	21/02/21 12:33:19
20	972	331.92656734751824	282.15579246283005	21/02/21 12:33:19
20	972	332.09290448603264	282.1541019854413	21/02/21 12:33:19
20	972	332.25420054930584	282.1524627402896	21/02/21 12:33:19
20	972	332.4150269287463	282.15082826851506	21/02/21 12:33:19
20	972	332.4150269287463	282.15082826851506	21/02/21 12:33:19
20	972	332.5859624789181	282.14909105766077	21/02/21 12:33:19
20	972	332.7524399475724	282.1473991541027	21/02/21 12:33:20
20	972	332.9044058583846	282.1458547309006	21/02/21 12:33:20
20	972	333.1866561176324	282.142986233309	21/02/21 12:33:20
20	972	333.4507311455147	282.14030244983434	21/02/21 12:33:20
20	972	333.6813164248923	282.13795902127447	21/02/21 12:33:20
20	972	334.0894246705578	282.13381143422555	21/02/21 12:33:20
20	972	334.0894246705578	282.13381143422555	21/02/21 12:33:20
20	972	334.56296906105416	282.1289988223708	21/02/21 12:33:20
20	972	334.7894432169794	282.1266971749868	21/02/21 12:33:20
20	972	335.0796609868772	282.1237477039174	21/02/21 12:33:21
20	972	335.315575053733	282.121350119113	21/02/21 12:33:21
20	972	335.5867090666866	282.118594595468	21/02/21 12:33:21
20	972	335.8070482980938	282.1163552970655	21/02/21 12:33:21
20	972	336.00763487060226	282.1143167441101	21/02/21 12:33:21
20	972	336.2325812235573	282.11203062372385	21/02/21 12:33:21
20	972	336.42837545526635	282.11004077512774	21/02/21 12:33:21
20	972	336.65877810293534	282.1076992026463	21/02/21 12:33:21
20	972	336.82681610805037	282.10599143942136	21/02/21 12:33:21
20	972	336.9826730123249	282.1044074722153	21/02/21 12:33:21
20	972	337.1619562715809	282.1025854239424	21/02/21 12:33:22
20	972	337.369790061734	282.1004732178169	21/02/21 12:33:22
20	972	337.6127063964763	282.0980044692566	21/02/21 12:33:22
20	972	337.8525997800922	282.09556644282225	21/02/21 12:33:22
20	972	338.04570129965526	282.09360396014716	21/02/21 12:33:22
20	972	338.2875953008945	282.0911456015195	21/02/21 12:33:22
20	972	338.466085799123	282.08933161004376	21/02/21 12:33:22
20	972	338.62012987025946	282.0877660665851	21/02/21 12:33:22
20	972	338.9158392281368	282.0847607847365	21/02/21 12:33:22
20	972	338.9158392281368	282.0847607847365	21/02/21 12:33:23
20	972	339.3963583248164	282.0798772892342	21/02/21 12:33:23
20	972	339.3963583248164	282.0798772892342	21/02/21 12:33:23
20	972	339.69628522385085	282.07682914469103	21/02/21 12:33:23
20	972	339.69628522385085	282.07682914469103	21/02/21 12:33:23
20	972	340.0939920439704	282.0727872668953	21/02/21 12:33:23
20	972	340.0939920439704	282.0727872668953	21/02/21 12:33:23
20	972	340.5022067467956	282.06863859792674	21/02/21 12:33:23
20	972	340.7263844175435	282.0663602896256	21/02/21 12:33:23
20	972	340.934602879207	282.0642441740996	21/02/21 12:33:23
20	972	341.1428237263085	282.0621280343305	21/02/21 12:33:24
20	972	341.3992436804413	282.0595220490505	21/02/21 12:33:24
20	972	341.3992436804413	282.0595220490505	21/02/21 12:33:24
20	972	341.5523862501016	282.0579656675137	21/02/21 12:33:24
20	972	341.84917189557484	282.0549494473992	21/02/21 12:33:24
20	972	342.1121133401338	282.0522771844845	21/02/21 12:33:24
20	972	342.3574434447726	282.04978390488156	21/02/21 12:33:24
20	972	342.8201347515873	282.0450815924628	21/02/21 12:33:24
20	972	343.11928455261443	282.0420413455342	21/02/21 12:33:24
20	972	343.11928455261443	282.0420413455342	21/02/21 12:33:24
20	972	343.6336376297141	282.0368139967026	21/02/21 12:33:25
20	972	343.89932529598934	282.03411382405136	21/02/21 12:33:25
20	972	344.1530924424838	282.03153479914454	21/02/21 12:33:25
20	972	344.31424587586923	282.0298970035344	21/02/21 12:33:25
20	972	344.5003552165038	282.0280055820817	21/02/21 12:33:25
20	972	344.5003552165038	282.0280055820817	21/02/21 12:33:25
20	972	344.91625103882944	282.02377885021656	21/02/21 12:33:25
20	972	344.91625103882944	282.02377885021656	21/02/21 12:33:25
20	972	345.3979104252954	282.0188837659968	21/02/21 12:33:25
20	972	345.5488049573726	282.01735023117203	21/02/21 12:33:26
20	972	345.79304519948346	282.0148680277964	21/02/21 12:33:26
20	972	346.01409249466514	282.0126215333714	21/02/21 12:33:26
20	972	346.3097380318076	282.0096169001302	21/02/21 12:33:26
20	972	346.59117321211363	282.0067566861518	21/02/21 12:33:26
20	972	346.59117321211363	282.0067566861518	21/02/21 12:33:26
20	972	346.88629649411	282.0037573605679	21/02/21 12:33:26
20	972	347.074753711778	282.0018420777389	21/02/21 12:33:26
20	972	347.5351791142613	281.99716279361115	21/02/21 12:33:26
20	972	347.71472314219886	281.995338095157	21/02/21 12:33:26
20	972	347.71472314219886	281.995338095157	21/02/21 12:33:27
20	972	348.09015462359156	281.9915226006981	21/02/21 12:33:27
20	972	348.2962402433089	281.9894281611557	21/02/21 12:33:27
20	972	348.51877720020104	281.98716652736096	21/02/21 12:33:27
20	972	348.77868408496283	281.9845251045507	21/02/21 12:33:27
20	972	348.77868408496283	281.9845251045507	21/02/21 12:33:27
20	972	349.11347810833166	281.98112260687975	21/02/21 12:33:27
20	972	349.11347810833166	281.98112260687975	21/02/21 12:33:27
20	972	349.49612181352546	281.9772338148917	21/02/21 12:33:27
20	972	349.6551789978474	281.9756173233732	21/02/21 12:33:28
20	972	349.88542711139615	281.9732773214156	21/02/21 12:33:28
20	972	349.88542711139615	281.9732773214156	21/02/21 12:33:28
20	972	350.1093238429303	281.97100186828794	21/02/21 12:33:28
20	972	350.53134423750714	281.9667128926509	21/02/21 12:33:28
20	972	350.69497710495443	281.96504989865605	21/02/21 12:33:28
20	972	350.87680171906504	281.96320202269993	21/02/21 12:33:28
20	947	351.16145341260284	281.94457706493256	21/02/21 12:33:28
20	947	351.4419886066037	281.89693885724375	21/02/21 12:33:28
20	947	351.6760621345886	281.85719039224165	21/02/21 12:33:29
20	947	351.6760621345886	281.85719039224165	21/02/21 12:33:29
20	947	352.0596313647131	281.79205578154586	21/02/21 12:33:29
20	947	352.29068637635226	281.75281989646834	21/02/21 12:33:29
20	947	352.50547096903705	281.71634692176326	21/02/21 12:33:29
20	947	352.70636504728316	281.68223272137914	21/02/21 12:33:29
20	947	352.8660375081986	281.6551184411821	21/02/21 12:33:29
20	947	353.15483481521176	281.60607722857964	21/02/21 12:33:29
20	947	353.15483481521176	281.60607722857964	21/02/21 12:33:29
20	947	353.6240483238816	281.52639920224135	21/02/21 12:33:29
20	947	353.6240483238816	281.52639920224135	21/02/21 12:33:30
20	947	353.8411287002669	281.48953637619826	21/02/21 12:33:30
20	947	354.360870193513	281.4012780979885	21/02/21 12:33:30
20	947	354.360870193513	281.4012780979885	21/02/21 12:33:30
20	947	354.6493669244787	281.35228792676867	21/02/21 12:33:30
20	947	354.88649957507175	281.3120199864164	21/02/21 12:33:30
20	947	355.12701442689917	281.2711777081261	21/02/21 12:33:30
20	947	355.5940170582852	281.1918751150079	21/02/21 12:33:30
20	947	355.80010935838675	281.1568781948166	21/02/21 12:33:30
20	947	355.80010935838675	281.1568781948166	21/02/21 12:33:31
20	947	355.9924380429676	281.1242185000029	21/02/21 12:33:31
20	947	356.26777351799257	281.0774632663501	21/02/21 12:33:31
20	947	356.5449339989529	281.030398125015	21/02/21 12:33:31
20	947	357.0524529005349	280.94421538803016	21/02/21 12:33:31
20	947	357.0524529005349	280.94421538803016	21/02/21 12:33:31
20	947	357.28521499636656	280.90468961978274	21/02/21 12:33:31
20	947	357.28521499636656	280.90468961978274	21/02/21 12:33:31
20	947	357.4404205981355	280.87833386531895	21/02/21 12:33:31
20	947	357.62368211808695	280.84721388274454	21/02/21 12:33:31
20	947	357.82083451987097	280.8137350634613	21/02/21 12:33:32
20	947	357.98173765814977	280.78641179963194	21/02/21 12:33:32
20	947	357.98173765814977	280.78641179963194	21/02/21 12:33:32
20	947	358.49482106476154	280.6992841436068	21/02/21 12:33:32
20	947	358.6871087832808	280.6666314053168	21/02/21 12:33:32
20	947	358.9671549224005	280.619076244955	21/02/21 12:33:32
20	947	359.2500260942008	280.5710413604928	21/02/21 12:33:32
20	947	359.4798623823051	280.5320124291456	21/02/21 12:33:32
20	947	359.6317230283198	280.50622468789487	21/02/21 12:33:32
20	947	359.8943028172857	280.4616355212265	21/02/21 12:33:33
20	947	360.08193966985016	280.42977255521123	21/02/21 12:33:33
20	963	360.2807133468145	280.380789472675	21/02/21 12:33:33
20	963	360.5131220180752	280.29217164944015	21/02/21 12:33:33
20	963	360.5131220180752	280.29217164944015	21/02/21 12:33:33
20	963	360.76956802381727	280.1943883495191	21/02/21 12:33:33
20	963	361.01887992489014	280.0993252958913	21/02/21 12:33:33
20	963	361.19604531604875	280.031771829698	21/02/21 12:33:33
20	963	361.3794135708516	279.96185320100454	21/02/21 12:33:33
20	963	361.75007882570276	279.8205179063465	21/02/21 12:33:33
20	963	361.93606596732656	279.749600691636	21/02/21 12:33:34
