floorId	partitionId	location_x	location_y	timeStamp
20	903	330.1259927668153	264.80227208326863	21/02/21 12:26:18
20	903	330.1259927668153	264.80227208326863	21/02/21 12:26:19
20	903	330.1259927668153	264.80227208326863	21/02/21 12:26:20
20	903	327.6380754019837	266.9902274241022	21/02/21 12:26:21
20	913	331.24535024056297	264.72849209942825	21/02/21 12:26:22
20	913	334.7105270463214	264.7624571054217	21/02/21 12:26:23
20	971	337.9980803454893	264.7948126545373	21/02/21 12:26:24
20	971	339.3755271076506	266.5060738980819	21/02/21 12:26:25
20	967	347.02545627575296	269.14709229356157	21/02/21 12:26:26
20	991	349.8232048428036	270.0522803478262	21/02/21 12:26:27
20	947	350.16717979015334	274.80475712710944	21/02/21 12:26:28
20	947	350.47000855666397	273.9422901622144	21/02/21 12:26:29
