floorId	partitionId	location_x	location_y	timeStamp
3	51	301.7497359498304	290.0736322823413	20/04/28 05:08:49
3	51	301.68107269959614	290.19792150171054	20/04/28 05:08:49
3	51	301.40448781335147	290.1600174969962	20/04/28 05:08:49
3	51	301.5507427230656	290.18999877098497	20/04/28 05:08:49
3	51	301.47782123169003	290.14386077459653	20/04/28 05:08:49
3	51	301.4747789849404	289.96201078291307	20/04/28 05:08:49
3	51	301.57169389311645	289.99505938971487	20/04/28 05:08:49
3	51	301.5727589668734	290.0009473344497	20/04/28 05:08:50
3	51	301.6753076449436	289.85934315616976	20/04/28 05:08:50
3	51	301.73768033749514	289.9101909834267	20/04/28 05:08:50
3	51	301.6427041067089	289.9558248554346	20/04/28 05:08:50
3	51	301.73174700421174	289.89405000194233	20/04/28 05:08:50
3	51	301.7842381849403	289.99287251692886	20/04/28 05:08:50
3	51	301.6594220888366	289.93605393675006	20/04/28 05:08:50
3	51	301.70089843932	289.7389768130536	20/04/28 05:08:50
3	51	301.75961196159466	289.57039945829257	20/04/28 05:08:50
3	51	301.98956431460584	289.5474725612559	20/04/28 05:08:50
3	51	301.9102472811051	289.52760745987365	20/04/28 05:08:51
3	51	301.9946823585398	289.66230087113695	20/04/28 05:08:51
3	51	301.95505928737555	289.6772820710315	20/04/28 05:08:51
3	51	302.1897951908716	289.574096923011	20/04/28 05:08:51
3	51	302.15152103580846	289.5893292170338	20/04/28 05:08:51
3	51	302.0348208894361	289.7460434704238	20/04/28 05:08:51
3	51	302.04204679712757	289.53746219981423	20/04/28 05:08:51
3	51	302.0301674602764	289.47067867151816	20/04/28 05:08:51
3	51	301.86854462914147	289.40783309049124	20/04/28 05:08:51
3	51	301.8082737743902	289.4296213482001	20/04/28 05:08:52
3	51	301.9356710260819	289.5998498098582	20/04/28 05:08:52
3	51	301.9286288087326	289.5643931837763	20/04/28 05:08:52
3	51	301.8485311045931	289.47065601276154	20/04/28 05:08:52
3	51	301.8485311045931	289.47065601276154	20/04/28 05:08:52
3	51	301.8485311045931	289.47065601276154	20/04/28 05:08:52
3	51	301.8485311045931	289.47065601276154	20/04/28 05:08:52
3	51	302.0597935654971	289.4826147589537	20/04/28 05:08:52
3	51	301.8712325429563	289.57279089708527	20/04/28 05:08:52
3	51	301.98752946916625	289.6016975287519	20/04/28 05:08:52
3	51	302.28214075341526	289.54605068966805	20/04/28 05:08:53
3	51	302.28409967183615	289.54336343821996	20/04/28 05:08:53
3	51	302.2703980380442	289.5891074809911	20/04/28 05:08:53
3	51	302.360485572755	289.54169827043023	20/04/28 05:08:53
3	51	302.36471392635485	289.5385825111739	20/04/28 05:08:53
3	51	302.245573092864	289.5978302335825	20/04/28 05:08:53
3	51	302.35461586285527	289.53002191213	20/04/28 05:08:53
3	51	302.3754302795941	289.4993693183119	20/04/28 05:08:53
3	51	302.5468322851693	289.3357085635819	20/04/28 05:08:53
3	51	302.49503564345855	289.30250732802995	20/04/28 05:08:53
3	51	302.5049433205517	289.3011961780358	20/04/28 05:08:54
3	51	302.2402778983782	289.4173380424167	20/04/28 05:08:54
3	51	302.2402778983782	289.4173380424167	20/04/28 05:08:54
3	51	302.2402778983782	289.4173380424167	20/04/28 05:08:54
3	51	302.2162029229525	289.41334867378623	20/04/28 05:08:54
3	51	302.1275044390047	289.41106631973605	20/04/28 05:08:54
3	51	302.20649603189656	289.54629237142683	20/04/28 05:08:54
3	51	302.2185201472545	289.6065007336439	20/04/28 05:08:54
3	51	302.1951557328287	289.6831434372035	20/04/28 05:08:54
3	51	302.210728844457	289.69226918319276	20/04/28 05:08:54
3	51	302.19106401733137	289.5128268126758	20/04/28 05:08:55
3	51	302.3534059591223	289.4487069586481	20/04/28 05:08:55
3	51	302.22064709091075	289.5960420872687	20/04/28 05:08:55
3	51	302.2076853222801	289.6973219504208	20/04/28 05:08:55
3	51	302.20081564416586	289.758278325039	20/04/28 05:08:55
3	51	302.2512676421276	289.71393567378055	20/04/28 05:08:55
3	51	302.25451423603306	289.60885774041446	20/04/28 05:08:55
3	51	302.5058465219665	289.5222638132062	20/04/28 05:08:55
3	51	302.56749743404845	289.67610374722125	20/04/28 05:08:55
3	51	302.545479489832	289.6523841976852	20/04/28 05:08:56
3	51	302.3876559790886	289.7809248031439	20/04/28 05:08:56
3	51	302.24507395942203	289.6613073357408	20/04/28 05:08:56
3	51	302.0663509365879	289.8336893111885	20/04/28 05:08:56
3	51	302.0673970374267	289.7456594069919	20/04/28 05:08:56
3	51	302.04752597937187	289.76034902487703	20/04/28 05:08:56
3	51	302.16177234696255	289.62991785925567	20/04/28 05:08:56
3	51	302.0936957654072	289.42628004826986	20/04/28 05:08:56
3	51	302.0304082045806	289.41641723280685	20/04/28 05:08:56
3	51	301.9360490375475	289.2864746524189	20/04/28 05:08:56
3	51	301.8500231662943	289.2699649728142	20/04/28 05:08:57
3	51	301.75801198110923	289.3259978990191	20/04/28 05:08:57
3	51	301.734378157325	289.31288347850915	20/04/28 05:08:57
3	51	301.8281809038596	289.39525787977726	20/04/28 05:08:57
3	51	301.8370018147241	289.3864507587863	20/04/28 05:08:57
3	51	301.9167139715955	289.4835554435633	20/04/28 05:08:57
3	51	301.934771105723	289.45735242424394	20/04/28 05:08:57
3	51	301.8954114169551	289.4759930871684	20/04/28 05:08:57
3	51	301.9243904252186	289.39703007797556	20/04/28 05:08:57
3	51	301.6413629997263	289.3184555574542	20/04/28 05:08:57
3	51	301.5453034859158	289.27881215782656	20/04/28 05:08:58
3	51	301.63978928318	289.25438421720565	20/04/28 05:08:58
3	51	301.3776135530938	289.39336373706794	20/04/28 05:08:58
3	51	301.5466219309433	289.34298544068145	20/04/28 05:08:58
3	51	301.54250013900327	289.06697791296926	20/04/28 05:08:58
3	51	301.3517195578282	289.12686131207715	20/04/28 05:08:58
3	51	301.5153863597536	289.0720313022433	20/04/28 05:08:58
3	51	301.46487311861887	288.95572080087896	20/04/28 05:08:58
3	51	301.38913206323735	289.1607665179964	20/04/28 05:08:58
3	51	301.60908989823014	289.0307976138272	20/04/28 05:08:59
3	51	301.4293540710579	289.0647127979476	20/04/28 05:08:59
3	51	301.43930606271493	289.0496086436264	20/04/28 05:08:59
3	51	301.4103412608594	289.1258253859525	20/04/28 05:08:59
3	51	301.56575571834645	289.01160715171403	20/04/28 05:08:59
3	51	301.30199201058156	289.0571149428609	20/04/28 05:08:59
3	51	301.2486269455469	288.9165904045758	20/04/28 05:08:59
3	51	301.3338327198605	288.9464291135187	20/04/28 05:08:59
3	51	301.3272147885407	288.92158110450754	20/04/28 05:08:59
3	51	301.22084116918955	289.1488605446244	20/04/28 05:08:59
3	51	301.18685193572395	289.14733039230345	20/04/28 05:09:00
3	51	301.0984165775141	288.9162908675997	20/04/28 05:09:00
3	51	301.34814120780857	289.01079217743415	20/04/28 05:09:00
3	51	301.3416124662131	289.054540974489	20/04/28 05:09:00
3	51	301.3397353726925	289.03561458877164	20/04/28 05:09:00
3	51	301.1371944323183	289.0968505937095	20/04/28 05:09:00
3	51	301.006126511746	289.25992065672125	20/04/28 05:09:00
3	51	301.2030405759701	289.31787906290725	20/04/28 05:09:00
3	51	301.198660922647	289.33163901251953	20/04/28 05:09:00
3	51	301.2347013442232	289.3189921683666	20/04/28 05:09:00
3	51	301.2347013442232	289.3189921683666	20/04/28 05:09:01
3	51	301.2347013442232	289.3189921683666	20/04/28 05:09:01
3	51	301.19169628414414	289.2446202217792	20/04/28 05:09:01
3	51	301.19867954618394	289.16776341777995	20/04/28 05:09:01
3	51	301.2057026368966	289.18456534429976	20/04/28 05:09:01
3	51	301.3928824194264	289.16369624425084	20/04/28 05:09:01
3	51	301.3964008017647	289.1138274605443	20/04/28 05:09:01
3	51	301.4148680721224	289.07404814329277	20/04/28 05:09:01
3	51	301.53155511876537	289.11537952094403	20/04/28 05:09:01
3	51	301.62863361781535	289.2806050150762	20/04/28 05:09:02
3	51	301.39103598006125	289.12724160313087	20/04/28 05:09:02
3	51	301.39103598006125	289.12724160313087	20/04/28 05:09:02
3	51	301.24965177438185	289.11011690582365	20/04/28 05:09:02
3	51	301.24965177438185	289.11011690582365	20/04/28 05:09:02
3	51	301.30196287626285	289.4016491556109	20/04/28 05:09:02
3	51	301.26838215941126	289.5859904408105	20/04/28 05:09:02
3	51	301.2818204815718	289.61260392395366	20/04/28 05:09:02
3	51	301.30944261904494	289.6353441951622	20/04/28 05:09:02
3	51	301.48776908158277	289.6985081675754	20/04/28 05:09:03
3	51	301.48776908158277	289.6985081675754	20/04/28 05:09:03
3	51	301.4337904310797	289.7852111087188	20/04/28 05:09:03
3	51	301.4214490354387	289.7607680318244	20/04/28 05:09:03
3	51	301.3254138307594	289.85284689437856	20/04/28 05:09:03
3	51	301.1930700935156	289.76490387374326	20/04/28 05:09:03
3	51	301.1930700935156	289.76490387374326	20/04/28 05:09:03
3	51	301.1989946537475	289.653405116661	20/04/28 05:09:03
3	51	301.2283975373664	289.5729617001906	20/04/28 05:09:03
3	51	300.87281293634953	289.467111511435	20/04/28 05:09:03
3	51	300.69628091286046	289.4131449258034	20/04/28 05:09:04
3	51	300.69628091286046	289.4131449258034	20/04/28 05:09:04
3	51	300.6794121607603	289.55318218097875	20/04/28 05:09:04
3	51	300.7528150358477	289.47547635007754	20/04/28 05:09:04
3	51	300.97762279521055	289.63508350562796	20/04/28 05:09:04
3	51	300.90909315246887	289.49323251873466	20/04/28 05:09:04
3	51	300.95489283034146	289.6159454140413	20/04/28 05:09:04
3	51	300.9131820097123	289.36348965190484	20/04/28 05:09:04
3	51	300.9439091199903	289.3516889265472	20/04/28 05:09:04
3	51	301.09587166981237	289.24926415293135	20/04/28 05:09:04
3	51	301.09430260828697	289.1516666977217	20/04/28 05:09:05
3	51	300.88858431254954	289.2444159872359	20/04/28 05:09:05
3	51	300.73065990080914	289.09890194262874	20/04/28 05:09:05
3	51	300.72136561480283	289.0724345070228	20/04/28 05:09:05
3	51	300.65200865043715	289.1717398029969	20/04/28 05:09:05
3	51	300.81605286115456	289.1192247362706	20/04/28 05:09:05
3	51	300.67223034552916	289.2072137305079	20/04/28 05:09:05
3	51	300.65860228534484	289.2137761214018	20/04/28 05:09:05
3	51	300.7618381025055	289.12877010010453	20/04/28 05:09:05
3	51	300.7614007604452	289.125940417501	20/04/28 05:09:06
3	51	300.8383510485369	289.1689134163356	20/04/28 05:09:06
3	51	300.86065274343474	289.1465492375222	20/04/28 05:09:06
3	51	300.6071123874561	289.2976680856991	20/04/28 05:09:06
3	51	300.5856716507439	289.236304501011	20/04/28 05:09:06
3	51	300.64804567799916	289.29569464019136	20/04/28 05:09:06
3	51	300.67459556235445	289.0458659873526	20/04/28 05:09:06
3	51	300.6579581836255	289.07663182269613	20/04/28 05:09:06
3	51	300.6991433080547	288.99318951450203	20/04/28 05:09:06
3	51	300.6850603480608	288.99495347718994	20/04/28 05:09:06
3	51	300.86514429320164	288.9751968892301	20/04/28 05:09:07
3	51	300.7108874454185	288.72928245098814	20/04/28 05:09:07
3	51	300.78529037457673	288.7495567958662	20/04/28 05:09:07
3	51	300.6510184000136	288.7288804875523	20/04/28 05:09:07
3	51	300.6300252464372	288.84585681221864	20/04/28 05:09:07
3	51	300.6360738384239	288.86426544775577	20/04/28 05:09:07
3	51	300.8654298148582	289.0548932476652	20/04/28 05:09:07
3	51	300.6624082413361	289.24080640916355	20/04/28 05:09:07
3	51	300.66288435802005	289.25091402580205	20/04/28 05:09:07
3	51	300.80821465744384	289.20460651925885	20/04/28 05:09:07
3	51	300.8472432702075	289.24997184517156	20/04/28 05:09:08
3	51	300.7663742813125	289.28027237526	20/04/28 05:09:08
3	51	300.8849748969068	289.23962636771085	20/04/28 05:09:08
3	51	300.8137554447075	289.30276398731155	20/04/28 05:09:08
3	51	300.80609037282926	289.1211238293385	20/04/28 05:09:08
3	51	300.608813360653	288.910296937604	20/04/28 05:09:08
3	51	300.6706597297275	288.8741498185904	20/04/28 05:09:08
3	51	300.542984213343	288.89582094476515	20/04/28 05:09:08
3	51	300.78981326175125	288.822137030548	20/04/28 05:09:08
3	51	300.78981326175125	288.822137030548	20/04/28 05:09:09
3	51	300.8623391709683	289.02253215562894	20/04/28 05:09:09
3	51	300.9352357339573	288.7486847274477	20/04/28 05:09:09
3	51	300.9090740412258	288.6710472605105	20/04/28 05:09:09
3	51	301.0263442802439	288.7087565801624	20/04/28 05:09:09
3	51	301.0325670597738	288.96930682020474	20/04/28 05:09:09
3	51	301.13990490338534	289.00185589577865	20/04/28 05:09:09
3	51	301.29560689060696	288.99716693750594	20/04/28 05:09:09
3	51	301.1236724888598	289.21318447367	20/04/28 05:09:09
3	51	301.1737779758826	289.25279362669295	20/04/28 05:09:09
3	51	301.3569753720566	289.54150666262245	20/04/28 05:09:10
3	51	301.37856830024367	289.5617103685536	20/04/28 05:09:10
3	51	301.19484771709483	289.58449177053154	20/04/28 05:09:10
3	51	301.1962555168898	289.5822578978072	20/04/28 05:09:10
3	51	301.18316451970406	289.5888854353956	20/04/28 05:09:10
3	51	301.16149655484776	289.61005267627064	20/04/28 05:09:10
3	51	301.26072886579664	289.5702106472686	20/04/28 05:09:10
3	51	301.371018022208	289.7822678801235	20/04/28 05:09:10
3	51	301.3442783365672	289.7884413720476	20/04/28 05:09:10
3	51	301.3542896297436	289.78411917290055	20/04/28 05:09:11
3	51	301.3843251738383	290.0392085515928	20/04/28 05:09:11
3	51	301.4363286707074	289.93740439017455	20/04/28 05:09:11
3	51	301.217147152945	289.9145624314499	20/04/28 05:09:11
3	51	301.2561897364295	289.9658468711243	20/04/28 05:09:11
3	51	301.55106004960135	289.9669881900604	20/04/28 05:09:11
3	51	301.6654213496952	290.06104853688953	20/04/28 05:09:11
3	51	301.56451265369594	290.01586799611624	20/04/28 05:09:11
3	51	301.48767241156685	289.9758272904119	20/04/28 05:09:11
3	51	301.3025171560489	290.1769303253074	20/04/28 05:09:11
3	51	301.2045699273642	290.1153625617936	20/04/28 05:09:12
3	51	301.371374808945	290.0777757680713	20/04/28 05:09:12
3	51	301.66919395935975	290.07430620727126	20/04/28 05:09:12
3	51	301.60024723634683	290.33305784831026	20/04/28 05:09:12
3	51	301.67821335472706	290.4039688297256	20/04/28 05:09:12
3	51	301.6770780901302	290.45259532475205	20/04/28 05:09:12
3	51	301.655295403316	290.6824048408475	20/04/28 05:09:12
3	51	301.5934261504234	290.43381724660645	20/04/28 05:09:12
3	51	301.3681260259006	290.539096376295	20/04/28 05:09:12
3	51	301.2140146668894	290.746247645045	20/04/28 05:09:13
3	51	301.1602562221339	290.68918213030287	20/04/28 05:09:13
3	51	301.4274586704284	290.65303204909236	20/04/28 05:09:13
3	51	301.17870959204225	290.703137261048	20/04/28 05:09:13
3	51	301.2220852196345	290.6308022857781	20/04/28 05:09:13
3	51	301.33741124911245	290.7009111515565	20/04/28 05:09:13
3	51	301.302967601292	290.67856564326576	20/04/28 05:09:13
3	51	301.20793862845	290.63245574877294	20/04/28 05:09:13
3	51	301.21806680160404	290.6277052211973	20/04/28 05:09:13
3	51	301.2064841000051	290.6201476159239	20/04/28 05:09:13
3	51	301.1826421740482	290.65320757165557	20/04/28 05:09:14
3	51	301.21594008327656	290.63506650582667	20/04/28 05:09:14
3	51	301.25341455584726	290.65171113329103	20/04/28 05:09:14
3	51	301.36809866616454	290.653967999908	20/04/28 05:09:14
3	51	301.36986256243097	290.65838596288893	20/04/28 05:09:14
3	51	301.4629760050695	290.73468081805197	20/04/28 05:09:14
3	51	301.4629760050695	290.73468081805197	20/04/28 05:09:14
3	51	301.4629760050695	290.73468081805197	20/04/28 05:09:14
3	51	301.45340824165135	290.74454965591275	20/04/28 05:09:14
3	51	301.5034952265743	290.74955692134847	20/04/28 05:09:14
3	51	301.51704263143733	290.7570087284017	20/04/28 05:09:15
3	51	301.5245202345182	290.7661202360836	20/04/28 05:09:15
3	51	301.42819642588546	290.74933075973064	20/04/28 05:09:15
3	51	301.181011773762	290.8552520095293	20/04/28 05:09:15
3	51	301.26911208565616	290.8612111417579	20/04/28 05:09:15
3	51	301.17436784317886	291.0158868154759	20/04/28 05:09:15
3	51	301.2929427383892	290.9602267262891	20/04/28 05:09:15
3	51	301.5310499828206	291.12505144625703	20/04/28 05:09:15
3	51	301.40996169545195	291.3060971904753	20/04/28 05:09:15
3	51	301.26113668261695	291.44593250696806	20/04/28 05:09:16
3	51	301.2003644372829	291.5629827378592	20/04/28 05:09:16
3	51	301.09404549781806	291.732016409511	20/04/28 05:09:16
3	51	301.1399903508923	291.80474544666873	20/04/28 05:09:16
3	51	301.2824683511517	291.7287840228576	20/04/28 05:09:16
3	51	301.17443479746146	291.5095007415207	20/04/28 05:09:16
3	51	301.15046514677067	291.5492362785079	20/04/28 05:09:16
3	51	301.17028293969264	291.4580649915145	20/04/28 05:09:16
3	51	301.27070400776074	291.50688848960516	20/04/28 05:09:16
3	51	301.30977971960306	291.4057239911671	20/04/28 05:09:16
3	51	301.3864695318811	291.6743452641734	20/04/28 05:09:17
3	51	301.46435018567286	291.48337532633826	20/04/28 05:09:17
3	51	301.47258378703725	291.46181601387724	20/04/28 05:09:17
3	51	301.5102827038005	291.7223612589473	20/04/28 05:09:17
3	51	301.47223419616137	291.5887349285903	20/04/28 05:09:17
3	51	301.5150626417551	291.7400898075943	20/04/28 05:09:17
3	51	301.55932676887574	291.57366485590046	20/04/28 05:09:17
3	51	301.5135802361819	291.7720561402014	20/04/28 05:09:17
3	51	301.4546578841057	291.802265114654	20/04/28 05:09:17
3	51	301.1968564310038	291.6734316990873	20/04/28 05:09:17
3	51	301.17178048815003	291.7267145081464	20/04/28 05:09:18
3	51	301.1779128001234	291.7237168023961	20/04/28 05:09:18
3	51	301.14929169381054	291.7115499432419	20/04/28 05:09:18
3	51	301.2562726210752	291.8950644998532	20/04/28 05:09:18
3	51	301.307006503076	292.0254668319834	20/04/28 05:09:18
3	51	301.43984341294714	291.8438355839916	20/04/28 05:09:18
3	51	301.5641513569439	291.9361536876584	20/04/28 05:09:18
3	51	301.5745220143078	291.85828472527663	20/04/28 05:09:18
3	51	301.5372607012886	291.83628854176317	20/04/28 05:09:18
3	51	301.7182094411129	291.91978047904365	20/04/28 05:09:19
3	51	301.73420017536836	291.90323273812425	20/04/28 05:09:19
3	51	301.7882305823854	292.0677428478781	20/04/28 05:09:19
3	51	301.7882305823854	292.0677428478781	20/04/28 05:09:19
