floorId	partitionId	location_x	location_y	timeStamp
3	14	325.86848871342477	268.57487977953787	20/04/28 05:14:10
3	14	325.71449788200874	266.8660387296905	20/04/28 05:14:11
3	14	325.86848871342477	268.57487977953787	20/04/28 05:14:12
3	14	325.71449788200874	266.8660387296905	20/04/28 05:14:13
3	14	325.71449788200874	266.8660387296905	20/04/28 05:14:14
3	14	325.71449788200874	266.8660387296905	20/04/28 05:14:15
3	NULL	328.7589326730361	266.5344039090584	20/04/28 05:14:16
3	14	325.86848871342477	268.57487977953787	20/04/28 05:14:17
3	14	325.71449788200874	266.8660387296905	20/04/28 05:14:18
3	14	325.71449788200874	266.8660387296905	20/04/28 05:14:19
3	14	325.71449788200874	266.8660387296905	20/04/28 05:14:20
3	14	325.71449788200874	266.8660387296905	20/04/28 05:14:21
3	14	325.71449788200874	266.8660387296905	20/04/28 05:14:22
3	14	325.71449788200874	266.8660387296905	20/04/28 05:14:23
3	14	325.86848871342477	268.57487977953787	20/04/28 05:14:24
3	14	325.86848871342477	268.57487977953787	20/04/28 05:14:25
3	14	325.71449788200874	266.8660387296905	20/04/28 05:14:26
3	NULL	328.7589326730361	266.5344039090584	20/04/28 05:14:27
3	14	325.86848871342477	268.57487977953787	20/04/28 05:14:28
3	NULL	328.7589326730361	266.5344039090584	20/04/28 05:14:29
3	14	325.71449788200874	266.8660387296905	20/04/28 05:14:30
3	NULL	328.7589326730361	266.5344039090584	20/04/28 05:14:31
3	14	325.71449788200874	266.8660387296905	20/04/28 05:14:32
3	NULL	328.7589326730361	266.5344039090584	20/04/28 05:14:33
3	14	325.71449788200874	266.8660387296905	20/04/28 05:14:34
3	54	329.0533935951116	265.20577071730946	20/04/28 05:14:35
3	54	329.0533935951116	265.2057707173094	20/04/28 05:14:36
3	28	332.6477860802388	265.03642994070896	20/04/28 05:14:37
3	54	332.9065526505472	263.50534437986465	20/04/28 05:14:38
3	54	332.9065526505472	263.50534437986465	20/04/28 05:14:39
3	54	334.4407240787428	261.4032786809491	20/04/28 05:14:40
3	NULL	337.70753542622793	260.45953294809686	20/04/28 05:14:41
3	54	339.3775199660886	260.697329100326	20/04/28 05:14:42
3	54	345.98250818917177	261.859258749847	20/04/28 05:14:43
3	54	345.98250818917177	261.859258749847	20/04/28 05:14:44
3	54	349.17477120857285	262.4807721885283	20/04/28 05:14:45
3	54	350.89456573837674	262.47535273189357	20/04/28 05:14:46
3	54	350.89456573837674	262.47535273189357	20/04/28 05:14:47
3	54	354.93110780732565	263.85962413987545	20/04/28 05:14:48
3	8	357.87501606482897	266.0533751351783	20/04/28 05:14:49
3	54	358.23287936641947	263.00617074250107	20/04/28 05:14:50
3	54	359.56855835216805	263.22793628113516	20/04/28 05:14:51
3	46	361.6170319482885	264.17422801455785	20/04/28 05:14:52
3	54	365.2339908031949	263.4272252913235	20/04/28 05:14:53
3	54	367.80245440868674	262.5455232582413	20/04/28 05:14:54
3	54	368.9169651830857	261.65782172430613	20/04/28 05:14:55
3	54	372.48785670166836	262.3595943162643	20/04/28 05:14:56
3	54	372.48785670166836	262.3595943162643	20/04/28 05:14:57
3	54	372.48785670166836	262.3595943162643	20/04/28 05:14:58
3	15	379.8755906118027	262.6421307240284	20/04/28 05:14:59
3	15	379.8755906118027	262.6421307240284	20/04/28 05:15:00
3	15	380.97239583354167	266.94453563659977	20/04/28 05:15:01
1	33	381.6109766893215	266.73786054806715	20/04/28 05:15:02
1	86	377.91614244309534	266.0609018455502	20/04/28 05:15:03
1	69	376.18075636557654	261.96517202151136	20/04/28 05:15:04
1	74	374.7544496259108	264.4513026329313	20/04/28 05:15:05
1	69	372.48785670166836	262.3595943162643	20/04/28 05:15:06
1	69	372.48785670166836	262.3595943162643	20/04/28 05:15:07
1	69	372.48785670166836	262.3595943162643	20/04/28 05:15:08
1	69	368.9169651830857	261.6578217243062	20/04/28 05:15:09
3	57	365.6578696297699	259.3576200548633	20/04/28 05:15:10
1	64	358.87237025214637	261.21107622709695	20/04/28 05:15:11
1	64	357.6965830742679	260.8022089979779	20/04/28 05:15:12
1	64	356.02694011127693	259.70882448523747	20/04/28 05:15:13
1	64	354.3333978239378	262.53426333928064	20/04/28 05:15:14
1	41	352.7251685521831	260.56227788261185	20/04/28 05:15:15
1	41	351.1038521390131	261.25919659269	20/04/28 05:15:16
1	41	350.03191915941005	261.4911728805443	20/04/28 05:15:17
1	41	349.6149730760457	260.6816456755546	20/04/28 05:15:18
1	22	343.1917987024697	259.9647561276533	20/04/28 05:15:19
1	22	343.1917987024697	259.9647561276533	20/04/28 05:15:20
1	69	340.1854692097293	258.18142547541174	20/04/28 05:15:21
1	69	338.1583683683643	258.3517387010974	20/04/28 05:15:22
1	69	338.1583683683643	258.3517387010974	20/04/28 05:15:23
1	5	333.7145018941879	260.98944075495035	20/04/28 05:15:24
3	54	333.7145018941879	260.9894407549504	20/04/28 05:15:25
3	54	329.2127636639186	262.6803906369539	20/04/28 05:15:26
1	37	326.9602189569582	261.44157637998103	20/04/28 05:15:27
1	37	323.9780902572864	261.641853061257	20/04/28 05:15:28
1	37	323.9780902572864	261.641853061257	20/04/28 05:15:29
1	37	323.9780902572864	261.641853061257	20/04/28 05:15:30
1	72	319.9159223640798	262.79603188013016	20/04/28 05:15:31
1	81	318.06966812882723	262.69145868280907	20/04/28 05:15:32
1	81	318.06966812882723	262.69145868280907	20/04/28 05:15:33
1	81	314.50318194109644	265.02915212402996	20/04/28 05:15:34
1	81	314.50318194109644	265.02915212402996	20/04/28 05:15:35
1	81	314.50318194109644	265.02915212402996	20/04/28 05:15:36
1	81	314.50318194109644	265.02915212402996	20/04/28 05:15:37
1	81	314.5031819410965	265.02915212402996	20/04/28 05:15:38
1	81	314.5031819410965	265.02915212402996	20/04/28 05:15:39
1	81	314.5031819410965	265.02915212402996	20/04/28 05:15:40
1	81	314.5031819410965	265.02915212402996	20/04/28 05:15:41
1	56	314.01729050634464	268.1547602617643	20/04/28 05:15:42
1	56	312.82542176317753	266.64578814796073	20/04/28 05:15:43
1	56	314.01729050634464	268.1547602617643	20/04/28 05:15:44
1	81	314.5031819410965	265.02915212402996	20/04/28 05:15:45
1	56	312.8254217631775	266.64578814796073	20/04/28 05:15:46
1	NULL	311.6525405201562	268.72873151570235	20/04/28 05:15:47
1	81	314.5031819410965	265.02915212402996	20/04/28 05:15:48
1	81	314.5031819410965	265.02915212402996	20/04/28 05:15:49
1	81	314.5031819410965	265.02915212402996	20/04/28 05:15:50
1	81	314.5031819410965	265.02915212402996	20/04/28 05:15:51
1	81	314.50318194109644	265.02915212402996	20/04/28 05:15:52
1	81	314.50318194109644	265.02915212402996	20/04/28 05:15:53
1	81	316.8584991431141	264.5437756453438	20/04/28 05:15:54
1	81	315.74240883925677	260.5181275582284	20/04/28 05:15:55
1	81	315.74240883925677	260.5181275582284	20/04/28 05:15:56
3	NULL	315.74240883925677	260.5181275582284	20/04/28 05:15:57
3	73	322.2571108201696	258.22191770932045	20/04/28 05:15:58
3	73	323.11326204380686	253.8963777389766	20/04/28 05:15:59
3	73	324.10855447296336	249.68610572910595	20/04/28 05:16:00
3	73	326.306999632011	249.6119394915912	20/04/28 05:16:01
3	73	323.11326204380686	253.8963777389766	20/04/28 05:16:02
3	73	326.85357882486704	250.33831695104467	20/04/28 05:16:03
3	73	325.06299415291227	250.80876693149915	20/04/28 05:16:04
3	31	327.3022920611675	245.40166748172052	20/04/28 05:16:05
3	31	327.3022920611675	245.40166748172055	20/04/28 05:16:06
3	73	323.11326204380686	253.8963777389766	20/04/28 05:16:07
3	73	328.8033109339724	247.2507061435672	20/04/28 05:16:08
3	73	324.10855447296336	249.68610572910595	20/04/28 05:16:09
3	73	324.10855447296336	249.68610572910595	20/04/28 05:16:10
3	31	327.3022920611675	245.40166748172052	20/04/28 05:16:11
3	31	327.3022920611675	245.40166748172052	20/04/28 05:16:12
3	31	327.3022920611675	245.40166748172052	20/04/28 05:16:13
3	31	327.3022920611675	245.40166748172052	20/04/28 05:16:14
3	31	327.3022920611675	245.40166748172052	20/04/28 05:16:15
3	73	328.2567317411164	246.52432868411373	20/04/28 05:16:16
3	73	324.10855447296336	249.68610572910595	20/04/28 05:16:17
3	73	314.97972246305835	241.84336367019685	20/04/28 05:16:18
3	31	327.3022920611675	245.40166748172055	20/04/28 05:16:19
3	31	327.3022920611675	245.40166748172052	20/04/28 05:16:20
3	31	326.7063811755535	243.92366382681712	20/04/28 05:16:21
3	31	327.3022920611675	245.40166748172052	20/04/28 05:16:22
3	31	327.3022920611675	245.40166748172055	20/04/28 05:16:23
3	31	327.3022920611675	245.40166748172052	20/04/28 05:16:24
3	31	327.3022920611675	245.40166748172052	20/04/28 05:16:25
3	73	328.8033109339724	247.2507061435672	20/04/28 05:16:26
3	73	328.8033109339724	247.2507061435672	20/04/28 05:16:27
3	95	333.58240038650445	248.93710402931347	20/04/28 05:16:28
3	95	332.65419250800556	247.24933982518607	20/04/28 05:16:29
3	95	335.4149042494905	248.08298100603486	20/04/28 05:16:30
3	99	337.12628586448284	254.53049372428973	20/04/28 05:16:31
1	69	335.09826601945855	254.91724379106157	20/04/28 05:16:32
1	41	353.3088250899925	261.3393367331624	20/04/28 05:16:33
3	42	340.8294774057768	254.78806625784264	20/04/28 05:16:34
1	69	342.2648602922862	255.25296476132485	20/04/28 05:16:35
3	84	349.36567136765126	251.36428280809122	20/04/28 05:16:36
3	42	352.3082224688189	259.7527506776221	20/04/28 05:16:37
1	69	352.9485501322174	257.48017010128	20/04/28 05:16:38
1	69	355.5701928050021	256.31045579772257	20/04/28 05:16:39
1	69	355.5701928050021	256.31045579772257	20/04/28 05:16:40
1	69	357.91989747494364	257.06854038031366	20/04/28 05:16:41
3	34	360.3447443281359	257.2761703004846	20/04/28 05:16:42
3	34	360.34474432813596	257.2761703004846	20/04/28 05:16:43
3	34	360.34474432813596	257.2761703004846	20/04/28 05:16:44
3	57	365.8336784609425	258.95489486040736	20/04/28 05:16:45
1	69	368.9169651830857	261.6578217243062	20/04/28 05:16:46
1	69	372.48785670166836	262.35959431626424	20/04/28 05:16:47
1	69	372.48785670166836	262.35959431626424	20/04/28 05:16:48
3	54	372.48785670166836	262.35959431626424	20/04/28 05:16:49
1	69	376.3565651967492	261.56244682705545	20/04/28 05:16:50
1	33	379.51825801393375	263.17204603967434	20/04/28 05:16:51
1	33	381.6109766893215	266.73786054806715	20/04/28 05:16:52
1	33	381.6109766893215	266.73786054806715	20/04/28 05:16:53
3	15	380.97239583354167	266.94453563659977	20/04/28 05:16:54
3	15	379.8755906118027	262.6421307240284	20/04/28 05:16:55
3	54	376.35656519674916	261.5624468270555	20/04/28 05:16:56
3	54	372.48785670166836	262.3595943162643	20/04/28 05:16:57
3	54	372.48785670166836	262.3595943162643	20/04/28 05:16:58
3	54	372.48785670166836	262.3595943162643	20/04/28 05:16:59
3	54	368.9169651830857	261.65782172430613	20/04/28 05:17:00
3	57	365.8336784609425	258.9548948604074	20/04/28 05:17:01
3	34	362.2167196060361	259.70189758364177	20/04/28 05:17:02
3	54	359.5685583521681	263.2279362811352	20/04/28 05:17:03
3	54	359.56855835216805	263.2279362811352	20/04/28 05:17:04
3	54	358.23287936641947	263.0061707425011	20/04/28 05:17:05
3	54	354.3948115151741	261.6556623953523	20/04/28 05:17:06
3	42	351.2362894892158	259.98472696547645	20/04/28 05:17:07
3	54	350.37914153837863	260.97432627346046	20/04/28 05:17:08
3	54	350.37914153837863	260.97432627346046	20/04/28 05:17:09
1	41	349.51649495941183	259.9901464221112	20/04/28 05:17:10
3	54	345.98250818917177	261.859258749847	20/04/28 05:17:11
3	99	339.59375125487367	258.8166372045796	20/04/28 05:17:12
3	99	339.59375125487367	258.8166372045796	20/04/28 05:17:13
3	NULL	337.70753542622793	260.45953294809686	20/04/28 05:17:14
3	54	334.4407240787428	261.4032786809491	20/04/28 05:17:15
3	54	334.4407240787428	261.4032786809491	20/04/28 05:17:16
3	54	334.4407240787428	261.4032786809491	20/04/28 05:17:17
3	54	327.3540763805351	261.1072377077433	20/04/28 05:17:18
3	54	327.3540763805351	261.1072377077433	20/04/28 05:17:19
3	54	324.0151806674323	262.76750572012435	20/04/28 05:17:20
3	54	324.6837666112415	261.38954335341236	20/04/28 05:17:21
3	54	322.37703876396404	263.60161237306977	20/04/28 05:17:22
3	54	321.27015631552865	262.1152944981856	20/04/28 05:17:23
3	54	317.5263569831538	260.75405889490565	20/04/28 05:17:24
1	81	315.74240883925677	260.5181275582284	20/04/28 05:17:26
1	81	313.2523840549326	264.4074609667819	20/04/28 05:17:27
3	54	313.37765885306834	261.0920988121665	20/04/28 05:17:28
3	54	306.98903329094395	261.4144857625964	20/04/28 05:17:29
3	47	305.42047124180004	265.2616066172563	20/04/28 05:17:30
3	47	303.28594423312194	264.61216223098285	20/04/28 05:17:31
3	47	302.8570592601016	265.6207358146814	20/04/28 05:17:32
1	98	303.28594423312194	264.61216223098285	20/04/28 05:17:33
1	98	305.14384176673207	266.22087392439636	20/04/28 05:17:34
1	98	305.14384176673207	266.22087392439636	20/04/28 05:17:35
1	56	307.159840217744	263.3357311024059	20/04/28 05:17:36
1	56	309.29436722642214	263.9851754886793	20/04/28 05:17:37
1	81	314.50318194109644	265.02915212402996	20/04/28 05:17:38
1	81	314.50318194109644	265.02915212402996	20/04/28 05:17:39
1	56	316.93641578625676	267.24841017033344	20/04/28 05:17:40
1	56	319.89662212153377	266.1573209564685	20/04/28 05:17:41
1	72	322.34915620924	265.0152899264337	20/04/28 05:17:42
1	72	322.34915620924	265.0152899264337	20/04/28 05:17:43
1	72	322.34915620924	265.0152899264337	20/04/28 05:17:44
1	37	325.93617404217133	264.20930050997885	20/04/28 05:17:45
1	37	328.6595361715347	265.5401093895471	20/04/28 05:17:46
1	NULL	331.9249996219656	268.7304237073172	20/04/28 05:17:47
1	56	333.50170633168455	266.9779643433037	20/04/28 05:17:48
3	28	333.50170633168455	266.9779643433037	20/04/28 05:17:49
1	83	337.2720802919978	268.9776784695725	20/04/28 05:17:50
1	56	341.08635902837887	268.2451054968998	20/04/28 05:17:51
1	NULL	344.77216199423657	268.7257539392073	20/04/28 05:17:52
1	NULL	344.77216199423657	268.7257539392073	20/04/28 05:17:53
1	NULL	344.7721619942365	268.7257539392073	20/04/28 05:17:54
3	62	345.6348085732032	269.7099337905566	20/04/28 05:17:55
3	40	350.5106868279581	273.4278672788951	20/04/28 05:17:56
1	56	354.81839048556503	267.9006545429323	20/04/28 05:17:57
1	10	356.9884669306864	271.1056044765582	20/04/28 05:17:58
1	10	356.82857512281635	271.29270616704315	20/04/28 05:17:59
1	10	356.82857512281635	271.29270616704315	20/04/28 05:18:00
1	45	354.92432902796776	273.612071983729	20/04/28 05:18:01
3	62	350.59854891528283	266.7667040052482	20/04/28 05:18:02
1	56	349.28912447399813	268.09561447179954	20/04/28 05:18:03
1	NULL	346.19160987992444	266.1313518007171	20/04/28 05:18:04
1	NULL	344.77216199423657	268.7257539392073	20/04/28 05:18:05
1	NULL	344.77216199423657	268.7257539392073	20/04/28 05:18:06
1	56	342.8440990865012	267.81543116836286	20/04/28 05:18:07
3	26	337.2720802919978	268.9776784695725	20/04/28 05:18:08
1	56	333.50170633168455	266.9779643433037	20/04/28 05:18:09
1	56	333.50170633168455	266.97796434330365	20/04/28 05:18:10
1	56	333.50170633168455	266.9779643433037	20/04/28 05:18:11
1	NULL	331.9249996219656	268.73042370731713	20/04/28 05:18:12
1	37	326.6418503961265	263.9569908021342	20/04/28 05:18:13
1	37	323.6597216964546	264.1572674834102	20/04/28 05:18:14
1	72	322.34915620924	265.0152899264337	20/04/28 05:18:15
1	72	322.34915620924	265.0152899264337	20/04/28 05:18:16
1	56	319.89662212153377	266.1573209564685	20/04/28 05:18:17
1	81	317.4633882763735	263.93806291016494	20/04/28 05:18:18
1	81	316.8584991431141	264.5437756453438	20/04/28 05:18:19
1	81	313.2523840549325	264.4074609667819	20/04/28 05:18:20
1	81	311.65911721261057	263.4112042347413	20/04/28 05:18:21
1	56	307.159840217744	263.3357311024059	20/04/28 05:18:22
1	56	307.159840217744	263.3357311024059	20/04/28 05:18:23
1	98	305.14384176673207	266.22087392439636	20/04/28 05:18:24
1	98	303.4235469930243	265.77780366757264	20/04/28 05:18:25
3	47	302.8570592601016	265.6207358146814	20/04/28 05:18:26
3	47	303.28594423312194	264.61216223098285	20/04/28 05:18:27
3	47	305.42047124180004	265.2616066172563	20/04/28 05:18:28
3	20	308.1866193271433	264.17491998155526	20/04/28 05:18:29
3	NULL	309.29436722642214	263.9851754886794	20/04/28 05:18:30
3	51	312.6019130172586	265.6450929868838	20/04/28 05:18:31
1	81	315.74240883925677	260.5181275582284	20/04/28 05:18:32
1	81	315.0919378015828	261.7557595783303	20/04/28 05:18:33
3	54	321.27015631552865	262.1152944981856	20/04/28 05:18:34
3	18	323.5974156050991	264.28862562276623	20/04/28 05:18:35
3	54	324.0151806674323	262.76750572012435	20/04/28 05:18:36
3	54	324.0151806674323	262.76750572012435	20/04/28 05:18:37
3	54	327.3540763805351	261.1072377077433	20/04/28 05:18:38
3	54	327.3540763805351	261.1072377077433	20/04/28 05:18:39
3	54	334.4407240787428	261.4032786809491	20/04/28 05:18:40
3	54	334.4407240787428	261.4032786809491	20/04/28 05:18:41
3	54	334.4407240787428	261.4032786809491	20/04/28 05:18:42
3	54	334.4407240787428	261.4032786809491	20/04/28 05:18:43
3	NULL	337.70753542622793	260.4595329480968	20/04/28 05:18:44
3	42	343.1917987024697	259.9647561276533	20/04/28 05:18:45
3	54	344.05444528143636	260.94893597900256	20/04/28 05:18:46
3	42	347.1868785189775	260.3528128347792	20/04/28 05:18:47
3	54	350.37914153837863	260.97432627346046	20/04/28 05:18:48
