floorId	partitionId	location_x	location_y	timeStamp
1	39	328.06549335123384	278.2621360136776	20/04/28 05:11:32
1	9	331.2124740764311	280.36793404834106	20/04/28 05:11:33
1	9	331.2124740764311	280.36793404834106	20/04/28 05:11:34
1	9	331.2124740764311	280.36793404834106	20/04/28 05:11:35
1	9	331.2124740764311	280.36793404834106	20/04/28 05:11:36
1	9	331.2124740764311	280.36793404834106	20/04/28 05:11:37
1	9	332.07149686486787	280.81042788541987	20/04/28 05:11:38
1	9	331.4650997210625	282.099090762378	20/04/28 05:11:39
1	9	331.39495529865195	281.80238393656543	20/04/28 05:11:40
1	59	328.5945802458779	282.23375842854654	20/04/28 05:11:41
1	9	331.2124740764311	280.36793404834106	20/04/28 05:11:42
1	59	328.5945802458779	282.23375842854654	20/04/28 05:11:43
1	59	328.5945802458779	282.23375842854654	20/04/28 05:11:44
1	59	328.5945802458779	282.23375842854654	20/04/28 05:11:45
1	9	331.2124740764311	280.36793404834106	20/04/28 05:11:46
1	9	331.2124740764311	280.36793404834106	20/04/28 05:11:47
1	9	331.2124740764311	280.36793404834106	20/04/28 05:11:48
1	9	331.2124740764311	280.36793404834106	20/04/28 05:11:49
1	9	331.2124740764311	280.36793404834106	20/04/28 05:11:50
1	9	331.2124740764311	280.36793404834106	20/04/28 05:11:51
1	9	331.2124740764311	280.36793404834106	20/04/28 05:11:52
1	NULL	332.04012152812555	278.8758762041585	20/04/28 05:11:53
1	9	331.2124740764311	280.36793404834106	20/04/28 05:11:54
1	9	331.2124740764311	280.36793404834106	20/04/28 05:11:55
1	9	331.2124740764311	280.36793404834106	20/04/28 05:11:56
1	39	328.56320490913555	280.29920674728515	20/04/28 05:11:57
1	59	328.5945802458779	282.23375842854654	20/04/28 05:11:58
1	59	328.5945802458779	282.23375842854654	20/04/28 05:11:59
1	9	331.2124740764311	280.36793404834106	20/04/28 05:12:00
1	39	328.04643660382663	278.9967269639211	20/04/28 05:12:01
1	39	325.1681104108905	280.1535421165315	20/04/28 05:12:02
1	59	328.5945802458779	282.23375842854654	20/04/28 05:12:03
1	59	328.5945802458779	282.23375842854654	20/04/28 05:12:04
1	39	328.5632049091355	280.29920674728515	20/04/28 05:12:05
1	39	329.2687133728509	279.8327396442798	20/04/28 05:12:06
1	59	328.5945802458779	282.23375842854654	20/04/28 05:12:07
1	39	325.1681104108905	280.1535421165315	20/04/28 05:12:08
1	39	325.1681104108905	280.1535421165315	20/04/28 05:12:09
1	59	328.5945802458779	282.23375842854654	20/04/28 05:12:10
1	59	326.764801256524	282.94412878333566	20/04/28 05:12:11
1	59	326.0592927928086	283.41059588634107	20/04/28 05:12:12
1	59	326.0592927928086	283.41059588634107	20/04/28 05:12:13
1	39	323.3383314215366	280.8639124713207	20/04/28 05:12:14
1	39	325.1681104108905	280.1535421165315	20/04/28 05:12:15
1	39	325.1681104108905	280.1535421165315	20/04/28 05:12:16
1	39	325.1681104108905	280.1535421165315	20/04/28 05:12:17
1	39	325.1681104108905	280.1535421165315	20/04/28 05:12:18
1	39	325.8736188746059	279.6870750135261	20/04/28 05:12:19
1	39	323.11960286715964	277.42468672218996	20/04/28 05:12:20
1	39	323.0934417610824	276.80430912710955	20/04/28 05:12:21
1	39	323.0934417610824	276.80430912710955	20/04/28 05:12:22
1	39	323.0934417610824	276.80430912710955	20/04/28 05:12:23
1	39	325.1681104108905	280.1535421165315	20/04/28 05:12:24
1	39	323.3383314215366	280.86391247132065	20/04/28 05:12:25
1	39	323.3383314215366	280.8639124713207	20/04/28 05:12:26
1	59	326.05929279280866	283.41059588634107	20/04/28 05:12:27
1	39	323.3383314215366	280.8639124713207	20/04/28 05:12:28
1	59	326.0592927928086	283.41059588634107	20/04/28 05:12:29
1	59	326.0592927928086	283.41059588634107	20/04/28 05:12:30
1	39	323.3383314215366	280.86391247132065	20/04/28 05:12:31
1	59	326.05929279280866	283.41059588634107	20/04/28 05:12:32
1	59	326.0592927928086	283.41059588634107	20/04/28 05:12:33
1	39	323.3383314215366	280.8639124713207	20/04/28 05:12:34
1	59	326.05929279280866	283.41059588634107	20/04/28 05:12:35
1	59	326.05929279280866	283.41059588634107	20/04/28 05:12:36
1	59	326.05929279280866	283.41059588634107	20/04/28 05:12:37
1	39	323.3383314215366	280.8639124713207	20/04/28 05:12:38
1	59	326.05929279280866	283.41059588634107	20/04/28 05:12:39
1	59	326.764801256524	282.94412878333566	20/04/28 05:12:40
1	59	326.05929279280866	283.41059588634107	20/04/28 05:12:41
1	59	326.764801256524	282.94412878333566	20/04/28 05:12:42
1	39	323.3383314215366	280.86391247132065	20/04/28 05:12:43
1	39	325.1681104108905	280.1535421165315	20/04/28 05:12:44
1	39	323.3383314215366	280.86391247132065	20/04/28 05:12:45
1	39	323.3383314215366	280.8639124713207	20/04/28 05:12:46
1	39	323.3383314215366	280.86391247132065	20/04/28 05:12:47
1	39	323.3383314215366	280.86391247132065	20/04/28 05:12:48
1	39	323.3383314215366	280.8639124713207	20/04/28 05:12:49
1	39	323.3383314215366	280.8639124713207	20/04/28 05:12:50
1	39	323.3383314215366	280.8639124713207	20/04/28 05:12:51
1	39	323.3383314215366	280.8639124713207	20/04/28 05:12:52
1	39	323.3383314215366	280.8639124713207	20/04/28 05:12:53
1	39	323.3383314215366	280.86391247132065	20/04/28 05:12:54
1	39	323.3383314215366	280.8639124713207	20/04/28 05:12:55
1	39	323.3383314215366	280.8639124713207	20/04/28 05:12:56
1	39	323.3383314215366	280.8639124713207	20/04/28 05:12:57
1	39	323.3383314215366	280.8639124713207	20/04/28 05:12:58
1	39	323.3383314215366	280.86391247132065	20/04/28 05:13:00
1	39	323.0934417610824	276.80430912710955	20/04/28 05:13:01
1	39	323.0934417610824	276.80430912710955	20/04/28 05:13:02
1	39	323.3383314215366	280.86391247132065	20/04/28 05:13:03
1	39	323.0934417610824	276.80430912710955	20/04/28 05:13:04
1	39	323.11960286715964	277.42468672218996	20/04/28 05:13:05
1	39	323.0934417610824	276.80430912710955	20/04/28 05:13:06
1	39	323.0934417610824	276.80430912710955	20/04/28 05:13:07
1	39	323.0934417610824	276.80430912710955	20/04/28 05:13:08
1	39	323.0934417610824	276.80430912710955	20/04/28 05:13:09
1	39	323.0934417610824	276.80430912710955	20/04/28 05:13:10
1	39	323.0934417610824	276.80430912710955	20/04/28 05:13:11
1	39	323.0934417610824	276.80430912710955	20/04/28 05:13:12
1	39	323.0934417610824	276.80430912710955	20/04/28 05:13:13
1	39	323.0934417610824	276.80430912710955	20/04/28 05:13:14
1	39	323.0934417610824	276.80430912710955	20/04/28 05:13:15
1	39	323.0934417610824	276.80430912710955	20/04/28 05:13:16
1	39	325.1681104108905	280.1535421165315	20/04/28 05:13:17
1	39	323.3383314215366	280.86391247132065	20/04/28 05:13:18
1	39	323.3383314215366	280.8639124713207	20/04/28 05:13:19
1	39	323.3383314215366	280.8639124713207	20/04/28 05:13:20
1	59	326.0592927928086	283.41059588634107	20/04/28 05:13:21
1	59	326.0592927928086	283.41059588634107	20/04/28 05:13:22
1	39	325.1681104108905	280.1535421165315	20/04/28 05:13:23
1	59	326.05929279280866	283.41059588634107	20/04/28 05:13:24
1	59	326.05929279280866	283.41059588634107	20/04/28 05:13:25
1	59	326.05929279280866	283.41059588634107	20/04/28 05:13:26
1	59	326.0592927928086	283.41059588634107	20/04/28 05:13:27
1	59	326.0592927928086	283.41059588634107	20/04/28 05:13:28
1	39	323.3383314215366	280.86391247132065	20/04/28 05:13:29
1	59	326.05929279280866	283.41059588634107	20/04/28 05:13:30
1	59	326.0592927928086	283.41059588634107	20/04/28 05:13:31
1	39	323.3383314215366	280.8639124713207	20/04/28 05:13:32
1	39	323.3383314215366	280.8639124713207	20/04/28 05:13:33
1	39	323.3383314215366	280.8639124713207	20/04/28 05:13:34
1	59	326.05929279280866	283.41059588634107	20/04/28 05:13:35
1	39	323.3383314215366	280.8639124713207	20/04/28 05:13:36
1	59	326.0592927928086	283.41059588634107	20/04/28 05:13:37
1	59	326.0592927928086	283.41059588634107	20/04/28 05:13:38
1	59	326.0592927928086	283.41059588634107	20/04/28 05:13:39
1	59	326.05929279280866	283.41059588634107	20/04/28 05:13:40
1	59	326.0592927928086	283.41059588634107	20/04/28 05:13:41
1	59	328.5945802458779	282.23375842854654	20/04/28 05:13:42
1	59	327.4971270661714	282.632451151298	20/04/28 05:13:43
1	59	326.0592927928086	283.41059588634107	20/04/28 05:13:44
1	59	326.0592927928086	283.41059588634107	20/04/28 05:13:45
1	59	326.05929279280866	283.41059588634107	20/04/28 05:13:46
1	59	326.0592927928086	283.41059588634107	20/04/28 05:13:47
1	59	326.0592927928086	283.41059588634107	20/04/28 05:13:48
1	59	326.0592927928086	283.41059588634107	20/04/28 05:13:49
1	59	326.05929279280866	283.41059588634107	20/04/28 05:13:50
1	59	326.0592927928086	283.41059588634107	20/04/28 05:13:51
1	59	326.05929279280866	283.41059588634107	20/04/28 05:13:52
1	59	326.05929279280866	283.41059588634107	20/04/28 05:13:53
1	59	326.05929279280866	283.41059588634107	20/04/28 05:13:54
