stationId	t_start	t_end	t_max	timeStamp
51	20/04/28 05:15:12	20/04/28 05:15:12	20/04/28 05:15:12
111	20/04/28 05:15:14	20/04/28 05:15:15	20/04/28 05:15:15
111	20/04/28 05:15:17	20/04/28 05:15:17	20/04/28 05:15:17
57	20/04/28 05:15:19	20/04/28 05:15:19	20/04/28 05:15:19
79	20/04/28 05:15:21	20/04/28 05:15:21	20/04/28 05:15:21
30	20/04/28 05:15:23	20/04/28 05:15:23	20/04/28 05:15:23
30	20/04/28 05:15:25	20/04/28 05:15:25	20/04/28 05:15:25
86	20/04/28 05:15:27	20/04/28 05:15:27	20/04/28 05:15:27
79	20/04/28 05:15:30	20/04/28 05:15:30	20/04/28 05:15:30
84	20/04/28 05:15:32	20/04/28 05:15:32	20/04/28 05:15:32
84	20/04/28 05:15:34	20/04/28 05:15:34	20/04/28 05:15:34
114	20/04/28 05:15:36	20/04/28 05:15:36	20/04/28 05:15:36
76	20/04/28 05:15:38	20/04/28 05:15:38	20/04/28 05:15:38
86	20/04/28 05:15:40	20/04/28 05:15:40	20/04/28 05:15:40
141	20/04/28 05:15:42	20/04/28 05:15:43	20/04/28 05:15:42
114	20/04/28 05:15:45	20/04/28 05:15:45	20/04/28 05:15:45
84	20/04/28 05:15:47	20/04/28 05:15:47	20/04/28 05:15:47
84	20/04/28 05:15:49	20/04/28 05:15:50	20/04/28 05:15:50
84	20/04/28 05:15:52	20/04/28 05:15:52	20/04/28 05:15:52
84	20/04/28 05:15:54	20/04/28 05:15:54	20/04/28 05:15:54
46	20/04/28 05:15:56	20/04/28 05:15:57	20/04/28 05:15:57
77	20/04/28 05:15:59	20/04/28 05:15:59	20/04/28 05:15:59
46	20/04/28 05:16:01	20/04/28 05:16:01	20/04/28 05:16:01
49	20/04/28 05:16:03	20/04/28 05:16:03	20/04/28 05:16:03
84	20/04/28 05:16:05	20/04/28 05:16:05	20/04/28 05:16:05
49	20/04/28 05:16:07	20/04/28 05:16:07	20/04/28 05:16:07
84	20/04/28 05:16:09	20/04/28 05:16:09	20/04/28 05:16:09
56	20/04/28 05:16:11	20/04/28 05:16:12	20/04/28 05:16:12
56	20/04/28 05:16:14	20/04/28 05:16:14	20/04/28 05:16:14
47	20/04/28 05:16:16	20/04/28 05:16:16	20/04/28 05:16:16
56	20/04/28 05:16:18	20/04/28 05:16:18	20/04/28 05:16:18
