floorId	partitionId	location_x	location_y	timeStamp
1	39	322.78778636591267	280.38824699275324	20/04/28 05:17:35
1	39	322.84336709792393	280.26361736405	20/04/28 05:17:35
1	39	322.7656685181838	280.1010470036616	20/04/28 05:17:35
1	39	322.7641695555151	280.10346256580016	20/04/28 05:17:35
1	39	322.86740788475123	280.2770260744749	20/04/28 05:17:35
1	39	323.05248864082773	280.36638034640146	20/04/28 05:17:36
1	39	322.87196433828103	280.32618955581006	20/04/28 05:17:36
1	39	322.588254319851	280.25089971678915	20/04/28 05:17:36
1	39	322.4998256015341	280.5265404120289	20/04/28 05:17:36
1	39	322.5477750283988	280.7893778048396	20/04/28 05:17:36
1	39	322.454571628491	280.67541627412925	20/04/28 05:17:36
1	39	322.47743608739825	280.58027295760263	20/04/28 05:17:36
1	39	322.5477929654238	280.60295983736194	20/04/28 05:17:36
1	39	322.7233408018674	280.7336775343742	20/04/28 05:17:36
1	39	322.5439552603935	280.5565565827477	20/04/28 05:17:36
1	39	322.5491842824694	280.53285414821687	20/04/28 05:17:37
1	39	322.59900640056867	280.457852403607	20/04/28 05:17:37
1	39	322.6020996133344	280.5024076213653	20/04/28 05:17:37
1	39	322.5439506592558	280.2587597867043	20/04/28 05:17:37
1	39	322.54305051994675	280.15551206619574	20/04/28 05:17:37
1	39	322.5441284188261	280.153061541221	20/04/28 05:17:37
1	39	322.4921478746802	279.99601178474586	20/04/28 05:17:37
1	39	322.73531461150793	280.0769736311518	20/04/28 05:17:37
1	39	322.7192720185587	280.01103452113034	20/04/28 05:17:37
1	39	322.7522672568172	280.1004685560823	20/04/28 05:17:37
1	39	322.53030255925916	279.98519058859677	20/04/28 05:17:38
1	39	322.5642103546385	279.8743444571583	20/04/28 05:17:38
1	39	322.4821205344406	280.0389622029627	20/04/28 05:17:38
1	39	322.453929540533	280.0496188055031	20/04/28 05:17:38
1	39	322.5846561799179	280.0894140218448	20/04/28 05:17:38
1	39	322.57510387115946	280.10342521696697	20/04/28 05:17:38
1	39	322.7958200832387	280.0495043914104	20/04/28 05:17:38
1	39	322.75073145865343	279.9883835412042	20/04/28 05:17:38
1	39	322.82615161320757	279.88097141420764	20/04/28 05:17:38
1	39	322.58437862967673	279.99132739572417	20/04/28 05:17:39
1	39	322.5864134438929	280.16737606924545	20/04/28 05:17:39
1	39	322.60477395245937	280.2206237830923	20/04/28 05:17:39
1	39	322.5392305772136	280.2630438674275	20/04/28 05:17:39
1	39	322.567202538676	280.2550847123793	20/04/28 05:17:39
1	39	322.5296596446628	280.12865351413336	20/04/28 05:17:39
1	39	322.6589760223334	280.14340630618705	20/04/28 05:17:39
1	39	322.7319969258206	280.15124088099236	20/04/28 05:17:39
1	39	322.7319394971211	280.20193359652677	20/04/28 05:17:39
1	39	322.6902127535983	280.1280050040304	20/04/28 05:17:39
1	39	322.6864524534663	280.1258232623702	20/04/28 05:17:40
1	39	322.9524567555297	280.1144059193175	20/04/28 05:17:40
1	39	322.8314818707521	279.91560650736176	20/04/28 05:17:40
1	39	322.83740811498683	279.9396032687789	20/04/28 05:17:40
1	39	322.99445209449465	279.90151503101777	20/04/28 05:17:40
1	39	322.9618129903834	279.91626066802866	20/04/28 05:17:40
1	39	322.88559442338294	280.1901622336357	20/04/28 05:17:40
1	39	322.61980908333067	280.09186912018146	20/04/28 05:17:40
1	39	322.68112023329047	280.0529288054694	20/04/28 05:17:40
1	39	322.72609187290266	279.8787043366098	20/04/28 05:17:41
1	39	322.8419124277785	279.8546659697205	20/04/28 05:17:41
1	39	322.7717876509426	279.81962699045215	20/04/28 05:17:41
1	39	322.8270687995414	279.94810399584475	20/04/28 05:17:41
1	39	322.7946313350415	279.82430022279306	20/04/28 05:17:41
1	39	322.7538279073578	279.84889027921906	20/04/28 05:17:41
1	39	322.479668498661	279.92664035220736	20/04/28 05:17:41
1	39	322.52962910441556	279.66472730686036	20/04/28 05:17:41
1	39	322.47293083425143	279.4333137384005	20/04/28 05:17:41
1	39	322.4786220544833	279.4477983466053	20/04/28 05:17:41
1	39	322.6737739297686	279.26438166446127	20/04/28 05:17:42
1	39	322.54064546567975	279.11504335902873	20/04/28 05:17:42
1	39	322.61771697508897	279.25012571405375	20/04/28 05:17:42
1	39	322.5978154957707	279.51062302806366	20/04/28 05:17:42
1	39	322.492629222276	279.4435737197139	20/04/28 05:17:42
1	39	322.46699746381597	279.44648363935625	20/04/28 05:17:42
1	39	322.4615507483226	279.4125274097805	20/04/28 05:17:42
1	39	322.68586886955984	279.5506201793553	20/04/28 05:17:42
1	39	322.6963644423699	279.54602689438445	20/04/28 05:17:42
1	39	322.56007307756175	279.6719276126259	20/04/28 05:17:42
1	39	322.47714635388974	279.70651985496653	20/04/28 05:17:43
1	39	322.6325565819244	279.9247630758125	20/04/28 05:17:43
1	39	322.50393360071024	279.9933646151513	20/04/28 05:17:43
1	39	322.5041157459526	279.99035405429686	20/04/28 05:17:43
1	39	322.50046615656987	280.0866848777809	20/04/28 05:17:43
1	39	322.5206887791369	280.10678660719833	20/04/28 05:17:43
1	39	322.5910992474171	280.0202157973933	20/04/28 05:17:43
1	39	322.6139002395977	280.05408859569457	20/04/28 05:17:43
1	39	322.8437538980616	280.03447015352793	20/04/28 05:17:43
1	39	322.9415351545036	279.99655340742635	20/04/28 05:17:43
1	39	322.8665684096091	280.06917799158765	20/04/28 05:17:44
1	39	322.76019047146696	279.9127272747765	20/04/28 05:17:44
1	39	322.754916876548	279.92543988528274	20/04/28 05:17:44
1	39	322.61535819525926	279.69019959987025	20/04/28 05:17:44
1	39	322.492495897969	279.573014032948	20/04/28 05:17:44
1	39	322.55133259248885	279.33825254273154	20/04/28 05:17:44
1	39	322.8029755615676	279.2636401485916	20/04/28 05:17:44
1	39	322.8739463060059	279.3665272778247	20/04/28 05:17:44
1	39	322.7985343520897	279.33083119182834	20/04/28 05:17:44
1	39	322.78384535133233	279.3271891728411	20/04/28 05:17:45
1	39	323.0460194283154	279.2571080713292	20/04/28 05:17:45
1	39	322.9428539666848	279.26351329951615	20/04/28 05:17:45
1	39	323.0547992378236	279.3489099483876	20/04/28 05:17:45
1	39	323.0547023337534	279.38104740379026	20/04/28 05:17:45
1	39	323.00541383972626	279.3488523198146	20/04/28 05:17:45
1	39	322.9854910350875	279.16164366392195	20/04/28 05:17:45
1	39	323.03823183161865	278.9490408474972	20/04/28 05:17:45
1	39	323.2839306602982	279.05632990814263	20/04/28 05:17:45
1	39	323.45715176670865	279.13783892382753	20/04/28 05:17:45
1	39	323.68748545368146	278.997631750765	20/04/28 05:17:46
1	39	323.5866838560617	278.882525068191	20/04/28 05:17:46
1	39	323.6761704254384	279.1679938400698	20/04/28 05:17:46
1	39	323.7849307831129	279.1856610908765	20/04/28 05:17:46
1	39	323.8196941573487	279.4437442738239	20/04/28 05:17:46
1	39	323.7723834744261	279.4843061938995	20/04/28 05:17:46
1	39	323.9962266600411	279.36846316266787	20/04/28 05:17:46
1	39	324.0013913467764	279.40177923029495	20/04/28 05:17:46
1	39	324.1655632615333	279.1928265753755	20/04/28 05:17:46
1	39	323.9943313078823	279.29450101236205	20/04/28 05:17:46
1	39	324.06694006133233	279.1700239905706	20/04/28 05:17:47
1	39	324.2491901598895	279.270181533982	20/04/28 05:17:47
1	39	324.04039994033224	279.2211820288496	20/04/28 05:17:47
1	39	324.1851306835071	279.1196057710464	20/04/28 05:17:47
1	39	324.2578193883198	279.30767561950734	20/04/28 05:17:47
1	39	324.2214980426921	279.3348120540072	20/04/28 05:17:47
1	39	324.21301770212716	279.3307104185151	20/04/28 05:17:47
1	39	324.26715074500135	279.4451283713017	20/04/28 05:17:47
1	39	324.39525617875734	279.45139050063307	20/04/28 05:17:47
1	39	324.3862220309192	279.51532421611347	20/04/28 05:17:48
1	39	324.3262624882521	279.4688691090101	20/04/28 05:17:48
1	39	324.31987432450893	279.4898224520683	20/04/28 05:17:48
1	39	324.32266303116126	279.4814985349295	20/04/28 05:17:48
1	39	324.2783286541615	279.40743117571856	20/04/28 05:17:48
1	39	324.11798488029945	279.33732218418623	20/04/28 05:17:48
1	39	324.1456969718745	279.0509941486682	20/04/28 05:17:48
1	39	324.07738838163357	278.9920591316732	20/04/28 05:17:48
1	39	324.26672823573733	279.0280803030006	20/04/28 05:17:48
1	39	324.20113678026036	279.2021704684773	20/04/28 05:17:48
1	39	324.28854246175763	279.0268596347924	20/04/28 05:17:49
1	39	324.41209534120657	278.85151610416324	20/04/28 05:17:49
1	39	324.1466850407188	278.92509598066516	20/04/28 05:17:49
1	39	324.03719280328374	279.163772931209	20/04/28 05:17:49
1	39	323.9268545869162	279.16737889696094	20/04/28 05:17:49
1	39	324.03473576062686	278.92073288438445	20/04/28 05:17:49
1	39	324.0175379718575	278.90571734470115	20/04/28 05:17:49
1	39	324.06694059530207	279.08869611799935	20/04/28 05:17:49
1	39	323.9714322269046	279.3221077647658	20/04/28 05:17:49
1	39	323.6857093421559	279.4044110499798	20/04/28 05:17:49
1	39	323.7459137958608	279.44630511651945	20/04/28 05:17:50
1	39	323.67489754485285	279.1730192898758	20/04/28 05:17:50
1	39	323.7908589637995	279.2719343878655	20/04/28 05:17:50
1	39	323.76864045503953	279.33038637142175	20/04/28 05:17:50
1	39	323.8029842223905	279.36508701877756	20/04/28 05:17:50
1	39	323.5727829189571	279.34757460101747	20/04/28 05:17:50
1	39	323.44944609355065	279.2724433312374	20/04/28 05:17:50
1	39	323.35574672069686	279.29417048181455	20/04/28 05:17:50
1	39	323.2214231079676	279.3611585245779	20/04/28 05:17:50
1	39	323.3325875366206	279.39154978504865	20/04/28 05:17:51
1	39	323.4043396026147	279.42893190508727	20/04/28 05:17:51
1	39	323.33310104072433	279.41096886537207	20/04/28 05:17:51
1	39	323.3931044758727	279.42114605551336	20/04/28 05:17:51
1	39	323.18458794783584	279.4810852920676	20/04/28 05:17:51
1	39	322.9847939236935	279.47790853311454	20/04/28 05:17:51
1	39	323.0532895961878	279.5239247614578	20/04/28 05:17:51
1	39	323.0690064065466	279.4729361529504	20/04/28 05:17:51
1	39	323.26336418053563	279.4849115621855	20/04/28 05:17:51
1	39	323.30348886104866	279.31490747294936	20/04/28 05:17:51
1	39	323.4253297983274	279.4416487310512	20/04/28 05:17:52
1	39	323.4907102456634	279.52092298568306	20/04/28 05:17:52
1	39	323.6727050644605	279.3158697210583	20/04/28 05:17:52
1	39	323.6528170046841	279.31429937415584	20/04/28 05:17:52
1	39	323.6528170046841	279.31429937415584	20/04/28 05:17:52
1	39	323.6528170046841	279.31429937415584	20/04/28 05:17:52
1	39	323.70682280543554	279.3239850636751	20/04/28 05:17:52
1	39	323.5003588276547	279.40262734974607	20/04/28 05:17:52
1	39	323.40160539642625	279.21902353057766	20/04/28 05:17:52
1	39	323.6024695598428	279.00407658814123	20/04/28 05:17:53
1	39	323.54767441254336	278.97788708384826	20/04/28 05:17:53
1	39	323.5182222532361	278.8582995544194	20/04/28 05:17:53
1	39	323.3631581125879	278.9790443117485	20/04/28 05:17:53
1	39	323.34360702091936	278.9507909154569	20/04/28 05:17:53
1	39	323.62404332601545	278.86823940454224	20/04/28 05:17:53
1	39	323.6218748937366	278.99002244246464	20/04/28 05:17:53
1	39	323.69147045331556	278.99978013331014	20/04/28 05:17:53
1	39	323.695320525427	279.0278634530595	20/04/28 05:17:53
1	39	323.6337875936405	278.73652894978613	20/04/28 05:17:53
1	39	323.8127391852787	278.5970426159783	20/04/28 05:17:54
1	39	323.85614706927174	278.579422182955	20/04/28 05:17:54
1	39	323.89649342497563	278.5126504692942	20/04/28 05:17:54
1	39	323.8386361745483	278.7145642820081	20/04/28 05:17:54
1	39	324.1042814526309	278.62684064067594	20/04/28 05:17:54
1	39	324.0213349331922	278.74165780718425	20/04/28 05:17:54
1	39	324.05494913724357	278.91368217634067	20/04/28 05:17:54
1	39	324.11470994688847	279.00986829990524	20/04/28 05:17:54
1	39	324.07066877057014	279.277072616607	20/04/28 05:17:54
1	39	323.95939167125465	279.36458901158744	20/04/28 05:17:54
1	39	323.9538342947476	279.08951593171065	20/04/28 05:17:55
1	39	323.86289815720255	278.86923654882247	20/04/28 05:17:55
1	39	323.7817786902426	278.87586793537093	20/04/28 05:17:55
1	39	323.7642286383525	278.90020001138595	20/04/28 05:17:55
1	39	323.91561997637535	278.7960411697092	20/04/28 05:17:55
1	39	324.1452235412033	278.75683323005927	20/04/28 05:17:55
1	39	324.00157488173596	278.59175998946057	20/04/28 05:17:55
1	39	324.0228369635579	278.62106849948873	20/04/28 05:17:55
1	39	323.8918064153414	278.81385823193284	20/04/28 05:17:55
1	39	323.86868486425726	278.84161632248805	20/04/28 05:17:56
1	39	323.80090211940757	278.85730536780306	20/04/28 05:17:56
1	39	323.8049533685232	278.8564038834781	20/04/28 05:17:56
1	39	323.86554963846305	278.711781031985	20/04/28 05:17:56
1	39	323.9795443718152	278.8964843826075	20/04/28 05:17:56
1	39	323.93296273098383	278.8578800628171	20/04/28 05:17:56
1	39	323.8272977348657	279.03331655972136	20/04/28 05:17:56
1	39	323.937296761044	278.98384518370256	20/04/28 05:17:56
1	39	324.216412098553	278.98843689143905	20/04/28 05:17:56
1	39	324.2177342806548	278.9851351295768	20/04/28 05:17:56
1	39	324.1196857479031	278.81429529414476	20/04/28 05:17:57
1	39	324.15441515645364	278.9026919283909	20/04/28 05:17:57
1	39	324.11167735531075	278.84968606352226	20/04/28 05:17:57
1	39	324.31535781358076	278.6794650067778	20/04/28 05:17:57
1	39	324.377114830328	278.7757664573354	20/04/28 05:17:57
1	39	324.3347077269777	278.81007346452265	20/04/28 05:17:57
1	39	324.23529356250054	278.7149575583835	20/04/28 05:17:57
1	39	324.39648731256847	278.87736699265673	20/04/28 05:17:57
1	39	324.3141395091322	278.9841828064526	20/04/28 05:17:57
1	39	324.4402616196711	278.8626836831686	20/04/28 05:17:58
1	39	324.3768060854523	278.7256135324171	20/04/28 05:17:58
1	39	324.0974745350388	278.66390212983316	20/04/28 05:17:58
1	39	323.9997415307742	278.6336001730033	20/04/28 05:17:58
1	39	324.18973004320446	278.74854161031084	20/04/28 05:17:58
1	39	324.38306056327775	278.7692743154865	20/04/28 05:17:58
1	39	324.6079739090601	278.71550534088976	20/04/28 05:17:58
1	39	324.668635598446	278.5230689525062	20/04/28 05:17:58
1	39	324.61880372160965	278.38627616068123	20/04/28 05:17:58
1	39	324.36832376666956	278.26338578166894	20/04/28 05:17:58
1	39	324.35077269078937	278.31042717191855	20/04/28 05:17:59
1	39	324.28884504788437	278.55166291421756	20/04/28 05:17:59
1	39	324.5390637146286	278.654584241791	20/04/28 05:17:59
1	39	324.5309035829585	278.6847191645291	20/04/28 05:17:59
1	39	324.37240958004344	278.74569418537726	20/04/28 05:17:59
1	39	324.304192427959	278.7175520553933	20/04/28 05:17:59
1	39	324.5718155886867	278.84878829729973	20/04/28 05:17:59
1	39	324.61641045611043	278.9501504725551	20/04/28 05:17:59
1	39	324.4873596925731	278.95929742977984	20/04/28 05:17:59
1	39	324.67385032780504	278.96221337980865	20/04/28 05:17:59
1	39	324.5051844894095	279.0396456045165	20/04/28 05:18:00
1	39	324.5892331083553	279.17359381718586	20/04/28 05:18:00
1	39	324.59069199424204	279.1679817338159	20/04/28 05:18:00
1	39	324.4536410152025	279.4262926526284	20/04/28 05:18:00
1	39	324.35095761597864	279.6800512578181	20/04/28 05:18:00
1	39	324.53959880424793	279.47121549772044	20/04/28 05:18:00
1	39	324.27456870802587	279.33845936826987	20/04/28 05:18:00
1	39	324.1644082409652	279.4292998366542	20/04/28 05:18:00
1	39	324.2297461577379	279.4542005712577	20/04/28 05:18:00
1	39	324.37068269937413	279.2987093075066	20/04/28 05:18:00
1	39	324.3719494248078	279.23525648036997	20/04/28 05:18:01
1	39	324.3489744834328	279.24388259794983	20/04/28 05:18:01
1	39	324.54026024840783	279.36882976639833	20/04/28 05:18:01
1	39	324.7798059908031	279.3147027574036	20/04/28 05:18:01
1	39	324.76173258015444	279.2883997441318	20/04/28 05:18:01
1	39	324.77723287690753	279.2615220830866	20/04/28 05:18:01
1	39	324.84474878749546	279.0024700529055	20/04/28 05:18:01
1	39	325.0172279474385	278.913959384868	20/04/28 05:18:01
1	39	325.0734773361331	278.78688446303204	20/04/28 05:18:01
1	39	325.0172981143543	278.97487288189427	20/04/28 05:18:02
1	39	325.0451766105132	278.9535093652423	20/04/28 05:18:02
1	39	325.21797306359423	278.9451260172645	20/04/28 05:18:02
1	39	325.1085550500187	279.11263819889547	20/04/28 05:18:02
1	39	325.1001845903448	279.1063130070559	20/04/28 05:18:02
1	39	325.2804259995219	279.1114582454954	20/04/28 05:18:02
1	39	325.26712924910055	279.1088332731697	20/04/28 05:18:02
1	39	325.45404582889597	279.0974490023237	20/04/28 05:18:02
1	39	325.5712624965738	279.07400602729734	20/04/28 05:18:02
1	39	325.64121065598016	279.0338215025231	20/04/28 05:18:02
1	39	325.67281035591446	278.83858246960364	20/04/28 05:18:03
1	39	325.7481110828974	278.7825416973326	20/04/28 05:18:03
1	39	325.66424849409924	278.8095172245763	20/04/28 05:18:03
1	39	325.45618684862035	278.73998347926823	20/04/28 05:18:03
1	39	325.45618684862035	278.73998347926823	20/04/28 05:18:03
1	39	325.45618684862035	278.73998347926823	20/04/28 05:18:03
1	39	325.6458211363818	278.5852444671332	20/04/28 05:18:03
1	39	325.6065228549257	278.6290212416054	20/04/28 05:18:03
1	39	325.40446751058437	278.5765536716465	20/04/28 05:18:03
1	39	325.4264681361943	278.67739945508373	20/04/28 05:18:03
1	39	325.22937577164896	278.77654756840434	20/04/28 05:18:04
1	39	325.2273144981521	278.77343709382495	20/04/28 05:18:04
1	39	325.2989099630573	278.6673494082032	20/04/28 05:18:04
1	39	325.2989099630573	278.6673494082032	20/04/28 05:18:04
1	39	325.2989099630573	278.6673494082032	20/04/28 05:18:04
1	39	325.39809162591337	278.73057573420436	20/04/28 05:18:04
1	39	325.60260496559783	278.73667059936076	20/04/28 05:18:04
1	39	325.52550689274847	278.73017831261717	20/04/28 05:18:04
1	39	325.4780914027356	278.8542360463333	20/04/28 05:18:04
1	39	325.7584523508852	278.8418825635381	20/04/28 05:18:05
1	39	325.7413216091197	278.9336720171868	20/04/28 05:18:05
1	39	325.46476700315446	278.9423418127716	20/04/28 05:18:05
1	39	325.3784134601962	278.6794283598457	20/04/28 05:18:05
1	39	325.2983412750899	278.7039939566503	20/04/28 05:18:05
1	39	325.3383707872654	278.9012926304324	20/04/28 05:18:05
1	39	325.26246489480184	278.81742928130365	20/04/28 05:18:05
1	39	325.263249680856	278.80204036392763	20/04/28 05:18:05
1	39	325.1134368907648	278.76120351147057	20/04/28 05:18:05
1	39	324.91430435718195	278.92251320494665	20/04/28 05:18:05
1	39	324.9539697477167	278.8298016041901	20/04/28 05:18:06
1	39	325.0334346433598	279.0928808425301	20/04/28 05:18:06
1	39	325.2001563625438	279.1972808117723	20/04/28 05:18:06
1	39	325.3515151304618	278.97557369094807	20/04/28 05:18:06
1	39	325.4884118161571	278.9098268733084	20/04/28 05:18:06
1	39	325.339907376256	279.11090352120675	20/04/28 05:18:06
1	39	325.2463470845963	279.12350021569625	20/04/28 05:18:06
1	39	325.4166460454407	278.92588659957426	20/04/28 05:18:06
1	39	325.21147020631014	278.8794929193654	20/04/28 05:18:06
1	39	324.9782782883584	278.70064602337106	20/04/28 05:18:06
1	39	324.77822377468914	278.7674196526886	20/04/28 05:18:07
1	39	324.757881223845	278.87265864792806	20/04/28 05:18:07
1	39	324.89698669318335	278.7399910588628	20/04/28 05:18:07
1	39	324.6623948970879	278.6131718841368	20/04/28 05:18:07
1	39	324.82438042275703	278.71672650954116	20/04/28 05:18:07
1	39	324.95212157529824	278.4522320126248	20/04/28 05:18:07
1	39	324.97334901883335	278.3819267449334	20/04/28 05:18:07
1	39	324.93379301777986	278.29436775660247	20/04/28 05:18:07
1	39	325.1393478335907	278.1795089692775	20/04/28 05:18:07
1	39	325.016631305766	278.3930641989662	20/04/28 05:18:08
1	39	324.9282476647917	278.36536538386554	20/04/28 05:18:08
1	39	324.73814917924494	278.4504720128534	20/04/28 05:18:08
1	39	324.78752594381916	278.6285444798192	20/04/28 05:18:08
1	39	324.9680626386721	278.5653972933068	20/04/28 05:18:08
1	39	324.87997751820103	278.67349469229856	20/04/28 05:18:08
1	39	324.7782668706473	278.5133636860207	20/04/28 05:18:08
1	39	324.93383174950844	278.4102680693354	20/04/28 05:18:08
1	39	324.93286336858256	278.6089697122697	20/04/28 05:18:08
1	39	324.77039809314124	278.71765258427035	20/04/28 05:18:08
1	39	324.9963903343113	278.6406089137243	20/04/28 05:18:09
1	39	324.9036889091836	278.73998300033867	20/04/28 05:18:09
1	39	325.0008371528673	278.60330944988567	20/04/28 05:18:09
1	39	324.95732377969784	278.5936562411684	20/04/28 05:18:09
1	39	324.9610080824614	278.64408537230634	20/04/28 05:18:09
1	39	325.01359558391715	278.63193026394003	20/04/28 05:18:09
1	39	325.03853707003276	278.66475908940276	20/04/28 05:18:09
1	39	325.00834606564814	278.47260932990986	20/04/28 05:18:09
1	39	324.95814244215535	278.4549044091705	20/04/28 05:18:09
1	39	324.95814244215535	278.4549044091705	20/04/28 05:18:09
1	39	324.95814244215535	278.4549044091705	20/04/28 05:18:10
1	39	324.9461397804201	278.3015703963577	20/04/28 05:18:10
1	39	324.9464710541167	278.2993193817672	20/04/28 05:18:10
1	39	324.90925046606435	278.312392781615	20/04/28 05:18:10
1	39	324.95996086839205	278.4294652990839	20/04/28 05:18:10
1	39	324.90059544159317	278.4156750945587	20/04/28 05:18:10
1	39	325.02954801264235	278.397484618795	20/04/28 05:18:10
1	39	324.79989466576785	278.51839998645573	20/04/28 05:18:10
1	39	324.72785024187016	278.6478955786082	20/04/28 05:18:10
1	39	324.8163772104423	278.398003118105	20/04/28 05:18:11
1	39	324.611608549758	278.54015119122795	20/04/28 05:18:11
1	39	324.6947907581363	278.3416951964019	20/04/28 05:18:11
1	39	324.6850221941655	278.32504873532434	20/04/28 05:18:11
1	39	324.41647254330366	278.2563690013231	20/04/28 05:18:11
1	39	324.2868644296159	278.110357252411	20/04/28 05:18:11
1	39	324.3639522037334	278.3317906794542	20/04/28 05:18:11
1	39	324.5584356422694	278.16667794021504	20/04/28 05:18:11
1	39	324.5981355862556	278.2833741666027	20/04/28 05:18:11
1	39	324.579457235075	278.2739509039884	20/04/28 05:18:11
1	39	324.6842863537077	278.0340839655612	20/04/28 05:18:12
1	39	324.7540872444989	278.02957168392913	20/04/28 05:18:12
1	39	324.74769943230433	278.0204594371554	20/04/28 05:18:12
1	39	324.756321634679	278.0080575014817	20/04/28 05:18:12
1	39	324.7318874471261	278.0255935562154	20/04/28 05:18:12
1	39	324.95512457229336	277.95930469407466	20/04/28 05:18:12
1	39	325.0517164476314	277.8239085870659	20/04/28 05:18:12
1	39	325.0193180173121	277.6119416506692	20/04/28 05:18:12
1	39	325.2662870180065	277.56890288388996	20/04/28 05:18:12
1	39	325.1202815482727	277.3862181924955	20/04/28 05:18:13
1	39	325.10409798067025	277.55814207849096	20/04/28 05:18:13
1	39	325.3460644756665	277.4121563353415	20/04/28 05:18:13
1	39	325.3836572470578	277.50292676774455	20/04/28 05:18:13
1	39	325.29078410683724	277.6488391177597	20/04/28 05:18:13
1	39	325.1710970521168	277.60415351097294	20/04/28 05:18:13
1	39	325.2830144819524	277.72345272880455	20/04/28 05:18:13
1	39	325.0779294575789	277.57369492365274	20/04/28 05:18:13
1	39	325.1674347282915	277.682607498663	20/04/28 05:18:13
1	39	325.1456531554425	277.6398216525384	20/04/28 05:18:13
1	39	325.30704503349926	277.685337890322	20/04/28 05:18:14
1	39	325.13745036318176	277.6536440051952	20/04/28 05:18:14
1	39	325.1043423811775	277.7096664514175	20/04/28 05:18:14
1	39	325.0651338716931	277.77866915076424	20/04/28 05:18:14
1	39	325.1661240322904	277.8288100972286	20/04/28 05:18:14
1	39	324.89848998159465	277.75514135888994	20/04/28 05:18:14
1	39	324.9455017034639	277.46738988627874	20/04/28 05:18:14
1	39	324.96420609584186	277.4121385026314	20/04/28 05:18:14
1	39	325.0621746718321	277.30201482625966	20/04/28 05:18:14
1	39	325.1525946554452	277.15265160439753	20/04/28 05:18:14
1	39	325.1014701077984	277.42677573564697	20/04/28 05:18:15
1	39	325.1095667875003	277.42708860146297	20/04/28 05:18:15
1	39	325.1095667875003	277.42708860146297	20/04/28 05:18:15
