floorId	partitionId	location_x	location_y	timeStamp
3	17	358.8231846856295	250.49629923836142	20/04/28 05:17:17
3	17	358.938155460269	250.4864063784764	20/04/28 05:17:17
3	17	359.07215016895714	250.59390911653804	20/04/28 05:17:17
3	17	359.31572503395813	250.54360981024382	20/04/28 05:17:17
3	17	359.23842625454347	250.80498758340087	20/04/28 05:17:17
3	17	359.0850847010189	250.82485154933218	20/04/28 05:17:17
3	17	359.0775166448772	250.66566830790367	20/04/28 05:17:17
3	17	358.8534919469457	250.79335508974256	20/04/28 05:17:17
3	17	358.988215171481	250.6183994272257	20/04/28 05:17:18
3	17	359.07525940850684	250.674916355548	20/04/28 05:17:18
3	17	359.05476696172724	250.43629746871824	20/04/28 05:17:18
3	17	358.96618530109254	250.3481793876904	20/04/28 05:17:18
3	17	358.9544611699256	250.26924318856393	20/04/28 05:17:18
3	17	358.92023999443535	250.4115683241107	20/04/28 05:17:18
3	17	358.6761250100399	250.35211276778858	20/04/28 05:17:18
3	17	358.6480123522975	250.1708212914732	20/04/28 05:17:18
3	17	358.6572160112722	250.24668060337765	20/04/28 05:17:18
3	17	358.6423025985795	249.950485347227	20/04/28 05:17:18
3	17	358.5698006588193	250.174446816118	20/04/28 05:17:19
3	17	358.5039576824772	250.06209596932516	20/04/28 05:17:19
3	17	358.63677733202303	250.10603983580336	20/04/28 05:17:19
3	17	358.55705302622255	250.05862873671217	20/04/28 05:17:19
3	17	358.59396680307145	250.06178047963783	20/04/28 05:17:19
3	17	358.51128325170606	250.01043435458925	20/04/28 05:17:19
3	17	358.50629111060067	250.28350150672233	20/04/28 05:17:19
3	17	358.50035758661517	250.4149913292054	20/04/28 05:17:19
3	17	358.7096535472384	250.55216049671188	20/04/28 05:17:19
3	17	358.5473276197934	250.68831636885935	20/04/28 05:17:19
3	17	358.5555280230771	250.68196601892504	20/04/28 05:17:20
3	17	358.572328485332	250.6537586302999	20/04/28 05:17:20
3	17	358.5530320066393	250.41634719402472	20/04/28 05:17:20
3	17	358.5260130346834	250.36155588631186	20/04/28 05:17:20
3	17	358.6841080821095	250.20967082900748	20/04/28 05:17:20
3	17	358.70386177355357	250.21284741211701	20/04/28 05:17:20
3	17	358.70788304173414	250.21283018601451	20/04/28 05:17:20
3	17	358.6800488509503	250.21982420788066	20/04/28 05:17:20
3	17	358.6030527459176	250.35787455597205	20/04/28 05:17:20
3	17	358.6030527459176	250.35787455597205	20/04/28 05:17:21
3	17	358.66109706435105	250.40714032443844	20/04/28 05:17:21
3	17	358.53872284473914	250.17311782424792	20/04/28 05:17:21
3	17	358.67038592070963	250.3630210509838	20/04/28 05:17:21
3	17	358.75582517580074	250.36965928522596	20/04/28 05:17:21
3	17	358.75582517580074	250.36965928522596	20/04/28 05:17:21
3	17	358.6736144186489	250.59159945800494	20/04/28 05:17:21
3	17	358.7284446935113	250.40650706588812	20/04/28 05:17:21
3	17	358.759865718606	250.1441518128782	20/04/28 05:17:21
3	17	358.7637112659147	250.07953640889767	20/04/28 05:17:21
3	17	358.7637112659147	250.07953640889767	20/04/28 05:17:22
3	17	358.6684499247075	250.29225015962763	20/04/28 05:17:22
3	17	358.94590692199	250.3967637885721	20/04/28 05:17:22
3	17	359.13679437774687	250.1887044595189	20/04/28 05:17:22
3	17	358.9286312088589	250.26410779149145	20/04/28 05:17:22
3	17	358.95067351468924	250.07272690894752	20/04/28 05:17:22
3	17	358.95067351468924	250.07272690894752	20/04/28 05:17:22
3	17	358.8930277211163	250.2984527955948	20/04/28 05:17:22
3	17	358.8461946604391	250.206297487205	20/04/28 05:17:22
3	17	358.5818210512182	250.28386318651104	20/04/28 05:17:22
3	17	358.5818210512182	250.28386318651104	20/04/28 05:17:23
3	17	358.51635801862886	250.33468824785498	20/04/28 05:17:23
3	17	358.51635801862886	250.33468824785498	20/04/28 05:17:23
3	17	358.71531632741835	250.40817857603594	20/04/28 05:17:23
3	17	358.72906249138515	250.31717147970969	20/04/28 05:17:23
3	17	358.57601844719966	250.52348016252196	20/04/28 05:17:23
3	17	358.57601844719966	250.52348016252196	20/04/28 05:17:23
3	17	358.69447805251093	250.87656841455367	20/04/28 05:17:23
3	17	358.5430117858707	251.12499891853787	20/04/28 05:17:23
3	17	358.58844330271694	251.22427262019178	20/04/28 05:17:24
3	17	358.58844330271694	251.22427262019178	20/04/28 05:17:24
3	17	358.73755222521766	251.23569970912502	20/04/28 05:17:24
3	17	358.9115169921185	251.01815697613688	20/04/28 05:17:24
3	17	358.6568321353279	251.01704254572616	20/04/28 05:17:24
3	17	358.5981636381726	251.27933252569005	20/04/28 05:17:24
3	17	358.79118340609097	251.16150471093775	20/04/28 05:17:24
3	17	358.92085804131733	251.18674662205095	20/04/28 05:17:24
3	17	358.96842970964974	251.01007256013236	20/04/28 05:17:24
3	17	358.89374127307747	251.15060044798201	20/04/28 05:17:24
3	17	358.8465705527552	251.16006121366047	20/04/28 05:17:25
3	17	358.84568703350527	251.2310190442044	20/04/28 05:17:25
3	17	358.79311957718033	251.2600651725224	20/04/28 05:17:25
3	17	358.6541108297829	251.16720877117913	20/04/28 05:17:25
3	17	358.6547202419202	251.31208677639364	20/04/28 05:17:25
3	17	358.6302202933883	251.4441365864098	20/04/28 05:17:25
3	17	358.58875789485177	251.51601223460375	20/04/28 05:17:25
3	17	358.6930443192434	251.55468916940353	20/04/28 05:17:25
3	17	358.6594475729587	251.5039186416517	20/04/28 05:17:25
3	17	358.66019490823385	251.7723639063347	20/04/28 05:17:25
3	17	358.65038436641987	251.72821058814455	20/04/28 05:17:26
3	17	358.69779161396235	251.70900070221458	20/04/28 05:17:26
3	17	358.8185938675595	251.91563836950868	20/04/28 05:17:26
3	17	358.7373445757353	251.7193150172074	20/04/28 05:17:26
3	17	358.6072719750638	251.5656962773877	20/04/28 05:17:26
3	17	358.6044407430696	251.6374315819496	20/04/28 05:17:26
3	17	358.68118756461047	251.4846216533748	20/04/28 05:17:26
3	17	358.70257477538945	251.40502031496663	20/04/28 05:17:26
3	17	358.70260134750305	251.40596021705082	20/04/28 05:17:26
3	17	358.8689950773748	251.29643418266747	20/04/28 05:17:26
3	17	358.68480099088487	251.3601849731942	20/04/28 05:17:27
3	17	358.7192697637877	251.39611818265706	20/04/28 05:17:27
3	17	358.7514473987165	251.26197460406672	20/04/28 05:17:27
3	17	358.8337792756102	251.24868963261676	20/04/28 05:17:27
3	17	358.7206603720451	251.23931457365984	20/04/28 05:17:27
3	17	358.66862147978173	251.28946850226728	20/04/28 05:17:27
3	17	358.52869081257114	251.338611500086	20/04/28 05:17:27
3	17	358.8054515039417	251.31930080225396	20/04/28 05:17:27
3	17	358.84347652093214	251.13889131345408	20/04/28 05:17:27
3	17	359.0590168483695	251.3406523209595	20/04/28 05:17:28
3	17	358.9813724621308	251.26707700086052	20/04/28 05:17:28
3	17	359.0671604850055	251.3139754134201	20/04/28 05:17:28
3	17	359.0528337640404	251.35663274364464	20/04/28 05:17:28
3	17	359.1226264669466	251.3012570900682	20/04/28 05:17:28
3	17	359.1575302026152	251.31560232873207	20/04/28 05:17:28
3	17	359.3039981575071	251.30293449546625	20/04/28 05:17:28
3	17	359.1667392227817	251.08648734169273	20/04/28 05:17:28
3	17	359.2370237337002	251.0927837257252	20/04/28 05:17:28
3	17	359.2542935564762	251.04096564165957	20/04/28 05:17:28
3	17	359.20517445478066	250.97085445668537	20/04/28 05:17:29
3	17	359.07474431238836	251.03669812483673	20/04/28 05:17:29
3	17	358.8087434818234	251.06091332502612	20/04/28 05:17:29
3	17	358.8334389692928	250.96930884603623	20/04/28 05:17:29
3	17	359.0131579871547	251.0902116803356	20/04/28 05:17:29
3	17	359.0136900921714	251.12250409227303	20/04/28 05:17:29
3	17	359.01477041414824	250.9552060848062	20/04/28 05:17:29
3	17	358.8844367770628	251.07107098856417	20/04/28 05:17:29
3	17	358.88443269913955	251.07120295750886	20/04/28 05:17:29
3	17	358.7620020541362	251.0606990135423	20/04/28 05:17:29
3	17	358.6986716987422	251.0455788285147	20/04/28 05:17:30
3	17	358.5759197246299	251.2326349585393	20/04/28 05:17:30
3	17	358.68877036036537	251.2457670459122	20/04/28 05:17:30
3	17	358.6903837259116	251.24086150476816	20/04/28 05:17:30
3	17	358.6129061835301	251.35256586148466	20/04/28 05:17:30
3	17	358.613764384119	251.19800645012933	20/04/28 05:17:30
3	17	358.5024605863215	251.31544163579906	20/04/28 05:17:30
3	17	358.740783301204	251.41662805100898	20/04/28 05:17:30
3	17	358.85690336590307	251.2615328042756	20/04/28 05:17:30
3	17	359.03431875745827	251.3998012573114	20/04/28 05:17:31
3	17	359.1901191304791	251.39298983988937	20/04/28 05:17:31
3	17	359.12746958114786	251.31857404393642	20/04/28 05:17:31
3	17	359.39403676425513	251.23098902683617	20/04/28 05:17:31
3	17	359.62243391566193	251.1462620154833	20/04/28 05:17:31
3	17	359.62231679001485	251.14665549932732	20/04/28 05:17:31
3	17	359.4484111208123	251.0855006003663	20/04/28 05:17:31
3	17	359.60751061371275	251.23029376544142	20/04/28 05:17:31
3	17	359.50807054115893	251.19754481014755	20/04/28 05:17:31
3	17	359.5909594434168	250.96009083885056	20/04/28 05:17:31
3	17	359.57943150723986	250.95962109756798	20/04/28 05:17:32
3	17	359.578331696275	251.12392486652308	20/04/28 05:17:32
3	17	359.429999747151	250.87008791221533	20/04/28 05:17:32
3	17	359.2061976964091	250.99743915805894	20/04/28 05:17:32
3	17	359.2970826266873	250.9175297261899	20/04/28 05:17:32
3	17	359.24440118348974	250.83249299018502	20/04/28 05:17:32
3	17	359.3414394247051	250.79889530956768	20/04/28 05:17:32
3	17	359.3141472890215	250.52182556969197	20/04/28 05:17:32
3	17	359.1151109495148	250.30646589034103	20/04/28 05:17:32
3	17	359.1990696185812	250.03625510224148	20/04/28 05:17:32
3	17	359.1757128428713	250.06981887165443	20/04/28 05:17:33
3	17	359.11732599703134	250.23282986564124	20/04/28 05:17:33
3	17	359.13107486424474	250.13528108006366	20/04/28 05:17:33
3	17	359.2606910052472	250.33044973309381	20/04/28 05:17:33
3	17	359.2134408145797	250.26799702236386	20/04/28 05:17:33
3	17	359.1997372066846	250.27268574541753	20/04/28 05:17:33
3	17	359.2438881895438	250.18541248786573	20/04/28 05:17:33
3	17	359.24166481319986	250.17732191119833	20/04/28 05:17:33
3	17	359.3289264031737	250.28610624757133	20/04/28 05:17:33
3	17	359.36320231677234	250.2188488291443	20/04/28 05:17:34
3	17	359.2194818758576	250.39137401226122	20/04/28 05:17:34
3	17	359.2449928964866	250.2728868772989	20/04/28 05:17:34
3	17	359.21017039857156	250.31314349360323	20/04/28 05:17:34
3	17	359.20246050437447	250.31580672595575	20/04/28 05:17:34
3	17	359.1986729485777	250.31423515755168	20/04/28 05:17:34
3	17	359.3685328409172	250.2333250569008	20/04/28 05:17:34
3	17	359.3435470190268	250.4444092799196	20/04/28 05:17:34
3	17	359.52995596768375	250.45720754038436	20/04/28 05:17:34
3	17	359.406500203778	250.34135530991358	20/04/28 05:17:34
3	17	359.4874778945092	250.18333023267292	20/04/28 05:17:35
3	17	359.3170643996935	250.11275379993006	20/04/28 05:17:35
3	17	359.0396363032123	250.03464411155315	20/04/28 05:17:35
3	17	358.86611768438956	250.00556285944282	20/04/28 05:17:35
3	17	359.10213760522123	250.16718166040144	20/04/28 05:17:35
3	17	359.3526384284014	250.00902949713932	20/04/28 05:17:35
3	17	359.2005369939203	249.96109159861942	20/04/28 05:17:35
3	17	359.4142929644692	250.06926438548086	20/04/28 05:17:35
3	17	359.4142929644692	250.06926438548086	20/04/28 05:17:35
3	17	359.47699029918164	250.24895576670406	20/04/28 05:17:35
3	17	359.60905594275835	250.0458687755638	20/04/28 05:17:36
3	17	359.51230628372593	250.213270517171	20/04/28 05:17:36
3	17	359.51230628372593	250.213270517171	20/04/28 05:17:36
3	17	359.3716135588396	249.9276605899102	20/04/28 05:17:36
3	17	359.3716135588396	249.9276605899102	20/04/28 05:17:36
3	17	359.34037638757906	249.93849886657392	20/04/28 05:17:36
3	17	359.07414738292846	250.0294861398508	20/04/28 05:17:36
3	17	359.1526771281557	250.04762686753958	20/04/28 05:17:36
3	17	359.199605039046	250.0761691798519	20/04/28 05:17:36
3	17	359.00960545026186	249.94361001107993	20/04/28 05:17:37
3	17	359.20832231172386	249.94844186025776	20/04/28 05:17:37
3	17	359.01486556456894	250.05153366089704	20/04/28 05:17:37
3	17	359.01486556456894	250.05153366089704	20/04/28 05:17:37
3	17	358.88952661935724	250.00622741264425	20/04/28 05:17:37
3	17	358.6707164563473	250.03521630032566	20/04/28 05:17:37
3	17	358.6707164563473	250.03521630032566	20/04/28 05:17:37
3	17	358.95169845421884	250.07523589220781	20/04/28 05:17:37
3	17	358.76113840769057	250.15691545287638	20/04/28 05:17:37
3	17	358.9361252315752	250.25698091991651	20/04/28 05:17:37
3	17	359.15418955231735	250.16819770126833	20/04/28 05:17:38
3	17	359.3023088149643	250.36850033779962	20/04/28 05:17:38
3	17	359.26510970759693	250.33429568506267	20/04/28 05:17:38
3	17	359.5218491949698	250.44826549500382	20/04/28 05:17:38
3	17	359.4927633633926	250.4833868060567	20/04/28 05:17:38
3	17	359.4927633633926	250.4833868060567	20/04/28 05:17:38
3	17	359.51031133233204	250.4864422585669	20/04/28 05:17:38
3	17	359.5818618532275	250.6521030991547	20/04/28 05:17:38
3	17	359.5126895835652	250.54044540452983	20/04/28 05:17:38
3	17	359.43793847227477	250.63916348268134	20/04/28 05:17:38
3	17	359.206648614509	250.69329381467028	20/04/28 05:17:39
3	17	359.1506759835421	250.57964840036496	20/04/28 05:17:39
3	17	359.10763119986166	250.54247604042797	20/04/28 05:17:39
3	17	359.1624431313505	250.55237509491738	20/04/28 05:17:39
3	17	359.15929449231965	250.516085699216	20/04/28 05:17:39
3	17	359.33772446369886	250.5947354905779	20/04/28 05:17:39
3	17	359.58829103462995	250.69863000089825	20/04/28 05:17:39
3	17	359.73440703009635	250.85893568284905	20/04/28 05:17:39
3	17	359.8490967968471	250.64266970407724	20/04/28 05:17:39
3	17	359.8934710809561	250.65014612779777	20/04/28 05:17:40
3	17	359.93738437098756	250.91410302869386	20/04/28 05:17:40
3	17	359.94898174872236	250.95309383810618	20/04/28 05:17:40
3	17	359.96916012543755	250.8903093665135	20/04/28 05:17:40
3	17	360.0264465514671	250.81314344438107	20/04/28 05:17:40
3	17	360.1134501719042	250.83110060167738	20/04/28 05:17:40
3	17	360.1687213749563	250.87683883150643	20/04/28 05:17:40
3	17	360.23299878635487	250.98724456462443	20/04/28 05:17:40
3	17	360.23299878635487	250.98724456462443	20/04/28 05:17:40
3	17	360.37267822400537	251.11132396863388	20/04/28 05:17:40
3	17	360.3936953966406	251.09559374327497	20/04/28 05:17:41
3	17	360.5060474731794	251.3193855350116	20/04/28 05:17:41
3	17	360.5060474731794	251.3193855350116	20/04/28 05:17:41
3	17	360.4828984199207	251.41410502429463	20/04/28 05:17:41
3	17	360.61066138480123	251.5168440125907	20/04/28 05:17:41
3	17	360.403027263781	251.3627631270698	20/04/28 05:17:41
3	17	360.403027263781	251.3627631270698	20/04/28 05:17:41
3	17	360.37885582680747	251.42199890450593	20/04/28 05:17:41
3	17	360.21447215989133	251.45285734006532	20/04/28 05:17:41
3	17	360.23459435992277	251.70276910130713	20/04/28 05:17:41
3	17	360.31767567095454	251.83359626533596	20/04/28 05:17:42
3	17	360.1912642722442	251.8981280990943	20/04/28 05:17:42
3	17	360.0772442334832	252.17033318706993	20/04/28 05:17:42
3	17	359.95426051478665	252.4285327872052	20/04/28 05:17:42
3	17	359.8619485515798	252.54754032986128	20/04/28 05:17:42
3	17	359.80943121102604	252.76205390889095	20/04/28 05:17:42
3	17	359.8910919645163	252.84455512138422	20/04/28 05:17:42
3	17	359.9312332291397	252.7532809499655	20/04/28 05:17:42
3	17	359.7241082664387	252.57275604923575	20/04/28 05:17:42
3	17	359.8877349508481	252.80517483934645	20/04/28 05:17:43
3	17	359.9027282951809	252.82606605851325	20/04/28 05:17:43
3	17	359.8965804894039	252.92900877550298	20/04/28 05:17:43
3	17	359.8932886521744	252.97781488778426	20/04/28 05:17:43
3	17	359.8932886521744	252.97781488778426	20/04/28 05:17:43
3	17	359.55161692474326	253.17597489283403	20/04/28 05:17:43
3	17	359.55161692474326	253.17597489283403	20/04/28 05:17:43
3	17	359.4961215169661	253.10002702976175	20/04/28 05:17:43
3	17	359.4961215169661	253.10002702976175	20/04/28 05:17:43
3	17	359.3315012307956	253.14881561611418	20/04/28 05:17:43
3	17	359.526038529072	253.0606156929266	20/04/28 05:17:44
3	17	359.539797085587	253.1328778058641	20/04/28 05:17:44
3	17	359.59232766559245	253.39049515353148	20/04/28 05:17:44
3	17	359.5932252787037	253.233726522961	20/04/28 05:17:44
3	17	359.5174408807612	253.20757750907933	20/04/28 05:17:44
3	17	359.68529185286854	253.30278275492262	20/04/28 05:17:44
3	17	359.69287074102044	253.5142775267088	20/04/28 05:17:44
3	17	359.6498563467292	253.59426977459293	20/04/28 05:17:44
3	17	359.7332532656941	253.81939382038894	20/04/28 05:17:44
3	17	359.6574026534957	253.77286589438611	20/04/28 05:17:44
3	17	359.6810203140071	253.71522960480797	20/04/28 05:17:45
3	17	359.4609887427395	253.8039430400881	20/04/28 05:17:45
3	17	359.3691282223914	253.6000822519879	20/04/28 05:17:45
3	17	359.14497292023134	253.69722088281247	20/04/28 05:17:45
3	17	359.13486124932194	253.6936344400084	20/04/28 05:17:45
3	17	358.951423643277	253.6360367334748	20/04/28 05:17:45
3	17	358.951423643277	253.6360367334748	20/04/28 05:17:45
3	17	358.76075359507115	253.679479497958	20/04/28 05:17:45
3	17	358.77614775416816	253.72711000326458	20/04/28 05:17:45
3	17	358.843058407014	253.87600683874723	20/04/28 05:17:46
3	17	358.6079430081007	253.69920106056452	20/04/28 05:17:46
3	17	358.6079430081007	253.69920106056452	20/04/28 05:17:46
3	17	358.6079430081007	253.69920106056452	20/04/28 05:17:46
3	17	358.6004839528496	253.64905523384144	20/04/28 05:17:46
3	17	358.61974407775745	253.69460692019763	20/04/28 05:17:46
3	17	358.72409872499685	253.7667693506203	20/04/28 05:17:46
3	17	358.6963200909512	253.84218223777467	20/04/28 05:17:46
3	17	358.60896756989206	253.92704853338117	20/04/28 05:17:46
3	17	358.7714014051887	253.9476038775927	20/04/28 05:17:46
3	17	358.946531422552	253.881764339536	20/04/28 05:17:47
3	17	359.0296539338012	253.83649637734473	20/04/28 05:17:47
3	17	359.1845511338302	253.7235499395619	20/04/28 05:17:47
3	17	359.20778845574	253.79740905602208	20/04/28 05:17:47
3	17	359.25831043945846	253.74018688785526	20/04/28 05:17:47
3	17	359.3840718561192	253.9501558693907	20/04/28 05:17:47
3	17	359.2326491798056	254.1904882981822	20/04/28 05:17:47
3	17	359.2129411672751	254.16297836892159	20/04/28 05:17:47
3	17	359.25313988745177	254.07037463197733	20/04/28 05:17:47
3	17	359.22916199522473	254.12482599878965	20/04/28 05:17:47
3	17	359.2031982776647	254.1661110660551	20/04/28 05:17:48
3	17	359.1355839242862	254.17497969060983	20/04/28 05:17:48
3	17	359.0699762584374	254.1062962534625	20/04/28 05:17:48
3	17	359.29890234365917	254.25859672498845	20/04/28 05:17:48
3	17	359.1381503513813	254.38295852229493	20/04/28 05:17:48
3	17	358.9013726295573	254.4294923185093	20/04/28 05:17:48
3	17	358.9793826609901	254.46946871311695	20/04/28 05:17:48
3	17	358.9873355782114	254.50464774017613	20/04/28 05:17:48
3	17	358.8818861161877	254.61459201863417	20/04/28 05:17:48
3	17	358.93687830400927	254.61867673813987	20/04/28 05:17:49
3	17	358.7773433568819	254.78561803178707	20/04/28 05:17:49
3	17	358.7854166772494	254.7779550435163	20/04/28 05:17:49
3	17	358.6568637081852	254.64656886063358	20/04/28 05:17:49
3	17	358.6635889668025	254.71298492473863	20/04/28 05:17:49
3	17	358.6704820047241	254.70066875218615	20/04/28 05:17:49
3	17	358.6652980076308	254.4178704808729	20/04/28 05:17:49
3	17	358.6588083461404	254.44341529386486	20/04/28 05:17:49
3	17	358.7994524509723	254.59286181993448	20/04/28 05:17:49
3	17	358.73248426073377	254.62671008151983	20/04/28 05:17:49
3	17	358.7140256229251	254.578701095402	20/04/28 05:17:50
3	17	358.71804354281977	254.55774684078065	20/04/28 05:17:50
3	17	358.63416508869875	254.44468983906813	20/04/28 05:17:50
3	17	358.62227461891473	254.41767875059637	20/04/28 05:17:50
3	17	358.8203218823396	254.3403438706719	20/04/28 05:17:50
3	17	358.83721300242314	254.3247692405847	20/04/28 05:17:50
3	17	358.64388363719087	254.20666060271463	20/04/28 05:17:50
3	17	358.8212816735605	253.97639066841896	20/04/28 05:17:50
3	17	358.8610070665064	254.0512552070822	20/04/28 05:17:50
3	17	358.7045368885397	253.88009871331417	20/04/28 05:17:51
3	17	358.64292691460537	253.67657969109987	20/04/28 05:17:51
3	17	358.61136945899733	253.71117188176365	20/04/28 05:17:51
3	17	358.54835129658045	253.5398243145363	20/04/28 05:17:51
3	17	358.6637216954716	253.29989562405765	20/04/28 05:17:51
3	17	358.6721247967263	253.4495053070055	20/04/28 05:17:51
3	17	358.680865903676	253.49525792082366	20/04/28 05:17:51
3	17	358.7484860817631	253.57208704913617	20/04/28 05:17:51
3	17	358.65027259996964	253.4022835918802	20/04/28 05:17:51
3	17	358.65540470656214	253.40041496031066	20/04/28 05:17:51
3	17	358.6133878685791	253.3910292515939	20/04/28 05:17:52
3	17	358.72001013046884	253.41411699489944	20/04/28 05:17:52
3	17	358.67535571543743	253.4561509190326	20/04/28 05:17:52
3	17	358.74282406027766	253.51541432266865	20/04/28 05:17:52
3	17	358.6062048699818	253.55955644210636	20/04/28 05:17:52
3	17	358.63335467575257	253.55475219619922	20/04/28 05:17:52
3	17	358.82173355342786	253.36946459753253	20/04/28 05:17:52
3	17	358.95750937561337	253.61704243833228	20/04/28 05:17:52
3	17	359.0726148341698	253.81028515840697	20/04/28 05:17:52
3	17	359.0109244069217	253.76378343363157	20/04/28 05:17:52
3	17	358.8534134948266	253.99992459965407	20/04/28 05:17:53
3	17	358.9008087232574	254.16268058916745	20/04/28 05:17:53
3	17	359.0511624172719	254.06639007405172	20/04/28 05:17:53
3	17	359.0746314923717	254.01546833406815	20/04/28 05:17:53
3	17	358.9152824864252	254.07033826074735	20/04/28 05:17:53
3	17	358.8605941415725	253.83504252890165	20/04/28 05:17:53
3	17	358.9385918010612	253.77726162693494	20/04/28 05:17:53
3	17	358.7899170503342	253.74867885781333	20/04/28 05:17:53
3	17	359.0189496669977	253.57399009574968	20/04/28 05:17:53
3	17	358.99012370597376	253.739512166465	20/04/28 05:17:54
3	17	358.78001330567446	253.5323224149578	20/04/28 05:17:54
3	17	358.7549517586526	253.65661044724243	20/04/28 05:17:54
3	17	358.72109949572933	253.70267333934	20/04/28 05:17:54
3	17	358.88583356968655	253.66329651148942	20/04/28 05:17:54
3	17	358.5998066384527	253.57861566883705	20/04/28 05:17:54
3	17	358.5234227201249	253.48658864333822	20/04/28 05:17:54
3	17	358.58636449704755	253.47447792234175	20/04/28 05:17:54
3	17	358.7448687364	253.32845681318946	20/04/28 05:17:54
3	17	358.55122180418084	253.5133135181959	20/04/28 05:17:54
3	17	358.5352421311627	253.37827264862122	20/04/28 05:17:55
3	17	358.7098872288883	253.31750303186692	20/04/28 05:17:55
3	17	358.6568795399077	253.2433855994619	20/04/28 05:17:55
3	17	358.57624617816407	253.16472864166408	20/04/28 05:17:55
3	17	358.57624617816407	253.16472864166408	20/04/28 05:17:55
3	17	358.5001993993057	253.00981595351743	20/04/28 05:17:55
3	17	358.7194995778886	253.01656715872664	20/04/28 05:17:55
3	17	358.7248300923209	253.01163852405642	20/04/28 05:17:55
3	17	358.7816390462596	252.99659877717647	20/04/28 05:17:55
3	17	358.79794420110295	253.00966232879395	20/04/28 05:17:56
3	17	358.8010085316564	253.0255116408601	20/04/28 05:17:56
3	17	358.72057721677396	253.19098083143322	20/04/28 05:17:56
3	17	358.80115796875975	253.2578040730837	20/04/28 05:17:56
3	17	358.77908270152955	253.22479641170227	20/04/28 05:17:56
3	17	358.8285990790983	253.28125588486725	20/04/28 05:17:56
3	17	358.79356963559195	253.3757131344074	20/04/28 05:17:56
3	17	358.77407488316857	253.29470772041375	20/04/28 05:17:56
3	17	358.877988938688	253.55414414261995	20/04/28 05:17:56
3	17	358.7460871249245	253.41461956112562	20/04/28 05:17:56
3	17	358.6837853758282	253.13731783173523	20/04/28 05:17:57
3	17	358.8768347300225	253.14110453756777	20/04/28 05:17:57
3	17	358.67208835171795	253.33858343288162	20/04/28 05:17:57
3	17	358.75691560695816	253.16032427555407	20/04/28 05:17:57
3	17	358.64716338094354	253.0272253164699	20/04/28 05:17:57
3	17	358.66623662640455	253.26615083642955	20/04/28 05:17:57
3	17	358.8342626298574	253.35155463043756	20/04/28 05:17:57
3	17	358.707083166855	253.4143133227034	20/04/28 05:17:57
3	17	358.7051724309196	253.41606676497648	20/04/28 05:17:57
3	17	358.8172672470438	253.6004324129186	20/04/28 05:17:58
3	17	358.70484473364917	253.86537465057566	20/04/28 05:17:58
3	17	358.70090615977483	253.87225256322756	20/04/28 05:17:58
3	17	358.7717180113072	253.77822904741416	20/04/28 05:17:58
3	17	358.7717180113072	253.77822904741416	20/04/28 05:17:58
3	17	358.7796693766637	253.9794857209192	20/04/28 05:17:58
3	17	359.0310368171669	253.9238834472941	20/04/28 05:17:58
3	17	359.0918205100651	253.64565808722875	20/04/28 05:17:58
3	17	359.31513873216676	253.5047033631802	20/04/28 05:17:58
3	17	359.4141194441422	253.52098747462117	20/04/28 05:17:58
3	17	359.3382269944286	253.43478395209874	20/04/28 05:17:59
3	17	359.4234061691898	253.37094084597663	20/04/28 05:17:59
3	17	359.483758363133	253.32674874040285	20/04/28 05:17:59
3	17	359.46317371271897	253.34018450268738	20/04/28 05:17:59
3	17	359.58970450480183	253.38257808432397	20/04/28 05:17:59
3	17	359.47518292396137	253.3006741829764	20/04/28 05:17:59
3	17	359.40543563334677	253.33736565022792	20/04/28 05:17:59
3	17	359.4416934959227	253.33389794112756	20/04/28 05:17:59
3	17	359.4435687628859	253.33241794014538	20/04/28 05:17:59
3	17	359.53593326973606	253.29003771398567	20/04/28 05:17:59
3	17	359.4893174212477	253.40567404032458	20/04/28 05:18:00
3	17	359.27881135530464	253.35397230264877	20/04/28 05:18:00
3	17	359.07370743312146	253.21156734767928	20/04/28 05:18:00
3	17	358.96480493257366	253.36204732946848	20/04/28 05:18:00
3	17	358.935711872985	253.3217516836569	20/04/28 05:18:00
3	17	359.0051980024311	253.2888607563211	20/04/28 05:18:00
3	17	359.0028998078877	253.33484814909943	20/04/28 05:18:00
3	17	359.18514969230796	253.45063624697048	20/04/28 05:18:00
3	17	359.34913367870615	253.27133867403717	20/04/28 05:18:00
3	17	359.1837072277928	253.46870834653436	20/04/28 05:18:01
3	17	359.014849204217	253.709112653353	20/04/28 05:18:01
3	17	359.0169644402125	253.711145581483	20/04/28 05:18:01
3	17	359.02700005874095	253.49293097729802	20/04/28 05:18:01
3	17	358.6901367168503	253.8637424973291	20/04/28 05:18:01
3	17	358.68040864345096	254.05731175417762	20/04/28 05:18:01
3	17	358.68040864345096	254.05731175417762	20/04/28 05:18:01
3	17	358.93047011397084	254.0580715381989	20/04/28 05:18:01
3	17	358.88748246156945	254.06343624186172	20/04/28 05:18:01
3	17	358.89999614543376	254.12825643059278	20/04/28 05:18:01
3	17	358.89999614543376	254.12825643059278	20/04/28 05:18:02
3	17	358.83064109319736	254.1139040624452	20/04/28 05:18:02
3	17	358.9653479550855	253.88509598611583	20/04/28 05:18:02
3	17	358.94305990152816	254.1818313066633	20/04/28 05:18:02
3	17	358.9971066087029	254.379265289878	20/04/28 05:18:02
3	17	358.7948850917572	254.46147515372152	20/04/28 05:18:02
3	17	358.792611979257	254.45908564950372	20/04/28 05:18:02
3	17	358.5567588931668	254.4838886017212	20/04/28 05:18:02
3	17	358.55574414609083	254.63560859736094	20/04/28 05:18:02
3	17	358.56041397868927	254.6676694056532	20/04/28 05:18:02
3	17	358.57568981596927	254.71460025777168	20/04/28 05:18:03
3	17	358.57568981596927	254.71460025777168	20/04/28 05:18:03
3	17	358.50398326658177	254.68080696867048	20/04/28 05:18:03
3	17	358.502500398326	254.69464332494888	20/04/28 05:18:03
3	17	358.5073392560188	254.61657221050223	20/04/28 05:18:03
3	17	358.5092400407993	254.84643384575708	20/04/28 05:18:03
3	17	358.6647531248482	254.78937030689593	20/04/28 05:18:03
3	17	358.6399575608542	254.7980796848377	20/04/28 05:18:03
3	17	358.6530696123723	254.78761310355048	20/04/28 05:18:03
3	17	358.64312927017227	254.8026213358596	20/04/28 05:18:04
3	17	358.7525824550726	254.90608642689372	20/04/28 05:18:04
3	17	358.7584062500396	254.91597354266162	20/04/28 05:18:04
3	17	358.91071036525847	254.85624399730315	20/04/28 05:18:04
3	17	358.9798252479058	254.8170762101424	20/04/28 05:18:04
3	17	358.7388236342482	254.66225884449963	20/04/28 05:18:04
3	17	358.73621548333034	254.66089414366238	20/04/28 05:18:04
3	17	358.7342654679208	254.72877487727254	20/04/28 05:18:04
3	17	358.841664062652	254.66993574117694	20/04/28 05:18:04
3	17	358.85696502401225	254.66254693928815	20/04/28 05:18:04
3	17	358.7252375041617	254.71962302274122	20/04/28 05:18:05
3	17	358.67382400903546	254.71503085286884	20/04/28 05:18:05
3	17	358.7607930186564	254.88320544648886	20/04/28 05:18:05
3	17	358.699353388001	254.89758666737853	20/04/28 05:18:05
3	17	358.6989758913786	254.89931267995706	20/04/28 05:18:05
3	17	358.6744721068188	254.89147660208897	20/04/28 05:18:05
3	17	358.5962036949519	254.9017794629913	20/04/28 05:18:05
3	17	358.6097147288348	254.88174991922222	20/04/28 05:18:05
3	17	358.86281680623534	254.76055051366606	20/04/28 05:18:05
3	17	358.89179624241586	254.70857379646662	20/04/28 05:18:05
3	17	358.870416165062	254.72038700214986	20/04/28 05:18:06
3	17	358.9002560202673	254.50761075550045	20/04/28 05:18:06
3	17	358.9002560202673	254.50761075550045	20/04/28 05:18:06
3	17	358.98705474515384	254.71157285310386	20/04/28 05:18:06
3	17	359.01597896758267	254.8110406065501	20/04/28 05:18:06
3	17	359.1064960189367	254.8475354500463	20/04/28 05:18:06
3	17	359.22655880039576	254.80504435098004	20/04/28 05:18:06
3	17	359.20542746640035	254.79619414954237	20/04/28 05:18:06
3	17	359.20542746640035	254.79619414954237	20/04/28 05:18:06
3	17	359.2761462653733	254.59476542907586	20/04/28 05:18:07
3	17	359.1079586119984	254.45506053878438	20/04/28 05:18:07
3	17	359.1587652134164	254.1740332799754	20/04/28 05:18:07
3	17	359.2213895789119	254.42749534517583	20/04/28 05:18:07
3	17	359.2213895789119	254.42749534517583	20/04/28 05:18:07
3	17	359.23459533833204	254.51223791040616	20/04/28 05:18:07
3	17	359.36987318135084	254.87644389578537	20/04/28 05:18:07
3	17	359.36987318135084	254.87644389578537	20/04/28 05:18:07
3	17	359.41362924115805	254.81073242835893	20/04/28 05:18:07
3	17	359.1178437315299	254.81532141027853	20/04/28 05:18:07
3	17	359.1178437315299	254.81532141027853	20/04/28 05:18:08
3	17	359.11310781173887	254.61226127508831	20/04/28 05:18:08
3	17	359.0829379543704	254.60124216738092	20/04/28 05:18:08
3	17	358.89979532733133	254.74477085326953	20/04/28 05:18:08
3	17	359.17662531454744	254.67541792732308	20/04/28 05:18:08
3	17	359.09739293408103	254.73846425046824	20/04/28 05:18:08
3	17	358.8951255327938	254.69195625367868	20/04/28 05:18:08
3	17	359.0078413744718	254.90163488053446	20/04/28 05:18:08
3	17	358.86764366285945	254.9016741808565	20/04/28 05:18:08
3	17	358.86764366285945	254.9016741808565	20/04/28 05:18:08
3	17	358.9806827667216	254.77627350133267	20/04/28 05:18:09
3	17	358.72864675194097	254.77923929860847	20/04/28 05:18:09
3	17	358.71938483869167	254.79027953813883	20/04/28 05:18:09
3	17	358.87661084122726	254.59703392743236	20/04/28 05:18:09
3	17	358.88906299786845	254.41622583941083	20/04/28 05:18:09
3	17	358.81126616702926	254.60579227070724	20/04/28 05:18:09
3	17	358.82463976391256	254.61377895791122	20/04/28 05:18:09
3	17	358.77875964123723	254.58172410749853	20/04/28 05:18:09
3	17	358.7756877528101	254.5823936421247	20/04/28 05:18:09
3	17	358.540547541495	254.56281004827633	20/04/28 05:18:10
3	17	358.6781121351569	254.34044525579083	20/04/28 05:18:10
3	17	358.7744061111122	254.34337575255677	20/04/28 05:18:10
3	17	358.779622518196	254.37122376227248	20/04/28 05:18:10
3	17	358.76977042290673	254.4366461592713	20/04/28 05:18:10
3	17	358.6951764776206	254.41455059183613	20/04/28 05:18:10
3	17	358.6976990290014	254.38254858745992	20/04/28 05:18:10
3	17	358.86302197705874	254.56487117926562	20/04/28 05:18:10
3	17	358.78658587706406	254.58032917139624	20/04/28 05:18:10
3	17	358.77846746764794	254.5796081401264	20/04/28 05:18:10
3	17	358.85179724399785	254.55275738811835	20/04/28 05:18:11
3	17	358.9014865509119	254.31377909433843	20/04/28 05:18:11
3	17	358.8567531022765	254.4116265210457	20/04/28 05:18:11
3	17	358.8585958852613	254.392222027976	20/04/28 05:18:11
3	17	358.7392425810944	254.2672630111802	20/04/28 05:18:11
3	17	358.70092603351554	254.06380689061206	20/04/28 05:18:11
3	17	358.6942607319793	253.7790611624869	20/04/28 05:18:11
3	17	358.94177227753966	253.909962848967	20/04/28 05:18:11
3	17	358.96346105002317	253.95534988182004	20/04/28 05:18:11
3	17	359.0111140121624	253.90751388434163	20/04/28 05:18:11
3	17	359.0996701660628	254.04625977865865	20/04/28 05:18:12
3	17	358.8824475920689	254.21932813697535	20/04/28 05:18:12
3	17	359.0266508172497	254.03706922158833	20/04/28 05:18:12
3	17	359.1339599359063	254.13488553309733	20/04/28 05:18:12
3	17	359.02033184870265	254.07258756289133	20/04/28 05:18:12
3	17	359.020056855167	254.0478559503447	20/04/28 05:18:12
3	17	359.07518065656757	254.06585121078618	20/04/28 05:18:12
3	17	359.07518065656757	254.06585121078618	20/04/28 05:18:12
3	17	359.28954837516824	254.32104170516067	20/04/28 05:18:12
3	17	359.28954837516824	254.32104170516067	20/04/28 05:18:13
3	17	359.28954837516824	254.32104170516067	20/04/28 05:18:13
3	17	359.28954837516824	254.32104170516067	20/04/28 05:18:13
3	17	359.5420400150784	254.1626228658536	20/04/28 05:18:13
3	17	359.7440309777928	254.03588926835658	20/04/28 05:18:13
3	17	359.9356707160242	253.9156502580411	20/04/28 05:18:13
3	17	360.3168595380707	253.6764839602305	20/04/28 05:18:13
3	17	360.3168595380707	253.6764839602305	20/04/28 05:18:13
3	17	360.7115868976564	253.42882328453223	20/04/28 05:18:13
3	17	360.9153420713364	253.30098278205588	20/04/28 05:18:13
3	17	361.0842282410185	253.19501986389523	20/04/28 05:18:14
3	17	361.2554612326361	253.0875844977469	20/04/28 05:18:14
3	17	361.2554612326361	253.0875844977469	20/04/28 05:18:14
3	17	361.42152173659485	252.98339446475705	20/04/28 05:18:14
3	17	361.5513769217923	252.90192044952113	20/04/28 05:18:14
3	17	362.00963670364996	252.6143981269253	20/04/28 05:18:14
3	17	362.2099092578595	252.48874269693076	20/04/28 05:18:14
3	17	362.36549307173226	252.39112597101678	20/04/28 05:18:14
3	17	362.53842537316217	252.2826244203081	20/04/28 05:18:14
3	17	362.67287734860815	252.19826627720178	20/04/28 05:18:14
3	17	362.8627850655225	252.07911397536824	20/04/28 05:18:15
3	17	363.11533658006397	251.92065756939323	20/04/28 05:18:15
3	17	363.11533658006397	251.92065756939323	20/04/28 05:18:15
3	17	363.42417736142795	251.72688403244848	20/04/28 05:18:15
3	17	363.42417736142795	251.72688403244848	20/04/28 05:18:15
3	17	363.63463375171415	251.59483903846072	20/04/28 05:18:15
3	17	363.8874747694148	251.43620099180063	20/04/28 05:18:15
3	17	364.1183241339081	251.29136099475826	20/04/28 05:18:15
3	17	364.2513026168085	251.20792735346467	20/04/28 05:18:15
3	34	364.33608333333336	251.22295567743726	20/04/28 05:18:16
3	34	364.33608333333336	251.46076559189441	20/04/28 05:18:16
3	34	364.33608333333336	251.68081442409516	20/04/28 05:18:16
3	34	364.33608333333336	251.903987284662	20/04/28 05:18:16
3	34	364.33608333333336	252.077922364255	20/04/28 05:18:16
3	34	364.33608333333336	252.31989593483112	20/04/28 05:18:16
3	34	364.33608333333336	252.49185454856442	20/04/28 05:18:16
3	34	364.33608333333336	252.7317563463041	20/04/28 05:18:16
3	34	364.33608333333336	253.15701509958606	20/04/28 05:18:16
3	34	364.33608333333336	253.15701509958606	20/04/28 05:18:16
3	34	364.33608333333336	253.41589776913943	20/04/28 05:18:17
3	34	364.33608333333336	253.70342008347342	20/04/28 05:18:17
3	34	364.33608333333336	253.97108295591394	20/04/28 05:18:17
3	34	364.33608333333336	254.18725207074917	20/04/28 05:18:17
3	34	364.33608333333336	254.42981720225706	20/04/28 05:18:17
3	34	364.33608333333336	254.72752584337525	20/04/28 05:18:17
3	34	364.33608333333336	255.00077544342741	20/04/28 05:18:17
3	34	364.33608333333336	255.18121650776632	20/04/28 05:18:17
3	34	364.33608333333336	255.38630226019296	20/04/28 05:18:17
3	34	364.33608333333336	255.78693824514357	20/04/28 05:18:17
3	34	364.33608333333336	256.02267763436913	20/04/28 05:18:18
3	34	364.31517287886305	256.22283761094366	20/04/28 05:18:18
3	34	364.31517287886305	256.22283761094366	20/04/28 05:18:18
3	34	364.22591861175204	256.49325857933366	20/04/28 05:18:18
3	34	364.137259650995	256.7618758992713	20/04/28 05:18:18
3	34	364.06853383053055	256.9701001503346	20/04/28 05:18:18
3	34	364.00204816107794	257.1715372322734	20/04/28 05:18:18
3	34	363.9216703890077	257.4150643561164	20/04/28 05:18:18
3	34	363.8659773899304	257.5838020000466	20/04/28 05:18:18
3	34	363.7982707989851	257.78893820789915	20/04/28 05:18:19
3	34	363.6572841758599	258.2160969353147	20/04/28 05:18:19
3	34	363.6572841758599	258.2160969353147	20/04/28 05:18:19
3	34	363.56800749895376	258.48658580049766	20/04/28 05:18:19
3	34	363.47746981103353	258.76089525410316	20/04/28 05:18:19
3	34	363.30962906790074	259.26941610988274	20/04/28 05:18:19
3	34	363.2623628815418	259.4126223486544	20/04/28 05:18:19
3	34	363.2623628815418	259.4126223486544	20/04/28 05:18:19
3	34	363.1307440329874	259.81139876166543	20/04/28 05:18:19
3	34	363.1307440329874	259.81139876166543	20/04/28 05:18:19
3	34	363.04840330047705	260.06087322763926	20/04/28 05:18:20
3	34	362.99485320508546	260.2231183406394	20/04/28 05:18:20
3	34	362.9185018890732	260.45444618055325	20/04/28 05:18:20
3	47	362.71977187808324	260.589485760294	20/04/28 05:18:20
3	47	362.322782443161	260.5922496814284	20/04/28 05:18:20
3	47	362.322782443161	260.5922496814284	20/04/28 05:18:20
3	47	362.03884187699657	260.5942265333613	20/04/28 05:18:20
3	47	361.8303254083989	260.59567826739686	20/04/28 05:18:20
3	47	361.63556227807106	260.59703424789603	20/04/28 05:18:20
3	47	361.46265290341364	260.5982380781064	20/04/28 05:18:20
3	47	361.2663646845802	260.59960467658175	20/04/28 05:18:21
3	47	361.05254275368895	260.6010933483241	20/04/28 05:18:21
3	47	360.8512733288771	260.6024946269679	20/04/28 05:18:21
3	47	360.61811056792266	260.60411795350024	20/04/28 05:18:21
3	47	360.3784798003952	260.60578631160894	20/04/28 05:18:21
3	47	360.1864096550122	260.60712354299955	20/04/28 05:18:21
3	47	359.9773198989476	260.608579268379	20/04/28 05:18:21
3	47	359.8252246581231	260.6096381863591	20/04/28 05:18:21
3	47	359.6476355330376	260.61087459794317	20/04/28 05:18:21
3	47	359.45168052475526	260.61223887653887	20/04/28 05:18:22
3	47	359.2255510214189	260.61381323610215	20/04/28 05:18:22
3	47	359.049759387429	260.6150371331878	20/04/28 05:18:22
3	47	358.75858904417896	260.6170643202982	20/04/28 05:18:22
3	47	358.53242625582595	260.6186389115985	20/04/28 05:18:22
3	47	358.2332487859348	260.620721845952	20/04/28 05:18:22
3	47	358.0773843738844	260.6218070056683	20/04/28 05:18:22
3	47	357.8305268452249	260.6235256779569	20/04/28 05:18:22
3	47	357.54288072639804	260.6255283287005	20/04/28 05:18:22
3	47	357.2955810793593	260.6272500791071	20/04/28 05:18:22
3	47	357.020398778687	260.62916595421547	20/04/28 05:18:23
3	47	356.7229897805273	260.63123657610936	20/04/28 05:18:23
3	47	356.4304446129691	260.633273335026	20/04/28 05:18:23
3	47	356.18716603862015	260.6349670899072	20/04/28 05:18:23
3	47	355.98688400379393	260.6363614941412	20/04/28 05:18:23
3	47	355.7761459057881	260.63782869561226	20/04/28 05:18:23
3	47	355.5016461983019	260.6397398183681	20/04/28 05:18:23
3	47	355.3068240226082	260.6410962099531	20/04/28 05:18:23
3	47	355.01029964109443	260.6431606729661	20/04/28 05:18:23
3	47	354.7791970443572	260.6447696562164	20/04/28 05:18:24
3	47	354.4852858646476	260.6468159255873	20/04/28 05:18:24
3	47	354.28184558140026	260.6482323181887	20/04/28 05:18:24
3	47	354.0926344390501	260.6495496446191	20/04/28 05:18:24
3	47	353.8320971059156	260.6513635584869	20/04/28 05:18:24
3	47	353.6202617201374	260.6528383994984	20/04/28 05:18:24
3	47	353.4616898419907	260.65394240914395	20/04/28 05:18:24
3	47	353.21113615841153	260.6556868148143	20/04/28 05:18:24
3	47	353.21113615841153	260.6556868148143	20/04/28 05:18:24
3	47	352.9680778836678	260.6573790359249	20/04/28 05:18:24
3	47	352.66894113306574	260.6594616867825	20/04/28 05:18:25
3	47	352.66894113306574	260.6594616867825	20/04/28 05:18:25
3	47	352.4282938850585	260.66113712183494	20/04/28 05:18:25
3	47	352.1814600481323	260.6628556291769	20/04/28 05:18:25
3	47	351.9929670993283	260.66416795539783	20/04/28 05:18:25
3	47	351.7857114145779	260.66561091159997	20/04/28 05:18:25
3	47	351.56234906371924	260.66716600568526	20/04/28 05:18:25
3	47	351.56234906371924	260.66716600568526	20/04/28 05:18:25
3	47	351.27972258004434	260.6691337087087	20/04/28 05:18:25
3	47	351.0564804863053	260.6706879655395	20/04/28 05:18:25
3	47	350.86804527618676	260.671999889772	20/04/28 05:18:26
3	47	350.86804527618676	260.671999889772	20/04/28 05:18:26
3	47	350.6699642189172	260.67337897035287	20/04/28 05:18:26
3	47	350.4150566386748	260.67515368873677	20/04/28 05:18:26
3	47	350.1194041947325	260.6772120811432	20/04/28 05:18:26
3	47	349.9428534471718	260.6784412633318	20/04/28 05:18:26
3	47	349.72650627641286	260.67994751630744	20/04/28 05:18:26
3	47	349.46894088075317	260.68174073894244	20/04/28 05:18:26
3	47	349.2759547059828	260.68308434791584	20/04/28 05:18:26
3	47	349.103666693819	260.68428385207426	20/04/28 05:18:27
3	47	348.91964503514714	260.68556504826455	20/04/28 05:18:27
3	47	348.7611754883403	260.68666834545854	20/04/28 05:18:27
3	47	348.5894484015015	260.68786394434085	20/04/28 05:18:27
3	47	348.3455140636273	260.68956226478105	20/04/28 05:18:27
3	47	348.1520642810765	260.69090910148606	20/04/28 05:18:27
3	47	347.8932193646481	260.69271123240475	20/04/28 05:18:27
3	47	347.6228371333189	260.69459368845475	20/04/28 05:18:27
3	47	347.396941832567	260.69616641745205	20/04/28 05:18:27
3	47	347.17148609860084	260.69773608609603	20/04/28 05:18:27
3	47	346.9569070014765	260.6992300293836	20/04/28 05:18:28
3	47	346.76281375986844	260.70058134598133	20/04/28 05:18:28
3	47	346.6063812351194	260.7016704610137	20/04/28 05:18:28
3	47	346.3809189094056	260.7032401755508	20/04/28 05:18:28
3	47	346.1981277899087	260.7045128044772	20/04/28 05:18:28
3	47	346.011999286845	260.7058086689463	20/04/28 05:18:28
3	47	345.7650718737874	260.70752782778425	20/04/28 05:18:28
3	47	345.59521881325594	260.7087103793145	20/04/28 05:18:28
3	47	345.32225764291485	260.71061079046206	20/04/28 05:18:28
3	47	345.14068701835544	260.7118749220547	20/04/28 05:18:28
3	47	344.8430086378511	260.7139474194432	20/04/28 05:18:29
3	47	344.68593548804574	260.7150409946374	20/04/28 05:18:29
3	47	344.42891831036604	260.7168304004674	20/04/28 05:18:29
3	47	344.16742717612436	260.7186509548923	20/04/28 05:18:29
3	47	343.9883261467714	260.71989789266115	20/04/28 05:18:29
3	47	343.7592657017652	260.7214926580361	20/04/28 05:18:29
3	47	343.48007264959153	260.7234364568116	20/04/28 05:18:29
3	47	343.19441479988785	260.7254252648215	20/04/28 05:18:29
3	47	342.9691253860056	260.7269937755113	20/04/28 05:18:29
3	47	342.7187829406924	260.7287367104979	20/04/28 05:18:30
3	47	342.4814995299213	260.7303887258318	20/04/28 05:18:30
3	47	342.2163181684716	260.7322349723686	20/04/28 05:18:30
3	47	342.2163181684716	260.7322349723686	20/04/28 05:18:30
3	47	342.0461727481397	260.7334195593672	20/04/28 05:18:30
3	47	341.8577950957842	260.73473108287084	20/04/28 05:18:30
3	47	341.698517244223	260.7358400076468	20/04/28 05:18:30
3	47	341.48305086270466	260.7373401283887	20/04/28 05:18:30
3	47	341.2137053200348	260.73921536680155	20/04/28 05:18:30
3	47	340.9954259583492	260.7407350720831	20/04/28 05:18:30
3	47	340.81437843089014	260.7419955617674	20/04/28 05:18:31
3	47	340.53038316205294	260.7439727945514	20/04/28 05:18:31
3	47	340.26771224793276	260.7458015628436	20/04/28 05:18:31
3	47	340.00480696893663	260.74763196283175	20/04/28 05:18:31
3	47	339.80800158699327	260.7490021619017	20/04/28 05:18:31
3	47	339.5351020251147	260.75090214411864	20/04/28 05:18:31
3	47	339.3103067960832	260.752467214193	20/04/28 05:18:31
3	47	339.14372227324804	260.7536270094995	20/04/28 05:18:31
3	47	338.848830877347	260.7556801033347	20/04/28 05:18:31
3	47	338.5536818776501	260.75773499065997	20/04/28 05:18:31
3	47	338.27652367672897	260.75966462238745	20/04/28 05:18:32
3	47	337.99161876779493	260.76164818827067	20/04/28 05:18:32
3	47	337.70006692828093	260.7636780314356	20/04/28 05:18:32
3	47	337.44652954914847	260.76544321020083	20/04/28 05:18:32
3	47	337.2292583504806	260.7669558964466	20/04/28 05:18:32
3	47	337.0172829156223	260.7684317125083	20/04/28 05:18:32
3	47	336.7468802472224	260.7703143108453	20/04/28 05:18:32
3	47	336.52105402734765	260.7718865588875	20/04/28 05:18:32
3	47	336.2834472679464	260.77354082544025	20/04/28 05:18:32
3	47	335.99343017952816	260.7755599833561	20/04/28 05:18:33
3	47	335.7745015320612	260.77708420909727	20/04/28 05:18:33
3	47	335.50699802133147	260.77894662290936	20/04/28 05:18:33
3	47	335.22596299178866	260.7809032459057	20/04/28 05:18:33
3	47	335.01902397133216	260.78234399742666	20/04/28 05:18:33
3	47	334.8142506376688	260.78376967099604	20/04/28 05:18:33
3	47	334.6286854109722	260.78506161382063	20/04/28 05:18:33
3	47	334.37910429467803	260.78679924827986	20/04/28 05:18:33
3	47	334.2138066876001	260.78795008381724	20/04/28 05:18:33
3	47	333.9928716216066	260.78948827865196	20/04/28 05:18:33
3	47	333.7730860049929	260.79101847078647	20/04/28 05:18:34
3	47	333.54477407967426	260.7926080248152	20/04/28 05:18:34
3	47	333.3540755006001	260.79393570708237	20/04/28 05:18:34
3	47	333.16746273591383	260.7952349430794	20/04/28 05:18:34
3	47	332.8956272139638	260.79712751723406	20/04/28 05:18:34
3	47	332.7210266341754	260.7983431219583	20/04/28 05:18:34
3	47	332.43647102096946	260.80032425597363	20/04/28 05:18:34
3	47	332.2031794320084	260.8019484794327	20/04/28 05:18:34
3	47	331.9783666520725	260.80351367170005	20/04/28 05:18:34
3	47	331.744232595928	260.80514376058693	20/04/28 05:18:34
3	47	331.5399938711859	260.80656571210034	20/04/28 05:18:35
3	47	331.34581975290695	260.8079175917779	20/04/28 05:18:35
3	47	331.0896582985218	260.8097010398884	20/04/28 05:18:35
3	47	330.8330509678089	260.8114875922805	20/04/28 05:18:35
3	47	330.55956499157514	260.81339165723335	20/04/28 05:18:35
3	47	330.3309118952573	260.81498358656387	20/04/28 05:18:35
3	47	330.0330405837316	260.81705742717736	20/04/28 05:18:35
3	47	329.86648989411975	260.81821698693005	20/04/28 05:18:35
3	47	329.6468412328708	260.8197462255535	20/04/28 05:18:35
3	47	329.42934113795565	260.82126050542144	20/04/28 05:18:36
3	47	329.25830413728505	260.82245129978355	20/04/28 05:18:36
3	47	329.07784936337487	260.82370766259714	20/04/28 05:18:36
3	47	328.8644624923844	260.8251933053641	20/04/28 05:18:36
3	47	328.70573726209864	260.82629838267843	20/04/28 05:18:36
3	47	328.4260992356656	260.8282452794552	20/04/28 05:18:36
3	47	328.15552229154594	260.8301290911352	20/04/28 05:18:36
3	47	327.9794611066699	260.8313548648889	20/04/28 05:18:36
3	47	327.7574727725245	260.8329003927906	20/04/28 05:18:36
3	47	327.51483873663824	260.83458966026404	20/04/28 05:18:36
3	47	327.3265641152712	260.835900466445	20/04/28 05:18:37
3	47	327.1372262617058	260.83721867506466	20/04/28 05:18:37
3	47	326.84585076341205	260.83924729050614	20/04/28 05:18:37
3	47	326.59991090404924	260.8409595737946	20/04/28 05:18:37
3	47	326.37115566925576	260.84255221423393	20/04/28 05:18:37
3	47	326.07776585496845	260.84459485375277	20/04/28 05:18:37
3	47	325.90838669877553	260.8457741058647	20/04/28 05:18:37
3	47	325.73712289647676	260.8469664792658	20/04/28 05:18:37
3	47	325.52313231034947	260.84845632522024	20/04/28 05:18:37
3	47	325.2988320658568	260.85001794911165	20/04/28 05:18:37
3	47	325.0741966865026	260.8515819062801	20/04/28 05:18:38
3	47	324.84224806257345	260.8531967797437	20/04/28 05:18:38
3	47	324.6315288505705	260.8546638497266	20/04/28 05:18:38
3	47	324.3783964729154	260.85642620878923	20/04/28 05:18:38
3	47	324.1086106973663	260.85830451219283	20/04/28 05:18:38
3	47	323.9580496518833	260.8593527487932	20/04/28 05:18:38
3	47	323.77915360612207	260.8605982594246	20/04/28 05:18:38
3	47	323.50989370782025	260.86247290156393	20/04/28 05:18:38
3	47	323.35665838228243	260.86353975704554	20/04/28 05:18:38
3	47	323.1241882898552	260.8651582610788	20/04/28 05:18:39
3	47	322.9237493592098	260.8665537576534	20/04/28 05:18:39
3	47	322.6331852087911	260.86857672432603	20/04/28 05:18:39
3	47	322.33987555669233	260.8706188057394	20/04/28 05:18:39
3	47	322.1255115088593	260.87211125181017	20/04/28 05:18:39
3	47	321.8567667674243	260.8739823073227	20/04/28 05:18:39
3	47	321.56566136830935	260.87600904227884	20/04/28 05:18:39
3	47	321.3390066244799	260.8775870586732	20/04/28 05:18:39
3	47	321.1558831066354	260.8788620018245	20/04/28 05:18:39
3	47	320.8680260956343	260.8808661208423	20/04/28 05:18:39
3	47	320.62448899475993	260.88256167563776	20/04/28 05:18:40
3	47	320.3525970522713	260.88445464260366	20/04/28 05:18:40
3	47	320.17547475169175	260.8856878040606	20/04/28 05:18:40
3	47	319.95196251491	260.88724394168213	20/04/28 05:18:40
3	47	319.69174070156066	260.88905565883704	20/04/28 05:18:40
3	47	319.45732882628437	260.89068768195716	20/04/28 05:18:40
3	47	319.22171215240604	260.89232809313006	20/04/28 05:18:40
3	47	318.9620200869912	260.89413612207215	20/04/28 05:18:40
3	47	318.7009960473203	260.89595342448973	20/04/28 05:18:40
3	47	318.5013075786541	260.8973436961955	20/04/28 05:18:40
3	47	318.26719162077336	260.8989736590786	20/04/28 05:18:41
3	47	318.0952886501294	260.9001704824997	20/04/28 05:18:41
3	47	317.9173518484626	260.90140931467874	20/04/28 05:18:41
3	47	317.68443923334394	260.90303089964493	20/04/28 05:18:41
3	47	317.5015889032698	260.90430394080744	20/04/28 05:18:41
3	47	317.24032563240115	260.90612290880125	20/04/28 05:18:41
3	47	317.0613862668378	260.9073687210339	20/04/28 05:18:41
3	47	316.86101742344135	260.9087637296468	20/04/28 05:18:41
3	47	316.6841015521471	260.9099954539011	20/04/28 05:18:41
3	47	316.3960539103997	260.91200090012893	20/04/28 05:18:42
3	47	316.2054543983123	260.91332789267165	20/04/28 05:18:42
3	47	316.0193983321498	260.9146232528204	20/04/28 05:18:42
3	47	315.86874707330026	260.9156721175045	20/04/28 05:18:42
3	47	315.700269489577	260.91684509268566	20/04/28 05:18:42
3	47	315.41101025307466	260.91885897428244	20/04/28 05:18:42
3	47	315.1143148949241	260.92092462766954	20/04/28 05:18:42
3	47	314.95875512179106	260.92200766642776	20/04/28 05:18:42
3	47	314.69749765877845	260.9238265939861	20/04/28 05:18:42
3	47	314.472887379451	260.9253903764031	20/04/28 05:18:42
3	47	314.20527624646235	260.92725353950317	20/04/28 05:18:43
3	47	313.9784913585793	260.9288324619869	20/04/28 05:18:43
3	47	313.82725822424965	260.9298853778064	20/04/28 05:18:43
3	47	313.648231924644	260.9311317952915	20/04/28 05:18:43
3	47	313.4001427185121	260.93285904276894	20/04/28 05:18:43
3	47	313.23777126834386	260.9339895058072	20/04/28 05:18:43
3	47	312.98353801495597	260.93575952939045	20/04/28 05:18:43
3	47	312.8037417183061	260.9370113077515	20/04/28 05:18:43
3	47	312.5491142068357	260.93878407623964	20/04/28 05:18:43
3	47	312.26650539100615	260.940751656256	20/04/28 05:18:43
3	47	312.08563737219106	260.9420108961646	20/04/28 05:18:44
3	47	311.8472501625346	260.9436705963707	20/04/28 05:18:44
3	47	311.62834325204676	260.9451946707745	20/04/28 05:18:44
3	47	311.45441271127316	260.9464056105509	20/04/28 05:18:44
3	47	311.20525183580617	260.9481403192081	20/04/28 05:18:44
3	47	311.0549473065366	260.94918676989045	20/04/28 05:18:44
3	47	310.84315103619934	260.95066133857233	20/04/28 05:18:44
3	47	310.64610128428035	260.95203323899574	20/04/28 05:18:44
3	47	310.39062130620215	260.9538119425297	20/04/28 05:18:44
3	47	309.89618323934326	260.95725432084623	20/04/28 05:18:45
3	47	309.73718394469216	260.95836130625236	20/04/28 05:18:45
3	47	309.4579506498958	260.9603053852052	20/04/28 05:18:45
3	47	309.28787036742926	260.9614895187007	20/04/28 05:18:45
3	47	309.0557840343984	260.96310535092306	20/04/28 05:18:45
3	47	308.8349058020102	260.9646431500707	20/04/28 05:18:45
3	47	308.56168488312187	260.9665453696404	20/04/28 05:18:45
3	47	308.2719868329963	260.9685623063468	20/04/28 05:18:45
3	47	308.04039172137584	260.9701747185859	20/04/28 05:18:45
3	47	307.7585994935814	260.97213661335036	20/04/28 05:18:45
3	47	307.5936989496923	260.9732846844531	20/04/28 05:18:46
3	47	307.30113256228316	260.97532159110665	20/04/28 05:18:46
3	47	307.113514572143	260.97662782568756	20/04/28 05:18:46
3	47	306.91182918261006	260.97803200036225	20/04/28 05:18:46
3	47	306.7437162233755	260.9792024369536	20/04/28 05:18:46
3	47	306.5239236789642	260.9807326773208	20/04/28 05:18:46
3	47	306.3689151390235	260.9818118782815	20/04/28 05:18:46
3	47	306.07471799742234	260.9838601385772	20/04/28 05:18:46
3	47	305.8078150799219	260.98571837093715	20/04/28 05:18:46
3	47	305.61799199242506	261.0336853346355	20/04/28 05:18:47
3	47	305.48758209286126	261.19020366733895	20/04/28 05:18:47
3	47	305.3610872804942	261.34202310124357	20/04/28 05:18:47
3	47	305.2311360701642	261.49799091382283	20/04/28 05:18:47
3	47	305.09796094501286	261.6578280781485	20/04/28 05:18:47
3	47	304.9601678406424	261.8232077542793	20/04/28 05:18:47
3	47	304.80366498446597	262.0110429277899	20/04/28 05:18:47
3	47	304.6701364432682	262.17130426306056	20/04/28 05:18:47
3	47	304.53570561113906	262.33264853047564	20/04/28 05:18:47
3	47	304.38915978154375	262.5085332523382	20/04/28 05:18:47
3	47	304.2527263040402	262.67228110043277	20/04/28 05:18:48
3	47	304.14747831280147	262.7986000391344	20/04/28 05:18:48
3	47	303.9915039122759	262.9858009586685	20/04/28 05:18:48
3	47	303.8125668381656	263.20056174440845	20/04/28 05:18:48
3	47	303.6215248787922	263.429850847901	20/04/28 05:18:48
3	47	303.48864845413675	263.5893295110411	20/04/28 05:18:48
3	47	303.48864845413675	263.5893295110411	20/04/28 05:18:48
3	47	303.3198141403222	263.79196493511387	20/04/28 05:18:48
3	47	303.0671883363663	264.0951671441895	20/04/28 05:18:48
3	47	303.0671883363663	264.0951671441895	20/04/28 05:18:48
3	47	302.8848107674749	264.31405722156006	20/04/28 05:18:49
