floorId	partitionId	location_x	location_y	timeStamp
1	97	337.2586468419421	285.47441107691395	20/04/28 05:08:49
1	97	337.1901116847542	285.38267910856854	20/04/28 05:08:49
1	97	336.98831726805196	285.2362733270737	20/04/28 05:08:49
1	97	336.77334100460604	285.1380816707974	20/04/28 05:08:49
1	97	336.528739246221	285.07216972858333	20/04/28 05:08:49
1	97	336.5113323174226	285.21394026786163	20/04/28 05:08:49
1	97	336.5354660607701	285.24331232885885	20/04/28 05:08:49
1	97	336.4911691335381	285.3639872558401	20/04/28 05:08:49
1	97	336.6157833041456	285.12202252239405	20/04/28 05:08:49
1	97	336.70386676709995	285.098883272104	20/04/28 05:08:50
1	97	336.7419093564389	285.2252650624694	20/04/28 05:08:50
1	97	336.7419093564389	285.2252650624694	20/04/28 05:08:50
1	97	336.60041607479604	285.1496277143023	20/04/28 05:08:50
1	97	336.7389129307746	285.3985186438335	20/04/28 05:08:50
1	97	336.7389129307746	285.3985186438335	20/04/28 05:08:50
1	97	336.8934489662262	285.29184696837245	20/04/28 05:08:50
1	97	336.7537217260564	285.2665674363425	20/04/28 05:08:50
1	97	336.9139378492354	285.4161810432252	20/04/28 05:08:50
1	97	336.95762865931266	285.2780543126293	20/04/28 05:08:50
1	97	336.95762865931266	285.2780543126293	20/04/28 05:08:51
1	97	336.9652879121618	285.5526809828034	20/04/28 05:08:51
1	97	336.9652879121618	285.5526809828034	20/04/28 05:08:51
1	97	336.85953554426897	285.65408268783756	20/04/28 05:08:51
1	97	336.65942537971347	285.62002907717357	20/04/28 05:08:51
1	97	336.51225804055133	285.61959116998645	20/04/28 05:08:51
1	97	336.4997554517259	285.6343481009717	20/04/28 05:08:51
1	97	336.45830549753	285.61218408580027	20/04/28 05:08:51
1	97	336.3903087675239	285.3790031035914	20/04/28 05:08:51
1	97	336.13148098333846	285.3903494331186	20/04/28 05:08:52
1	97	336.1418354384042	285.6271852802815	20/04/28 05:08:52
1	97	336.1418354384042	285.6271852802815	20/04/28 05:08:52
1	97	336.38086353921847	285.64815924492876	20/04/28 05:08:52
1	97	336.38086353921847	285.64815924492876	20/04/28 05:08:52
1	97	336.3698898846866	285.73410750984675	20/04/28 05:08:52
1	97	336.4134127572928	285.57596174646716	20/04/28 05:08:52
1	97	336.28584372775555	285.6347055121479	20/04/28 05:08:52
1	97	336.21601092323374	285.42717185187615	20/04/28 05:08:52
1	97	336.1636474114971	285.2808864910984	20/04/28 05:08:52
1	97	336.1226399296991	285.2818338490224	20/04/28 05:08:53
1	97	335.9711146981266	285.19824425339317	20/04/28 05:08:53
1	97	336.1760701542869	285.17349531983075	20/04/28 05:08:53
1	97	336.3773254797601	285.0677322940794	20/04/28 05:08:53
1	97	336.1248126576907	285.1174666615904	20/04/28 05:08:53
1	97	335.965523168107	285.1582818491888	20/04/28 05:08:53
1	97	335.8295003675812	285.1725536273591	20/04/28 05:08:53
1	97	335.58132273112136	285.29441364646624	20/04/28 05:08:53
1	97	335.58245496828187	285.29646297877986	20/04/28 05:08:53
1	97	335.6452947683214	285.0708628305562	20/04/28 05:08:53
1	97	335.66084524429925	285.2376321875438	20/04/28 05:08:54
1	97	335.9096880260475	285.315092127248	20/04/28 05:08:54
1	97	335.9497939152278	285.339344139836	20/04/28 05:08:54
1	97	336.09108015979785	285.37984891186153	20/04/28 05:08:54
1	97	336.13970816579865	285.3923428221159	20/04/28 05:08:54
1	97	336.12144421755534	285.3925997892043	20/04/28 05:08:54
1	97	336.2737677608164	285.2316785557611	20/04/28 05:08:54
1	97	336.3868865006683	285.22363884370304	20/04/28 05:08:54
1	97	336.2533100486858	285.2936652559439	20/04/28 05:08:54
1	97	336.27869525212043	285.19324079219894	20/04/28 05:08:55
1	97	336.366611019581	285.30431532154586	20/04/28 05:08:55
1	97	336.3561253752379	285.29950175408226	20/04/28 05:08:55
1	97	336.1560533395824	285.18152824894037	20/04/28 05:08:55
1	97	336.01835723035583	285.23639523878273	20/04/28 05:08:55
1	97	335.90843122622925	285.4523088056883	20/04/28 05:08:55
1	97	335.64521632990875	285.5684130549984	20/04/28 05:08:55
1	97	335.809368186857	285.5813920924118	20/04/28 05:08:55
1	97	335.6994998784736	285.7621953795827	20/04/28 05:08:55
1	97	335.6683269647065	285.76645450654735	20/04/28 05:08:55
1	97	335.65498845069425	285.7049839096315	20/04/28 05:08:56
1	97	335.63746903661223	285.43755610907857	20/04/28 05:08:56
1	97	335.85853255992464	285.4231612308188	20/04/28 05:08:56
1	97	335.87118364768565	285.41593875701074	20/04/28 05:08:56
1	97	335.8737299297996	285.46480950209656	20/04/28 05:08:56
1	97	336.07187027417467	285.6320686949014	20/04/28 05:08:56
1	97	336.16122465149743	285.51175588062074	20/04/28 05:08:56
1	97	336.14736280190573	285.29370066506755	20/04/28 05:08:56
1	97	336.1836032280364	285.3162003953534	20/04/28 05:08:56
1	97	336.18484317602514	285.31226179007024	20/04/28 05:08:57
1	97	336.2089110601663	285.46953205337405	20/04/28 05:08:57
1	97	336.1984711016507	285.4599223333348	20/04/28 05:08:57
1	97	336.07066003487597	285.6069904289477	20/04/28 05:08:57
1	97	335.8949331244537	285.6627664779431	20/04/28 05:08:57
1	97	335.84106464879125	285.936766842368	20/04/28 05:08:57
1	97	335.76475482230927	285.8938895498112	20/04/28 05:08:57
1	97	335.7486350417029	285.877705038669	20/04/28 05:08:57
1	97	335.7037207828701	285.90145808493196	20/04/28 05:08:57
1	97	335.8147581791841	286.074906309198	20/04/28 05:08:57
1	97	335.8742036513241	286.20736253306995	20/04/28 05:08:58
1	97	335.6819134535672	286.249871626111	20/04/28 05:08:58
1	97	335.5040501532065	285.97624166355047	20/04/28 05:08:58
1	97	335.65390192645344	286.1877207141462	20/04/28 05:08:58
1	97	335.65390192645344	286.1877207141462	20/04/28 05:08:58
1	97	335.69076228234456	286.24250381013627	20/04/28 05:08:58
1	97	335.6668410385584	286.16137065378337	20/04/28 05:08:58
1	97	335.7683502399208	286.28381405856544	20/04/28 05:08:58
1	97	335.91356129620067	286.2464131872988	20/04/28 05:08:58
1	97	335.9697772991632	286.2734080628563	20/04/28 05:08:58
1	97	335.93492065279275	286.08871082886475	20/04/28 05:08:59
1	97	336.04015729391125	286.05422618826776	20/04/28 05:08:59
1	97	336.03537076993786	286.069040921545	20/04/28 05:08:59
1	97	335.95769595273	286.1382187019801	20/04/28 05:08:59
1	97	335.9949076714952	286.1500967067432	20/04/28 05:08:59
1	97	335.8835816230145	285.99059024097124	20/04/28 05:08:59
1	97	336.04120706456695	285.94771924922406	20/04/28 05:08:59
1	97	336.06993176316377	285.93342751289384	20/04/28 05:08:59
1	97	336.1357038943528	286.08022217355165	20/04/28 05:08:59
1	97	336.123169583505	285.8616501125656	20/04/28 05:09:00
1	97	336.0482077928036	286.01397373975954	20/04/28 05:09:00
1	97	336.0507198868662	286.0205124195937	20/04/28 05:09:00
1	97	336.01129809382815	286.1111842869295	20/04/28 05:09:00
1	97	336.13728719453286	286.2091030140896	20/04/28 05:09:00
1	97	336.1346754912288	286.23773223707377	20/04/28 05:09:00
1	97	336.10631593924035	286.23036915645685	20/04/28 05:09:00
1	97	336.1699674660536	286.23614340632207	20/04/28 05:09:00
1	97	336.22043339080426	286.1468024230389	20/04/28 05:09:00
1	97	336.2315092017091	286.1466153411725	20/04/28 05:09:00
1	97	336.450119958186	285.98822983749915	20/04/28 05:09:01
1	97	336.5020953953051	285.9504732030681	20/04/28 05:09:01
1	97	336.2926682957118	285.757806141261	20/04/28 05:09:01
1	97	336.34591914440153	285.66678169945277	20/04/28 05:09:01
1	97	336.05507291654226	285.63202504060905	20/04/28 05:09:01
1	97	336.04843519582244	285.48166029870197	20/04/28 05:09:01
1	97	335.9897863095815	285.3565005756307	20/04/28 05:09:01
1	97	335.97646092968125	285.33997652871534	20/04/28 05:09:01
1	97	336.24575483446375	285.22170606198017	20/04/28 05:09:01
1	97	336.3180767321435	285.062453071109	20/04/28 05:09:02
1	97	336.37931748055263	285.23473308034954	20/04/28 05:09:02
1	97	336.36796831450084	285.2127997242795	20/04/28 05:09:02
1	97	336.4040870505645	285.47256991756336	20/04/28 05:09:02
1	97	336.4799628623871	285.7442867772593	20/04/28 05:09:02
1	97	336.47010152428055	285.73442560480765	20/04/28 05:09:02
1	97	336.42098903899495	285.8076993985536	20/04/28 05:09:02
1	97	336.419610314894	285.98901525417773	20/04/28 05:09:02
1	97	336.2990308873882	286.1169415365975	20/04/28 05:09:02
1	97	336.50007913405614	285.94518220485895	20/04/28 05:09:02
1	97	336.4168973171188	285.931578219251	20/04/28 05:09:03
1	97	336.5749174614638	285.7572450411469	20/04/28 05:09:03
1	97	336.5582394150751	285.84928136598006	20/04/28 05:09:03
1	97	336.3825036085725	286.052088106098	20/04/28 05:09:03
1	97	336.40854310959355	286.000001628204	20/04/28 05:09:03
1	97	336.39520764489095	286.09594620646175	20/04/28 05:09:03
1	97	336.4192363198149	286.2539160226096	20/04/28 05:09:03
1	97	336.3903316896349	286.1780045306286	20/04/28 05:09:03
1	97	336.257395557667	286.35854537249946	20/04/28 05:09:03
1	97	336.2128120014933	286.44489525066723	20/04/28 05:09:03
1	97	336.0766969423812	286.43783527163646	20/04/28 05:09:04
1	97	336.05422866093255	286.54072536962445	20/04/28 05:09:04
1	97	336.221451316211	286.3251529282634	20/04/28 05:09:04
1	97	336.17478265697446	286.430790701079	20/04/28 05:09:04
1	97	336.17478265697446	286.430790701079	20/04/28 05:09:04
1	97	336.1425245746319	286.4587857000286	20/04/28 05:09:04
1	97	336.18504011319186	286.3054967129057	20/04/28 05:09:04
1	97	336.163698405669	286.3003442628509	20/04/28 05:09:04
1	97	336.2119805571469	286.20575908289834	20/04/28 05:09:04
1	97	336.20195661526253	286.19222276375945	20/04/28 05:09:05
1	97	336.41021384945384	286.1391039203426	20/04/28 05:09:05
1	97	336.1721069695382	286.2482205862358	20/04/28 05:09:05
1	97	336.2060271891215	286.2318483990471	20/04/28 05:09:05
1	97	336.0969487820765	286.19134083335086	20/04/28 05:09:05
1	97	336.0100430463035	286.0085568331447	20/04/28 05:09:05
1	97	336.0100430463035	286.0085568331447	20/04/28 05:09:05
1	97	335.71496392939576	285.6395068810336	20/04/28 05:09:05
1	97	335.8326118715565	285.46093632596325	20/04/28 05:09:05
1	97	335.78909443880895	285.4900293028099	20/04/28 05:09:05
1	97	335.7895127101077	285.46006303348605	20/04/28 05:09:06
1	97	335.9276158234732	285.5601959209006	20/04/28 05:09:06
1	97	335.8141432910005	285.62738784956775	20/04/28 05:09:06
1	97	335.7917603432318	285.76496692074534	20/04/28 05:09:06
1	97	335.75624596885154	285.6200241746442	20/04/28 05:09:06
1	97	335.78236511429475	285.35211064708704	20/04/28 05:09:06
1	97	335.77327935725646	285.3662467187505	20/04/28 05:09:06
1	97	335.8087320994584	285.1511636899415	20/04/28 05:09:06
1	97	335.818974169111	285.14411712980376	20/04/28 05:09:06
1	97	335.7596930039894	285.06801330296463	20/04/28 05:09:06
1	97	335.88339189858374	285.32304968168506	20/04/28 05:09:07
1	97	335.72307893806817	285.46060548635927	20/04/28 05:09:07
1	97	335.72307893806817	285.46060548635927	20/04/28 05:09:07
1	97	335.72307893806817	285.46060548635927	20/04/28 05:09:07
1	97	335.8096784687828	285.358234186407	20/04/28 05:09:07
1	97	335.8082860182265	285.64940653140707	20/04/28 05:09:07
1	97	335.60179985071795	285.8275661989682	20/04/28 05:09:07
1	97	335.50587613313553	285.9942780697627	20/04/28 05:09:07
1	97	335.5386040245384	286.0387794968848	20/04/28 05:09:07
1	97	335.4981068665169	285.99010307237353	20/04/28 05:09:08
1	97	335.5314337816197	286.1728463342127	20/04/28 05:09:08
1	97	335.55219507879247	285.8950833730377	20/04/28 05:09:08
1	97	335.6138835066661	286.1583535826995	20/04/28 05:09:08
1	97	335.6098246362921	286.0020993936299	20/04/28 05:09:08
1	97	335.7170653337703	286.08587442137	20/04/28 05:09:08
1	97	335.8409195942271	285.8392664781674	20/04/28 05:09:08
1	97	335.8131345088176	285.8470543919744	20/04/28 05:09:08
1	97	335.7471742743465	285.63603891704025	20/04/28 05:09:08
1	97	335.9075179006164	285.53305939526985	20/04/28 05:09:08
1	97	335.73199229000306	285.60154510249436	20/04/28 05:09:09
1	97	335.85280928173535	285.6219489888853	20/04/28 05:09:09
1	97	335.8539552805295	285.6287424858317	20/04/28 05:09:09
1	97	335.8214563984854	285.64407869781496	20/04/28 05:09:09
1	97	336.08523520147395	285.5539586030533	20/04/28 05:09:09
1	97	335.92820565309114	285.6146518083277	20/04/28 05:09:09
1	97	336.06425920080085	285.65202101340265	20/04/28 05:09:09
1	97	336.06146763157113	285.69801655955956	20/04/28 05:09:09
1	97	336.06451230686645	285.6851876275515	20/04/28 05:09:09
1	97	336.022867875955	285.82567978330263	20/04/28 05:09:10
1	97	336.0261516445295	285.85679150756937	20/04/28 05:09:10
1	97	336.02133973124245	286.0141540023138	20/04/28 05:09:10
1	97	336.0700520481839	285.7352911721188	20/04/28 05:09:10
1	97	335.9285754644833	285.5072095688191	20/04/28 05:09:10
1	97	335.87607572109187	285.53572259511276	20/04/28 05:09:10
1	97	335.96437228658374	285.70413302321464	20/04/28 05:09:10
1	97	335.99410379496953	285.9308789578874	20/04/28 05:09:10
1	97	335.997706494875	285.9367307552095	20/04/28 05:09:10
1	97	335.99597634131237	285.95700758213775	20/04/28 05:09:10
1	97	335.8033906282833	286.0475009135665	20/04/28 05:09:11
1	97	335.73169849322693	286.03687718834277	20/04/28 05:09:11
1	97	335.87114792554826	285.9696581036672	20/04/28 05:09:11
1	97	335.7531158196656	286.00482484704975	20/04/28 05:09:11
1	97	335.9190802777371	285.91704714921616	20/04/28 05:09:11
1	97	335.8869054515722	286.0579276401759	20/04/28 05:09:11
1	97	335.78461005259686	286.01494277594696	20/04/28 05:09:11
1	97	335.8203665303131	286.07842422719744	20/04/28 05:09:11
1	97	335.8232776102424	286.1017809531691	20/04/28 05:09:11
1	97	335.8109015715499	286.12695003951313	20/04/28 05:09:12
1	97	335.53101713584783	286.19078091118433	20/04/28 05:09:12
1	97	335.61024273508025	286.10535707642276	20/04/28 05:09:12
1	97	335.50183428334697	286.0823097193612	20/04/28 05:09:12
1	97	335.5756652472656	286.02153746312365	20/04/28 05:09:12
1	97	335.80615106972584	286.03554985552495	20/04/28 05:09:12
1	97	335.8105510901353	286.0539642033533	20/04/28 05:09:12
1	97	335.61519630353143	286.1239032722306	20/04/28 05:09:12
1	97	335.6833857901764	286.0625398476428	20/04/28 05:09:12
1	97	335.8154841181042	286.1144967968841	20/04/28 05:09:12
1	97	335.9249723814637	286.3784943891263	20/04/28 05:09:13
1	97	335.9274087126589	286.36909147466093	20/04/28 05:09:13
1	97	335.7667775383202	286.4015462310976	20/04/28 05:09:13
1	97	335.9956659827475	286.26601528883094	20/04/28 05:09:13
1	97	336.0370711904809	286.2598695241035	20/04/28 05:09:13
1	97	336.048801117538	286.26146565403434	20/04/28 05:09:13
1	97	336.12641105846535	286.22223607332694	20/04/28 05:09:13
1	97	336.1622913753021	286.30696395363225	20/04/28 05:09:13
1	97	336.1460121325264	286.41359541892984	20/04/28 05:09:13
1	97	336.1608428670597	286.3824814119391	20/04/28 05:09:13
1	97	336.1162226583419	286.27948723402295	20/04/28 05:09:14
1	97	336.17060243308663	286.4377633074499	20/04/28 05:09:14
1	97	336.1147589380998	286.7066264895198	20/04/28 05:09:14
1	97	336.1147475220103	286.70642631933543	20/04/28 05:09:14
1	97	336.0843061073365	286.68337318752816	20/04/28 05:09:14
1	97	336.0254627342967	286.7320368886644	20/04/28 05:09:14
1	97	335.97736320553	286.51497267623773	20/04/28 05:09:14
1	97	335.9431651125707	286.4076258670704	20/04/28 05:09:14
1	97	336.0875371093116	286.4824460718703	20/04/28 05:09:14
1	97	336.044236466047	286.4498903528062	20/04/28 05:09:15
1	97	336.0172916761017	286.43970440862256	20/04/28 05:09:15
1	97	335.90509565732856	286.48402241855945	20/04/28 05:09:15
1	97	336.08785154181254	286.57562150270707	20/04/28 05:09:15
1	97	336.13009399675116	286.5259834106242	20/04/28 05:09:15
1	97	336.1731306850406	286.4409123233265	20/04/28 05:09:15
1	97	336.0775267390776	286.40512951586646	20/04/28 05:09:15
1	97	336.09202235426574	286.2883113558505	20/04/28 05:09:15
1	97	336.09202235426574	286.2883113558505	20/04/28 05:09:15
1	97	336.09202235426574	286.2883113558505	20/04/28 05:09:15
1	97	335.7972347549051	286.2745406818961	20/04/28 05:09:16
1	97	335.7193697874944	286.18419669296765	20/04/28 05:09:16
1	97	335.7235250863886	286.1651837230243	20/04/28 05:09:16
1	97	335.81013518673285	286.2320438759816	20/04/28 05:09:16
1	97	335.63023351982474	286.37367587664465	20/04/28 05:09:16
1	97	335.8346735903626	286.21064868765006	20/04/28 05:09:16
1	97	335.8568618813799	286.24168863873956	20/04/28 05:09:16
1	97	335.9538502399022	286.048376768645	20/04/28 05:09:16
1	97	335.7688780147918	286.24792766557533	20/04/28 05:09:16
1	97	335.9049651591155	286.2198152377234	20/04/28 05:09:17
1	97	335.8992470714465	286.19611377769405	20/04/28 05:09:17
1	97	336.0716454176669	286.1924488436103	20/04/28 05:09:17
1	97	336.1213372754756	286.03890825185266	20/04/28 05:09:17
1	97	336.34120901385603	286.16743269208655	20/04/28 05:09:17
1	97	336.2863649305302	286.0808713631754	20/04/28 05:09:17
1	97	336.22710046077844	286.01216839613096	20/04/28 05:09:17
1	97	335.98718992128516	286.17210140060564	20/04/28 05:09:17
1	97	335.8448796152668	286.0647970294589	20/04/28 05:09:17
1	97	335.79362170096715	286.0542185323885	20/04/28 05:09:17
1	97	335.9573262911683	285.99602487023975	20/04/28 05:09:18
1	97	336.13626806384536	286.2301404062336	20/04/28 05:09:18
1	97	335.9464336632329	286.3725098567526	20/04/28 05:09:18
1	97	336.0168708576588	286.381018626095	20/04/28 05:09:18
1	97	335.9955844319154	286.3333102357693	20/04/28 05:09:18
1	97	335.92230003379154	286.2780487032731	20/04/28 05:09:18
1	97	335.8196978633555	286.338373339141	20/04/28 05:09:18
1	97	335.8133327265602	286.34291918961503	20/04/28 05:09:18
1	97	336.0405658429228	286.2041998080682	20/04/28 05:09:18
1	97	335.8112726841829	286.309655867671	20/04/28 05:09:18
1	97	335.7881636717731	286.2864388535231	20/04/28 05:09:19
1	97	335.7561173844117	286.303245468647	20/04/28 05:09:19
1	97	335.797177566859	286.34810344910164	20/04/28 05:09:19
1	97	335.80081555026834	286.53399802802835	20/04/28 05:09:19
1	97	335.7976073331879	286.4832777745933	20/04/28 05:09:19
1	97	335.79792106015344	286.48855089021754	20/04/28 05:09:19
1	97	335.7575883804708	286.50132995194207	20/04/28 05:09:19
1	97	335.58573231887596	286.465291400946	20/04/28 05:09:19
1	97	335.7127036641113	286.5976908250787	20/04/28 05:09:19
1	97	335.63259979713075	286.44976812518996	20/04/28 05:09:20
1	97	335.57766038389553	286.6779626061787	20/04/28 05:09:20
1	97	335.5484410084248	286.4431237184497	20/04/28 05:09:20
1	97	335.7043829481678	286.3452983130036	20/04/28 05:09:20
1	97	335.5610647991713	286.2923325936005	20/04/28 05:09:20
1	97	335.5566786306555	286.2985070978377	20/04/28 05:09:20
1	97	335.5762449562549	286.26728196660673	20/04/28 05:09:20
1	97	335.611276557574	286.274140907797	20/04/28 05:09:20
1	97	335.70051787205915	286.1931164905811	20/04/28 05:09:20
1	97	335.86782440310225	286.2107653929977	20/04/28 05:09:20
1	97	336.0306537558985	286.4423422456936	20/04/28 05:09:21
1	97	336.1050978189712	286.52032497095644	20/04/28 05:09:21
1	97	336.1281945349278	286.52083326077945	20/04/28 05:09:21
1	97	336.22482055445636	286.5325370714701	20/04/28 05:09:21
1	97	336.1844826308549	286.4522032396582	20/04/28 05:09:21
1	97	336.2186105942398	286.43769266191646	20/04/28 05:09:21
1	97	336.1574868878291	286.47858842767107	20/04/28 05:09:21
1	97	336.0876666905211	286.540862244374	20/04/28 05:09:21
1	97	336.2151988666519	286.4877588985098	20/04/28 05:09:21
1	97	336.12154141955057	286.48621978684804	20/04/28 05:09:21
1	97	336.061855074147	286.4490676348022	20/04/28 05:09:22
1	97	336.00385172490473	286.44729192343215	20/04/28 05:09:22
1	97	335.94000111422287	286.5655267499336	20/04/28 05:09:22
1	97	335.8398789965375	286.67707596560183	20/04/28 05:09:22
1	97	335.8976313273932	286.7000091977203	20/04/28 05:09:22
1	97	335.9856157513481	286.8727507222072	20/04/28 05:09:22
1	97	336.19028601933593	287.0577201720589	20/04/28 05:09:22
1	97	336.2001896749215	287.2507837457479	20/04/28 05:09:22
1	97	336.3012291713157	287.1780955701646	20/04/28 05:09:22
1	97	336.32950063392104	287.27654457118115	20/04/28 05:09:23
1	97	336.2681974216734	287.24754207933785	20/04/28 05:09:23
1	97	336.2335805009111	287.3496503990991	20/04/28 05:09:23
1	97	336.18793437975745	287.3221338672676	20/04/28 05:09:23
1	97	336.05306440073883	287.354452137623	20/04/28 05:09:23
1	97	336.1056082556956	287.51924141003764	20/04/28 05:09:23
1	97	336.12206831000657	287.59863599225406	20/04/28 05:09:23
1	97	335.98072041647873	287.6679683265797	20/04/28 05:09:23
1	97	336.0123198012622	287.96270411552683	20/04/28 05:09:23
1	97	335.9709056023584	287.7484045967742	20/04/28 05:09:23
1	97	335.99191276298376	287.4868063626454	20/04/28 05:09:24
1	97	336.1842603237318	287.26314052168306	20/04/28 05:09:24
1	97	336.37313338543333	287.4865136815542	20/04/28 05:09:24
1	97	336.3187852399947	287.4132059875556	20/04/28 05:09:24
1	97	336.4177476230536	287.40423927761816	20/04/28 05:09:24
1	97	336.2638019297775	287.45387695758956	20/04/28 05:09:24
1	97	336.2986786499925	287.3863818962619	20/04/28 05:09:24
1	97	336.534257332491	287.4835099568819	20/04/28 05:09:24
1	97	336.72444185380766	287.7006025544745	20/04/28 05:09:24
1	97	336.67017621346304	287.6569998244969	20/04/28 05:09:24
1	97	336.67598429390955	287.6596322712796	20/04/28 05:09:25
1	97	336.67598429390955	287.6596322712796	20/04/28 05:09:25
1	97	336.4776818791615	287.5080160308945	20/04/28 05:09:25
1	97	336.5384406364381	287.39665937937673	20/04/28 05:09:25
1	97	336.37281384526494	287.2931926947276	20/04/28 05:09:25
1	97	336.3424729521759	287.26468833149596	20/04/28 05:09:25
1	97	336.36110658894637	287.3207425559524	20/04/28 05:09:25
1	97	336.3559304015136	287.6132279661227	20/04/28 05:09:25
1	97	336.2375107286085	287.460993703679	20/04/28 05:09:25
1	97	336.25500029494793	287.4365971970601	20/04/28 05:09:26
1	97	336.2928139981746	287.4327585846359	20/04/28 05:09:26
1	97	336.0319400478222	287.4910175644281	20/04/28 05:09:26
1	97	335.9930809188722	287.34457613395875	20/04/28 05:09:26
1	97	336.00902030006273	287.5087431718056	20/04/28 05:09:26
1	97	336.00902030006273	287.5087431718056	20/04/28 05:09:26
1	97	336.1783667811921	287.3680640477994	20/04/28 05:09:26
1	97	335.9320762893727	287.2896290871883	20/04/28 05:09:26
1	97	335.80101125810177	287.43845761865396	20/04/28 05:09:26
1	97	335.93817674786413	287.4376350378616	20/04/28 05:09:26
1	97	335.93817674786413	287.4376350378616	20/04/28 05:09:27
1	97	335.98077837528314	287.5523934819228	20/04/28 05:09:27
1	97	336.0150074726476	287.31989659923795	20/04/28 05:09:27
1	97	336.01602080941416	287.32336532637544	20/04/28 05:09:27
1	97	336.0301773007099	287.28844574335125	20/04/28 05:09:27
1	97	336.06906303402826	287.2780914981404	20/04/28 05:09:27
1	97	336.05331697433996	287.111962252798	20/04/28 05:09:27
1	97	336.0439222547463	287.11147270520803	20/04/28 05:09:27
1	97	336.24716786245784	287.28944056300014	20/04/28 05:09:27
1	97	336.45785033939427	287.191351579572	20/04/28 05:09:27
1	97	336.3720602436754	287.1909586776787	20/04/28 05:09:28
1	97	336.29662095847124	287.0879156743305	20/04/28 05:09:28
1	97	336.30688444465557	287.11204889424	20/04/28 05:09:28
1	97	336.15647494010864	287.31584161621714	20/04/28 05:09:28
1	97	335.936459678943	287.2815419088855	20/04/28 05:09:28
1	97	335.65809328133497	287.3790574885471	20/04/28 05:09:28
1	97	335.70110625333746	287.38430078673787	20/04/28 05:09:28
1	97	335.68180616813504	287.3909467971321	20/04/28 05:09:28
1	97	335.86895622822425	287.36815962287454	20/04/28 05:09:28
1	97	336.0941558687706	287.293256486507	20/04/28 05:09:29
1	97	336.0941558687706	287.293256486507	20/04/28 05:09:29
1	97	336.30111564286153	287.30196035050045	20/04/28 05:09:29
1	97	336.29267528942967	287.3479276243875	20/04/28 05:09:29
1	97	336.3957211951602	287.22398772769714	20/04/28 05:09:29
1	97	336.0852717160426	287.155620080743	20/04/28 05:09:29
1	97	336.2527331253953	287.20588853785193	20/04/28 05:09:29
1	97	336.13268803788793	287.0127458142955	20/04/28 05:09:29
1	97	336.35680804904774	287.1149783355059	20/04/28 05:09:29
1	97	336.1356023934281	287.20860981243374	20/04/28 05:09:29
1	97	336.22899372351696	287.05857779670737	20/04/28 05:09:30
1	97	336.21880111368404	287.0240018982879	20/04/28 05:09:30
1	97	336.1630695771969	287.0496301032879	20/04/28 05:09:30
1	97	336.30747261376086	286.8490231946154	20/04/28 05:09:30
1	97	336.31635530110856	286.8473969358633	20/04/28 05:09:30
1	97	336.3083399438328	287.000694258357	20/04/28 05:09:30
1	97	336.4413035505182	286.94105548941036	20/04/28 05:09:30
1	97	336.3188057281929	286.70318487397174	20/04/28 05:09:30
1	97	336.31280716331565	286.4182715363427	20/04/28 05:09:30
1	97	336.5825368325123	286.44609502249534	20/04/28 05:09:31
1	97	336.6492521433167	286.7306949562482	20/04/28 05:09:31
1	97	336.6492521433167	286.7306949562482	20/04/28 05:09:31
1	97	336.74605111350786	286.8186563289009	20/04/28 05:09:31
1	97	336.74605111350786	286.8186563289009	20/04/28 05:09:31
1	97	336.84186771138	286.7884682931629	20/04/28 05:09:31
1	97	336.84216579102986	286.7842782613352	20/04/28 05:09:31
1	97	336.9362588908021	287.0438644036843	20/04/28 05:09:31
1	97	337.01928691734236	286.9686281008519	20/04/28 05:09:31
1	97	337.11479034766376	286.9138830249637	20/04/28 05:09:31
1	97	337.1155546630068	286.8653652050387	20/04/28 05:09:32
1	97	337.0877792749273	286.82659269494025	20/04/28 05:09:32
1	97	337.19835623565143	286.9814864634801	20/04/28 05:09:32
1	97	336.98651186542344	286.891997456636	20/04/28 05:09:32
1	97	337.0595750601064	286.9005787930259	20/04/28 05:09:32
1	97	337.0396154823024	286.8200920053875	20/04/28 05:09:32
1	97	337.02217980868943	286.76777764620306	20/04/28 05:09:32
1	97	337.31995796607555	286.7318070479841	20/04/28 05:09:32
1	97	337.31881003827914	286.7313523604285	20/04/28 05:09:32
1	97	337.3168362861935	286.7150815900372	20/04/28 05:09:33
1	97	337.4157514375824	286.7520300577407	20/04/28 05:09:33
1	97	337.54813839198573	286.82030804033997	20/04/28 05:09:33
1	97	337.7759338969777	286.81749446620995	20/04/28 05:09:33
1	97	337.7754757066187	286.96231941963174	20/04/28 05:09:33
1	97	337.81426407787495	286.72362506732054	20/04/28 05:09:33
1	97	337.9220858421855	286.68820041764843	20/04/28 05:09:33
1	97	337.83290563851875	286.82312028538945	20/04/28 05:09:33
1	97	337.8858909903271	286.82178803968924	20/04/28 05:09:33
1	97	337.85280609135765	286.87624793803485	20/04/28 05:09:33
1	97	337.85280609135765	286.87624793803485	20/04/28 05:09:34
1	97	337.85639326842914	286.87864277475734	20/04/28 05:09:34
1	97	337.79938053775993	286.4559611608656	20/04/28 05:09:34
1	97	337.72410768611644	286.3894260305633	20/04/28 05:09:34
1	97	337.72410768611644	286.3894260305633	20/04/28 05:09:34
1	97	337.7003590553526	286.4537387986108	20/04/28 05:09:34
1	97	337.6054657144449	286.59731688914036	20/04/28 05:09:34
1	97	337.59844192174023	286.6215949488162	20/04/28 05:09:34
1	97	337.72717458024863	286.587692217693	20/04/28 05:09:34
1	97	337.52852435847836	286.40764655192595	20/04/28 05:09:34
1	97	337.7133816327007	286.2755218430926	20/04/28 05:09:35
1	97	337.7172500852846	286.1060714471453	20/04/28 05:09:35
1	97	337.7796882370582	286.09767006232596	20/04/28 05:09:35
1	97	337.6652367892759	285.936269043655	20/04/28 05:09:35
1	97	337.8690362096523	285.9504189802739	20/04/28 05:09:35
1	97	337.66825982481913	285.8036552588865	20/04/28 05:09:35
1	97	337.3914275040189	285.81909230237096	20/04/28 05:09:35
1	97	337.39800139782704	285.82580919413317	20/04/28 05:09:35
1	97	337.40952851599866	285.72285360225465	20/04/28 05:09:35
1	97	337.6092723625488	285.54350044811906	20/04/28 05:09:36
1	97	337.72825469812886	285.55754731729627	20/04/28 05:09:36
1	97	337.77722486884386	285.59336036898753	20/04/28 05:09:36
1	97	337.7763468219622	285.5893501257283	20/04/28 05:09:36
1	97	337.67911150257464	285.56220429180553	20/04/28 05:09:36
1	97	337.72336026446726	285.6118155781753	20/04/28 05:09:36
1	97	337.9475201043703	285.60827052719804	20/04/28 05:09:36
1	97	337.9475201043703	285.60827052719804	20/04/28 05:09:36
1	97	338.10422300198246	285.57722103774324	20/04/28 05:09:36
1	97	337.9739738989056	285.53495815555607	20/04/28 05:09:36
1	97	338.0365638399178	285.62694243929326	20/04/28 05:09:37
1	97	338.03538731353296	285.6766145431622	20/04/28 05:09:37
1	97	337.93531434247564	285.5715516911605	20/04/28 05:09:37
1	97	337.9252357732935	285.6994172870461	20/04/28 05:09:37
1	97	337.90431636250656	285.723072631563	20/04/28 05:09:37
1	97	337.9821590934727	285.67099257222566	20/04/28 05:09:37
1	97	337.8280081560265	285.7237588256578	20/04/28 05:09:37
1	97	337.7677184125017	285.9123205167071	20/04/28 05:09:37
1	97	337.7330679821703	285.82520348088224	20/04/28 05:09:37
1	97	337.7658661802408	285.8053657886824	20/04/28 05:09:38
1	97	337.7937588092628	285.67359327126564	20/04/28 05:09:38
1	97	337.6614866559615	285.6090375601752	20/04/28 05:09:38
1	97	337.5545917270828	285.454311152726	20/04/28 05:09:38
1	97	337.7235965824541	285.388916698788	20/04/28 05:09:38
1	97	337.7812609258594	285.24775524944823	20/04/28 05:09:38
1	97	337.62084534734527	285.22058197529384	20/04/28 05:09:38
1	97	337.68816865190894	285.45442631832617	20/04/28 05:09:38
1	97	337.8914502101648	285.4846524211891	20/04/28 05:09:38
1	97	337.94038212637605	285.4602645474002	20/04/28 05:09:38
1	97	337.9210133224204	285.4315770884871	20/04/28 05:09:39
1	97	338.08150595243865	285.41450189252316	20/04/28 05:09:39
1	97	338.03093255783665	285.4876712791288	20/04/28 05:09:39
1	97	338.1256844500547	285.59539084394635	20/04/28 05:09:39
1	97	338.1258019244254	285.6033487506982	20/04/28 05:09:39
1	97	338.3104717746772	285.50115391643465	20/04/28 05:09:39
1	97	338.3104717746772	285.50115391643465	20/04/28 05:09:39
1	97	338.3104717746772	285.50115391643465	20/04/28 05:09:39
1	97	338.4648246429068	285.4880551816634	20/04/28 05:09:39
1	97	338.65163064782627	285.4722024000457	20/04/28 05:09:39
1	97	338.8710376708112	285.4535830220323	20/04/28 05:09:40
1	97	339.10106057373054	285.43406275635016	20/04/28 05:09:40
1	97	339.3042018938645	285.416823722803	20/04/28 05:09:40
1	97	339.4892522940272	285.40111992579006	20/04/28 05:09:40
1	97	339.7443259797382	285.37947379381615	20/04/28 05:09:40
1	97	340.03762918307314	285.3545834181976	20/04/28 05:09:40
1	97	340.2308146441224	285.33818926145165	20/04/28 05:09:40
1	97	340.45937645317036	285.31879298751204	20/04/28 05:09:40
1	97	340.64753098083605	285.302825767193	20/04/28 05:09:40
1	97	340.93243194014707	285.278648425075	20/04/28 05:09:41
1	97	340.93243194014707	285.278648425075	20/04/28 05:09:41
1	97	341.1652269281384	285.2588929139612	20/04/28 05:09:41
1	83	341.24329666666665	285.45676224115476	20/04/28 05:09:41
1	83	341.24329666666665	285.65592633510033	20/04/28 05:09:41
1	97	341.2674601228151	285.9464490649165	20/04/28 05:09:41
1	97	341.3188009823036	286.1074946245119	20/04/28 05:09:41
1	97	341.38307927126675	286.30912219987846	20/04/28 05:09:41
1	97	341.46809734556183	286.5758061527181	20/04/28 05:09:41
1	97	341.55848179831514	286.8593233146317	20/04/28 05:09:41
1	97	341.6458982829409	287.1335305800471	20/04/28 05:09:42
1	97	341.721108138853	287.36944819913504	20/04/28 05:09:42
1	97	341.8091008895267	287.645463090856	20/04/28 05:09:42
1	97	341.8763801878132	287.85650420605515	20/04/28 05:09:42
1	97	341.95721037699167	288.1100516374409	20/04/28 05:09:42
1	97	342.01858607301483	288.3025743846267	20/04/28 05:09:42
1	97	342.07746027883115	288.4872504791815	20/04/28 05:09:42
1	97	342.1579789290299	288.7398206778169	20/04/28 05:09:42
1	97	342.22166110445676	288.9395783694497	20/04/28 05:09:42
1	97	342.3069617053973	289.20714854940314	20/04/28 05:09:43
1	97	342.39588712126647	289.48608901716267	20/04/28 05:09:43
1	97	342.4553763002136	289.6726941540625	20/04/28 05:09:43
1	97	342.53898666223904	289.9349624073508	20/04/28 05:09:43
1	83	342.5591484032552	289.9982055804632	20/04/28 05:09:43
1	83	342.6240960280324	289.91547322066896	20/04/28 05:09:43
1	83	342.58572852964505	289.8708057827269	20/04/28 05:09:43
1	83	342.75782473621825	289.6548986338171	20/04/28 05:09:43
1	83	342.6086424036848	289.7242845721969	20/04/28 05:09:43
1	83	342.68088749984645	289.6322434050112	20/04/28 05:09:43
1	83	342.6546601873543	289.6574974998827	20/04/28 05:09:44
1	83	342.44882193857455	289.86859295157507	20/04/28 05:09:44
1	83	342.37385428672485	289.99919489300805	20/04/28 05:09:44
1	83	342.6104967398501	289.89363832164474	20/04/28 05:09:44
1	83	342.3460894860459	289.8404158977698	20/04/28 05:09:44
1	83	342.3278863425736	289.83228078087245	20/04/28 05:09:44
1	83	342.1966947230256	289.9448346876239	20/04/28 05:09:44
1	83	342.20636688266524	290.1426779451929	20/04/28 05:09:44
1	83	342.18561254941727	290.13750114133995	20/04/28 05:09:44
1	83	342.32747880353065	290.23231364365637	20/04/28 05:09:45
1	83	342.5356619262497	290.160052902047	20/04/28 05:09:45
1	83	342.54254164906206	290.1689244196018	20/04/28 05:09:45
1	83	342.39782222113956	290.28767470850516	20/04/28 05:09:45
1	83	342.4013124774541	290.2893419953088	20/04/28 05:09:45
1	83	342.32743334858964	290.3615804235294	20/04/28 05:09:45
1	83	342.3282566976391	290.36160118738866	20/04/28 05:09:45
1	83	342.2726863546456	290.23699609364854	20/04/28 05:09:45
1	83	342.3156912188433	290.2196322430408	20/04/28 05:09:45
1	83	342.3032058329376	290.22389512871064	20/04/28 05:09:45
1	83	342.276287682115	290.2680883853836	20/04/28 05:09:46
1	83	342.1104013492753	290.40462176439866	20/04/28 05:09:46
1	83	341.85836281495637	290.2490215978706	20/04/28 05:09:46
1	83	342.1154196958584	290.2035044965665	20/04/28 05:09:46
1	83	341.8742827995699	290.0567908155511	20/04/28 05:09:46
1	83	341.67882368869124	290.0750565790538	20/04/28 05:09:46
1	83	341.4466193143922	290.0253286015462	20/04/28 05:09:46
1	83	341.5422813098654	290.16934376171076	20/04/28 05:09:46
1	83	341.73305323469026	289.96410379381354	20/04/28 05:09:46
1	83	341.7306899003733	289.92634047558033	20/04/28 05:09:46
1	83	341.8779224006414	289.91384731001733	20/04/28 05:09:47
1	83	341.87292926413915	289.95275846009196	20/04/28 05:09:47
1	83	341.86531176595264	289.94403937960953	20/04/28 05:09:47
1	83	341.6997825855972	290.0784023532769	20/04/28 05:09:47
1	83	341.68072383445593	290.3104594485018	20/04/28 05:09:47
1	83	341.477633383121	290.3603385781806	20/04/28 05:09:47
1	83	341.5949168949777	290.2816400939052	20/04/28 05:09:47
1	83	341.3689466989338	290.2556316113083	20/04/28 05:09:47
1	83	341.3572775735749	290.2024830142746	20/04/28 05:09:47
1	83	341.3581211603076	290.2085301628057	20/04/28 05:09:48
1	83	341.56620217825906	290.22641522599173	20/04/28 05:09:48
1	83	341.51278087091595	290.28473765706246	20/04/28 05:09:48
1	83	341.39566775009234	290.35310230960664	20/04/28 05:09:48
1	83	341.59725448712567	290.45950275257167	20/04/28 05:09:48
1	83	341.5951898983621	290.45853963831604	20/04/28 05:09:48
1	83	341.5929538291924	290.458762007048	20/04/28 05:09:48
1	83	341.595991833218	290.4590878732046	20/04/28 05:09:48
1	83	341.7517789626197	290.602538787927	20/04/28 05:09:48
1	83	341.904282250205	290.4032548473867	20/04/28 05:09:48
1	83	341.71544251306716	290.4228270964398	20/04/28 05:09:49
1	83	341.5880627383502	290.3588799575114	20/04/28 05:09:49
1	83	341.491282548207	290.42850508330207	20/04/28 05:09:49
1	83	341.7014081462201	290.3918302987769	20/04/28 05:09:49
1	83	341.6581337243678	290.5328991419115	20/04/28 05:09:49
1	83	341.8906472729227	290.6610105574935	20/04/28 05:09:49
1	83	341.7568165716506	290.9075369711802	20/04/28 05:09:49
1	83	341.689386011337	290.9249860592504	20/04/28 05:09:49
1	83	341.59661624036005	290.8274178039982	20/04/28 05:09:49
1	83	341.7438913661138	290.89365211244876	20/04/28 05:09:49
1	83	341.76143857527376	291.0903967260413	20/04/28 05:09:50
1	83	341.57938228102284	291.125347192824	20/04/28 05:09:50
1	83	341.6243698124003	291.06971437696296	20/04/28 05:09:50
1	83	341.5902205361412	291.0428606497077	20/04/28 05:09:50
1	83	341.31756124820777	291.0500878035567	20/04/28 05:09:50
1	83	341.27037728696615	291.08741492731883	20/04/28 05:09:50
1	83	341.2935804025946	291.25100962329117	20/04/28 05:09:50
1	83	341.2685801670349	291.3204662007304	20/04/28 05:09:50
1	83	341.3802746145035	291.4727850084609	20/04/28 05:09:50
1	83	341.3807141043427	291.4722941933212	20/04/28 05:09:51
1	83	341.39948282620287	291.74041352969925	20/04/28 05:09:51
1	83	341.41706642844366	291.97186358952666	20/04/28 05:09:51
1	83	341.32527077964363	291.81132326401877	20/04/28 05:09:51
1	83	341.29488675915013	291.7072591685774	20/04/28 05:09:51
1	83	341.38766511247326	291.7466436712833	20/04/28 05:09:51
1	83	341.40106672102087	291.8665978167273	20/04/28 05:09:51
1	83	341.5901833938751	291.83071543388473	20/04/28 05:09:51
1	83	341.54430938310645	291.7310858021416	20/04/28 05:09:51
1	83	341.4714410677408	291.61316982062397	20/04/28 05:09:51
1	83	341.44065022726824	291.59388221532845	20/04/28 05:09:52
1	83	341.4051489788545	291.83514188569495	20/04/28 05:09:52
1	83	341.36702965557413	291.90838800120014	20/04/28 05:09:52
1	83	341.3028997672421	291.8269432211039	20/04/28 05:09:52
1	83	341.3310558736185	291.83907791245355	20/04/28 05:09:52
1	83	341.53252450508	291.7570035002163	20/04/28 05:09:52
1	83	341.5934506046598	291.47139753559964	20/04/28 05:09:52
1	83	341.78372108885395	291.24533347681853	20/04/28 05:09:52
1	83	341.7740398275173	291.15710646012474	20/04/28 05:09:52
1	83	341.7706161048822	291.15543392645833	20/04/28 05:09:52
1	83	341.76102670895517	291.3778521474046	20/04/28 05:09:53
1	83	341.8077873514411	291.5684207386263	20/04/28 05:09:53
1	83	341.8155978168029	291.42252651496335	20/04/28 05:09:53
1	83	341.9559435373683	291.45559593889186	20/04/28 05:09:53
1	83	341.9333341984229	291.31059428764456	20/04/28 05:09:53
1	83	341.9711792768812	291.2311159950807	20/04/28 05:09:53
1	83	342.0056727696567	291.2092642393937	20/04/28 05:09:53
1	83	342.05615089494995	291.22294380950194	20/04/28 05:09:53
1	83	342.2114895233435	291.2720201862299	20/04/28 05:09:53
1	83	342.2114895233435	291.2720201862299	20/04/28 05:09:54
1	83	342.26636415025683	291.3041659011416	20/04/28 05:09:54
1	83	342.12435725536847	291.1727936679741	20/04/28 05:09:54
1	83	342.136632780162	290.9142028207772	20/04/28 05:09:54
1	83	341.91674763487936	290.85275185800873	20/04/28 05:09:54
1	83	342.16341995197774	290.6830510698409	20/04/28 05:09:54
1	83	342.340301826648	290.842914957795	20/04/28 05:09:54
1	83	342.3040676268799	290.74074665076444	20/04/28 05:09:54
1	83	342.0983131397334	290.6586330241825	20/04/28 05:09:54
1	83	342.18638142157806	290.56595076725074	20/04/28 05:09:54
1	83	342.26135559989245	290.5152743478271	20/04/28 05:09:55
1	83	342.26135559989245	290.5152743478271	20/04/28 05:09:55
1	83	342.35253885374004	290.6899552905544	20/04/28 05:09:55
1	83	342.572329514782	290.68074700839014	20/04/28 05:09:55
1	83	342.58698479007614	290.7200050252931	20/04/28 05:09:55
1	83	342.63818120777995	291.01122322713735	20/04/28 05:09:55
1	83	342.5608114848632	290.99881085849887	20/04/28 05:09:55
1	83	342.3056080075613	291.13173222511017	20/04/28 05:09:55
1	83	342.3056080075613	291.13173222511017	20/04/28 05:09:55
1	83	342.64884593074623	291.2385263383948	20/04/28 05:09:56
1	83	342.44001389795255	291.4517527586276	20/04/28 05:09:56
1	83	342.44001389795255	291.4517527586276	20/04/28 05:09:56
1	83	342.5747098412422	291.45404777637265	20/04/28 05:09:56
1	83	342.5415914155489	291.7070532618883	20/04/28 05:09:56
1	83	342.332796379049	291.73946655344133	20/04/28 05:09:56
1	83	342.332796379049	291.73946655344133	20/04/28 05:09:56
1	83	342.31277852941395	291.730002523298	20/04/28 05:09:56
1	83	342.35729508581596	291.69682481677296	20/04/28 05:09:56
1	83	342.2867735737036	291.7825977096629	20/04/28 05:09:56
1	83	342.3168445303641	291.8827096226422	20/04/28 05:09:57
1	83	342.3100995406408	291.8798175881981	20/04/28 05:09:57
1	83	342.43521474122923	291.7151391916847	20/04/28 05:09:57
1	83	342.46425358181244	291.6060321220139	20/04/28 05:09:57
1	83	342.4662893012863	291.6018136390592	20/04/28 05:09:57
1	83	342.3801659745435	291.4306550677986	20/04/28 05:09:57
1	83	342.23657142379824	291.5800586395871	20/04/28 05:09:57
1	83	342.3370079721784	291.30124222467055	20/04/28 05:09:57
1	83	342.35159822475555	291.3739215153888	20/04/28 05:09:57
1	83	342.35430447674577	291.3735825483502	20/04/28 05:09:58
1	83	342.3305888238523	291.5718918458493	20/04/28 05:09:58
1	83	342.3669993481099	291.5787093917215	20/04/28 05:09:58
1	83	342.3489206498431	291.57659301576604	20/04/28 05:09:58
1	83	342.3257196630472	291.5575950256343	20/04/28 05:09:58
1	83	342.4390505714659	291.39207971669435	20/04/28 05:09:58
1	83	342.2584917590116	291.50503556495414	20/04/28 05:09:58
1	83	342.44355142868244	291.40114207909596	20/04/28 05:09:58
1	83	342.5943901015688	291.5357285385599	20/04/28 05:09:58
1	83	342.6184039125751	291.3284861195949	20/04/28 05:09:58
1	83	342.44494343511525	291.3049112259168	20/04/28 05:09:59
1	83	342.2904611556357	291.1040438577496	20/04/28 05:09:59
1	83	342.4628676180629	291.1036904231778	20/04/28 05:09:59
1	83	342.4974016160748	291.00449258085325	20/04/28 05:09:59
1	83	342.3967935772467	290.91900971648226	20/04/28 05:09:59
1	83	342.42951456800023	290.9351213378149	20/04/28 05:09:59
1	83	342.6352348693947	290.9693008218053	20/04/28 05:09:59
1	83	342.36017936523797	291.08736555185885	20/04/28 05:09:59
1	83	342.1574453311642	291.1526143843569	20/04/28 05:09:59
1	83	342.22424550908073	290.89186024697636	20/04/28 05:09:59
1	83	342.1013525777789	290.97098883892363	20/04/28 05:10:00
1	83	341.8390141965067	291.1096455365926	20/04/28 05:10:00
1	83	341.77369989480223	291.0586656715474	20/04/28 05:10:00
1	83	342.01238248915774	290.9874665624782	20/04/28 05:10:00
1	83	342.01039027832564	290.9724491822044	20/04/28 05:10:00
1	83	341.9451815890907	290.91097735730517	20/04/28 05:10:00
1	83	341.848825045117	290.8210207848165	20/04/28 05:10:00
1	83	341.889725476181	290.68379160173043	20/04/28 05:10:00
1	83	341.77399534175623	290.6337360254552	20/04/28 05:10:00
1	83	341.99851717511126	290.60840486466617	20/04/28 05:10:01
1	83	341.99851717511126	290.60840486466617	20/04/28 05:10:01
