floorId	partitionId	location_x	location_y	timeStamp
3	42	342.10970984992787	258.65317248923645	20/04/28 05:16:33
3	42	342.3271754053315	258.69701962031434	20/04/28 05:16:33
3	42	342.5790938095277	258.7478134081821	20/04/28 05:16:33
3	42	342.7569870593697	258.7836816569685	20/04/28 05:16:33
3	42	343.00017871233547	258.83271588799806	20/04/28 05:16:33
3	42	343.175790704857	258.86812417157955	20/04/28 05:16:33
3	42	343.46878932579205	258.92720087875705	20/04/28 05:16:33
3	42	343.64237848668176	258.96220130297183	20/04/28 05:16:33
3	42	343.90816126373073	259.01579053572124	20/04/28 05:16:34
3	42	344.1533636920818	259.0652301952414	20/04/28 05:16:34
3	42	344.4168461705833	259.1183556235426	20/04/28 05:16:34
3	42	344.6125014903452	259.1578052018253	20/04/28 05:16:34
3	42	344.80117724109107	259.1958475040134	20/04/28 05:16:34
3	42	345.03168145607447	259.24232359311	20/04/28 05:16:34
3	42	345.2447165685922	259.2852774231334	20/04/28 05:16:34
3	42	345.4741161541388	259.33153078807663	20/04/28 05:16:34
3	42	345.4741161541388	259.33153078807663	20/04/28 05:16:34
3	42	345.6486563436744	259.3667229662343	20/04/28 05:16:34
3	42	345.8054147464166	259.3983298394232	20/04/28 05:16:35
3	42	346.064842540966	259.4506377301682	20/04/28 05:16:35
3	42	346.34621958135426	259.50737120204747	20/04/28 05:16:35
3	42	346.58891020083274	259.5563044107291	20/04/28 05:16:35
3	42	346.85570280890806	259.610097253624	20/04/28 05:16:35
3	42	347.12236614101664	259.66386403087256	20/04/28 05:16:35
3	42	347.34526532944864	259.7088067341627	20/04/28 05:16:35
3	42	347.61105056954796	259.76239646353184	20/04/28 05:16:35
3	42	347.76627312086157	259.79369366616726	20/04/28 05:16:35
3	42	347.9854517645669	259.8378862037035	20/04/28 05:16:35
3	42	348.24486515288555	259.8901911897499	20/04/28 05:16:36
3	42	348.5284092462756	259.947361600053	20/04/28 05:16:36
3	42	348.72135435079383	259.9862647232301	20/04/28 05:16:36
3	42	348.8892812508849	260.0201234774872	20/04/28 05:16:36
3	42	349.1108913684837	260.0648062680859	20/04/28 05:16:36
3	42	349.314811971521	260.1059223583755	20/04/28 05:16:36
3	42	349.5652646735578	260.1564206197421	20/04/28 05:16:36
3	42	349.774208147414	260.1985494611075	20/04/28 05:16:36
3	42	349.96260635167675	260.2365358021711	20/04/28 05:16:36
3	42	350.17292379753695	260.2789416746757	20/04/28 05:16:36
3	42	350.3516693618532	260.31498177387033	20/04/28 05:16:37
3	42	350.56135164193887	260.3572595792108	20/04/28 05:16:37
3	42	350.83455518504434	260.4123450457034	20/04/28 05:16:37
3	42	351.1202785384949	260.46995485571443	20/04/28 05:16:37
3	42	351.316722453435	260.50956343681514	20/04/28 05:16:37
3	42	351.5935865978121	260.5653869827865	20/04/28 05:16:37
3	15	351.76442028354097	260.59089356719517	20/04/28 05:16:37
3	15	352.03579384709343	260.60279114648785	20/04/28 05:16:37
3	15	352.43963345213234	260.6204963114995	20/04/28 05:16:37
3	15	352.67470422610484	260.63080230128026	20/04/28 05:16:38
3	15	352.67470422610484	260.63080230128026	20/04/28 05:16:38
3	15	352.92472105433757	260.64176355704694	20/04/28 05:16:38
3	15	353.0829730919191	260.6487016542614	20/04/28 05:16:38
3	15	353.3716491158587	260.6613578092669	20/04/28 05:16:38
3	15	353.56332592407864	260.6697613176799	20/04/28 05:16:38
3	15	353.72080180729506	260.67666538667885	20/04/28 05:16:38
3	15	353.91583219964156	260.6852159231683	20/04/28 05:16:38
3	15	354.1846087595589	260.69699964444084	20/04/28 05:16:38
3	15	354.4089027462767	260.7068331575396	20/04/28 05:16:38
3	15	354.6180506420399	260.7160026346293	20/04/28 05:16:39
3	15	354.88885725783757	260.7278753577578	20/04/28 05:16:39
3	15	355.1713261725097	260.7402593802324	20/04/28 05:16:39
3	15	355.3520991540368	260.74818484229115	20/04/28 05:16:39
3	15	355.64242147394873	260.76091317432315	20/04/28 05:16:39
3	15	355.9096012688376	260.7726268901085	20/04/28 05:16:39
3	15	356.1675137048561	260.7839343056796	20/04/28 05:16:39
3	15	356.388186181756	260.79360904428444	20/04/28 05:16:39
3	15	356.5484152775628	260.8006338198278	20/04/28 05:16:39
3	15	356.7960386616743	260.81149014204516	20/04/28 05:16:40
3	15	357.03588313565945	260.82200542072525	20/04/28 05:16:40
3	15	357.27185658166434	260.8323509855182	20/04/28 05:16:40
3	15	357.541066060432	260.8441536868501	20/04/28 05:16:40
3	15	357.798602003257	260.85544459617955	20/04/28 05:16:40
3	15	358.0806443098759	260.86780991527314	20/04/28 05:16:40
3	15	358.3200775427404	260.8783071642904	20/04/28 05:16:40
3	15	358.51613621957654	260.8869027829024	20/04/28 05:16:40
3	15	358.7578226054297	260.89749881481504	20/04/28 05:16:40
3	15	358.96176815247907	260.9064402101582	20/04/28 05:16:40
3	15	359.1956409586008	260.91669367854627	20/04/28 05:16:41
3	15	359.40839187646924	260.92602111959025	20/04/28 05:16:41
3	15	359.40839187646924	260.92602111959025	20/04/28 05:16:41
3	15	359.62606038285486	260.93556415790374	20/04/28 05:16:41
3	15	359.8276840215804	260.9444037559752	20/04/28 05:16:41
3	15	360.0922320787211	260.95600209092487	20/04/28 05:16:41
3	15	360.32838955202607	260.9663557238559	20/04/28 05:16:41
3	15	360.5763986980661	260.9772289586754	20/04/28 05:16:41
3	15	361.0324153665116	260.9972216742539	20/04/28 05:16:41
3	15	361.0324153665116	260.9972216742539	20/04/28 05:16:41
3	15	361.5301394956996	261.0190429313263	20/04/28 05:16:42
3	15	361.7467885958981	261.0285412767604	20/04/28 05:16:42
3	15	362.0071176493243	261.0399546418457	20/04/28 05:16:42
3	15	362.27470732379146	261.051686327601	20/04/28 05:16:42
3	15	362.51985801454373	261.0624342418182	20/04/28 05:16:42
3	15	362.6966850063348	261.0701867035112	20/04/28 05:16:42
3	15	362.85491385529383	261.07712378408837	20/04/28 05:16:42
3	15	363.02653788494854	261.08464813714113	20/04/28 05:16:42
3	15	363.2337476601377	261.0937326430092	20/04/28 05:16:42
3	15	363.4748495161844	261.1043030479241	20/04/28 05:16:43
3	15	363.63259840880954	261.1112190862212	20/04/28 05:16:43
3	15	363.7975345116238	261.11845022670434	20/04/28 05:16:43
3	15	363.96598577673075	261.1258354791856	20/04/28 05:16:43
3	15	364.21460261637924	261.13673535655204	20/04/28 05:16:43
3	15	364.48595779182364	261.14863212967197	20/04/28 05:16:43
3	15	364.64685345218965	261.15568612878667	20/04/28 05:16:43
3	15	364.93132542332546	261.16815796940676	20/04/28 05:16:43
3	15	365.1345990167161	261.17706990490933	20/04/28 05:16:43
3	15	365.36086075916774	261.1869896884965	20/04/28 05:16:43
3	15	365.5528536532263	261.19540705476754	20/04/28 05:16:44
3	15	365.7225875705859	261.2028485413811	20/04/28 05:16:44
3	15	365.91514791622734	261.21129078590525	20/04/28 05:16:44
3	15	366.1711560633914	261.22251471350745	20/04/28 05:16:44
3	15	366.3517052728683	261.23043036493596	20/04/28 05:16:44
3	15	366.64540219792235	261.2433066466493	20/04/28 05:16:44
3	15	366.81408023378617	261.25070184123035	20/04/28 05:16:44
3	15	366.9732599505476	261.25768060982216	20/04/28 05:16:44
3	15	367.12803243354995	261.26446615615447	20/04/28 05:16:44
3	15	367.37714327854155	261.27538769173873	20/04/28 05:16:44
3	15	367.52743430109894	261.28197676155986	20/04/28 05:16:45
3	15	367.69309730313995	261.2892397708112	20/04/28 05:16:45
3	15	367.8616564055765	261.2966297511044	20/04/28 05:16:45
3	15	368.1271860191073	261.3082711195199	20/04/28 05:16:45
3	15	368.31819373202234	261.3166452934083	20/04/28 05:16:45
3	15	368.520431547405	261.325511818257	20/04/28 05:16:45
3	15	368.7101600608706	261.33382990939117	20/04/28 05:16:45
3	15	368.86668038761593	261.3406920848146	20/04/28 05:16:45
3	15	369.14244570279743	261.3527822075981	20/04/28 05:16:45
3	15	369.3845329855377	261.36339581566097	20/04/28 05:16:46
3	15	369.56220870714935	261.3711854874278	20/04/28 05:16:46
3	15	369.8428811858754	261.3834907504284	20/04/28 05:16:46
3	15	370.1209601975126	261.39568231045837	20/04/28 05:16:46
3	15	370.28865103161513	261.4030342240688	20/04/28 05:16:46
3	15	370.28865103161513	261.4030342240688	20/04/28 05:16:46
3	15	370.7136273158646	261.42166606489064	20/04/28 05:16:46
3	15	370.7136273158646	261.42166606489064	20/04/28 05:16:46
3	15	370.91061363504	261.43030235326484	20/04/28 05:16:46
3	15	371.08388451869143	261.437898907809	20/04/28 05:16:46
3	15	371.27569624543554	261.4463083313296	20/04/28 05:16:47
3	15	371.4749081504074	261.45504219399635	20/04/28 05:16:47
3	15	371.68076894031697	261.46406755755476	20/04/28 05:16:47
3	15	372.14271736137164	261.4843203334578	20/04/28 05:16:47
3	15	372.14271736137164	261.4843203334578	20/04/28 05:16:47
3	15	372.60484183666694	261.5045808279435	20/04/28 05:16:47
3	15	372.7788233590582	261.5122085383624	20/04/28 05:16:47
3	15	373.0426522520907	261.5237753436675	20/04/28 05:16:47
3	15	373.0426522520907	261.5237753436675	20/04/28 05:16:47
3	15	373.2482122453653	261.53278751967827	20/04/28 05:16:47
3	15	373.46638516789005	261.5423526726404	20/04/28 05:16:48
3	15	373.96181660339033	261.56407341327116	20/04/28 05:16:48
3	15	374.13711162366945	261.5717587101589	20/04/28 05:16:48
3	15	374.33522785512633	261.5804445362286	20/04/28 05:16:48
3	15	374.62744705801555	261.5932560315405	20/04/28 05:16:48
3	15	374.62744705801555	261.5932560315405	20/04/28 05:16:48
3	15	374.9094368642317	261.60561904890767	20/04/28 05:16:48
3	15	375.1949009367084	261.6181343853061	20/04/28 05:16:48
3	15	375.41624328116166	261.6278384922924	20/04/28 05:16:48
3	15	375.6550006114243	261.63830610833924	20/04/28 05:16:49
3	15	375.94250769595845	261.6509110146193	20/04/28 05:16:49
3	15	376.1026369583853	261.6579314132604	20/04/28 05:16:49
3	15	376.3770169390987	261.6699608001106	20/04/28 05:16:49
3	15	376.5930283019827	261.67943118581945	20/04/28 05:16:49
3	15	376.7635874301239	261.68690885138346	20/04/28 05:16:49
3	15	377.0352743798084	261.6988201701735	20/04/28 05:16:49
3	15	377.3097184891809	261.7108523685569	20/04/28 05:16:49
3	15	377.556206817636	261.7216589275825	20/04/28 05:16:49
3	15	377.556206817636	261.7216589275825	20/04/28 05:16:49
3	15	377.79368630145746	261.7320705201937	20/04/28 05:16:50
3	15	378.06511664795306	261.74397058896824	20/04/28 05:16:50
3	15	378.29104712766065	261.75387584931036	20/04/28 05:16:50
3	15	378.5077653480816	261.76337722511823	20/04/28 05:16:50
3	15	378.7371616398784	261.9326899863968	20/04/28 05:16:50
3	15	378.91605816919923	262.1060988829308	20/04/28 05:16:50
3	15	379.1252352248308	262.30885945372006	20/04/28 05:16:50
3	15	379.3368067203235	262.51394101517195	20/04/28 05:16:50
3	15	379.44599962973655	262.61978444322807	20/04/28 05:16:50
3	15	379.5723864504096	262.7422943610703	20/04/28 05:16:50
3	15	379.69509141471445	262.8612353631128	20/04/28 05:16:51
3	15	379.90680010118285	263.0664499072213	20/04/28 05:16:51
3	15	380.11926413117203	263.27239662476507	20/04/28 05:16:51
3	15	380.32171111023524	263.4686335633981	20/04/28 05:16:51
3	15	380.4636977347476	263.6062647626883	20/04/28 05:16:51
3	15	380.6473243647569	263.7842586645547	20/04/28 05:16:51
3	15	380.6473243647569	263.7842586645547	20/04/28 05:16:51
3	15	380.77988324706837	263.91275131667425	20/04/28 05:16:51
3	15	380.9664683307298	264.09361292192887	20/04/28 05:16:51
3	15	381.1810268473542	264.30158987794397	20/04/28 05:16:52
3	15	381.39464409886244	264.50865444205436	20/04/28 05:16:52
3	15	381.5110452623208	264.62148501169827	20/04/28 05:16:52
3	15	381.5110452623208	264.62148501169827	20/04/28 05:16:52
1	33	381.8312425614858	264.9318807753721	20/04/28 05:16:52
1	33	381.7164210964605	264.831481860799	20/04/28 05:16:52
1	33	381.60192247666777	264.7313652393572	20/04/28 05:16:52
1	33	381.4885788677686	264.6322585496387	20/04/28 05:16:52
1	33	381.4885788677686	264.6322585496387	20/04/28 05:16:52
1	33	381.16811203673194	264.3520450722571	20/04/28 05:16:52
1	33	381.16811203673194	264.3520450722571	20/04/28 05:16:53
1	33	380.98103425908187	264.1884658511359	20/04/28 05:16:53
1	33	380.78088733914507	264.01345908291194	20/04/28 05:16:53
1	33	380.41593512838165	263.6943479670273	20/04/28 05:16:53
1	33	380.41593512838165	263.6943479670273	20/04/28 05:16:53
1	33	380.24380454651305	263.54383844704637	20/04/28 05:16:53
1	33	379.9122018947843	263.2538879025569	20/04/28 05:16:53
1	33	379.7686298104966	263.12834969049595	20/04/28 05:16:53
1	33	379.5563499770926	262.9427340057036	20/04/28 05:16:53
1	33	379.4244182788816	262.8273740484406	20/04/28 05:16:53
1	33	379.4244182788816	262.8273740484406	20/04/28 05:16:54
1	33	379.2086915192619	262.6387444006179	20/04/28 05:16:54
1	33	379.04544878205803	262.4960063365842	20/04/28 05:16:54
1	33	378.93015375642887	262.39519334463785	20/04/28 05:16:54
1	33	378.66492627698483	262.163280687494	20/04/28 05:16:54
1	41	378.4345089756414	262.06114282169705	20/04/28 05:16:54
1	41	378.1707435051441	262.0311734158876	20/04/28 05:16:54
1	41	378.1707435051441	262.0311734158876	20/04/28 05:16:54
1	41	377.80641436346565	261.9897778235283	20/04/28 05:16:54
1	41	377.6207707853543	261.9686847376219	20/04/28 05:16:55
1	41	377.3704660713605	261.94024476200434	20/04/28 05:16:55
1	41	377.19574330502553	261.92039251417765	20/04/28 05:16:55
1	41	376.9498195285574	261.89245030687783	20/04/28 05:16:55
1	41	376.66178079493216	261.8597229385814	20/04/28 05:16:55
1	41	376.4348563781045	261.8339394653953	20/04/28 05:16:55
1	41	376.14936111850255	261.8015010902147	20/04/28 05:16:55
1	41	375.96628123467576	261.78069929487884	20/04/28 05:16:55
1	41	375.7112295375809	261.75171996032753	20/04/28 05:16:55
1	41	375.4306607653656	261.7198413396115	20/04/28 05:16:55
1	41	375.2182084154647	261.69570220313796	20/04/28 05:16:56
1	41	374.994112577758	261.67024011711214	20/04/28 05:16:56
1	41	374.72638759372677	261.6398208257749	20/04/28 05:16:56
1	41	374.447928289177	261.6081818857585	20/04/28 05:16:56
1	41	374.23348070061377	261.5838160474462	20/04/28 05:16:56
1	41	373.9383243961203	261.5502799706811	20/04/28 05:16:56
1	41	373.6961616311548	261.52276509482755	20/04/28 05:16:56
1	41	373.44058978311557	261.4937266599903	20/04/28 05:16:56
1	41	373.197101296819	261.4660611538041	20/04/28 05:16:56
1	41	372.9081011003182	261.4332245427359	20/04/28 05:16:56
1	41	372.7569862329125	261.4160546577749	20/04/28 05:16:57
1	41	372.5189436676185	261.38900792483537	20/04/28 05:16:57
1	41	372.32945115239653	261.3674775172508	20/04/28 05:16:57
1	41	372.1574386909375	261.34793321809735	20/04/28 05:16:57
1	41	371.987945694291	261.32867518409927	20/04/28 05:16:57
1	41	371.8303442811345	261.3107682886359	20/04/28 05:16:57
1	41	371.66596845326205	261.29209167459135	20/04/28 05:16:57
1	41	371.66596845326205	261.29209167459135	20/04/28 05:16:57
1	41	371.4242122937491	261.2646229978244	20/04/28 05:16:57
1	41	371.2022410897482	261.2394023156852	20/04/28 05:16:58
1	41	370.94901739035066	261.21063068081764	20/04/28 05:16:58
1	41	370.7955613756007	261.19319479138426	20/04/28 05:16:58
1	41	370.6303866540368	261.17442740590855	20/04/28 05:16:58
1	41	370.40075669156954	261.14833652480036	20/04/28 05:16:58
1	41	370.15693677285367	261.12063336079393	20/04/28 05:16:58
1	41	369.9303061181122	261.09488326527156	20/04/28 05:16:58
1	41	369.7002731772302	261.06874659718596	20/04/28 05:16:58
1	41	369.49697859029897	261.0456479786931	20/04/28 05:16:58
1	41	369.27512728567723	261.02044091969094	20/04/28 05:16:58
1	41	369.27512728567723	261.02044091969094	20/04/28 05:16:59
1	41	369.10092338950875	261.0006476266264	20/04/28 05:16:59
1	41	368.8467847631146	260.9717720364595	20/04/28 05:16:59
1	41	368.66467230455186	260.95108016135043	20/04/28 05:16:59
1	41	368.1574683361906	260.8934509291112	20/04/28 05:16:59
1	41	368.1574683361906	260.8934509291112	20/04/28 05:16:59
1	41	367.9249846223375	260.8670358007344	20/04/28 05:16:59
1	41	367.9249846223375	260.8670358007344	20/04/28 05:16:59
1	41	367.3733985338209	260.80436380923214	20/04/28 05:16:59
1	41	367.3733985338209	260.80436380923214	20/04/28 05:16:59
1	41	367.1469517171869	260.77863460165554	20/04/28 05:17:00
1	41	366.94647862624157	260.75585656552715	20/04/28 05:17:00
1	41	366.49003483601115	260.70399477651887	20/04/28 05:17:00
1	41	366.49003483601115	260.70399477651887	20/04/28 05:17:00
1	41	366.2202016804682	260.67333595175285	20/04/28 05:17:00
1	41	365.958532784387	260.64360476169384	20/04/28 05:17:00
1	41	365.80493238901516	260.62615246752995	20/04/28 05:17:00
1	41	365.5400808176057	260.59605965739877	20/04/28 05:17:00
1	41	365.33225352808205	260.57244602682664	20/04/28 05:17:00
1	41	365.04550136193143	260.53986484014627	20/04/28 05:17:00
1	41	364.79050222523273	260.51089147758154	20/04/28 05:17:01
1	41	364.51938792618944	260.48008708747903	20/04/28 05:17:01
1	41	364.24743723187765	260.4491876649632	20/04/28 05:17:01
1	41	363.97945637691333	260.41873930120863	20/04/28 05:17:01
1	41	363.7066448983015	260.3877420751632	20/04/28 05:17:01
1	41	363.4347481427068	260.35684878124067	20/04/28 05:17:01
1	41	363.25298880911396	260.3361970286901	20/04/28 05:17:01
1	41	362.9893244793173	260.3062391146301	20/04/28 05:17:01
1	41	362.6956194651029	260.2728679355191	20/04/28 05:17:01
1	41	362.52442269020753	260.2534163158267	20/04/28 05:17:02
1	41	362.36647580694245	260.23547016756106	20/04/28 05:17:02
1	41	362.09612308228515	260.2047523086174	20/04/28 05:17:02
1	41	361.8644011596533	260.1784237360366	20/04/28 05:17:02
1	41	361.66896659706725	260.15621818462654	20/04/28 05:17:02
1	41	361.49146252621404	260.1360499210468	20/04/28 05:17:02
1	41	361.25565725850134	260.1092573930227	20/04/28 05:17:02
1	41	361.0803760339673	260.0893416923856	20/04/28 05:17:02
1	41	360.8740592339835	260.0658996857713	20/04/28 05:17:02
1	41	360.64117902739156	260.0394395073287	20/04/28 05:17:02
1	41	360.4106879622783	260.01325078652	20/04/28 05:17:03
1	41	360.2196238267021	259.991541809208	20/04/28 05:17:03
1	41	360.0499745684153	259.9722660205413	20/04/28 05:17:03
1	41	359.8219909019077	259.9463621939085	20/04/28 05:17:03
1	41	359.61729692843437	259.92310457513753	20/04/28 05:17:03
1	41	359.46021840749785	259.9052570914278	20/04/28 05:17:03
1	41	359.29029606990974	259.88595027510473	20/04/28 05:17:03
1	41	359.05998085147826	259.85978153424475	20/04/28 05:17:03
1	41	358.8947125779033	259.8410035192572	20/04/28 05:17:03
1	41	358.70901083756814	259.8199038248767	20/04/28 05:17:03
1	41	358.4870479161911	259.7946840838209	20/04/28 05:17:04
1	41	358.28089157160423	259.77126030837576	20/04/28 05:17:04
1	41	358.0482840476759	259.7448311125231	20/04/28 05:17:04
1	41	357.7931490683104	259.71584231532245	20/04/28 05:17:04
1	41	357.5616572342093	259.68953988572594	20/04/28 05:17:04
1	41	357.32722852315794	259.6629037640166	20/04/28 05:17:04
1	41	357.15553175449276	259.6433953343249	20/04/28 05:17:04
1	41	356.9322696115283	259.61802797387486	20/04/28 05:17:04
1	41	356.71394642947007	259.5932217851483	20/04/28 05:17:04
1	41	356.48349606158513	259.56703768841624	20/04/28 05:17:05
1	41	356.2516018916589	259.5406895448542	20/04/28 05:17:05
1	41	356.0654711387898	259.51954110546285	20/04/28 05:17:05
1	41	355.8491961173007	259.4949676316369	20/04/28 05:17:05
1	41	355.59337036860126	259.4659003482475	20/04/28 05:17:05
1	41	355.4195743672745	259.4461534007718	20/04/28 05:17:05
1	41	355.2359758479656	259.4252926773389	20/04/28 05:17:05
1	41	354.97091463168175	259.3951760470606	20/04/28 05:17:05
1	41	354.80694382506323	259.3765454521037	20/04/28 05:17:05
1	41	354.51908937107913	259.3438390219207	20/04/28 05:17:05
1	41	354.24385455562134	259.3125664529154	20/04/28 05:17:06
1	41	353.9634432179111	259.28070572013047	20/04/28 05:17:06
1	41	353.66780584395093	259.2471149835722	20/04/28 05:17:06
1	41	353.4321632242361	259.2203409358437	20/04/28 05:17:06
1	41	353.24045655600213	259.1985589530624	20/04/28 05:17:06
1	41	353.0150194315511	259.17294446813963	20/04/28 05:17:06
1	69	352.9114678080013	259.32116497395174	20/04/28 05:17:06
1	69	352.93347345919994	259.5680063796162	20/04/28 05:17:06
1	69	352.95773306131275	259.840130764045	20/04/28 05:17:06
1	69	352.9729392277459	260.0107011081458	20/04/28 05:17:06
1	69	352.9890704040788	260.1916474571131	20/04/28 05:17:07
1	69	353.0083164656397	260.40753404216866	20/04/28 05:17:07
1	69	353.0232616401223	260.5751767919279	20/04/28 05:17:07
1	69	353.04770617567135	260.84937560846254	20/04/28 05:17:07
1	41	353.05812949274707	260.96629585842163	20/04/28 05:17:07
1	41	353.0596220156465	260.96656034201	20/04/28 05:17:07
1	41	353.0049263499155	260.6873882395909	20/04/28 05:17:07
1	41	353.0278780707549	260.74986993111565	20/04/28 05:17:07
1	41	353.04378406310536	260.73241723405334	20/04/28 05:17:07
1	41	353.1504763304206	260.8084718318608	20/04/28 05:17:08
1	41	353.18627543177087	260.8606796347459	20/04/28 05:17:08
1	41	353.0956723930241	260.92960164721995	20/04/28 05:17:08
1	41	353.1094089474312	260.87451766342554	20/04/28 05:17:08
1	41	353.1865024324399	260.9798307863511	20/04/28 05:17:08
1	41	352.9906996303221	260.9696076638677	20/04/28 05:17:08
1	41	352.99597343079864	260.9901773981797	20/04/28 05:17:08
1	41	353.19586342277466	261.1087783832853	20/04/28 05:17:08
1	41	353.162286903752	260.923382593021	20/04/28 05:17:08
1	41	353.1681934680336	260.92736129673983	20/04/28 05:17:08
1	41	353.00446116860275	260.77931743726725	20/04/28 05:17:09
1	41	352.81917924279423	260.91002733785166	20/04/28 05:17:09
1	41	352.7505196713109	261.12885263269516	20/04/28 05:17:09
1	41	352.67596650898986	261.25557475554194	20/04/28 05:17:09
1	41	352.6860031661473	261.34896773483763	20/04/28 05:17:09
1	41	352.83667890448527	261.44625124688935	20/04/28 05:17:09
1	41	352.84470392393683	261.4597311197263	20/04/28 05:17:09
1	41	352.7664916846083	261.5627128264676	20/04/28 05:17:09
1	41	352.8528624853302	261.67401401843637	20/04/28 05:17:09
1	41	352.7967306001428	261.603103874769	20/04/28 05:17:09
1	41	352.95741396652403	261.5521477605705	20/04/28 05:17:10
1	41	353.1717942729971	261.4084318740709	20/04/28 05:17:10
1	41	352.9999246957516	261.47699987516376	20/04/28 05:17:10
1	41	353.222434531477	261.63357215463435	20/04/28 05:17:10
1	41	352.93256388485673	261.70458774183186	20/04/28 05:17:10
1	41	352.9536462975037	261.7369257998978	20/04/28 05:17:10
1	41	353.0111832641152	261.47340627160605	20/04/28 05:17:10
1	41	352.87980732140227	261.5880291916302	20/04/28 05:17:10
1	41	352.9249359574018	261.62536697398366	20/04/28 05:17:10
1	41	352.8276187799197	261.512309621766	20/04/28 05:17:10
1	41	352.83305255208563	261.49474420632407	20/04/28 05:17:11
1	41	352.71072429668567	261.4195711830295	20/04/28 05:17:11
1	41	352.5870099479618	261.5501759918374	20/04/28 05:17:11
1	41	352.4745291540925	261.4098918100623	20/04/28 05:17:11
1	41	352.52960342413155	261.4054206777309	20/04/28 05:17:11
1	41	352.53191909685705	261.41515408408844	20/04/28 05:17:11
1	41	352.4427201330258	261.4600124051708	20/04/28 05:17:11
1	41	352.4330620051738	261.6640287232331	20/04/28 05:17:11
1	41	352.31016139611296	261.6677072810413	20/04/28 05:17:11
1	41	352.326429588447	261.69825784816203	20/04/28 05:17:12
1	41	352.25379559459014	261.9746798921393	20/04/28 05:17:12
1	41	352.2722993389589	262.0756730178532	20/04/28 05:17:12
1	41	352.47789506710075	262.14634307498466	20/04/28 05:17:12
1	41	352.488695318931	262.1491535881043	20/04/28 05:17:12
1	41	352.5818952333392	262.1612135762694	20/04/28 05:17:12
1	41	352.6558096374064	261.9136415526168	20/04/28 05:17:12
1	41	352.638910535418	261.92301770964025	20/04/28 05:17:12
1	41	352.7158763665429	262.19183765819463	20/04/28 05:17:12
1	41	352.5131959321549	262.0042150672172	20/04/28 05:17:12
1	41	352.5662297174172	262.03236430828287	20/04/28 05:17:13
1	41	352.4119328113007	261.88644330593826	20/04/28 05:17:13
1	41	352.1884087421307	262.08514043372907	20/04/28 05:17:13
1	41	352.18877789115095	262.08694118418543	20/04/28 05:17:13
1	41	352.1473464267602	262.073455499276	20/04/28 05:17:13
1	41	352.1055103071258	262.06627414691354	20/04/28 05:17:13
1	41	352.0782898305816	262.2041527476338	20/04/28 05:17:13
1	41	351.9994119308265	261.93940105432	20/04/28 05:17:13
1	41	351.7871376993828	261.7898403719401	20/04/28 05:17:13
1	41	351.73805624324723	261.7463563242765	20/04/28 05:17:13
1	41	351.69104884836236	261.81500037502076	20/04/28 05:17:14
1	41	351.6786020303567	261.81568293031484	20/04/28 05:17:14
1	41	351.7629226313911	261.96513984426895	20/04/28 05:17:14
1	41	351.58697111476465	262.09308426291324	20/04/28 05:17:14
1	41	351.5997409707028	262.23455177590984	20/04/28 05:17:14
1	41	351.7204195578009	262.41558834879214	20/04/28 05:17:14
1	41	351.6705202817375	262.2074753716664	20/04/28 05:17:14
1	41	351.9013055984564	262.11030566158604	20/04/28 05:17:14
1	41	351.91958756387754	261.96336796065395	20/04/28 05:17:14
1	41	351.9093017070277	262.1511406511691	20/04/28 05:17:15
1	41	351.9503812984792	262.06965612382135	20/04/28 05:17:15
1	41	352.03785869976747	261.9581119935718	20/04/28 05:17:15
1	41	351.99263835561123	261.9729335026276	20/04/28 05:17:15
1	41	351.9450847130924	261.99671346966215	20/04/28 05:17:15
1	41	352.0320220570982	262.04320127485596	20/04/28 05:17:15
1	41	352.1104312515003	262.0529407092217	20/04/28 05:17:15
1	41	352.21606827159025	261.7789885396982	20/04/28 05:17:15
1	41	352.4758467732255	261.8398480272327	20/04/28 05:17:15
1	41	352.45471484868716	261.83123999256986	20/04/28 05:17:15
1	41	352.2267999256548	261.80779202393427	20/04/28 05:17:16
1	41	352.4022619106539	261.9803939936017	20/04/28 05:17:16
1	41	352.4563978188513	261.9497387589141	20/04/28 05:17:16
1	41	352.5385573907521	261.89294538403766	20/04/28 05:17:16
1	41	352.3580084286476	262.022761111095	20/04/28 05:17:16
1	41	352.38194783608367	262.0575030568456	20/04/28 05:17:16
1	41	352.34554168266465	261.83586414397354	20/04/28 05:17:16
1	41	352.2624828574134	261.89385456741235	20/04/28 05:17:16
1	41	352.2562808452321	261.80027369024407	20/04/28 05:17:16
1	41	352.1710002860486	262.0766860660957	20/04/28 05:17:16
1	41	352.2242950053548	262.0496333743445	20/04/28 05:17:17
1	41	352.0158540230851	262.18687360468994	20/04/28 05:17:17
1	41	352.12941341021786	262.30630157443966	20/04/28 05:17:17
1	41	352.1348067813014	262.32113009141324	20/04/28 05:17:17
1	41	352.13258296934134	262.61099456897	20/04/28 05:17:17
1	41	352.22099208558944	262.72238145717336	20/04/28 05:17:17
1	41	352.20677010469535	262.4825224117214	20/04/28 05:17:17
1	41	352.39402528895414	262.65915389584035	20/04/28 05:17:17
1	41	352.3085341937131	262.67248746275556	20/04/28 05:17:17
1	41	352.37362355758034	262.6370482740058	20/04/28 05:17:18
1	41	352.3553862810352	262.7615899258251	20/04/28 05:17:18
1	41	352.2695199853082	262.52022776231144	20/04/28 05:17:18
1	41	352.1536487110608	262.35892038361783	20/04/28 05:17:18
1	41	352.17315687794866	262.16480493373547	20/04/28 05:17:18
1	41	352.27094006046195	262.0348798362301	20/04/28 05:17:18
1	41	352.27094006046195	262.0348798362301	20/04/28 05:17:18
1	41	352.27094006046195	262.0348798362301	20/04/28 05:17:18
1	41	352.29495351652315	262.0227523341725	20/04/28 05:17:18
1	41	352.0859497666523	262.02135133260174	20/04/28 05:17:18
1	41	352.0427287669853	262.157553766315	20/04/28 05:17:19
1	41	352.062379661217	262.16960847580833	20/04/28 05:17:19
1	41	352.08105295101905	262.16859393266856	20/04/28 05:17:19
1	41	352.254411840163	262.0960582322651	20/04/28 05:17:19
1	41	352.29663602993736	262.12423628867424	20/04/28 05:17:19
1	41	352.42260775731063	262.2809903515111	20/04/28 05:17:19
1	41	352.214583629588	262.4395259659373	20/04/28 05:17:19
1	41	352.04070375515647	262.44053827176083	20/04/28 05:17:19
1	41	352.08818562878747	262.4726731175152	20/04/28 05:17:19
1	41	351.8509518116301	262.65118867622306	20/04/28 05:17:19
1	41	351.84034726094154	262.6389622988655	20/04/28 05:17:20
1	41	351.77545740029194	262.66262904632333	20/04/28 05:17:20
1	41	351.63312477218943	262.80989498161233	20/04/28 05:17:20
1	41	351.68162702177415	262.7987490859433	20/04/28 05:17:20
1	41	351.67824034356147	262.79361687679216	20/04/28 05:17:20
1	41	351.59893824089613	262.81911514868113	20/04/28 05:17:20
1	41	351.66165763338734	262.7489727164681	20/04/28 05:17:20
1	41	351.7235654369039	262.7298059884677	20/04/28 05:17:20
1	41	352.0054842700249	262.69894387192477	20/04/28 05:17:20
1	41	352.070414053584	262.8951953476801	20/04/28 05:17:21
1	41	351.979554490114	262.9131285151464	20/04/28 05:17:21
1	41	351.98271231076785	262.8884682966109	20/04/28 05:17:21
1	41	352.1462824541207	262.9038750700907	20/04/28 05:17:21
1	41	352.3077700804519	262.85729866137666	20/04/28 05:17:21
1	41	352.1608088830765	262.93543638202226	20/04/28 05:17:21
1	41	352.27270254796974	262.98441925516465	20/04/28 05:17:21
1	41	352.01582187518574	262.86411080991417	20/04/28 05:17:21
1	41	352.0716027891397	263.0206159578557	20/04/28 05:17:21
1	41	352.0673236509593	263.02257530360714	20/04/28 05:17:21
1	41	352.0673608169905	263.02096916408374	20/04/28 05:17:22
1	41	351.95049286186634	262.8275516467446	20/04/28 05:17:22
1	41	351.71428070880376	262.85348799219577	20/04/28 05:17:22
1	41	351.59560362024285	262.8560633448157	20/04/28 05:17:22
1	41	351.57090443996105	262.96496803317666	20/04/28 05:17:22
1	41	351.5693262517229	262.9693746283789	20/04/28 05:17:22
1	41	351.48036696130254	262.99259978046246	20/04/28 05:17:22
1	41	351.4923774757505	262.9747199577406	20/04/28 05:17:22
1	41	351.63753224618836	262.937177850351	20/04/28 05:17:22
1	41	351.90809267741895	262.9002607202081	20/04/28 05:17:22
1	41	351.75715740568035	262.87834586363783	20/04/28 05:17:23
1	41	351.7573747693395	262.8787794413705	20/04/28 05:17:23
1	41	351.6080659221609	263.0554429968645	20/04/28 05:17:23
1	41	351.62825541361366	263.0453974371955	20/04/28 05:17:23
1	41	351.66351681813364	262.8025627711569	20/04/28 05:17:23
1	41	351.6345253440283	262.7635992176783	20/04/28 05:17:23
1	41	351.5899037754568	262.77613463790715	20/04/28 05:17:23
1	41	351.75139594695895	262.97119077063695	20/04/28 05:17:23
1	41	351.7053538571694	262.92664685279124	20/04/28 05:17:23
1	41	351.8331988348101	262.9134043413021	20/04/28 05:17:24
1	41	351.70504964882326	262.9660538018086	20/04/28 05:17:24
1	41	351.7038843817126	262.9928680765934	20/04/28 05:17:24
1	41	351.78985293126414	263.06559664897316	20/04/28 05:17:24
1	41	351.88045921248505	262.81593821421717	20/04/28 05:17:24
1	41	351.9790221107467	262.78303930939995	20/04/28 05:17:24
1	41	351.8583538234381	262.9178033902583	20/04/28 05:17:24
1	41	351.8657331170727	263.1514783298077	20/04/28 05:17:24
1	41	351.82561011046346	263.1856320814609	20/04/28 05:17:24
1	41	351.8935505055771	263.20132616257024	20/04/28 05:17:24
1	41	352.0864205616181	263.2046609328687	20/04/28 05:17:25
1	41	351.9807697504689	263.33159914914796	20/04/28 05:17:25
1	41	352.0668145957943	263.3239145200682	20/04/28 05:17:25
1	41	352.0180217519544	263.11521130976035	20/04/28 05:17:25
1	41	352.011011571363	263.11045097115203	20/04/28 05:17:25
1	41	352.1000717471005	263.01697616491424	20/04/28 05:17:25
1	41	351.97661130385893	262.86222585894393	20/04/28 05:17:25
1	41	351.90211489267006	263.0133288946269	20/04/28 05:17:25
1	41	351.97229894722534	262.9221702339283	20/04/28 05:17:25
1	41	351.9195038017754	262.99286626545944	20/04/28 05:17:25
1	41	351.9586792841168	263.2733330547194	20/04/28 05:17:26
1	41	351.83976334699065	263.25653934815705	20/04/28 05:17:26
1	41	351.84959363831825	263.38005718270097	20/04/28 05:17:26
1	41	351.98941784528597	263.3686670086076	20/04/28 05:17:26
1	41	351.93429921273355	263.42953375740825	20/04/28 05:17:26
1	41	351.91877726860145	263.5044131282682	20/04/28 05:17:26
1	41	352.09722780852724	263.6688698799226	20/04/28 05:17:26
1	41	352.1339143782444	263.8376979785101	20/04/28 05:17:26
1	41	352.1695709206628	263.86044486080476	20/04/28 05:17:26
1	41	352.13946568486864	263.75879460880753	20/04/28 05:17:26
1	41	351.97205058093374	263.6967965855727	20/04/28 05:17:27
1	41	351.961012394253	263.69911912724024	20/04/28 05:17:27
1	41	351.9195805109149	263.67395045988974	20/04/28 05:17:27
1	41	351.8010490277725	263.6235464991796	20/04/28 05:17:27
1	41	351.93760027374225	263.40495957027736	20/04/28 05:17:27
1	41	351.82359984224206	263.52312189034467	20/04/28 05:17:27
1	41	351.98040847239054	263.7074545811421	20/04/28 05:17:27
1	41	351.9825777398861	263.684777892118	20/04/28 05:17:27
1	41	351.9878696849143	263.7031850547537	20/04/28 05:17:27
1	41	351.94471999020897	263.76906419840185	20/04/28 05:17:28
1	41	351.81844263316907	263.76260679386337	20/04/28 05:17:28
1	41	351.91167076492803	263.56963506074493	20/04/28 05:17:28
1	41	352.1602780710526	263.5601954518744	20/04/28 05:17:28
1	41	352.1828827917	263.58583860592734	20/04/28 05:17:28
1	41	352.1828827917	263.58583860592734	20/04/28 05:17:28
1	41	352.1449179338134	263.57885002567843	20/04/28 05:17:28
1	41	352.09999671564856	263.57242762085855	20/04/28 05:17:28
1	41	352.09999671564856	263.57242762085855	20/04/28 05:17:28
1	41	351.80071970637	263.7699972836929	20/04/28 05:17:28
1	41	351.80071970637	263.7699972836929	20/04/28 05:17:29
1	41	351.7970324433689	263.7973699819424	20/04/28 05:17:29
1	41	351.6993500461757	263.84551672626185	20/04/28 05:17:29
1	41	351.9921078889197	263.90059817202825	20/04/28 05:17:29
1	41	352.1120934546209	263.8537799666683	20/04/28 05:17:29
1	41	352.1120934546209	263.8537799666683	20/04/28 05:17:29
1	41	352.066848104505	263.7524478421349	20/04/28 05:17:29
1	41	352.270825580175	263.7720294209907	20/04/28 05:17:29
1	41	352.1013356137205	263.92638535985924	20/04/28 05:17:29
1	41	352.0565585019745	264.0371155095902	20/04/28 05:17:29
1	41	351.88046655284745	264.0144020325604	20/04/28 05:17:30
1	41	351.93015738196794	264.0776785802964	20/04/28 05:17:30
1	41	351.9596035397022	264.20300040200743	20/04/28 05:17:30
1	41	351.9171729703003	264.2730693938677	20/04/28 05:17:30
1	41	351.92758823507796	264.5646650715933	20/04/28 05:17:30
1	41	351.8533477745926	264.62938615800823	20/04/28 05:17:30
1	41	352.10418667478467	264.5451998765135	20/04/28 05:17:30
1	41	351.8966407573314	264.36639113177176	20/04/28 05:17:30
1	41	351.8305015668893	264.1087548225831	20/04/28 05:17:30
1	41	351.89196900176546	263.94644563330127	20/04/28 05:17:31
1	41	351.840627671743	263.8109442694605	20/04/28 05:17:31
1	41	351.59140534111555	263.8254481594548	20/04/28 05:17:31
1	41	351.6400452616352	263.81626517371404	20/04/28 05:17:31
1	41	351.9248719460704	263.7984672381947	20/04/28 05:17:31
1	41	351.9317056614448	263.7918112874869	20/04/28 05:17:31
1	41	351.88493629184234	263.9323336107056	20/04/28 05:17:31
1	41	351.92957687470476	263.9343938226537	20/04/28 05:17:31
1	41	352.1465980770435	264.1002641777015	20/04/28 05:17:31
1	41	352.09505124619506	264.1935147584874	20/04/28 05:17:31
1	41	352.083607565254	264.3281332329962	20/04/28 05:17:32
1	41	352.0052498431062	264.4289747148697	20/04/28 05:17:32
1	41	351.9852633718969	264.47231515816713	20/04/28 05:17:32
1	41	351.8990058082393	264.35888855341074	20/04/28 05:17:32
1	41	352.1166984478917	264.28101325753653	20/04/28 05:17:32
1	41	352.1166984478917	264.28101325753653	20/04/28 05:17:32
1	41	352.0627823986938	264.23100761674897	20/04/28 05:17:32
1	41	351.8708099495691	264.1421020291806	20/04/28 05:17:32
1	41	351.96603122180056	264.4195547261533	20/04/28 05:17:32
1	41	351.9591272971091	264.42120460660936	20/04/28 05:17:32
1	41	351.92349664547214	264.3957835739533	20/04/28 05:17:33
1	41	352.0838298942266	264.4009904896482	20/04/28 05:17:33
1	41	351.9513664788407	264.3094273836987	20/04/28 05:17:33
1	41	351.9513664788407	264.3094273836987	20/04/28 05:17:33
1	41	352.0930862718611	264.1517409723977	20/04/28 05:17:33
1	41	352.0930862718611	264.1517409723977	20/04/28 05:17:33
1	41	352.1170941284028	264.2825855366621	20/04/28 05:17:33
1	41	352.1872930245949	264.3824085146707	20/04/28 05:17:33
1	41	352.1872930245949	264.3824085146707	20/04/28 05:17:33
1	41	352.1944251518334	264.3616121653325	20/04/28 05:17:34
1	41	352.3519104423656	264.3383194574444	20/04/28 05:17:34
1	41	352.3519104423656	264.3383194574444	20/04/28 05:17:34
1	41	352.63580496150655	264.2387610561223	20/04/28 05:17:34
1	41	352.63580496150655	264.2387610561223	20/04/28 05:17:34
1	41	352.7424357107042	264.16540863322007	20/04/28 05:17:34
1	41	352.7264461353175	264.19775978500985	20/04/28 05:17:34
1	41	352.74904532200094	264.1725542291878	20/04/28 05:17:34
1	41	352.7477254611419	264.16636792218196	20/04/28 05:17:34
1	41	352.83254054341364	264.1353697410499	20/04/28 05:17:34
1	41	352.8569096658199	264.2385617031838	20/04/28 05:17:35
1	41	352.8842062563677	264.35035132368495	20/04/28 05:17:35
1	41	352.68719250024947	264.2761256640795	20/04/28 05:17:35
1	41	352.6784175701836	264.28408305864883	20/04/28 05:17:35
1	41	352.6854640687629	264.15713899685363	20/04/28 05:17:35
1	41	352.5484138181371	264.0444549019576	20/04/28 05:17:35
1	41	352.5232356922849	263.90196165600986	20/04/28 05:17:35
1	41	352.30392811493857	264.0741265361546	20/04/28 05:17:35
1	41	352.2860236261751	264.10201903371615	20/04/28 05:17:35
1	41	352.0244627424925	263.9792599964127	20/04/28 05:17:35
1	41	352.00046938089883	263.8917205632145	20/04/28 05:17:36
1	41	352.0339019113267	264.07919047378675	20/04/28 05:17:36
1	41	352.03293807301674	264.08184853229676	20/04/28 05:17:36
1	41	352.0197436578916	264.10469735919787	20/04/28 05:17:36
1	41	351.99220110849166	264.1860785268937	20/04/28 05:17:36
1	41	352.17716784561986	264.1430322002399	20/04/28 05:17:36
1	41	352.3142775672719	264.0100804140374	20/04/28 05:17:36
1	41	352.31467135683016	263.99121208942324	20/04/28 05:17:36
1	41	352.40137840619536	263.99021081694224	20/04/28 05:17:36
1	41	352.23237575573086	264.021589567134	20/04/28 05:17:37
1	41	352.2054638765481	263.91642835800366	20/04/28 05:17:37
1	41	352.1752339103659	263.8794021651459	20/04/28 05:17:37
1	41	352.1914761162705	263.9096716801278	20/04/28 05:17:37
1	41	352.1862440250737	263.84634080479145	20/04/28 05:17:37
1	41	352.3908907250563	263.8200688413361	20/04/28 05:17:37
1	41	352.32533425722886	263.89642934901	20/04/28 05:17:37
1	41	352.324751672129	263.90515051946016	20/04/28 05:17:37
1	41	352.17607975262115	263.92734747112905	20/04/28 05:17:37
1	41	352.10706438740243	264.0640692541895	20/04/28 05:17:37
1	41	351.8867450255095	264.1090962369552	20/04/28 05:17:38
1	41	351.91512764895083	264.1162225591706	20/04/28 05:17:38
1	41	351.9825971803539	264.0791807519835	20/04/28 05:17:38
1	41	352.03400574788816	264.0351757014838	20/04/28 05:17:38
1	41	352.1425759382129	264.070458926288	20/04/28 05:17:38
1	41	352.14848428364706	264.04201068676855	20/04/28 05:17:38
1	41	351.9970275033636	264.2817760670392	20/04/28 05:17:38
1	41	351.98948322155576	264.3834688125002	20/04/28 05:17:38
1	41	352.00333634648115	264.39248522251046	20/04/28 05:17:38
1	41	352.09317981565636	264.43617650107814	20/04/28 05:17:38
1	41	352.09317981565636	264.43617650107814	20/04/28 05:17:39
1	41	352.11452219778516	264.47793249274895	20/04/28 05:17:39
1	41	352.30959263587135	264.60782580762356	20/04/28 05:17:39
1	41	352.48696179602814	264.4997389391273	20/04/28 05:17:39
1	41	352.53031972951	264.44730452062356	20/04/28 05:17:39
1	41	352.3027817047305	264.6171292576849	20/04/28 05:17:39
1	41	352.3027817047305	264.6171292576849	20/04/28 05:17:39
1	41	352.4312098490636	264.40913501084816	20/04/28 05:17:39
1	41	352.53463601621786	264.39950906850913	20/04/28 05:17:39
1	41	352.49601067146693	264.44708282115926	20/04/28 05:17:40
1	41	352.445654832566	264.41742720238585	20/04/28 05:17:40
1	41	352.4115583556132	264.5956014458121	20/04/28 05:17:40
1	41	352.30268975517276	264.4301617755964	20/04/28 05:17:40
1	41	352.16182788415614	264.3034614390939	20/04/28 05:17:40
1	41	352.39994245481887	264.38558556866354	20/04/28 05:17:40
1	41	352.32390881797636	264.3857504683854	20/04/28 05:17:40
1	41	352.37114253491654	264.4022121839447	20/04/28 05:17:40
1	41	352.36661914339135	264.40271423444784	20/04/28 05:17:40
1	41	352.59013339697873	264.58660611185337	20/04/28 05:17:40
1	41	352.5592745063723	264.6560287692724	20/04/28 05:17:41
1	41	352.60330237251605	264.95264162210174	20/04/28 05:17:41
1	41	352.62062454275383	265.1245408349766	20/04/28 05:17:41
1	41	352.42002844180524	264.94668448818385	20/04/28 05:17:41
1	41	352.5176101626998	264.8015940981433	20/04/28 05:17:41
1	41	352.547789046865	264.5317140718229	20/04/28 05:17:41
1	41	352.50945183922204	264.62797069266367	20/04/28 05:17:41
1	41	352.40469462767504	264.6607582510171	20/04/28 05:17:41
1	41	352.3980733407727	264.49827593782163	20/04/28 05:17:41
1	41	352.26470925124664	264.46848879615845	20/04/28 05:17:41
1	41	352.2093626181629	264.4035986910973	20/04/28 05:17:42
1	41	352.20710805923807	264.3951880821209	20/04/28 05:17:42
1	41	352.0177341889033	264.50615026926664	20/04/28 05:17:42
1	41	351.90928142172504	264.5236249022385	20/04/28 05:17:42
1	41	351.90261192485616	264.4480500280702	20/04/28 05:17:42
1	41	351.7005470553828	264.450545902357	20/04/28 05:17:42
1	41	351.56442910980536	264.6228773132976	20/04/28 05:17:42
1	41	351.6044673735554	264.39063085150224	20/04/28 05:17:42
1	41	351.4610149546613	264.3206677933888	20/04/28 05:17:42
1	41	351.38918915634486	264.1877873654335	20/04/28 05:17:43
1	41	351.27603009115495	263.966217024385	20/04/28 05:17:43
1	41	351.41751586793276	263.9378276626572	20/04/28 05:17:43
1	41	351.4078070281099	263.924689509991	20/04/28 05:17:43
1	41	351.380048879905	263.72360124611856	20/04/28 05:17:43
1	41	351.32481510319946	263.79420173288355	20/04/28 05:17:43
1	41	351.4609034801436	263.7062181347949	20/04/28 05:17:43
1	41	351.34546818908655	263.6342758729848	20/04/28 05:17:43
1	41	351.3434712208892	263.64184820256077	20/04/28 05:17:43
1	41	351.16376396323886	263.71540426217393	20/04/28 05:17:43
1	41	351.16376396323886	263.71540426217393	20/04/28 05:17:44
1	41	351.09084092783706	263.8517266865916	20/04/28 05:17:44
1	41	350.9936169001362	264.12179072841946	20/04/28 05:17:44
1	41	351.26758189838085	264.11331241320977	20/04/28 05:17:44
1	41	351.4027385640753	264.1189626697582	20/04/28 05:17:44
1	41	351.4027385640753	264.1189626697582	20/04/28 05:17:44
1	41	351.5179303612369	263.86028023145775	20/04/28 05:17:44
1	41	351.5179303612369	263.86028023145775	20/04/28 05:17:44
1	41	351.79914464225436	263.6361144451892	20/04/28 05:17:44
1	41	351.8208515210817	263.57309762995493	20/04/28 05:17:45
1	41	351.8342790118274	263.55774215633534	20/04/28 05:17:45
1	41	351.7226849681485	263.573043836845	20/04/28 05:17:45
1	41	351.7505274018121	263.4271664939515	20/04/28 05:17:45
1	41	351.8425239798854	263.4632713045657	20/04/28 05:17:45
1	41	351.86377521975413	263.4467496146245	20/04/28 05:17:45
1	41	351.98856258636437	263.1841616600054	20/04/28 05:17:45
1	41	352.19160830652055	263.04447227572837	20/04/28 05:17:45
1	41	351.93198829195836	263.11601870285534	20/04/28 05:17:45
1	41	351.8329960678809	262.9956001598067	20/04/28 05:17:45
1	41	351.89623145294644	262.8484307019787	20/04/28 05:17:46
1	41	351.9242778923931	262.7276552933019	20/04/28 05:17:46
1	41	351.8438023209482	262.75276560328655	20/04/28 05:17:46
1	41	351.77177768024643	262.47117245147285	20/04/28 05:17:46
1	41	351.91007076723076	262.4220753384984	20/04/28 05:17:46
1	41	351.9827656463028	262.25252687488677	20/04/28 05:17:46
1	41	352.03067838542086	262.4015504651386	20/04/28 05:17:46
1	41	352.22975928375126	262.5312837527258	20/04/28 05:17:46
1	41	352.0664044061496	262.46630859984026	20/04/28 05:17:46
1	41	352.31911998641226	262.41236203046896	20/04/28 05:17:46
1	41	352.23633842060786	262.40982286330217	20/04/28 05:17:47
1	41	352.2415600458012	262.27525383689874	20/04/28 05:17:47
1	41	352.50009977787886	262.1517623910643	20/04/28 05:17:47
1	41	352.4373744816869	261.88583504981847	20/04/28 05:17:47
1	41	352.6701166342506	261.70312101483313	20/04/28 05:17:47
1	41	352.6044509904876	261.6981865964104	20/04/28 05:17:47
1	41	352.4271084908208	261.58789948524156	20/04/28 05:17:47
1	41	352.4031293566792	261.6171759823505	20/04/28 05:17:47
1	41	352.11906826300077	261.64927637772024	20/04/28 05:17:47
1	41	352.1285718730202	261.6481162751017	20/04/28 05:17:48
1	41	352.16663296288624	261.5242175329601	20/04/28 05:17:48
1	41	352.1119468987648	261.2733048540728	20/04/28 05:17:48
1	41	352.14192044802235	261.25902752520216	20/04/28 05:17:48
1	41	352.0322395034803	261.2540947323426	20/04/28 05:17:48
1	41	352.0690957867081	261.30618876243733	20/04/28 05:17:48
1	41	352.04662664924064	261.3088638595099	20/04/28 05:17:48
1	41	352.19749706913046	261.3757094211636	20/04/28 05:17:48
1	41	352.12140049699934	261.4126072027587	20/04/28 05:17:48
1	41	352.17337238261536	261.5823717554781	20/04/28 05:17:48
1	41	352.228316032262	261.73595002637387	20/04/28 05:17:49
1	41	352.30170987986014	261.7949348030231	20/04/28 05:17:49
1	41	352.3634880750952	261.59511651126894	20/04/28 05:17:49
1	41	352.3743879792155	261.58331199144806	20/04/28 05:17:49
1	41	352.3221224538292	261.44330960394973	20/04/28 05:17:49
1	41	352.26603041806266	261.39425060865136	20/04/28 05:17:49
1	41	352.44998292497246	261.21575104745676	20/04/28 05:17:49
1	41	352.69166322225794	261.18341050870384	20/04/28 05:17:49
1	41	352.67313913862245	261.2716996006567	20/04/28 05:17:49
1	41	352.7019799506972	261.2353511860981	20/04/28 05:17:49
1	41	352.4390078154132	261.12066463305075	20/04/28 05:17:50
1	41	352.3798825623182	261.1886837516662	20/04/28 05:17:50
1	41	352.5298717031034	261.2873561260262	20/04/28 05:17:50
1	41	352.39097985031884	261.3663939048864	20/04/28 05:17:50
1	41	352.39097985031884	261.3663939048864	20/04/28 05:17:50
1	41	352.40981106947146	261.38482756410735	20/04/28 05:17:50
1	41	352.4553925250267	261.30034512343934	20/04/28 05:17:50
1	41	352.7002268555683	261.4454830865434	20/04/28 05:17:50
1	41	352.61071707338715	261.4131196972005	20/04/28 05:17:50
1	41	352.6095814262483	261.4607155633512	20/04/28 05:17:51
1	41	352.87005415419594	261.4797543927831	20/04/28 05:17:51
1	41	352.87005415419594	261.4797543927831	20/04/28 05:17:51
1	41	352.7434381103096	261.3417707842456	20/04/28 05:17:51
1	41	352.6139185830031	261.60458969327703	20/04/28 05:17:51
1	41	352.3913343692827	261.6649019521717	20/04/28 05:17:51
1	41	352.15685200631924	261.7866931712619	20/04/28 05:17:51
1	41	352.1818931427722	261.6483745992435	20/04/28 05:17:51
1	41	352.21759827246314	261.6226340589941	20/04/28 05:17:51
1	41	352.14282293830337	261.8644958572967	20/04/28 05:17:51
1	41	352.41438528528096	261.98824731173994	20/04/28 05:17:52
1	41	352.39607169964137	261.99715800009403	20/04/28 05:17:52
1	41	352.1723538537285	261.82031986732113	20/04/28 05:17:52
1	41	352.1921538201102	261.8029795880036	20/04/28 05:17:52
1	41	352.1972930141344	261.80635582413566	20/04/28 05:17:52
1	41	352.21615905688265	261.8537554284135	20/04/28 05:17:52
1	41	352.08456269869794	261.70747988049396	20/04/28 05:17:52
1	41	352.0545986972592	261.75159634943765	20/04/28 05:17:52
1	41	352.04627562602275	261.66427354519834	20/04/28 05:17:52
1	41	352.26836574347476	261.85582321105056	20/04/28 05:17:53
1	41	352.0726941134024	261.91442159325163	20/04/28 05:17:53
1	41	351.95629359319537	261.8396774761591	20/04/28 05:17:53
1	41	352.1278418136298	261.808488878553	20/04/28 05:17:53
1	41	352.2448729723983	261.80352914492335	20/04/28 05:17:53
1	41	352.23694254551964	261.78948832357656	20/04/28 05:17:53
1	41	352.26674366050094	261.7822018233391	20/04/28 05:17:53
1	41	352.18736790679276	261.7593958966704	20/04/28 05:17:53
1	41	352.09383434274656	261.70171417510755	20/04/28 05:17:53
1	41	352.09794912404925	261.69639406509975	20/04/28 05:17:53
1	41	352.16533028373414	261.6606330113363	20/04/28 05:17:54
1	41	351.9224381007293	261.72605745702924	20/04/28 05:17:54
1	41	351.8946923380032	261.853399370096	20/04/28 05:17:54
1	41	351.9971513885219	261.68525403267705	20/04/28 05:17:54
1	41	352.15900490623727	261.8876021324117	20/04/28 05:17:54
1	41	352.15900490623727	261.8876021324117	20/04/28 05:17:54
1	41	352.17165818846854	261.9555420665397	20/04/28 05:17:54
1	41	352.1471367890513	261.9474986634128	20/04/28 05:17:54
1	41	352.2478084219012	261.9203413848245	20/04/28 05:17:54
1	41	352.2555314617822	261.9142095286118	20/04/28 05:17:54
1	41	352.21241053577285	261.99909281290576	20/04/28 05:17:55
1	41	352.05811033103726	261.99410365696866	20/04/28 05:17:55
1	41	352.0215137495313	262.0125877898893	20/04/28 05:17:55
1	41	352.0787951772745	262.05135618818696	20/04/28 05:17:55
1	41	352.0787951772745	262.05135618818696	20/04/28 05:17:55
1	41	351.7924432693188	262.0059050156667	20/04/28 05:17:55
1	41	351.9826920728406	262.0062448534703	20/04/28 05:17:55
1	41	351.95596948521273	261.9800601424669	20/04/28 05:17:55
1	41	352.0841510894878	261.98654323077056	20/04/28 05:17:55
1	41	351.97052104159405	262.30260071537174	20/04/28 05:17:56
1	41	352.14622086012594	262.4066874704423	20/04/28 05:17:56
1	41	352.2133598287209	262.23457651989054	20/04/28 05:17:56
1	41	352.4344882974186	262.193973130206	20/04/28 05:17:56
1	41	352.4344882974186	262.193973130206	20/04/28 05:17:56
1	41	352.11210807134125	261.96041213817045	20/04/28 05:17:56
1	41	352.18084203664785	261.95261444566694	20/04/28 05:17:56
1	41	352.18084203664785	261.95261444566694	20/04/28 05:17:56
1	41	352.36855584422517	261.8436145774475	20/04/28 05:17:56
1	41	352.26624957361696	261.9808550948456	20/04/28 05:17:56
1	41	352.26624957361696	261.9808550948456	20/04/28 05:17:57
1	41	351.94312432624724	262.0459229790083	20/04/28 05:17:57
1	41	351.8741007943764	262.1917429111467	20/04/28 05:17:57
1	41	351.7142854544237	262.3058329713966	20/04/28 05:17:57
1	41	351.79542932282646	262.1980404325767	20/04/28 05:17:57
1	41	351.79542932282646	262.1980404325767	20/04/28 05:17:57
1	41	351.5868049227924	262.03386294845603	20/04/28 05:17:57
1	41	351.7215512269298	262.4650974789546	20/04/28 05:17:57
1	41	351.7215512269298	262.4650974789546	20/04/28 05:17:57
1	41	351.5855162626439	262.30252950022117	20/04/28 05:17:58
1	41	351.5855162626439	262.30252950022117	20/04/28 05:17:58
1	41	351.5854601991915	262.28176942653295	20/04/28 05:17:58
1	41	351.714172054406	262.0809704314138	20/04/28 05:17:58
1	41	351.7133109275103	262.0815637206407	20/04/28 05:17:58
1	41	351.7162638205057	262.09318190910494	20/04/28 05:17:58
1	41	351.6571543525858	262.1341820551667	20/04/28 05:17:58
1	41	351.74629820018	262.19447751047494	20/04/28 05:17:58
1	41	351.8109502474027	262.4697623340146	20/04/28 05:17:58
1	41	351.83668573992486	262.23535792365635	20/04/28 05:17:58
1	41	351.6559640664842	262.3405732204076	20/04/28 05:17:59
1	41	351.67541416477945	262.37555147287884	20/04/28 05:17:59
1	41	351.8422129346484	262.53114573940667	20/04/28 05:17:59
1	41	351.8623828479261	262.5682169546898	20/04/28 05:17:59
1	41	351.6893391021351	262.6726668088474	20/04/28 05:17:59
1	41	351.90258008944204	262.73513746273375	20/04/28 05:17:59
1	41	352.0821621068776	262.87759768448257	20/04/28 05:17:59
1	41	352.1278374339213	263.04017264468695	20/04/28 05:17:59
1	41	352.04830320304416	262.97683773475774	20/04/28 05:17:59
1	41	352.1161935598541	262.9748655247763	20/04/28 05:17:59
1	41	351.90764005560186	262.776644039984	20/04/28 05:18:00
1	41	351.89406896413016	262.6980558174737	20/04/28 05:18:00
1	41	351.86412876835413	262.9920305523355	20/04/28 05:18:00
1	41	351.61152113996985	262.9550220752363	20/04/28 05:18:00
1	41	351.6372823980488	262.9799006859216	20/04/28 05:18:00
1	41	351.611337619529	263.0860792270973	20/04/28 05:18:00
1	41	351.3352004254586	262.9917369628045	20/04/28 05:18:00
1	41	351.3244477549288	262.99009723266244	20/04/28 05:18:00
1	41	351.3393545354622	262.9255281233825	20/04/28 05:18:00
1	41	351.56209494288845	262.76000899284224	20/04/28 05:18:01
1	41	351.47227391396575	262.87961269509395	20/04/28 05:18:01
1	41	351.4402320870235	263.1232770857047	20/04/28 05:18:01
1	41	351.4128203604788	263.06545584783896	20/04/28 05:18:01
1	41	351.3859946403335	263.0590886543519	20/04/28 05:18:01
1	41	351.55553391866476	263.0987991918769	20/04/28 05:18:01
1	41	351.51010753561786	263.1560286232671	20/04/28 05:18:01
1	41	351.4263639239466	263.1066894659818	20/04/28 05:18:01
1	41	351.5311874193538	263.02409380280704	20/04/28 05:18:01
1	41	351.4061377311767	262.99927261566273	20/04/28 05:18:01
1	41	351.5472909390805	262.87976356776	20/04/28 05:18:02
1	41	351.607567987881	262.7204875802825	20/04/28 05:18:02
1	41	351.61450381121676	262.7114675522463	20/04/28 05:18:02
1	41	351.61007733492363	262.70600996326687	20/04/28 05:18:02
1	41	351.86600378164275	262.66534708574494	20/04/28 05:18:02
1	41	351.9450202509016	262.8694560695227	20/04/28 05:18:02
1	41	351.9865879742703	262.86858103488566	20/04/28 05:18:02
1	41	351.9012535402459	262.84438322665204	20/04/28 05:18:02
1	41	351.8483950558026	262.9835284404903	20/04/28 05:18:02
1	41	351.8887601254448	263.047663137414	20/04/28 05:18:02
1	41	351.89400944896676	263.0395872721254	20/04/28 05:18:03
1	41	351.9357231672214	262.8783547621097	20/04/28 05:18:03
1	41	351.92979950886195	262.89761993227324	20/04/28 05:18:03
1	41	351.8919065505492	262.8793999556999	20/04/28 05:18:03
1	41	351.76317359389407	262.8461155082874	20/04/28 05:18:03
1	41	351.84851775072525	262.7623711185025	20/04/28 05:18:03
1	41	351.82434815446777	262.8674277557165	20/04/28 05:18:03
1	41	351.773250971957	262.8685814039087	20/04/28 05:18:03
1	41	351.9083962410502	262.74989833806285	20/04/28 05:18:03
1	41	351.76604992794637	262.73821604809456	20/04/28 05:18:04
1	41	351.7866270162742	262.76281902724895	20/04/28 05:18:04
1	41	351.86425451727683	262.7530616133261	20/04/28 05:18:04
1	41	351.8643515791356	262.7372225952352	20/04/28 05:18:04
1	41	351.7160298254288	262.8586024218487	20/04/28 05:18:04
1	41	351.71468019354	262.85900273371254	20/04/28 05:18:04
1	41	351.6237004174651	262.8889976504987	20/04/28 05:18:04
1	41	351.59841347097336	262.91293392050943	20/04/28 05:18:04
1	41	351.4429397024713	262.9142248398155	20/04/28 05:18:04
1	41	351.4557785118675	262.7741593145251	20/04/28 05:18:04
1	41	351.2832690136853	262.6391785545196	20/04/28 05:18:05
1	41	351.27034419997904	262.38494070303875	20/04/28 05:18:05
1	41	351.381471720056	262.6539926576325	20/04/28 05:18:05
1	41	351.3698605558365	262.55360047814463	20/04/28 05:18:05
1	41	351.23094479121767	262.41632817474095	20/04/28 05:18:05
1	41	351.2266944516719	262.4420188601637	20/04/28 05:18:05
1	41	351.3949885783839	262.39668123981374	20/04/28 05:18:05
1	41	351.49072225829593	262.65567697465167	20/04/28 05:18:05
1	41	351.519519427311	262.64862777867336	20/04/28 05:18:05
1	41	351.5959823426164	262.56056629348456	20/04/28 05:18:06
1	41	351.44331329299405	262.5110298454589	20/04/28 05:18:06
1	41	351.4994713900505	262.5025055660065	20/04/28 05:18:06
1	41	351.49337244439755	262.41092524350813	20/04/28 05:18:06
1	41	351.5731910736157	262.25287806650704	20/04/28 05:18:06
1	41	351.5964396255846	262.3024948169972	20/04/28 05:18:06
1	41	351.56916632521376	262.2866622585031	20/04/28 05:18:06
1	41	351.69034552828373	262.4812001242405	20/04/28 05:18:06
1	41	351.6526426558242	262.45812609015326	20/04/28 05:18:06
1	41	351.42668897459345	262.3831857893738	20/04/28 05:18:06
1	41	351.3462619485958	262.3852828367113	20/04/28 05:18:07
1	41	351.24551293534284	262.24813640812175	20/04/28 05:18:07
1	41	351.07282550841035	262.3253689250167	20/04/28 05:18:07
1	41	350.9770712621459	262.4038282420044	20/04/28 05:18:07
1	41	350.7855517023464	262.3948539870761	20/04/28 05:18:07
1	41	350.80097607531746	262.5221632935317	20/04/28 05:18:07
1	41	350.92778488321215	262.42863003309304	20/04/28 05:18:07
1	41	350.77073431007733	262.42001275277596	20/04/28 05:18:07
1	41	350.90472837908817	262.3040346798949	20/04/28 05:18:07
1	41	350.96781381011147	262.34784197094166	20/04/28 05:18:07
1	41	350.9848918178379	262.2790123056572	20/04/28 05:18:08
1	41	350.76485512040745	262.1413954855193	20/04/28 05:18:08
1	41	350.51281721470866	262.2400006799061	20/04/28 05:18:08
1	41	350.7062676814051	262.21782710789773	20/04/28 05:18:08
1	41	350.5556119421552	262.0245541157752	20/04/28 05:18:08
1	41	350.4527613728454	261.96482251314814	20/04/28 05:18:08
1	41	350.3286249834315	262.21239888442057	20/04/28 05:18:08
1	41	350.41578301682773	262.19345671107	20/04/28 05:18:08
1	41	350.23198998054943	262.17937261335663	20/04/28 05:18:08
1	41	350.40546998764233	262.11160702058527	20/04/28 05:18:09
1	41	350.66530998423127	262.24628575052924	20/04/28 05:18:09
1	41	350.4233503551727	262.14765016313817	20/04/28 05:18:09
1	41	350.4215938473523	262.0589968322641	20/04/28 05:18:09
1	41	350.2970178201164	262.15454027452637	20/04/28 05:18:09
1	41	350.31429249739847	262.1464796111896	20/04/28 05:18:09
1	41	350.3509193615422	262.1490798388925	20/04/28 05:18:09
1	41	350.128282775527	262.1445864941757	20/04/28 05:18:09
1	41	350.2179180413906	262.0003160441105	20/04/28 05:18:09
1	41	350.4944609201194	261.9881556681327	20/04/28 05:18:09
1	41	350.6326634841555	262.04041928692516	20/04/28 05:18:10
1	41	350.4093538645663	262.10887001844003	20/04/28 05:18:10
1	41	350.620210914272	262.1453066876185	20/04/28 05:18:10
1	41	350.55573966285925	262.1774821817127	20/04/28 05:18:10
1	41	350.3890316330101	261.98946479353924	20/04/28 05:18:10
1	41	350.37639313474114	261.95721746700553	20/04/28 05:18:10
1	41	350.5226032902397	261.94031504773903	20/04/28 05:18:10
1	41	350.66496746267194	261.85672349611616	20/04/28 05:18:10
1	41	350.81637361680214	261.7151941958074	20/04/28 05:18:10
1	41	351.078198088446	261.6456806311613	20/04/28 05:18:10
1	41	351.10242369584626	261.6421919200479	20/04/28 05:18:11
1	41	351.08163920575464	261.51548121928306	20/04/28 05:18:11
1	41	350.94420082666477	261.2680731078594	20/04/28 05:18:11
1	41	350.9562475399095	261.2718140621985	20/04/28 05:18:11
1	41	350.96728607379265	261.28317131529707	20/04/28 05:18:11
1	41	351.17456074823883	261.47843377950545	20/04/28 05:18:11
1	41	351.09844099677713	261.6034024421216	20/04/28 05:18:11
1	41	351.00684510837164	261.54091440477947	20/04/28 05:18:11
1	41	351.15995031909245	261.7686252329257	20/04/28 05:18:11
1	41	351.3069451627719	262.0298894891292	20/04/28 05:18:12
1	41	351.18857886719843	262.29319354133133	20/04/28 05:18:12
1	41	351.03367875086025	262.06796142921075	20/04/28 05:18:12
1	41	351.1314958877781	261.99214330303806	20/04/28 05:18:12
1	41	351.1346053552595	261.77126355307996	20/04/28 05:18:12
1	41	351.19374997042075	261.7397038400697	20/04/28 05:18:12
1	41	351.0500230499924	261.6689910708209	20/04/28 05:18:12
1	41	350.98508661044144	261.5528170615255	20/04/28 05:18:12
1	41	351.1758057440273	261.55837074534685	20/04/28 05:18:12
1	41	351.17588241179914	261.5592419026241	20/04/28 05:18:12
1	41	350.99170764980596	261.5292314538774	20/04/28 05:18:13
1	41	351.076285406112	261.5445348741779	20/04/28 05:18:13
1	41	351.1746170036885	261.7056471080315	20/04/28 05:18:13
1	41	351.0685069414956	261.44416739302716	20/04/28 05:18:13
1	41	350.98593449225734	261.35016152794	20/04/28 05:18:13
1	41	351.10077310221754	261.172322464976	20/04/28 05:18:13
1	41	351.09302593674755	261.11948355056865	20/04/28 05:18:13
1	41	351.1640880754792	261.35528271918315	20/04/28 05:18:13
1	41	351.1640880754792	261.35528271918315	20/04/28 05:18:13
1	41	351.1640880754792	261.35528271918315	20/04/28 05:18:13
1	41	351.07958787196094	261.39703331850944	20/04/28 05:18:14
1	41	351.07752289587137	261.3965426501943	20/04/28 05:18:14
1	41	351.1082648227254	261.4001504585919	20/04/28 05:18:14
1	41	351.0110847032397	261.3730561408821	20/04/28 05:18:14
1	41	351.1098077472741	261.31525572573247	20/04/28 05:18:14
1	41	351.1109632847965	261.31488455778407	20/04/28 05:18:14
1	41	351.30060761321414	261.21581946949993	20/04/28 05:18:14
1	41	351.14934740401856	261.06252171989684	20/04/28 05:18:14
1	41	351.084755130257	261.2173895760967	20/04/28 05:18:14
1	41	351.15598123000416	261.3586454428224	20/04/28 05:18:15
1	41	351.18949464872816	261.23146854312944	20/04/28 05:18:15
1	41	351.1889594568965	261.2347124053127	20/04/28 05:18:15
1	41	351.2552795054441	261.4613811184829	20/04/28 05:18:15
1	41	351.24686979684134	261.4937716356585	20/04/28 05:18:15
1	41	351.21963936300125	261.4230430468128	20/04/28 05:18:15
1	41	351.37086086161685	261.44800376148123	20/04/28 05:18:15
1	41	351.36466281551253	261.50347635356803	20/04/28 05:18:15
1	41	351.5384457020972	261.58433130261955	20/04/28 05:18:15
1	41	351.7275381982213	261.7551202209332	20/04/28 05:18:15
1	41	351.75182720621376	261.73651803071226	20/04/28 05:18:16
1	41	351.9184328202586	261.76390105292376	20/04/28 05:18:16
1	41	351.9746071569037	261.7373773256301	20/04/28 05:18:16
1	41	352.0793051321698	261.8297779309808	20/04/28 05:18:16
1	41	352.2184880050135	261.98633551690045	20/04/28 05:18:16
1	41	352.28927999714125	261.9181197015295	20/04/28 05:18:16
1	41	352.3642947498155	261.7232435617124	20/04/28 05:18:16
1	41	352.1812920983236	261.6731260341672	20/04/28 05:18:16
1	41	352.17012895666096	261.6835688862266	20/04/28 05:18:16
1	41	351.9721979034275	261.8065726329649	20/04/28 05:18:16
1	41	351.99385513592284	261.9401904034441	20/04/28 05:18:17
1	41	351.75638698343244	262.00011747722425	20/04/28 05:18:17
1	41	351.8027795603504	262.0119568238911	20/04/28 05:18:17
1	41	351.79670207507854	261.8412216400875	20/04/28 05:18:17
1	41	351.7630611229722	261.82305537760783	20/04/28 05:18:17
1	41	351.74469040010575	261.75637324083533	20/04/28 05:18:17
1	41	351.9923320092982	261.73135917185584	20/04/28 05:18:17
1	41	351.97504813051364	261.8047491840806	20/04/28 05:18:17
1	41	351.8077681167045	261.6309561346731	20/04/28 05:18:17
1	41	351.8318733168716	261.66270570203363	20/04/28 05:18:18
1	41	351.85226000748975	261.7167967842398	20/04/28 05:18:18
1	41	352.0574847757187	261.57534336796334	20/04/28 05:18:18
1	41	351.97015064288337	261.4629687028747	20/04/28 05:18:18
1	41	351.8921294650169	261.18520641076776	20/04/28 05:18:18
1	41	351.734877953624	261.07600925960486	20/04/28 05:18:18
1	41	351.7535795426552	261.0101121080694	20/04/28 05:18:18
1	41	351.60905789666384	261.0317499211875	20/04/28 05:18:18
1	41	351.76583470661865	261.27557380674256	20/04/28 05:18:18
1	41	351.6897967085039	261.1772925974968	20/04/28 05:18:18
1	41	351.7617345967947	260.894146150038	20/04/28 05:18:19
1	41	351.8867513320735	260.79386310302226	20/04/28 05:18:19
1	41	351.8786181683344	260.81338367504054	20/04/28 05:18:19
1	41	351.9499606366928	260.6871556925572	20/04/28 05:18:19
1	41	351.8128955940288	260.5635108390671	20/04/28 05:18:19
1	41	351.8176145809256	260.3987731661257	20/04/28 05:18:19
1	41	351.85153083809377	260.42918719248814	20/04/28 05:18:19
1	41	351.86280453411445	260.44379015296795	20/04/28 05:18:19
1	41	351.93169437235576	260.3440760808673	20/04/28 05:18:19
1	41	351.6995506054454	260.4047473267527	20/04/28 05:18:20
1	41	351.67110506058924	260.42961451204667	20/04/28 05:18:20
1	41	351.65118698260136	260.43213576037294	20/04/28 05:18:20
1	41	351.4943119852121	260.6378260803518	20/04/28 05:18:20
1	41	351.6523208660325	260.6426003994856	20/04/28 05:18:20
1	41	351.4157447428322	260.7108407866967	20/04/28 05:18:20
1	41	351.61333670422664	260.6660142562587	20/04/28 05:18:20
1	41	351.3448645457048	260.7861596184052	20/04/28 05:18:20
1	41	351.57844530149697	260.8862110537386	20/04/28 05:18:20
1	41	351.61338669367956	260.68465229049303	20/04/28 05:18:20
1	41	351.76240878782744	260.9293468107669	20/04/28 05:18:21
1	41	351.75619049514313	260.9667537579545	20/04/28 05:18:21
1	41	351.7113675833354	260.9865629195291	20/04/28 05:18:21
1	41	351.6219211589415	261.20194669557395	20/04/28 05:18:21
1	41	351.3760876143551	261.31587392991776	20/04/28 05:18:21
1	41	351.32244855912467	261.15599308458314	20/04/28 05:18:21
1	41	351.3375247930384	261.0617563342943	20/04/28 05:18:21
1	41	351.35154631848394	260.9489481937593	20/04/28 05:18:21
1	41	351.3774262584247	260.95704556643597	20/04/28 05:18:21
1	41	351.42417142953286	261.06807154916817	20/04/28 05:18:21
1	41	351.1889523661783	260.96845637555793	20/04/28 05:18:22
1	41	351.16547329393563	261.07499946865676	20/04/28 05:18:22
1	41	351.1129064695678	261.03299450687723	20/04/28 05:18:22
1	41	351.06251109979115	260.9165357784336	20/04/28 05:18:22
1	41	351.0504574415611	260.828874500952	20/04/28 05:18:22
1	41	351.24390286508435	260.72107336741	20/04/28 05:18:22
1	41	351.09343413927604	260.6950720535149	20/04/28 05:18:22
1	41	350.9465900935651	260.761598465786	20/04/28 05:18:22
1	41	350.94718799185705	260.5601828842626	20/04/28 05:18:22
1	41	351.121879279416	260.38931666782975	20/04/28 05:18:22
1	41	351.1524138308733	260.1808996005255	20/04/28 05:18:23
1	41	351.3112540829437	260.4107808583599	20/04/28 05:18:23
1	41	351.28413489710914	260.30407740102646	20/04/28 05:18:23
1	41	351.3913833284417	260.27333435574917	20/04/28 05:18:23
1	41	351.3712362169618	260.4445067151859	20/04/28 05:18:23
1	41	351.50094194863914	260.6356108322793	20/04/28 05:18:23
1	41	351.2915214932167	260.81635244541684	20/04/28 05:18:23
1	41	351.3403602185413	261.0109243528789	20/04/28 05:18:23
1	41	351.30264711333547	261.0373090659902	20/04/28 05:18:23
1	41	351.43124062197546	260.8842942885389	20/04/28 05:18:24
1	41	351.4402124686281	260.62261149991633	20/04/28 05:18:24
1	41	351.49062855404907	260.5723408561141	20/04/28 05:18:24
1	41	351.55969039843956	260.6000452527644	20/04/28 05:18:24
1	41	351.5899024712248	260.80969208033656	20/04/28 05:18:24
1	41	351.6642759895353	260.92979678834723	20/04/28 05:18:24
1	41	351.9178191521411	260.84955933871225	20/04/28 05:18:24
1	41	352.0721039497766	260.95648166205365	20/04/28 05:18:24
1	41	351.93031626319396	260.84570149095816	20/04/28 05:18:24
1	41	351.80187694959386	260.7358675779449	20/04/28 05:18:24
1	41	351.7912553512282	260.7400189173543	20/04/28 05:18:25
1	41	351.79133667301073	260.73828020139854	20/04/28 05:18:25
1	41	351.61666531390983	260.613508980512	20/04/28 05:18:25
1	41	351.652305854824	260.65120240244477	20/04/28 05:18:25
1	41	351.82609714757393	260.6468621286421	20/04/28 05:18:25
1	41	351.85898714143383	260.657009205514	20/04/28 05:18:25
1	41	351.85779191868426	260.6509368670325	20/04/28 05:18:25
1	41	351.7903879279165	260.53496648851643	20/04/28 05:18:25
1	41	351.6415219298994	260.5208101679733	20/04/28 05:18:25
1	41	351.74163098106203	260.52583553518105	20/04/28 05:18:25
1	41	351.7721630643197	260.57811828905545	20/04/28 05:18:26
1	41	351.6829029516171	260.62427732590976	20/04/28 05:18:26
1	41	351.83087586356953	260.6245339022199	20/04/28 05:18:26
1	41	352.0287700925263	260.63075435170856	20/04/28 05:18:26
1	41	352.0187739009929	260.5714401005143	20/04/28 05:18:26
1	41	352.0193387481845	260.57056097321896	20/04/28 05:18:26
1	41	352.10401482060036	260.49761869635444	20/04/28 05:18:26
1	41	352.20568765073415	260.512752080923	20/04/28 05:18:26
1	41	352.1311745507505	260.74390307130017	20/04/28 05:18:26
1	41	352.12398649570525	260.74483385589207	20/04/28 05:18:27
1	41	352.2233031972068	260.6807772534762	20/04/28 05:18:27
1	41	352.0230703430032	260.893844211241	20/04/28 05:18:27
1	41	351.92986354652027	261.0451570328369	20/04/28 05:18:27
1	41	352.13860947972154	260.84424490008814	20/04/28 05:18:27
1	41	352.1855826216579	260.80895821091764	20/04/28 05:18:27
1	41	352.12998874545036	261.0423650573778	20/04/28 05:18:27
1	41	351.8893986267104	261.05713692953884	20/04/28 05:18:27
1	41	351.75026621028536	260.9895293136601	20/04/28 05:18:27
1	41	351.6835801769772	261.1760796904863	20/04/28 05:18:27
1	41	351.7883316648687	261.19278543148357	20/04/28 05:18:28
1	41	351.55560166181465	261.15797289586015	20/04/28 05:18:28
1	41	351.5490972766409	261.3095778312171	20/04/28 05:18:28
1	41	351.5518189741138	261.28819262067	20/04/28 05:18:28
1	41	351.59452866948067	261.4916363968591	20/04/28 05:18:28
1	41	351.6135266595165	261.28337570362265	20/04/28 05:18:28
1	41	351.6094502665417	261.2785935156164	20/04/28 05:18:28
1	41	351.7714309728198	261.33211661996324	20/04/28 05:18:28
1	41	351.88839080803905	261.4802903418798	20/04/28 05:18:28
1	41	351.7163664476506	261.5295430730582	20/04/28 05:18:28
1	41	351.50730931942996	261.6202407828136	20/04/28 05:18:29
1	41	351.3234056720133	261.6644139814684	20/04/28 05:18:29
1	41	351.3124521271116	261.5744689888187	20/04/28 05:18:29
1	41	351.10852205236495	261.57237523692686	20/04/28 05:18:29
1	41	351.226668158286	261.73759242638187	20/04/28 05:18:29
1	41	351.29262755748437	261.62343694257015	20/04/28 05:18:29
1	41	351.23381166349617	261.90631336624836	20/04/28 05:18:29
1	41	351.4671140353304	261.77937310140464	20/04/28 05:18:29
1	41	351.55715088224656	261.63517437881393	20/04/28 05:18:29
1	41	351.6844156034877	261.5782418280154	20/04/28 05:18:30
1	41	351.77533165653375	261.48214070781717	20/04/28 05:18:30
1	41	351.5858750569508	261.4790122394825	20/04/28 05:18:30
1	41	351.5073791435666	261.2007659837412	20/04/28 05:18:30
1	41	351.5662804220917	261.20641060449964	20/04/28 05:18:30
1	41	351.5160363882068	260.9709114535431	20/04/28 05:18:30
1	41	351.30866243663775	260.77586811916547	20/04/28 05:18:30
1	41	351.29730836328235	260.820257122287	20/04/28 05:18:30
1	41	351.45247106910296	261.0019266936054	20/04/28 05:18:30
1	41	351.48686198818234	260.9476430265743	20/04/28 05:18:30
1	41	351.25311688462114	260.9632287947037	20/04/28 05:18:31
1	41	351.0567508802527	260.8931699053419	20/04/28 05:18:31
1	41	351.0806634326313	260.72235794930475	20/04/28 05:18:31
1	41	351.0251118403649	260.7852056123748	20/04/28 05:18:31
1	41	351.0534753867749	260.70697979392634	20/04/28 05:18:31
1	41	351.1597438239037	260.7181347792041	20/04/28 05:18:31
1	41	351.19375209110046	260.78192896054054	20/04/28 05:18:31
1	41	351.2707664117042	260.8591295993226	20/04/28 05:18:31
1	41	351.36261878231636	261.07161050837084	20/04/28 05:18:31
1	41	351.48282821438653	261.0451905613509	20/04/28 05:18:31
1	41	351.4022333376168	260.93297526939574	20/04/28 05:18:32
1	41	351.45465124672785	260.8284949944187	20/04/28 05:18:32
1	41	351.521349970285	260.8104964380374	20/04/28 05:18:32
1	41	351.52166277246187	260.8182981100082	20/04/28 05:18:32
1	41	351.2832925457821	260.9226576962485	20/04/28 05:18:32
1	41	351.1164009541636	261.02504431912894	20/04/28 05:18:32
1	41	351.0875948530775	261.0515517021164	20/04/28 05:18:32
1	41	351.246519275323	261.206169090095	20/04/28 05:18:32
1	41	351.3141963946725	261.38310805520064	20/04/28 05:18:32
1	41	351.3142857067522	261.39075558151984	20/04/28 05:18:33
1	41	351.2950136119727	261.3478943774072	20/04/28 05:18:33
1	41	351.2865534557675	261.5137683267455	20/04/28 05:18:33
1	41	351.03106391693547	261.6333897063136	20/04/28 05:18:33
1	41	351.0317966970473	261.54616894754696	20/04/28 05:18:33
1	41	351.0877056247847	261.82486321463983	20/04/28 05:18:33
1	41	351.2159730523602	261.99528302276906	20/04/28 05:18:33
1	41	351.2239307491155	262.1805654123112	20/04/28 05:18:33
1	41	351.29523767692007	262.1498622309104	20/04/28 05:18:33
1	41	351.3906190297109	262.09676396047104	20/04/28 05:18:33
1	41	351.25459737543	262.1059553942932	20/04/28 05:18:34
1	41	351.24705718202193	262.1214169962561	20/04/28 05:18:34
1	41	351.30402308178316	262.12630299990246	20/04/28 05:18:34
1	41	351.32026030761534	262.1302708597994	20/04/28 05:18:34
1	41	351.3556423974388	262.2895430201065	20/04/28 05:18:34
1	41	351.60100394602614	262.4599463953432	20/04/28 05:18:34
1	41	351.61442408397767	262.3825392917525	20/04/28 05:18:34
1	41	351.587396559263	262.6637562393641	20/04/28 05:18:34
1	41	351.49765795932467	262.54046130084686	20/04/28 05:18:34
1	41	351.7844804569168	262.5110496523592	20/04/28 05:18:34
1	41	351.7980218862698	262.50158764281963	20/04/28 05:18:35
1	41	351.82313178708597	262.54064170013544	20/04/28 05:18:35
1	41	351.6213201410098	262.45490287678825	20/04/28 05:18:35
1	41	351.6790938564275	262.48763627971374	20/04/28 05:18:35
1	41	351.875195090247	262.30882051829605	20/04/28 05:18:35
1	41	351.998535539244	262.4446028052944	20/04/28 05:18:35
1	41	351.9659620781144	262.54565170618395	20/04/28 05:18:35
1	41	351.839365303436	262.292946298919	20/04/28 05:18:35
1	41	352.0825853924388	262.4414635495059	20/04/28 05:18:35
1	41	352.2110653237559	262.4898353944818	20/04/28 05:18:36
1	41	352.1214992663023	262.6929292582372	20/04/28 05:18:36
1	41	352.3236481289204	262.79543233427745	20/04/28 05:18:36
1	41	352.34200059354816	262.80607291772577	20/04/28 05:18:36
1	41	352.34200059354816	262.80607291772577	20/04/28 05:18:36
1	41	352.34200059354816	262.80607291772577	20/04/28 05:18:36
1	41	352.3947199311581	262.57491818327645	20/04/28 05:18:36
1	41	352.4495333191561	262.33458181485116	20/04/28 05:18:36
1	41	352.49060579982495	262.1544942266414	20/04/28 05:18:36
1	41	352.5439902874413	261.9204230562108	20/04/28 05:18:36
1	41	352.5902819383713	261.7174513429257	20/04/28 05:18:37
1	41	352.62551937039046	261.5629482780096	20/04/28 05:18:37
1	41	352.68562214343797	261.29941991871453	20/04/28 05:18:37
1	41	352.7255004499705	261.1245683410063	20/04/28 05:18:37
1	41	352.7886273459137	260.8477803248836	20/04/28 05:18:37
1	41	352.8530405473729	260.5653523363436	20/04/28 05:18:37
1	41	352.90369730994894	260.34324122812063	20/04/28 05:18:37
1	41	352.95162848354903	260.1330808162551	20/04/28 05:18:37
1	41	353.0064346111956	259.8927762817772	20/04/28 05:18:37
1	41	353.0440665858585	259.72777403583905	20/04/28 05:18:38
1	41	353.0920688031031	259.51730212395256	20/04/28 05:18:38
1	41	353.14430856715046	259.288250141634	20/04/28 05:18:38
1	53	353.13443118657216	259.159541666667	20/04/28 05:18:38
1	53	352.89049451761286	259.159541666667	20/04/28 05:18:38
1	53	352.7322153756984	259.159541666667	20/04/28 05:18:38
1	53	352.57756042436523	259.159541666667	20/04/28 05:18:38
1	53	352.3414600254146	259.159541666667	20/04/28 05:18:38
1	53	352.15132346341665	259.159541666667	20/04/28 05:18:38
1	53	351.91649595089496	259.159541666667	20/04/28 05:18:38
1	53	351.7658779316677	259.159541666667	20/04/28 05:18:39
1	53	351.56590889449336	259.159541666667	20/04/28 05:18:39
1	53	351.3542068874643	259.159541666667	20/04/28 05:18:39
1	53	351.05563514493974	259.159541666667	20/04/28 05:18:39
1	53	350.8811142710959	259.159541666667	20/04/28 05:18:39
1	53	350.64676459661507	259.159541666667	20/04/28 05:18:39
1	53	350.4825980175975	259.159541666667	20/04/28 05:18:39
1	53	350.2422515638074	259.159541666667	20/04/28 05:18:39
1	53	349.95956890112836	259.159541666667	20/04/28 05:18:39
1	53	349.773649888233	259.159541666667	20/04/28 05:18:39
1	53	349.5699895834839	259.159541666667	20/04/28 05:18:40
1	53	349.3678293981122	259.159541666667	20/04/28 05:18:40
1	53	349.2130443108444	259.159541666667	20/04/28 05:18:40
1	53	348.96956098628493	259.159541666667	20/04/28 05:18:40
1	53	348.81459889609494	259.159541666667	20/04/28 05:18:40
1	53	348.5259374867603	259.159541666667	20/04/28 05:18:40
1	53	348.31502003634404	259.159541666667	20/04/28 05:18:40
1	53	348.0884230255105	259.159541666667	20/04/28 05:18:40
1	53	347.7910645578098	259.159541666667	20/04/28 05:18:40
1	53	347.5722917434567	259.159541666667	20/04/28 05:18:41
1	53	347.36557927868887	259.159541666667	20/04/28 05:18:41
1	53	347.1069135314515	259.159541666667	20/04/28 05:18:41
1	53	346.8976176879179	259.159541666667	20/04/28 05:18:41
1	53	346.7038813462353	259.159541666667	20/04/28 05:18:41
1	53	346.5000867620913	259.159541666667	20/04/28 05:18:41
1	53	346.3381273869737	259.159541666667	20/04/28 05:18:41
1	53	346.13536134706794	259.159541666667	20/04/28 05:18:41
1	53	345.9667845617209	259.159541666667	20/04/28 05:18:41
1	53	345.711315607992	259.159541666667	20/04/28 05:18:41
1	53	345.5133903355788	259.159541666667	20/04/28 05:18:42
1	53	345.2743746025392	259.159541666667	20/04/28 05:18:42
1	53	345.04451554105646	259.159541666667	20/04/28 05:18:42
1	53	344.7884918027029	259.159541666667	20/04/28 05:18:42
1	53	344.7884918027029	259.159541666667	20/04/28 05:18:42
1	53	344.63537016784824	259.159541666667	20/04/28 05:18:42
1	53	344.37383159469454	259.159541666667	20/04/28 05:18:42
1	53	344.2017033347038	259.159541666667	20/04/28 05:18:42
1	53	344.00411257844854	259.159541666667	20/04/28 05:18:42
1	53	343.7153073218077	259.159541666667	20/04/28 05:18:42
1	53	343.4509865934574	259.159541666667	20/04/28 05:18:43
1	53	343.210058238005	259.159541666667	20/04/28 05:18:43
1	53	342.98523749190224	259.159541666667	20/04/28 05:18:43
1	53	342.7727005838757	259.159541666667	20/04/28 05:18:43
1	53	342.5193323781009	259.159541666667	20/04/28 05:18:43
1	53	342.31763740450054	259.159541666667	20/04/28 05:18:43
1	53	342.0253586254507	259.159541666667	20/04/28 05:18:43
1	53	341.7289859900297	259.159541666667	20/04/28 05:18:43
1	53	341.53268655620354	259.159541666667	20/04/28 05:18:43
1	53	341.30582947964564	259.159541666667	20/04/28 05:18:44
1	53	341.07258304695057	259.159541666667	20/04/28 05:18:44
1	53	340.8974392784304	259.159541666667	20/04/28 05:18:44
1	53	340.60362556829165	259.159541666667	20/04/28 05:18:44
1	53	340.3093552083101	259.159541666667	20/04/28 05:18:44
1	69	340.1941740875946	259.18926767781716	20/04/28 05:18:44
1	69	340.1941740875946	259.18926767781716	20/04/28 05:18:44
1	69	340.25303167080017	259.39161113690244	20/04/28 05:18:44
1	69	340.3364784792573	259.6784886292023	20/04/28 05:18:44
1	69	340.4193351466444	259.9633373058602	20/04/28 05:18:44
1	53	340.4358842129278	260.02023048995034	20/04/28 05:18:45
1	53	340.4875737501144	260.2892186988894	20/04/28 05:18:45
1	53	340.5864445573485	260.4711069472425	20/04/28 05:18:45
1	53	340.6824928849006	260.5971262054692	20/04/28 05:18:45
1	53	340.8949469680078	260.76117422404224	20/04/28 05:18:45
1	53	340.7835650488637	260.762060002414	20/04/28 05:18:45
1	53	340.79873170970603	260.7384341092153	20/04/28 05:18:45
1	53	340.923766749512	260.60181307734814	20/04/28 05:18:45
1	53	340.76786296784	260.6016336623358	20/04/28 05:18:45
1	53	340.71026687433385	260.6590544264945	20/04/28 05:18:45
1	53	340.64198564642226	260.82580681008255	20/04/28 05:18:46
1	53	340.4413137545564	260.93162470828116	20/04/28 05:18:46
1	53	340.6301478460792	261.1107095114136	20/04/28 05:18:46
1	53	340.7272890197333	261.33388492388247	20/04/28 05:18:46
1	53	340.77733490483075	261.4011171650082	20/04/28 05:18:46
1	53	341.00554476886816	261.5708695358632	20/04/28 05:18:46
1	53	340.9204765374303	261.5151725144964	20/04/28 05:18:46
1	53	341.00773010960114	261.5784325372637	20/04/28 05:18:46
1	53	340.96706430768637	261.70665559754633	20/04/28 05:18:46
1	53	341.03982477721524	261.73294549465845	20/04/28 05:18:47
1	53	340.9935515437391	261.71684403374684	20/04/28 05:18:47
1	53	340.8340807540552	261.68872450352296	20/04/28 05:18:47
1	53	340.8313009905814	261.7159964355997	20/04/28 05:18:47
1	53	340.7876428604756	261.6832296695013	20/04/28 05:18:47
1	53	340.8241693041405	261.4910196667824	20/04/28 05:18:47
1	53	340.8458477708276	261.5099094285646	20/04/28 05:18:47
1	53	341.01929754411447	261.675190805464	20/04/28 05:18:47
1	53	341.0417855130297	261.68423799137105	20/04/28 05:18:47
1	53	341.26870681430574	261.5917525525867	20/04/28 05:18:47
1	53	341.2291184770862	261.3696307167833	20/04/28 05:18:48
1	53	341.22776318996927	261.4175035969573	20/04/28 05:18:48
1	53	341.27969864907914	261.28902124140006	20/04/28 05:18:48
1	53	341.1871305668533	261.05806515542844	20/04/28 05:18:48
1	53	340.9620991567944	260.91004656817194	20/04/28 05:18:48
1	53	340.918415411068	260.9926226733407	20/04/28 05:18:48
1	53	340.9101543708818	261.002326275301	20/04/28 05:18:48
1	53	341.0974399153465	261.0684980436473	20/04/28 05:18:48
1	53	341.0866039121307	261.07233071406694	20/04/28 05:18:48
1	53	340.802748941047	261.1392736044072	20/04/28 05:18:48
1	53	340.75848727562635	261.01520454170725	20/04/28 05:18:49
