floorId	partitionId	location_x	location_y	timeStamp
3	49	323.43722664659316	275.95182315407965	20/04/28 05:17:16
1	39	323.11960286715964	277.42468672219	20/04/28 05:17:17
3	49	323.11960286715964	277.42468672219	20/04/28 05:17:18
3	49	323.11960286715964	277.42468672218996	20/04/28 05:17:19
3	66	337.7946664738924	277.6732244543289	20/04/28 05:17:20
3	49	323.73992003557714	278.7626369666894	20/04/28 05:17:21
3	49	323.73992003557714	278.7626369666894	20/04/28 05:17:22
1	39	323.84466687572785	280.95629795696965	20/04/28 05:17:23
3	NULL	324.01078524907774	280.6817404919995	20/04/28 05:17:24
3	49	323.73992003557714	278.7626369666894	20/04/28 05:17:25
1	39	323.11960286715964	277.42468672219	20/04/28 05:17:26
1	39	323.73992003557714	278.76263696668934	20/04/28 05:17:27
3	49	323.11960286715964	277.42468672219	20/04/28 05:17:28
1	39	323.11960286715964	277.42468672218996	20/04/28 05:17:29
1	39	324.01078524907774	280.6817404919995	20/04/28 05:17:30
3	49	323.23358458138586	278.6702514810404	20/04/28 05:17:31
1	39	323.23358458138586	278.6702514810404	20/04/28 05:17:32
3	49	323.23358458138586	278.6702514810404	20/04/28 05:17:33
1	39	323.11960286715964	277.42468672218996	20/04/28 05:17:34
1	39	323.84466687572785	280.95629795696965	20/04/28 05:17:35
3	NULL	324.01078524907774	280.6817404919995	20/04/28 05:17:36
1	4	319.2453954067801	279.681025785484	20/04/28 05:17:37
3	NULL	322.66002597890133	273.94033414312054	20/04/28 05:17:38
1	39	323.11960286715964	277.42468672219	20/04/28 05:17:39
1	39	323.11960286715964	277.42468672219	20/04/28 05:17:40
3	49	323.11960286715964	277.42468672219	20/04/28 05:17:41
1	4	318.46819473908823	277.6695367745249	20/04/28 05:17:42
3	NULL	322.66002597890133	273.94033414312054	20/04/28 05:17:43
3	NULL	322.66002597890133	273.94033414312054	20/04/28 05:17:44
1	39	323.11960286715964	277.42468672219	20/04/28 05:17:45
3	51	319.8657125751976	281.0189760299834	20/04/28 05:17:46
1	4	318.46819473908823	277.66953677452483	20/04/28 05:17:47
3	49	323.11960286715964	277.42468672218996	20/04/28 05:17:48
1	4	319.2453954067801	279.681025785484	20/04/28 05:17:49
1	4	319.2453954067801	279.681025785484	20/04/28 05:17:50
1	4	318.46819473908823	277.6695367745249	20/04/28 05:17:51
1	4	319.35937712100633	280.9265905443344	20/04/28 05:17:52
1	4	319.35937712100633	280.9265905443344	20/04/28 05:17:53
1	4	319.35937712100633	280.9265905443344	20/04/28 05:17:54
1	4	318.572941579239	279.8631977648052	20/04/28 05:17:55
1	87	315.8425784574272	274.19884125120274	20/04/28 05:17:56
1	87	312.52047803864497	277.04067651357406	20/04/28 05:17:57
1	4	318.46819473908823	277.6695367745249	20/04/28 05:17:58
1	4	318.46819473908823	277.6695367745249	20/04/28 05:17:59
1	4	312.8753080867525	278.33136810236323	20/04/28 05:18:00
1	4	319.8657125751976	281.0189760299834	20/04/28 05:18:01
1	4	319.2453954067801	279.681025785484	20/04/28 05:18:02
