floorId	partitionId	location_x	location_y	timeStamp
3	68	357.22135694849777	258.61882138940047	20/04/28 05:08:49
3	68	353.5787573247015	258.259240649203	20/04/28 05:08:50
3	54	354.93110780732565	263.85962413987545	20/04/28 05:08:51
3	8	357.87501606482897	266.0533751351783	20/04/28 05:08:52
3	8	357.87501606482897	266.0533751351783	20/04/28 05:08:53
3	8	357.87501606482897	266.0533751351783	20/04/28 05:08:54
3	8	357.8750160648289	266.0533751351783	20/04/28 05:08:55
3	8	357.8750160648289	266.0533751351783	20/04/28 05:08:56
3	8	357.87501606482897	266.0533751351783	20/04/28 05:08:57
3	8	357.8750160648289	266.0533751351783	20/04/28 05:08:58
3	8	357.8750160648289	266.0533751351783	20/04/28 05:08:59
3	8	357.8750160648289	266.0533751351783	20/04/28 05:09:00
3	8	357.8750160648289	266.0533751351783	20/04/28 05:09:01
3	8	357.87501606482897	266.0533751351783	20/04/28 05:09:02
3	8	360.0833814688194	266.8125651781161	20/04/28 05:09:03
3	8	357.8750160648289	266.0533751351783	20/04/28 05:09:04
3	8	357.8750160648289	266.0533751351783	20/04/28 05:09:05
3	8	360.0833814688194	266.8125651781161	20/04/28 05:09:06
3	8	360.0833814688194	266.8125651781161	20/04/28 05:09:07
3	8	357.8750160648289	266.0533751351783	20/04/28 05:09:08
3	8	357.87501606482897	266.0533751351783	20/04/28 05:09:09
3	8	357.8750160648289	266.0533751351783	20/04/28 05:09:10
3	8	360.0833814688194	266.8125651781161	20/04/28 05:09:11
3	46	361.61703194828846	264.17422801455785	20/04/28 05:09:12
3	46	367.4445911070962	265.59272765091856	20/04/28 05:09:13
3	46	368.31727752533806	266.1301521552222	20/04/28 05:09:14
3	46	368.31727752533806	266.1301521552222	20/04/28 05:09:15
3	54	372.48785670166836	262.3595943162643	20/04/28 05:09:16
3	54	372.48785670166836	262.3595943162643	20/04/28 05:09:17
3	54	376.35656519674916	261.5624468270555	20/04/28 05:09:18
3	15	379.8755906118027	262.6421307240284	20/04/28 05:09:19
3	15	379.8755906118027	262.6421307240284	20/04/28 05:09:20
3	15	380.97239583354167	266.94453563659977	20/04/28 05:09:21
1	33	381.6109766893215	266.73786054806715	20/04/28 05:09:22
1	33	381.6109766893215	266.73786054806715	20/04/28 05:09:23
1	69	376.18075636557654	261.96517202151136	20/04/28 05:09:24
1	74	374.7544496259108	264.4513026329313	20/04/28 05:09:25
1	69	372.48785670166836	262.3595943162643	20/04/28 05:09:26
1	69	372.48785670166836	262.3595943162643	20/04/28 05:09:27
1	69	368.9169651830857	261.65782172430613	20/04/28 05:09:28
1	69	368.9169651830857	261.65782172430613	20/04/28 05:09:29
1	69	364.1854955537803	263.2925259814757	20/04/28 05:09:30
1	64	358.9196105941775	261.36039806972667	20/04/28 05:09:31
1	64	356.02694011127693	259.70882448523747	20/04/28 05:09:32
1	64	354.49328963180795	262.3471616487957	20/04/28 05:09:33
1	41	352.7251685521831	260.56227788261185	20/04/28 05:09:34
1	41	352.7251685521831	260.56227788261185	20/04/28 05:09:35
1	41	351.1038521390131	261.25919659269	20/04/28 05:09:36
1	41	350.03191915941005	261.4911728805443	20/04/28 05:09:37
1	22	346.48253983850464	261.2777688197779	20/04/28 05:09:38
1	22	343.1917987024697	259.9647561276533	20/04/28 05:09:39
1	22	343.1917987024697	259.9647561276533	20/04/28 05:09:40
1	69	340.1854692097293	258.18142547541174	20/04/28 05:09:41
1	69	340.1854692097293	258.18142547541174	20/04/28 05:09:42
1	69	338.1583683683643	258.3517387010974	20/04/28 05:09:43
1	69	335.24867332238347	258.8873750560348	20/04/28 05:09:44
3	54	333.7145018941879	260.9894407549504	20/04/28 05:09:45
3	54	329.2127636639186	262.6803906369539	20/04/28 05:09:46
3	54	333.1227839393323	261.62465248411826	20/04/28 05:09:47
1	5	333.1227839393323	261.62465248411826	20/04/28 05:09:48
3	54	335.03244203359844	260.7680669517812	20/04/28 05:09:49
1	5	333.7145018941879	260.9894407549504	20/04/28 05:09:50
3	54	333.1227839393323	261.62465248411826	20/04/28 05:09:51
3	54	333.7145018941879	260.9894407549504	20/04/28 05:09:52
1	5	334.73798111152297	262.0967001435302	20/04/28 05:09:53
1	69	335.24867332238347	258.8873750560348	20/04/28 05:09:54
1	69	335.24867332238347	258.8873750560348	20/04/28 05:09:55
1	5	334.954212400308	260.21600824778375	20/04/28 05:09:56
1	5	333.1227839393323	261.62465248411826	20/04/28 05:09:57
1	5	334.1462631566674	262.7319118726981	20/04/28 05:09:58
3	54	333.1227839393323	261.62465248411826	20/04/28 05:09:59
1	5	333.7145018941879	260.9894407549504	20/04/28 05:10:00
1	5	333.7145018941879	260.9894407549504	20/04/28 05:10:01
3	54	329.2127636639186	262.6803906369539	20/04/28 05:10:02
1	5	333.7145018941879	260.98944075495035	20/04/28 05:10:03
1	69	338.1583683683643	258.3517387010974	20/04/28 05:10:04
1	69	338.1583683683643	258.3517387010974	20/04/28 05:10:05
1	69	338.1583683683643	258.3517387010974	20/04/28 05:10:06
1	22	343.1917987024697	259.9647561276533	20/04/28 05:10:07
1	22	343.1917987024697	259.9647561276533	20/04/28 05:10:08
1	22	345.9671156385064	259.7767423613448	20/04/28 05:10:09
1	41	350.03191915941005	261.4911728805443	20/04/28 05:10:10
1	41	351.1038521390131	261.25919659268993	20/04/28 05:10:11
1	41	352.7251685521831	260.56227788261185	20/04/28 05:10:12
1	41	352.7251685521831	260.56227788261185	20/04/28 05:10:13
1	64	354.49328963180795	262.3471616487957	20/04/28 05:10:14
1	64	356.02694011127693	259.70882448523747	20/04/28 05:10:15
3	54	357.6965830742679	260.8022089979779	20/04/28 05:10:16
3	54	358.87237025214637	261.21107622709695	20/04/28 05:10:17
3	54	365.05818197202217	263.8299504857794	20/04/28 05:10:18
1	69	367.80245440868674	262.5455232582413	20/04/28 05:10:19
1	69	368.9169651830857	261.65782172430613	20/04/28 05:10:20
1	69	372.48785670166836	262.3595943162643	20/04/28 05:10:21
1	69	372.48785670166836	262.3595943162643	20/04/28 05:10:22
1	74	374.7544496259107	264.45130263293123	20/04/28 05:10:23
1	74	374.7544496259108	264.4513026329313	20/04/28 05:10:24
1	33	381.6109766893215	266.73786054806715	20/04/28 05:10:25
1	33	381.6109766893215	266.73786054806715	20/04/28 05:10:26
3	15	380.97239583354167	266.94453563659977	20/04/28 05:10:27
3	15	380.97239583354167	266.94453563659977	20/04/28 05:10:28
3	15	379.8755906118027	262.6421307240284	20/04/28 05:10:29
3	54	376.35656519674916	261.5624468270555	20/04/28 05:10:30
3	54	372.48785670166836	262.3595943162643	20/04/28 05:10:31
3	54	372.48785670166836	262.3595943162643	20/04/28 05:10:32
3	54	372.48785670166836	262.3595943162643	20/04/28 05:10:33
3	54	372.48785670166836	262.3595943162643	20/04/28 05:10:34
3	57	365.8336784609425	258.9548948604074	20/04/28 05:10:35
3	34	363.08940602427793	260.2393220879455	20/04/28 05:10:36
3	46	361.6170319482885	264.17422801455785	20/04/28 05:10:37
3	54	359.5685583521681	263.2279362811352	20/04/28 05:10:38
3	54	358.23287936641947	263.0061707425011	20/04/28 05:10:39
3	54	354.93110780732565	263.85962413987545	20/04/28 05:10:40
3	54	352.7460406443366	261.2652131687019	20/04/28 05:10:41
3	54	350.37914153837863	260.97432627346046	20/04/28 05:10:42
3	54	350.37914153837863	260.97432627346046	20/04/28 05:10:43
3	54	350.37914153837863	260.97432627346046	20/04/28 05:10:44
1	22	345.98250818917177	261.859258749847	20/04/28 05:10:45
3	54	344.0544452814365	260.94893597900256	20/04/28 05:10:46
3	99	339.59375125487367	258.8166372045796	20/04/28 05:10:47
3	NULL	337.70753542622793	260.4595329480968	20/04/28 05:10:48
3	54	334.4407240787428	261.4032786809491	20/04/28 05:10:49
3	54	334.4407240787428	261.4032786809491	20/04/28 05:10:50
3	54	334.4407240787428	261.4032786809491	20/04/28 05:10:51
3	54	333.1227839393323	261.62465248411826	20/04/28 05:10:52
3	54	327.3540763805351	261.1072377077433	20/04/28 05:10:53
3	54	324.0151806674323	262.76750572012435	20/04/28 05:10:54
3	54	324.6837666112415	261.38954335341236	20/04/28 05:10:55
3	18	323.5974156050991	264.28862562276623	20/04/28 05:10:56
3	54	324.01518066743233	262.76750572012435	20/04/28 05:10:57
1	81	315.74240883925677	260.5181275582284	20/04/28 05:10:58
1	81	315.74240883925677	260.5181275582284	20/04/28 05:10:59
1	81	313.2523840549325	264.4074609667819	20/04/28 05:11:00
1	81	313.37765885306834	261.0920988121665	20/04/28 05:11:01
3	NULL	309.29436722642214	263.9851754886794	20/04/28 05:11:02
3	NULL	309.29436722642214	263.9851754886793	20/04/28 05:11:03
3	47	303.2859442331219	264.61216223098285	20/04/28 05:11:04
3	47	302.8570592601016	265.6207358146814	20/04/28 05:11:05
3	47	302.31579909374545	265.96754816044853	20/04/28 05:11:06
1	98	303.28594423312194	264.61216223098285	20/04/28 05:11:07
1	98	303.28594423312194	264.61216223098285	20/04/28 05:11:08
1	56	307.159840217744	263.3357311024059	20/04/28 05:11:09
1	56	307.159840217744	263.3357311024059	20/04/28 05:11:10
1	56	310.54516511258606	264.60686664592737	20/04/28 05:11:11
1	56	312.82542176317753	266.64578814796073	20/04/28 05:11:12
1	81	314.5031819410965	265.02915212402996	20/04/28 05:11:13
1	56	316.9364157862567	267.2484101703335	20/04/28 05:11:14
1	56	319.89662212153377	266.1573209564685	20/04/28 05:11:15
1	56	319.89662212153377	266.1573209564685	20/04/28 05:11:16
1	56	322.1133542424002	268.2357308438957	20/04/28 05:11:17
1	101	322.533707924491	270.7462440268079	20/04/28 05:11:18
1	NULL	322.91265801837744	273.4535940489428	20/04/28 05:11:19
1	NULL	322.91265801837744	273.4535940489428	20/04/28 05:11:20
1	NULL	322.91265801837744	273.45359404894276	20/04/28 05:11:21
1	NULL	322.91265801837744	273.45359404894276	20/04/28 05:11:22
1	101	322.98869492093166	274.61064813682924	20/04/28 05:11:23
1	NULL	322.91265801837744	273.45359404894276	20/04/28 05:11:24
1	NULL	322.91265801837744	273.45359404894276	20/04/28 05:11:25
1	NULL	322.91265801837744	273.4535940489428	20/04/28 05:11:26
1	NULL	322.91265801837744	273.45359404894276	20/04/28 05:11:27
1	NULL	322.91265801837744	273.4535940489428	20/04/28 05:11:28
1	101	322.98869492093166	274.6106481368293	20/04/28 05:11:29
1	101	325.71133559163553	274.93848474690407	20/04/28 05:11:30
1	101	328.08504352745376	274.58910885986205	20/04/28 05:11:31
1	101	328.0850435274538	274.589108859862	20/04/28 05:11:32
3	49	328.0850435274538	274.589108859862	20/04/28 05:11:33
1	101	326.30775251662243	273.59925867969645	20/04/28 05:11:34
1	101	328.0850435274538	274.589108859862	20/04/28 05:11:35
1	101	328.08504352745376	274.58910885986205	20/04/28 05:11:37
1	101	328.08504352745376	274.58910885986205	20/04/28 05:11:38
1	29	331.69286809267174	275.97981690209605	20/04/28 05:11:39
1	101	328.08504352745376	274.58910885986205	20/04/28 05:11:40
1	29	329.96545287831736	275.5266432147365	20/04/28 05:11:41
1	101	328.0850435274538	274.589108859862	20/04/28 05:11:42
1	29	331.69286809267174	275.97981690209605	20/04/28 05:11:43
1	29	331.69286809267174	275.97981690209605	20/04/28 05:11:44
1	101	328.0850435274538	274.589108859862	20/04/28 05:11:45
1	101	328.08504352745376	274.58910885986205	20/04/28 05:11:46
1	101	328.0850435274538	274.589108859862	20/04/28 05:11:47
1	101	328.08504352745376	274.58910885986205	20/04/28 05:11:48
1	101	328.08504352745376	274.58910885986205	20/04/28 05:11:49
1	101	328.0850435274538	274.589108859862	20/04/28 05:11:50
1	101	328.08504352745376	274.58910885986205	20/04/28 05:11:51
1	101	328.0850435274538	274.589108859862	20/04/28 05:11:52
1	101	326.30775251662243	273.59925867969645	20/04/28 05:11:53
1	101	328.08504352745376	274.58910885986205	20/04/28 05:11:54
1	101	325.2863659541957	273.10421816190075	20/04/28 05:11:55
1	101	328.08504352745376	274.58910885986205	20/04/28 05:11:56
1	101	328.03516773097687	274.052432367056	20/04/28 05:11:57
1	101	326.30775251662243	273.59925867969645	20/04/28 05:11:58
1	29	331.53643314824757	274.0223057673639	20/04/28 05:11:59
1	101	326.30775251662243	273.59925867969645	20/04/28 05:12:00
1	101	328.08504352745376	274.58910885986205	20/04/28 05:12:01
1	101	328.08504352745376	274.58910885986205	20/04/28 05:12:02
1	29	329.7591421374162	273.0324555871983	20/04/28 05:12:03
1	101	326.30775251662243	273.59925867969645	20/04/28 05:12:04
1	101	326.30775251662243	273.59925867969645	20/04/28 05:12:05
1	29	329.7591421374162	273.0324555871983	20/04/28 05:12:06
1	101	328.08504352745376	274.58910885986205	20/04/28 05:12:07
1	29	329.80901793389313	273.5691320800044	20/04/28 05:12:08
1	29	331.53643314824757	274.0223057673639	20/04/28 05:12:09
1	NULL	328.66484669285217	271.90587441539986	20/04/28 05:12:10
1	101	328.08504352745376	274.58910885986205	20/04/28 05:12:11
1	101	328.0850435274538	274.589108859862	20/04/28 05:12:12
1	101	328.08504352745376	274.58910885986205	20/04/28 05:12:13
1	101	328.08504352745376	274.58910885986205	20/04/28 05:12:14
1	29	331.69286809267174	275.97981690209605	20/04/28 05:12:15
1	101	328.08504352745376	274.58910885986205	20/04/28 05:12:16
1	29	331.69286809267174	275.97981690209605	20/04/28 05:12:17
1	101	328.0850435274538	274.589108859862	20/04/28 05:12:18
