floorId	partitionId	location_x	location_y	timeStamp
1	98	301.6975901954513	269.08604739085087	20/04/28 05:17:35
1	98	301.7452576224743	268.7983447915866	20/04/28 05:17:35
1	98	301.78913253301823	268.5335323904496	20/04/28 05:17:35
1	98	301.8194175402455	268.350743516743	20/04/28 05:17:35
1	98	301.86739709949774	268.06115700514556	20/04/28 05:17:35
1	98	301.9050954531579	267.8336239702539	20/04/28 05:17:36
1	98	301.93049455669006	267.68032456725376	20/04/28 05:17:36
1	98	301.96499483421525	267.47209391292137	20/04/28 05:17:36
1	98	302.0138401648411	267.1772819320649	20/04/28 05:17:36
1	98	302.05804009543493	266.9105078325732	20/04/28 05:17:36
1	98	302.0994717345819	266.6604420954689	20/04/28 05:17:36
1	98	302.1456570765798	266.38168480205997	20/04/28 05:17:36
1	98	302.17454336289813	266.2073380798663	20/04/28 05:17:36
1	98	302.2189620039001	265.9392439268949	20/04/28 05:17:36
1	98	302.260870960712	265.68629728051064	20/04/28 05:17:36
1	98	302.2896424039876	265.51264370757957	20/04/28 05:17:37
1	98	302.33546846598597	265.2360548926513	20/04/28 05:17:37
1	98	302.36117983222607	265.0808707897974	20/04/28 05:17:37
3	47	302.4473464134237	264.84453870249575	20/04/28 05:17:37
3	47	302.5562385509918	264.7241299124484	20/04/28 05:17:37
3	47	302.6831561946083	264.5837892024136	20/04/28 05:17:37
3	47	302.8269720886991	264.42476304879233	20/04/28 05:17:37
3	47	302.93992845586905	264.29986018800895	20/04/28 05:17:37
3	47	303.04749729600337	264.18091465000566	20/04/28 05:17:37
3	47	303.1547122924574	264.0623603789052	20/04/28 05:17:38
3	47	303.3290301651624	263.8696062957842	20/04/28 05:17:38
3	47	303.45866908749235	263.726256499101	20/04/28 05:17:38
3	47	303.59992465749013	263.57006145462185	20/04/28 05:17:38
3	47	303.710304270166	263.44800787109403	20/04/28 05:17:38
3	47	303.8320774179976	263.3133557491124	20/04/28 05:17:38
3	47	304.02011054205286	263.10543586194746	20/04/28 05:17:38
3	47	304.1583043033531	262.95262644924	20/04/28 05:17:38
3	47	304.30996115698923	262.7849300603497	20/04/28 05:17:38
3	47	304.46706295330137	262.61121286064486	20/04/28 05:17:38
3	47	304.59584447399436	262.468811146128	20/04/28 05:17:39
3	47	304.74477291121104	262.3041317364904	20/04/28 05:17:39
3	47	304.9204310419909	262.10989564689254	20/04/28 05:17:39
3	47	305.0936238815724	261.9183855826712	20/04/28 05:17:39
3	47	305.25643613773855	261.73835397334057	20/04/28 05:17:39
3	47	305.40381538852915	261.57538759521543	20/04/28 05:17:39
3	47	305.5461925423033	261.4179523459936	20/04/28 05:17:39
3	34	305.69689416822683	261.29484056720895	20/04/28 05:17:39
3	34	305.8622942510158	261.29279251736847	20/04/28 05:17:39
3	34	306.0952565749033	261.2899078848929	20/04/28 05:17:39
3	34	306.26509125010625	261.2878049241592	20/04/28 05:17:40
3	34	306.47828871845337	261.28516502801364	20/04/28 05:17:40
3	34	306.692463414752	261.2825130314415	20/04/28 05:17:40
3	34	306.91981033013656	261.2796979311953	20/04/28 05:17:40
3	34	307.20980040167694	261.27610715838705	20/04/28 05:17:40
3	34	307.48943654870743	261.2726445920046	20/04/28 05:17:40
3	34	307.6462566414756	261.27070278302506	20/04/28 05:17:40
3	34	307.9003837083323	261.2675560802547	20/04/28 05:17:40
3	34	308.15590299768536	261.2643921384297	20/04/28 05:17:40
3	34	308.32265705091186	261.26232732318687	20/04/28 05:17:41
3	34	308.51873936387375	261.2598993537263	20/04/28 05:17:41
3	34	308.7718194962885	261.25676561451604	20/04/28 05:17:41
3	34	309.07012377116916	261.25307189192364	20/04/28 05:17:41
3	34	309.27480409546826	261.250537458455	20/04/28 05:17:41
3	34	309.27480409546826	261.250537458455	20/04/28 05:17:41
3	34	309.4724080743842	261.24809064711934	20/04/28 05:17:41
3	34	309.72039379147486	261.2450199889929	20/04/28 05:17:41
3	34	309.9538630738368	261.2421290791552	20/04/28 05:17:41
3	34	310.21614398120204	261.2388814122772	20/04/28 05:17:41
3	34	310.41553222720586	261.23641250743424	20/04/28 05:17:42
3	34	310.71028690483723	261.23276273737173	20/04/28 05:17:42
3	34	310.9075026805441	261.2303207329231	20/04/28 05:17:42
3	34	311.12064484916976	261.2276815215207	20/04/28 05:17:42
3	34	311.3573664331493	261.22475034038627	20/04/28 05:17:42
3	34	311.6397805011368	261.2212533766778	20/04/28 05:17:42
3	34	311.8247170019651	261.2189634191117	20/04/28 05:17:42
3	34	312.10207503809966	261.21552906120763	20/04/28 05:17:42
3	34	312.2548405145326	261.21363745810584	20/04/28 05:17:42
3	34	312.5254069801909	261.2102871961381	20/04/28 05:17:42
3	34	312.74943235383955	261.20751322454737	20/04/28 05:17:43
3	34	313.01801323576456	261.2041875488699	20/04/28 05:17:43
3	34	313.1689474782444	261.20231862083784	20/04/28 05:17:43
3	34	313.3871447840854	261.1996168147088	20/04/28 05:17:43
3	34	313.6127011196883	261.1968238861361	20/04/28 05:17:43
3	34	313.8014583910056	261.1944866182648	20/04/28 05:17:43
3	34	314.0538761987644	261.1913610802228	20/04/28 05:17:43
3	34	314.3265560596238	261.1879846493522	20/04/28 05:17:43
3	34	314.48532952669393	261.1860186529124	20/04/28 05:17:43
3	34	314.7845152374575	261.1823140160291	20/04/28 05:17:44
3	34	315.0663942057652	261.1788236781385	20/04/28 05:17:44
3	34	315.32150529209315	261.17566479084627	20/04/28 05:17:44
3	34	315.5156749882836	261.17326050417	20/04/28 05:17:44
3	34	315.8051724991487	261.16967583044465	20/04/28 05:17:44
3	34	315.9771629017404	261.167546176634	20/04/28 05:17:44
3	34	316.25705874582906	261.16408039457895	20/04/28 05:17:44
3	34	316.5088259155871	261.1609629129963	20/04/28 05:17:44
3	34	316.7777612556089	261.1576328482772	20/04/28 05:17:44
3	34	316.93791210955897	261.1556497964833	20/04/28 05:17:44
3	34	317.14226256123874	261.15311944762914	20/04/28 05:17:45
3	34	317.4241291549099	261.1496292629662	20/04/28 05:17:45
3	34	317.69255752743817	261.14630547572096	20/04/28 05:17:45
3	34	317.8664275500923	261.1441525477045	20/04/28 05:17:45
3	34	318.0337310436209	261.14208092907256	20/04/28 05:17:45
3	34	318.2749106739205	261.1390945466293	20/04/28 05:17:45
3	34	318.4306461533149	261.13716616776543	20/04/28 05:17:45
3	34	318.62619099875235	261.1347448534423	20/04/28 05:17:45
3	34	318.8146470651581	261.1324113152105	20/04/28 05:17:45
3	34	319.04387081080466	261.1295729753029	20/04/28 05:17:46
3	34	319.19639160765405	261.1276844019214	20/04/28 05:17:46
3	34	319.47158507344056	261.12427684659133	20/04/28 05:17:46
3	34	319.7454518084365	261.1208857193714	20/04/28 05:17:46
3	34	319.96785155418945	261.1181318769541	20/04/28 05:17:46
3	34	319.96785155418945	261.1181318769541	20/04/28 05:17:46
3	34	320.1594371948331	261.115759587085	20/04/28 05:17:46
3	34	320.1594371948331	261.115759587085	20/04/28 05:17:46
3	34	320.3365119850411	261.11356697635756	20/04/28 05:17:46
3	34	320.4896803203158	261.1116703848968	20/04/28 05:17:46
3	34	320.68368957149914	261.1092680849146	20/04/28 05:17:47
3	34	320.90092387263627	261.1065782030942	20/04/28 05:17:47
3	34	321.15109211411647	261.1034805200797	20/04/28 05:17:47
3	34	321.4230737820412	261.10011273451266	20/04/28 05:17:47
3	34	321.6573692478567	261.09721159454165	20/04/28 05:17:47
3	34	321.9014788642543	261.0941889318411	20/04/28 05:17:47
3	34	322.18684210781777	261.09065545026357	20/04/28 05:17:47
3	34	322.42390732312725	261.08772001414883	20/04/28 05:17:47
3	34	322.62801523519784	261.0851926685169	20/04/28 05:17:47
3	34	322.8703415113298	261.08219208784726	20/04/28 05:17:47
3	34	323.11631588243006	261.0791463350097	20/04/28 05:17:48
3	34	323.30078011872814	261.07686222521147	20/04/28 05:17:48
3	34	323.528198032828	261.0740462458308	20/04/28 05:17:48
3	34	323.6947867932057	261.07198347730997	20/04/28 05:17:48
3	34	323.9598717411918	261.06870108968184	20/04/28 05:17:48
3	34	324.1338983620697	261.0665462226037	20/04/28 05:17:48
3	34	324.3212652223019	261.0642261713574	20/04/28 05:17:48
3	34	324.56612208625927	261.06119425593926	20/04/28 05:17:48
3	34	324.79255664588055	261.05839045284625	20/04/28 05:17:48
3	34	325.0348913850581	261.0553897673838	20/04/28 05:17:49
3	34	325.29889824589276	261.05212072906113	20/04/28 05:17:49
3	34	325.5592979437274	261.0488963560704	20/04/28 05:17:49
3	34	325.79479002552483	261.0459803991227	20/04/28 05:17:49
3	34	326.27775322409985	261.04000015603503	20/04/28 05:17:49
3	34	326.5486933072829	261.03664526778596	20/04/28 05:17:49
3	34	326.5486933072829	261.03664526778596	20/04/28 05:17:49
3	34	326.77102747309914	261.0338922374056	20/04/28 05:17:49
3	34	326.99051168843414	261.0311744962496	20/04/28 05:17:49
3	34	327.23314757695584	261.02817008183575	20/04/28 05:17:49
3	34	327.39655382489303	261.0261467204542	20/04/28 05:17:50
3	34	327.6525732612849	261.02297658560894	20/04/28 05:17:50
3	34	327.9024027624732	261.0198830970119	20/04/28 05:17:50
3	34	328.10212329212953	261.01741007770016	20/04/28 05:17:50
3	34	328.29522875137076	261.01501896883053	20/04/28 05:17:50
3	34	328.58409538816903	261.0114421068397	20/04/28 05:17:50
3	34	329.0936056707542	261.0051331471622	20/04/28 05:17:50
3	34	329.3795789688538	261.00159211164595	20/04/28 05:17:50
3	34	329.3795789688538	261.00159211164595	20/04/28 05:17:50
3	34	329.61141303596713	260.99872144969606	20/04/28 05:17:51
3	34	329.83983410282343	260.9958930488776	20/04/28 05:17:51
3	34	330.08941353663647	260.9928026567146	20/04/28 05:17:51
3	34	330.6304475510531	260.98610335760765	20/04/28 05:17:51
3	34	330.89710874746805	260.98280145224237	20/04/28 05:17:51
3	34	331.08880925152516	260.9804277400886	20/04/28 05:17:51
3	34	331.37838658110917	260.97684207801603	20/04/28 05:17:51
3	34	331.6429285558165	260.97356641369976	20/04/28 05:17:51
3	34	331.92223415529776	260.97010794028904	20/04/28 05:17:51
3	34	332.1139310939909	260.967734272283	20/04/28 05:17:51
3	34	332.1139310939909	260.967734272283	20/04/28 05:17:52
3	34	332.3499179563243	260.9648121887652	20/04/28 05:17:52
3	34	332.5781194216838	260.9619865071401	20/04/28 05:17:52
3	34	332.76274443353293	260.9597004065549	20/04/28 05:17:52
3	34	333.04160218704976	260.95624747855163	20/04/28 05:17:52
3	34	333.3354039154744	260.9526095082865	20/04/28 05:17:52
3	34	333.5770391234825	260.9496174846982	20/04/28 05:17:52
3	34	333.75740426768436	260.94738413149435	20/04/28 05:17:52
3	34	334.0115222428573	260.9442375413008	20/04/28 05:17:52
3	34	334.16859185086184	260.94229264272406	20/04/28 05:17:52
3	34	334.32471638820647	260.9403594463894	20/04/28 05:17:53
3	34	334.546380185371	260.93761471678124	20/04/28 05:17:53
3	34	334.770879801208	260.93483487293446	20/04/28 05:17:53
3	34	335.0121713483727	260.9318471046919	20/04/28 05:17:53
3	34	335.29249626891857	260.9283760096409	20/04/28 05:17:53
3	34	335.5093093467158	260.925691343576	20/04/28 05:17:53
3	34	335.7930741347565	260.9221776547127	20/04/28 05:17:53
3	34	336.0513909428395	260.9189790728942	20/04/28 05:17:53
3	34	336.2147403903608	260.91695641483807	20/04/28 05:17:53
3	34	336.36632471401396	260.91507943724145	20/04/28 05:17:54
3	34	336.6581056491364	260.9114664892456	20/04/28 05:17:54
3	34	336.9303546359889	260.90809539362886	20/04/28 05:17:54
3	34	337.0930740864013	260.90608053644837	20/04/28 05:17:54
3	34	337.32470412784676	260.90321240082574	20/04/28 05:17:54
3	34	337.48434862282295	260.90123561897076	20/04/28 05:17:54
3	34	337.68527535723234	260.89874766395036	20/04/28 05:17:54
3	34	337.84021985575964	260.8968290793273	20/04/28 05:17:54
3	34	338.0874855315364	260.8937673370398	20/04/28 05:17:54
3	34	338.36180101799545	260.89037065320014	20/04/28 05:17:54
3	34	338.55515139565455	260.8879765116529	20/04/28 05:17:55
3	34	338.73268584969776	260.8857782091844	20/04/28 05:17:55
3	34	338.92568703565536	260.8833883914682	20/04/28 05:17:55
3	34	338.92568703565536	260.8833883914682	20/04/28 05:17:55
3	34	339.1883082758135	260.8801365104537	20/04/28 05:17:55
3	34	339.4361968047796	260.8770670557494	20/04/28 05:17:55
3	34	339.6462721610284	260.87446581884194	20/04/28 05:17:55
3	34	339.8367394825509	260.8721073764465	20/04/28 05:17:55
3	34	340.04579609406727	260.8695187540429	20/04/28 05:17:55
3	34	340.3085528900572	260.866265194522	20/04/28 05:17:56
3	34	340.46904143447983	260.8642779613099	20/04/28 05:17:56
3	34	340.72999059320506	260.8610467846751	20/04/28 05:17:56
3	34	340.94607693561505	260.85837111733787	20/04/28 05:17:56
3	34	341.12425645295735	260.85616482743814	20/04/28 05:17:56
3	34	341.3918786878889	260.85285102211037	20/04/28 05:17:56
3	34	341.6702790714094	260.849403757445	20/04/28 05:17:56
3	34	341.9010174286232	260.8465466630124	20/04/28 05:17:56
3	34	342.06978141531926	260.8444569599711	20/04/28 05:17:56
3	34	342.29950325898363	260.84161245241506	20/04/28 05:17:56
3	34	342.48945667210864	260.8392603734385	20/04/28 05:17:57
3	34	342.6860073868512	260.83682660404014	20/04/28 05:17:57
3	34	342.92136673177134	260.83391229069343	20/04/28 05:17:57
3	34	343.1420267361521	260.83117999044816	20/04/28 05:17:57
3	34	343.3842500219582	260.8281806850458	20/04/28 05:17:57
3	34	343.6446520431279	260.8249562832866	20/04/28 05:17:57
3	34	343.9134636071484	260.8216277512114	20/04/28 05:17:57
3	34	344.1249144788056	260.81900948212314	20/04/28 05:17:57
3	34	344.30520278333876	260.81677708037876	20/04/28 05:17:57
3	34	344.5208162571099	260.8141072682897	20/04/28 05:17:57
3	34	344.69744508735965	260.8119201796165	20/04/28 05:17:58
3	34	344.8519574453789	260.8100069459297	20/04/28 05:17:58
3	34	345.03162514496864	260.8077822287634	20/04/28 05:17:58
3	34	345.29826157014577	260.8044806301255	20/04/28 05:17:58
3	34	345.57430385922834	260.80106256432657	20/04/28 05:17:58
3	34	345.76681823201324	260.79867877452534	20/04/28 05:17:58
3	34	346.0533806820718	260.7951304438944	20/04/28 05:17:58
3	34	346.3402257002571	260.79157861439205	20/04/28 05:17:58
3	34	346.5571925749849	260.78889204395216	20/04/28 05:17:58
3	34	346.75998026402834	260.7863810458487	20/04/28 05:17:59
3	34	347.0012915321373	260.7833930334135	20/04/28 05:17:59
3	34	347.2646433479032	260.7801321061203	20/04/28 05:17:59
3	34	347.4678644182538	260.7776157417165	20/04/28 05:17:59
3	34	347.76658172638145	260.7739169047816	20/04/28 05:17:59
3	34	347.9742651817227	260.7713452853458	20/04/28 05:17:59
3	34	348.13741932036214	260.7693250456822	20/04/28 05:17:59
3	34	348.2900866644055	260.7674346576948	20/04/28 05:17:59
3	34	348.51309558461804	260.7646732722362	20/04/28 05:17:59
3	34	348.73240740080354	260.7619576657953	20/04/28 05:17:59
3	34	348.89788118887475	260.7599087033066	20/04/28 05:18:00
3	34	349.17097412812893	260.75652715753444	20/04/28 05:18:00
3	34	349.4673684629158	260.7528570845826	20/04/28 05:18:00
3	34	349.62956296873506	260.7508487274756	20/04/28 05:18:00
3	34	349.8257339477371	260.7484196601168	20/04/28 05:18:00
3	34	350.06431506782087	260.74546545346413	20/04/28 05:18:00
3	34	350.26993404524626	260.7429193972179	20/04/28 05:18:00
3	34	350.55593195237395	260.73937805698284	20/04/28 05:18:00
3	34	350.78931225234027	260.73648824896065	20/04/28 05:18:00
3	34	351.0765260277506	260.7329318533592	20/04/28 05:18:00
3	34	351.32187034127566	260.729893902146	20/04/28 05:18:01
3	34	351.6150353979706	260.72626381540437	20/04/28 05:18:01
3	34	351.783954606471	260.72417219034475	20/04/28 05:18:01
3	34	351.94173574083817	260.72221848136456	20/04/28 05:18:01
3	34	352.12399782147133	260.71996163953673	20/04/28 05:18:01
3	34	352.35073227888716	260.71715412298954	20/04/28 05:18:01
3	34	352.6037047679609	260.7140217166621	20/04/28 05:18:01
3	34	352.8156827288368	260.71139692094476	20/04/28 05:18:01
3	34	352.97519547660426	260.70942177043634	20/04/28 05:18:01
3	34	353.14458179292114	260.7073243614613	20/04/28 05:18:02
3	34	353.37888609623326	260.7044231120609	20/04/28 05:18:02
3	34	353.37888609623326	260.7044231120609	20/04/28 05:18:02
3	34	353.65259794620164	260.70103390268923	20/04/28 05:18:02
3	34	353.9242538558223	260.6976701507915	20/04/28 05:18:02
3	34	354.1587853186253	260.69476608861163	20/04/28 05:18:02
3	34	354.4090003460303	260.69166782627514	20/04/28 05:18:02
3	34	354.66018603123047	260.6885575448664	20/04/28 05:18:02
3	34	354.8722172808258	260.68593208930685	20/04/28 05:18:02
3	34	355.11932500778056	260.6828723028047	20/04/28 05:18:02
3	34	355.416472991215	260.6791928978745	20/04/28 05:18:03
3	34	355.66301712810343	260.6761400899695	20/04/28 05:18:03
3	34	355.8805898887388	260.6734460172085	20/04/28 05:18:03
3	34	356.14039640775957	260.6702289891946	20/04/28 05:18:03
3	34	356.3403025457913	260.66775367160585	20/04/28 05:18:03
3	34	356.54167272440435	260.6652602256823	20/04/28 05:18:03
3	34	356.7728051235086	260.66239825206577	20/04/28 05:18:03
3	34	357.0165027358479	260.65938069096387	20/04/28 05:18:03
3	34	357.16694115628326	260.65751790239824	20/04/28 05:18:03
3	34	357.3748129652598	260.65494395069254	20/04/28 05:18:04
3	34	357.5644211645049	260.652596146292	20/04/28 05:18:04
3	34	357.7819868846145	260.6499021607096	20/04/28 05:18:04
3	34	357.93702352342206	260.6479824351688	20/04/28 05:18:04
3	34	358.1690345816671	260.6451095816441	20/04/28 05:18:04
3	34	358.3807898996971	260.6424875427793	20/04/28 05:18:04
3	34	358.6028543701883	260.6397378518741	20/04/28 05:18:04
3	34	358.8235364788105	260.6370052779253	20/04/28 05:18:04
3	34	359.09951497995417	260.6335880019741	20/04/28 05:18:04
3	34	359.3758684129112	260.63016608346754	20/04/28 05:18:04
3	34	359.56094539620716	260.62787438639145	20/04/28 05:18:05
3	34	359.8267818077594	260.62458269384155	20/04/28 05:18:05
3	34	360.0079487717168	260.62233941218545	20/04/28 05:18:05
3	34	360.19675787002416	260.6200015025717	20/04/28 05:18:05
3	34	360.40684947914036	260.6174000644147	20/04/28 05:18:05
3	34	360.61371802714103	260.61483853548685	20/04/28 05:18:05
3	34	360.8635863470422	260.61174456622103	20/04/28 05:18:05
3	34	361.09705835240294	260.60885362266606	20/04/28 05:18:05
3	34	361.3877070218452	260.60525469483576	20/04/28 05:18:05
3	34	361.61969498553964	260.602382127277	20/04/28 05:18:05
3	34	361.7824613641938	260.6003666890123	20/04/28 05:18:06
3	34	362.00779792748574	260.59757648174804	20/04/28 05:18:06
3	34	362.26514316001953	260.5943899303658	20/04/28 05:18:06
3	34	362.5234827242401	260.5911910667717	20/04/28 05:18:06
3	34	362.75444247051036	260.5694974470374	20/04/28 05:18:06
3	34	362.82801505057824	260.3507637630901	20/04/28 05:18:06
3	34	362.91626870051886	260.08838277882256	20/04/28 05:18:06
3	34	362.9701567335358	259.92817189629545	20/04/28 05:18:06
3	34	363.02712416393666	259.75880586475097	20/04/28 05:18:06
3	34	363.12121814916713	259.4790613728797	20/04/28 05:18:06
3	34	363.183337340632	259.29437898739843	20/04/28 05:18:07
3	34	363.24989349696887	259.09650536041	20/04/28 05:18:07
3	34	363.3104303123618	258.9165274306824	20/04/28 05:18:07
3	34	363.396457721811	258.6607651321209	20/04/28 05:18:07
3	34	363.4780235810964	258.41826716794225	20/04/28 05:18:07
3	34	363.546630380217	258.214296912969	20/04/28 05:18:07
3	34	363.6217878798251	257.9908512114538	20/04/28 05:18:07
3	34	363.69619008605474	257.76965102182606	20/04/28 05:18:07
3	34	363.7843353994212	257.5075921257325	20/04/28 05:18:07
3	34	363.83382586173815	257.3604553645524	20/04/28 05:18:08
3	34	363.89681901070776	257.1731746748599	20/04/28 05:18:08
3	34	363.9483238423239	257.02004912794985	20/04/28 05:18:08
3	34	364.03852934263284	256.75186522877584	20/04/28 05:18:08
3	34	364.12553084996625	256.49320690538343	20/04/28 05:18:08
3	34	364.19036317803807	256.30045827613935	20/04/28 05:18:08
3	34	364.25111951665303	256.1198276967014	20/04/28 05:18:08
3	34	364.3221163745491	255.9087517189122	20/04/28 05:18:08
3	6	364.45485911757464	255.6686662376557	20/04/28 05:18:08
3	6	364.57814567136563	255.4625641841906	20/04/28 05:18:08
3	6	364.67972349777693	255.29275330079625	20/04/28 05:18:09
3	6	364.8172518709208	255.06284274491586	20/04/28 05:18:09
3	6	364.93440395566716	254.86699587847758	20/04/28 05:18:09
3	6	365.0225615586712	254.719620009423	20/04/28 05:18:09
3	6	365.12934605450033	254.5411049711494	20/04/28 05:18:09
3	6	365.27472212205373	254.2980751749055	20/04/28 05:18:09
3	6	365.4166484019735	254.0608124983795	20/04/28 05:18:09
3	6	365.53459989938364	253.8636292283635	20/04/28 05:18:09
3	6	365.6763226279116	253.62670683517365	20/04/28 05:18:09
3	6	365.7555610625116	253.4942414236405	20/04/28 05:18:09
3	6	365.8448568567925	253.3449628040249	20/04/28 05:18:10
3	6	365.9328091309101	253.19793018980084	20/04/28 05:18:10
3	6	366.0204992224688	253.05133587449998	20/04/28 05:18:10
3	6	366.171715720808	252.79854244433932	20/04/28 05:18:10
3	6	366.2940434004952	252.5940433712134	20/04/28 05:18:10
3	6	366.4453922317097	252.34102871597585	20/04/28 05:18:10
3	6	366.5833223317655	252.11044658043872	20/04/28 05:18:10
3	6	366.7006784550047	251.91425861636188	20/04/28 05:18:10
3	6	366.84944291872455	251.66556433046864	20/04/28 05:18:10
3	6	366.97584400600755	251.454255612298	20/04/28 05:18:11
3	6	367.11040377773895	251.2293077618239	20/04/28 05:18:11
3	6	367.1935699557116	251.09027621676128	20/04/28 05:18:11
3	6	367.27817674069775	250.94883636313148	20/04/28 05:18:11
3	6	367.36418400314795	250.80505528677864	20/04/28 05:18:11
3	6	367.4769057528931	250.6166147522817	20/04/28 05:18:11
3	6	367.5869559016485	250.43264041813757	20/04/28 05:18:11
3	6	367.7235116046537	250.20435590586655	20/04/28 05:18:11
3	6	367.8067334241946	250.0652313430245	20/04/28 05:18:11
3	57	367.9150399133207	249.90563643579765	20/04/28 05:18:11
3	57	368.0462548757286	249.79918249487883	20/04/28 05:18:12
3	57	368.2334842840701	249.64728435759264	20/04/28 05:18:12
3	57	368.4618897107064	249.4619803545546	20/04/28 05:18:12
3	57	368.6413700214763	249.31636901535845	20/04/28 05:18:12
3	57	368.82441620473327	249.16786470441508	20/04/28 05:18:12
3	57	369.05048247895354	248.9844584422179	20/04/28 05:18:12
3	57	369.17780088994823	248.88116575094867	20/04/28 05:18:12
3	57	369.39301286243233	248.70656552104026	20/04/28 05:18:12
3	57	369.61974412520993	248.52261975746845	20/04/28 05:18:12
3	57	369.840611890404	248.34343101561032	20/04/28 05:18:13
3	57	370.12774396604186	248.11048242152526	20/04/28 05:18:13
3	57	370.2900447995152	247.97880869300693	20/04/28 05:18:13
3	57	370.2900447995152	247.97880869300693	20/04/28 05:18:13
3	57	370.4611757793401	247.83997111776895	20/04/28 05:18:13
3	57	370.65116358123123	247.68583511173227	20/04/28 05:18:13
3	57	371.03052108588315	247.3780645599123	20/04/28 05:18:13
3	57	371.22292319554117	247.22196983993277	20/04/28 05:18:13
3	57	371.38819558017684	247.0878853091243	20/04/28 05:18:13
3	57	371.61390973904287	246.90476471607968	20/04/28 05:18:13
3	57	371.61390973904287	246.90476471607968	20/04/28 05:18:14
3	57	371.840791364236	246.72069696434886	20/04/28 05:18:14
3	57	372.02983905655617	246.56732366377568	20/04/28 05:18:14
3	57	372.1525910680072	246.46773566607428	20/04/28 05:18:14
3	57	372.3087366294175	246.34105567421915	20/04/28 05:18:14
3	57	372.45296300156565	246.22404565175034	20/04/28 05:18:14
3	57	372.59735525872316	246.10690104773184	20/04/28 05:18:14
3	57	372.8139734415665	245.93115996748327	20/04/28 05:18:14
3	57	373.0289755900729	245.75672996655572	20/04/28 05:18:14
3	57	373.18476591503526	245.63033817597847	20/04/28 05:18:14
3	57	373.3318621014794	245.51099988975145	20/04/28 05:18:15
3	57	373.52362839073464	245.3554210071913	20/04/28 05:18:15
3	57	373.69450846045504	245.21678699387152	20/04/28 05:18:15
3	57	373.84732290289963	245.09280951958803	20/04/28 05:18:15
3	57	374.03141556648717	244.9434562051984	20/04/28 05:18:15
3	57	374.2365937838665	244.7769963028374	20/04/28 05:18:15
3	57	374.3762399845255	244.66370214703622	20/04/28 05:18:15
3	57	374.5091224148142	244.55589539905938	20/04/28 05:18:15
3	57	374.64258603240955	244.4476171371784	20/04/28 05:18:15
3	57	374.84848338801584	244.28057380212863	20/04/28 05:18:16
3	57	374.9967115526257	244.16031714855563	20/04/28 05:18:16
3	57	375.14919322807333	244.03660964621423	20/04/28 05:18:16
3	57	375.2841109585977	243.92715167091495	20/04/28 05:18:16
3	57	375.5150869894097	243.73976215156057	20/04/28 05:18:16
3	57	375.6350192324198	243.64246181570434	20/04/28 05:18:16
3	57	375.83003965955817	243.48424286988006	20/04/28 05:18:16
3	57	376.0262135430936	243.32508813154487	20/04/28 05:18:16
3	57	376.1916907625051	243.1908374194662	20/04/28 05:18:16
3	57	376.35285418007356	243.0600864699002	20/04/28 05:18:16
3	57	376.4881636280066	242.9503106965304	20/04/28 05:18:17
3	57	376.7175570533145	242.76420513587811	20/04/28 05:18:17
3	57	376.86993434060804	242.64058232304305	20/04/28 05:18:17
3	57	377.01059037848154	242.52646889214398	20/04/28 05:18:17
3	57	377.21441765032637	242.36110500409018	20/04/28 05:18:17
3	57	377.4040100089974	242.20728981885335	20/04/28 05:18:17
3	57	377.6108521080667	242.0394800188902	20/04/28 05:18:17
3	57	377.83162282207365	241.86037001409943	20/04/28 05:18:17
3	57	378.0491157734818	241.68391923916812	20/04/28 05:18:17
3	57	378.2217045883614	241.5438989307728	20/04/28 05:18:17
3	57	378.3404158975714	241.44758913145472	20/04/28 05:18:18
3	57	378.5075147945768	241.3120227617132	20/04/28 05:18:18
3	57	378.7115916414326	241.14645639489484	20/04/28 05:18:18
3	57	378.90305746527997	240.9911212781842	20/04/28 05:18:18
3	6	379.1217333962412	240.81371075877604	20/04/28 05:18:18
3	6	379.21586722490076	240.79463631467704	20/04/28 05:18:18
3	6	379.16442825308616	240.79985875831179	20/04/28 05:18:18
3	6	379.1895550448136	240.62918678161782	20/04/28 05:18:18
3	6	379.2541347850797	240.63050251784932	20/04/28 05:18:18
3	6	379.2199594046662	240.65441591411184	20/04/28 05:18:19
3	6	379.09479350611997	240.91530877824914	20/04/28 05:18:19
3	6	379.113273126041	240.86352746458957	20/04/28 05:18:19
3	6	379.1622069152837	240.57393430544315	20/04/28 05:18:19
3	6	379.0373118060508	240.56818812940438	20/04/28 05:18:19
3	6	379.1388695416102	240.75675626239257	20/04/28 05:18:19
3	6	379.1665990890554	240.74783929360703	20/04/28 05:18:19
3	6	379.16104647098757	240.78200348862782	20/04/28 05:18:19
3	6	379.2738382603035	240.86367052028982	20/04/28 05:18:19
3	6	379.36485168896274	240.87983112679618	20/04/28 05:18:19
3	6	379.33905737835295	240.65351765624746	20/04/28 05:18:20
3	6	379.31212142861915	240.63728561577156	20/04/28 05:18:20
3	6	379.37068377794526	240.5658283567907	20/04/28 05:18:20
3	6	379.4703650903456	240.3972268270833	20/04/28 05:18:20
3	6	379.2276495728233	240.38780194869256	20/04/28 05:18:20
3	6	379.25300273911563	240.4691547417345	20/04/28 05:18:20
3	6	379.08476993552085	240.65721076327534	20/04/28 05:18:20
3	6	379.00208081826247	240.54144922279872	20/04/28 05:18:20
3	6	378.8946404281979	240.45587293662777	20/04/28 05:18:20
3	6	379.01614156855845	240.50000169559527	20/04/28 05:18:20
3	6	379.2828540060781	240.48576063503202	20/04/28 05:18:21
3	6	379.320345074759	240.5231475182594	20/04/28 05:18:21
3	6	379.3197875827639	240.51797806094262	20/04/28 05:18:21
3	6	379.23547410216054	240.76586320081017	20/04/28 05:18:21
3	6	379.2287263488977	240.7702826874384	20/04/28 05:18:21
3	6	379.28074369403885	240.81947796175032	20/04/28 05:18:21
3	6	379.28074369403885	240.81947796175032	20/04/28 05:18:21
3	6	379.36788374282105	240.91470417576403	20/04/28 05:18:21
3	6	379.1019381956373	240.92769239395514	20/04/28 05:18:21
3	6	379.2438873990596	241.10582605632743	20/04/28 05:18:22
3	6	378.9932612175434	240.99816012739012	20/04/28 05:18:22
3	6	379.1149213045153	241.08840418645133	20/04/28 05:18:22
3	6	378.82386310859306	241.31895276579408	20/04/28 05:18:22
3	6	378.82386310859306	241.31895276579408	20/04/28 05:18:22
3	6	378.7840083607095	241.38402373838252	20/04/28 05:18:22
3	6	378.84892568035673	241.3150912803394	20/04/28 05:18:22
3	6	379.0479458404365	241.17232855710193	20/04/28 05:18:22
3	6	378.87982873854924	241.1575957051458	20/04/28 05:18:22
3	6	379.0231160748081	241.11367724901118	20/04/28 05:18:22
3	6	378.81552451674617	241.02233932864144	20/04/28 05:18:23
3	6	378.9977039926909	241.04275566914723	20/04/28 05:18:23
3	6	379.018824784503	241.11255758602502	20/04/28 05:18:23
3	6	378.97014669904024	241.13854785152648	20/04/28 05:18:23
3	6	379.0350676108338	241.0934597864348	20/04/28 05:18:23
3	6	379.0077335735895	241.16640261548383	20/04/28 05:18:23
3	6	378.9237248386395	241.09329915079843	20/04/28 05:18:23
3	6	378.90014882505136	241.01592175122173	20/04/28 05:18:23
3	6	379.0983807621422	240.88699501398972	20/04/28 05:18:23
3	6	379.2680617600072	240.67052979981622	20/04/28 05:18:23
3	6	379.2534943124241	240.6476300496716	20/04/28 05:18:24
3	6	379.1316339866075	240.90671149289577	20/04/28 05:18:24
3	6	378.98527910660187	240.8788069807983	20/04/28 05:18:24
3	6	378.8476365456092	241.0344193457511	20/04/28 05:18:24
3	6	378.92140628468076	241.01699250927385	20/04/28 05:18:24
3	6	378.89463213320386	241.01163733894046	20/04/28 05:18:24
3	6	378.9154742992596	241.02137751820152	20/04/28 05:18:24
3	6	378.9338974646426	240.99377370827574	20/04/28 05:18:24
3	6	378.9504782344839	240.99078205652796	20/04/28 05:18:24
3	6	379.02760087098795	240.89681692029805	20/04/28 05:18:25
3	6	378.77027920317676	241.0293501435034	20/04/28 05:18:25
3	6	378.6885353046752	241.13750163814842	20/04/28 05:18:25
3	6	378.5540198853465	241.01887433831178	20/04/28 05:18:25
3	6	378.48932289456144	241.291155142557	20/04/28 05:18:25
3	6	378.37102176796907	241.55231809294773	20/04/28 05:18:25
3	6	378.6561651457938	241.50391061931506	20/04/28 05:18:25
3	6	378.4122315273945	241.41604047778955	20/04/28 05:18:25
3	6	378.274790439534	241.64589951903926	20/04/28 05:18:25
3	6	378.06248422735825	241.50311857189803	20/04/28 05:18:25
3	6	378.3387441449525	241.46760478119756	20/04/28 05:18:26
3	6	378.05361889517303	241.40686703214948	20/04/28 05:18:26
3	6	378.06113063613	241.51422127385322	20/04/28 05:18:26
3	6	378.0414660500758	241.23983340811105	20/04/28 05:18:26
3	6	378.20126934104263	241.25917930745675	20/04/28 05:18:26
3	6	378.26854852867166	241.23957634574677	20/04/28 05:18:26
3	6	378.266538477992	241.23895822958815	20/04/28 05:18:26
3	6	378.2798962584113	241.22620013995703	20/04/28 05:18:26
3	6	378.4113675195172	241.38679214515327	20/04/28 05:18:26
3	6	378.36777393893	241.33828965518885	20/04/28 05:18:26
3	6	378.3746760335397	241.3457889922455	20/04/28 05:18:27
3	6	378.35888722324785	241.38715167046243	20/04/28 05:18:27
3	6	378.18610465944033	241.227966660664	20/04/28 05:18:27
3	6	378.21313299911645	241.1671920266636	20/04/28 05:18:27
3	6	378.1930286552502	240.92766697475432	20/04/28 05:18:27
3	6	378.07872292814255	240.94568210064588	20/04/28 05:18:27
3	6	377.9190768789131	241.1731341414239	20/04/28 05:18:27
3	6	377.9733985492433	241.15884093086805	20/04/28 05:18:27
3	6	378.06662451972875	241.0525115731938	20/04/28 05:18:27
3	6	378.06045092420214	241.04077543352597	20/04/28 05:18:28
3	6	377.970267385689	241.06335305241333	20/04/28 05:18:28
3	6	377.98767557645283	241.13776753881743	20/04/28 05:18:28
3	6	377.97581889578044	241.43236384392438	20/04/28 05:18:28
3	6	377.9554001440612	241.4699859912573	20/04/28 05:18:28
3	6	377.79062017522244	241.56563257707953	20/04/28 05:18:28
3	6	377.7887462413954	241.56094246385533	20/04/28 05:18:28
3	6	377.8306991496171	241.75315300528536	20/04/28 05:18:28
3	6	377.8250893266292	241.58783162551254	20/04/28 05:18:28
3	6	377.88491031290175	241.48833069397753	20/04/28 05:18:28
3	6	377.7060854132899	241.55932603328858	20/04/28 05:18:29
3	6	377.8727640648119	241.5933178237669	20/04/28 05:18:29
3	6	377.9569161799705	241.31644500534176	20/04/28 05:18:29
3	6	377.96310461042805	241.32112604817007	20/04/28 05:18:29
3	6	377.9488440481615	241.27039637147078	20/04/28 05:18:29
3	6	377.9963355545718	241.2146271087398	20/04/28 05:18:29
3	6	378.20067189394524	241.08106648059976	20/04/28 05:18:29
3	6	378.33448903245574	240.980763585113	20/04/28 05:18:29
3	6	378.25635405293207	241.1752698729181	20/04/28 05:18:29
3	6	378.3528558311107	241.083406104316	20/04/28 05:18:29
3	6	378.32811936208657	241.19312098429123	20/04/28 05:18:30
3	6	378.50146816538114	241.20023256716547	20/04/28 05:18:30
3	6	378.52631875647074	241.4359999546742	20/04/28 05:18:30
3	6	378.50253960928455	241.22101801213498	20/04/28 05:18:30
3	6	378.56693311732437	241.32333758050973	20/04/28 05:18:30
3	6	378.5616513317655	241.28758096858846	20/04/28 05:18:30
3	6	378.72320670709445	241.3348624326976	20/04/28 05:18:30
3	6	378.5247282512087	241.41059219941383	20/04/28 05:18:30
3	6	378.4606057867604	241.47321702871898	20/04/28 05:18:30
3	6	378.37070150010726	241.2811250856453	20/04/28 05:18:31
3	6	378.6075131387118	241.2271285214885	20/04/28 05:18:31
3	6	378.42456492647034	241.2638009726805	20/04/28 05:18:31
3	6	378.5818568874805	241.166901182463	20/04/28 05:18:31
3	6	378.6692760397323	241.2001811703114	20/04/28 05:18:31
3	6	378.4435403667773	241.0878636948089	20/04/28 05:18:31
3	6	378.3146245964706	241.3239015045383	20/04/28 05:18:31
3	6	378.40370012811815	241.23833807954765	20/04/28 05:18:31
3	6	378.28513786842626	241.36698395174855	20/04/28 05:18:31
3	6	378.29887311469	241.34224784171533	20/04/28 05:18:31
3	6	378.2114989037935	241.61684828645144	20/04/28 05:18:32
3	6	378.33591735631103	241.59448156423883	20/04/28 05:18:32
3	6	378.4177429251426	241.6532953910717	20/04/28 05:18:32
3	6	378.46564000502116	241.82648894642125	20/04/28 05:18:32
3	6	378.4577929759405	241.64079720037256	20/04/28 05:18:32
3	6	378.5320340896755	241.84236505231226	20/04/28 05:18:32
3	6	378.53262355530853	241.54695903092687	20/04/28 05:18:32
3	6	378.53629614707046	241.55019422265892	20/04/28 05:18:32
3	6	378.5967962556612	241.40617085468767	20/04/28 05:18:32
3	6	378.592349993883	241.40864849377326	20/04/28 05:18:32
3	6	378.50401410625363	241.384278125484	20/04/28 05:18:33
3	6	378.4960243604652	241.38636982173935	20/04/28 05:18:33
3	6	378.4385548675341	241.376283563319	20/04/28 05:18:33
3	6	378.32462229302126	241.49948072850083	20/04/28 05:18:33
3	6	378.2034118030722	241.53337702802264	20/04/28 05:18:33
3	6	378.16339025601405	241.5340389401535	20/04/28 05:18:33
3	6	378.00632033820284	241.6281560447658	20/04/28 05:18:33
3	6	377.9934630121439	241.89012818591794	20/04/28 05:18:33
3	6	378.06338896807443	241.89244205376338	20/04/28 05:18:33
3	6	378.02823127058167	241.96950004318145	20/04/28 05:18:34
3	6	378.0227268458024	242.18443562540608	20/04/28 05:18:34
3	6	378.1486495236589	242.2821115272947	20/04/28 05:18:34
3	6	378.35647096064326	242.26478168168362	20/04/28 05:18:34
3	6	378.2273710299142	242.25639305914243	20/04/28 05:18:34
3	6	378.1297179119013	242.2009084963982	20/04/28 05:18:34
3	6	378.05471576799147	242.16767654916458	20/04/28 05:18:34
3	6	377.857682365476	242.33098065531027	20/04/28 05:18:34
3	6	377.85285728741684	242.3174624289477	20/04/28 05:18:34
3	6	378.0739567938413	242.30244931774644	20/04/28 05:18:34
3	6	378.07892687337295	242.29708467403051	20/04/28 05:18:35
3	6	378.3521996468343	242.32833050879645	20/04/28 05:18:35
3	6	378.3898776906912	242.29442857796096	20/04/28 05:18:35
3	6	378.4936073179502	242.11195805024667	20/04/28 05:18:35
3	6	378.35864311266585	241.8593026706128	20/04/28 05:18:35
3	6	378.53459428150273	241.88130976121872	20/04/28 05:18:35
3	6	378.459433232895	241.87034683198092	20/04/28 05:18:35
3	6	378.4695357236857	241.77856661150742	20/04/28 05:18:35
3	6	378.70998286016413	241.6447291317741	20/04/28 05:18:35
3	6	378.7400110662161	241.80035385751142	20/04/28 05:18:35
3	6	378.8262891086958	241.98905293524047	20/04/28 05:18:36
3	6	378.8282290026396	241.99069305503954	20/04/28 05:18:36
3	6	379.03310320732777	241.91055669061745	20/04/28 05:18:36
3	6	379.0334641684344	241.91127021661197	20/04/28 05:18:36
3	6	379.017410529189	242.1701413252586	20/04/28 05:18:36
3	6	379.0748403263007	241.90708293943496	20/04/28 05:18:36
3	6	379.3690862102985	241.92147519422903	20/04/28 05:18:36
3	6	379.5611886637398	241.95494922929473	20/04/28 05:18:36
3	6	379.5911351769031	241.86971870788543	20/04/28 05:18:36
3	6	379.4204460456941	242.02058573727393	20/04/28 05:18:37
3	6	379.61810649417475	242.0976021187096	20/04/28 05:18:37
3	6	379.56411849335	241.85742216657488	20/04/28 05:18:37
3	6	379.5985521830857	241.8416678968846	20/04/28 05:18:37
3	6	379.6006667026174	241.84054595127103	20/04/28 05:18:37
3	6	379.65587651040215	241.82031243998182	20/04/28 05:18:37
3	6	379.5256524246752	241.66678264355045	20/04/28 05:18:37
3	6	379.53887484205507	241.7913161010972	20/04/28 05:18:37
3	6	379.69785813003966	241.63800523302973	20/04/28 05:18:37
3	6	379.7783445014036	241.44263535972294	20/04/28 05:18:37
3	6	379.83949138308975	241.46479700541852	20/04/28 05:18:38
3	6	379.693917290417	241.2111195917471	20/04/28 05:18:38
3	6	379.72216172840996	240.95272355352824	20/04/28 05:18:38
3	6	379.5611602629949	240.85819343225353	20/04/28 05:18:38
3	6	379.52578214684036	240.87198721362603	20/04/28 05:18:38
3	6	379.37045818602707	240.81834627172097	20/04/28 05:18:38
3	6	379.3160602888175	240.84117027307562	20/04/28 05:18:38
3	6	379.31168359172324	240.87213458278126	20/04/28 05:18:38
3	6	379.37475892645153	240.9337447209133	20/04/28 05:18:38
3	6	379.2708288579316	240.72993557912406	20/04/28 05:18:38
3	6	379.2484898889588	240.7328063915632	20/04/28 05:18:39
3	6	379.4486594106255	240.76572648033888	20/04/28 05:18:39
3	6	379.57295309244125	240.7279523705447	20/04/28 05:18:39
3	6	379.4194099020152	240.9623494206065	20/04/28 05:18:39
3	6	379.3607987195121	240.9624568712233	20/04/28 05:18:39
3	6	379.3451625063593	240.9664006049891	20/04/28 05:18:39
3	6	379.34604113888895	240.9408347719237	20/04/28 05:18:39
3	6	379.6348534123383	240.86128522614882	20/04/28 05:18:39
3	6	379.5107229555195	240.71230224515983	20/04/28 05:18:39
3	6	379.58138255583884	240.71148118436244	20/04/28 05:18:40
3	6	379.39966749435615	240.87826295403164	20/04/28 05:18:40
3	6	379.3757861700941	240.90563055926552	20/04/28 05:18:40
3	6	379.41352433425976	241.0047159142853	20/04/28 05:18:40
3	6	379.4082491005798	241.0001841573135	20/04/28 05:18:40
3	6	379.6531171571116	240.9540642106179	20/04/28 05:18:40
3	6	379.5993787015122	240.9467823786598	20/04/28 05:18:40
3	6	379.32307879479185	241.01941028839482	20/04/28 05:18:40
3	6	379.4287724444402	241.19681074602283	20/04/28 05:18:40
3	6	379.60614145001733	241.02351380889286	20/04/28 05:18:40
3	6	379.3440862587273	241.04507979133774	20/04/28 05:18:41
3	6	379.1669266905464	240.9764371351707	20/04/28 05:18:41
3	6	378.93666799854446	240.85792002269272	20/04/28 05:18:41
3	6	378.963713511367	240.9093826596773	20/04/28 05:18:41
3	6	378.7686432928349	240.9421279349443	20/04/28 05:18:41
3	6	378.7220297289065	241.0239464968379	20/04/28 05:18:41
3	6	378.5349953058477	241.12078647017557	20/04/28 05:18:41
3	6	378.43083881250516	241.1679080164645	20/04/28 05:18:41
3	6	378.62751386940005	240.97753823234484	20/04/28 05:18:41
3	6	378.7538776500783	240.9597530761022	20/04/28 05:18:41
3	6	378.7176834204983	240.9261141721743	20/04/28 05:18:42
3	6	378.7310586392876	240.93425621448256	20/04/28 05:18:42
3	6	378.71693423387063	241.00645150849533	20/04/28 05:18:42
3	6	378.78750763132734	241.17864073564593	20/04/28 05:18:42
3	6	378.735857213854	241.23081943141437	20/04/28 05:18:42
3	6	378.7906326370463	241.47779392110064	20/04/28 05:18:42
3	6	378.56300041086223	241.37315058830168	20/04/28 05:18:42
3	6	378.5561489551245	241.41748353918013	20/04/28 05:18:42
3	6	378.45915367622484	241.5687778633064	20/04/28 05:18:42
3	6	378.45989634925047	241.5635380065101	20/04/28 05:18:42
3	6	378.46148711935723	241.5488594843401	20/04/28 05:18:43
3	6	378.62490095959595	241.31189780588775	20/04/28 05:18:43
3	6	378.5942174177295	241.31121982912174	20/04/28 05:18:43
3	6	378.585678901768	241.41861593808053	20/04/28 05:18:43
3	6	378.42894266434587	241.5872254576027	20/04/28 05:18:43
3	6	378.32073468242794	241.64557781948773	20/04/28 05:18:43
3	6	378.18281767452095	241.49353500864237	20/04/28 05:18:43
3	6	378.337240249163	241.51171802165848	20/04/28 05:18:43
3	6	378.6107468626137	241.54947701203665	20/04/28 05:18:43
3	6	378.4880658668305	241.53575300988797	20/04/28 05:18:44
3	6	378.5112299733886	241.55963589379908	20/04/28 05:18:44
3	6	378.70852413918175	241.6768693707978	20/04/28 05:18:44
3	6	378.7168208875851	241.6537077209726	20/04/28 05:18:44
3	6	378.73510185052606	241.59984568942915	20/04/28 05:18:44
3	6	378.75152139027836	241.6523260035199	20/04/28 05:18:44
3	6	378.6685118410533	241.70245351513236	20/04/28 05:18:44
3	6	378.7439004208215	241.71027813214428	20/04/28 05:18:44
3	6	378.47864588565915	241.7029466127562	20/04/28 05:18:44
3	6	378.31771532240134	241.56296525035913	20/04/28 05:18:44
3	6	378.25135201987916	241.48451270228114	20/04/28 05:18:45
3	6	378.01721460458117	241.46553033849835	20/04/28 05:18:45
3	6	377.90541598879867	241.62023501442155	20/04/28 05:18:45
3	6	377.81776570125595	241.61480340732714	20/04/28 05:18:45
3	6	377.5630063736374	241.66134893584123	20/04/28 05:18:45
3	6	377.72210547985486	241.55012227765607	20/04/28 05:18:45
3	6	377.7264976052386	241.65932923617385	20/04/28 05:18:45
3	6	377.5085503484796	241.4959388480984	20/04/28 05:18:45
3	6	377.8010785165019	241.50637944796742	20/04/28 05:18:45
3	6	377.84637686917796	241.36447099492122	20/04/28 05:18:45
3	6	377.7282945165189	241.1377472266729	20/04/28 05:18:46
3	6	377.52941369330136	241.17431947728346	20/04/28 05:18:46
3	6	377.31655186586005	241.12457396629645	20/04/28 05:18:46
3	6	377.21232288352877	241.3346610393672	20/04/28 05:18:46
3	6	377.3258081495229	241.10005400283694	20/04/28 05:18:46
3	6	377.161107203024	241.20040020982077	20/04/28 05:18:46
3	6	377.11951760130574	241.25693139239564	20/04/28 05:18:46
3	6	377.1830290159884	241.5291978178195	20/04/28 05:18:46
3	6	377.2295497970424	241.54516561304146	20/04/28 05:18:46
3	6	377.23276583256404	241.57882366176997	20/04/28 05:18:47
3	6	377.33321600902093	241.7403910039978	20/04/28 05:18:47
3	6	377.4258247966737	241.69550215686348	20/04/28 05:18:47
3	6	377.4292587989778	241.79003518459746	20/04/28 05:18:47
3	6	377.4469139834404	241.7913085457237	20/04/28 05:18:47
3	6	377.67854652274406	241.64329043411482	20/04/28 05:18:47
3	6	377.6032559814522	241.39536455170884	20/04/28 05:18:47
3	6	377.6032559814522	241.39536455170884	20/04/28 05:18:47
3	6	377.6032559814522	241.39536455170884	20/04/28 05:18:47
3	6	377.48803337679345	241.50378591275646	20/04/28 05:18:47
3	6	377.31673431855575	241.66497370308034	20/04/28 05:18:48
3	6	377.1172462596457	241.85268658219664	20/04/28 05:18:48
3	6	376.9901479258738	241.9722826838057	20/04/28 05:18:48
3	6	376.85093534400903	242.10327796589843	20/04/28 05:18:48
3	6	376.6611219907307	242.28188720814214	20/04/28 05:18:48
3	6	376.46572547993844	242.46575005091324	20/04/28 05:18:48
3	6	376.2635863219903	242.6559575426694	20/04/28 05:18:48
3	6	376.10058136624514	242.80934080641126	20/04/28 05:18:48
3	6	375.9876165294488	242.915637668839	20/04/28 05:18:48
3	6	375.8187604706033	243.074526662673	20/04/28 05:18:48
3	6	375.6066541085194	243.2741130244993	20/04/28 05:18:49
