floorId	partitionId	location_x	location_y	timeStamp
1	98	305.35353885943323	268.37069539550134	20/04/28 05:16:32
1	98	305.14384176673207	266.22087392439636	20/04/28 05:16:33
1	98	305.14384176673207	266.22087392439636	20/04/28 05:16:34
1	98	305.14384176673207	266.22087392439636	20/04/28 05:16:35
1	98	303.28594423312194	264.61216223098285	20/04/28 05:16:36
1	98	303.28594423312194	264.61216223098285	20/04/28 05:16:37
3	47	302.3157990937455	265.96754816044853	20/04/28 05:16:38
3	47	304.4503261024236	266.616992546722	20/04/28 05:16:39
3	47	305.42047124180004	265.2616066172563	20/04/28 05:16:40
3	20	308.1866193271433	264.1749199815553	20/04/28 05:16:41
1	81	313.2523840549326	264.4074609667819	20/04/28 05:16:42
1	81	313.37765885306834	261.0920988121665	20/04/28 05:16:43
3	NULL	315.74240883925677	260.5181275582284	20/04/28 05:16:44
3	54	318.718225726321	262.2630310087092	20/04/28 05:16:45
3	18	323.88933172803024	266.62874758140686	20/04/28 05:16:46
3	54	324.0151806674323	262.76750572012435	20/04/28 05:16:47
3	54	324.6837666112415	261.38954335341236	20/04/28 05:16:48
3	54	327.3540763805351	261.1072377077433	20/04/28 05:16:49
3	54	327.3540763805351	261.1072377077433	20/04/28 05:16:50
3	54	334.4407240787428	261.4032786809491	20/04/28 05:16:51
3	54	334.4407240787428	261.4032786809491	20/04/28 05:16:52
3	54	334.4407240787428	261.4032786809491	20/04/28 05:16:53
3	54	334.4407240787428	261.4032786809491	20/04/28 05:16:54
3	NULL	337.70753542622793	260.4595329480968	20/04/28 05:16:55
3	99	339.59375125487367	258.8166372045796	20/04/28 05:16:56
3	42	346.32423194001075	259.3686329834299	20/04/28 05:16:57
1	41	349.17477120857285	262.4807721885283	20/04/28 05:16:58
3	54	350.37914153837863	260.97432627346046	20/04/28 05:16:59
3	54	350.37914153837863	260.97432627346046	20/04/28 05:17:00
3	54	350.37914153837863	260.97432627346046	20/04/28 05:17:01
3	54	352.9059324522066	261.07811147821695	20/04/28 05:17:02
3	54	354.93110780732565	263.85962413987545	20/04/28 05:17:03
3	54	358.23287936641947	263.0061707425011	20/04/28 05:17:04
3	54	359.56855835216805	263.2279362811352	20/04/28 05:17:05
3	34	362.2167196060361	259.70189758364177	20/04/28 05:17:06
3	34	363.08940602427793	260.2393220879455	20/04/28 05:17:07
3	57	365.8336784609425	258.9548948604074	20/04/28 05:17:08
3	54	372.48785670166836	262.3595943162643	20/04/28 05:17:09
3	54	372.48785670166836	262.3595943162643	20/04/28 05:17:10
3	54	372.48785670166836	262.3595943162643	20/04/28 05:17:11
3	54	376.18269094789457	263.03655301878126	20/04/28 05:17:12
3	15	378.8796771581538	263.378721128207	20/04/28 05:17:13
1	33	379.8755906118027	262.6421307240284	20/04/28 05:17:14
3	15	381.6109766893215	266.7378605480671	20/04/28 05:17:15
3	15	380.97239583354167	266.94453563659977	20/04/28 05:17:16
1	33	381.6109766893215	266.73786054806715	20/04/28 05:17:17
1	33	379.51825801393375	263.17204603967434	20/04/28 05:17:18
1	69	376.3565651967492	261.56244682705545	20/04/28 05:17:19
3	54	372.48785670166836	262.3595943162643	20/04/28 05:17:20
1	69	372.48785670166836	262.3595943162643	20/04/28 05:17:21
1	69	372.48785670166836	262.3595943162643	20/04/28 05:17:22
1	69	367.80245440868674	262.5455232582413	20/04/28 05:17:23
1	69	365.6578696297699	259.3576200548633	20/04/28 05:17:24
3	34	362.2167196060361	259.70189758364177	20/04/28 05:17:25
3	54	358.87237025214637	261.21107622709695	20/04/28 05:17:26
1	64	358.87237025214637	261.21107622709695	20/04/28 05:17:27
1	64	356.02694011127693	259.70882448523747	20/04/28 05:17:28
1	64	354.49328963180795	262.3471616487957	20/04/28 05:17:29
1	41	352.7251685521831	260.56227788261185	20/04/28 05:17:30
1	41	351.1038521390131	261.25919659269	20/04/28 05:17:31
1	41	351.1038521390131	261.25919659268993	20/04/28 05:17:32
1	41	350.03191915941005	261.4911728805443	20/04/28 05:17:33
1	22	346.48253983850464	261.2777688197779	20/04/28 05:17:34
1	22	343.1917987024697	259.9647561276533	20/04/28 05:17:35
1	NULL	341.7564158159603	259.49985762417106	20/04/28 05:17:36
1	69	340.1854692097293	258.18142547541174	20/04/28 05:17:37
1	69	338.1583683683643	258.3517387010974	20/04/28 05:17:38
1	69	336.9186578622442	259.125171208264	20/04/28 05:17:39
1	5	334.954212400308	260.21600824778375	20/04/28 05:17:40
1	5	333.7145018941879	260.9894407549504	20/04/28 05:17:41
1	NULL	329.63052872625184	261.159270734312	20/04/28 05:17:42
1	37	327.25467987903363	260.112943188232	20/04/28 05:17:43
1	37	327.25467987903363	260.112943188232	20/04/28 05:17:44
1	37	323.9780902572864	261.641853061257	20/04/28 05:17:45
1	37	323.9780902572864	261.641853061257	20/04/28 05:17:46
1	81	318.06966812882723	262.69145868280907	20/04/28 05:17:47
1	72	321.1077911072469	264.3050039939337	20/04/28 05:17:48
1	72	321.10779110724695	264.3050039939337	20/04/28 05:17:49
1	72	321.10779110724695	264.3050039939337	20/04/28 05:17:50
1	72	321.1077911072469	264.3050039939337	20/04/28 05:17:51
1	72	321.1077911072469	264.3050039939337	20/04/28 05:17:52
1	72	321.1077911072469	264.3050039939337	20/04/28 05:17:53
1	72	321.1077911072469	264.3050039939337	20/04/28 05:17:54
1	56	319.89662212153377	266.1573209564685	20/04/28 05:17:55
1	56	319.89662212153377	266.1573209564685	20/04/28 05:17:56
1	56	319.89662212153377	266.1573209564685	20/04/28 05:17:57
1	56	319.89662212153377	266.1573209564685	20/04/28 05:17:58
1	72	321.1077911072469	264.3050039939337	20/04/28 05:17:59
1	72	321.1077911072469	264.3050039939337	20/04/28 05:18:00
1	72	321.10779110724695	264.3050039939337	20/04/28 05:18:01
1	72	321.1077911072469	264.3050039939337	20/04/28 05:18:02
1	72	322.34915620924	265.0152899264337	20/04/28 05:18:03
1	72	322.34915620924	265.0152899264337	20/04/28 05:18:04
1	72	321.1077911072469	264.3050039939337	20/04/28 05:18:05
1	56	319.89662212153377	266.1573209564685	20/04/28 05:18:06
1	72	322.34915620924	265.0152899264337	20/04/28 05:18:07
1	72	321.10779110724695	264.3050039939337	20/04/28 05:18:08
1	72	321.10779110724695	264.3050039939337	20/04/28 05:18:09
1	72	321.1077911072469	264.3050039939337	20/04/28 05:18:10
1	72	321.1077911072469	264.3050039939337	20/04/28 05:18:11
1	72	321.1077911072469	264.3050039939337	20/04/28 05:18:12
1	56	319.89662212153377	266.1573209564685	20/04/28 05:18:13
1	72	321.1077911072469	264.3050039939337	20/04/28 05:18:14
1	56	319.89662212153377	266.1573209564685	20/04/28 05:18:15
1	56	319.89662212153377	266.1573209564685	20/04/28 05:18:16
1	72	321.1077911072469	264.3050039939337	20/04/28 05:18:17
1	72	321.1077911072469	264.3050039939337	20/04/28 05:18:18
1	81	318.06966812882723	262.69145868280907	20/04/28 05:18:19
1	81	315.74240883925677	260.5181275582284	20/04/28 05:18:20
1	81	315.74240883925677	260.5181275582284	20/04/28 05:18:21
1	81	314.50318194109644	265.02915212402996	20/04/28 05:18:22
1	81	315.74240883925677	260.5181275582284	20/04/28 05:18:23
1	81	314.50318194109644	265.02915212402996	20/04/28 05:18:24
1	81	314.50318194109644	265.02915212402996	20/04/28 05:18:25
1	81	314.50318194109644	265.02915212402996	20/04/28 05:18:26
1	81	311.6591172126105	263.4112042347413	20/04/28 05:18:27
1	81	314.50318194109644	265.02915212402996	20/04/28 05:18:28
1	81	314.50318194109644	265.02915212402996	20/04/28 05:18:29
1	81	314.50318194109644	265.02915212402996	20/04/28 05:18:30
1	81	314.50318194109644	265.02915212402996	20/04/28 05:18:31
1	81	314.50318194109644	265.02915212402996	20/04/28 05:18:32
1	81	314.50318194109644	265.02915212402996	20/04/28 05:18:33
1	81	314.50318194109644	265.02915212402996	20/04/28 05:18:34
1	81	314.50318194109644	265.02915212402996	20/04/28 05:18:35
1	81	314.50318194109644	265.02915212402996	20/04/28 05:18:36
1	81	314.50318194109644	265.02915212402996	20/04/28 05:18:37
1	81	314.50318194109644	265.02915212402996	20/04/28 05:18:38
1	81	314.50318194109644	265.02915212402996	20/04/28 05:18:39
1	81	314.50318194109644	265.02915212402996	20/04/28 05:18:40
1	81	313.2523840549325	264.4074609667819	20/04/28 05:18:41
1	81	314.50318194109644	265.02915212402996	20/04/28 05:18:42
1	81	317.4633882763735	263.93806291016494	20/04/28 05:18:43
1	81	315.74240883925677	260.5181275582284	20/04/28 05:18:44
1	81	318.19494292696305	259.3760965281936	20/04/28 05:18:45
1	37	323.9780902572864	261.641853061257	20/04/28 05:18:46
1	37	323.9780902572864	261.641853061257	20/04/28 05:18:47
1	37	323.9780902572864	261.641853061257	20/04/28 05:18:48
