floorId	partitionId	location_x	location_y	timeStamp
21	923	365.5376388615176	288.35765702660336	21/02/24 15:38:00
21	923	365.5376388615176	288.35765702660336	21/02/24 15:38:00
21	923	365.7713530331023	288.4672743642627	21/02/24 15:38:00
21	923	365.7637996837389	288.35527251710215	21/02/24 15:38:00
21	923	365.6451492442915	288.2276823425887	21/02/24 15:38:00
21	923	365.56097102815966	288.0945828773268	21/02/24 15:38:00
21	923	365.55029336388515	288.3167134284827	21/02/24 15:38:00
21	923	365.55029336388515	288.3167134284827	21/02/24 15:38:00
21	923	365.6868229167491	288.364210633163	21/02/24 15:38:00
21	923	365.71566985365155	288.2172551251108	21/02/24 15:38:01
21	923	365.63934651251185	288.2076956878385	21/02/24 15:38:01
21	923	365.4301753276707	288.2706694123773	21/02/24 15:38:01
21	923	365.7031689407464	288.2374287031609	21/02/24 15:38:01
21	923	365.76420606311666	288.163467760495	21/02/24 15:38:01
21	923	365.49774244067567	288.1526708410317	21/02/24 15:38:01
21	923	365.45463720642346	288.0792831002918	21/02/24 15:38:01
21	923	365.4739861507082	288.1297701979895	21/02/24 15:38:01
21	923	365.4739861507082	288.1297701979895	21/02/24 15:38:01
21	923	365.5329907752503	288.16311435581684	21/02/24 15:38:01
21	923	365.4162212244244	288.33431712907	21/02/24 15:38:02
21	923	365.6558712584314	288.22548300508436	21/02/24 15:38:02
21	923	365.57318665123984	288.15613739466266	21/02/24 15:38:02
21	923	365.4699809707376	288.0307902569236	21/02/24 15:38:02
21	923	365.4699809707376	288.0307902569236	21/02/24 15:38:02
21	923	365.41031585222333	287.97520064906604	21/02/24 15:38:02
21	923	365.45365001022225	288.0761010927495	21/02/24 15:38:02
21	923	365.33978427083287	288.21666717772837	21/02/24 15:38:02
21	923	365.4637767712762	288.34064980725657	21/02/24 15:38:02
21	923	365.4637767712762	288.34064980725657	21/02/24 15:38:03
21	923	365.3638729459347	288.41418070830974	21/02/24 15:38:03
21	923	365.3638729459347	288.41418070830974	21/02/24 15:38:03
21	923	365.17809070176713	288.2231888607104	21/02/24 15:38:03
21	923	365.2677338275919	288.131118086774	21/02/24 15:38:03
21	923	365.2636900888225	288.19170038276957	21/02/24 15:38:03
21	923	365.00515686124197	288.21948296953167	21/02/24 15:38:03
21	923	365.01190464482187	288.2756096361007	21/02/24 15:38:03
21	923	365.06737554978633	288.35384219455455	21/02/24 15:38:03
21	923	365.08348836740373	288.41620807873085	21/02/24 15:38:03
21	923	365.01858511838265	288.18949427456533	21/02/24 15:38:04
21	923	364.89679374277154	288.3036182919401	21/02/24 15:38:04
21	923	364.8911607393759	288.5115439368234	21/02/24 15:38:04
21	923	364.69539946388363	288.46211628346407	21/02/24 15:38:04
21	923	364.82296293669543	288.45280102928945	21/02/24 15:38:04
21	923	364.9474349129096	288.5022266826676	21/02/24 15:38:04
21	923	364.9740429081716	288.3743206513585	21/02/24 15:38:04
21	923	364.97866759723814	288.4141122677169	21/02/24 15:38:04
21	923	364.97866759723814	288.4141122677169	21/02/24 15:38:04
21	923	364.9950111372529	288.30992059945663	21/02/24 15:38:04
21	923	364.9842308414908	288.24336091417683	21/02/24 15:38:05
21	923	364.9721741292027	288.31347890869336	21/02/24 15:38:05
21	923	364.84034679003554	288.5150404196853	21/02/24 15:38:05
21	923	364.85126195645756	288.4899190539579	21/02/24 15:38:05
21	923	364.8562791732615	288.49319547859994	21/02/24 15:38:05
21	923	364.84777014127235	288.33232028365717	21/02/24 15:38:05
21	923	364.67727510147097	288.3544734290656	21/02/24 15:38:05
21	923	364.68478054668816	288.32595383614563	21/02/24 15:38:05
21	923	364.7719244553681	288.2871159601953	21/02/24 15:38:05
21	923	364.7549825419564	288.2808848699743	21/02/24 15:38:06
21	923	364.7549825419564	288.2808848699743	21/02/24 15:38:06
21	923	364.7214896508833	288.16433173366755	21/02/24 15:38:06
21	923	364.75274159435884	288.16527778476956	21/02/24 15:38:06
21	923	364.81914074935736	288.08373571652334	21/02/24 15:38:06
21	923	364.71586291168444	288.357835043496	21/02/24 15:38:06
21	923	364.8503191942065	288.1160981153724	21/02/24 15:38:06
21	923	364.83765398254627	287.97680495727684	21/02/24 15:38:06
21	923	364.7910542985286	287.93947701602883	21/02/24 15:38:06
21	923	364.7910542985286	287.93947701602883	21/02/24 15:38:06
21	923	364.87494866003055	288.21795071184584	21/02/24 15:38:07
21	923	364.92598236942655	288.08785817097765	21/02/24 15:38:07
21	923	364.92428891594807	288.09855251290736	21/02/24 15:38:07
21	923	364.88974255722707	287.81419202279807	21/02/24 15:38:07
21	923	364.8348472383137	287.85017164315553	21/02/24 15:38:07
21	923	364.8342481869359	287.83394162554094	21/02/24 15:38:07
21	923	364.76760904926414	288.07126950712393	21/02/24 15:38:07
21	923	364.82855020976785	288.03184744446054	21/02/24 15:38:07
21	923	364.89407609462256	287.97132908148245	21/02/24 15:38:07
21	923	364.84520536952544	287.8531863755589	21/02/24 15:38:08
21	923	364.86009579954566	287.8484586557279	21/02/24 15:38:08
21	923	364.90420480822115	287.9028493640088	21/02/24 15:38:08
21	923	364.7963899736018	287.884399469986	21/02/24 15:38:08
21	923	364.7963899736018	287.884399469986	21/02/24 15:38:08
21	923	364.80038709252955	287.9161737507516	21/02/24 15:38:08
21	923	364.8880508603598	287.9517089825055	21/02/24 15:38:08
21	923	364.820370737092	287.911054960681	21/02/24 15:38:08
21	923	364.8203054536735	287.9111595474846	21/02/24 15:38:08
21	923	364.7063579851497	287.81454278171	21/02/24 15:38:08
21	923	364.8672144107744	287.7674090145255	21/02/24 15:38:09
21	923	364.9437094252567	287.8253402573461	21/02/24 15:38:09
21	923	364.7158184507525	287.88422915415475	21/02/24 15:38:09
21	923	364.699298032721	287.86002172653014	21/02/24 15:38:09
21	923	364.7692535748079	287.98503996239646	21/02/24 15:38:09
21	923	365.03795326681984	287.9976696668987	21/02/24 15:38:09
21	923	364.9634736799271	288.1483260554013	21/02/24 15:38:09
21	923	364.9498515310114	288.10620090155567	21/02/24 15:38:09
21	923	364.7062279696138	287.99681520343677	21/02/24 15:38:09
21	923	364.91384200081575	288.1330570849479	21/02/24 15:38:09
21	923	364.9085462976739	288.1876177277347	21/02/24 15:38:10
21	923	365.08688815091654	288.3279986128397	21/02/24 15:38:10
21	923	365.065556859546	288.40427354419944	21/02/24 15:38:10
21	923	365.09887583564057	288.5931317831838	21/02/24 15:38:10
21	923	365.3482006638213	288.6512030870295	21/02/24 15:38:10
21	923	365.14380741135767	288.5584876437137	21/02/24 15:38:10
21	923	365.14380741135767	288.5584876437137	21/02/24 15:38:10
21	923	364.98313110347414	288.4856877843054	21/02/24 15:38:10
21	923	365.01904166664036	288.4904685936938	21/02/24 15:38:10
21	923	365.00253440557054	288.1246574371994	21/02/24 15:38:11
21	923	365.00253440557054	288.1246574371994	21/02/24 15:38:11
21	923	365.25607171831206	288.2203239028674	21/02/24 15:38:11
21	923	365.2335729216229	288.25915764991237	21/02/24 15:38:11
21	923	365.4691371243791	288.2366527349587	21/02/24 15:38:11
21	923	365.4691371243791	288.2366527349587	21/02/24 15:38:11
21	923	365.56321389978496	288.269133349357	21/02/24 15:38:11
21	923	365.3633996602144	288.23741493189544	21/02/24 15:38:11
21	923	365.3632031711172	288.0428847105405	21/02/24 15:38:11
21	923	365.3721404367927	288.24527246245214	21/02/24 15:38:11
21	923	365.566150832175	288.29624872659645	21/02/24 15:38:12
21	923	365.4669014614646	288.47038043297357	21/02/24 15:38:12
21	923	365.54901087678195	288.4588605398724	21/02/24 15:38:12
21	923	365.3861483942562	288.48191555638965	21/02/24 15:38:12
21	923	365.37869037772947	288.4811009686476	21/02/24 15:38:12
21	923	365.20325910462446	288.53178184710526	21/02/24 15:38:12
21	923	365.16134236210934	288.52388856435846	21/02/24 15:38:12
21	923	365.12179756619963	288.4517369789633	21/02/24 15:38:12
21	923	364.9319131762133	288.5545909458164	21/02/24 15:38:12
21	923	364.84070272600866	288.49462696214425	21/02/24 15:38:12
21	923	364.7975081198186	288.53459167776833	21/02/24 15:38:13
21	923	364.8006229743781	288.59025395088213	21/02/24 15:38:13
21	923	364.71459051246444	288.5581899080484	21/02/24 15:38:13
21	923	364.712818883672	288.623739006222	21/02/24 15:38:13
21	923	364.70897704879513	288.67992652796516	21/02/24 15:38:13
21	923	364.6831462702866	288.5800659244641	21/02/24 15:38:13
21	923	364.68773609754305	288.5742860321589	21/02/24 15:38:13
21	923	364.82097586277814	288.406473155191	21/02/24 15:38:13
21	923	364.79292956808195	288.6535653467866	21/02/24 15:38:13
21	923	364.74110782462486	288.7672884606921	21/02/24 15:38:13
21	923	364.72178694508295	288.7732687716629	21/02/24 15:38:14
21	923	364.7242279593606	288.98829297549867	21/02/24 15:38:14
21	923	364.8429646164515	288.7592015273244	21/02/24 15:38:14
21	923	364.9262722540953	288.6923116097735	21/02/24 15:38:14
21	923	364.95235711699684	288.70488756301006	21/02/24 15:38:14
21	923	365.01142695771836	288.6824417309593	21/02/24 15:38:14
21	923	365.0127911743578	288.6807498405346	21/02/24 15:38:14
21	923	365.07901288539847	288.79060035188263	21/02/24 15:38:14
21	923	365.0522078727678	288.75876424618764	21/02/24 15:38:14
21	923	365.0626460039933	288.59062044798236	21/02/24 15:38:15
21	923	365.0543090169029	288.6625249168992	21/02/24 15:38:15
21	923	365.2870100888189	288.7965070572551	21/02/24 15:38:15
21	923	365.36164851072454	288.7103803877054	21/02/24 15:38:15
21	923	365.33033944248126	288.8688979034512	21/02/24 15:38:15
21	923	365.32642510937063	288.75993401495	21/02/24 15:38:15
21	923	365.3244660590764	288.7461601065811	21/02/24 15:38:15
21	923	365.3529629379752	288.74483839485515	21/02/24 15:38:15
21	923	365.36534896017673	288.63468882901356	21/02/24 15:38:15
21	923	365.35372130990277	288.62695308145726	21/02/24 15:38:15
21	923	365.21974397721925	288.5640531187267	21/02/24 15:38:16
21	923	365.07199154230045	288.37789367678056	21/02/24 15:38:16
21	923	365.04868267538507	288.58915612324233	21/02/24 15:38:16
21	923	365.05212456890945	288.4000295678759	21/02/24 15:38:16
21	923	365.0499733908133	288.4065591250267	21/02/24 15:38:16
21	923	365.34451076397255	288.36575954516604	21/02/24 15:38:16
21	923	365.20892353906686	288.2976445291705	21/02/24 15:38:16
21	923	365.2201654552113	288.43096952128604	21/02/24 15:38:16
21	923	365.023647867663	288.32056472518804	21/02/24 15:38:16
21	923	365.023647867663	288.32056472518804	21/02/24 15:38:16
21	923	365.023647867663	288.32056472518804	21/02/24 15:38:17
21	923	364.95518096599346	288.2835151207226	21/02/24 15:38:17
21	923	364.98937352340363	288.26840850983916	21/02/24 15:38:17
21	923	364.9567431938058	288.4832599296638	21/02/24 15:38:17
21	923	364.9568919600053	288.4841793181403	21/02/24 15:38:17
21	923	365.21203687823044	288.6146252098466	21/02/24 15:38:17
21	923	365.2545176926154	288.56315511080294	21/02/24 15:38:17
21	923	365.3219778631261	288.5314312112678	21/02/24 15:38:17
21	923	365.1527350745528	288.51765390762444	21/02/24 15:38:17
21	923	365.38620518450716	288.44637024445547	21/02/24 15:38:18
21	923	365.33102940542983	288.52077158549315	21/02/24 15:38:18
21	923	365.4827391403523	288.53778427261875	21/02/24 15:38:18
21	923	365.7713942400598	288.51508868612603	21/02/24 15:38:18
21	923	365.75095078993337	288.4116993459469	21/02/24 15:38:18
21	923	365.7629726690688	288.3806834464664	21/02/24 15:38:18
21	923	365.5908942010456	288.40334308063217	21/02/24 15:38:18
21	923	365.66730009849095	288.4905306683335	21/02/24 15:38:18
21	923	365.6357296705559	288.6896946660143	21/02/24 15:38:18
21	923	365.83034644057017	288.51895231440176	21/02/24 15:38:18
21	923	365.6690712678347	288.26617471764143	21/02/24 15:38:19
21	923	365.51922877272165	288.37450649492905	21/02/24 15:38:19
21	923	365.48694575457665	288.37390939140175	21/02/24 15:38:19
21	923	365.5644835662029	288.3265430954425	21/02/24 15:38:19
21	923	365.70288079082644	288.2791474348434	21/02/24 15:38:19
21	923	365.7240124526879	288.52630033521666	21/02/24 15:38:19
21	923	365.8315425064656	288.61597207171707	21/02/24 15:38:19
21	923	365.94200090601856	288.40166548393546	21/02/24 15:38:19
21	923	365.9100158671839	288.22173573113577	21/02/24 15:38:19
21	923	365.9755993428098	288.29272127940663	21/02/24 15:38:19
21	923	365.78763564208344	288.3439146550379	21/02/24 15:38:20
21	923	366.02550778901707	288.35348901813757	21/02/24 15:38:20
21	923	366.0232957150434	288.3612713942738	21/02/24 15:38:20
21	923	365.8548234576712	288.3295472434828	21/02/24 15:38:20
21	923	365.7801549887669	288.08541184316715	21/02/24 15:38:20
21	923	365.7761803385513	288.15572771949206	21/02/24 15:38:20
21	923	366.0208978383657	288.07898844486397	21/02/24 15:38:20
21	923	365.7557661829067	287.97648543518	21/02/24 15:38:20
21	923	365.99907770058417	287.95758826644783	21/02/24 15:38:20
21	923	365.9658393152016	287.9338328836358	21/02/24 15:38:21
21	923	366.22875958799307	287.83922238773897	21/02/24 15:38:21
21	923	366.3388543866828	287.6357216334019	21/02/24 15:38:21
21	923	366.1175172164792	287.63790631143735	21/02/24 15:38:21
21	923	366.24682920107733	287.4181897651818	21/02/24 15:38:21
21	923	366.1781447048592	287.46302958496267	21/02/24 15:38:21
21	923	366.4357708844848	287.4941679822225	21/02/24 15:38:21
21	923	366.4738802451682	287.4635998377599	21/02/24 15:38:21
21	923	366.40862502789344	287.328708357174	21/02/24 15:38:21
21	923	366.5002253958684	287.0525223126566	21/02/24 15:38:21
21	923	366.3505479455962	287.2019121691456	21/02/24 15:38:22
21	923	366.3812178195404	287.45060801399694	21/02/24 15:38:22
21	923	366.49803627342334	287.65078149485845	21/02/24 15:38:22
21	923	366.4341120432074	287.7787066676662	21/02/24 15:38:22
21	923	366.4445097236406	288.0715060386406	21/02/24 15:38:22
21	923	366.48940063997327	287.9143776423654	21/02/24 15:38:22
21	923	366.450191278129	287.90400995598105	21/02/24 15:38:22
21	923	366.4450700476632	287.7613514692725	21/02/24 15:38:22
21	923	366.5774347058644	287.92069265956263	21/02/24 15:38:22
21	923	366.381899963012	287.7935220200398	21/02/24 15:38:22
21	923	366.5521816326811	287.8055170299419	21/02/24 15:38:23
21	923	366.51515071268466	287.9499238342915	21/02/24 15:38:23
21	923	366.49758618540363	287.75917954984294	21/02/24 15:38:23
21	923	366.5535554786734	287.69997691906286	21/02/24 15:38:23
21	923	366.58008046128145	287.64151813033897	21/02/24 15:38:23
21	923	366.623361011579	287.4003588309942	21/02/24 15:38:23
21	923	366.7040272634513	287.4021943525201	21/02/24 15:38:23
21	923	366.7040272634513	287.4021943525201	21/02/24 15:38:23
21	923	366.80010049202286	287.66836954512036	21/02/24 15:38:23
21	923	366.8324075713829	287.519066132993	21/02/24 15:38:24
21	923	366.8000832428098	287.66414458303143	21/02/24 15:38:24
21	923	367.06530983289866	287.5633633310038	21/02/24 15:38:24
21	923	367.1480516188507	287.7932621057567	21/02/24 15:38:24
21	923	367.33059052331055	287.8741304349444	21/02/24 15:38:24
21	923	367.37676901526976	287.90772632509805	21/02/24 15:38:24
21	923	367.376737022791	287.9076284696285	21/02/24 15:38:24
21	923	367.4312436427013	287.96805089492943	21/02/24 15:38:24
21	923	367.4258255916754	288.04919717124284	21/02/24 15:38:24
21	923	367.3561100742945	288.07465644862964	21/02/24 15:38:24
21	923	367.36553650193196	288.08107450066916	21/02/24 15:38:25
21	923	367.3149872932401	287.7993724150583	21/02/24 15:38:25
21	923	367.2877024689521	288.0559110348659	21/02/24 15:38:25
21	923	367.2582320875977	288.03422198002096	21/02/24 15:38:25
21	923	366.99844030555676	287.8972229545317	21/02/24 15:38:25
21	923	367.07282438026107	287.95344458074624	21/02/24 15:38:25
21	923	367.0189312882105	287.9322227952259	21/02/24 15:38:25
21	923	367.09338742130853	287.9887676372438	21/02/24 15:38:25
21	923	367.00657405126253	287.9436347608811	21/02/24 15:38:25
21	923	367.20956783455773	287.7741420145796	21/02/24 15:38:25
21	923	367.20956783455773	287.7741420145796	21/02/24 15:38:26
21	923	367.14120826025254	287.8802034254834	21/02/24 15:38:26
21	923	367.05509846640194	288.0967639030375	21/02/24 15:38:26
21	923	367.0215347427638	288.2533016662472	21/02/24 15:38:26
21	923	367.0786854932783	288.3868870571745	21/02/24 15:38:26
21	923	367.2056497051421	288.369078286238	21/02/24 15:38:26
21	923	367.26183462072174	288.44005648122493	21/02/24 15:38:26
21	923	367.2885493415321	288.38123837122066	21/02/24 15:38:26
21	923	367.2362396000289	288.3613296791015	21/02/24 15:38:26
21	923	367.1667627916683	288.4611041924837	21/02/24 15:38:26
21	923	367.28768141674936	288.55682225003324	21/02/24 15:38:27
21	923	367.38724321030463	288.4587688997636	21/02/24 15:38:27
21	923	367.4447270741737	288.27675333789927	21/02/24 15:38:27
21	923	367.38753714733025	288.3272668428218	21/02/24 15:38:27
21	923	367.3805873041584	288.37020935763275	21/02/24 15:38:27
21	923	367.09867393263534	288.3534783701552	21/02/24 15:38:27
21	923	367.0790803583314	288.3780286099387	21/02/24 15:38:27
21	923	367.3989881300085	288.294114667833	21/02/24 15:38:27
21	923	367.30428040752395	288.0873756032509	21/02/24 15:38:27
21	923	367.2110961622379	288.02325471567286	21/02/24 15:38:28
21	923	367.0324065370433	287.973892119366	21/02/24 15:38:28
21	923	366.93887061415865	287.8872209362452	21/02/24 15:38:28
21	923	366.93887061415865	287.8872209362452	21/02/24 15:38:28
21	923	367.1522878339685	287.77760986168306	21/02/24 15:38:28
21	923	367.13056916627113	287.79086021687743	21/02/24 15:38:28
21	923	367.10822330157106	287.88604685831825	21/02/24 15:38:28
21	923	367.1267552824969	287.87218901464865	21/02/24 15:38:28
21	923	367.03408602986053	288.0908807599418	21/02/24 15:38:28
21	923	367.04449022792596	288.1252116808496	21/02/24 15:38:28
21	923	367.04449022792596	288.1252116808496	21/02/24 15:38:29
21	923	366.77533591191724	288.22172817093843	21/02/24 15:38:29
21	923	366.77533591191724	288.22172817093843	21/02/24 15:38:29
21	923	366.9959694581309	288.0249248782954	21/02/24 15:38:29
21	923	367.0353772503123	287.99497530432257	21/02/24 15:38:29
21	923	366.9861404478013	287.980019654229	21/02/24 15:38:29
21	923	366.9861404478013	287.980019654229	21/02/24 15:38:29
21	923	366.8916019569461	287.96807963457076	21/02/24 15:38:29
21	923	367.08729112862346	287.9498735355898	21/02/24 15:38:29
21	923	367.080941003846	288.0205277999315	21/02/24 15:38:29
21	923	367.0134612445834	287.93422554465235	21/02/24 15:38:30
21	923	367.0612237451526	287.89006346403914	21/02/24 15:38:30
21	923	367.0580039067208	287.84497831404263	21/02/24 15:38:30
21	923	367.24623538798664	288.0618399971961	21/02/24 15:38:30
21	923	367.17549414197	287.9880408491553	21/02/24 15:38:30
21	923	367.10036923148886	287.99978611672725	21/02/24 15:38:30
21	923	366.94793982834983	288.05739789765784	21/02/24 15:38:30
21	923	367.00096566355273	287.9431270752231	21/02/24 15:38:30
21	923	367.01527377200097	287.8989571164014	21/02/24 15:38:30
21	923	367.0216994519524	288.1067303472948	21/02/24 15:38:31
21	923	367.03902138899025	287.9761662147391	21/02/24 15:38:31
21	923	367.12183420819207	287.88154875623655	21/02/24 15:38:31
21	923	367.04501195147003	287.70593651595783	21/02/24 15:38:31
21	923	367.0064880472134	287.8714072985602	21/02/24 15:38:31
21	923	366.9560240054467	287.94489498569715	21/02/24 15:38:31
21	923	367.1214666311616	288.05986009280355	21/02/24 15:38:31
21	923	367.1199839188221	288.085042706526	21/02/24 15:38:31
21	923	367.1242524315	288.08871503253164	21/02/24 15:38:31
21	923	367.27923688420384	288.16283142942325	21/02/24 15:38:31
21	923	367.3103860540146	288.29132432356107	21/02/24 15:38:32
21	923	367.3381266259392	288.23857578324004	21/02/24 15:38:32
21	923	367.47829204803094	288.48940902493575	21/02/24 15:38:32
21	923	367.30415190929557	288.3186801379882	21/02/24 15:38:32
21	923	367.2804931371746	288.2874272372899	21/02/24 15:38:32
21	923	367.3042083734303	288.25896534500214	21/02/24 15:38:32
21	923	367.2981141736638	288.2552213580777	21/02/24 15:38:32
21	923	367.1333718542329	288.41299240837884	21/02/24 15:38:32
21	923	367.2218751718455	288.5480500011441	21/02/24 15:38:32
21	923	367.43250858448044	288.36248089558086	21/02/24 15:38:33
21	923	367.1843942727952	288.47636814307225	21/02/24 15:38:33
21	923	367.4016424326457	288.4222763113278	21/02/24 15:38:33
21	923	367.50511281861066	288.2025512196463	21/02/24 15:38:33
21	923	367.5070909891645	288.19966681592547	21/02/24 15:38:33
21	923	367.33676975327614	288.1125786631602	21/02/24 15:38:33
21	923	367.33676975327614	288.1125786631602	21/02/24 15:38:33
21	923	367.33676975327614	288.1125786631602	21/02/24 15:38:33
21	923	367.6122850804823	288.11943483006377	21/02/24 15:38:33
21	923	367.72276557049577	288.06931703309994	21/02/24 15:38:33
21	923	367.88024687292415	288.09232142926714	21/02/24 15:38:34
21	923	368.03964950196746	288.1377968252867	21/02/24 15:38:34
21	923	368.07636288744163	288.18973319393217	21/02/24 15:38:34
21	923	368.13764611753896	288.1298752110478	21/02/24 15:38:34
21	923	368.0343202242545	288.02504895706613	21/02/24 15:38:34
21	923	368.0623179149289	288.0614948700191	21/02/24 15:38:34
21	923	368.2926235120892	287.9525163787312	21/02/24 15:38:34
21	923	368.56425339710756	288.0069420793239	21/02/24 15:38:34
21	923	368.4499798612164	287.93884744672647	21/02/24 15:38:34
21	923	368.4316197448468	287.9547913344302	21/02/24 15:38:34
21	923	368.45251078659874	287.97075075710245	21/02/24 15:38:35
21	923	368.41647232097773	287.95725061481227	21/02/24 15:38:35
21	923	368.4524873306094	287.88080951189147	21/02/24 15:38:35
21	923	368.66531654320846	288.0234661875787	21/02/24 15:38:35
21	923	368.90595435544174	287.9673934750536	21/02/24 15:38:35
21	923	369.00966259631997	288.0738427058641	21/02/24 15:38:35
21	923	369.00422932046564	288.1054199700995	21/02/24 15:38:35
21	923	369.11703461918427	288.0738512721321	21/02/24 15:38:35
21	923	369.0111963720573	288.1417007599372	21/02/24 15:38:35
21	923	369.06519178379364	288.1991130480564	21/02/24 15:38:36
21	923	369.19979979278435	288.1681232032751	21/02/24 15:38:36
21	923	369.16221530586904	288.38284338758206	21/02/24 15:38:36
21	923	369.26665261910534	288.1635941298314	21/02/24 15:38:36
21	923	369.29706026784896	288.18911193821015	21/02/24 15:38:36
21	923	369.3376640364022	288.2438136949998	21/02/24 15:38:36
21	923	369.22844999899746	288.0850246225067	21/02/24 15:38:36
21	923	369.14818905402143	288.0716128685097	21/02/24 15:38:36
21	923	369.41227126184964	288.0580908052709	21/02/24 15:38:36
21	923	369.5123490424923	288.063131768989	21/02/24 15:38:36
21	923	369.347580824084	288.11966526729077	21/02/24 15:38:37
21	923	369.27554818394685	288.15988746022396	21/02/24 15:38:37
21	923	369.21240371386887	288.27045801220385	21/02/24 15:38:37
21	923	369.1000185434575	288.082044991509	21/02/24 15:38:37
21	923	369.1222262078773	287.81573147273764	21/02/24 15:38:37
21	923	369.1222262078773	287.81573147273764	21/02/24 15:38:37
21	923	369.1044571799119	287.8248338190203	21/02/24 15:38:37
21	923	369.1135434765587	287.82705586342854	21/02/24 15:38:37
21	923	369.194673590347	288.10193036749365	21/02/24 15:38:37
21	923	369.0018620074369	288.30081170389394	21/02/24 15:38:38
21	923	369.02053366169974	288.27147761588037	21/02/24 15:38:38
21	923	368.98994882178914	288.0795322845268	21/02/24 15:38:38
21	923	369.20004403486473	288.2194901287075	21/02/24 15:38:38
21	923	369.20120008517154	288.2192900975482	21/02/24 15:38:38
21	923	369.1936898274446	288.19922052879156	21/02/24 15:38:38
21	923	369.2409670805598	288.26412353438684	21/02/24 15:38:38
21	923	369.06839109304815	288.04082371650304	21/02/24 15:38:38
21	923	369.11038053285375	287.9586803127316	21/02/24 15:38:38
21	923	369.21886241990944	288.0316423840977	21/02/24 15:38:38
21	923	369.2173025829016	288.08308765554733	21/02/24 15:38:39
21	923	369.46337940545425	288.1738926397658	21/02/24 15:38:39
21	923	369.45048218526136	288.1798696852608	21/02/24 15:38:39
21	923	369.3192606046485	288.25129584072903	21/02/24 15:38:39
21	923	369.5165465335118	288.3747165383865	21/02/24 15:38:39
21	923	369.53269538467407	288.3615214814463	21/02/24 15:38:39
21	923	369.277132532293	288.2499412298329	21/02/24 15:38:39
21	923	369.0738367708524	288.2586362272857	21/02/24 15:38:39
21	923	369.2243659702909	288.0896962810461	21/02/24 15:38:39
21	923	369.09951334138077	288.2186670728769	21/02/24 15:38:40
21	923	369.149281003548	288.2187805926516	21/02/24 15:38:40
21	923	369.0130939595249	288.1237253114203	21/02/24 15:38:40
21	923	369.21353985928334	288.23589051759177	21/02/24 15:38:40
21	923	369.3029176578566	288.2203752412192	21/02/24 15:38:40
21	923	369.4981092252577	288.1525085659614	21/02/24 15:38:40
21	923	369.4646545991799	288.19364102324823	21/02/24 15:38:40
21	923	369.68091632131797	288.150798599206	21/02/24 15:38:40
21	923	369.6045709166636	288.4288384788405	21/02/24 15:38:40
21	923	369.5729441254005	288.3046539238758	21/02/24 15:38:40
21	923	369.57041488458094	288.31170871916663	21/02/24 15:38:41
21	923	369.4399025128981	288.4129600059768	21/02/24 15:38:41
21	923	369.4868490816225	288.66558181019707	21/02/24 15:38:41
21	923	369.5201461761869	288.7396892070892	21/02/24 15:38:41
21	923	369.62422669957346	288.4876790848289	21/02/24 15:38:41
21	923	369.88585202471	288.45378859113885	21/02/24 15:38:41
21	923	370.0547524512563	288.41133857590995	21/02/24 15:38:41
21	923	370.0308883657288	288.4157606467257	21/02/24 15:38:41
21	923	369.90162327438793	288.14597855800463	21/02/24 15:38:41
21	923	369.7200942208462	288.0628234614919	21/02/24 15:38:41
21	923	369.64479831641694	288.06187892074695	21/02/24 15:38:42
21	923	369.57127613998733	288.1377033328314	21/02/24 15:38:42
21	923	369.7379220714848	288.140423185809	21/02/24 15:38:42
21	923	369.86456799674284	287.9905699285971	21/02/24 15:38:42
21	923	369.9678498387868	287.76518174935404	21/02/24 15:38:42
21	923	370.1014017739333	287.9350947292676	21/02/24 15:38:42
21	923	370.0694977288698	288.00850439743533	21/02/24 15:38:42
21	923	370.0475542143508	287.8283992237397	21/02/24 15:38:42
21	923	369.8754423024754	288.03383619537584	21/02/24 15:38:42
21	923	369.7313945385419	287.99181100265037	21/02/24 15:38:43
21	923	369.93342537973155	288.0906205932385	21/02/24 15:38:43
21	923	370.08989945525536	288.0441257273004	21/02/24 15:38:43
21	923	369.9044555384824	288.06608058309	21/02/24 15:38:43
21	923	369.7391455377047	287.9957569533878	21/02/24 15:38:43
21	923	369.7376232520586	287.8181294268656	21/02/24 15:38:43
21	923	369.7121111586448	287.84585404401383	21/02/24 15:38:43
21	923	369.7965591476715	287.88198237718495	21/02/24 15:38:43
21	923	369.9160397233116	288.0444189704297	21/02/24 15:38:43
21	923	370.05557483591707	287.7933561630783	21/02/24 15:38:43
21	923	370.1577237628789	287.6803069573348	21/02/24 15:38:44
21	923	370.11149229055735	287.4331535897903	21/02/24 15:38:44
21	923	370.11368375886724	287.42964232209005	21/02/24 15:38:44
21	923	370.0940780618441	287.42319911660013	21/02/24 15:38:44
21	923	370.16504619284814	287.5207920308207	21/02/24 15:38:44
21	923	369.90441514747084	287.5444072286506	21/02/24 15:38:44
21	923	369.89271860235885	287.5471866769605	21/02/24 15:38:44
21	923	369.61913654829857	287.6134753762305	21/02/24 15:38:44
21	923	369.52759668447385	287.5922665221496	21/02/24 15:38:44
21	923	369.5332951093231	287.65590032075875	21/02/24 15:38:44
21	923	369.5230370121764	287.4231484539055	21/02/24 15:38:45
21	923	369.4635167201958	287.39259539907187	21/02/24 15:38:45
21	923	369.7318644113255	287.4592799342901	21/02/24 15:38:45
21	923	369.66123745531286	287.22135749337286	21/02/24 15:38:45
21	923	369.5920309659083	287.22125474569276	21/02/24 15:38:45
21	923	369.7044766476991	287.1718676291257	21/02/24 15:38:45
21	923	369.8365109600223	287.22140348670035	21/02/24 15:38:45
21	923	369.91159140181753	287.0006128239843	21/02/24 15:38:45
21	923	369.77512269781266	286.90220451348955	21/02/24 15:38:45
21	923	369.8967358873	287.1190899812501	21/02/24 15:38:46
21	923	369.8946727694676	287.2063472377395	21/02/24 15:38:46
21	923	369.82469761570496	287.2270995719346	21/02/24 15:38:46
21	923	369.8936828164848	287.08831191807695	21/02/24 15:38:46
21	923	369.99933251506104	286.9769840944067	21/02/24 15:38:46
21	923	369.8419071902989	286.7334760045416	21/02/24 15:38:46
21	923	369.9851471193244	286.7579854014395	21/02/24 15:38:46
21	923	370.08492306631376	286.7411138216165	21/02/24 15:38:46
21	923	370.08670710794536	286.85295966776863	21/02/24 15:38:46
21	923	370.25044029904024	286.7746779570484	21/02/24 15:38:46
21	923	370.08320920475074	286.64937393814455	21/02/24 15:38:47
21	923	370.1024521918052	286.6035538598961	21/02/24 15:38:47
21	923	370.11723054393076	286.5917025856276	21/02/24 15:38:47
21	923	369.9451393236073	286.38260948334755	21/02/24 15:38:47
21	923	369.93024563449836	286.5213713100164	21/02/24 15:38:47
21	923	369.91347783405297	286.6000655518058	21/02/24 15:38:47
21	923	369.8791621679043	286.6665737314187	21/02/24 15:38:47
21	923	369.78813143848333	286.7095108572831	21/02/24 15:38:47
21	923	369.75051917112864	286.66481456474776	21/02/24 15:38:47
21	923	369.70802940854827	286.5360984883282	21/02/24 15:38:47
21	923	369.5443985142716	286.63315928540027	21/02/24 15:38:48
21	923	369.5039940449029	286.66363794719376	21/02/24 15:38:48
21	923	369.48881681045964	286.6655399035183	21/02/24 15:38:48
21	923	369.65496017553403	286.69538407738037	21/02/24 15:38:48
21	923	369.6539558422651	286.69654220068514	21/02/24 15:38:48
21	923	369.79417722142114	286.86876911286527	21/02/24 15:38:48
21	923	369.7533510380159	287.1291876827025	21/02/24 15:38:48
21	923	369.86171067591914	287.23693269574085	21/02/24 15:38:48
21	923	369.94875906188014	287.23843699375874	21/02/24 15:38:48
21	923	369.803691924865	287.30511511038696	21/02/24 15:38:49
21	923	369.6351279577763	287.1564578533474	21/02/24 15:38:49
21	923	369.3833902862829	287.0944083287821	21/02/24 15:38:49
21	923	369.3965188750527	287.10041028183406	21/02/24 15:38:49
21	923	369.36834059011676	287.0858781656854	21/02/24 15:38:49
21	923	369.38245741602657	287.00458075585016	21/02/24 15:38:49
21	923	369.3502032833477	287.07488947571545	21/02/24 15:38:49
21	923	369.3231503380047	287.05963398793125	21/02/24 15:38:49
21	923	369.2719959269752	286.9937146847938	21/02/24 15:38:49
21	923	369.28369780496206	286.95262921591956	21/02/24 15:38:49
21	923	369.2553548814554	287.0945894835746	21/02/24 15:38:50
21	923	369.4701428584387	287.16646351725444	21/02/24 15:38:50
21	923	369.35775999857253	287.00618966534984	21/02/24 15:38:50
21	923	369.25942036914137	286.9683286956628	21/02/24 15:38:50
21	923	369.38170230021535	287.0857186300672	21/02/24 15:38:50
21	923	369.35639652183863	287.06912439882507	21/02/24 15:38:50
21	923	369.2885918099921	286.9705320991058	21/02/24 15:38:50
21	923	369.2767568590617	286.93159161316845	21/02/24 15:38:50
21	923	369.3830227983455	286.959992193992	21/02/24 15:38:50
21	923	369.66761718864876	286.8669365636471	21/02/24 15:38:50
21	923	369.58908499868664	287.00169458465797	21/02/24 15:38:51
21	923	369.55546617937375	287.0687778255291	21/02/24 15:38:51
21	923	369.84736187435834	287.03358888516425	21/02/24 15:38:51
21	923	369.88258503290393	287.3218230051272	21/02/24 15:38:51
21	923	369.88853900077146	287.3048465191758	21/02/24 15:38:51
21	923	369.8878609109765	287.5874591810597	21/02/24 15:38:51
21	923	369.80440196328203	287.59544487219483	21/02/24 15:38:51
21	923	369.88593807066457	287.6106346885962	21/02/24 15:38:51
21	923	369.7979186861337	287.7564274865127	21/02/24 15:38:51
21	923	369.7007533538205	287.7136275870323	21/02/24 15:38:52
21	923	369.6114757623223	287.9509779684528	21/02/24 15:38:52
21	923	369.6089780256343	287.9586040175106	21/02/24 15:38:52
21	923	369.44919101344095	288.10384533279546	21/02/24 15:38:52
21	923	369.63144276591663	288.2636502078445	21/02/24 15:38:52
21	923	369.5989316726791	288.23928540773784	21/02/24 15:38:52
21	923	369.3653260470983	288.25312495167384	21/02/24 15:38:52
21	923	369.2882797935765	288.2659379807975	21/02/24 15:38:52
21	923	369.4408706769231	288.2251853134341	21/02/24 15:38:52
21	923	369.46433210101435	288.0125064747096	21/02/24 15:38:52
21	923	369.52753811948406	287.83899233725657	21/02/24 15:38:53
21	923	369.561377800032	287.6887964149336	21/02/24 15:38:53
21	923	369.5170811631277	287.53149317044983	21/02/24 15:38:53
21	923	369.29721405185643	287.3846262846299	21/02/24 15:38:53
21	923	369.23931505072665	287.3621977054421	21/02/24 15:38:53
21	923	368.9973894929361	287.313927894331	21/02/24 15:38:53
21	923	369.00865245468196	287.3982552130359	21/02/24 15:38:53
21	923	369.0697574067488	287.4044029926044	21/02/24 15:38:53
21	923	369.27615383386393	287.4652313150117	21/02/24 15:38:53
21	923	369.1408803258428	287.25435762267034	21/02/24 15:38:53
21	923	369.1119827518158	287.16904928744674	21/02/24 15:38:54
21	923	369.2358846881886	287.07879587312294	21/02/24 15:38:54
21	923	369.05502524986395	287.00487780448543	21/02/24 15:38:54
21	923	368.9448993891789	287.2139315532114	21/02/24 15:38:54
21	923	368.96652523624437	287.1872691461494	21/02/24 15:38:54
21	923	369.0291851333477	287.0709940537212	21/02/24 15:38:54
21	923	368.85443826558657	287.081559134122	21/02/24 15:38:54
21	923	369.02221677952343	286.888316325789	21/02/24 15:38:54
21	923	369.01713520270823	286.8802895893345	21/02/24 15:38:54
21	923	368.94887683266614	286.8359999300634	21/02/24 15:38:55
21	923	369.0277480850949	286.7656326325892	21/02/24 15:38:55
21	923	369.01717368011157	286.8731777174172	21/02/24 15:38:55
21	923	369.0379990255415	287.03903263612574	21/02/24 15:38:55
21	923	369.0282197201791	286.83842189223634	21/02/24 15:38:55
21	923	369.18646896727586	286.8994787049545	21/02/24 15:38:55
21	923	369.08538094336893	286.7439874344118	21/02/24 15:38:55
21	923	369.08535205487806	286.8097117724637	21/02/24 15:38:55
21	923	369.0788132734447	286.8432587444293	21/02/24 15:38:55
21	923	369.13642473267277	286.8135454451611	21/02/24 15:38:55
21	923	369.19551038041664	286.83650026493257	21/02/24 15:38:56
21	923	369.45678883018786	286.70783208956135	21/02/24 15:38:56
21	923	369.39552255588245	286.5809735825016	21/02/24 15:38:56
21	923	369.38279823167767	286.41784626662997	21/02/24 15:38:56
21	923	369.2959433868872	286.355708819493	21/02/24 15:38:56
21	923	369.22300447749035	286.19959491084336	21/02/24 15:38:56
21	923	369.1384075827148	286.07405113788394	21/02/24 15:38:56
21	923	369.11368067772156	286.15208109878336	21/02/24 15:38:56
21	923	369.29783061798685	286.3392698844924	21/02/24 15:38:56
21	923	369.3755619123467	286.25448976538087	21/02/24 15:38:56
21	923	369.2671839430791	286.43387739323606	21/02/24 15:38:57
21	923	369.2671839430791	286.43387739323606	21/02/24 15:38:57
21	923	369.2671839430791	286.43387739323606	21/02/24 15:38:57
21	923	369.3026678557232	286.41477120385775	21/02/24 15:38:57
21	923	369.3510993975966	286.4658530114426	21/02/24 15:38:57
21	923	369.5834698137592	286.30007643584196	21/02/24 15:38:57
21	923	369.4537316062396	286.1818330947028	21/02/24 15:38:57
21	923	369.3491979587222	286.33756067331797	21/02/24 15:38:57
21	923	369.35751167038126	286.3609107415581	21/02/24 15:38:57
21	923	369.37490697542796	286.36991108191984	21/02/24 15:38:58
21	923	369.3230122902014	286.5941210586177	21/02/24 15:38:58
21	923	369.54091176210255	286.5724453813838	21/02/24 15:38:58
21	923	369.75920292091143	286.73488947856765	21/02/24 15:38:58
21	923	369.85474915196244	286.6808964388751	21/02/24 15:38:58
21	923	369.8546874576033	286.6814062179363	21/02/24 15:38:58
21	923	370.0930947365983	286.6474110607304	21/02/24 15:38:58
21	923	369.91666812392583	286.4615595169144	21/02/24 15:38:58
21	923	369.90278678356447	286.4703570351211	21/02/24 15:38:58
21	923	369.93916583791423	286.41899650825616	21/02/24 15:38:58
21	923	369.77411524336463	286.5447961893595	21/02/24 15:38:59
21	923	369.7818140402362	286.5257427863103	21/02/24 15:38:59
21	923	369.6874422095907	286.55526430048536	21/02/24 15:38:59
21	923	369.62597208210224	286.57223940449813	21/02/24 15:38:59
21	923	369.6326519887227	286.5675701380224	21/02/24 15:38:59
21	923	369.584011085054	286.6316810393688	21/02/24 15:38:59
21	923	369.51315602928616	286.886217994905	21/02/24 15:38:59
21	923	369.3844525079749	287.0001612593236	21/02/24 15:38:59
21	923	369.5686083246904	287.1626334614892	21/02/24 15:38:59
21	923	369.57778134306534	287.1635045237195	21/02/24 15:38:59
21	923	369.86786883816154	287.1961101594073	21/02/24 15:39:00
21	923	369.6656304183594	287.2201811327117	21/02/24 15:39:00
21	923	369.5963989811481	287.22778136953457	21/02/24 15:39:00
21	923	369.6231899850157	287.16408666801334	21/02/24 15:39:00
21	923	369.35095002094977	287.28093745149846	21/02/24 15:39:00
21	923	369.34617755373193	287.2837878093731	21/02/24 15:39:00
21	923	369.3248588021175	287.52815625096616	21/02/24 15:39:00
21	923	369.48725635738253	287.6302790889377	21/02/24 15:39:00
21	923	369.4120914528445	287.4674178779613	21/02/24 15:39:00
21	923	369.155084240003	287.6126459333756	21/02/24 15:39:00
21	923	368.91113503919803	287.5097368776908	21/02/24 15:39:01
21	923	369.0127615383234	287.4407074223004	21/02/24 15:39:01
21	923	369.1160645570086	287.5263406367506	21/02/24 15:39:01
21	923	369.11793299068995	287.54423208028163	21/02/24 15:39:01
21	923	369.28865257708026	287.5783516960671	21/02/24 15:39:01
21	923	369.2662631792329	287.66022113968734	21/02/24 15:39:01
21	923	369.33075494237903	287.59370737652495	21/02/24 15:39:01
21	923	369.36360869555216	287.49415245770507	21/02/24 15:39:01
21	923	369.2868518284392	287.76174051669636	21/02/24 15:39:01
21	923	369.34687868623485	287.62559837495604	21/02/24 15:39:02
21	923	369.5707224649342	287.63069719194385	21/02/24 15:39:02
21	923	369.61657413457647	287.66323267700875	21/02/24 15:39:02
21	923	369.7193384698631	287.6372092815833	21/02/24 15:39:02
21	923	369.9720809703058	287.68287741891356	21/02/24 15:39:02
21	923	369.90068768965114	287.60763791766874	21/02/24 15:39:02
21	923	369.98368065513125	287.4923419944112	21/02/24 15:39:02
21	923	370.05042412265396	287.33851330898136	21/02/24 15:39:02
21	923	370.11618362758634	287.1201266392939	21/02/24 15:39:02
21	923	370.2069641729475	286.95891861726597	21/02/24 15:39:02
21	923	370.09447422474585	286.87683257450067	21/02/24 15:39:03
21	923	370.2957600788848	286.8141272232909	21/02/24 15:39:03
21	923	370.4784254566981	286.8025103485687	21/02/24 15:39:03
21	923	370.73182409035616	286.6683632259654	21/02/24 15:39:03
21	923	370.75735825345953	286.5005451265373	21/02/24 15:39:03
21	923	370.6430785894039	286.615189598798	21/02/24 15:39:03
21	923	370.6474152002786	286.63531339185306	21/02/24 15:39:03
21	923	370.67620803805846	286.662864614973	21/02/24 15:39:03
21	923	370.61934111422005	286.901831824061	21/02/24 15:39:03
21	923	370.66679771622665	286.84145176997225	21/02/24 15:39:03
21	923	370.5901450497839	286.7869956654785	21/02/24 15:39:04
21	923	370.8004664578514	286.6813918558633	21/02/24 15:39:04
21	923	370.7224160246375	286.52078021356124	21/02/24 15:39:04
21	923	370.6210034314408	286.327069455034	21/02/24 15:39:04
21	923	370.7490104783971	286.4087875722361	21/02/24 15:39:04
21	923	370.81118128884776	286.64613276594264	21/02/24 15:39:04
21	923	370.7649969656062	286.745144059383	21/02/24 15:39:04
21	923	370.75002362594046	286.51553729366555	21/02/24 15:39:04
21	923	370.7214049339568	286.221167393225	21/02/24 15:39:04
21	923	370.5911770036254	286.2804810789791	21/02/24 15:39:05
21	923	370.7865408085954	286.26646735037684	21/02/24 15:39:05
21	923	370.9500110634004	286.2851780636359	21/02/24 15:39:05
21	923	371.2075640093097	286.3272115605566	21/02/24 15:39:05
21	923	371.1293243274349	286.4233001197531	21/02/24 15:39:05
21	923	370.89687416193715	286.4110764233884	21/02/24 15:39:05
21	923	370.88942325251	286.1764601108868	21/02/24 15:39:05
21	923	371.07043251136986	286.16466491051165	21/02/24 15:39:05
21	923	370.8529471837162	286.24162340562106	21/02/24 15:39:05
21	923	370.9886871501179	286.05782636842446	21/02/24 15:39:05
21	923	371.1303932972227	286.18497021904636	21/02/24 15:39:06
21	923	371.0744683370405	286.329972575534	21/02/24 15:39:06
21	923	371.1067086974903	286.35316838371887	21/02/24 15:39:06
21	923	371.2692320683379	286.59028806087076	21/02/24 15:39:06
21	923	371.22653232661844	286.6287646887671	21/02/24 15:39:06
21	923	371.32005295239026	286.5317599447073	21/02/24 15:39:06
21	923	371.15380341445194	286.3070077023026	21/02/24 15:39:06
21	923	370.9373827480333	286.3756979825419	21/02/24 15:39:06
21	923	370.7143101624126	286.2144128126424	21/02/24 15:39:06
21	923	370.76080927812234	286.199500209741	21/02/24 15:39:06
21	923	370.9200473225491	286.1039728399788	21/02/24 15:39:07
21	923	370.9266452934203	286.1502415986081	21/02/24 15:39:07
21	923	370.9596110156333	285.9608309628191	21/02/24 15:39:07
21	923	370.904746257952	285.96363827000886	21/02/24 15:39:07
21	923	370.93069626740237	286.1165551005476	21/02/24 15:39:07
21	923	370.9133696831842	285.86451149990586	21/02/24 15:39:07
21	923	371.0818965503577	285.746757656671	21/02/24 15:39:07
21	923	371.30832563537973	285.93600701860527	21/02/24 15:39:07
21	923	371.33921848487415	286.18154516825524	21/02/24 15:39:07
21	923	371.38164144867187	286.0734186930103	21/02/24 15:39:07
21	923	371.44400547812745	285.98470358879666	21/02/24 15:39:08
21	923	371.44048190707787	285.9932020516133	21/02/24 15:39:08
21	923	371.41166834839635	285.9709847636934	21/02/24 15:39:08
21	923	371.40903103140346	285.96458413099197	21/02/24 15:39:08
21	923	371.41187309657334	285.84111241401416	21/02/24 15:39:08
21	923	371.435609098616	285.9343957757265	21/02/24 15:39:08
21	923	371.5119891534689	285.86939479281114	21/02/24 15:39:08
21	923	371.55917757946054	285.88943427018506	21/02/24 15:39:08
21	923	371.52003373355456	285.71142130863706	21/02/24 15:39:08
21	923	371.2904099582972	285.6983896764893	21/02/24 15:39:09
21	923	371.3530776673957	285.6071197775213	21/02/24 15:39:09
21	923	371.5853235919849	285.5189908335906	21/02/24 15:39:09
21	923	371.5637120883705	285.3684534283744	21/02/24 15:39:09
21	923	371.44134908513774	285.555700207271	21/02/24 15:39:09
21	923	371.43516822643636	285.54612082100283	21/02/24 15:39:09
21	923	371.4525395813532	285.3474155981861	21/02/24 15:39:09
21	923	371.4812887271257	285.33621443381963	21/02/24 15:39:09
21	923	371.5190906605229	285.3030898058881	21/02/24 15:39:09
21	923	371.5066020721779	285.25673424038484	21/02/24 15:39:09
21	923	371.5199391179951	285.3574700207463	21/02/24 15:39:10
21	923	371.4269555368221	285.18961464222593	21/02/24 15:39:10
21	923	371.51953456953635	285.2822020815418	21/02/24 15:39:10
21	923	371.47464954029385	285.1401131322426	21/02/24 15:39:10
21	923	371.2588013621852	285.0319240975705	21/02/24 15:39:10
21	923	371.28986972458205	285.0323413516372	21/02/24 15:39:10
21	923	371.4489780167023	285.065614923777	21/02/24 15:39:10
21	923	371.4704036997828	285.0105913877678	21/02/24 15:39:10
21	923	371.6883886167492	284.9687438796261	21/02/24 15:39:10
21	923	371.67795266589894	285.0523483175203	21/02/24 15:39:10
21	923	371.56290173061774	284.97801018032834	21/02/24 15:39:11
21	923	371.6615642587229	285.07522582984194	21/02/24 15:39:11
21	923	371.43963463526666	285.0159854161131	21/02/24 15:39:11
21	923	371.5296214006815	284.8385933323984	21/02/24 15:39:11
21	923	371.60124939941664	284.63278235636056	21/02/24 15:39:11
21	923	371.7162471832888	284.85107459309666	21/02/24 15:39:11
21	923	371.9641658091842	284.95410790024	21/02/24 15:39:11
21	923	371.98219208132383	284.97855015476557	21/02/24 15:39:11
21	923	371.9791871653653	284.9822814879779	21/02/24 15:39:11
21	923	372.00102181736156	284.91451195521887	21/02/24 15:39:12
21	923	371.97707050834947	284.71787681366993	21/02/24 15:39:12
21	923	371.9934035428163	284.5984287183837	21/02/24 15:39:12
21	923	371.99712924549544	284.6003382338286	21/02/24 15:39:12
21	923	372.0794622385379	284.64912463950867	21/02/24 15:39:12
21	923	372.09270143279974	284.64903587498554	21/02/24 15:39:12
21	923	372.269727428748	284.5878375903613	21/02/24 15:39:12
21	923	372.218796126567	284.35623619481333	21/02/24 15:39:12
21	923	372.0889195720572	284.3378852883913	21/02/24 15:39:12
21	923	371.86095200536556	284.1685833030397	21/02/24 15:39:12
21	923	371.9073303430023	284.1401607905874	21/02/24 15:39:13
21	923	371.9102008647182	284.1488300669394	21/02/24 15:39:13
21	923	371.90809331435844	284.2234660944909	21/02/24 15:39:13
21	923	371.90214857860235	284.2292900399923	21/02/24 15:39:13
21	923	371.9830333881549	284.126714612385	21/02/24 15:39:13
21	923	371.97223588692776	284.0357123531144	21/02/24 15:39:13
21	923	372.03303690667497	284.01851563752524	21/02/24 15:39:13
21	923	371.8610387456286	284.0057695989479	21/02/24 15:39:13
21	923	372.1415225844807	284.1058718677933	21/02/24 15:39:13
21	923	372.0829291919856	284.0898269894794	21/02/24 15:39:13
21	923	372.0750139160756	284.02593626295004	21/02/24 15:39:14
21	923	372.10745695896225	284.0168763281172	21/02/24 15:39:14
21	923	372.10745695896225	284.0168763281172	21/02/24 15:39:14
21	923	372.10765504482464	284.1716216228928	21/02/24 15:39:14
21	923	372.10765504482464	284.1716216228928	21/02/24 15:39:14
21	923	372.0532754934605	284.03436296939867	21/02/24 15:39:14
21	923	371.8837385155575	283.78894163555236	21/02/24 15:39:14
21	923	372.07980716135177	283.6808119069275	21/02/24 15:39:14
21	923	372.03540398076706	283.8795307381049	21/02/24 15:39:14
21	923	371.9854228545665	283.9139942104044	21/02/24 15:39:15
21	923	372.0193054110456	283.695504020189	21/02/24 15:39:15
21	923	372.1431482872054	283.8286478608455	21/02/24 15:39:15
21	923	372.1768163511014	283.8863964035028	21/02/24 15:39:15
21	923	372.2211145831937	283.89033423623744	21/02/24 15:39:15
21	923	372.22840544963475	284.1267564172698	21/02/24 15:39:15
21	923	372.2236270442409	284.13021264163586	21/02/24 15:39:15
21	923	372.081590132663	284.30739126973236	21/02/24 15:39:15
21	923	372.01202510565395	284.14088229779054	21/02/24 15:39:15
21	923	372.13802307347623	284.25182030131936	21/02/24 15:39:15
21	923	372.2866577658231	284.257017198678	21/02/24 15:39:16
21	923	372.1844411334656	284.48919417216666	21/02/24 15:39:16
21	923	372.1989993589594	284.596634889594	21/02/24 15:39:16
21	923	372.1797428548572	284.5401803274852	21/02/24 15:39:16
21	923	372.15449710593305	284.5444892003084	21/02/24 15:39:16
21	923	372.1693049189674	284.76287059176576	21/02/24 15:39:16
21	923	372.02220427936567	284.9754809915228	21/02/24 15:39:16
21	923	372.0235863105766	284.9646431671014	21/02/24 15:39:16
21	923	372.2431740460633	285.09981770476776	21/02/24 15:39:16
21	923	372.1993685163354	284.8756077244598	21/02/24 15:39:16
21	923	372.0938381689155	285.08197801529	21/02/24 15:39:17
21	923	372.1170500027568	285.15694276292146	21/02/24 15:39:17
21	923	372.0191766313718	284.9548701720673	21/02/24 15:39:17
21	923	372.16181747695924	284.8145820991257	21/02/24 15:39:17
21	923	372.2108125929802	284.7062555762121	21/02/24 15:39:17
21	923	372.2108125929802	284.7062555762121	21/02/24 15:39:17
21	923	372.04472749392465	284.8688601518597	21/02/24 15:39:17
21	923	371.84692029886446	284.7881483269888	21/02/24 15:39:17
21	923	371.8042356305012	284.7658293988442	21/02/24 15:39:17
21	923	371.8108304785052	284.7324926332282	21/02/24 15:39:18
21	923	371.85511968155447	284.7027977001014	21/02/24 15:39:18
21	923	371.7789294161101	284.7135829845215	21/02/24 15:39:18
21	923	371.5367776981269	284.7070489344899	21/02/24 15:39:18
21	923	371.5367776981269	284.7070489344899	21/02/24 15:39:18
21	923	371.65129654269526	284.9571660184717	21/02/24 15:39:18
21	923	371.7221531874124	285.0185306690393	21/02/24 15:39:18
21	923	371.83905249173364	285.0994512407697	21/02/24 15:39:18
21	923	371.8321208484809	285.3501498537145	21/02/24 15:39:18
21	923	371.8321208484809	285.3501498537145	21/02/24 15:39:18
21	923	371.8429663952008	285.321055721366	21/02/24 15:39:19
21	923	371.80090898285937	285.4406427939188	21/02/24 15:39:19
21	923	372.08471540584975	285.3829791855796	21/02/24 15:39:19
21	923	371.89338573505756	285.40712159241167	21/02/24 15:39:19
21	923	372.00785530881194	285.2815605509021	21/02/24 15:39:19
21	923	372.14728550006294	285.32485420939486	21/02/24 15:39:19
21	923	372.136047020632	285.6092389507425	21/02/24 15:39:19
21	923	372.13795449399566	285.6159414331587	21/02/24 15:39:19
21	923	372.088750596949	285.63204666596596	21/02/24 15:39:19
21	923	372.04676334920845	285.6953237126596	21/02/24 15:39:19
21	923	372.0524580412209	285.75013970328513	21/02/24 15:39:20
21	923	372.2242772300671	285.6365334441357	21/02/24 15:39:20
21	923	372.22770150785743	285.7573994510166	21/02/24 15:39:20
21	923	372.24970902608135	285.74924216294386	21/02/24 15:39:20
21	923	372.3478888434943	285.5249839595381	21/02/24 15:39:20
21	923	372.31352771858695	285.51914793065777	21/02/24 15:39:20
21	923	372.2271396786913	285.52075125468366	21/02/24 15:39:20
21	923	372.1484455782182	285.6755883571611	21/02/24 15:39:20
21	923	372.0903514722355	285.6805371155773	21/02/24 15:39:20
21	923	371.8937863672965	285.5303099040926	21/02/24 15:39:21
21	923	371.92751888089117	285.62629457085	21/02/24 15:39:21
21	923	371.82282236179486	285.75510201276256	21/02/24 15:39:21
21	923	371.5307077384389	285.78983229028825	21/02/24 15:39:21
21	923	371.3666486539839	285.7998668594583	21/02/24 15:39:21
21	923	371.29884025846553	285.7701552562399	21/02/24 15:39:21
21	923	371.14519836325553	285.8481013442565	21/02/24 15:39:21
21	923	371.1452836900615	285.8100601976332	21/02/24 15:39:21
21	923	371.22321909547986	285.8857494277142	21/02/24 15:39:21
21	923	371.0057679546834	285.77418734205565	21/02/24 15:39:21
21	923	371.0057679546834	285.77418734205565	21/02/24 15:39:22
21	923	370.8941769317896	285.91581863654363	21/02/24 15:39:22
21	923	370.95598723753824	285.9203822144423	21/02/24 15:39:22
21	923	370.69215449816363	285.90186428578954	21/02/24 15:39:22
21	923	370.5843118403475	285.90780221339054	21/02/24 15:39:22
21	923	370.6371047574958	286.1277915139464	21/02/24 15:39:22
21	923	370.86557822385623	286.151953576981	21/02/24 15:39:22
21	923	370.915382153414	286.10058583710145	21/02/24 15:39:22
21	923	370.5617823947393	285.8208582170509	21/02/24 15:39:22
21	923	370.5827979770524	285.8356720200126	21/02/24 15:39:22
21	923	370.5827979770524	285.8356720200126	21/02/24 15:39:23
21	923	370.76098259969814	285.640543449679	21/02/24 15:39:23
21	923	370.7652143521153	285.6006104927889	21/02/24 15:39:23
21	923	370.7652143521153	285.6006104927889	21/02/24 15:39:23
21	923	370.88608707093	285.5589236115366	21/02/24 15:39:23
21	923	371.01956515382824	285.81439239666406	21/02/24 15:39:23
21	923	370.8516179346732	285.8638758964745	21/02/24 15:39:23
21	923	371.1245033340964	285.9483269381097	21/02/24 15:39:23
21	923	371.380372674695	285.99457652795263	21/02/24 15:39:23
21	923	371.3590085605547	286.16489487676176	21/02/24 15:39:24
21	923	371.345554604448	286.44494202648065	21/02/24 15:39:24
21	923	371.345554604448	286.44494202648065	21/02/24 15:39:24
21	923	371.2396773430734	286.2368857821273	21/02/24 15:39:24
21	923	371.1523853572856	286.14755396265497	21/02/24 15:39:24
21	923	371.2815914730454	285.97620496308735	21/02/24 15:39:24
21	923	371.1812697587788	285.8384724941839	21/02/24 15:39:24
21	923	371.10320601436626	285.9348437134343	21/02/24 15:39:24
21	923	371.06372388536687	286.11933473233086	21/02/24 15:39:24
21	923	371.11686755670524	286.09782881299554	21/02/24 15:39:24
21	923	370.9672325550898	286.0406287621625	21/02/24 15:39:25
21	923	371.16714053049384	286.18250954591866	21/02/24 15:39:25
21	923	371.2066826640335	286.1532209759792	21/02/24 15:39:25
21	923	371.39877781564667	286.0761368225204	21/02/24 15:39:25
21	923	371.3959712197519	286.37468258716615	21/02/24 15:39:25
21	923	371.3959712197519	286.37468258716615	21/02/24 15:39:25
21	923	371.3959712197519	286.37468258716615	21/02/24 15:39:25
21	923	371.37713056565286	286.1387402807929	21/02/24 15:39:25
21	923	371.36660487609674	286.31500516774196	21/02/24 15:39:25
21	923	371.51173134414853	286.3992948594545	21/02/24 15:39:25
21	923	371.5229946197958	286.34388683825637	21/02/24 15:39:26
21	923	371.5781418932348	286.3748795508221	21/02/24 15:39:26
21	923	371.6199902877595	286.2333497064371	21/02/24 15:39:26
21	923	371.6198987361061	286.2334914148888	21/02/24 15:39:26
21	923	371.5432602809373	286.2504743025892	21/02/24 15:39:26
21	923	371.5432602809373	286.2504743025892	21/02/24 15:39:26
21	923	371.42273807673314	286.16001673395925	21/02/24 15:39:26
21	923	371.4200726993363	286.1580272051716	21/02/24 15:39:26
21	923	371.2770208251806	286.2170622148162	21/02/24 15:39:26
21	923	371.2770208251806	286.2170622148162	21/02/24 15:39:27
21	923	371.058365580278	286.2777083317123	21/02/24 15:39:27
21	923	371.024415739857	286.3563111314527	21/02/24 15:39:27
21	923	370.9775722824608	286.24189968686204	21/02/24 15:39:27
21	923	371.134484879532	286.3291604085429	21/02/24 15:39:27
21	923	371.36172579106767	286.35331901782104	21/02/24 15:39:27
21	923	371.36172579106767	286.35331901782104	21/02/24 15:39:27
21	923	371.4680565247671	286.4434327012693	21/02/24 15:39:27
21	923	371.5172915275506	286.66672532705854	21/02/24 15:39:27
21	923	371.62634175481617	286.55735835085534	21/02/24 15:39:27
21	923	371.62946791463077	286.54145148628913	21/02/24 15:39:28
21	923	371.6382025176381	286.56119773615245	21/02/24 15:39:28
21	923	371.5334465687454	286.3696173191688	21/02/24 15:39:28
21	923	371.758297658143	286.279607290149	21/02/24 15:39:28
21	923	371.789653371741	286.33121878422486	21/02/24 15:39:28
21	923	371.77928326037676	286.32075875106045	21/02/24 15:39:28
21	923	371.7109815398613	286.0277992096254	21/02/24 15:39:28
21	923	371.7838172575872	285.9862458196579	21/02/24 15:39:28
21	923	371.58155535191855	286.16984120404004	21/02/24 15:39:28
21	923	371.6733049696224	286.20091315342023	21/02/24 15:39:29
21	923	371.77145565628587	286.0636380686964	21/02/24 15:39:29
21	923	371.7079034946247	286.1380210687018	21/02/24 15:39:29
21	923	371.7628749325577	286.27541712096803	21/02/24 15:39:29
21	923	371.7628749325577	286.27541712096803	21/02/24 15:39:29
21	923	371.67028537324524	286.27201336610017	21/02/24 15:39:29
21	923	371.44680818895733	286.2405209511999	21/02/24 15:39:29
21	923	371.5516765468113	286.21935057888504	21/02/24 15:39:29
21	923	371.5389094728193	286.217978268029	21/02/24 15:39:29
21	923	371.53508634868706	286.2262325201728	21/02/24 15:39:29
21	923	371.66612566284374	286.2186038677797	21/02/24 15:39:30
21	923	371.5971416933058	286.32516730007563	21/02/24 15:39:30
21	923	371.72526797507373	286.3918031726274	21/02/24 15:39:30
21	923	371.5926314994053	286.3668324701509	21/02/24 15:39:30
21	923	371.6999058431437	286.16974046729905	21/02/24 15:39:30
21	923	371.6999058431437	286.16974046729905	21/02/24 15:39:30
21	923	371.6999058431437	286.16974046729905	21/02/24 15:39:30
21	923	371.6607953190739	286.31937673883374	21/02/24 15:39:30
21	923	371.6927325377567	286.24995506617495	21/02/24 15:39:30
21	923	371.66246302102866	286.37315970297715	21/02/24 15:39:30
21	923	371.41282968218616	286.43937267331216	21/02/24 15:39:31
21	923	371.22913682554326	286.32256192476586	21/02/24 15:39:31
21	923	371.06595486994365	286.33471552895435	21/02/24 15:39:31
21	923	371.0387821439611	286.1010924495542	21/02/24 15:39:31
21	923	371.07220943531723	286.0927296795937	21/02/24 15:39:31
21	923	371.1136973972311	285.8846076319731	21/02/24 15:39:31
21	923	371.3237023248073	286.0975140984466	21/02/24 15:39:31
21	923	371.57177723631867	286.28332122422677	21/02/24 15:39:31
21	923	371.6584004484829	286.3010124593699	21/02/24 15:39:31
21	923	371.6384841106584	286.2844408513	21/02/24 15:39:32
21	923	371.6384841106584	286.2844408513	21/02/24 15:39:32
21	923	371.63989162198675	286.3918347927241	21/02/24 15:39:32
21	923	371.75563807419405	286.4890513909214	21/02/24 15:39:32
21	923	371.795108642237	286.69687048334214	21/02/24 15:39:32
21	923	371.57804139668775	286.55996865828695	21/02/24 15:39:32
21	923	371.57804139668775	286.55996865828695	21/02/24 15:39:32
21	923	371.56075673344145	286.62968286455754	21/02/24 15:39:32
21	923	371.47663262534564	286.7768495006454	21/02/24 15:39:32
21	923	371.3941681657347	286.6003872258474	21/02/24 15:39:32
21	923	371.27025812623174	286.6278968134805	21/02/24 15:39:33
21	923	371.27025812623174	286.6278968134805	21/02/24 15:39:33
21	923	371.54282584802166	286.54572952412957	21/02/24 15:39:33
21	923	371.54082874898273	286.33072684764767	21/02/24 15:39:33
21	923	371.27661358699106	286.29163345370955	21/02/24 15:39:33
21	923	371.2968032133321	286.2850062311078	21/02/24 15:39:33
21	923	371.25699323678975	286.30504304778856	21/02/24 15:39:33
21	923	371.0419295559893	286.28596012517875	21/02/24 15:39:33
21	923	371.16337835337487	286.5095550944294	21/02/24 15:39:33
21	923	371.1004494140041	286.559572832055	21/02/24 15:39:34
21	923	371.08142091000667	286.2877192447231	21/02/24 15:39:34
21	923	370.8544678808945	286.15917361262603	21/02/24 15:39:34
21	923	370.6377639414931	286.1462122735441	21/02/24 15:39:34
21	923	370.6596582716255	286.2618096629926	21/02/24 15:39:34
21	923	370.6444518577342	286.26211288675563	21/02/24 15:39:34
21	923	370.6095028251765	286.28274676013285	21/02/24 15:39:34
21	923	370.7334827513651	286.02190624836953	21/02/24 15:39:34
21	923	370.68359836243684	286.3111888336206	21/02/24 15:39:34
21	923	370.7599924513674	286.5153964062048	21/02/24 15:39:34
21	923	370.76158060353583	286.50090304690684	21/02/24 15:39:35
21	923	370.49726010197674	286.4395365504624	21/02/24 15:39:35
21	923	370.3989772755024	286.34815799433136	21/02/24 15:39:35
21	923	370.2347164082881	286.10763644154895	21/02/24 15:39:35
21	923	370.3120667995969	286.0932862152163	21/02/24 15:39:35
21	923	370.246840995012	286.3164710173929	21/02/24 15:39:35
21	923	370.3080527369799	286.48171899712696	21/02/24 15:39:35
21	923	370.1384885299169	286.2586659014596	21/02/24 15:39:35
21	923	370.098919197362	286.25724999625857	21/02/24 15:39:35
21	923	370.08400916057565	286.35998895214436	21/02/24 15:39:35
21	923	370.09110045457567	286.5221017529623	21/02/24 15:39:36
21	923	370.0905331907674	286.5255363409479	21/02/24 15:39:36
21	923	370.272241300416	286.5055659268791	21/02/24 15:39:36
21	923	370.1385196333554	286.5546671416866	21/02/24 15:39:36
21	923	370.30952957013386	286.4070959963131	21/02/24 15:39:36
21	923	370.30861255776705	286.40796457327247	21/02/24 15:39:36
21	923	370.2949690132861	286.55768819057755	21/02/24 15:39:36
21	923	370.2292825026664	286.31684951188447	21/02/24 15:39:36
21	923	370.1292630732832	286.48891739669017	21/02/24 15:39:36
21	923	370.0025122179621	286.68579214069683	21/02/24 15:39:37
21	923	370.00974621336024	286.65885459766173	21/02/24 15:39:37
21	923	370.13944852366865	286.5401685286953	21/02/24 15:39:37
21	923	370.245148163617	286.50244597540694	21/02/24 15:39:37
21	923	370.1526333224902	286.4266802449248	21/02/24 15:39:37
21	923	370.186705262906	286.4821179428799	21/02/24 15:39:37
21	923	370.20383540369994	286.3292550956328	21/02/24 15:39:37
21	923	370.17571454010107	286.2983093684951	21/02/24 15:39:37
21	923	370.203484327613	286.59055196108136	21/02/24 15:39:37
21	923	370.1994864081024	286.5880765616051	21/02/24 15:39:37
21	923	370.323880191101	286.31657582784476	21/02/24 15:39:38
21	923	370.3535219539171	286.37528703253173	21/02/24 15:39:38
21	923	370.3289671871941	286.36752653468363	21/02/24 15:39:38
21	923	370.04452084341153	286.3515725200549	21/02/24 15:39:38
21	923	370.04452084341153	286.3515725200549	21/02/24 15:39:38
21	923	370.04452084341153	286.3515725200549	21/02/24 15:39:38
21	923	370.0430827444744	286.3514787102838	21/02/24 15:39:38
21	923	369.9293970939567	286.3474261410112	21/02/24 15:39:38
21	923	369.9065760682231	286.3261940431189	21/02/24 15:39:38
21	923	369.90552968232555	286.3274403349244	21/02/24 15:39:38
21	923	369.81638010426997	286.3822161058073	21/02/24 15:39:39
21	923	369.86794802995684	286.59112069553936	21/02/24 15:39:39
21	923	369.71369902325506	286.7578127974152	21/02/24 15:39:39
21	923	369.59343664467997	286.790215682224	21/02/24 15:39:39
21	923	369.61088084589903	286.9944689008142	21/02/24 15:39:39
21	923	369.59842109265236	286.8688032772441	21/02/24 15:39:39
21	923	369.8887771864	286.794917778709	21/02/24 15:39:39
21	923	369.85564953725344	286.7460129576558	21/02/24 15:39:39
21	923	369.8197195940378	287.0400303460212	21/02/24 15:39:39
21	923	370.07069145140184	287.0444502402094	21/02/24 15:39:40
21	923	370.13172770429014	287.062251703038	21/02/24 15:39:40
21	923	370.2952108945607	286.9456910803963	21/02/24 15:39:40
21	923	369.99883673279874	286.91212697522826	21/02/24 15:39:40
21	923	370.03282007260725	286.9942048133365	21/02/24 15:39:40
21	923	370.0229673901382	286.92086341528704	21/02/24 15:39:40
21	923	370.0280114535854	286.9501852330988	21/02/24 15:39:40
21	923	370.2543306304238	287.03966895151035	21/02/24 15:39:40
21	923	370.4407715527822	286.909332750026	21/02/24 15:39:40
21	923	370.4350694290274	287.1227988147565	21/02/24 15:39:40
21	923	370.4445769240535	287.0816675930759	21/02/24 15:39:41
21	923	370.21620132848665	287.1730835749085	21/02/24 15:39:41
21	923	370.215504473852	287.14180715182476	21/02/24 15:39:41
21	923	370.50348189021287	287.05921199752237	21/02/24 15:39:41
21	923	370.50348189021287	287.05921199752237	21/02/24 15:39:41
21	923	370.50348189021287	287.05921199752237	21/02/24 15:39:41
21	923	370.5342813174084	287.3563169407004	21/02/24 15:39:41
21	923	370.6223963504728	287.37612041885774	21/02/24 15:39:41
21	923	370.6278417852248	287.37357823620215	21/02/24 15:39:41
21	923	370.75526935979394	287.1663489198606	21/02/24 15:39:41
21	923	370.7210278220503	287.2139822984803	21/02/24 15:39:42
21	923	370.74293586164055	287.2719803870835	21/02/24 15:39:42
21	923	370.7717056541321	287.47386594293084	21/02/24 15:39:42
21	923	370.7588548907534	287.4646322409779	21/02/24 15:39:42
21	923	370.74488991220585	287.47260543454485	21/02/24 15:39:42
21	923	370.7519554581357	287.4632385343053	21/02/24 15:39:42
21	923	370.6246115211455	287.5398882087978	21/02/24 15:39:42
21	923	370.6246115211455	287.5398882087978	21/02/24 15:39:42
21	923	370.56045521368037	287.50802381381106	21/02/24 15:39:42
21	923	370.39411963597865	287.45562990621454	21/02/24 15:39:43
21	923	370.47481634786556	287.3042476696037	21/02/24 15:39:43
21	923	370.47481634786556	287.3042476696037	21/02/24 15:39:43
21	923	370.25380843500807	287.3528801341127	21/02/24 15:39:43
21	923	370.17248013666165	287.31924734641115	21/02/24 15:39:43
21	923	370.301828748709	287.0549962438189	21/02/24 15:39:43
21	923	370.3530784785506	287.0834670357826	21/02/24 15:39:43
21	923	370.42649616747303	287.1561457004826	21/02/24 15:39:43
21	923	370.2978183946918	287.36706582581724	21/02/24 15:39:43
21	923	370.2277277879925	287.5000259394916	21/02/24 15:39:43
21	923	370.16084721901973	287.5099965440832	21/02/24 15:39:44
21	923	370.13522173235594	287.6618708193368	21/02/24 15:39:44
21	923	370.12911076511136	287.6519204001511	21/02/24 15:39:44
21	923	369.85594690075084	287.72677216685787	21/02/24 15:39:44
21	923	369.89801561158515	287.8909204882561	21/02/24 15:39:44
21	923	369.89801561158515	287.8909204882561	21/02/24 15:39:44
21	923	369.9700906277991	288.0026424967623	21/02/24 15:39:44
21	923	369.9700906277991	288.0026424967623	21/02/24 15:39:44
21	923	369.9881877284809	288.000009968561	21/02/24 15:39:44
21	923	369.9582753882944	288.0458697835007	21/02/24 15:39:44
21	923	370.1203986053025	288.11484658318824	21/02/24 15:39:45
21	923	370.29293676302655	288.24985804837337	21/02/24 15:39:45
21	923	370.29544073302924	288.2510272462432	21/02/24 15:39:45
21	923	370.350597852409	288.270861696456	21/02/24 15:39:45
21	923	370.56337511539317	288.3919149644064	21/02/24 15:39:45
21	923	370.55710285948885	288.34893013877183	21/02/24 15:39:45
21	923	370.58883767085024	288.38534846910926	21/02/24 15:39:45
21	923	370.7971616015846	288.5614820091911	21/02/24 15:39:45
21	923	370.79018552222766	288.6451474979479	21/02/24 15:39:45
21	923	370.7783743009694	288.6930752394574	21/02/24 15:39:46
21	923	371.04319717096257	288.6684791926111	21/02/24 15:39:46
21	923	371.21040801438687	288.70163120809116	21/02/24 15:39:46
21	923	371.16770168648105	288.7588334252977	21/02/24 15:39:46
21	923	371.18485149747966	288.60214207720765	21/02/24 15:39:46
21	923	371.34884627852625	288.5648278327877	21/02/24 15:39:46
21	923	371.35055330399257	288.6044294235718	21/02/24 15:39:46
21	923	371.5673753743205	288.55149268996036	21/02/24 15:39:46
21	923	371.5673753743205	288.55149268996036	21/02/24 15:39:46
21	923	371.4590833628821	288.30216151530186	21/02/24 15:39:46
21	923	371.29262845471874	288.365235687382	21/02/24 15:39:47
21	923	371.29262845471874	288.365235687382	21/02/24 15:39:47
21	923	371.16149810648625	288.1117525498965	21/02/24 15:39:47
21	923	371.1554546237338	288.15671687448213	21/02/24 15:39:47
21	923	371.18818377164183	288.0605726980023	21/02/24 15:39:47
21	923	371.18212390150813	288.07175069384357	21/02/24 15:39:47
21	923	371.4572939872957	287.79708535511645	21/02/24 15:39:47
21	923	371.60003176439915	287.90151144870754	21/02/24 15:39:47
21	923	371.4906097056717	288.0821716277347	21/02/24 15:39:47
21	923	371.3691846990256	287.9646807814516	21/02/24 15:39:47
21	923	371.2008244134623	287.9006315436699	21/02/24 15:39:48
21	923	371.17589337700235	287.68263762287773	21/02/24 15:39:48
21	923	371.19533955517596	287.665839912745	21/02/24 15:39:48
21	923	371.27393989658384	287.7781488489387	21/02/24 15:39:48
21	923	370.9861779426763	287.76234155977306	21/02/24 15:39:48
21	923	371.04888368724073	287.79669092486614	21/02/24 15:39:48
21	923	370.93368630237103	287.769875375396	21/02/24 15:39:48
21	923	371.04499236070455	287.7417313223354	21/02/24 15:39:48
21	923	370.93377722513446	287.7550112394218	21/02/24 15:39:48
21	923	370.9630794244482	287.7499436746295	21/02/24 15:39:49
21	923	370.776473890708	287.8790152124037	21/02/24 15:39:49
21	923	370.5051800395723	287.9299081217291	21/02/24 15:39:49
21	923	370.641382906815	287.76791129527663	21/02/24 15:39:49
21	923	370.6208282699866	288.03450797541916	21/02/24 15:39:49
21	923	370.7814924040026	287.86494649419814	21/02/24 15:39:49
21	923	370.8360203924937	287.8941858587454	21/02/24 15:39:49
21	923	370.6917816039131	287.89670277865895	21/02/24 15:39:49
21	923	370.6755885406222	287.97490907369286	21/02/24 15:39:49
21	923	370.40598510790494	288.0434121417934	21/02/24 15:39:49
21	923	370.2865197112419	288.0197858299234	21/02/24 15:39:50
21	923	370.28559938315556	287.90114771654663	21/02/24 15:39:50
21	923	370.245204187715	287.9282631091909	21/02/24 15:39:50
21	923	370.3691739104111	288.04214756164833	21/02/24 15:39:50
21	923	370.38715472529617	288.0011360246114	21/02/24 15:39:50
21	923	370.24870503882926	287.9246376330629	21/02/24 15:39:50
21	923	370.2725391220321	287.92724141667213	21/02/24 15:39:50
21	923	370.32781118049144	288.0009626985963	21/02/24 15:39:50
21	923	370.1450054992157	287.97562437849143	21/02/24 15:39:50
21	923	370.3155348760742	287.9146680492547	21/02/24 15:39:50
21	923	370.3794230804962	287.6988763526461	21/02/24 15:39:51
21	923	370.56792141886996	287.7290173725024	21/02/24 15:39:51
21	923	370.5728781120879	287.69336220243815	21/02/24 15:39:51
21	923	370.4219341281733	287.52992435112844	21/02/24 15:39:51
21	923	370.38366914682797	287.3426982789293	21/02/24 15:39:51
21	923	370.32109682720983	287.4386912352122	21/02/24 15:39:51
21	923	370.35942009085954	287.3852912059432	21/02/24 15:39:51
21	923	370.3335044507306	287.1686981712606	21/02/24 15:39:51
21	923	370.21391509687436	286.97842957302106	21/02/24 15:39:51
21	923	370.1594065004998	287.01823765191506	21/02/24 15:39:52
21	923	370.2464797877003	286.99763901977656	21/02/24 15:39:52
21	923	370.06439558900877	287.0536778555552	21/02/24 15:39:52
21	923	370.00180514216635	286.92668903845276	21/02/24 15:39:52
21	923	370.1000744368842	286.8230099622775	21/02/24 15:39:52
21	923	370.2199577528005	286.7421449610172	21/02/24 15:39:52
21	923	369.9602665657385	286.6089118445868	21/02/24 15:39:52
21	923	370.0981725225811	286.45630255149126	21/02/24 15:39:52
21	923	370.3143033813508	286.3726953338463	21/02/24 15:39:52
21	923	370.3509819074926	286.341557936253	21/02/24 15:39:52
21	923	370.5571495525101	286.2478209063527	21/02/24 15:39:53
21	923	370.5245356783355	286.02469476785535	21/02/24 15:39:53
21	923	370.7521802418138	285.83797927955743	21/02/24 15:39:53
21	923	370.9628440067199	285.762789053637	21/02/24 15:39:53
21	923	370.9723681679027	285.7766073647026	21/02/24 15:39:53
21	923	371.103980878262	285.72033102595066	21/02/24 15:39:53
21	923	370.9588487743556	285.7283268469725	21/02/24 15:39:53
21	923	371.1325870286696	285.81269018508056	21/02/24 15:39:53
21	923	371.1930915616091	285.5653028460798	21/02/24 15:39:53
21	923	370.9742803911187	285.5018129437604	21/02/24 15:39:53
21	923	370.89038488528774	285.34758087156	21/02/24 15:39:54
21	923	370.9887351899251	285.2423758305136	21/02/24 15:39:54
21	923	371.048301256829	285.07201348947297	21/02/24 15:39:54
21	923	371.02407641119703	285.12736464865884	21/02/24 15:39:54
21	923	371.11001858884396	285.3638630252712	21/02/24 15:39:54
21	923	370.831510853357	285.3065793710461	21/02/24 15:39:54
21	923	370.6999279299413	285.1213327158191	21/02/24 15:39:54
21	923	370.6047268598626	285.1726563300229	21/02/24 15:39:54
21	923	370.6047268598626	285.1726563300229	21/02/24 15:39:54
