stationId	t_start	t_end	t_max	timeStamp
98	20/04/28 05:11:55	20/04/28 05:11:55	20/04/28 05:11:55
23	20/04/28 05:11:57	20/04/28 05:17:42	20/04/28 05:17:42
66	20/04/28 05:11:59	20/04/28 05:11:59	20/04/28 05:11:59
11	20/04/28 05:12:01	20/04/28 05:12:01	20/04/28 05:12:01
72	20/04/28 05:12:03	20/04/28 05:12:03	20/04/28 05:12:03
94	20/04/28 05:12:05	20/04/28 05:12:05	20/04/28 05:12:05
86	20/04/28 05:08:53	20/04/28 05:12:07	20/04/28 05:12:07
114	20/04/28 05:12:09	20/04/28 05:12:09	20/04/28 05:12:09
133	20/04/28 05:12:11	20/04/28 05:12:11	20/04/28 05:12:11
12	20/04/28 05:12:13	20/04/28 05:12:13	20/04/28 05:12:13
108	20/04/28 05:12:15	20/04/28 05:12:15	20/04/28 05:12:15
23	20/04/28 05:12:17	20/04/28 05:12:17	20/04/28 05:12:17
14	20/04/28 05:12:19	20/04/28 05:12:19	20/04/28 05:12:19
13	20/04/28 05:12:21	20/04/28 05:12:21	20/04/28 05:12:21
1	20/04/28 05:12:23	20/04/28 05:12:23	20/04/28 05:12:23
86	20/04/28 05:12:25	20/04/28 05:12:25	20/04/28 05:12:25
156	20/04/28 05:12:27	20/04/28 05:12:27	20/04/28 05:12:27
143	20/04/28 05:12:29	20/04/28 05:12:29	20/04/28 05:12:29
143	20/04/28 05:12:31	20/04/28 05:12:32	20/04/28 05:12:32
114	20/04/28 05:12:34	20/04/28 05:12:35	20/04/28 05:12:35
158	20/04/28 05:12:37	20/04/28 05:12:40	20/04/28 05:12:40
154	20/04/28 05:12:42	20/04/28 05:12:43	20/04/28 05:12:43
61	20/04/28 05:12:45	20/04/28 05:12:45	20/04/28 05:12:45
154	20/04/28 05:12:47	20/04/28 05:12:47	20/04/28 05:12:47
154	20/04/28 05:12:49	20/04/28 05:12:50	20/04/28 05:12:49
154	20/04/28 05:12:52	20/04/28 05:12:52	20/04/28 05:12:52
154	20/04/28 05:12:54	20/04/28 05:12:54	20/04/28 05:12:54
156	20/04/28 05:12:56	20/04/28 05:12:56	20/04/28 05:12:56
35	20/04/28 05:12:58	20/04/28 05:12:58	20/04/28 05:12:58
158	20/04/28 05:13:00	20/04/28 05:13:00	20/04/28 05:13:00
114	20/04/28 05:13:02	20/04/28 05:13:02	20/04/28 05:13:02
35	20/04/28 05:13:04	20/04/28 05:13:04	20/04/28 05:13:04
35	20/04/28 05:13:06	20/04/28 05:13:06	20/04/28 05:13:06
35	20/04/28 05:13:08	20/04/28 05:13:08	20/04/28 05:13:08
18	20/04/28 05:13:10	20/04/28 05:13:10	20/04/28 05:13:10
18	20/04/28 05:13:12	20/04/28 05:13:12	20/04/28 05:13:12
18	20/04/28 05:13:14	20/04/28 05:13:14	20/04/28 05:13:14
18	20/04/28 05:13:16	20/04/28 05:13:16	20/04/28 05:13:16
1	20/04/28 05:13:18	20/04/28 05:13:19	20/04/28 05:13:19
28	20/04/28 05:13:21	20/04/28 05:13:21	20/04/28 05:13:21
1	20/04/28 05:13:23	20/04/28 05:13:23	20/04/28 05:13:23
61	20/04/28 05:13:25	20/04/28 05:13:25	20/04/28 05:13:25
64	20/04/28 05:13:27	20/04/28 05:13:27	20/04/28 05:13:27
154	20/04/28 05:13:29	20/04/28 05:13:29	20/04/28 05:13:29
18	20/04/28 05:13:31	20/04/28 05:13:31	20/04/28 05:13:31
33	20/04/28 05:13:33	20/04/28 05:13:33	20/04/28 05:13:33
61	20/04/28 05:13:35	20/04/28 05:13:35	20/04/28 05:13:35
56	20/04/28 05:13:37	20/04/28 05:13:37	20/04/28 05:13:37
108	20/04/28 05:13:39	20/04/28 05:13:39	20/04/28 05:13:39
83	20/04/28 05:13:41	20/04/28 05:13:44	20/04/28 05:13:43
83	20/04/28 05:12:58	20/04/28 05:13:46	20/04/28 05:13:46
83	20/04/28 05:13:48	20/04/28 05:13:49	20/04/28 05:13:49
83	20/04/28 05:13:51	20/04/28 05:13:51	20/04/28 05:13:51
109	20/04/28 05:13:53	20/04/28 05:13:54	20/04/28 05:13:54
55	20/04/28 05:13:56	20/04/28 05:13:56	20/04/28 05:13:56
109	20/04/28 05:13:58	20/04/28 05:13:59	20/04/28 05:13:58
83	20/04/28 05:14:01	20/04/28 05:14:02	20/04/28 05:14:02
45	20/04/28 05:14:04	20/04/28 05:14:04	20/04/28 05:14:04
108	20/04/28 05:14:06	20/04/28 05:14:10	20/04/28 05:14:10
135	20/04/28 05:14:12	20/04/28 05:14:12	20/04/28 05:14:12
55	20/04/28 05:14:14	20/04/28 05:14:14	20/04/28 05:14:14
45	20/04/28 05:14:16	20/04/28 05:14:16	20/04/28 05:14:16
108	20/04/28 05:14:18	20/04/28 05:14:19	20/04/28 05:14:19
64	20/04/28 05:14:21	20/04/28 05:14:21	20/04/28 05:14:21
108	20/04/28 05:14:23	20/04/28 05:14:23	20/04/28 05:14:23
108	20/04/28 05:14:25	20/04/28 05:14:26	20/04/28 05:14:25
108	20/04/28 05:14:28	20/04/28 05:14:29	20/04/28 05:14:28
83	20/04/28 05:14:31	20/04/28 05:14:31	20/04/28 05:14:31
61	20/04/28 05:14:33	20/04/28 05:14:33	20/04/28 05:14:33
56	20/04/28 05:14:35	20/04/28 05:14:35	20/04/28 05:14:35
61	20/04/28 05:14:37	20/04/28 05:14:37	20/04/28 05:14:37
63	20/04/28 05:14:39	20/04/28 05:14:39	20/04/28 05:14:39
1	20/04/28 05:14:41	20/04/28 05:14:42	20/04/28 05:14:42
13	20/04/28 05:14:44	20/04/28 05:14:44	20/04/28 05:14:44
98	20/04/28 05:14:46	20/04/28 05:14:46	20/04/28 05:14:46
44	20/04/28 05:14:48	20/04/28 05:14:48	20/04/28 05:14:48
89	20/04/28 05:14:50	20/04/28 05:14:50	20/04/28 05:14:50
32	20/04/28 05:14:52	20/04/28 05:14:52	20/04/28 05:14:52
142	20/04/28 05:14:54	20/04/28 05:14:54	20/04/28 05:14:54
105	20/04/28 05:14:56	20/04/28 05:14:56	20/04/28 05:14:56
1	20/04/28 05:14:58	20/04/28 05:16:14	20/04/28 05:14:58
41	20/04/28 05:15:00	20/04/28 05:15:00	20/04/28 05:15:00
95	20/04/28 05:15:02	20/04/28 05:15:02	20/04/28 05:15:02
72	20/04/28 05:15:04	20/04/28 05:15:04	20/04/28 05:15:04
65	20/04/28 05:15:06	20/04/28 05:15:06	20/04/28 05:15:06
25	20/04/28 05:15:08	20/04/28 05:15:08	20/04/28 05:15:08
142	20/04/28 05:15:10	20/04/28 05:15:10	20/04/28 05:15:10
103	20/04/28 05:15:12	20/04/28 05:15:12	20/04/28 05:15:12
117	20/04/28 05:15:14	20/04/28 05:15:14	20/04/28 05:15:14
68	20/04/28 05:15:16	20/04/28 05:15:16	20/04/28 05:15:16
142	20/04/28 05:15:18	20/04/28 05:15:18	20/04/28 05:15:18
19	20/04/28 05:15:20	20/04/28 05:15:20	20/04/28 05:15:20
67	20/04/28 05:15:22	20/04/28 05:15:22	20/04/28 05:15:22
24	20/04/28 05:15:24	20/04/28 05:15:24	20/04/28 05:15:24
147	20/04/28 05:15:26	20/04/28 05:15:26	20/04/28 05:15:26
104	20/04/28 05:15:28	20/04/28 05:15:28	20/04/28 05:15:28
87	20/04/28 05:15:30	20/04/28 05:15:30	20/04/28 05:15:30
95	20/04/28 05:15:32	20/04/28 05:15:32	20/04/28 05:15:32
26	20/04/28 05:15:34	20/04/28 05:15:34	20/04/28 05:15:34
78	20/04/28 05:15:36	20/04/28 05:15:36	20/04/28 05:15:36
99	20/04/28 05:15:38	20/04/28 05:15:38	20/04/28 05:15:38
151	20/04/28 05:15:40	20/04/28 05:15:40	20/04/28 05:15:40
130	20/04/28 05:15:42	20/04/28 05:15:42	20/04/28 05:15:42
89	20/04/28 05:15:44	20/04/28 05:15:44	20/04/28 05:15:44
130	20/04/28 05:15:46	20/04/28 05:15:47	20/04/28 05:15:47
126	20/04/28 05:15:49	20/04/28 05:15:49	20/04/28 05:15:49
89	20/04/28 05:15:51	20/04/28 05:15:51	20/04/28 05:15:51
126	20/04/28 05:15:53	20/04/28 05:15:54	20/04/28 05:15:54
125	20/04/28 05:15:56	20/04/28 05:15:57	20/04/28 05:15:57
89	20/04/28 05:15:59	20/04/28 05:15:59	20/04/28 05:15:59
96	20/04/28 05:16:01	20/04/28 05:16:01	20/04/28 05:16:01
91	20/04/28 05:16:03	20/04/28 05:16:03	20/04/28 05:16:03
152	20/04/28 05:16:05	20/04/28 05:16:05	20/04/28 05:16:05
150	20/04/28 05:16:07	20/04/28 05:16:07	20/04/28 05:16:07
5	20/04/28 05:16:09	20/04/28 05:16:09	20/04/28 05:16:09
2	20/04/28 05:16:11	20/04/28 05:16:11	20/04/28 05:16:11
83	20/04/28 05:16:13	20/04/28 05:16:13	20/04/28 05:16:13
109	20/04/28 05:16:15	20/04/28 05:16:15	20/04/28 05:16:15
150	20/04/28 05:16:17	20/04/28 05:16:17	20/04/28 05:16:17
94	20/04/28 05:16:19	20/04/28 05:16:19	20/04/28 05:16:19
151	20/04/28 05:16:21	20/04/28 05:16:21	20/04/28 05:16:21
95	20/04/28 05:16:23	20/04/28 05:16:23	20/04/28 05:16:23
150	20/04/28 05:16:25	20/04/28 05:16:26	20/04/28 05:16:26
95	20/04/28 05:16:28	20/04/28 05:16:28	20/04/28 05:16:28
14	20/04/28 05:16:30	20/04/28 05:16:30	20/04/28 05:16:30
150	20/04/28 05:16:32	20/04/28 05:16:32	20/04/28 05:16:32
83	20/04/28 05:16:34	20/04/28 05:16:34	20/04/28 05:16:34
150	20/04/28 05:16:36	20/04/28 05:16:37	20/04/28 05:16:37
151	20/04/28 05:16:39	20/04/28 05:16:39	20/04/28 05:16:39
94	20/04/28 05:16:41	20/04/28 05:16:41	20/04/28 05:16:41
91	20/04/28 05:16:43	20/04/28 05:16:43	20/04/28 05:16:43
83	20/04/28 05:16:45	20/04/28 05:16:45	20/04/28 05:16:45
71	20/04/28 05:16:48	20/04/28 05:16:48	20/04/28 05:16:48
68	20/04/28 05:16:50	20/04/28 05:16:50	20/04/28 05:16:50
71	20/04/28 05:16:52	20/04/28 05:16:52	20/04/28 05:16:52
18	20/04/28 05:16:54	20/04/28 05:16:54	20/04/28 05:16:54
150	20/04/28 05:16:56	20/04/28 05:16:57	20/04/28 05:16:57
2	20/04/28 05:16:59	20/04/28 05:16:59	20/04/28 05:16:59
94	20/04/28 05:17:01	20/04/28 05:17:01	20/04/28 05:17:01
