stationId	t_start	t_end	t_max	timeStamp
24	20/04/28 05:15:59	20/04/28 05:15:59	20/04/28 05:15:59
24	20/04/28 05:16:01	20/04/28 05:16:01	20/04/28 05:16:01
79	20/04/28 05:16:03	20/04/28 05:16:03	20/04/28 05:16:03
2	20/04/28 05:16:05	20/04/28 05:16:05	20/04/28 05:16:05
129	20/04/28 05:16:07	20/04/28 05:16:07	20/04/28 05:16:07
75	20/04/28 05:16:09	20/04/28 05:16:09	20/04/28 05:16:09
12	20/04/28 05:16:11	20/04/28 05:16:11	20/04/28 05:16:11
13	20/04/28 05:16:13	20/04/28 05:16:13	20/04/28 05:16:13
86	20/04/28 05:16:15	20/04/28 05:16:15	20/04/28 05:16:15
28	20/04/28 05:16:17	20/04/28 05:16:17	20/04/28 05:16:17
80	20/04/28 05:16:19	20/04/28 05:16:19	20/04/28 05:16:19
28	20/04/28 05:16:21	20/04/28 05:16:21	20/04/28 05:16:21
28	20/04/28 05:16:23	20/04/28 05:16:23	20/04/28 05:16:23
81	20/04/28 05:16:25	20/04/28 05:16:25	20/04/28 05:16:25
72	20/04/28 05:16:27	20/04/28 05:16:27	20/04/28 05:16:27
24	20/04/28 05:16:29	20/04/28 05:16:30	20/04/28 05:16:30
10	20/04/28 05:16:32	20/04/28 05:16:32	20/04/28 05:16:32
151	20/04/28 05:16:34	20/04/28 05:16:34	20/04/28 05:16:34
83	20/04/28 05:16:36	20/04/28 05:16:36	20/04/28 05:16:36
33	20/04/28 05:16:38	20/04/28 05:16:38	20/04/28 05:16:38
32	20/04/28 05:16:40	20/04/28 05:16:40	20/04/28 05:16:40
39	20/04/28 05:16:42	20/04/28 05:16:42	20/04/28 05:16:42
39	20/04/28 05:16:44	20/04/28 05:16:44	20/04/28 05:16:44
35	20/04/28 05:16:46	20/04/28 05:16:46	20/04/28 05:16:46
33	20/04/28 05:16:48	20/04/28 05:16:48	20/04/28 05:16:48
28	20/04/28 05:16:50	20/04/28 05:16:50	20/04/28 05:16:48
156	20/04/28 05:16:52	20/04/28 05:16:52	20/04/28 05:16:52
156	20/04/28 05:16:54	20/04/28 05:16:54	20/04/28 05:16:54
114	20/04/28 05:16:56	20/04/28 05:16:56	20/04/28 05:16:56
114	20/04/28 05:16:58	20/04/28 05:16:59	20/04/28 05:16:59
143	20/04/28 05:17:01	20/04/28 05:17:01	20/04/28 05:17:01
62	20/04/28 05:17:03	20/04/28 05:17:03	20/04/28 05:17:03
62	20/04/28 05:17:05	20/04/28 05:17:06	20/04/28 05:17:05
62	20/04/28 05:17:08	20/04/28 05:17:08	20/04/28 05:17:08
135	20/04/28 05:17:10	20/04/28 05:17:10	20/04/28 05:17:10
156	20/04/28 05:17:12	20/04/28 05:17:12	20/04/28 05:17:12
135	20/04/28 05:17:14	20/04/28 05:17:14	20/04/28 05:17:14
62	20/04/28 05:17:16	20/04/28 05:17:16	20/04/28 05:17:16
143	20/04/28 05:17:18	20/04/28 05:17:18	20/04/28 05:17:18
114	20/04/28 05:17:20	20/04/28 05:17:21	20/04/28 05:17:21
18	20/04/28 05:17:23	20/04/28 05:17:23	20/04/28 05:17:23
114	20/04/28 05:17:25	20/04/28 05:17:25	20/04/28 05:17:25
143	20/04/28 05:17:27	20/04/28 05:17:27	20/04/28 05:17:27
143	20/04/28 05:17:29	20/04/28 05:17:29	20/04/28 05:17:29
83	20/04/28 05:17:31	20/04/28 05:17:31	20/04/28 05:17:31
143	20/04/28 05:17:33	20/04/28 05:17:33	20/04/28 05:10:29
135	20/04/28 05:17:35	20/04/28 05:17:35	20/04/28 05:17:35
135	20/04/28 05:17:37	20/04/28 05:17:38	20/04/28 05:17:37
135	20/04/28 05:17:41	20/04/28 05:17:41	20/04/28 05:17:41
135	20/04/28 05:17:43	20/04/28 05:17:43	20/04/28 05:17:43
135	20/04/28 05:17:45	20/04/28 05:17:45	20/04/28 05:17:45
143	20/04/28 05:17:47	20/04/28 05:17:47	20/04/28 05:17:47
18	20/04/28 05:17:49	20/04/28 05:17:49	20/04/28 05:17:49
86	20/04/28 05:17:51	20/04/28 05:17:51	20/04/28 05:17:51
75	20/04/28 05:17:53	20/04/28 05:17:53	20/04/28 05:17:53
155	20/04/28 05:17:55	20/04/28 05:17:55	20/04/28 05:17:55
53	20/04/28 05:17:57	20/04/28 05:17:57	20/04/28 05:17:57
157	20/04/28 05:17:59	20/04/28 05:17:59	20/04/28 05:17:59
64	20/04/28 05:18:01	20/04/28 05:18:01	20/04/28 05:18:01
64	20/04/28 05:18:03	20/04/28 05:18:03	20/04/28 05:18:03
61	20/04/28 05:18:05	20/04/28 05:18:05	20/04/28 05:18:05
75	20/04/28 05:18:07	20/04/28 05:18:07	20/04/28 05:18:07
61	20/04/28 05:18:09	20/04/28 05:18:09	20/04/28 05:18:09
45	20/04/28 05:18:11	20/04/28 05:18:11	20/04/28 05:18:11
155	20/04/28 05:18:13	20/04/28 05:18:13	20/04/28 05:18:13
13	20/04/28 05:18:15	20/04/28 05:18:15	20/04/28 05:18:15
157	20/04/28 05:18:17	20/04/28 05:18:17	20/04/28 05:18:17
78	20/04/28 05:18:19	20/04/28 05:18:19	20/04/28 05:18:19
125	20/04/28 05:18:21	20/04/28 05:18:21	20/04/28 05:18:21
150	20/04/28 05:18:23	20/04/28 05:18:23	20/04/28 05:18:23
153	20/04/28 05:18:25	20/04/28 05:18:25	20/04/28 05:18:25
153	20/04/28 05:18:27	20/04/28 05:18:27	20/04/28 05:18:27
130	20/04/28 05:18:29	20/04/28 05:18:29	20/04/28 05:18:29
74	20/04/28 05:18:31	20/04/28 05:18:32	20/04/28 05:18:32
158	20/04/28 05:18:34	20/04/28 05:18:34	20/04/28 05:18:34
85	20/04/28 05:18:36	20/04/28 05:18:36	20/04/28 05:18:36
85	20/04/28 05:18:38	20/04/28 05:18:38	20/04/28 05:18:38
51	20/04/28 05:18:40	20/04/28 05:18:40	20/04/28 05:18:40
156	20/04/28 05:18:42	20/04/28 05:18:42	20/04/28 05:18:42
14	20/04/28 05:17:17	20/04/28 05:18:44	20/04/28 05:18:44
142	20/04/28 05:18:46	20/04/28 05:18:46	20/04/28 05:18:46
