deviceId	device_location_x	device_location_y	rssi_measurement	timeStamp
51	325.7355139096782	278.0932066266133	-70	21/02/21 12:33:05
76	322.8122862148216	270.34769777745714	-69	21/02/21 12:33:05
56	322.2516392927648	279.48868682081735	-66	21/02/21 12:33:05
87	316.7754558564986	283.3435273986795	-64	21/02/21 12:33:05
80	319.50438552760113	266.6532375434548	-66	21/02/21 12:33:05
63	316.1845617273695	266.1427544980059	-66	21/02/21 12:33:05
85	313.592506279435	288.9508043358895	-64	21/02/21 12:33:05
82	310.7343024876997	289.9885281058247	-67	21/02/21 12:33:05
67	308.6687909404943	269.3159542687186	-59	21/02/21 12:33:05
54	308.4167510170523	285.31774122436696	-59	21/02/21 12:33:05
72	308.3782577378165	279.0389065249484	-46	21/02/21 12:33:05
79	308.3126945352996	266.84191839250167	-63	21/02/21 12:33:05
83	304.39664002154746	273.1089612991749	-52	21/02/21 12:33:05
71	303.7334461133063	278.9617445552159	-51	21/02/21 12:33:05
84	302.4589736847336	273.8327768701395	-53	21/02/21 12:33:05

51	325.7355139096782	278.0932066266133	-67	21/02/21 12:33:06
76	322.8122862148216	270.34769777745714	-66	21/02/21 12:33:06
56	322.2516392927648	279.48868682081735	-64	21/02/21 12:33:06
87	316.7754558564986	283.3435273986795	-64	21/02/21 12:33:06
80	319.50438552760113	266.6532375434548	-66	21/02/21 12:33:06
63	316.1845617273695	266.1427544980059	-66	21/02/21 12:33:06
85	313.592506279435	288.9508043358895	-67	21/02/21 12:33:06
82	310.7343024876997	289.9885281058247	-65	21/02/21 12:33:06
67	308.6687909404943	269.3159542687186	-58	21/02/21 12:33:06
54	308.4167510170523	285.31774122436696	-59	21/02/21 12:33:06
72	308.3782577378165	279.0389065249484	-47	21/02/21 12:33:06
79	308.3126945352996	266.84191839250167	-61	21/02/21 12:33:06
83	304.39664002154746	273.1089612991749	-55	21/02/21 12:33:06
71	303.7334461133063	278.9617445552159	-54	21/02/21 12:33:06
84	302.4589736847336	273.8327768701395	-56	21/02/21 12:33:06

51	325.7355139096782	278.0932066266133	-65	21/02/21 12:33:07
59	323.45461907694477	290.2448168091638	-71	21/02/21 12:33:07
76	322.8122862148216	270.34769777745714	-65	21/02/21 12:33:07
56	322.2516392927648	279.48868682081735	-64	21/02/21 12:33:07
87	316.7754558564986	283.3435273986795	-59	21/02/21 12:33:07
80	319.50438552760113	266.6532375434548	-67	21/02/21 12:33:07
63	316.1845617273695	266.1427544980059	-62	21/02/21 12:33:07
85	313.592506279435	288.9508043358895	-65	21/02/21 12:33:07
82	310.7343024876997	289.9885281058247	-65	21/02/21 12:33:07
67	308.6687909404943	269.3159542687186	-57	21/02/21 12:33:07
54	308.4167510170523	285.31774122436696	-61	21/02/21 12:33:07
72	308.3782577378165	279.0389065249484	-48	21/02/21 12:33:07
79	308.3126945352996	266.84191839250167	-63	21/02/21 12:33:07
83	304.39664002154746	273.1089612991749	-57	21/02/21 12:33:07
71	303.7334461133063	278.9617445552159	-59	21/02/21 12:33:07
84	302.4589736847336	273.8327768701395	-59	21/02/21 12:33:07

51	325.7355139096782	278.0932066266133	-66	21/02/21 12:33:08
59	323.45461907694477	290.2448168091638	-69	21/02/21 12:33:08
76	322.8122862148216	270.34769777745714	-63	21/02/21 12:33:08
56	322.2516392927648	279.48868682081735	-60	21/02/21 12:33:08
87	316.7754558564986	283.3435273986795	-56	21/02/21 12:33:08
80	319.50438552760113	266.6532375434548	-64	21/02/21 12:33:08
63	316.1845617273695	266.1427544980059	-65	21/02/21 12:33:08
85	313.592506279435	288.9508043358895	-62	21/02/21 12:33:08
82	310.7343024876997	289.9885281058247	-63	21/02/21 12:33:08
67	308.6687909404943	269.3159542687186	-62	21/02/21 12:33:08
54	308.4167510170523	285.31774122436696	-62	21/02/21 12:33:08
72	308.3782577378165	279.0389065249484	-51	21/02/21 12:33:08
79	308.3126945352996	266.84191839250167	-63	21/02/21 12:33:08
83	304.39664002154746	273.1089612991749	-59	21/02/21 12:33:08
71	303.7334461133063	278.9617445552159	-61	21/02/21 12:33:08
84	302.4589736847336	273.8327768701395	-65	21/02/21 12:33:08

51	325.7355139096782	278.0932066266133	-62	21/02/21 12:33:09
59	323.45461907694477	290.2448168091638	-68	21/02/21 12:33:09
76	322.8122862148216	270.34769777745714	-62	21/02/21 12:33:09
56	322.2516392927648	279.48868682081735	-57	21/02/21 12:33:09
87	316.7754558564986	283.3435273986795	-54	21/02/21 12:33:09
80	319.50438552760113	266.6532375434548	-64	21/02/21 12:33:09
52	331.19910015001574	266.24837823159737	-72	21/02/21 12:33:09
78	328.9028398411137	264.37460626325225	-68	21/02/21 12:33:09
63	316.1845617273695	266.1427544980059	-62	21/02/21 12:33:09
85	313.592506279435	288.9508043358895	-65	21/02/21 12:33:09
82	310.7343024876997	289.9885281058247	-67	21/02/21 12:33:09
67	308.6687909404943	269.3159542687186	-64	21/02/21 12:33:09
54	308.4167510170523	285.31774122436696	-62	21/02/21 12:33:09
72	308.3782577378165	279.0389065249484	-58	21/02/21 12:33:09
79	308.3126945352996	266.84191839250167	-66	21/02/21 12:33:09
83	304.39664002154746	273.1089612991749	-65	21/02/21 12:33:09
71	303.7334461133063	278.9617445552159	-63	21/02/21 12:33:09
84	302.4589736847336	273.8327768701395	-65	21/02/21 12:33:09

58	332.2404669919893	290.75762549514525	-70	21/02/21 12:33:10
51	325.7355139096782	278.0932066266133	-59	21/02/21 12:33:10
59	323.45461907694477	290.2448168091638	-64	21/02/21 12:33:10
76	322.8122862148216	270.34769777745714	-61	21/02/21 12:33:10
56	322.2516392927648	279.48868682081735	-53	21/02/21 12:33:10
87	316.7754558564986	283.3435273986795	-53	21/02/21 12:33:10
80	319.50438552760113	266.6532375434548	-63	21/02/21 12:33:10
52	331.19910015001574	266.24837823159737	-69	21/02/21 12:33:10
78	328.9028398411137	264.37460626325225	-68	21/02/21 12:33:10
77	330.2760383093163	263.7838317549563	-70	21/02/21 12:33:10
63	316.1845617273695	266.1427544980059	-62	21/02/21 12:33:10
85	313.592506279435	288.9508043358895	-62	21/02/21 12:33:10
82	310.7343024876997	289.9885281058247	-67	21/02/21 12:33:10
67	308.6687909404943	269.3159542687186	-64	21/02/21 12:33:10
54	308.4167510170523	285.31774122436696	-64	21/02/21 12:33:10
72	308.3782577378165	279.0389065249484	-61	21/02/21 12:33:10
79	308.3126945352996	266.84191839250167	-66	21/02/21 12:33:10
83	304.39664002154746	273.1089612991749	-65	21/02/21 12:33:10
71	303.7334461133063	278.9617445552159	-66	21/02/21 12:33:10
84	302.4589736847336	273.8327768701395	-68	21/02/21 12:33:10

93	336.67560053475273	286.85202800061563	-71	21/02/21 12:33:11
58	332.2404669919893	290.75762549514525	-69	21/02/21 12:33:11
51	325.7355139096782	278.0932066266133	-57	21/02/21 12:33:11
59	323.45461907694477	290.2448168091638	-65	21/02/21 12:33:11
76	322.8122862148216	270.34769777745714	-61	21/02/21 12:33:11
56	322.2516392927648	279.48868682081735	-47	21/02/21 12:33:11
87	316.7754558564986	283.3435273986795	-55	21/02/21 12:33:11
80	319.50438552760113	266.6532375434548	-65	21/02/21 12:33:11
52	331.19910015001574	266.24837823159737	-67	21/02/21 12:33:11
78	328.9028398411137	264.37460626325225	-68	21/02/21 12:33:11
77	330.2760383093163	263.7838317549563	-71	21/02/21 12:33:11
63	316.1845617273695	266.1427544980059	-66	21/02/21 12:33:11
85	313.592506279435	288.9508043358895	-65	21/02/21 12:33:11
82	310.7343024876997	289.9885281058247	-67	21/02/21 12:33:11
67	308.6687909404943	269.3159542687186	-65	21/02/21 12:33:11
54	308.4167510170523	285.31774122436696	-67	21/02/21 12:33:11
72	308.3782577378165	279.0389065249484	-63	21/02/21 12:33:11
79	308.3126945352996	266.84191839250167	-66	21/02/21 12:33:11
83	304.39664002154746	273.1089612991749	-68	21/02/21 12:33:11
71	303.7334461133063	278.9617445552159	-67	21/02/21 12:33:11
84	302.4589736847336	273.8327768701395	-69	21/02/21 12:33:11

93	336.67560053475273	286.85202800061563	-69	21/02/21 12:33:12
58	332.2404669919893	290.75762549514525	-69	21/02/21 12:33:12
51	325.7355139096782	278.0932066266133	-52	21/02/21 12:33:12
59	323.45461907694477	290.2448168091638	-63	21/02/21 12:33:12
76	322.8122862148216	270.34769777745714	-61	21/02/21 12:33:12
56	322.2516392927648	279.48868682081735	-35	21/02/21 12:33:12
87	316.7754558564986	283.3435273986795	-57	21/02/21 12:33:12
80	319.50438552760113	266.6532375434548	-66	21/02/21 12:33:12
52	331.19910015001574	266.24837823159737	-70	21/02/21 12:33:12
78	328.9028398411137	264.37460626325225	-69	21/02/21 12:33:12
77	330.2760383093163	263.7838317549563	-68	21/02/21 12:33:12
53	333.6341107305594	263.56249180343514	-72	21/02/21 12:33:12
63	316.1845617273695	266.1427544980059	-67	21/02/21 12:33:12
85	313.592506279435	288.9508043358895	-63	21/02/21 12:33:12
82	310.7343024876997	289.9885281058247	-68	21/02/21 12:33:12
67	308.6687909404943	269.3159542687186	-69	21/02/21 12:33:12
54	308.4167510170523	285.31774122436696	-67	21/02/21 12:33:12
72	308.3782577378165	279.0389065249484	-66	21/02/21 12:33:12
79	308.3126945352996	266.84191839250167	-67	21/02/21 12:33:12
83	304.39664002154746	273.1089612991749	-71	21/02/21 12:33:12
71	303.7334461133063	278.9617445552159	-69	21/02/21 12:33:12
84	302.4589736847336	273.8327768701395	-68	21/02/21 12:33:12

93	336.67560053475273	286.85202800061563	-68	21/02/21 12:33:13
58	332.2404669919893	290.75762549514525	-65	21/02/21 12:33:13
51	325.7355139096782	278.0932066266133	-43	21/02/21 12:33:13
59	323.45461907694477	290.2448168091638	-64	21/02/21 12:33:13
76	322.8122862148216	270.34769777745714	-61	21/02/21 12:33:13
56	322.2516392927648	279.48868682081735	-32	21/02/21 12:33:13
87	316.7754558564986	283.3435273986795	-58	21/02/21 12:33:13
80	319.50438552760113	266.6532375434548	-67	21/02/21 12:33:13
52	331.19910015001574	266.24837823159737	-69	21/02/21 12:33:13
78	328.9028398411137	264.37460626325225	-67	21/02/21 12:33:13
77	330.2760383093163	263.7838317549563	-68	21/02/21 12:33:13
53	333.6341107305594	263.56249180343514	-68	21/02/21 12:33:13
63	316.1845617273695	266.1427544980059	-67	21/02/21 12:33:13
85	313.592506279435	288.9508043358895	-64	21/02/21 12:33:13
82	310.7343024876997	289.9885281058247	-67	21/02/21 12:33:13
67	308.6687909404943	269.3159542687186	-69	21/02/21 12:33:13
54	308.4167510170523	285.31774122436696	-67	21/02/21 12:33:13
72	308.3782577378165	279.0389065249484	-68	21/02/21 12:33:13
79	308.3126945352996	266.84191839250167	-72	21/02/21 12:33:13
83	304.39664002154746	273.1089612991749	-72	21/02/21 12:33:13
71	303.7334461133063	278.9617445552159	-69	21/02/21 12:33:13

92	341.84858120867176	289.31372348611615	-71	21/02/21 12:33:14
93	336.67560053475273	286.85202800061563	-66	21/02/21 12:33:14
58	332.2404669919893	290.75762549514525	-65	21/02/21 12:33:14
51	325.7355139096782	278.0932066266133	-39	21/02/21 12:33:14
59	323.45461907694477	290.2448168091638	-63	21/02/21 12:33:14
76	322.8122862148216	270.34769777745714	-61	21/02/21 12:33:14
56	322.2516392927648	279.48868682081735	-45	21/02/21 12:33:14
87	316.7754558564986	283.3435273986795	-61	21/02/21 12:33:14
80	319.50438552760113	266.6532375434548	-68	21/02/21 12:33:14
52	331.19910015001574	266.24837823159737	-68	21/02/21 12:33:14
78	328.9028398411137	264.37460626325225	-67	21/02/21 12:33:14
77	330.2760383093163	263.7838317549563	-70	21/02/21 12:33:14
53	333.6341107305594	263.56249180343514	-68	21/02/21 12:33:14
63	316.1845617273695	266.1427544980059	-68	21/02/21 12:33:14
85	313.592506279435	288.9508043358895	-67	21/02/21 12:33:14
82	310.7343024876997	289.9885281058247	-68	21/02/21 12:33:14
67	308.6687909404943	269.3159542687186	-71	21/02/21 12:33:14
54	308.4167510170523	285.31774122436696	-71	21/02/21 12:33:14
72	308.3782577378165	279.0389065249484	-69	21/02/21 12:33:14

92	341.84858120867176	289.31372348611615	-69	21/02/21 12:33:15
93	336.67560053475273	286.85202800061563	-64	21/02/21 12:33:15
58	332.2404669919893	290.75762549514525	-65	21/02/21 12:33:15
51	325.7355139096782	278.0932066266133	-45	21/02/21 12:33:15
59	323.45461907694477	290.2448168091638	-63	21/02/21 12:33:15
76	322.8122862148216	270.34769777745714	-64	21/02/21 12:33:15
56	322.2516392927648	279.48868682081735	-55	21/02/21 12:33:15
87	316.7754558564986	283.3435273986795	-64	21/02/21 12:33:15
80	319.50438552760113	266.6532375434548	-68	21/02/21 12:33:15
52	331.19910015001574	266.24837823159737	-68	21/02/21 12:33:15
81	339.29837025838907	264.47650128123246	-71	21/02/21 12:33:15
78	328.9028398411137	264.37460626325225	-66	21/02/21 12:33:15
77	330.2760383093163	263.7838317549563	-68	21/02/21 12:33:15
53	333.6341107305594	263.56249180343514	-69	21/02/21 12:33:15
63	316.1845617273695	266.1427544980059	-70	21/02/21 12:33:15
85	313.592506279435	288.9508043358895	-66	21/02/21 12:33:15
82	310.7343024876997	289.9885281058247	-70	21/02/21 12:33:15
54	308.4167510170523	285.31774122436696	-71	21/02/21 12:33:15
72	308.3782577378165	279.0389065249484	-69	21/02/21 12:33:15

92	341.84858120867176	289.31372348611615	-67	21/02/21 12:33:16
93	336.67560053475273	286.85202800061563	-60	21/02/21 12:33:16
58	332.2404669919893	290.75762549514525	-62	21/02/21 12:33:16
51	325.7355139096782	278.0932066266133	-53	21/02/21 12:33:16
59	323.45461907694477	290.2448168091638	-61	21/02/21 12:33:16
76	322.8122862148216	270.34769777745714	-65	21/02/21 12:33:16
56	322.2516392927648	279.48868682081735	-58	21/02/21 12:33:16
87	316.7754558564986	283.3435273986795	-67	21/02/21 12:33:16
80	319.50438552760113	266.6532375434548	-68	21/02/21 12:33:16
52	331.19910015001574	266.24837823159737	-65	21/02/21 12:33:16
81	339.29837025838907	264.47650128123246	-70	21/02/21 12:33:16
78	328.9028398411137	264.37460626325225	-70	21/02/21 12:33:16
77	330.2760383093163	263.7838317549563	-69	21/02/21 12:33:16
53	333.6341107305594	263.56249180343514	-67	21/02/21 12:33:16
85	313.592506279435	288.9508043358895	-70	21/02/21 12:33:16

68	349.95048728464866	274.98837624848665	-71	21/02/21 12:33:17
75	347.6291109145471	268.793342181416	-70	21/02/21 12:33:17
92	341.84858120867176	289.31372348611615	-64	21/02/21 12:33:17
93	336.67560053475273	286.85202800061563	-59	21/02/21 12:33:17
58	332.2404669919893	290.75762549514525	-63	21/02/21 12:33:17
51	325.7355139096782	278.0932066266133	-58	21/02/21 12:33:17
59	323.45461907694477	290.2448168091638	-64	21/02/21 12:33:17
76	322.8122862148216	270.34769777745714	-65	21/02/21 12:33:17
56	322.2516392927648	279.48868682081735	-61	21/02/21 12:33:17
87	316.7754558564986	283.3435273986795	-67	21/02/21 12:33:17
80	319.50438552760113	266.6532375434548	-69	21/02/21 12:33:17
52	331.19910015001574	266.24837823159737	-67	21/02/21 12:33:17
81	339.29837025838907	264.47650128123246	-71	21/02/21 12:33:17
78	328.9028398411137	264.37460626325225	-68	21/02/21 12:33:17
77	330.2760383093163	263.7838317549563	-70	21/02/21 12:33:17
53	333.6341107305594	263.56249180343514	-68	21/02/21 12:33:17
85	313.592506279435	288.9508043358895	-71	21/02/21 12:33:17

62	351.13290750009605	287.0856838894416	-70	21/02/21 12:33:18
61	352.70574551472464	283.9731484405883	-71	21/02/21 12:33:18
74	352.9219411712642	280.6325529514257	-70	21/02/21 12:33:18
68	349.95048728464866	274.98837624848665	-68	21/02/21 12:33:18
75	347.6291109145471	268.793342181416	-70	21/02/21 12:33:18
92	341.84858120867176	289.31372348611615	-63	21/02/21 12:33:18
93	336.67560053475273	286.85202800061563	-58	21/02/21 12:33:18
58	332.2404669919893	290.75762549514525	-63	21/02/21 12:33:18
51	325.7355139096782	278.0932066266133	-58	21/02/21 12:33:18
59	323.45461907694477	290.2448168091638	-67	21/02/21 12:33:18
76	322.8122862148216	270.34769777745714	-68	21/02/21 12:33:18
56	322.2516392927648	279.48868682081735	-65	21/02/21 12:33:18
87	316.7754558564986	283.3435273986795	-67	21/02/21 12:33:18
80	319.50438552760113	266.6532375434548	-70	21/02/21 12:33:18
52	331.19910015001574	266.24837823159737	-66	21/02/21 12:33:18
81	339.29837025838907	264.47650128123246	-69	21/02/21 12:33:18
78	328.9028398411137	264.37460626325225	-68	21/02/21 12:33:18
77	330.2760383093163	263.7838317549563	-68	21/02/21 12:33:18
57	343.49677062806313	263.6595584507821	-70	21/02/21 12:33:18
53	333.6341107305594	263.56249180343514	-70	21/02/21 12:33:18

62	351.13290750009605	287.0856838894416	-68	21/02/21 12:33:19
61	352.70574551472464	283.9731484405883	-71	21/02/21 12:33:19
74	352.9219411712642	280.6325529514257	-67	21/02/21 12:33:19
70	353.83042747079617	278.0451520567406	-69	21/02/21 12:33:19
68	349.95048728464866	274.98837624848665	-66	21/02/21 12:33:19
75	347.6291109145471	268.793342181416	-69	21/02/21 12:33:19
92	341.84858120867176	289.31372348611615	-62	21/02/21 12:33:19
93	336.67560053475273	286.85202800061563	-56	21/02/21 12:33:19
58	332.2404669919893	290.75762549514525	-61	21/02/21 12:33:19
51	325.7355139096782	278.0932066266133	-62	21/02/21 12:33:19
59	323.45461907694477	290.2448168091638	-67	21/02/21 12:33:19
76	322.8122862148216	270.34769777745714	-66	21/02/21 12:33:19
56	322.2516392927648	279.48868682081735	-66	21/02/21 12:33:19
87	316.7754558564986	283.3435273986795	-71	21/02/21 12:33:19
52	331.19910015001574	266.24837823159737	-68	21/02/21 12:33:19
81	339.29837025838907	264.47650128123246	-67	21/02/21 12:33:19
78	328.9028398411137	264.37460626325225	-68	21/02/21 12:33:19
77	330.2760383093163	263.7838317549563	-70	21/02/21 12:33:19
57	343.49677062806313	263.6595584507821	-69	21/02/21 12:33:19
53	333.6341107305594	263.56249180343514	-68	21/02/21 12:33:19

62	351.13290750009605	287.0856838894416	-68	21/02/21 12:33:20
61	352.70574551472464	283.9731484405883	-66	21/02/21 12:33:20
74	352.9219411712642	280.6325529514257	-66	21/02/21 12:33:20
70	353.83042747079617	278.0451520567406	-66	21/02/21 12:33:20
55	354.75979169217595	271.5300370237252	-69	21/02/21 12:33:20
73	354.5491652380227	269.7386121151303	-71	21/02/21 12:33:20
68	349.95048728464866	274.98837624848665	-65	21/02/21 12:33:20
75	347.6291109145471	268.793342181416	-66	21/02/21 12:33:20
92	341.84858120867176	289.31372348611615	-60	21/02/21 12:33:20
93	336.67560053475273	286.85202800061563	-59	21/02/21 12:33:20
58	332.2404669919893	290.75762549514525	-63	21/02/21 12:33:20
51	325.7355139096782	278.0932066266133	-66	21/02/21 12:33:20
59	323.45461907694477	290.2448168091638	-70	21/02/21 12:33:20
76	322.8122862148216	270.34769777745714	-67	21/02/21 12:33:20
56	322.2516392927648	279.48868682081735	-69	21/02/21 12:33:20
86	351.89001632921503	266.37512261357585	-69	21/02/21 12:33:20
52	331.19910015001574	266.24837823159737	-65	21/02/21 12:33:20
81	339.29837025838907	264.47650128123246	-65	21/02/21 12:33:20
78	328.9028398411137	264.37460626325225	-69	21/02/21 12:33:20
77	330.2760383093163	263.7838317549563	-68	21/02/21 12:33:20
57	343.49677062806313	263.6595584507821	-70	21/02/21 12:33:20
53	333.6341107305594	263.56249180343514	-68	21/02/21 12:33:20

62	351.13290750009605	287.0856838894416	-64	21/02/21 12:33:21
61	352.70574551472464	283.9731484405883	-65	21/02/21 12:33:21
60	357.9780865491638	283.67516347255633	-70	21/02/21 12:33:21
74	352.9219411712642	280.6325529514257	-66	21/02/21 12:33:21
69	359.939700978864	280.33006737333886	-69	21/02/21 12:33:21
70	353.83042747079617	278.0451520567406	-67	21/02/21 12:33:21
55	354.75979169217595	271.5300370237252	-67	21/02/21 12:33:21
73	354.5491652380227	269.7386121151303	-69	21/02/21 12:33:21
68	349.95048728464866	274.98837624848665	-61	21/02/21 12:33:21
75	347.6291109145471	268.793342181416	-64	21/02/21 12:33:21
92	341.84858120867176	289.31372348611615	-62	21/02/21 12:33:21
93	336.67560053475273	286.85202800061563	-60	21/02/21 12:33:21
58	332.2404669919893	290.75762549514525	-64	21/02/21 12:33:21
51	325.7355139096782	278.0932066266133	-67	21/02/21 12:33:21
76	322.8122862148216	270.34769777745714	-71	21/02/21 12:33:21
56	322.2516392927648	279.48868682081735	-71	21/02/21 12:33:21
86	351.89001632921503	266.37512261357585	-70	21/02/21 12:33:21
52	331.19910015001574	266.24837823159737	-65	21/02/21 12:33:21
81	339.29837025838907	264.47650128123246	-67	21/02/21 12:33:21
78	328.9028398411137	264.37460626325225	-69	21/02/21 12:33:21
77	330.2760383093163	263.7838317549563	-69	21/02/21 12:33:21
57	343.49677062806313	263.6595584507821	-67	21/02/21 12:33:21
53	333.6341107305594	263.56249180343514	-70	21/02/21 12:33:21

62	351.13290750009605	287.0856838894416	-68	21/02/21 12:33:22
61	352.70574551472464	283.9731484405883	-66	21/02/21 12:33:22
60	357.9780865491638	283.67516347255633	-70	21/02/21 12:33:22
74	352.9219411712642	280.6325529514257	-65	21/02/21 12:33:22
70	353.83042747079617	278.0451520567406	-65	21/02/21 12:33:22
55	354.75979169217595	271.5300370237252	-70	21/02/21 12:33:22
73	354.5491652380227	269.7386121151303	-68	21/02/21 12:33:22
68	349.95048728464866	274.98837624848665	-64	21/02/21 12:33:22
75	347.6291109145471	268.793342181416	-64	21/02/21 12:33:22
92	341.84858120867176	289.31372348611615	-63	21/02/21 12:33:22
93	336.67560053475273	286.85202800061563	-61	21/02/21 12:33:22
58	332.2404669919893	290.75762549514525	-67	21/02/21 12:33:22
51	325.7355139096782	278.0932066266133	-67	21/02/21 12:33:22
59	323.45461907694477	290.2448168091638	-68	21/02/21 12:33:22
76	322.8122862148216	270.34769777745714	-71	21/02/21 12:33:22
56	322.2516392927648	279.48868682081735	-70	21/02/21 12:33:22
86	351.89001632921503	266.37512261357585	-71	21/02/21 12:33:22
52	331.19910015001574	266.24837823159737	-66	21/02/21 12:33:22
81	339.29837025838907	264.47650128123246	-68	21/02/21 12:33:22
78	328.9028398411137	264.37460626325225	-68	21/02/21 12:33:22
77	330.2760383093163	263.7838317549563	-68	21/02/21 12:33:22
57	343.49677062806313	263.6595584507821	-67	21/02/21 12:33:22
53	333.6341107305594	263.56249180343514	-66	21/02/21 12:33:22

62	351.13290750009605	287.0856838894416	-70	21/02/21 12:33:23
61	352.70574551472464	283.9731484405883	-67	21/02/21 12:33:23
74	352.9219411712642	280.6325529514257	-68	21/02/21 12:33:23
70	353.83042747079617	278.0451520567406	-69	21/02/21 12:33:23
55	354.75979169217595	271.5300370237252	-70	21/02/21 12:33:23
73	354.5491652380227	269.7386121151303	-68	21/02/21 12:33:23
68	349.95048728464866	274.98837624848665	-64	21/02/21 12:33:23
75	347.6291109145471	268.793342181416	-66	21/02/21 12:33:23
92	341.84858120867176	289.31372348611615	-62	21/02/21 12:33:23
93	336.67560053475273	286.85202800061563	-58	21/02/21 12:33:23
58	332.2404669919893	290.75762549514525	-65	21/02/21 12:33:23
51	325.7355139096782	278.0932066266133	-63	21/02/21 12:33:23
59	323.45461907694477	290.2448168091638	-69	21/02/21 12:33:23
76	322.8122862148216	270.34769777745714	-69	21/02/21 12:33:23
56	322.2516392927648	279.48868682081735	-68	21/02/21 12:33:23
86	351.89001632921503	266.37512261357585	-71	21/02/21 12:33:23
52	331.19910015001574	266.24837823159737	-64	21/02/21 12:33:23
81	339.29837025838907	264.47650128123246	-68	21/02/21 12:33:23
78	328.9028398411137	264.37460626325225	-67	21/02/21 12:33:23
77	330.2760383093163	263.7838317549563	-67	21/02/21 12:33:23
57	343.49677062806313	263.6595584507821	-67	21/02/21 12:33:23
53	333.6341107305594	263.56249180343514	-68	21/02/21 12:33:23

