floorId	partitionId	location_x	location_y	timeStamp
21	962	339.4685028081033	275.16920856313214	21/02/24 15:44:05
21	962	339.5872822551768	275.35554907558037	21/02/24 15:44:05
21	962	339.5872822551768	275.35554907558037	21/02/24 15:44:05
21	962	339.317247771279	275.4430653355319	21/02/24 15:44:05
21	962	339.29822573574944	275.5127348974033	21/02/24 15:44:05
21	962	339.25473180012426	275.4394633904828	21/02/24 15:44:05
21	962	339.25654373755845	275.5203646680334	21/02/24 15:44:05
21	962	339.2402272103358	275.53156842295476	21/02/24 15:44:05
21	962	339.0571312038164	275.57907629717255	21/02/24 15:44:05
21	962	339.0426926085153	275.56063989241477	21/02/24 15:44:05
21	962	339.000521840738	275.67090295282605	21/02/24 15:44:06
21	962	339.17125994553686	275.6220065852773	21/02/24 15:44:06
21	962	338.94278099736346	275.6427874472997	21/02/24 15:44:06
21	962	339.08781094308875	275.6703302233286	21/02/24 15:44:06
21	962	338.98571921416936	275.83919625160945	21/02/24 15:44:06
21	962	338.82515115212254	275.63728122106346	21/02/24 15:44:06
21	962	338.79560121601475	275.65107176543495	21/02/24 15:44:06
21	962	338.94660712969994	275.4100843252472	21/02/24 15:44:06
21	962	338.96587943322146	275.46051284272625	21/02/24 15:44:06
21	962	339.11998356472884	275.6236117415995	21/02/24 15:44:07
21	962	339.13526257673635	275.5211918648351	21/02/24 15:44:07
21	962	338.9142965782405	275.646203574299	21/02/24 15:44:07
21	962	338.8438572963162	275.78356930163653	21/02/24 15:44:07
21	962	338.95840794556966	275.93496902195454	21/02/24 15:44:07
21	962	338.95840794556966	275.93496902195454	21/02/24 15:44:07
21	962	339.1216138563831	276.07636945052275	21/02/24 15:44:07
21	962	339.1216138563831	276.07636945052275	21/02/24 15:44:07
21	962	339.04111122600483	275.96331666750353	21/02/24 15:44:07
21	962	338.70099247952123	275.9548260742106	21/02/24 15:44:08
21	962	338.74570856585996	275.76745864277024	21/02/24 15:44:08
21	962	338.53193339422364	275.8270403391792	21/02/24 15:44:08
21	962	338.60349365920223	275.7894053232137	21/02/24 15:44:08
21	962	338.4873619763119	275.6594202034469	21/02/24 15:44:08
21	962	338.39790473952905	275.60657506477554	21/02/24 15:44:08
21	962	338.63165002219216	275.7017780285778	21/02/24 15:44:08
21	962	338.5359487274383	275.6919633834799	21/02/24 15:44:08
21	962	338.5410669514961	275.7020152898366	21/02/24 15:44:08
21	962	338.51474350949906	275.6654631263896	21/02/24 15:44:09
21	962	338.51474350949906	275.6654631263896	21/02/24 15:44:09
21	962	338.5269147548622	275.66022496815435	21/02/24 15:44:09
21	962	338.55962586770966	275.39257864434717	21/02/24 15:44:09
21	962	338.5915610761623	275.3007725689547	21/02/24 15:44:09
21	962	338.4222669881492	275.3603246498012	21/02/24 15:44:09
21	962	338.6453438538092	275.4477928399774	21/02/24 15:44:09
21	962	338.600998634192	275.52113110521736	21/02/24 15:44:09
21	962	338.4641453225273	275.61933681601573	21/02/24 15:44:09
21	962	338.4641453225273	275.61933681601573	21/02/24 15:44:09
21	962	338.41982707311627	275.5984241748278	21/02/24 15:44:10
21	962	338.33765608732926	275.50589276379645	21/02/24 15:44:10
21	962	338.30581852685725	275.4750630029675	21/02/24 15:44:10
21	962	338.5607935709319	275.5140659677179	21/02/24 15:44:10
21	962	338.63662998376674	275.29170206279974	21/02/24 15:44:10
21	962	338.56288331010546	275.5042484022796	21/02/24 15:44:10
21	962	338.58574984692405	275.58906712266725	21/02/24 15:44:10
21	962	338.58574984692405	275.58906712266725	21/02/24 15:44:10
21	962	338.4661923840798	275.58937651386685	21/02/24 15:44:10
21	962	338.65084951135475	275.40556586591094	21/02/24 15:44:11
21	962	338.6602083527902	275.4080601342348	21/02/24 15:44:11
21	962	338.60004682450295	275.44408970209554	21/02/24 15:44:11
21	962	338.62806146111126	275.70549168797055	21/02/24 15:44:11
21	962	338.48714087269724	275.6471590599171	21/02/24 15:44:11
21	962	338.57932650984725	275.68485012319843	21/02/24 15:44:11
21	962	338.4353420932187	275.69019473930695	21/02/24 15:44:11
21	962	338.31012293410544	275.6371834877714	21/02/24 15:44:11
21	962	338.32582621485295	275.611182553599	21/02/24 15:44:11
21	962	338.2740878873088	275.77808826617587	21/02/24 15:44:12
21	962	338.3155011106996	275.8545435050308	21/02/24 15:44:12
21	962	338.2812171121919	275.5845333738218	21/02/24 15:44:12
21	962	338.2404185710217	275.40632286280874	21/02/24 15:44:12
21	962	338.0822378735092	275.57885848627086	21/02/24 15:44:12
21	962	338.1196979807504	275.6394130147763	21/02/24 15:44:12
21	962	338.1058603354726	275.65467474055885	21/02/24 15:44:12
21	962	338.28937047041495	275.51910716999487	21/02/24 15:44:12
21	962	338.11467785997667	275.5182619677871	21/02/24 15:44:12
21	962	338.0255360664613	275.4886417885119	21/02/24 15:44:12
21	962	338.02558261541964	275.3726215172312	21/02/24 15:44:13
21	962	338.0017329633487	275.377141261088	21/02/24 15:44:13
21	962	338.15579681412095	275.2901894834624	21/02/24 15:44:13
21	962	338.2562311500308	275.49126592102596	21/02/24 15:44:13
21	962	338.08902483661706	275.4517420417306	21/02/24 15:44:13
21	962	338.22350522235894	275.1879866330231	21/02/24 15:44:13
21	962	338.2457022455752	275.2551699329822	21/02/24 15:44:13
21	962	338.28243912731637	275.24418980966624	21/02/24 15:44:13
21	962	338.231092063438	275.3036430428144	21/02/24 15:44:13
21	962	338.1105874993146	275.34589345104797	21/02/24 15:44:14
21	962	338.0533553285181	275.2018633974971	21/02/24 15:44:14
21	962	337.8058720710095	275.11260192736216	21/02/24 15:44:14
21	962	337.8365561331941	275.05989113461106	21/02/24 15:44:14
21	962	337.82960065924993	275.2704130875301	21/02/24 15:44:14
21	962	338.0241368891055	275.47637237050185	21/02/24 15:44:14
21	962	338.07388386380177	275.7097087399063	21/02/24 15:44:14
21	962	338.0550975011294	275.7815254581822	21/02/24 15:44:14
21	962	338.0411303412847	275.78175541529976	21/02/24 15:44:14
21	962	337.9229244036528	275.68185107564454	21/02/24 15:44:15
21	962	337.93409515100524	275.71149343964316	21/02/24 15:44:15
21	962	337.79531740591864	275.47262487829096	21/02/24 15:44:15
21	962	337.5721128534662	275.5742745067124	21/02/24 15:44:15
21	962	337.47214319654313	275.6954114139187	21/02/24 15:44:15
21	962	337.4588939074527	275.7175517230051	21/02/24 15:44:15
21	962	337.47217952100715	275.72084799804134	21/02/24 15:44:15
21	962	337.6662628042082	275.80005539926225	21/02/24 15:44:15
21	962	337.5910561596771	275.66302230365665	21/02/24 15:44:15
21	962	337.4202526213053	275.7522507139446	21/02/24 15:44:15
21	962	337.34746631065775	275.7726475779994	21/02/24 15:44:16
21	962	337.34078954814	275.78868558437165	21/02/24 15:44:16
21	962	337.26898676111216	275.58501827263024	21/02/24 15:44:16
21	962	337.2555608386237	275.7955960984009	21/02/24 15:44:16
21	962	337.1951267374599	275.78112266565955	21/02/24 15:44:16
21	962	337.3641123200676	275.7684521765778	21/02/24 15:44:16
21	962	337.1946500567394	275.6601456791875	21/02/24 15:44:16
21	962	337.2231539435297	275.8134671089102	21/02/24 15:44:16
21	962	337.229406532981	275.79592744175824	21/02/24 15:44:16
21	962	337.20186622383983	275.7088962110485	21/02/24 15:44:17
21	962	337.3915188628578	275.53624756063596	21/02/24 15:44:17
21	962	337.3723227354445	275.373337245557	21/02/24 15:44:17
21	962	337.18229187333884	275.6027163977265	21/02/24 15:44:17
21	962	337.1697093953583	275.6168247527483	21/02/24 15:44:17
21	962	337.4319249835073	275.67505633494085	21/02/24 15:44:17
21	962	337.2574602709351	275.702318234489	21/02/24 15:44:17
21	962	337.20309322432234	275.73277490971464	21/02/24 15:44:17
21	962	337.21147012082173	275.7474937244144	21/02/24 15:44:17
21	962	337.1805480127428	275.75207845768176	21/02/24 15:44:18
21	962	337.28981802818583	275.7001900489828	21/02/24 15:44:18
21	962	337.3090408577272	275.6998093760548	21/02/24 15:44:18
21	962	337.2017378074027	275.679554177815	21/02/24 15:44:18
21	962	337.0468747526901	275.52493236219635	21/02/24 15:44:18
21	962	337.22592722012564	275.4661619672068	21/02/24 15:44:18
21	962	337.4352825315956	275.55615065312844	21/02/24 15:44:18
21	962	337.28718554177914	275.68054713491796	21/02/24 15:44:18
21	962	337.2171140475257	275.41014250107236	21/02/24 15:44:18
21	962	337.48747995149876	275.4721197858924	21/02/24 15:44:18
21	962	337.3410156412124	275.2308503752972	21/02/24 15:44:19
21	962	337.40815559930326	275.2925893284064	21/02/24 15:44:19
21	962	337.41342876469236	275.1801539612031	21/02/24 15:44:19
21	962	337.48258471693237	275.17797885587584	21/02/24 15:44:19
21	962	337.3611061069196	275.0284593574795	21/02/24 15:44:19
21	962	337.3078276533181	275.1804781105822	21/02/24 15:44:19
21	962	337.5779342142784	275.2317185333316	21/02/24 15:44:19
21	962	337.60899417525127	275.1928085579915	21/02/24 15:44:19
21	962	337.52166229346756	275.34070135973354	21/02/24 15:44:19
21	962	337.66046733049217	275.5683796489839	21/02/24 15:44:20
21	962	337.8189241569325	275.38791687277757	21/02/24 15:44:20
21	962	337.85532670623314	275.13025285256975	21/02/24 15:44:20
21	962	338.2313633958263	275.27627872516126	21/02/24 15:44:20
21	962	338.3187030949068	275.39300775877393	21/02/24 15:44:20
21	962	338.2318823200485	275.4141134691327	21/02/24 15:44:20
21	962	338.2318823200485	275.4141134691327	21/02/24 15:44:20
21	962	338.3083505683357	275.23975509699267	21/02/24 15:44:20
21	962	338.34596520951004	275.2852565694428	21/02/24 15:44:20
21	962	338.16207181231607	275.3425318584496	21/02/24 15:44:21
21	962	338.0541404602093	275.40033970174494	21/02/24 15:44:21
21	962	338.3014504339568	275.2641031392757	21/02/24 15:44:21
21	962	338.2767602081931	275.29531442923803	21/02/24 15:44:21
21	962	338.2767602081931	275.29531442923803	21/02/24 15:44:21
21	962	338.36204821639717	275.56324881284814	21/02/24 15:44:21
21	962	338.1451073795484	275.640448554883	21/02/24 15:44:21
21	962	338.029383880291	275.8863994334515	21/02/24 15:44:21
21	962	338.07616376760546	275.9210038841162	21/02/24 15:44:21
21	962	338.07616376760546	275.9210038841162	21/02/24 15:44:21
21	962	337.87583445697805	275.96505247308914	21/02/24 15:44:22
21	962	338.08236563739246	275.9798014771851	21/02/24 15:44:22
21	962	338.05887336057117	276.0603100829396	21/02/24 15:44:22
21	962	338.22367806072526	276.1791079100626	21/02/24 15:44:22
21	962	338.23823698692763	276.3935449732035	21/02/24 15:44:22
21	962	338.26501299998273	276.24509502562023	21/02/24 15:44:22
21	962	338.17551663914657	276.27619270451805	21/02/24 15:44:22
21	962	338.30997122916665	276.19605707924404	21/02/24 15:44:22
21	962	338.2607402497626	276.2759971101662	21/02/24 15:44:22
21	962	338.2800181528061	276.2734131822964	21/02/24 15:44:23
21	962	338.42104772625214	276.13301187643754	21/02/24 15:44:23
21	962	338.2910336318905	275.87017382130057	21/02/24 15:44:23
21	962	338.3149865522182	275.6046357372701	21/02/24 15:44:23
21	962	338.5300451451217	275.6442391306178	21/02/24 15:44:23
21	962	338.4748973786163	275.54393091489624	21/02/24 15:44:23
21	962	338.4688053746811	275.7255233739656	21/02/24 15:44:23
21	962	338.70131497295705	275.6456634949086	21/02/24 15:44:23
21	962	338.68098225858154	275.6142650973639	21/02/24 15:44:23
21	962	338.68098225858154	275.6142650973639	21/02/24 15:44:24
21	962	338.8282933824923	275.5663583475166	21/02/24 15:44:24
21	962	338.6655058951995	275.60029471573205	21/02/24 15:44:24
21	962	338.45783215408676	275.42443944913066	21/02/24 15:44:24
21	962	338.4806188877257	275.4381191596449	21/02/24 15:44:24
21	962	338.5166641329616	275.4364053140358	21/02/24 15:44:24
21	962	338.5166641329616	275.4364053140358	21/02/24 15:44:24
21	962	338.5166641329616	275.4364053140358	21/02/24 15:44:24
21	962	338.5166641329616	275.4364053140358	21/02/24 15:44:24
21	962	338.43719562755706	275.14719269057116	21/02/24 15:44:24
21	962	338.45328673695474	275.4017490897614	21/02/24 15:44:25
21	962	338.5448208667476	275.5216772818529	21/02/24 15:44:25
21	962	338.5448208667476	275.5216772818529	21/02/24 15:44:25
21	962	338.4440688898194	275.2476396406876	21/02/24 15:44:25
21	962	338.13803822920187	275.0878307223856	21/02/24 15:44:25
21	962	338.13803822920187	275.0878307223856	21/02/24 15:44:25
21	962	338.3597524708718	275.14335762329836	21/02/24 15:44:25
21	962	338.4298042224723	275.0754838584752	21/02/24 15:44:25
21	962	338.5082436126245	275.23729826815566	21/02/24 15:44:25
21	962	338.38225089778376	275.14965039505086	21/02/24 15:44:26
21	962	338.29494813308617	275.1043675581447	21/02/24 15:44:26
21	962	338.3355427540967	275.35280263002926	21/02/24 15:44:26
21	962	338.2016540609803	275.09396031489774	21/02/24 15:44:26
21	962	338.26776426368053	275.0047538127535	21/02/24 15:44:26
21	962	338.2682618342268	275.0042754452706	21/02/24 15:44:26
21	962	338.25044012807746	274.95587695337537	21/02/24 15:44:26
21	962	338.2630459447874	274.9510588855263	21/02/24 15:44:26
21	962	338.25330178924816	274.85589472240383	21/02/24 15:44:26
21	962	338.237050281762	274.8976246179169	21/02/24 15:44:27
21	962	338.237050281762	274.8976246179169	21/02/24 15:44:27
21	962	338.20840245852713	274.9034316469544	21/02/24 15:44:27
21	962	338.1902058893854	274.66776823666794	21/02/24 15:44:27
21	962	338.1902058893854	274.66776823666794	21/02/24 15:44:27
21	962	338.418304371626	274.6069717891794	21/02/24 15:44:27
21	962	338.418304371626	274.6069717891794	21/02/24 15:44:27
21	962	338.4157926304278	274.61372505894735	21/02/24 15:44:27
21	962	338.5247060168753	274.4709325431661	21/02/24 15:44:27
21	962	338.5247060168753	274.4709325431661	21/02/24 15:44:27
21	962	338.68187869358337	274.51828472399967	21/02/24 15:44:28
21	962	338.6453950632973	274.3632573869129	21/02/24 15:44:28
21	962	338.6453950632973	274.3632573869129	21/02/24 15:44:28
21	962	338.58888834270437	274.27640685236605	21/02/24 15:44:28
21	962	338.719036030843	274.4885897365531	21/02/24 15:44:28
21	962	338.8241584355959	274.37496080647935	21/02/24 15:44:28
21	962	338.74855358732134	274.44706472267177	21/02/24 15:44:28
21	962	338.5576838572152	274.6096891840967	21/02/24 15:44:28
21	962	338.7825873860583	274.4869631524016	21/02/24 15:44:28
21	962	338.7825873860583	274.4869631524016	21/02/24 15:44:29
21	962	338.59172869454983	274.3926217419949	21/02/24 15:44:29
21	962	338.4999512885796	274.3924616598268	21/02/24 15:44:29
21	962	338.4999512885796	274.3924616598268	21/02/24 15:44:29
21	962	338.1393329104973	274.2684416651619	21/02/24 15:44:29
21	962	338.0868543956097	274.3444660226539	21/02/24 15:44:29
21	962	338.0868543956097	274.3444660226539	21/02/24 15:44:29
21	962	337.8467374841434	274.3106516903689	21/02/24 15:44:29
21	962	337.8149538301098	274.198093125852	21/02/24 15:44:29
21	962	337.8275306804008	274.3112087000054	21/02/24 15:44:30
21	962	337.631674723288	274.5015775673436	21/02/24 15:44:30
21	962	337.5496657893957	274.46587402608105	21/02/24 15:44:30
21	962	337.69688347417576	274.34548445273043	21/02/24 15:44:30
21	962	337.64757280408077	274.51091918582483	21/02/24 15:44:30
21	962	337.70815558463966	274.4303363172656	21/02/24 15:44:30
21	962	337.7676578912784	274.532398495534	21/02/24 15:44:30
21	962	337.754367042563	274.3781960296398	21/02/24 15:44:30
21	962	337.86060556100364	274.36848914795564	21/02/24 15:44:30
21	962	337.9788437774295	274.2770922144644	21/02/24 15:44:30
21	962	338.0308516986804	274.3611390172828	21/02/24 15:44:31
21	962	338.1268695863205	274.19116138022184	21/02/24 15:44:31
21	962	338.38176160526194	274.347200351957	21/02/24 15:44:31
21	962	338.38388441325736	274.20951224382213	21/02/24 15:44:31
21	962	338.34888870234784	274.1872462397466	21/02/24 15:44:31
21	962	338.3955442836342	274.30503200315945	21/02/24 15:44:31
21	962	338.2195770365218	274.1208177566033	21/02/24 15:44:31
21	962	338.01144324115035	274.31075500074905	21/02/24 15:44:31
21	962	337.7761332573765	274.41010684672204	21/02/24 15:44:31
21	962	337.624644533146	274.2910661524679	21/02/24 15:44:32
21	962	337.50935965894917	274.2357746340713	21/02/24 15:44:32
21	962	337.3913230841148	274.4423374853612	21/02/24 15:44:32
21	962	337.2755873876992	274.26367970612426	21/02/24 15:44:32
21	962	337.4768902610986	274.08555122786964	21/02/24 15:44:32
21	962	337.47198900565144	274.083774155065	21/02/24 15:44:32
21	962	337.4872586724449	274.13704310144186	21/02/24 15:44:32
21	962	337.31502436455196	274.32679736448665	21/02/24 15:44:32
21	962	337.3435533606075	274.1630481139068	21/02/24 15:44:32
21	962	337.1906114450551	274.004121657235	21/02/24 15:44:33
21	962	337.4764672288137	274.00507825785127	21/02/24 15:44:33
21	962	337.48488390503576	274.05111049878326	21/02/24 15:44:33
21	962	337.4739425606264	274.0322191195471	21/02/24 15:44:33
21	962	337.3257056355391	274.22332685951585	21/02/24 15:44:33
21	962	337.4228188989588	274.0716413354254	21/02/24 15:44:33
21	962	337.3308042162461	274.2415998955192	21/02/24 15:44:33
21	962	337.1491435029347	274.2182328488267	21/02/24 15:44:33
21	962	337.18370729322646	274.2288793428487	21/02/24 15:44:33
21	962	336.94129152223337	274.3275592512436	21/02/24 15:44:33
21	962	337.0961547560416	274.2010180279928	21/02/24 15:44:34
21	962	337.1971860480405	274.2174557168068	21/02/24 15:44:34
21	962	337.00334155620794	274.0418207138571	21/02/24 15:44:34
21	962	337.1760084848471	274.029851930901	21/02/24 15:44:34
21	962	337.1760084848471	274.029851930901	21/02/24 15:44:34
21	962	336.96523771032616	273.92203368417256	21/02/24 15:44:34
21	962	336.9062865711836	273.97115480676587	21/02/24 15:44:34
21	962	336.9117447069529	273.9640401012175	21/02/24 15:44:34
21	962	336.997599813745	274.0212110789378	21/02/24 15:44:34
21	962	336.9134870436341	274.0030395409766	21/02/24 15:44:35
21	962	336.7310904378119	274.0851426613134	21/02/24 15:44:35
21	962	336.7810798182792	274.06857022385606	21/02/24 15:44:35
21	962	336.6700829387128	274.0221918783949	21/02/24 15:44:35
21	962	336.6700829387128	274.0221918783949	21/02/24 15:44:35
21	962	336.91528541314705	273.8915183595724	21/02/24 15:44:35
21	962	336.68970895397814	273.9371304686605	21/02/24 15:44:35
21	962	336.5361424423767	274.0995925392751	21/02/24 15:44:35
21	962	336.38457256266514	274.4740519598801	21/02/24 15:44:35
21	962	336.38457256266514	274.4740519598801	21/02/24 15:44:36
21	962	336.62139113236503	274.4391198349411	21/02/24 15:44:36
21	962	336.62139113236503	274.4391198349411	21/02/24 15:44:36
21	962	336.4409695965446	274.6384358764902	21/02/24 15:44:36
21	962	336.39427316206246	274.4902697716704	21/02/24 15:44:36
21	962	336.39427316206246	274.4902697716704	21/02/24 15:44:36
21	962	336.5052214848823	274.58587642278553	21/02/24 15:44:36
21	962	336.50816427811935	274.48848136631807	21/02/24 15:44:36
21	962	336.50819947880274	274.4883510728892	21/02/24 15:44:36
21	962	336.26847680547075	274.58869147927146	21/02/24 15:44:36
21	962	336.27146297232804	274.5974132035344	21/02/24 15:44:37
21	962	336.34210933872635	274.7868336219179	21/02/24 15:44:37
21	962	336.4368553884358	274.5442671516778	21/02/24 15:44:37
21	962	336.4368553884358	274.5442671516778	21/02/24 15:44:37
21	962	336.3615062362207	274.56499944868	21/02/24 15:44:37
21	962	336.4408280345457	274.42916045694324	21/02/24 15:44:37
21	962	336.333797425434	274.52982414564735	21/02/24 15:44:37
21	962	336.34835593617765	274.82413463668604	21/02/24 15:44:37
21	962	336.14786941184286	274.70919574534963	21/02/24 15:44:37
21	962	335.9849418398821	274.65443942440555	21/02/24 15:44:38
21	962	336.11323082484824	274.91130878140467	21/02/24 15:44:38
21	962	336.0987055600084	275.0001333112646	21/02/24 15:44:38
21	962	336.11097284430804	274.9653863391058	21/02/24 15:44:38
21	962	336.09879666683764	274.97156782838243	21/02/24 15:44:38
21	962	336.16711320535563	274.9702544076188	21/02/24 15:44:38
21	962	336.16711320535563	274.9702544076188	21/02/24 15:44:38
21	962	335.9899211161748	274.75434865118376	21/02/24 15:44:38
21	962	336.07518939748917	274.8390862616693	21/02/24 15:44:38
21	962	336.03564324652757	274.87341765532676	21/02/24 15:44:39
21	962	335.94350584833495	274.9468749910839	21/02/24 15:44:39
21	962	335.97174921771847	275.1368290708306	21/02/24 15:44:39
21	962	336.0834062489533	275.1851944806387	21/02/24 15:44:39
21	962	336.0834062489533	275.1851944806387	21/02/24 15:44:39
21	962	336.0670159393355	275.1869604363245	21/02/24 15:44:39
21	962	336.0670159393355	275.1869604363245	21/02/24 15:44:39
21	962	336.0670159393355	275.1869604363245	21/02/24 15:44:39
21	962	336.0712229930331	275.0973177069663	21/02/24 15:44:39
21	962	336.0665755279678	275.1309966355436	21/02/24 15:44:39
21	962	335.97970561184366	275.1501975036295	21/02/24 15:44:40
21	962	335.97970561184366	275.1501975036295	21/02/24 15:44:40
21	962	336.03846373696587	275.27506608738855	21/02/24 15:44:40
21	962	335.6537234888372	275.43458137032394	21/02/24 15:44:40
21	962	335.68442426394165	275.521920217711	21/02/24 15:44:40
21	962	335.68442426394165	275.521920217711	21/02/24 15:44:40
21	962	335.6894970213992	275.43783009067147	21/02/24 15:44:40
21	962	335.6896556471125	275.4370552222915	21/02/24 15:44:40
21	962	335.7586914027238	275.36164652338624	21/02/24 15:44:40
21	962	335.73035932145126	275.36372976476815	21/02/24 15:44:41
21	962	335.7209302157668	275.37530474966667	21/02/24 15:44:41
21	962	335.9467580347403	275.20440217788706	21/02/24 15:44:41
21	962	335.8317398221648	275.1696957059028	21/02/24 15:44:41
21	962	335.8564131108052	275.3880548920638	21/02/24 15:44:41
21	962	335.8872200943741	275.39634397711444	21/02/24 15:44:41
21	962	335.73722916012605	275.2566085498675	21/02/24 15:44:41
21	962	335.73722916012605	275.2566085498675	21/02/24 15:44:41
21	962	335.6886887730736	275.1936672645924	21/02/24 15:44:41
21	962	335.6886887730736	275.1936672645924	21/02/24 15:44:42
21	962	335.5511822802942	275.46052364564883	21/02/24 15:44:42
21	962	335.5602774478583	275.4226365057376	21/02/24 15:44:42
21	962	335.4618558689025	275.37066901093567	21/02/24 15:44:42
21	962	335.4618558689025	275.37066901093567	21/02/24 15:44:42
21	962	335.35019934909525	275.56075911268806	21/02/24 15:44:42
21	962	335.35019934909525	275.56075911268806	21/02/24 15:44:42
21	962	335.280662921042	275.50510421896183	21/02/24 15:44:42
21	962	335.2356000984474	275.293947289852	21/02/24 15:44:42
21	962	335.2364072282658	275.2917530446551	21/02/24 15:44:42
21	962	334.953116546261	275.3764507105028	21/02/24 15:44:43
21	962	334.76087075031745	275.28872306765044	21/02/24 15:44:43
21	962	334.9337454933802	275.2368448157779	21/02/24 15:44:43
21	962	334.97898020909776	274.9870460005519	21/02/24 15:44:43
21	962	334.75361836360435	275.1490764460526	21/02/24 15:44:43
21	962	334.7162531004668	275.2994804658389	21/02/24 15:44:43
21	962	334.85096893583477	275.2978670952008	21/02/24 15:44:43
21	962	334.8224474933384	275.31540407101556	21/02/24 15:44:43
21	962	334.83354565145476	275.3337808842263	21/02/24 15:44:43
21	962	334.73346032118064	275.2269138715476	21/02/24 15:44:44
21	962	334.7179393441136	275.1576618795125	21/02/24 15:44:44
21	962	334.5925045912212	275.34104397278276	21/02/24 15:44:44
21	962	334.4502475747517	275.59911054258924	21/02/24 15:44:44
21	962	334.2460353701158	275.4616920858163	21/02/24 15:44:44
21	962	334.17906439199805	275.3957171842493	21/02/24 15:44:44
21	962	334.0392234076437	275.5198492424372	21/02/24 15:44:44
21	962	334.0392234076437	275.5198492424372	21/02/24 15:44:44
21	962	334.0593522564659	275.7686519809374	21/02/24 15:44:44
21	962	334.0593522564659	275.7686519809374	21/02/24 15:44:45
21	962	334.2297706047937	275.578272002477	21/02/24 15:44:45
21	962	334.22789956977533	275.5709265850545	21/02/24 15:44:45
21	962	334.1797527032677	275.4790082642261	21/02/24 15:44:45
21	962	334.17178610212864	275.5082568368495	21/02/24 15:44:45
21	962	334.18523068070175	275.26492131781515	21/02/24 15:44:45
21	962	334.3594727815181	275.2111697728434	21/02/24 15:44:45
21	962	334.23966931519715	275.23222349935196	21/02/24 15:44:45
21	962	334.3109774331338	275.3358869822152	21/02/24 15:44:45
21	962	334.22484298868864	275.4485066332261	21/02/24 15:44:45
21	962	334.12412175536	275.54945750402965	21/02/24 15:44:46
21	962	334.11181733541014	275.5785887270934	21/02/24 15:44:46
21	962	334.107002550346	275.57049346262033	21/02/24 15:44:46
21	962	334.2239339348535	275.63387535802127	21/02/24 15:44:46
21	962	334.0577563612916	275.66095655373	21/02/24 15:44:46
21	962	334.0185195559177	275.7709477951515	21/02/24 15:44:46
21	962	334.0063978032995	275.6850730425289	21/02/24 15:44:46
21	962	334.03930507528037	275.8178633986063	21/02/24 15:44:46
21	962	333.99223218027953	276.05209311169915	21/02/24 15:44:46
21	962	334.02973496202515	275.99388747434955	21/02/24 15:44:46
21	962	333.88697778516024	276.01494851724516	21/02/24 15:44:47
21	962	333.85185624276437	276.00081634077236	21/02/24 15:44:47
21	962	333.65525673067805	276.03437292190046	21/02/24 15:44:47
21	962	333.6598450778685	276.03177804957295	21/02/24 15:44:47
21	962	333.6100522698694	276.0468480846756	21/02/24 15:44:47
21	962	333.58512054842424	276.0517060345767	21/02/24 15:44:47
21	962	333.72644259276694	275.9617864811842	21/02/24 15:44:47
21	962	333.72797317406406	275.9285102946846	21/02/24 15:44:47
21	962	333.5929568398892	275.956097401462	21/02/24 15:44:47
21	962	333.48347335312286	275.7425028077696	21/02/24 15:44:48
21	962	333.3922648168423	275.63928772368865	21/02/24 15:44:48
21	962	333.380043245188	275.8118425934398	21/02/24 15:44:48
21	962	333.3739523912881	275.7901560074172	21/02/24 15:44:48
21	962	333.6570847315412	275.7948479136536	21/02/24 15:44:48
21	962	333.6655045250753	275.8124131813042	21/02/24 15:44:48
21	962	333.777561164376	275.8721947728861	21/02/24 15:44:48
21	962	333.6681784354035	275.82316470145395	21/02/24 15:44:48
21	962	333.61121282832795	275.5580091878084	21/02/24 15:44:48
21	962	333.61183564910914	275.557467096544	21/02/24 15:44:49
21	962	333.48394704235926	275.45470002638734	21/02/24 15:44:49
21	962	333.59676027478736	275.535029313359	21/02/24 15:44:49
21	962	333.7501282758517	275.69712694379416	21/02/24 15:44:49
21	962	333.8539030031165	275.7035582587295	21/02/24 15:44:49
21	962	334.07391852977634	275.64299929454035	21/02/24 15:44:49
21	962	334.25381201265316	275.4659181532696	21/02/24 15:44:49
21	962	334.27046908494526	275.2485541375595	21/02/24 15:44:49
21	962	334.2815170561812	275.25311124231376	21/02/24 15:44:49
21	962	334.3258052759482	275.1075215049517	21/02/24 15:44:49
21	962	334.3658129893842	275.1211297012311	21/02/24 15:44:50
21	962	334.1833773705478	275.2762917239714	21/02/24 15:44:50
21	962	334.1568174781171	275.16919618333753	21/02/24 15:44:50
21	962	334.16031043544535	275.1557262005464	21/02/24 15:44:50
21	962	334.27424878436454	275.08759653561776	21/02/24 15:44:50
21	962	334.24068014047793	275.1264850581728	21/02/24 15:44:50
21	962	334.2858623821596	275.09618332822293	21/02/24 15:44:50
21	962	334.27863967507614	275.0930678053121	21/02/24 15:44:50
21	962	334.1702489402358	274.96363874769605	21/02/24 15:44:50
21	962	333.95680583996074	275.015824151725	21/02/24 15:44:51
21	962	334.0011355642302	274.9593273198143	21/02/24 15:44:51
21	962	333.96634697376663	274.69728594263745	21/02/24 15:44:51
21	962	334.18961724290347	274.50996327444227	21/02/24 15:44:51
21	962	334.20666703371364	274.56620756779506	21/02/24 15:44:51
21	962	334.4236474063116	274.6642580849014	21/02/24 15:44:51
21	962	334.5022028311807	274.52842180025937	21/02/24 15:44:51
21	962	334.5507094693593	274.3976053187394	21/02/24 15:44:51
21	962	334.7608913124875	274.40059877481804	21/02/24 15:44:51
21	962	334.8436227060216	274.1805421291199	21/02/24 15:44:51
21	962	334.86412374260175	274.26430728616606	21/02/24 15:44:52
21	962	334.7786502885098	274.2638316643921	21/02/24 15:44:52
21	962	334.73404406092914	274.4992553086949	21/02/24 15:44:52
21	962	334.87401396890147	274.28960032470405	21/02/24 15:44:52
21	962	334.91085280318634	274.37745484078954	21/02/24 15:44:52
21	962	334.9611328125489	274.37083179978237	21/02/24 15:44:52
21	962	334.86189848610115	274.40425326267047	21/02/24 15:44:52
21	962	334.59965114699656	274.2765349788276	21/02/24 15:44:52
21	962	334.6228025847168	274.44866778472226	21/02/24 15:44:52
21	962	334.6505843361311	274.7408891031251	21/02/24 15:44:53
21	962	334.58250272973345	274.7423474016477	21/02/24 15:44:53
21	962	334.5018695207337	274.8685322374782	21/02/24 15:44:53
21	962	334.36106509229984	275.0771454701365	21/02/24 15:44:53
21	962	334.2504568494817	275.02249046886305	21/02/24 15:44:53
21	962	334.33653522236375	274.91898775450085	21/02/24 15:44:53
21	962	334.32971438093267	274.6395479489575	21/02/24 15:44:53
21	962	334.3928697595826	274.71849303112	21/02/24 15:44:53
21	962	334.43676815428665	274.7486302504783	21/02/24 15:44:53
21	962	334.3587252618311	274.73600303272156	21/02/24 15:44:54
21	962	334.49756274972214	274.7940059914169	21/02/24 15:44:54
21	962	334.44962927509505	274.8102782197824	21/02/24 15:44:54
21	962	334.4563015601816	274.8215329636823	21/02/24 15:44:54
21	962	334.64095186565015	274.70082252759363	21/02/24 15:44:54
21	962	334.5081295707872	274.78294791835174	21/02/24 15:44:54
21	962	334.68309273426644	274.923528885654	21/02/24 15:44:54
21	962	334.6402274028036	274.71079172345895	21/02/24 15:44:54
21	962	334.647649110473	274.7780821124651	21/02/24 15:44:54
21	962	334.4961135996915	274.9779862320701	21/02/24 15:44:54
21	962	334.4961135996915	274.9779862320701	21/02/24 15:44:55
21	962	334.73252129831155	274.89858001650884	21/02/24 15:44:55
21	962	334.5732805430999	274.82355888162016	21/02/24 15:44:55
21	962	334.6169141299526	274.93947362689136	21/02/24 15:44:55
21	962	334.56304135459135	274.97768932316126	21/02/24 15:44:55
21	962	334.61022346244704	274.93705910075505	21/02/24 15:44:55
21	962	334.60991985303383	274.9365337608116	21/02/24 15:44:55
21	962	334.80686916875857	275.1254619271659	21/02/24 15:44:55
21	962	334.81386455787026	275.1552509409291	21/02/24 15:44:55
21	962	334.95788374078586	275.13709458717574	21/02/24 15:44:56
21	962	334.80049007364	275.05085986068616	21/02/24 15:44:56
21	962	334.8797181206675	274.9334986639045	21/02/24 15:44:56
21	962	334.83341523717223	274.8125645257513	21/02/24 15:44:56
21	962	334.7757072732012	274.87111537756925	21/02/24 15:44:56
21	962	334.7850083633332	274.95271496381065	21/02/24 15:44:56
21	962	334.7578304834683	274.93951832314207	21/02/24 15:44:56
21	962	334.78124809959616	274.9032065861893	21/02/24 15:44:56
21	962	334.6835654248096	274.8575992034074	21/02/24 15:44:56
21	962	334.63036243561606	274.8615415872118	21/02/24 15:44:57
21	962	334.7048914346538	274.6440931324971	21/02/24 15:44:57
21	962	334.97474983873286	274.57246715532204	21/02/24 15:44:57
21	962	334.9581917860044	274.5304836063705	21/02/24 15:44:57
21	962	334.9730654319489	274.4792698770918	21/02/24 15:44:57
21	962	334.9730654319489	274.4792698770918	21/02/24 15:44:57
21	962	335.0934067625006	274.5954447702208	21/02/24 15:44:57
21	962	335.28214763694245	274.4920079044215	21/02/24 15:44:57
21	962	335.3284519690829	274.27246461961	21/02/24 15:44:57
21	962	335.3284519690829	274.27246461961	21/02/24 15:44:57
21	962	335.2883994562508	274.2551128158448	21/02/24 15:44:58
21	962	335.3964245979537	274.25625581731276	21/02/24 15:44:58
21	962	335.3326477498771	274.04819192407433	21/02/24 15:44:58
21	962	335.3270131778934	273.9469993514553	21/02/24 15:44:58
21	962	335.33047391864534	273.93156686529466	21/02/24 15:44:58
21	962	335.0777285391723	274.06366536053645	21/02/24 15:44:58
21	962	335.0903865846393	274.0776888006852	21/02/24 15:44:58
21	962	335.0223804186275	273.9073196118644	21/02/24 15:44:58
21	962	335.0186495203573	273.9698483508044	21/02/24 15:44:58
21	962	335.0467188990925	273.9676631769028	21/02/24 15:44:59
21	962	335.04838018108364	273.96546221758354	21/02/24 15:44:59
21	962	335.06874146742103	273.96510242567325	21/02/24 15:44:59
21	962	335.08769763208176	273.9576235950558	21/02/24 15:44:59
21	962	335.14836382870135	273.99974718777867	21/02/24 15:44:59
21	962	335.1224160944077	273.97167997206367	21/02/24 15:44:59
21	962	335.0816771281707	274.19595514520256	21/02/24 15:44:59
21	962	335.0735430526065	274.25147400156624	21/02/24 15:44:59
21	962	335.1452689390223	274.41541883849084	21/02/24 15:44:59
21	962	335.2620081579161	274.33496802729513	21/02/24 15:45:00
21	962	335.2495279897301	274.42343594485743	21/02/24 15:45:00
21	962	335.2495279897301	274.42343594485743	21/02/24 15:45:00
21	962	335.2495279897301	274.42343594485743	21/02/24 15:45:00
21	962	335.403153386707	274.2259176739278	21/02/24 15:45:00
21	962	335.3694930747078	274.20861804646773	21/02/24 15:45:00
21	962	335.4072662464949	274.2870098892052	21/02/24 15:45:00
21	962	335.43829695821745	274.16167306866583	21/02/24 15:45:00
21	962	335.428049589645	273.9102395123515	21/02/24 15:45:00
21	962	335.417178725095	273.7371833449934	21/02/24 15:45:00
21	962	335.5497278767588	273.7704942072629	21/02/24 15:45:01
21	962	335.5866141325722	273.7191705150685	21/02/24 15:45:01
21	962	335.8465838569654	273.7020177013837	21/02/24 15:45:01
21	962	335.6893997386519	273.95494112815817	21/02/24 15:45:01
21	962	335.54747290913747	273.9737271963176	21/02/24 15:45:01
21	962	335.557887240869	273.99986639422895	21/02/24 15:45:01
21	962	335.47627104120244	274.16554001699905	21/02/24 15:45:01
21	962	335.54352109431267	274.25471653192125	21/02/24 15:45:01
21	962	335.5801583114514	274.26796732404705	21/02/24 15:45:01
21	962	335.72369963334455	274.31501571040246	21/02/24 15:45:02
21	962	335.636308252031	274.588639719189	21/02/24 15:45:02
21	962	335.7259657836032	274.81195167465995	21/02/24 15:45:02
21	962	335.8881969505388	274.77117913529935	21/02/24 15:45:02
21	962	336.0748439302211	274.887815777891	21/02/24 15:45:02
21	962	336.1778881709341	274.69503196338695	21/02/24 15:45:02
21	962	336.2128152323207	274.6308110926417	21/02/24 15:45:02
21	962	336.128715622783	274.70029502470396	21/02/24 15:45:02
21	962	336.08179954607147	274.68863974676105	21/02/24 15:45:02
21	962	336.05191153595115	274.7023319061697	21/02/24 15:45:02
21	962	335.9813714120815	274.97990432382727	21/02/24 15:45:03
21	962	336.11571154051154	274.95052071588543	21/02/24 15:45:03
21	962	336.16343722199645	274.95797347499325	21/02/24 15:45:03
21	962	336.1622902179304	274.95494545380154	21/02/24 15:45:03
21	962	336.16673189846	274.9554615916852	21/02/24 15:45:03
21	962	336.15329416791843	275.04075825754416	21/02/24 15:45:03
21	962	336.43056700826577	275.1532490313833	21/02/24 15:45:03
21	962	336.4784855622266	275.4416036171203	21/02/24 15:45:03
21	962	336.2937683531121	275.43670662925314	21/02/24 15:45:03
21	962	336.346957611162	275.3470823315394	21/02/24 15:45:04
21	962	336.4850832997635	275.3600391301523	21/02/24 15:45:04
21	962	336.58536010718456	275.3435770796012	21/02/24 15:45:04
21	962	336.4656938462032	275.3610120136983	21/02/24 15:45:04
21	962	336.6220186239282	275.46634253195447	21/02/24 15:45:04
21	962	336.6220186239282	275.46634253195447	21/02/24 15:45:04
21	962	336.7782572753771	275.50535907251935	21/02/24 15:45:04
21	962	336.81634237603816	275.49051130321135	21/02/24 15:45:04
21	962	336.9430160183445	275.55109935933035	21/02/24 15:45:04
21	962	337.216800511135	275.4585543187233	21/02/24 15:45:05
21	962	337.27861907493883	275.73141541975247	21/02/24 15:45:05
21	962	337.21297741151267	275.6456103726881	21/02/24 15:45:05
21	962	336.9684737010111	275.7511280288913	21/02/24 15:45:05
21	962	336.8679633082007	275.59540148049314	21/02/24 15:45:05
21	962	336.8679633082007	275.59540148049314	21/02/24 15:45:05
21	962	337.1003781099891	275.4559109089022	21/02/24 15:45:05
21	962	337.1407531943682	275.623004319941	21/02/24 15:45:05
21	962	336.98549874160994	275.72678671203715	21/02/24 15:45:05
21	962	337.0251267176974	275.833281631871	21/02/24 15:45:05
21	962	337.057370810903	275.79761969874636	21/02/24 15:45:06
21	962	336.9869682064329	275.8999230633251	21/02/24 15:45:06
21	962	336.9869682064329	275.8999230633251	21/02/24 15:45:06
21	962	337.03878322651644	275.70905846657786	21/02/24 15:45:06
21	962	336.85495611137935	275.48869258988674	21/02/24 15:45:06
21	962	336.5117715295211	275.3568468104946	21/02/24 15:45:06
21	962	336.65662518999056	275.1099098870761	21/02/24 15:45:06
21	962	336.53528107038557	275.05277388311345	21/02/24 15:45:06
21	962	336.4796160662894	274.94127098498103	21/02/24 15:45:06
21	962	336.34535927993187	275.08959825919754	21/02/24 15:45:07
21	962	336.34535927993187	275.08959825919754	21/02/24 15:45:07
21	962	336.4083418486553	275.1292424915896	21/02/24 15:45:07
21	962	336.3313734273349	275.19251629312936	21/02/24 15:45:07
21	962	336.2890679713562	275.074103047335	21/02/24 15:45:07
21	962	336.2192873378544	275.05018717985865	21/02/24 15:45:07
21	962	336.2192873378544	275.05018717985865	21/02/24 15:45:07
21	962	336.2349522378989	274.82775773645557	21/02/24 15:45:07
21	962	336.2375774462037	274.72947293600066	21/02/24 15:45:07
21	962	336.16994525548455	274.8980710332568	21/02/24 15:45:07
21	962	336.0095282307224	274.68449374562624	21/02/24 15:45:08
21	962	335.9820082097529	274.65676170299133	21/02/24 15:45:08
21	962	335.8799249580681	274.706476745387	21/02/24 15:45:08
21	962	335.9021243309214	274.704237602678	21/02/24 15:45:08
21	962	335.71842247935973	274.46883122162484	21/02/24 15:45:08
21	962	335.77074001751276	274.2638897642436	21/02/24 15:45:08
21	962	335.79727219093127	274.2797224802385	21/02/24 15:45:08
21	962	335.8627235162167	274.37457596975275	21/02/24 15:45:08
21	962	335.5856975096161	274.4047561150509	21/02/24 15:45:08
21	962	335.6845546572651	274.1112614113155	21/02/24 15:45:09
21	962	335.6845546572651	274.1112614113155	21/02/24 15:45:09
21	962	335.9734267580391	274.12162497645784	21/02/24 15:45:09
21	962	336.12287536269736	274.114498016451	21/02/24 15:45:09
21	962	336.15879057940595	273.92344127260645	21/02/24 15:45:09
21	962	336.21655251733563	273.8270447527009	21/02/24 15:45:09
21	962	336.21655251733563	273.8270447527009	21/02/24 15:45:09
21	962	336.1235983412713	273.9708724437052	21/02/24 15:45:09
21	962	336.2364197639527	274.02851255670475	21/02/24 15:45:09
21	962	336.27267863581244	273.9640616704921	21/02/24 15:45:10
21	962	336.3793501445807	274.00152035136705	21/02/24 15:45:10
21	962	336.50361399118503	273.88735852953664	21/02/24 15:45:10
21	962	336.5107141206685	273.9303745653865	21/02/24 15:45:10
21	962	336.4679485259832	273.9170515732484	21/02/24 15:45:10
21	962	336.6591079848934	274.0707602459549	21/02/24 15:45:10
21	962	336.5659417027154	274.06594080510547	21/02/24 15:45:10
21	962	336.5166270265804	274.18103834405343	21/02/24 15:45:10
21	962	336.6023216833389	274.0591714098296	21/02/24 15:45:10
21	962	336.6746862021235	273.9800215235596	21/02/24 15:45:10
21	962	336.57797047976004	274.06415016658093	21/02/24 15:45:11
21	962	336.6820780781357	273.85778904473096	21/02/24 15:45:11
21	962	336.61883888270836	273.91750088816076	21/02/24 15:45:11
21	962	336.4176263979828	273.94840586772267	21/02/24 15:45:11
21	962	336.69767658901213	273.9532906313944	21/02/24 15:45:11
21	962	336.70704379552956	274.1385554354003	21/02/24 15:45:11
21	962	336.9679660318049	274.0492781575347	21/02/24 15:45:11
21	962	336.9039734709308	274.0428013479432	21/02/24 15:45:11
21	962	337.0540732145922	273.9249631922539	21/02/24 15:45:11
21	962	336.9129434178819	273.99561013333675	21/02/24 15:45:12
21	962	336.8721865089964	273.9236570556058	21/02/24 15:45:12
21	962	336.7994182078886	273.9746538703437	21/02/24 15:45:12
21	962	336.78327697375073	273.9769585348368	21/02/24 15:45:12
21	962	336.8437242811518	274.0803362055265	21/02/24 15:45:12
21	962	336.8000319724603	274.1414819447914	21/02/24 15:45:12
21	962	336.62906631451693	274.3685739237762	21/02/24 15:45:12
21	962	336.45724261799	274.31775850868746	21/02/24 15:45:12
21	962	336.5750543686981	274.3552138827885	21/02/24 15:45:12
21	962	336.5750543686981	274.3552138827885	21/02/24 15:45:13
21	962	336.55772446914847	274.38594672047105	21/02/24 15:45:13
21	962	336.48535862071725	274.1130496403847	21/02/24 15:45:13
21	962	336.44842157531133	274.05749023276974	21/02/24 15:45:13
21	962	336.2044441865107	274.06306279611937	21/02/24 15:45:13
21	962	336.32546996332684	274.09507677818726	21/02/24 15:45:13
21	962	336.4499500551486	273.9390794784576	21/02/24 15:45:13
21	962	336.4996063593482	273.9281306249492	21/02/24 15:45:13
21	962	336.51671216093206	273.8840577991096	21/02/24 15:45:13
21	962	336.53936891623255	273.89068491183934	21/02/24 15:45:13
21	962	336.6883264098385	273.929523890528	21/02/24 15:45:14
21	962	336.612358952996	273.67577583532085	21/02/24 15:45:14
21	962	336.606116127049	273.4740064760153	21/02/24 15:45:14
21	962	336.64924344498127	273.59301965023303	21/02/24 15:45:14
21	962	336.5475413807022	273.49537328822794	21/02/24 15:45:14
21	962	336.5353662957928	273.5863654546506	21/02/24 15:45:14
21	962	336.4246597527977	273.34438486829924	21/02/24 15:45:14
21	962	336.4246597527977	273.34438486829924	21/02/24 15:45:14
21	962	336.3959937964741	273.3926247480182	21/02/24 15:45:14
21	962	336.1452063797888	273.43676564431985	21/02/24 15:45:15
21	962	336.3016357696319	273.5143509592029	21/02/24 15:45:15
21	962	336.13589651517367	273.3894652244923	21/02/24 15:45:15
21	962	336.28586536138687	273.4147765201987	21/02/24 15:45:15
21	962	336.28586536138687	273.4147765201987	21/02/24 15:45:15
21	962	336.0784284635843	273.2091632776907	21/02/24 15:45:15
21	962	335.8450588239898	273.0287939610755	21/02/24 15:45:15
21	962	335.73795938450303	272.76970830757676	21/02/24 15:45:15
21	962	335.8568775820264	272.71289563791134	21/02/24 15:45:15
21	962	335.9478353938671	272.7694112188941	21/02/24 15:45:16
21	962	335.9498019405265	272.7401473845157	21/02/24 15:45:16
21	962	335.8908537788718	272.8217886398822	21/02/24 15:45:16
21	962	335.7781596394588	272.7075594051969	21/02/24 15:45:16
21	962	335.9441496554404	272.74250382405035	21/02/24 15:45:16
21	962	335.8542959303825	272.7615349790061	21/02/24 15:45:16
21	962	335.8566103544657	272.7607931063118	21/02/24 15:45:16
21	962	335.86417139710585	272.5860428413503	21/02/24 15:45:16
21	962	335.86309864083	272.5873541069846	21/02/24 15:45:16
21	962	336.02928726522407	272.81125757867085	21/02/24 15:45:16
21	962	336.0260848376078	272.8187325171885	21/02/24 15:45:17
21	962	336.01731110066436	272.7108742635469	21/02/24 15:45:17
21	962	336.07060598436567	272.52035418685847	21/02/24 15:45:17
21	962	335.9636597727046	272.49221271454627	21/02/24 15:45:17
21	962	336.17337630119255	272.6511406958631	21/02/24 15:45:17
21	962	336.0726076985455	272.7485907570977	21/02/24 15:45:17
21	962	336.28533881478626	272.6158793330425	21/02/24 15:45:17
21	962	336.43471916156625	272.46440538267143	21/02/24 15:45:17
21	962	336.2419962482459	272.42389398134424	21/02/24 15:45:17
21	962	336.2419962482459	272.42389398134424	21/02/24 15:45:18
21	962	336.12398376114885	272.5211526070149	21/02/24 15:45:18
21	962	336.1302199577437	272.5226171980839	21/02/24 15:45:18
21	962	336.3789436377663	272.6166433119502	21/02/24 15:45:18
21	962	336.3789436377663	272.6166433119502	21/02/24 15:45:18
21	962	336.40107106258847	272.5950024332496	21/02/24 15:45:18
21	962	336.57206300940857	272.4105556754144	21/02/24 15:45:18
21	962	336.41810494620995	272.44025336880605	21/02/24 15:45:18
21	962	336.5570139694055	272.63096166624274	21/02/24 15:45:18
21	962	336.5570139694055	272.63096166624274	21/02/24 15:45:19
21	962	336.3164826258734	272.62266508489165	21/02/24 15:45:19
21	962	336.180886298312	272.81476999069565	21/02/24 15:45:19
21	962	336.06953218546136	272.76041957498666	21/02/24 15:45:19
21	962	336.10476777348214	272.64774810520663	21/02/24 15:45:19
21	962	336.10621937935184	272.5578245205561	21/02/24 15:45:19
21	962	336.0663522047974	272.4851789594049	21/02/24 15:45:19
21	962	336.26302767749064	272.58400808466706	21/02/24 15:45:19
21	962	336.10489731553616	272.5070215997597	21/02/24 15:45:19
21	962	335.92287725299263	272.55618553412853	21/02/24 15:45:20
21	962	335.84259345994434	272.6476285909011	21/02/24 15:45:20
21	962	335.81566996582995	272.62316780881724	21/02/24 15:45:20
21	962	335.5524389113674	272.6349822496192	21/02/24 15:45:20
21	962	335.7477705383451	272.76286676169315	21/02/24 15:45:20
21	962	335.7477705383451	272.76286676169315	21/02/24 15:45:20
21	962	335.52169397867925	272.92961520292397	21/02/24 15:45:20
21	962	335.36214332820276	272.8180475212091	21/02/24 15:45:20
21	962	335.36136495905987	272.8717303323715	21/02/24 15:45:20
21	962	335.41543163058367	273.00834058298165	21/02/24 15:45:20
21	962	335.41543163058367	273.00834058298165	21/02/24 15:45:21
21	962	335.2112675457861	272.89829513600466	21/02/24 15:45:21
21	962	335.1680186828807	272.6254054366338	21/02/24 15:45:21
21	962	335.1581995326503	272.63170556874684	21/02/24 15:45:21
21	962	335.10021148301723	272.368497298541	21/02/24 15:45:21
21	962	335.01079307904797	272.4002038437266	21/02/24 15:45:21
21	962	335.0072814548984	272.5210669038851	21/02/24 15:45:21
21	962	334.94048696977165	272.6171478974613	21/02/24 15:45:21
21	962	334.9070249030419	272.59975470600926	21/02/24 15:45:21
21	962	335.03216581377495	272.43108248827065	21/02/24 15:45:22
21	962	335.02435101528926	272.4920444266868	21/02/24 15:45:22
21	962	335.0235741551111	272.49619571317163	21/02/24 15:45:22
21	962	334.986504043883	272.712205741245	21/02/24 15:45:22
21	962	334.93835483483775	272.72063493369643	21/02/24 15:45:22
21	962	334.8842864970466	272.7038143338874	21/02/24 15:45:22
21	962	334.892393423847	272.73183815477705	21/02/24 15:45:22
21	962	335.12165414131806	272.85946836694495	21/02/24 15:45:22
21	962	335.1894938602952	272.844966032611	21/02/24 15:45:22
21	962	335.05515600483574	272.75230196018373	21/02/24 15:45:22
21	962	335.06056232251444	272.8882394851348	21/02/24 15:45:23
21	962	335.11382824165435	272.8697814990331	21/02/24 15:45:23
21	962	335.1069339046485	272.88527458054017	21/02/24 15:45:23
21	962	335.05960614997866	273.03365041115444	21/02/24 15:45:23
21	962	335.05867643484737	273.02724494371944	21/02/24 15:45:23
21	962	335.0940729663017	273.0310929909497	21/02/24 15:45:23
21	962	334.94000155555784	272.9531984154007	21/02/24 15:45:23
21	962	334.94000155555784	272.9531984154007	21/02/24 15:45:23
21	962	334.86545112046707	273.05360723851476	21/02/24 15:45:23
21	962	334.8379897344534	273.12206885977236	21/02/24 15:45:24
21	962	334.5966905876736	273.2476171959104	21/02/24 15:45:24
21	962	334.6305677177946	273.34178864499125	21/02/24 15:45:24
21	962	334.5057312084816	273.3397581301964	21/02/24 15:45:24
21	962	334.4700777024392	273.48689628324644	21/02/24 15:45:24
21	962	334.4700777024392	273.48689628324644	21/02/24 15:45:24
21	962	334.5437788423656	273.5321277506511	21/02/24 15:45:24
21	962	334.46566502372514	273.77530513378633	21/02/24 15:45:24
21	962	334.6751663827832	273.65116934787176	21/02/24 15:45:24
21	962	334.76646121296756	273.5714958206445	21/02/24 15:45:25
21	962	334.78644064432115	273.74686510764167	21/02/24 15:45:25
21	962	334.8482952338159	273.8231207270644	21/02/24 15:45:25
21	962	334.9846674554369	273.79920528420155	21/02/24 15:45:25
21	962	335.0807706784622	273.8158435354323	21/02/24 15:45:25
21	962	335.0807706784622	273.8158435354323	21/02/24 15:45:25
21	962	335.3728100972448	273.63274490216367	21/02/24 15:45:25
21	962	335.4203054105066	273.5823895943284	21/02/24 15:45:25
21	962	335.28330563758715	273.73234660425436	21/02/24 15:45:25
21	962	335.28330563758715	273.73234660425436	21/02/24 15:45:26
21	962	335.18238514302953	273.70820919396937	21/02/24 15:45:26
21	962	335.09460177510675	273.7353234266297	21/02/24 15:45:26
21	962	335.09460177510675	273.7353234266297	21/02/24 15:45:26
21	962	335.34680646761075	273.7409948691595	21/02/24 15:45:26
21	962	335.3898691613493	273.7100657228105	21/02/24 15:45:26
21	962	335.43251206942125	273.69184492911126	21/02/24 15:45:26
21	962	335.309510866892	273.5994586696218	21/02/24 15:45:26
21	962	335.2586077355105	273.70583228960413	21/02/24 15:45:26
21	962	335.2054128459778	273.83833751413	21/02/24 15:45:26
21	962	335.3945047746484	273.7627105385336	21/02/24 15:45:27
21	962	335.09731400809505	273.78172174748397	21/02/24 15:45:27
21	962	335.2951868975675	273.62091068622783	21/02/24 15:45:27
21	962	335.2706898721581	273.6095333719906	21/02/24 15:45:27
21	962	335.2706898721581	273.6095333719906	21/02/24 15:45:27
21	962	335.2894446164333	273.5868539161781	21/02/24 15:45:27
21	962	335.3327087956997	273.6339632349459	21/02/24 15:45:27
21	962	335.3114763347461	273.669501454931	21/02/24 15:45:27
21	962	335.42062586855457	273.8446255795652	21/02/24 15:45:27
21	962	335.45417757899145	273.8051935788333	21/02/24 15:45:28
21	962	335.1943185415322	273.80637743478485	21/02/24 15:45:28
21	962	334.9929785819855	273.91368251770416	21/02/24 15:45:28
21	962	335.07024756452466	273.63317242725816	21/02/24 15:45:28
21	962	334.99041070912784	273.62915362586284	21/02/24 15:45:28
21	962	334.99041070912784	273.62915362586284	21/02/24 15:45:28
21	962	335.22449780284427	273.61439876446514	21/02/24 15:45:28
21	962	335.30348473385453	273.60662366229894	21/02/24 15:45:28
21	962	335.361135949882	273.40420233328337	21/02/24 15:45:28
21	962	335.36444471786416	273.40065368121583	21/02/24 15:45:29
21	962	335.4097365495376	273.40922759574295	21/02/24 15:45:29
21	962	335.4923839424207	273.27611914769636	21/02/24 15:45:29
21	962	335.43588391643067	273.339949013196	21/02/24 15:45:29
21	962	335.49717860305026	273.17163990154	21/02/24 15:45:29
21	962	335.5912080325713	273.37316958758197	21/02/24 15:45:29
21	962	335.57927902352765	273.6431240548474	21/02/24 15:45:29
21	962	335.7522337894689	273.7082221707441	21/02/24 15:45:29
21	962	335.4609948592294	273.70219020396905	21/02/24 15:45:29
21	962	335.4482339193626	273.6746888507995	21/02/24 15:45:29
21	962	335.38085344963736	273.7668683004194	21/02/24 15:45:30
21	962	335.14116900451546	273.6199913807165	21/02/24 15:45:30
21	962	335.2518409740829	273.52050599429896	21/02/24 15:45:30
21	962	335.3353846716154	273.58791451613445	21/02/24 15:45:30
21	962	335.3353846716154	273.58791451613445	21/02/24 15:45:30
21	962	335.36082826061295	273.35206194753897	21/02/24 15:45:30
21	962	335.64130828022826	273.4364588503509	21/02/24 15:45:30
21	962	335.864157397718	273.5949673561551	21/02/24 15:45:30
21	962	335.8938817501419	273.8703041642201	21/02/24 15:45:30
21	962	335.8938817501419	273.8703041642201	21/02/24 15:45:31
21	962	335.9756018808571	273.63818185109784	21/02/24 15:45:31
21	962	335.9256521489331	273.4276409907638	21/02/24 15:45:31
21	962	335.9256521489331	273.4276409907638	21/02/24 15:45:31
21	962	335.9443363599914	273.4014677734249	21/02/24 15:45:31
21	962	335.6697739848083	273.34712509116184	21/02/24 15:45:31
21	962	335.6781930084561	273.34480860511286	21/02/24 15:45:31
21	962	335.62324575442284	273.28244468492085	21/02/24 15:45:31
21	962	335.68271388536965	272.98920611744325	21/02/24 15:45:31
21	962	335.81029892515244	272.96662124490814	21/02/24 15:45:32
21	962	335.6640045898411	272.89052667381895	21/02/24 15:45:32
21	962	335.8092391752373	272.8283744243264	21/02/24 15:45:32
21	962	335.7944551040866	272.8113349310262	21/02/24 15:45:32
21	962	336.000613042637	272.97431105065857	21/02/24 15:45:32
21	962	336.1849405495142	272.99587401313323	21/02/24 15:45:32
21	962	336.2662097010337	273.2225201366512	21/02/24 15:45:32
21	962	336.09826291886435	273.0883410640881	21/02/24 15:45:32
21	962	336.2027124822869	273.03689347971	21/02/24 15:45:32
21	962	336.168545460036	273.1162369948099	21/02/24 15:45:32
21	962	336.168545460036	273.1162369948099	21/02/24 15:45:33
21	962	336.2094770895315	273.10270787424236	21/02/24 15:45:33
21	962	336.2390100250696	272.996341757226	21/02/24 15:45:33
21	962	336.2497646759071	273.1794853039175	21/02/24 15:45:33
21	962	336.0759801412136	272.9596187335817	21/02/24 15:45:33
21	962	335.98994164267293	273.160170550474	21/02/24 15:45:33
21	962	335.90424628806795	273.3538832862311	21/02/24 15:45:33
21	962	335.8531252236546	273.0738825179118	21/02/24 15:45:33
21	962	335.71916203413645	272.9761363583903	21/02/24 15:45:33
21	962	335.7071452119324	273.0123332484494	21/02/24 15:45:34
21	962	335.49002706719546	273.0309984555632	21/02/24 15:45:34
21	962	335.53673848490513	273.0724907627169	21/02/24 15:45:34
21	962	335.28161791768247	273.1715057310869	21/02/24 15:45:34
21	962	335.1452378423331	273.2056651826776	21/02/24 15:45:34
21	962	335.1982009744727	272.9626404509138	21/02/24 15:45:34
21	962	335.3700242253883	272.8996382660533	21/02/24 15:45:34
21	962	335.5686665329064	272.75341697410784	21/02/24 15:45:34
21	962	335.63125755341883	272.6496448933455	21/02/24 15:45:34
21	962	335.4328656577859	272.7451497918643	21/02/24 15:45:35
21	962	335.33317130755864	272.47505373708765	21/02/24 15:45:35
21	962	335.4128563456644	272.5646728527294	21/02/24 15:45:35
21	962	335.65932875349284	272.7157026966564	21/02/24 15:45:35
21	962	335.6354963416837	272.66937259289483	21/02/24 15:45:35
21	962	335.76957951212523	272.77478310845885	21/02/24 15:45:35
21	962	335.51388390723673	272.8572996126627	21/02/24 15:45:35
21	962	335.51388390723673	272.8572996126627	21/02/24 15:45:35
21	962	335.4406210845021	272.70447779381874	21/02/24 15:45:35
21	962	335.36961305278686	272.6788340625961	21/02/24 15:45:35
21	962	335.3874970511726	272.72112781385016	21/02/24 15:45:36
21	962	335.4169254647005	272.74431043456474	21/02/24 15:45:36
21	962	335.1372820667394	272.7699112692544	21/02/24 15:45:36
21	962	335.1372820667394	272.7699112692544	21/02/24 15:45:36
21	962	334.99925611451306	272.7397610935365	21/02/24 15:45:36
21	962	335.1143303207688	272.90869956647873	21/02/24 15:45:36
21	962	335.0650139601243	272.61628620899273	21/02/24 15:45:36
21	962	335.11988542926946	272.6172818019496	21/02/24 15:45:36
21	962	335.30503699590014	272.59829674561087	21/02/24 15:45:36
21	962	335.30503699590014	272.59829674561087	21/02/24 15:45:37
21	962	335.3515060595942	272.5292926190156	21/02/24 15:45:37
21	962	335.49101195124376	272.57400388153314	21/02/24 15:45:37
21	962	335.56477598651406	272.66687830093747	21/02/24 15:45:37
21	962	335.56477598651406	272.66687830093747	21/02/24 15:45:37
21	962	335.6366819457709	272.46510127089556	21/02/24 15:45:37
21	962	335.78641724237684	272.50713412694955	21/02/24 15:45:37
21	962	335.85446143223976	272.6037906066926	21/02/24 15:45:37
21	962	335.64985101384485	272.48656145608214	21/02/24 15:45:37
21	962	335.7296781279924	272.4206009700063	21/02/24 15:45:38
21	962	335.71261576005594	272.49948236940423	21/02/24 15:45:38
21	962	335.6812934197157	272.50460113311874	21/02/24 15:45:38
21	962	335.6812934197157	272.50460113311874	21/02/24 15:45:38
21	962	335.55459002725644	272.63197666683476	21/02/24 15:45:38
21	962	335.55459002725644	272.63197666683476	21/02/24 15:45:38
21	962	335.549033842113	272.73867481459644	21/02/24 15:45:38
21	962	335.7402460677625	272.78337007284455	21/02/24 15:45:38
21	962	335.7402460677625	272.78337007284455	21/02/24 15:45:38
21	962	335.37552833533556	273.0594894206578	21/02/24 15:45:39
21	962	335.41443144814485	272.91032744288685	21/02/24 15:45:39
21	962	335.5683774491676	272.9243743641182	21/02/24 15:45:39
21	962	335.74254150570647	273.0597310997635	21/02/24 15:45:39
21	962	335.6035226825539	273.11467849127376	21/02/24 15:45:39
21	962	335.7559976817287	273.3458936648901	21/02/24 15:45:39
21	962	335.55462484410117	273.47937074786694	21/02/24 15:45:39
21	962	335.5180107616523	273.549395730658	21/02/24 15:45:39
21	962	335.63394713815745	273.4201489617557	21/02/24 15:45:39
21	962	335.6987158367861	273.4793563689198	21/02/24 15:45:39
21	962	335.69671267948013	273.4832593934922	21/02/24 15:45:40
21	962	335.6047448435438	273.5658188264977	21/02/24 15:45:40
21	962	335.6851485811996	273.4846544922697	21/02/24 15:45:40
21	962	335.5375177743102	273.7175616335596	21/02/24 15:45:40
21	962	335.5357722571375	273.721582066984	21/02/24 15:45:40
21	962	335.5384185610768	273.816182961604	21/02/24 15:45:40
21	962	335.4399638801692	273.72258423274155	21/02/24 15:45:40
21	962	335.5216968687927	273.81232664430627	21/02/24 15:45:40
21	962	335.53022160608117	273.8047436244438	21/02/24 15:45:40
21	962	335.60152056321175	273.75253748310007	21/02/24 15:45:41
21	962	335.72436870812624	273.93802911164545	21/02/24 15:45:41
21	962	335.9271001975765	274.06082454219154	21/02/24 15:45:41
21	962	335.9467628660826	273.9666016675167	21/02/24 15:45:41
21	962	335.90179862650007	274.1496319238825	21/02/24 15:45:41
21	962	335.869052340886	274.17347833500276	21/02/24 15:45:41
21	962	335.78740702552665	274.14152688239153	21/02/24 15:45:41
21	962	335.7272675341711	274.2212064355896	21/02/24 15:45:41
21	962	335.73279619572577	274.12110720292554	21/02/24 15:45:41
21	962	335.7388480758857	274.1788803283432	21/02/24 15:45:42
21	962	335.6186498967369	274.3166517011359	21/02/24 15:45:42
21	962	335.62541913837623	274.42115559272435	21/02/24 15:45:42
21	962	335.53615311358203	274.63642596326713	21/02/24 15:45:42
21	962	335.44515524283116	274.4519416087862	21/02/24 15:45:42
21	962	335.4188284715314	274.2030245936046	21/02/24 15:45:42
21	962	335.43559130528723	274.1795584247499	21/02/24 15:45:42
21	962	335.2278667915785	274.23305653229824	21/02/24 15:45:42
21	962	335.27988953263224	273.99913945950937	21/02/24 15:45:42
21	962	335.09911055811773	273.7962236024008	21/02/24 15:45:42
21	962	334.96622021027974	273.634161421652	21/02/24 15:45:43
21	962	334.9601597256181	273.7139459726767	21/02/24 15:45:43
21	962	334.89698662980084	273.7760266343356	21/02/24 15:45:43
21	962	334.8948961699873	273.7835808320753	21/02/24 15:45:43
21	962	334.80196097193704	273.7743451927326	21/02/24 15:45:43
21	962	334.7491390130079	273.92300791046347	21/02/24 15:45:43
21	962	334.94283297580574	273.9569108191636	21/02/24 15:45:43
21	962	334.75099952547623	274.131484432557	21/02/24 15:45:43
21	962	334.7565059187814	274.1337649421357	21/02/24 15:45:43
21	962	334.73799784347153	274.2340989548851	21/02/24 15:45:44
21	962	334.6032364163803	274.3316999116321	21/02/24 15:45:44
21	962	334.72557733055567	274.4582563107956	21/02/24 15:45:44
21	962	334.7920982893694	274.43558427766436	21/02/24 15:45:44
21	962	334.8326558196581	274.2283959640876	21/02/24 15:45:44
21	962	334.68366676825985	274.45232968433174	21/02/24 15:45:44
21	962	334.6597080175686	274.29259280684664	21/02/24 15:45:44
21	962	334.8081942707158	274.2233198819383	21/02/24 15:45:44
21	962	334.7110424109667	274.2457855723493	21/02/24 15:45:44
21	962	334.6451504040296	274.20046128154183	21/02/24 15:45:45
21	962	334.62989093955804	274.2023401351038	21/02/24 15:45:45
21	962	334.9209390601853	274.14683296770403	21/02/24 15:45:45
21	962	335.07094589453476	274.087190906328	21/02/24 15:45:45
21	962	334.81185851630164	274.1404670494519	21/02/24 15:45:45
21	962	334.6081042288958	274.16410967456443	21/02/24 15:45:45
21	962	334.4339249058066	274.35623043078925	21/02/24 15:45:45
21	962	334.44840713238256	274.3760697932429	21/02/24 15:45:45
21	962	334.4060572883599	274.31606129636873	21/02/24 15:45:45
21	962	334.28932931045745	274.29631350599146	21/02/24 15:45:45
21	962	334.3454803496394	274.26850899731255	21/02/24 15:45:46
21	962	334.37689521062765	274.1260900833545	21/02/24 15:45:46
21	962	334.37689521062765	274.1260900833545	21/02/24 15:45:46
21	962	334.37689521062765	274.1260900833545	21/02/24 15:45:46
21	962	334.1927383369003	274.0056674431925	21/02/24 15:45:46
21	962	334.08474416826806	274.1778075600275	21/02/24 15:45:46
21	962	334.163759303434	273.9032916422859	21/02/24 15:45:46
21	962	334.17040180524026	273.97096346405203	21/02/24 15:45:46
21	962	334.34959655447705	273.91319975779686	21/02/24 15:45:46
21	962	334.1917151658469	274.09252670934063	21/02/24 15:45:47
21	962	334.24470582164173	274.0767908695533	21/02/24 15:45:47
21	962	334.1790646709364	273.93039320360697	21/02/24 15:45:47
21	962	334.131954537876	273.95744974431005	21/02/24 15:45:47
21	962	334.17975261113804	273.9399316048018	21/02/24 15:45:47
21	962	334.17146496773216	273.89942335032435	21/02/24 15:45:47
21	962	334.1577162063146	273.64293985571857	21/02/24 15:45:47
21	962	334.1027280604219	273.71485235126124	21/02/24 15:45:47
21	962	334.1027438238335	273.61959924501343	21/02/24 15:45:47
21	962	334.0457420743784	273.55917606756134	21/02/24 15:45:48
21	962	334.1565380529333	273.6233648523869	21/02/24 15:45:48
21	962	334.2415758139132	273.6111546047524	21/02/24 15:45:48
21	962	334.4988716962795	273.7167143630387	21/02/24 15:45:48
21	962	334.61127155966085	273.97558490787674	21/02/24 15:45:48
21	962	334.45609403762023	273.91392262383664	21/02/24 15:45:48
21	962	334.4919854496853	273.9421204412726	21/02/24 15:45:48
21	962	334.26451098416004	274.1105139615144	21/02/24 15:45:48
21	962	334.4914769620509	274.0570151792569	21/02/24 15:45:48
21	962	334.6021027322484	273.95674343687085	21/02/24 15:45:49
21	962	334.53292205734004	273.94998731690055	21/02/24 15:45:49
21	962	334.5773964215902	273.96624556465	21/02/24 15:45:49
21	962	334.42247602595046	274.08540048064566	21/02/24 15:45:49
21	962	334.45912867845027	274.1975412855356	21/02/24 15:45:49
21	962	334.42224453215033	273.90694420144655	21/02/24 15:45:49
21	962	334.5145502829157	273.98929482643297	21/02/24 15:45:49
21	962	334.5094040182059	273.82734546616035	21/02/24 15:45:49
21	962	334.73786870511947	273.86657852807474	21/02/24 15:45:49
21	962	334.73406689290863	273.8641790210126	21/02/24 15:45:49
21	962	334.7584174556111	273.5766275933613	21/02/24 15:45:50
21	962	334.81133978898583	273.5120739551443	21/02/24 15:45:50
21	962	334.9977478753511	273.6193273835485	21/02/24 15:45:50
21	962	335.1482969132855	273.5376676724757	21/02/24 15:45:50
21	962	334.99514752184604	273.72493888191843	21/02/24 15:45:50
21	962	334.98899978595415	273.71589886048577	21/02/24 15:45:50
21	962	335.1268680241005	273.73097343371717	21/02/24 15:45:50
21	962	335.1268680241005	273.73097343371717	21/02/24 15:45:50
21	962	335.12173421227715	274.0082657323573	21/02/24 15:45:50
21	962	334.856120696	273.9389141508015	21/02/24 15:45:51
21	962	334.71027416818146	273.82691997025955	21/02/24 15:45:51
21	962	334.6298343723189	273.91320603709823	21/02/24 15:45:51
21	962	334.5002920064989	273.79934587016277	21/02/24 15:45:51
21	962	334.45265307806386	273.7291182917252	21/02/24 15:45:51
21	962	334.44070005272346	273.7352465362026	21/02/24 15:45:51
21	962	334.5045817596848	273.6745333692924	21/02/24 15:45:51
21	962	334.70238657725724	273.5576120494266	21/02/24 15:45:51
21	962	334.77079265167566	273.7611099220749	21/02/24 15:45:51
21	962	334.76935301654373	273.7674431473875	21/02/24 15:45:52
21	962	334.8189662964539	273.71708098387217	21/02/24 15:45:52
21	962	334.96570913518445	273.6055767608173	21/02/24 15:45:52
21	962	334.9698522432399	273.6114912478185	21/02/24 15:45:52
21	962	334.96323039978137	273.45759100970434	21/02/24 15:45:52
21	962	334.9264752059655	273.4416653585076	21/02/24 15:45:52
21	962	334.8925333709137	273.4031094804627	21/02/24 15:45:52
21	962	334.67705668383246	273.346780573713	21/02/24 15:45:52
21	962	334.4166924226451	273.4151223250509	21/02/24 15:45:52
21	962	334.5111709765886	273.3048574319249	21/02/24 15:45:52
21	962	334.55952747027146	273.3816863855764	21/02/24 15:45:53
21	962	334.57311815924874	273.32609546453955	21/02/24 15:45:53
21	962	334.3067196720422	273.25779546348116	21/02/24 15:45:53
21	962	334.34517407830253	273.27076437173986	21/02/24 15:45:53
21	962	334.38628646120856	273.2736506389223	21/02/24 15:45:53
21	962	334.2419402791972	273.1851167238926	21/02/24 15:45:53
21	962	334.2419402791972	273.1851167238926	21/02/24 15:45:53
21	962	334.15305607808733	273.03240445245984	21/02/24 15:45:53
21	962	334.0686888893694	272.94486725771895	21/02/24 15:45:53
21	962	334.140735925413	272.9162279423525	21/02/24 15:45:54
21	962	334.09268836842585	272.8447026959583	21/02/24 15:45:54
21	962	334.2353246615165	272.77248307725847	21/02/24 15:45:54
21	962	334.15067474331516	272.8523015047884	21/02/24 15:45:54
21	962	333.86417335428257	272.7654289873839	21/02/24 15:45:54
21	962	333.96164775231887	272.906754677008	21/02/24 15:45:54
21	962	333.9501854364581	272.9891826927022	21/02/24 15:45:54
21	962	334.18780348754257	272.94256168025424	21/02/24 15:45:54
21	962	334.18237327228195	272.94919494458566	21/02/24 15:45:54
21	962	334.1609088445758	272.9671796183554	21/02/24 15:45:54
21	962	333.9771919200094	272.92891524320765	21/02/24 15:45:55
21	962	333.97961674525607	272.8702904490355	21/02/24 15:45:55
21	962	334.22981414237074	272.897176469736	21/02/24 15:45:55
21	962	334.1314496353764	272.8573093673346	21/02/24 15:45:55
21	962	334.0885769305067	273.0290645730099	21/02/24 15:45:55
21	962	334.16422676918233	272.7705017061881	21/02/24 15:45:55
21	962	333.8773261947467	272.7233705756103	21/02/24 15:45:55
21	962	333.7540405032451	272.7060720746551	21/02/24 15:45:55
21	962	333.7540405032451	272.7060720746551	21/02/24 15:45:55
21	962	333.7253065699958	272.9256421266111	21/02/24 15:45:56
21	962	333.603408203572	273.1489343710917	21/02/24 15:45:56
21	962	333.5263297382124	273.1850481796974	21/02/24 15:45:56
21	962	333.24766418350987	273.1706491637244	21/02/24 15:45:56
21	962	333.29406216407824	273.08007689860517	21/02/24 15:45:56
21	962	333.55478367833433	273.00318884005185	21/02/24 15:45:56
21	962	333.6434581412071	273.16735158500273	21/02/24 15:45:56
21	962	333.53742203715774	273.1906749631178	21/02/24 15:45:56
21	962	333.42397536678516	273.07996639789707	21/02/24 15:45:56
21	962	333.4759559532084	273.09625089105884	21/02/24 15:45:56
21	962	333.4887534633989	273.06134418458083	21/02/24 15:45:57
21	962	333.48146562168296	273.1865755599936	21/02/24 15:45:57
21	962	333.5630082978316	273.2012012369091	21/02/24 15:45:57
21	962	333.86193508329757	273.22354967819405	21/02/24 15:45:57
21	962	333.7324942036848	272.99374609689016	21/02/24 15:45:57
21	962	333.8939597707176	272.51359233631933	21/02/24 15:45:57
21	962	333.8939597707176	272.51359233631933	21/02/24 15:45:57
21	962	334.05989127323426	272.808706222754	21/02/24 15:45:57
21	962	334.05989127323426	272.808706222754	21/02/24 15:45:57
21	962	334.06236272918323	272.68414569366365	21/02/24 15:45:58
21	962	334.0274587291557	272.65351900030316	21/02/24 15:45:58
21	962	333.98439386914936	272.64690860431944	21/02/24 15:45:58
21	962	333.98439386914936	272.64690860431944	21/02/24 15:45:58
21	962	333.7397194638328	272.8606184636052	21/02/24 15:45:58
21	962	333.58283281214574	272.87304950603885	21/02/24 15:45:58
21	962	333.48037102349633	272.96990865782107	21/02/24 15:45:58
21	962	333.45030297075743	273.05895172286614	21/02/24 15:45:58
21	962	333.2665438069049	273.09788745216383	21/02/24 15:45:58
21	962	333.45134479316835	273.23450888659	21/02/24 15:45:59
21	962	333.54648906195985	273.30807477809145	21/02/24 15:45:59
21	962	333.5049286607012	273.3847288388239	21/02/24 15:45:59
21	962	333.3673386114699	273.1360310053366	21/02/24 15:45:59
21	962	333.438902204408	273.28103287000545	21/02/24 15:45:59
21	962	333.45873188260447	273.48874468541663	21/02/24 15:45:59
21	962	333.5789729909918	273.74690652937124	21/02/24 15:45:59
21	962	333.602891831077	273.7397906534582	21/02/24 15:45:59
21	962	333.3106407462613	273.74149773441553	21/02/24 15:45:59
21	962	333.2729867844185	273.77783232445637	21/02/24 15:45:59
21	962	333.28053071587595	273.9251316712816	21/02/24 15:46:00
21	962	333.35818409702074	273.9306237375282	21/02/24 15:46:00
21	962	333.33200144616677	274.15925918323893	21/02/24 15:46:00
21	962	333.25429601801017	274.1874882462715	21/02/24 15:46:00
21	962	333.1900033210619	274.09750845798504	21/02/24 15:46:00
21	962	332.96746196417695	274.11951107513295	21/02/24 15:46:00
21	962	333.1943676585109	273.9404245386891	21/02/24 15:46:00
21	962	333.05989175532847	274.0631365893264	21/02/24 15:46:00
21	962	333.16668152218676	274.3123805211499	21/02/24 15:46:00
21	962	333.38931113274504	274.485061873989	21/02/24 15:46:01
21	962	333.5438128165437	274.45831835415817	21/02/24 15:46:01
21	962	333.7570471076404	274.26115566265975	21/02/24 15:46:01
21	962	333.66022493949333	274.05733011198697	21/02/24 15:46:01
21	962	333.3694102902742	274.02399461290406	21/02/24 15:46:01
21	962	333.1473605297329	274.02363266662354	21/02/24 15:46:01
21	962	333.16301034753565	273.9964410517059	21/02/24 15:46:01
21	962	333.0645671367088	274.02151732879054	21/02/24 15:46:01
21	962	333.06398167394684	274.0167342622502	21/02/24 15:46:01
21	962	333.2347188731785	273.8718702078956	21/02/24 15:46:02
21	962	333.2584705567633	273.8535576817262	21/02/24 15:46:02
21	962	333.0901163708115	273.9952719808016	21/02/24 15:46:02
21	962	333.3542141796535	273.99389140599754	21/02/24 15:46:02
21	962	333.47136792087707	274.22429392596507	21/02/24 15:46:02
21	962	333.5386666751179	274.22797017694757	21/02/24 15:46:02
21	962	333.6230672298	273.9871364622074	21/02/24 15:46:02
21	962	333.4105185569284	274.12901979694817	21/02/24 15:46:02
21	962	333.4508307175312	274.1294667202721	21/02/24 15:46:02
21	962	333.4533665646969	274.1292686473658	21/02/24 15:46:03
21	962	333.4589047127412	274.10476511870183	21/02/24 15:46:03
21	962	333.5277262080098	274.27488680954457	21/02/24 15:46:03
21	962	333.52475546515757	274.3307037717258	21/02/24 15:46:03
21	962	333.3332458528659	274.3206451486663	21/02/24 15:46:03
21	962	333.13258157129263	274.53368790826613	21/02/24 15:46:03
21	962	332.9139899070862	274.3479301168999	21/02/24 15:46:03
21	962	333.131587259418	274.33826974749945	21/02/24 15:46:03
21	962	333.2595878444997	274.3773406443642	21/02/24 15:46:03
21	962	333.1811466175124	274.3726707232951	21/02/24 15:46:03
21	962	333.0754150333914	274.2581749123305	21/02/24 15:46:04
21	962	333.0539369532689	274.2596124277141	21/02/24 15:46:04
21	962	333.0812138814707	274.28572455794983	21/02/24 15:46:04
21	962	332.95170072440254	274.29852432073585	21/02/24 15:46:04
21	962	332.87968864778804	274.2475352361189	21/02/24 15:46:04
21	962	332.743663528878	274.13098826959595	21/02/24 15:46:04
21	962	332.63947927379905	274.1723783045447	21/02/24 15:46:04
21	962	332.6182656553799	274.1879302946759	21/02/24 15:46:04
21	962	332.5792408831767	274.33023854917906	21/02/24 15:46:04
21	962	332.6770523470867	274.4598803866066	21/02/24 15:46:05
21	962	332.83209223583214	274.55962399777377	21/02/24 15:46:05
21	962	332.70881789851984	274.7886579578428	21/02/24 15:46:05
21	962	332.6132646897922	275.00110394486717	21/02/24 15:46:05
21	962	332.787449009214	275.1003887691599	21/02/24 15:46:05
21	962	332.73614115355855	275.234972664268	21/02/24 15:46:05
21	962	332.71587532519777	275.18119599940496	21/02/24 15:46:05
21	962	332.8037732357041	275.2677573807741	21/02/24 15:46:05
21	962	332.89262751650483	275.19913239488113	21/02/24 15:46:05
21	962	333.0235920131807	275.0171335769953	21/02/24 15:46:06
21	962	332.91019651837007	274.9149676686099	21/02/24 15:46:06
21	962	332.836422284532	274.86331413299536	21/02/24 15:46:06
21	962	332.8318387866088	274.87048858012895	21/02/24 15:46:06
21	962	332.78198209757323	274.70539440027636	21/02/24 15:46:06
21	962	332.86428040646655	274.719314534831	21/02/24 15:46:06
21	962	332.69486319651446	274.744121299446	21/02/24 15:46:06
21	962	332.81298729723795	274.6181117457222	21/02/24 15:46:06
21	962	332.76678543430756	274.7161682112907	21/02/24 15:46:06
21	962	332.5221087159647	274.8774024064864	21/02/24 15:46:06
21	962	332.275212840815	274.8902803243028	21/02/24 15:46:07
21	962	332.3186319155236	274.89740573218774	21/02/24 15:46:07
21	962	332.2931015716289	274.9649348291536	21/02/24 15:46:07
21	962	332.3202674834487	274.93848261201737	21/02/24 15:46:07
21	962	332.3332451762287	274.9194961436585	21/02/24 15:46:07
21	962	332.2651019562799	275.07039425398045	21/02/24 15:46:07
21	962	332.2478844367654	275.106101864394	21/02/24 15:46:07
21	962	332.3876482425089	275.0582431673036	21/02/24 15:46:07
21	962	332.3812482542472	275.05255273110413	21/02/24 15:46:07
21	962	332.5171988015051	274.9536149203509	21/02/24 15:46:08
21	962	332.5225048948678	274.8206421992377	21/02/24 15:46:08
21	962	332.3321033173386	274.62820285233636	21/02/24 15:46:08
21	962	332.3745878109692	274.66911808423816	21/02/24 15:46:08
21	962	332.3703410112023	274.6690096570805	21/02/24 15:46:08
21	962	332.3865706549227	274.7333291057992	21/02/24 15:46:08
21	962	332.32864923960585	274.9197195459452	21/02/24 15:46:08
21	962	332.3449248524888	274.948842481802	21/02/24 15:46:08
21	962	332.3011811216777	274.9207608891771	21/02/24 15:46:08
21	962	332.24945712053903	274.67132301725417	21/02/24 15:46:09
21	962	332.2275251156309	274.4753119119045	21/02/24 15:46:09
21	962	332.3883631974136	274.63638737894996	21/02/24 15:46:09
21	962	332.51648482618987	274.7779660447682	21/02/24 15:46:09
21	962	332.3647423795321	274.85442839934433	21/02/24 15:46:09
21	962	332.1693993984359	274.88695203745556	21/02/24 15:46:09
21	962	332.16119379785414	274.92782744885983	21/02/24 15:46:09
21	962	331.9858533669767	274.7144089660541	21/02/24 15:46:09
21	962	331.79147004383526	274.7110558502807	21/02/24 15:46:09
21	962	331.7640807939289	274.7463722177655	21/02/24 15:46:09
21	962	331.9614832509324	274.56113976240204	21/02/24 15:46:10
21	962	331.9455366327455	274.55389760948805	21/02/24 15:46:10
21	962	331.8603514345627	274.7237477719661	21/02/24 15:46:10
21	962	331.78584327432526	274.8622416698559	21/02/24 15:46:10
21	962	332.0333266289163	274.8707985796978	21/02/24 15:46:10
21	962	332.17192843344026	274.7877646309624	21/02/24 15:46:10
21	962	332.1662781282057	275.06858016991015	21/02/24 15:46:10
21	962	331.9241371110079	274.9135747541874	21/02/24 15:46:10
21	962	332.0581618827416	274.90490932153836	21/02/24 15:46:10
21	962	332.0829640583334	274.87919104356604	21/02/24 15:46:11
21	962	332.0647861748514	274.8823577882519	21/02/24 15:46:11
21	962	332.1600136379154	274.63554645932265	21/02/24 15:46:11
21	962	332.15281937525526	274.4739657946437	21/02/24 15:46:11
21	962	332.4459229416885	274.47370007160924	21/02/24 15:46:11
21	962	332.4573760580353	274.4279168131393	21/02/24 15:46:11
21	962	332.5015790905751	274.6034722258752	21/02/24 15:46:11
21	962	332.33918367933956	274.36572588817756	21/02/24 15:46:11
21	962	332.3176226103329	274.31453812753637	21/02/24 15:46:11
21	962	332.1775636507177	274.28520338867105	21/02/24 15:46:12
21	962	332.2911205727502	274.24738189986266	21/02/24 15:46:12
21	962	332.3707917032962	274.21416444940127	21/02/24 15:46:12
21	962	332.20109751061403	274.1816021374458	21/02/24 15:46:12
21	962	332.0145880196282	274.3001717631713	21/02/24 15:46:12
21	962	331.97347839845594	274.3685013264812	21/02/24 15:46:12
21	962	331.92676169314836	274.3577755741854	21/02/24 15:46:12
21	962	331.93304436914025	274.5074299059084	21/02/24 15:46:12
21	962	331.90193268435917	274.57110137145196	21/02/24 15:46:12
21	962	332.0132260632656	274.6150392142137	21/02/24 15:46:13
21	962	332.01752379827496	274.6140730488016	21/02/24 15:46:13
21	962	332.1168612288188	274.616751813137	21/02/24 15:46:13
21	962	332.12384174994946	274.56389621946795	21/02/24 15:46:13
21	962	331.96353670754684	274.52503033896204	21/02/24 15:46:13
21	962	331.9653380130861	274.50271181819755	21/02/24 15:46:13
21	962	332.02893839145014	274.35827313277355	21/02/24 15:46:13
21	962	332.0262394878279	274.3524364743126	21/02/24 15:46:13
21	962	332.1683520263899	274.1717178235742	21/02/24 15:46:13
21	962	332.0593526758215	274.0611570792014	21/02/24 15:46:13
21	962	332.0541111340877	274.0583000841565	21/02/24 15:46:14
21	962	331.95684063224235	273.9594188589129	21/02/24 15:46:14
21	962	332.1870482687127	274.06679931453107	21/02/24 15:46:14
21	962	332.18724123583087	274.0547654134681	21/02/24 15:46:14
21	962	332.2946208778237	274.14286487677566	21/02/24 15:46:14
21	962	332.3639724146693	274.0427910668573	21/02/24 15:46:14
21	962	332.3639724146693	274.0427910668573	21/02/24 15:46:14
