floorId	partitionId	location_x	location_y	timeStamp
19	958	365.55243192741585	288.59648801263694	21/02/24 15:42:19
19	958	365.55243192741585	288.59648801263694	21/02/24 15:42:20
19	958	365.55243192741585	288.59648801263694	21/02/24 15:42:21
19	959	362.3530560401282	287.71527633822046	21/02/24 15:42:22
19	959	362.3530560401282	287.71527633822046	21/02/24 15:42:23
19	990	357.82242061436574	282.16385269148645	21/02/24 15:42:24
19	NULL	360.5547106147948	283.12207921272073	21/02/24 15:42:25
19	964	355.482293890607	282.3613173869535	21/02/24 15:42:26
19	964	355.482293890607	282.3613173869535	21/02/24 15:42:27
19	968	355.71807547868275	279.11092240486005	21/02/24 15:42:28
19	945	354.54681611956306	276.9555468868248	21/02/24 15:42:29
19	904	347.25758750563756	270.59329170523137	21/02/24 15:42:30
19	904	345.5840669454654	272.03626967984314	21/02/24 15:42:31
19	904	345.5840669454654	272.03626967984314	21/02/24 15:42:32
19	919	341.8507959684553	269.41861351939014	21/02/24 15:42:33
19	919	340.2475697813879	268.6028650417705	21/02/24 15:42:34
19	NULL	337.73701806888556	270.34580290420837	21/02/24 15:42:35
19	909	333.79691834538926	273.32229963118385	21/02/24 15:42:36
19	909	333.4071053969908	273.0002052198683	21/02/24 15:42:37
19	909	333.79691834538926	273.32229963118385	21/02/24 15:42:38
19	909	333.40710539699086	273.0002052198683	21/02/24 15:42:39
19	909	330.2883825087984	271.703362840502	21/02/24 15:42:40
19	900	327.2230053463675	269.6378469350531	21/02/24 15:42:41
19	900	325.33470491008825	269.6240183086286	21/02/24 15:42:42
19	900	325.33470491008825	269.6240183086286	21/02/24 15:42:43
19	900	322.74561175648233	266.3469506524756	21/02/24 15:42:44
19	900	322.74561175648233	266.34695065247564	21/02/24 15:42:45
19	900	322.74561175648233	266.3469506524756	21/02/24 15:42:46
19	900	322.74561175648233	266.3469506524756	21/02/24 15:42:47
19	900	322.74561175648233	266.34695065247564	21/02/24 15:42:48
19	900	322.74561175648233	266.34695065247564	21/02/24 15:42:49
19	900	322.74561175648233	266.34695065247564	21/02/24 15:42:50
19	900	322.74561175648233	266.34695065247564	21/02/24 15:42:51
19	900	322.74561175648233	266.34695065247564	21/02/24 15:42:52
19	900	322.74561175648233	266.34695065247564	21/02/24 15:42:53
19	900	322.74561175648233	266.34695065247564	21/02/24 15:42:54
19	900	322.74561175648233	266.3469506524756	21/02/24 15:42:55
19	900	322.74561175648233	266.34695065247564	21/02/24 15:42:56
19	900	322.74561175648233	266.34695065247564	21/02/24 15:42:57
19	900	322.74561175648233	266.34695065247564	21/02/24 15:42:58
19	900	322.74561175648233	266.34695065247564	21/02/24 15:42:59
19	900	322.74561175648233	266.34695065247564	21/02/24 15:43:00
19	900	322.74561175648233	266.34695065247564	21/02/24 15:43:01
19	900	322.74561175648233	266.34695065247564	21/02/24 15:43:02
19	900	322.74561175648233	266.34695065247564	21/02/24 15:43:03
19	900	322.74561175648233	266.3469506524756	21/02/24 15:43:04
19	900	322.74561175648233	266.3469506524756	21/02/24 15:43:05
19	900	322.74561175648233	266.3469506524756	21/02/24 15:43:06
19	900	322.74561175648233	266.34695065247564	21/02/24 15:43:07
19	900	322.74561175648233	266.3469506524756	21/02/24 15:43:08
19	900	325.33470491008825	269.6240183086286	21/02/24 15:43:09
19	900	325.33470491008825	269.6240183086286	21/02/24 15:43:10
19	909	326.737153683381	273.3535535783339	21/02/24 15:43:11
19	909	329.0152670680587	273.689476616074	21/02/24 15:43:12
19	955	331.14052623366666	274.53372397223194	21/02/24 15:43:13
19	955	331.14052623366666	274.53372397223194	21/02/24 15:43:14
19	955	328.92321811554416	278.4499778858854	21/02/24 15:43:15
19	955	328.92321811554416	278.4499778858854	21/02/24 15:43:16
19	955	328.92321811554416	278.4499778858854	21/02/24 15:43:17
19	955	328.92321811554416	278.4499778858854	21/02/24 15:43:18
19	955	328.92321811554416	278.4499778858854	21/02/24 15:43:19
19	955	332.13398995625107	274.9863189954403	21/02/24 15:43:20
19	955	328.92321811554416	278.4499778858854	21/02/24 15:43:21
19	955	328.92321811554416	278.4499778858854	21/02/24 15:43:22
19	955	328.92321811554416	278.4499778858854	21/02/24 15:43:23
19	955	328.92321811554416	278.4499778858854	21/02/24 15:43:24
19	955	328.92321811554416	278.4499778858854	21/02/24 15:43:25
19	955	328.92321811554416	278.4499778858854	21/02/24 15:43:26
19	955	328.92321811554416	278.4499778858854	21/02/24 15:43:27
19	955	328.92321811554416	278.4499778858854	21/02/24 15:43:28
19	955	328.92321811554416	278.4499778858854	21/02/24 15:43:29
19	955	328.92321811554416	278.4499778858854	21/02/24 15:43:30
19	955	328.92321811554416	278.4499778858854	21/02/24 15:43:31
19	955	328.92321811554416	278.4499778858854	21/02/24 15:43:32
19	955	328.92321811554416	278.4499778858854	21/02/24 15:43:33
19	955	328.92321811554416	278.4499778858854	21/02/24 15:43:34
19	955	328.92321811554416	278.4499778858854	21/02/24 15:43:35
19	955	328.92321811554416	278.4499778858854	21/02/24 15:43:36
19	955	328.92321811554416	278.4499778858854	21/02/24 15:43:37
19	955	328.92321811554416	278.4499778858854	21/02/24 15:43:38
19	955	332.13398995625107	274.9863189954403	21/02/24 15:43:39
19	955	328.92321811554416	278.4499778858854	21/02/24 15:43:40
19	955	328.92321811554416	278.4499778858854	21/02/24 15:43:41
19	955	328.92321811554416	278.4499778858854	21/02/24 15:43:42
19	955	328.92321811554416	278.4499778858854	21/02/24 15:43:43
19	955	328.92321811554416	278.4499778858854	21/02/24 15:43:44
19	955	332.13398995625107	274.9863189954403	21/02/24 15:43:45
19	955	331.5796102272668	277.2385535448373	21/02/24 15:43:46
19	915	336.54156488011523	280.3558442180772	21/02/24 15:43:47
19	964	349.72234002988336	284.71465847817086	21/02/24 15:43:48
19	964	349.72234002988336	284.71465847817086	21/02/24 15:43:49
19	964	349.72234002988336	284.71465847817086	21/02/24 15:43:50
19	964	355.482293890607	282.3613173869535	21/02/24 15:43:51
19	964	355.482293890607	282.3613173869535	21/02/24 15:43:52
19	964	355.482293890607	282.3613173869535	21/02/24 15:43:53
19	990	357.82242061436574	282.16385269148645	21/02/24 15:43:54
19	990	357.82242061436585	282.16385269148645	21/02/24 15:43:55
19	990	357.82242061436585	282.16385269148645	21/02/24 15:43:56
19	959	362.3530560401282	287.71527633822046	21/02/24 15:43:57
19	958	364.8238741505902	287.1482151372541	21/02/24 15:43:58
19	958	364.8238741505902	287.1482151372541	21/02/24 15:43:59
19	958	365.55243192741585	288.59648801263694	21/02/24 15:44:00
19	958	365.55243192741585	288.59648801263694	21/02/24 15:44:01
19	958	365.55243192741585	288.59648801263694	21/02/24 15:44:02
19	958	365.55243192741585	288.59648801263694	21/02/24 15:44:03
19	958	365.55243192741585	288.59648801263694	21/02/24 15:44:04
19	958	365.55243192741585	288.59648801263694	21/02/24 15:44:05
19	958	364.8238741505902	287.1482151372541	21/02/24 15:44:06
19	NULL	368.6441963719141	285.32200544753397	21/02/24 15:44:07
19	990	371.87975649755595	282.80894332222346	21/02/24 15:44:08
19	990	373.5702263177357	281.590961967497	21/02/24 15:44:09
19	990	373.5702263177357	281.590961967497	21/02/24 15:44:10
19	990	373.5702263177357	281.590961967497	21/02/24 15:44:11
19	990	373.5702263177357	281.590961967497	21/02/24 15:44:12
19	990	373.5702263177357	281.590961967497	21/02/24 15:44:13
19	990	373.5702263177357	281.590961967497	21/02/24 15:44:14
19	990	373.5702263177357	281.590961967497	21/02/24 15:44:15
19	990	373.5702263177357	281.590961967497	21/02/24 15:44:16
19	990	373.5702263177357	281.590961967497	21/02/24 15:44:17
19	990	373.5702263177357	281.590961967497	21/02/24 15:44:18
19	990	373.5702263177357	281.590961967497	21/02/24 15:44:19
19	990	373.5702263177357	281.590961967497	21/02/24 15:44:20
19	990	373.5702263177357	281.590961967497	21/02/24 15:44:21
19	990	373.5702263177357	281.590961967497	21/02/24 15:44:22
19	937	374.6323604046247	279.0631299285737	21/02/24 15:44:23
19	990	373.5702263177357	281.590961967497	21/02/24 15:44:24
19	990	373.5702263177357	281.590961967497	21/02/24 15:44:25
19	990	373.5702263177357	281.590961967497	21/02/24 15:44:26
19	990	373.5702263177357	281.590961967497	21/02/24 15:44:27
19	990	373.5702263177357	281.590961967497	21/02/24 15:44:28
19	990	371.87975649755595	282.8089433222234	21/02/24 15:44:29
19	990	371.87975649755595	282.8089433222234	21/02/24 15:44:30
19	990	373.5702263177357	281.590961967497	21/02/24 15:44:31
19	990	373.5702263177357	281.590961967497	21/02/24 15:44:32
19	910	371.49991506597235	283.64243362381774	21/02/24 15:44:33
19	987	363.64647505929315	279.84759664761776	21/02/24 15:44:34
19	990	363.0255287252569	282.5550180117545	21/02/24 15:44:35
19	NULL	360.5547106147949	283.12207921272073	21/02/24 15:44:36
19	NULL	360.5547106147949	283.12207921272073	21/02/24 15:44:37
19	990	357.82242061436574	282.16385269148645	21/02/24 15:44:38
19	990	357.82242061436574	282.16385269148645	21/02/24 15:44:39
19	964	355.482293890607	282.3613173869535	21/02/24 15:44:40
19	964	355.482293890607	282.3613173869535	21/02/24 15:44:41
19	964	355.482293890607	282.3613173869535	21/02/24 15:44:42
19	964	355.482293890607	282.3613173869535	21/02/24 15:44:43
19	940	347.9711572177418	278.13370891448585	21/02/24 15:44:44
19	964	341.9483564172974	281.53052240391844	21/02/24 15:44:45
19	915	336.54156488011523	280.3558442180772	21/02/24 15:44:46
19	955	332.13398995625107	274.9863189954403	21/02/24 15:44:47
19	955	332.13398995625107	274.9863189954403	21/02/24 15:44:48
19	955	331.57961022726676	277.2385535448373	21/02/24 15:44:49
19	955	328.92321811554416	278.4499778858854	21/02/24 15:44:50
19	955	328.92321811554416	278.4499778858854	21/02/24 15:44:51
19	955	328.92321811554416	278.4499778858854	21/02/24 15:44:52
19	955	323.9884222877308	280.17133116751256	21/02/24 15:44:53
19	NULL	322.7688919024709	282.9508947625264	21/02/24 15:44:55
19	897	319.01521359261704	283.59757186890573	21/02/24 15:44:56
19	897	319.01521359261704	283.59757186890573	21/02/24 15:44:57
19	897	319.01521359261704	283.59757186890573	21/02/24 15:44:58
19	897	319.01521359261704	283.59757186890573	21/02/24 15:44:59
19	975	315.07586920053365	286.03778962296946	21/02/24 15:45:00
19	980	311.1000485048991	283.6794021053163	21/02/24 15:45:01
19	980	311.1000485048991	283.6794021053163	21/02/24 15:45:02
19	929	307.59178972789636	285.09780219467183	21/02/24 15:45:03
19	929	307.5917897278964	285.09780219467183	21/02/24 15:45:04
19	929	307.5917897278964	285.09780219467183	21/02/24 15:45:05
19	980	310.36738320623186	287.58936639951213	21/02/24 15:45:06
19	980	310.36738320623186	287.58936639951213	21/02/24 15:45:07
19	980	310.36738320623186	287.58936639951213	21/02/24 15:45:08
19	980	310.36738320623186	287.58936639951213	21/02/24 15:45:09
19	980	310.36738320623186	287.58936639951213	21/02/24 15:45:10
19	980	310.36738320623186	287.58936639951213	21/02/24 15:45:11
19	980	310.36738320623186	287.58936639951213	21/02/24 15:45:12
19	980	310.36738320623186	287.58936639951213	21/02/24 15:45:13
19	980	310.36738320623186	287.58936639951213	21/02/24 15:45:14
19	980	310.36738320623186	287.58936639951213	21/02/24 15:45:15
19	980	310.36738320623186	287.58936639951213	21/02/24 15:45:16
19	980	310.36738320623186	287.58936639951213	21/02/24 15:45:17
19	980	310.36738320623186	287.58936639951213	21/02/24 15:45:18
19	980	310.36738320623186	287.58936639951213	21/02/24 15:45:19
19	980	310.36738320623186	287.58936639951213	21/02/24 15:45:20
19	980	310.36738320623186	287.58936639951213	21/02/24 15:45:21
19	929	307.5917897278964	285.09780219467183	21/02/24 15:45:22
19	929	307.59178972789636	285.09780219467183	21/02/24 15:45:23
19	929	307.59178972789636	285.09780219467183	21/02/24 15:45:24
19	980	311.1000485048991	283.6794021053163	21/02/24 15:45:25
19	980	311.1000485048991	283.6794021053162	21/02/24 15:45:26
19	897	319.01521359261704	283.59757186890573	21/02/24 15:45:27
19	897	319.01521359261704	283.59757186890573	21/02/24 15:45:28
19	897	319.01521359261704	283.59757186890573	21/02/24 15:45:29
19	897	319.01521359261704	283.59757186890573	21/02/24 15:45:30
19	NULL	322.7688919024709	282.9508947625264	21/02/24 15:45:31
19	NULL	322.7688919024709	282.9508947625264	21/02/24 15:45:32
19	NULL	322.7688919024709	282.9508947625264	21/02/24 15:45:33
19	955	328.92321811554416	278.4499778858854	21/02/24 15:45:34
19	955	328.92321811554416	278.4499778858854	21/02/24 15:45:35
19	955	328.92321811554416	278.4499778858854	21/02/24 15:45:36
19	955	328.92321811554416	278.4499778858854	21/02/24 15:45:37
19	955	328.92321811554416	278.4499778858854	21/02/24 15:45:38
19	915	336.54156488011523	280.3558442180772	21/02/24 15:45:39
19	964	340.0438894327782	286.2192342684243	21/02/24 15:45:40
19	964	344.3155484927012	283.53998029232963	21/02/24 15:45:41
19	895	344.21493558062156	279.99700365155473	21/02/24 15:45:42
19	964	349.72234002988336	284.71465847817086	21/02/24 15:45:43
19	964	355.482293890607	282.3613173869535	21/02/24 15:45:44
19	964	355.482293890607	282.3613173869535	21/02/24 15:45:45
19	964	355.482293890607	282.3613173869535	21/02/24 15:45:46
19	964	355.482293890607	282.3613173869535	21/02/24 15:45:47
19	945	357.72180770228624	278.62087605071156	21/02/24 15:45:48
19	NULL	360.5547106147949	283.12207921272073	21/02/24 15:45:49
19	NULL	360.5547106147948	283.12207921272073	21/02/24 15:45:50
19	958	364.8238741505902	287.1482151372541	21/02/24 15:45:51
19	959	364.13925124804297	284.5462645050939	21/02/24 15:45:52
19	NULL	368.6441963719141	285.32200544753397	21/02/24 15:45:53
19	910	371.49991506597235	283.6424336238178	21/02/24 15:45:54
19	990	373.5702263177357	281.5909619674969	21/02/24 15:45:55
19	990	373.5702263177357	281.5909619674969	21/02/24 15:45:56
19	905	375.09542798338026	284.54571340969284	21/02/24 15:45:57
19	905	375.09542798338026	284.54571340969284	21/02/24 15:45:58
19	905	375.09542798338026	284.54571340969284	21/02/24 15:45:59
19	905	375.09542798338026	284.54571340969284	21/02/24 15:46:00
19	905	375.09542798338026	284.54571340969284	21/02/24 15:46:01
19	905	375.09542798338026	284.54571340969284	21/02/24 15:46:02
19	990	373.5702263177357	281.5909619674969	21/02/24 15:46:03
19	990	373.5702263177357	281.590961967497	21/02/24 15:46:04
19	910	371.49991506597235	283.64243362381774	21/02/24 15:46:05
19	NULL	368.6441963719141	285.32200544753397	21/02/24 15:46:06
19	958	364.8238741505902	287.1482151372541	21/02/24 15:46:07
19	959	362.3530560401282	287.71527633822046	21/02/24 15:46:08
19	959	362.3530560401282	287.71527633822046	21/02/24 15:46:09
19	959	362.3530560401282	287.71527633822046	21/02/24 15:46:10
19	959	362.3530560401282	287.71527633822046	21/02/24 15:46:11
19	959	362.3530560401282	287.71527633822046	21/02/24 15:46:12
19	959	362.3530560401282	287.71527633822046	21/02/24 15:46:13
19	959	362.3530560401282	287.71527633822046	21/02/24 15:46:14
19	959	362.3530560401282	287.71527633822046	21/02/24 15:46:15
19	959	362.3530560401282	287.71527633822046	21/02/24 15:46:16
19	959	362.3530560401282	287.71527633822046	21/02/24 15:46:17
19	959	362.3530560401282	287.71527633822046	21/02/24 15:46:18
19	959	362.3530560401282	287.71527633822046	21/02/24 15:46:19
19	959	362.3530560401282	287.71527633822046	21/02/24 15:46:20
19	959	362.3530560401282	287.71527633822046	21/02/24 15:46:21
19	918	358.31519680311567	286.86252054896266	21/02/24 15:46:22
19	959	362.3530560401282	287.71527633822046	21/02/24 15:46:23
19	959	362.3530560401282	287.71527633822046	21/02/24 15:46:24
19	918	358.31519680311567	286.86252054896266	21/02/24 15:46:25
19	959	362.3530560401282	287.71527633822046	21/02/24 15:46:26
19	918	358.31519680311567	286.86252054896266	21/02/24 15:46:27
19	959	362.3530560401282	287.71527633822046	21/02/24 15:46:28
19	959	362.3530560401282	287.71527633822046	21/02/24 15:46:29
19	959	362.3530560401282	287.71527633822046	21/02/24 15:46:30
19	959	362.3530560401282	287.71527633822046	21/02/24 15:46:31
19	959	362.3530560401282	287.71527633822046	21/02/24 15:46:32
19	959	362.3530560401282	287.71527633822046	21/02/24 15:46:33
19	918	358.31519680311567	286.86252054896266	21/02/24 15:46:34
19	959	362.3530560401282	287.71527633822046	21/02/24 15:46:35
19	959	362.3530560401282	287.71527633822046	21/02/24 15:46:36
19	918	358.31519680311567	286.86252054896266	21/02/24 15:46:37
19	959	362.3530560401282	287.71527633822046	21/02/24 15:46:38
19	959	362.3530560401282	287.71527633822046	21/02/24 15:46:39
19	959	362.3530560401282	287.71527633822046	21/02/24 15:46:40
19	959	362.3530560401282	287.71527633822046	21/02/24 15:46:41
19	959	362.3530560401282	287.71527633822046	21/02/24 15:46:42
