floorId	partitionId	location_x	location_y	timeStamp
3	42	352.0898782617341	257.6816897320676	20/04/28 05:17:19
3	42	352.0898782617341	257.6816897320676	20/04/28 05:17:20
3	42	352.0898782617341	257.6816897320676	20/04/28 05:17:21
3	42	352.0898782617341	257.6816897320676	20/04/28 05:17:22
3	42	352.0898782617341	257.6816897320676	20/04/28 05:17:23
3	42	352.0898782617341	257.6816897320676	20/04/28 05:17:24
3	42	352.0898782617341	257.6816897320676	20/04/28 05:17:25
3	42	352.0898782617341	257.6816897320676	20/04/28 05:17:26
3	42	352.0898782617341	257.6816897320676	20/04/28 05:17:27
3	42	352.0898782617341	257.6816897320676	20/04/28 05:17:28
3	42	352.0898782617341	257.6816897320676	20/04/28 05:17:29
3	42	352.0898782617341	257.6816897320676	20/04/28 05:17:30
3	42	352.0898782617341	257.6816897320676	20/04/28 05:17:31
3	42	352.0898782617341	257.6816897320676	20/04/28 05:17:32
3	42	352.0898782617341	257.6816897320676	20/04/28 05:17:33
3	42	352.0898782617341	257.6816897320676	20/04/28 05:17:34
3	42	352.0898782617341	257.6816897320676	20/04/28 05:17:35
3	42	352.0898782617341	257.6816897320676	20/04/28 05:17:36
3	42	352.0898782617341	257.6816897320676	20/04/28 05:17:37
3	42	352.0898782617341	257.6816897320676	20/04/28 05:17:38
3	42	352.0898782617341	257.6816897320676	20/04/28 05:17:39
3	42	352.0898782617341	257.6816897320676	20/04/28 05:17:40
3	42	352.0898782617341	257.6816897320676	20/04/28 05:17:41
3	42	352.0898782617341	257.6816897320676	20/04/28 05:17:42
3	42	352.0898782617341	257.6816897320676	20/04/28 05:17:43
3	42	352.0898782617341	257.6816897320676	20/04/28 05:17:44
3	42	352.0898782617341	257.6816897320676	20/04/28 05:17:45
3	42	352.0898782617341	257.6816897320676	20/04/28 05:17:46
3	42	352.0898782617341	257.6816897320676	20/04/28 05:17:47
3	42	352.0898782617341	257.6816897320676	20/04/28 05:17:48
3	42	352.0898782617341	257.6816897320676	20/04/28 05:17:49
3	42	352.0898782617341	257.6816897320676	20/04/28 05:17:50
3	42	352.0898782617341	257.6816897320676	20/04/28 05:17:51
3	42	352.0898782617341	257.6816897320676	20/04/28 05:17:52
3	42	352.0898782617341	257.6816897320676	20/04/28 05:17:53
3	42	352.0898782617341	257.6816897320676	20/04/28 05:17:54
3	42	352.0898782617341	257.6816897320676	20/04/28 05:17:55
3	54	354.3948115151741	261.6556623953523	20/04/28 05:17:56
3	54	354.93110780732565	263.85962413987545	20/04/28 05:17:57
3	54	358.23287936641947	263.0061707425011	20/04/28 05:17:58
3	54	358.23287936641947	263.0061707425011	20/04/28 05:17:59
3	34	362.2167196060361	259.70189758364177	20/04/28 05:18:00
3	17	361.9057312824121	254.45903554354518	20/04/28 05:18:01
3	34	361.2642468288334	255.55936173685845	20/04/28 05:18:02
3	17	363.0633788732786	253.76883669815365	20/04/28 05:18:03
3	17	362.3945272480641	251.57317905073432	20/04/28 05:18:04
3	17	362.3945272480641	251.57317905073432	20/04/28 05:18:05
3	17	362.3945272480641	251.57317905073432	20/04/28 05:18:06
3	17	362.3945272480641	251.57317905073432	20/04/28 05:18:07
3	17	362.3945272480641	251.57317905073432	20/04/28 05:18:08
3	17	362.3945272480641	251.57317905073432	20/04/28 05:18:09
3	17	362.3945272480641	251.57317905073432	20/04/28 05:18:10
3	17	362.3945272480641	251.57317905073432	20/04/28 05:18:11
3	17	362.3945272480641	251.57317905073432	20/04/28 05:18:12
3	17	362.3945272480641	251.57317905073432	20/04/28 05:18:13
3	17	362.3945272480641	251.57317905073432	20/04/28 05:18:14
3	17	362.3945272480641	251.57317905073432	20/04/28 05:18:15
3	17	362.3945272480641	251.57317905073432	20/04/28 05:18:16
3	17	362.3945272480641	251.57317905073432	20/04/28 05:18:17
3	17	359.96968039487183	251.3655491305634	20/04/28 05:18:18
3	17	359.96968039487183	251.3655491305634	20/04/28 05:18:19
3	17	362.3945272480641	251.57317905073432	20/04/28 05:18:20
3	17	359.96968039487183	251.3655491305634	20/04/28 05:18:21
3	17	362.3945272480641	251.57317905073432	20/04/28 05:18:22
3	17	359.96968039487183	251.3655491305634	20/04/28 05:18:23
3	17	362.3945272480641	251.57317905073432	20/04/28 05:18:24
3	17	359.96968039487183	251.3655491305634	20/04/28 05:18:25
3	17	362.3945272480641	251.57317905073432	20/04/28 05:18:26
3	30	361.5359815708335	246.73539932578205	20/04/28 05:18:27
3	30	361.5359815708335	246.73539932578205	20/04/28 05:18:28
3	17	359.96968039487183	251.3655491305634	20/04/28 05:18:29
3	17	359.96968039487183	251.3655491305634	20/04/28 05:18:30
3	30	360.46690033995947	246.70758975930266	20/04/28 05:18:31
3	17	359.96968039487183	251.3655491305634	20/04/28 05:18:32
3	17	359.96968039487183	251.3655491305634	20/04/28 05:18:33
3	17	359.96968039487183	251.3655491305634	20/04/28 05:18:34
3	17	359.96968039487183	251.3655491305634	20/04/28 05:18:35
3	17	359.96968039487183	251.3655491305634	20/04/28 05:18:36
3	30	360.46690033995947	246.70758975930266	20/04/28 05:18:37
3	17	359.96968039487183	251.3655491305634	20/04/28 05:18:38
3	17	359.96968039487183	251.3655491305634	20/04/28 05:18:39
3	17	359.96968039487183	251.3655491305634	20/04/28 05:18:40
3	30	361.5359815708335	246.73539932578205	20/04/28 05:18:41
3	17	359.96968039487183	251.3655491305634	20/04/28 05:18:42
3	17	362.3945272480641	251.57317905073432	20/04/28 05:18:43
3	17	359.96968039487183	251.3655491305634	20/04/28 05:18:44
3	17	359.96968039487183	251.3655491305634	20/04/28 05:18:45
3	17	362.3945272480641	251.57317905073432	20/04/28 05:18:46
