floorId	partitionId	location_x	location_y	timeStamp
1	56	310.6507198038572	267.21263962728966	20/04/28 05:17:35
1	56	310.54490889716897	267.082555794533	20/04/28 05:17:35
1	56	310.37593023316356	266.8748135781971	20/04/28 05:17:35
1	56	310.1920527645492	266.6487547849819	20/04/28 05:17:35
1	56	310.066475679562	266.4943704305441	20/04/28 05:17:35
1	56	309.9544509520349	266.3566473320814	20/04/28 05:17:35
1	56	309.7692480611082	266.12895906587704	20/04/28 05:17:36
1	56	309.63017710946775	265.95798536400895	20/04/28 05:17:36
1	56	309.5179877293	265.8200598417391	20/04/28 05:17:36
1	56	309.38022408679524	265.6506933445373	20/04/28 05:17:36
1	56	309.26451623381735	265.5084422149844	20/04/28 05:17:36
1	56	309.1044325055735	265.31163542460985	20/04/28 05:17:36
1	56	308.9986057718474	265.18153213410716	20/04/28 05:17:36
1	56	308.836487271445	264.9822237966855	20/04/28 05:17:36
1	56	308.6634644753598	264.76950972803695	20/04/28 05:17:36
1	56	308.5146715535771	264.58658384488973	20/04/28 05:17:37
1	56	308.36060831804616	264.39717864279834	20/04/28 05:17:37
1	56	308.25154246241084	264.26309317875695	20/04/28 05:17:37
1	56	308.1549222403512	264.1443083653506	20/04/28 05:17:37
1	56	308.1549222403512	264.1443083653506	20/04/28 05:17:37
1	56	307.9693712575843	263.91619215535343	20/04/28 05:17:37
1	56	307.8067949904261	263.7163210398972	20/04/28 05:17:37
1	56	307.7113114209948	263.59893362620164	20/04/28 05:17:37
1	56	307.61249403628216	263.4774476230216	20/04/28 05:17:37
1	56	307.44955953183506	263.2771360909672	20/04/28 05:17:37
1	56	307.2788646583697	263.0672839682771	20/04/28 05:17:38
1	56	307.1767123863588	262.94169805767586	20/04/28 05:17:38
1	56	307.02899707243347	262.7600969846515	20/04/28 05:17:38
1	56	306.88796413696593	262.58671122164503	20/04/28 05:17:38
1	56	306.7002884569431	262.35598291076764	20/04/28 05:17:38
1	56	306.52031556688195	262.1347244028859	20/04/28 05:17:38
1	56	306.41701539819456	262.0077272691513	20/04/28 05:17:38
1	56	306.28273524375373	261.8426433690172	20/04/28 05:17:38
1	56	306.1661595907557	261.69932536690635	20/04/28 05:17:38
1	56	306.04497457016663	261.5503406124579	20/04/28 05:17:38
1	56	305.88600069565746	261.3548982752585	20/04/28 05:17:39
1	56	305.7034433285623	261.1304624136542	20/04/28 05:17:39
1	47	305.52075838290625	261.23346760107444	20/04/28 05:17:39
1	47	305.33503401741154	261.4514461980063	20/04/28 05:17:39
1	47	305.1405404238853	261.6797169502911	20/04/28 05:17:39
1	47	305.02541929702636	261.81483084147646	20/04/28 05:17:39
1	47	304.9266870064692	261.93070969296804	20/04/28 05:17:39
1	47	304.76655936778315	262.1186462510918	20/04/28 05:17:39
1	47	304.5733348274469	262.34542755726613	20/04/28 05:17:39
1	47	304.42091029235456	262.524323235326	20/04/28 05:17:40
1	47	304.2724473140102	262.69856936415044	20/04/28 05:17:40
1	47	304.13285940937845	262.8623991100173	20/04/28 05:17:40
1	47	303.95780772939503	263.0678515259763	20/04/28 05:17:40
1	47	303.8242393042297	263.22461640620287	20/04/28 05:17:40
1	47	303.7126050298735	263.35563789295753	20/04/28 05:17:40
1	47	303.5906545097018	263.4987672191035	20/04/28 05:17:40
1	47	303.40052991769113	263.7219102175912	20/04/28 05:17:40
1	47	303.27200802121246	263.8727521525997	20/04/28 05:17:40
1	47	303.079955219653	264.09815822739904	20/04/28 05:17:40
1	47	302.927020074913	264.27765319125695	20/04/28 05:17:41
1	47	302.7358377548928	264.5020376104211	20/04/28 05:17:41
1	47	302.63367476902346	264.6219429564905	20/04/28 05:17:41
1	47	302.4793233281568	264.80310018066467	20/04/28 05:17:41
3	47	302.4124032879799	264.8899415207738	20/04/28 05:17:41
3	47	302.5413001876257	264.7859704254079	20/04/28 05:17:41
3	47	302.7097452078565	264.65009893966675	20/04/28 05:17:41
3	47	302.9195697830647	264.4808497879881	20/04/28 05:17:41
3	47	303.1415485660888	264.30179678297094	20/04/28 05:17:41
3	47	303.3715155055715	264.1163003539518	20/04/28 05:17:41
3	47	303.3715155055715	264.1163003539518	20/04/28 05:17:42
3	47	303.5869467984838	263.94252869953874	20/04/28 05:17:42
3	47	303.8029640377746	263.7682844077933	20/04/28 05:17:42
3	47	303.936213929154	263.66080209284115	20/04/28 05:17:42
3	47	304.08045912438166	263.54445072216987	20/04/28 05:17:42
3	47	304.3118246114134	263.35782619370855	20/04/28 05:17:42
3	47	304.53396286146545	263.1786445590531	20/04/28 05:17:42
3	47	304.6730924817715	263.066419524465	20/04/28 05:17:42
3	47	304.8891834412706	262.8921157683661	20/04/28 05:17:42
3	47	305.02240057057946	262.78465988002597	20/04/28 05:17:43
3	47	305.17465704599437	262.66184643324084	20/04/28 05:17:43
3	47	305.30587390203004	262.5560040096451	20/04/28 05:17:43
3	47	305.44273727091104	262.44560698367235	20/04/28 05:17:43
3	47	305.5757426488957	262.3383218986423	20/04/28 05:17:43
3	15	305.71443069284874	262.2723121796033	20/04/28 05:17:43
3	15	305.71443069284874	262.2723121796033	20/04/28 05:17:43
3	15	305.9347326312731	262.2707812483639	20/04/28 05:17:43
3	15	306.19422658907206	262.2689779623408	20/04/28 05:17:43
3	15	306.35435365886934	262.2678652007592	20/04/28 05:17:43
3	15	306.60902257973714	262.26609544508005	20/04/28 05:17:44
3	15	306.87493944829055	262.26424752470285	20/04/28 05:17:44
3	15	307.1653644762847	262.26222929122184	20/04/28 05:17:44
3	15	307.42718121504066	262.2604098636343	20/04/28 05:17:44
3	15	307.6845158927715	262.25862158296854	20/04/28 05:17:44
3	15	307.8468328014236	262.2574936036692	20/04/28 05:17:44
3	15	308.11145002502303	262.2556547148379	20/04/28 05:17:44
3	15	308.30598065953063	262.25430287459756	20/04/28 05:17:44
3	15	308.5213033005047	262.2528065456956	20/04/28 05:17:44
3	15	308.7079725072362	262.2515093364106	20/04/28 05:17:44
3	15	309.00660607275125	262.249434059825	20/04/28 05:17:45
3	15	309.16849624784146	262.248309046	20/04/28 05:17:45
3	15	309.32475628701724	262.24722315734573	20/04/28 05:17:45
3	15	309.5164207256444	262.245891234991	20/04/28 05:17:45
3	15	309.7774377494682	262.24407736481515	20/04/28 05:17:45
3	15	309.98318592670626	262.24264757116816	20/04/28 05:17:45
3	15	310.20933735785025	262.24107599039473	20/04/28 05:17:45
3	15	310.4554930825656	262.2393653949664	20/04/28 05:17:45
3	15	310.4554930825656	262.2393653949664	20/04/28 05:17:45
3	15	310.8197282318591	262.2368342371721	20/04/28 05:17:46
3	15	311.0160166247076	262.23547018184564	20/04/28 05:17:46
3	15	311.2117920261238	262.2341096914202	20/04/28 05:17:46
3	15	311.4078048437756	262.23274755113215	20/04/28 05:17:46
3	15	311.7058783010035	262.23067616687393	20/04/28 05:17:46
3	15	311.8853449980998	262.2294290095635	20/04/28 05:17:46
3	15	312.13656976203873	262.2276831881605	20/04/28 05:17:46
3	15	312.13656976203873	262.2276831881605	20/04/28 05:17:46
3	15	312.2999545888588	262.2265477876406	20/04/28 05:17:46
3	15	312.48649595733116	262.2252514667345	20/04/28 05:17:46
3	15	312.7578556065289	262.22336572316345	20/04/28 05:17:47
3	15	313.02634919216626	262.2214998965585	20/04/28 05:17:47
3	15	313.2480866660752	262.2199589894372	20/04/28 05:17:47
3	15	313.5351461280536	262.21796414408516	20/04/28 05:17:47
3	15	313.7624833218663	262.2163843231613	20/04/28 05:17:47
3	15	314.15414156541647	262.213662595679	20/04/28 05:17:47
3	15	314.35765385781514	262.21224833973434	20/04/28 05:17:47
3	15	314.5297750244431	262.2110522282846	20/04/28 05:17:47
3	15	314.81750570612076	262.20905271846516	20/04/28 05:17:47
3	15	314.9775171015585	262.2079407607326	20/04/28 05:17:47
3	15	315.1681608037953	262.20661593172093	20/04/28 05:17:48
3	15	315.42831809916987	262.2048080360052	20/04/28 05:17:48
3	15	315.42831809916987	262.2048080360052	20/04/28 05:17:48
3	15	315.59365136625735	262.2036590953045	20/04/28 05:17:48
3	15	315.84385197422984	262.201920391008	20/04/28 05:17:48
3	15	315.84385197422984	262.201920391008	20/04/28 05:17:48
3	15	316.27233319766066	262.1989427717681	20/04/28 05:17:48
3	15	316.5618265640615	262.19693101262794	20/04/28 05:17:48
3	15	316.7193683072449	262.1958362171038	20/04/28 05:17:48
3	15	316.7193683072449	262.1958362171038	20/04/28 05:17:49
3	15	317.14846323971983	262.1928543330519	20/04/28 05:17:49
3	15	317.3922028671391	262.1911605276657	20/04/28 05:17:49
3	15	317.64044769085376	262.18943541458515	20/04/28 05:17:49
3	15	317.8927623498565	262.1876820192388	20/04/28 05:17:49
3	15	318.15701074646	262.18584569347513	20/04/28 05:17:49
3	15	318.338648894502	262.18458344622894	20/04/28 05:17:49
3	15	318.54709388505717	262.18313491177656	20/04/28 05:17:49
3	15	318.7370993540719	262.1818145180013	20/04/28 05:17:49
3	15	318.9597611172094	262.1802671877715	20/04/28 05:17:49
3	15	319.1741374488417	262.17877743500117	20/04/28 05:17:50
3	15	319.3694074893662	262.1774204564503	20/04/28 05:17:50
3	15	319.6690456482547	262.17533819870334	20/04/28 05:17:50
3	15	319.9488581513021	262.1733937142147	20/04/28 05:17:50
3	15	320.13736668189443	262.17208372302514	20/04/28 05:17:50
3	15	320.3519190301323	262.170592747073	20/04/28 05:17:50
3	15	320.6269529407902	262.16868147017396	20/04/28 05:17:50
3	15	320.7918743564919	262.1675353915278	20/04/28 05:17:50
3	15	321.0551806618536	262.16570561258305	20/04/28 05:17:50
3	15	321.2062117944179	262.16465606086047	20/04/28 05:17:51
3	15	321.44285391846745	262.1630115777349	20/04/28 05:17:51
3	15	321.5939480385205	262.16196158829706	20/04/28 05:17:51
3	15	321.87503449948815	262.16000825076793	20/04/28 05:17:51
3	15	322.1336656669225	262.1582109604829	20/04/28 05:17:51
3	15	322.36876081421167	262.1565772276715	20/04/28 05:17:51
3	15	322.61817471207667	262.1548439904131	20/04/28 05:17:51
3	15	322.7949328408628	262.1536156555963	20/04/28 05:17:51
3	15	322.94672647955235	262.15256080503497	20/04/28 05:17:51
3	15	323.10852353256917	262.1514364383377	20/04/28 05:17:51
3	15	323.33889708871084	262.1498355170006	20/04/28 05:17:52
3	15	323.6146765929716	262.147919058792	20/04/28 05:17:52
3	15	323.8842435440224	262.14604577311223	20/04/28 05:17:52
3	15	324.0447972651413	262.14493004662785	20/04/28 05:17:52
3	15	324.3074818073212	262.14310458846523	20/04/28 05:17:52
3	15	324.52352434027273	262.14160325686055	20/04/28 05:17:52
3	15	324.7027943876207	262.14035746611654	20/04/28 05:17:52
3	15	324.9229256866851	262.13882772069115	20/04/28 05:17:52
3	15	325.2185561322465	262.13677331350954	20/04/28 05:17:52
3	15	325.4351822045795	262.1352679267491	20/04/28 05:17:52
3	15	325.6792614312159	262.13357176140613	20/04/28 05:17:53
3	15	325.9581757535114	262.13163351859185	20/04/28 05:17:53
3	15	325.9581757535114	262.13163351859185	20/04/28 05:17:53
3	15	326.16385217880264	262.1302042235664	20/04/28 05:17:53
3	15	326.45265943551203	262.12819723236777	20/04/28 05:17:53
3	15	326.71112917214424	262.12640106390427	20/04/28 05:17:53
3	15	326.9245877589871	262.1249176887635	20/04/28 05:17:53
3	15	327.1848599144792	262.12310899485715	20/04/28 05:17:53
3	15	327.1848599144792	262.12310899485715	20/04/28 05:17:53
3	15	327.35286908387417	262.1219414586667	20/04/28 05:17:54
3	15	327.5266307417206	262.1207339470483	20/04/28 05:17:54
3	15	327.71721071991954	262.11940956087034	20/04/28 05:17:54
3	15	328.0001912871147	262.11744306074075	20/04/28 05:17:54
3	15	328.2894236915596	262.1154331150881	20/04/28 05:17:54
3	15	328.47000160245074	262.11417823568524	20/04/28 05:17:54
3	15	328.64041679120317	262.1129939794867	20/04/28 05:17:54
3	15	328.8637282569697	262.1114421343168	20/04/28 05:17:54
3	15	329.0179818551662	262.11037018890426	20/04/28 05:17:54
3	15	329.18768792137655	262.1091908605691	20/04/28 05:17:54
3	15	329.3552753364577	262.108026255251	20/04/28 05:17:55
3	15	329.6103918748159	262.10625338897006	20/04/28 05:17:55
3	15	329.90703863148497	262.1041919191977	20/04/28 05:17:55
3	15	330.1149385153416	262.10274717282306	20/04/28 05:17:55
3	15	330.29356309405625	262.1015058675961	20/04/28 05:17:55
3	15	330.52926075631046	262.0998679477631	20/04/28 05:17:55
3	15	330.7561414748786	262.09829129899566	20/04/28 05:17:55
3	15	331.02151347733434	262.09644716502424	20/04/28 05:17:55
3	15	331.24429179839774	262.09489902480533	20/04/28 05:17:55
3	15	331.52808268152916	262.09292689359506	20/04/28 05:17:56
3	15	331.7535127355906	262.0913603258448	20/04/28 05:17:56
3	15	331.9809669806069	262.08977969150396	20/04/28 05:17:56
3	15	332.200679421255	262.0882528568266	20/04/28 05:17:56
3	15	332.4438017939323	262.08656334089227	20/04/28 05:17:56
3	15	332.4438017939323	262.08656334089227	20/04/28 05:17:56
3	15	332.6981356674838	262.0847959135376	20/04/28 05:17:56
3	15	332.99710129073264	262.0827183294028	20/04/28 05:17:56
3	15	333.29454920695093	262.0806512921797	20/04/28 05:17:56
3	15	333.45466799449395	262.0795385881535	20/04/28 05:17:56
3	15	333.695275212898	262.0778665506321	20/04/28 05:17:57
3	15	333.9720949608764	262.07594286351934	20/04/28 05:17:57
3	15	334.18666688426254	262.07445175153475	20/04/28 05:17:57
3	15	334.44030215290974	262.07268917895385	20/04/28 05:17:57
3	15	334.72137537932196	262.0707359333948	20/04/28 05:17:57
3	15	335.0104728146422	262.0687269256751	20/04/28 05:17:57
3	15	335.2305596825922	262.06719748901224	20/04/28 05:17:57
3	15	335.4213735462174	262.0658714775081	20/04/28 05:17:57
3	15	335.6022901314648	262.0646142445756	20/04/28 05:17:57
3	15	335.89510201483847	262.06257942426157	20/04/28 05:17:58
3	15	336.1897416107741	262.0605319027327	20/04/28 05:17:58
3	15	336.44713278703676	262.058743229445	20/04/28 05:17:58
3	15	336.6223910950725	262.05752531724386	20/04/28 05:17:58
3	15	336.81780782176145	262.0561673193355	20/04/28 05:17:58
3	15	336.9815880012534	262.0550291714146	20/04/28 05:17:58
3	15	337.17905186815494	262.0536569474358	20/04/28 05:17:58
3	15	337.3907593198904	262.0521857413548	20/04/28 05:17:58
3	15	337.5408825119369	262.0511424991296	20/04/28 05:17:58
3	15	337.70872165236653	262.0499761445114	20/04/28 05:17:58
3	15	337.95350160688696	262.04827510964157	20/04/28 05:17:59
3	15	338.1651335605762	262.0468044282146	20/04/28 05:17:59
3	15	338.42960644747114	262.0449665424138	20/04/28 05:17:59
3	15	338.8780074289728	262.0418504959765	20/04/28 05:17:59
3	15	339.1732507194045	262.03979877922916	20/04/28 05:17:59
3	15	339.38730289455765	262.03831127910024	20/04/28 05:17:59
3	15	339.62219844402676	262.03667893334216	20/04/28 05:17:59
3	15	339.86359256339546	262.0350014274564	20/04/28 05:17:59
3	15	340.0344168459633	262.03381432836636	20/04/28 05:17:59
3	15	340.0344168459633	262.03381432836636	20/04/28 05:17:59
3	15	340.2965409277742	262.0319927649779	20/04/28 05:18:00
3	15	340.53798768765813	262.0303148932805	20/04/28 05:18:00
3	15	340.78850637582997	262.0285739785681	20/04/28 05:18:00
3	15	340.78850637582997	262.0285739785681	20/04/28 05:18:00
3	15	341.0062141641408	262.0270610747027	20/04/28 05:18:00
3	15	341.251323626578	262.02535775000297	20/04/28 05:18:00
3	15	341.52401888860794	262.0234627249366	20/04/28 05:18:00
3	15	341.9105518748024	262.02077661410226	20/04/28 05:18:00
3	15	342.1741856896512	262.01894455921524	20/04/28 05:18:00
3	15	342.32928182358563	262.0178667588189	20/04/28 05:18:01
3	15	342.581313286584	262.0161153314698	20/04/28 05:18:01
3	15	342.581313286584	262.0161153314698	20/04/28 05:18:01
3	15	342.77786361550943	262.01474945588643	20/04/28 05:18:01
3	15	343.22890876520574	262.01161503448736	20/04/28 05:18:01
3	15	343.5124557190392	262.0096445984006	20/04/28 05:18:01
3	15	343.8070197301223	262.00759760212907	20/04/28 05:18:01
3	15	344.03868770495455	262.00598768556466	20/04/28 05:18:01
3	15	344.2653995448662	262.00441221037573	20/04/28 05:18:01
3	15	344.2653995448662	262.00441221037573	20/04/28 05:18:01
3	15	344.4561533789714	262.00308661603117	20/04/28 05:18:02
3	15	344.6333166146296	262.0018554660291	20/04/28 05:18:02
3	15	344.9043553958007	261.9999719522473	20/04/28 05:18:02
3	15	345.16385147269517	261.998168651498	20/04/28 05:18:02
3	15	345.40684669552775	261.9964800191586	20/04/28 05:18:02
3	15	345.5662795672642	261.99537208172654	20/04/28 05:18:02
3	15	345.80789957322673	261.99369300610044	20/04/28 05:18:02
3	15	346.0821692249102	261.99178704022114	20/04/28 05:18:02
3	15	346.25618065604357	261.990577792868	20/04/28 05:18:02
3	15	346.46197535825274	261.98914767590776	20/04/28 05:18:02
3	15	346.69116545567124	261.9875549787104	20/04/28 05:18:03
3	15	346.85384612554543	261.98642447154674	20/04/28 05:18:03
3	15	347.0605464884074	261.98498806093244	20/04/28 05:18:03
3	15	347.2698526762196	261.98353354181285	20/04/28 05:18:03
3	15	347.4635317165068	261.9821876195059	20/04/28 05:18:03
3	15	347.7629759288665	261.98010670954005	20/04/28 05:18:03
3	15	347.94853842401193	261.9788171910605	20/04/28 05:18:03
3	15	348.1286414809864	261.97756561153193	20/04/28 05:18:03
3	15	348.3502993363499	261.97602525769906	20/04/28 05:18:03
3	15	348.5388536862751	261.9747149480999	20/04/28 05:18:04
3	15	348.8279283201059	261.97270609883327	20/04/28 05:18:04
3	15	349.0714551263541	261.97101377239267	20/04/28 05:18:04
3	15	349.34044764647325	261.9691444785718	20/04/28 05:18:04
3	15	349.56191933287835	261.9676054184719	20/04/28 05:18:04
3	15	349.56191933287835	261.9676054184719	20/04/28 05:18:04
3	15	350.0222540034416	261.9644064419546	20/04/28 05:18:04
3	15	350.2561831514362	261.9627808119532	20/04/28 05:18:04
3	15	350.4309173385427	261.9615665419947	20/04/28 05:18:04
3	15	350.4309173385427	261.9615665419947	20/04/28 05:18:04
3	15	350.5938940928301	261.96043397726913	20/04/28 05:18:05
3	15	350.84918992646584	261.9586598650221	20/04/28 05:18:05
3	15	351.043226344204	261.95731145921314	20/04/28 05:18:05
3	15	351.3198914717835	261.95538884659476	20/04/28 05:18:05
3	15	351.50094314898394	261.9541306748757	20/04/28 05:18:05
3	15	351.68385785975494	261.9528595564876	20/04/28 05:18:05
3	15	352.10003909250764	261.9499674128459	20/04/28 05:18:05
3	15	352.38553424034944	261.94798343828967	20/04/28 05:18:05
3	15	352.38553424034944	261.94798343828967	20/04/28 05:18:05
3	15	352.91865111335613	261.9442786807148	20/04/28 05:18:05
3	15	353.21433104479286	261.9422239296439	20/04/28 05:18:06
3	15	353.3879151844944	261.9410176516418	20/04/28 05:18:06
3	15	353.59475440637135	261.93958027606277	20/04/28 05:18:06
3	15	353.8022778465694	261.9381381456858	20/04/28 05:18:06
3	15	354.094332393143	261.93610858828765	20/04/28 05:18:06
3	15	354.2941408194136	261.934720071401	20/04/28 05:18:06
3	15	354.49740240078677	261.9333075577076	20/04/28 05:18:06
3	15	354.6689998571345	261.9321150856468	20/04/28 05:18:06
3	15	354.8759034374179	261.93067726282567	20/04/28 05:18:06
3	15	355.15065937533245	261.9287679176262	20/04/28 05:18:07
3	15	355.4035522300727	261.92701050425836	20/04/28 05:18:07
3	15	355.6892531252638	261.9250250999142	20/04/28 05:18:07
3	15	355.928194485588	261.9233646388419	20/04/28 05:18:07
3	15	356.14402447048224	261.9218647842849	20/04/28 05:18:07
3	15	356.3001934269409	261.92077952858637	20/04/28 05:18:07
3	15	356.4733496956482	261.9195762239629	20/04/28 05:18:07
3	15	356.64148295223276	261.9184078254607	20/04/28 05:18:07
3	15	356.8972914437369	261.9166301506306	20/04/28 05:18:07
3	15	357.10009358159874	261.9152208297209	20/04/28 05:18:07
3	15	357.38786976622237	261.9132210036906	20/04/28 05:18:08
3	15	357.5986972880879	261.91175591245417	20/04/28 05:18:08
3	15	357.7695375238216	261.9105687025018	20/04/28 05:18:08
3	15	358.00594956708386	261.90892581826307	20/04/28 05:18:08
3	15	358.2980474114747	261.90689595997793	20/04/28 05:18:08
3	15	358.5391643326446	261.9052203804092	20/04/28 05:18:08
3	15	358.72656388658714	261.90391809576556	20/04/28 05:18:08
3	15	358.897147962585	261.90273266592885	20/04/28 05:18:08
3	15	359.1738873551286	261.90080953722537	20/04/28 05:18:08
3	15	359.3592546529355	261.89952137521914	20/04/28 05:18:08
3	15	359.63881739269897	261.89757862639567	20/04/28 05:18:09
3	15	359.8293604596734	261.8962544967227	20/04/28 05:18:09
3	15	360.0325136984978	261.8948427359278	20/04/28 05:18:09
3	15	360.19059647574323	261.8937441806276	20/04/28 05:18:09
3	15	360.43127396055615	261.89207165480803	20/04/28 05:18:09
3	15	360.63430719460547	261.89066072795526	20/04/28 05:18:09
3	15	360.8578495473902	261.88910727829585	20/04/28 05:18:09
3	15	361.0597449418934	261.88770425856416	20/04/28 05:18:09
3	15	361.32859958553047	261.88583592288023	20/04/28 05:18:09
3	15	361.60606887369335	261.88390772195623	20/04/28 05:18:10
3	15	361.7564017819289	261.8828630223627	20/04/28 05:18:10
3	15	362.03837768031156	261.8809035039187	20/04/28 05:18:10
3	15	362.29501185385385	261.8791200912253	20/04/28 05:18:10
3	15	362.59460672293324	261.8770381343096	20/04/28 05:18:10
3	15	362.7807917527158	261.8757442896869	20/04/28 05:18:10
3	15	362.99050771553647	261.8742869229421	20/04/28 05:18:10
3	15	363.1757655510672	261.87299952161555	20/04/28 05:18:10
3	15	363.412489494525	261.8713544699072	20/04/28 05:18:10
3	15	363.412489494525	261.8713544699072	20/04/28 05:18:10
3	15	363.5638889382599	261.87030235870157	20/04/28 05:18:11
3	15	363.8036988525213	261.86863586183875	20/04/28 05:18:11
3	15	363.9963664798065	261.86729696808436	20/04/28 05:18:11
3	15	364.22105737101725	261.8657355369548	20/04/28 05:18:11
3	15	364.4276218204597	261.8643000708356	20/04/28 05:18:11
3	15	364.7092386013729	261.8623430479854	20/04/28 05:18:11
3	15	364.94166012848785	261.86072789480465	20/04/28 05:18:11
3	15	365.18160112405354	261.8590604870263	20/04/28 05:18:11
3	15	365.4326283785756	261.8573160381638	20/04/28 05:18:11
3	15	365.6353471622211	261.8559072965026	20/04/28 05:18:11
3	15	365.8600632736739	261.8543456901115	20/04/28 05:18:12
3	15	366.01624659762416	261.8532603345698	20/04/28 05:18:12
3	15	366.18763292905436	261.8520693296669	20/04/28 05:18:12
3	15	366.4874997005402	261.8499854832359	20/04/28 05:18:12
3	15	366.7557706878239	261.8481212035206	20/04/28 05:18:12
3	15	366.9535195009515	261.84674699938176	20/04/28 05:18:12
3	15	367.13059670418687	261.84551644723973	20/04/28 05:18:12
3	15	367.32300095266885	261.8441793837681	20/04/28 05:18:12
3	15	367.5329783788529	261.84272020005136	20/04/28 05:18:12
3	15	367.7937547743928	261.84090800205945	20/04/28 05:18:13
3	15	368.0768260932722	261.83894087127453	20/04/28 05:18:13
3	15	368.28179389244013	261.83751650066273	20/04/28 05:18:13
3	15	368.5303491788638	261.835789230102	20/04/28 05:18:13
3	15	368.79667440982035	261.8339384719161	20/04/28 05:18:13
3	15	368.973969400023	261.83270640631997	20/04/28 05:18:13
3	15	369.1290999528794	261.83162836673824	20/04/28 05:18:13
3	15	369.29274363921814	261.83049116734117	20/04/28 05:18:13
3	15	369.5335953931225	261.8288174304837	20/04/28 05:18:13
3	15	369.6921487565945	261.82771560496644	20/04/28 05:18:13
3	15	369.88162886791446	261.8263988620284	20/04/28 05:18:14
3	15	370.05015377981084	261.82522774181905	20/04/28 05:18:14
3	15	370.05015377981084	261.82522774181905	20/04/28 05:18:14
3	15	370.3438222550155	261.82318696884204	20/04/28 05:18:14
3	15	370.5566953058117	261.82170766273236	20/04/28 05:18:14
3	15	370.83773483289207	261.8197546513581	20/04/28 05:18:14
3	15	371.01181372161017	261.81854493522593	20/04/28 05:18:14
3	15	371.18319617482024	261.81735395727367	20/04/28 05:18:14
3	15	371.4162029508382	261.8157347370573	20/04/28 05:18:14
3	15	371.6379119115391	261.81419402808115	20/04/28 05:18:14
3	15	371.8654895770235	261.81261253606175	20/04/28 05:18:15
3	15	372.11523867727004	261.81087696940125	20/04/28 05:18:15
3	15	372.31065842623485	261.80951895049037	20/04/28 05:18:15
3	15	372.31065842623485	261.80951895049037	20/04/28 05:18:15
3	15	372.5499215634434	261.807856253313	20/04/28 05:18:15
3	15	372.8294141041807	261.8059139923195	20/04/28 05:18:15
3	15	373.0712692821143	261.8042332824267	20/04/28 05:18:15
3	15	373.2333537495165	261.80310691841765	20/04/28 05:18:15
3	15	373.4411641465576	261.80166279390846	20/04/28 05:18:15
3	15	373.7312825043555	261.79964669155254	20/04/28 05:18:16
3	15	373.9798410494228	261.7979193983467	20/04/28 05:18:16
3	15	373.9798410494228	261.7979193983467	20/04/28 05:18:16
3	15	374.44649575291675	261.7946765023981	20/04/28 05:18:16
3	15	374.44649575291675	261.7946765023981	20/04/28 05:18:16
3	15	374.7321412997966	261.7926914826827	20/04/28 05:18:16
3	15	374.94534012795293	261.7912099126676	20/04/28 05:18:16
3	15	375.10589554706775	261.79009417438346	20/04/28 05:18:16
3	15	375.33366407545134	261.7885113560118	20/04/28 05:18:16
3	15	375.57117028159126	261.78686086817163	20/04/28 05:18:16
3	15	375.7344532383081	261.7857261755716	20/04/28 05:18:17
3	15	375.92469038740836	261.78440417179564	20/04/28 05:18:17
3	15	376.20542263539033	261.7824532957779	20/04/28 05:18:17
3	15	376.4750043050659	261.78057990781485	20/04/28 05:18:17
3	15	376.70703161819415	261.77896749412207	20/04/28 05:18:17
3	15	376.99791730032985	261.77694605944447	20/04/28 05:18:17
3	15	377.18669371045803	261.7756342066955	20/04/28 05:18:17
3	15	377.37952196416416	261.77429419670943	20/04/28 05:18:17
3	15	377.64850229098226	261.7724249876228	20/04/28 05:18:17
3	15	377.8309971882452	261.7711567866199	20/04/28 05:18:17
3	15	378.11239779695234	261.7692012660024	20/04/28 05:18:18
3	15	378.32709876282854	261.7677092572705	20/04/28 05:18:18
3	15	378.53925226096425	261.76623495150557	20/04/28 05:18:18
3	15	378.8101021967358	262.0035459818021	20/04/28 05:18:18
3	15	378.98417274080674	262.1722681216028	20/04/28 05:18:18
3	15	378.98417274080674	262.1722681216028	20/04/28 05:18:18
3	15	379.3140082325663	262.49196925339925	20/04/28 05:18:18
3	15	379.3140082325663	262.49196925339925	20/04/28 05:18:18
3	15	379.67524842750055	262.84211016320467	20/04/28 05:18:18
3	15	379.67524842750055	262.84211016320467	20/04/28 05:18:19
3	15	380.02314763665737	263.1793199956734	20/04/28 05:18:19
3	15	380.15896220685397	263.3109615954741	20/04/28 05:18:19
3	15	380.3595430886863	263.5053795296886	20/04/28 05:18:19
3	15	380.3595430886863	263.5053795296886	20/04/28 05:18:19
3	15	380.5447295396662	263.6848760346153	20/04/28 05:18:19
3	15	380.7519896066964	263.8857679327317	20/04/28 05:18:19
3	15	380.9648996958659	264.09213625323963	20/04/28 05:18:19
3	15	381.17217399857606	264.29304194963765	20/04/28 05:18:19
3	15	381.3281146469898	264.444191243866	20/04/28 05:18:19
3	15	381.4441689346187	264.5566797056348	20/04/28 05:18:20
3	15	381.55441554291286	264.6635389319125	20/04/28 05:18:20
3	15	381.72544571609853	264.8293141177395	20/04/28 05:18:20
1	33	381.7973488081508	264.9069827646993	20/04/28 05:18:20
1	33	381.6243785141636	264.7797675558255	20/04/28 05:18:20
1	33	381.46516426650214	264.6626695657311	20/04/28 05:18:20
1	33	381.33883569045037	264.569758142511	20/04/28 05:18:20
1	33	381.33883569045037	264.569758142511	20/04/28 05:18:20
1	33	381.14167863401065	264.424754191036	20/04/28 05:18:20
1	33	380.97891775703835	264.3050477461707	20/04/28 05:18:20
1	33	380.7881094512451	264.16471313774287	20/04/28 05:18:21
1	33	380.3864293468311	263.86928773719825	20/04/28 05:18:21
1	33	380.2614212997304	263.7773475291068	20/04/28 05:18:21
1	33	380.11786297404166	263.6717640675361	20/04/28 05:18:21
1	33	380.11786297404166	263.6717640675361	20/04/28 05:18:21
1	33	379.9643976558188	263.55889426739543	20/04/28 05:18:21
1	33	379.64707569894165	263.3255121178145	20/04/28 05:18:21
1	33	379.42960178771955	263.16556564143997	20/04/28 05:18:21
1	33	379.42960178771955	263.16556564143997	20/04/28 05:18:21
1	33	379.2340679114939	263.02175549732476	20/04/28 05:18:22
1	33	378.8724394467663	262.755787049133	20/04/28 05:18:22
1	33	378.6913505269586	262.6226007994769	20/04/28 05:18:22
1	37	378.5478049930183	262.52858306782525	20/04/28 05:18:22
1	37	378.5478049930183	262.52858306782525	20/04/28 05:18:22
1	37	378.3406181310709	262.5147758351941	20/04/28 05:18:22
1	37	378.12440782939666	262.5003672674673	20/04/28 05:18:22
1	37	377.82642177206577	262.48050904491527	20/04/28 05:18:22
1	37	377.6365569893115	262.46785618073596	20/04/28 05:18:22
1	37	377.35901751743694	262.4493605482596	20/04/28 05:18:22
1	37	377.10975607494544	262.43274940462766	20/04/28 05:18:23
1	37	376.9216532691565	262.4202139611459	20/04/28 05:18:23
1	37	376.9216532691565	262.4202139611459	20/04/28 05:18:23
1	37	376.7392675574601	262.4080595130968	20/04/28 05:18:23
1	37	376.44868439528307	262.3886946302024	20/04/28 05:18:23
1	37	376.18002023166736	262.3707904611261	20/04/28 05:18:23
1	37	375.95872591065057	262.3560430869851	20/04/28 05:18:23
1	37	375.7689936586132	262.3433990548448	20/04/28 05:18:23
1	37	375.5406192146893	262.3281798510563	20/04/28 05:18:23
1	37	375.3599303387087	262.3161384825975	20/04/28 05:18:24
1	37	375.1111468331493	262.29955918937515	20/04/28 05:18:24
1	37	374.8912696112719	262.28490625277374	20/04/28 05:18:24
1	37	374.6420197536027	262.2682958811711	20/04/28 05:18:24
1	37	374.4163528945679	262.25325711476216	20/04/28 05:18:24
1	37	374.16112656508926	262.23624846242006	20/04/28 05:18:24
1	37	373.92126811258214	262.2202639476628	20/04/28 05:18:24
1	37	373.62443758990287	262.20048273161393	20/04/28 05:18:24
1	37	373.3868991001763	262.18465282253726	20/04/28 05:18:24
1	37	373.10920426509415	262.1661468364317	20/04/28 05:18:24
1	37	373.10920426509415	262.1661468364317	20/04/28 05:18:25
1	37	372.87314290862344	262.15041536565514	20/04/28 05:18:25
1	37	372.7142221048293	262.1398246530622	20/04/28 05:18:25
1	37	372.24977662512504	262.1088733334539	20/04/28 05:18:25
1	37	372.24977662512504	262.1088733334539	20/04/28 05:18:25
1	37	372.0980034102069	262.09875894653834	20/04/28 05:18:25
1	37	371.9199773179352	262.0868950298435	20/04/28 05:18:25
1	37	371.70322265310347	262.0724501849673	20/04/28 05:18:25
1	37	371.5059589431416	262.0593042455601	20/04/28 05:18:25
1	37	371.2579426318117	262.0427760792726	20/04/28 05:18:25
1	37	371.0249391461336	262.02724838943556	20/04/28 05:18:26
1	37	370.7514989152896	262.0090259363201	20/04/28 05:18:26
1	37	370.50196727310106	261.9923967861889	20/04/28 05:18:26
1	37	370.30474713702597	261.9792537506087	20/04/28 05:18:26
1	37	370.06854604310126	261.96351296752573	20/04/28 05:18:26
1	37	369.76997469554726	261.9436157403853	20/04/28 05:18:26
1	37	369.47796875385336	261.9241560414027	20/04/28 05:18:26
1	37	369.3149050129621	261.9132892374797	20/04/28 05:18:26
1	37	369.1289807616366	261.9008989760235	20/04/28 05:18:26
1	37	368.9038293973439	261.8858945629309	20/04/28 05:18:27
1	37	368.68579163631307	261.87136421066515	20/04/28 05:18:27
1	37	368.461188068095	261.8563963034966	20/04/28 05:18:27
1	37	368.2780108857599	261.8441891106975	20/04/28 05:18:27
1	37	368.02852209227433	261.82756281606595	20/04/28 05:18:27
1	37	367.8128278039199	261.81318863621436	20/04/28 05:18:27
1	37	367.6432141068358	261.8018853337218	20/04/28 05:18:27
1	37	367.3996780425323	261.7856557375867	20/04/28 05:18:27
1	37	367.12358322269483	261.767256378815	20/04/28 05:18:27
1	37	366.96485021120935	261.75667818097355	20/04/28 05:18:27
1	37	366.72073733257974	261.74041014509606	20/04/28 05:18:28
1	37	366.4418238051701	261.72182294356827	20/04/28 05:18:28
1	37	366.2781642624531	261.7109164345485	20/04/28 05:18:28
1	37	366.02148195075193	261.6938107534418	20/04/28 05:18:28
1	37	365.44732590792825	261.6555481629699	20/04/28 05:18:28
1	37	365.44732590792825	261.6555481629699	20/04/28 05:18:28
1	37	365.11393887213325	261.63333076792776	20/04/28 05:18:28
1	37	365.11393887213325	261.63333076792776	20/04/28 05:18:28
1	37	364.83355070700674	261.6146452944062	20/04/28 05:18:28
1	37	364.26365943962645	261.5766669147482	20/04/28 05:18:28
1	37	364.0773673404277	261.5642521393768	20/04/28 05:18:29
1	37	363.7961504959002	261.54551144145944	20/04/28 05:18:29
1	37	363.5720504866882	261.5305770921925	20/04/28 05:18:29
1	37	363.41157528547717	261.51988279230386	20/04/28 05:18:29
1	37	363.20452027581973	261.5060843465003	20/04/28 05:18:29
1	37	363.0410205926124	261.49518849074985	20/04/28 05:18:29
1	37	362.7697187005945	261.47710853963156	20/04/28 05:18:29
1	37	362.52929303252785	261.4610862248076	20/04/28 05:18:29
1	37	362.2381770818647	261.4416858361166	20/04/28 05:18:29
1	37	361.9441796260764	261.4220934197497	20/04/28 05:18:30
1	37	361.66191136042124	261.40328265360523	20/04/28 05:18:30
1	37	361.4374610532476	261.3883249599747	20/04/28 05:18:30
1	37	361.2322265700986	261.37464783669503	20/04/28 05:18:30
1	37	360.9683106045021	261.3570600944134	20/04/28 05:18:30
1	37	360.7511135406754	261.34258576742724	20/04/28 05:18:30
1	37	360.5941236095275	261.3321237309847	20/04/28 05:18:30
1	37	360.3567165966778	261.3163025837175	20/04/28 05:18:30
1	37	360.06622475325446	261.2969437864371	20/04/28 05:18:30
1	37	359.8790743650362	261.28447181344205	20/04/28 05:18:30
1	37	359.71001956667106	261.2732057567698	20/04/28 05:18:31
1	37	359.42523217196367	261.25422711221586	20/04/28 05:18:31
1	37	359.20603134868486	261.23961925179697	20/04/28 05:18:31
1	37	358.91595216959684	261.2202879550657	20/04/28 05:18:31
1	37	358.7341263793832	261.2081708209954	20/04/28 05:18:31
1	37	358.55400837720424	261.1961674963938	20/04/28 05:18:31
1	37	358.2580739498681	261.1764459974368	20/04/28 05:18:31
1	37	358.0472136264974	261.16239396001464	20/04/28 05:18:31
1	37	357.7891601161967	261.14519690024684	20/04/28 05:18:31
1	37	357.589065959777	261.1318623357872	20/04/28 05:18:31
1	37	357.37063324596403	261.1173056632959	20/04/28 05:18:32
1	37	357.1563494819562	261.10302548283016	20/04/28 05:18:32
1	37	356.88847201366036	261.0851737402696	20/04/28 05:18:32
1	37	356.6716226683811	261.0707225857512	20/04/28 05:18:32
1	37	356.41181809132814	261.0534088323583	20/04/28 05:18:32
1	37	356.41181809132814	261.0534088323583	20/04/28 05:18:32
1	37	356.1931307132289	261.03883518867	20/04/28 05:18:32
1	37	355.8955798562804	261.0190059685019	20/04/28 05:18:32
1	37	355.73049930992534	261.0080047617411	20/04/28 05:18:32
1	37	355.4830931744121	260.991517258454	20/04/28 05:18:33
1	37	355.26901254747594	260.977250615337	20/04/28 05:18:33
1	37	355.06188200973594	260.9634471362326	20/04/28 05:18:33
1	37	354.8464408941215	260.9490898281792	20/04/28 05:18:33
1	37	354.8464408941215	260.9490898281792	20/04/28 05:18:33
1	37	354.6924165706785	260.93882542413036	20/04/28 05:18:33
1	37	354.527127032158	260.92781028982887	20/04/28 05:18:33
1	37	354.25343777786657	260.90957124143006	20/04/28 05:18:33
1	37	354.0992679848629	260.89929714307897	20/04/28 05:18:33
1	37	353.8881963892544	260.8852310261688	20/04/28 05:18:33
1	37	353.6274225449472	260.8678526794019	20/04/28 05:18:34
1	37	353.3660416250438	260.8504338762378	20/04/28 05:18:34
1	37	353.1844565895074	260.83833278640793	20/04/28 05:18:34
1	37	352.7923654659387	260.8122032659121	20/04/28 05:18:34
1	37	352.5186444069436	260.79396209800177	20/04/28 05:18:34
1	37	352.23675034770446	260.775176269515	20/04/28 05:18:34
1	37	352.23675034770446	260.775176269515	20/04/28 05:18:34
1	37	352.08391815050044	260.76499131048575	20/04/28 05:18:34
1	37	351.6118742845866	260.7335336234127	20/04/28 05:18:34
1	37	351.3300584697004	260.71475300924294	20/04/28 05:18:34
1	37	351.3300584697004	260.71475300924294	20/04/28 05:18:35
1	37	351.12692708401295	260.7012160394249	20/04/28 05:18:35
1	37	350.94418079538	260.6890375620064	20/04/28 05:18:35
1	37	350.6913330943984	260.67218742491326	20/04/28 05:18:35
1	37	350.41445860283847	260.6537361076885	20/04/28 05:18:35
1	37	350.18689897555913	260.63857120446164	20/04/28 05:18:35
1	37	349.951840086263	260.62290653954983	20/04/28 05:18:35
1	37	349.4965104491921	260.59256271290076	20/04/28 05:18:35
1	37	349.4965104491921	260.59256271290076	20/04/28 05:18:35
1	37	349.24079068689963	260.5755211774811	20/04/28 05:18:36
1	37	349.0627788658631	260.56365821184204	20/04/28 05:18:36
1	37	348.58402599630415	260.53175342704674	20/04/28 05:18:36
1	37	348.58402599630415	260.53175342704674	20/04/28 05:18:36
1	37	348.3462899197879	260.5159103505001	20/04/28 05:18:36
1	37	348.1646334377084	260.50380449936915	20/04/28 05:18:36
1	37	347.6217847136213	260.46762827397265	20/04/28 05:18:36
1	37	347.4707641309043	260.45756404355734	20/04/28 05:18:36
1	37	347.1775964643938	260.43802692554993	20/04/28 05:18:36
1	37	347.1775964643938	260.43802692554993	20/04/28 05:18:36
1	37	346.9429322092729	260.42238855963126	20/04/28 05:18:37
1	37	346.7484010886921	260.4094247239391	20/04/28 05:18:37
1	37	346.5360252901089	260.3952716930533	20/04/28 05:18:37
1	37	346.3635963765339	260.3837807804554	20/04/28 05:18:37
1	37	346.19182937703823	260.3723339787707	20/04/28 05:18:37
1	37	345.9269804135126	260.3546840601555	20/04/28 05:18:37
1	37	345.6301850974123	260.33490519032404	20/04/28 05:18:37
1	37	345.46391522680904	260.32382472527235	20/04/28 05:18:37
1	37	345.17115506500164	260.3043147639687	20/04/28 05:18:37
1	37	344.9182985098681	260.2874640368221	20/04/28 05:18:37
1	37	344.6227778603801	260.2677701126203	20/04/28 05:18:38
1	37	344.4120605959552	260.2537276088536	20/04/28 05:18:38
1	37	344.2025868239526	260.2397679732233	20/04/28 05:18:38
1	37	343.9415823607585	260.2223742576797	20/04/28 05:18:38
1	37	343.6606935441231	260.20365542001633	20/04/28 05:18:38
1	37	343.6606935441231	260.20365542001633	20/04/28 05:18:38
1	37	343.3838305141208	260.18520486660634	20/04/28 05:18:38
1	37	343.1803633372493	260.17164551917733	20/04/28 05:18:38
1	37	342.66718042844667	260.1374462666882	20/04/28 05:18:38
1	37	342.4313033249833	260.1217270747989	20/04/28 05:18:39
1	37	342.4313033249833	260.1217270747989	20/04/28 05:18:39
1	37	342.2760963224836	260.11138385530444	20/04/28 05:18:39
1	37	342.0021099898695	260.0931250091758	20/04/28 05:18:39
1	37	341.769005367577	260.07759057944827	20/04/28 05:18:39
1	37	341.4831938260718	260.05854368426805	20/04/28 05:18:39
1	37	341.23057511453555	260.0417088073633	20/04/28 05:18:39
1	37	340.96711254630264	260.0241512801388	20/04/28 05:18:39
1	37	340.73832961506525	260.00890485416403	20/04/28 05:18:39
1	37	340.4673227818149	259.9908445661894	20/04/28 05:18:39
1	37	339.99155349602074	259.9591386117386	20/04/28 05:18:40
1	37	339.76263554831155	259.9438831880705	20/04/28 05:18:40
1	37	339.76263554831155	259.9438831880705	20/04/28 05:18:40
1	37	339.29313717766485	259.9125951364897	20/04/28 05:18:40
1	37	339.1429542056912	259.90258672566773	20/04/28 05:18:40
1	37	339.1429542056912	259.90258672566773	20/04/28 05:18:40
1	37	338.880154083489	259.8850733448064	20/04/28 05:18:40
1	37	338.7092328949439	259.87368290918874	20/04/28 05:18:40
1	37	338.5209634576781	259.86113636114396	20/04/28 05:18:40
1	37	338.31105452937976	259.8471477260677	20/04/28 05:18:40
1	37	337.892415021596	259.8192489827872	20/04/28 05:18:41
1	37	337.63329219545903	259.80198066226296	20/04/28 05:18:41
1	37	337.38555424498867	259.7854710463464	20/04/28 05:18:41
1	37	337.10109068271106	259.7665139824547	20/04/28 05:18:41
1	37	336.8722123253434	259.7512611971443	20/04/28 05:18:41
1	37	336.8722123253434	259.7512611971443	20/04/28 05:18:41
1	37	336.5900023265689	259.73245431398914	20/04/28 05:18:41
1	37	336.0964252523663	259.69956162272064	20/04/28 05:18:41
1	37	336.0964252523663	259.69956162272064	20/04/28 05:18:41
1	37	335.90053486696297	259.68650720365156	20/04/28 05:18:42
1	37	335.39227380142245	259.6526359499276	20/04/28 05:18:42
1	37	335.39227380142245	259.6526359499276	20/04/28 05:18:42
1	37	335.15438395295166	259.6367826257952	20/04/28 05:18:42
1	37	334.6806386197007	259.6052115504739	20/04/28 05:18:42
1	37	334.48605544253525	259.5922442456555	20/04/28 05:18:42
1	37	334.2753413228041	259.5782019514557	20/04/28 05:18:42
1	37	334.0083287499172	259.5604078467782	20/04/28 05:18:42
1	37	334.0083287499172	259.5604078467782	20/04/28 05:18:42
1	37	333.84842161181496	259.5497514034381	20/04/28 05:18:42
1	37	333.5762331346682	259.5316123690024	20/04/28 05:18:43
1	37	333.0758242555512	259.4982643963572	20/04/28 05:18:43
1	37	332.91104944431214	259.4872835642274	20/04/28 05:18:43
1	37	332.91104944431214	259.4872835642274	20/04/28 05:18:43
1	37	332.688084823088	259.47242487886086	20/04/28 05:18:43
1	37	332.39736985216	259.4530512120403	20/04/28 05:18:43
1	37	332.1266762512737	259.43501179832424	20/04/28 05:18:43
1	37	331.6587217727504	259.4038266339512	20/04/28 05:18:43
1	37	331.44418744866	259.3895297557986	20/04/28 05:18:43
1	37	331.44418744866	259.3895297557986	20/04/28 05:18:43
1	37	331.2118952105579	259.3740494645304	20/04/28 05:18:44
1	37	331.05332868639414	259.36348236164525	20/04/28 05:18:44
1	37	330.76948136116806	259.34456636468343	20/04/28 05:18:44
1	37	330.6092782311701	259.3338901960146	20/04/28 05:18:44
1	37	330.4227397914613	259.3214590041547	20/04/28 05:18:44
1	37	330.2620344154017	259.31074936508065	20/04/28 05:18:44
1	37	330.0795240962064	259.29858661300733	20/04/28 05:18:44
1	37	329.8765352219588	259.2850591403581	20/04/28 05:18:44
1	37	329.70268543306577	259.2734735385706	20/04/28 05:18:44
1	37	329.4678853970497	259.2578261240164	20/04/28 05:18:45
1	37	329.2919530562561	259.24610173795327	20/04/28 05:18:45
1	37	328.746836498784	259.2097743808546	20/04/28 05:18:45
1	37	328.746836498784	259.2097743808546	20/04/28 05:18:45
1	37	328.29660414670735	259.1797702446619	20/04/28 05:18:45
1	37	328.0908116782985	259.1660559364362	20/04/28 05:18:45
1	69	327.94590422012817	259.2516573972592	20/04/28 05:18:45
1	69	327.87495325400323	259.3902535406216	20/04/28 05:18:45
1	69	327.87495325400323	259.3902535406216	20/04/28 05:18:45
1	69	327.78449873645826	259.56694806595567	20/04/28 05:18:45
1	69	327.6884147758638	259.7546391870875	20/04/28 05:18:46
1	69	327.57225886203827	259.9815390105036	20/04/28 05:18:46
1	69	327.4443190985847	260.2314574931657	20/04/28 05:18:46
1	69	327.3676857327666	260.3811536782263	20/04/28 05:18:46
1	69	327.2062579288485	260.6964879474609	20/04/28 05:18:46
1	69	327.2062579288485	260.6964879474609	20/04/28 05:18:46
1	69	326.9978405874859	261.10361192758876	20/04/28 05:18:46
1	69	326.90266259810613	261.28953331783157	20/04/28 05:18:46
1	69	326.90266259810613	261.28953331783157	20/04/28 05:18:46
1	69	326.82007194622537	261.450866509663	20/04/28 05:18:47
1	69	326.7304864806835	261.62586342236966	20/04/28 05:18:47
1	69	326.6580020709301	261.76745500588714	20/04/28 05:18:47
1	69	326.5324301121596	262.012748201323	20/04/28 05:18:47
1	69	326.4234181908942	262.2256928966961	20/04/28 05:18:47
1	69	326.35097185317835	262.36721011001305	20/04/28 05:18:47
1	69	326.35097185317835	262.36721011001305	20/04/28 05:18:47
1	69	326.14897127869585	262.761799530134	20/04/28 05:18:47
1	69	326.14897127869585	262.761799530134	20/04/28 05:18:47
1	69	326.05328177529594	262.9487201156569	20/04/28 05:18:47
1	69	325.9397827139029	263.1704300238296	20/04/28 05:18:48
1	69	325.8186647871974	263.407022680001	20/04/28 05:18:48
1	69	325.69755468364195	263.6436000543731	20/04/28 05:18:48
1	69	325.69755468364195	263.6436000543731	20/04/28 05:18:48
1	69	325.5787776941975	263.8756199063396	20/04/28 05:18:48
1	37	325.5234867403508	263.9836256655916	20/04/28 05:18:48
1	37	325.4560000962909	264.1105883947084	20/04/28 05:18:48
1	37	325.45752170698324	263.9824076755711	20/04/28 05:18:48
1	37	325.4533401461073	263.8783445248963	20/04/28 05:18:48
1	37	325.4533401461073	263.8783445248963	20/04/28 05:18:48
1	37	325.49134861146496	263.9699192408384	20/04/28 05:18:49
