floorId	partitionId	location_x	location_y	timeStamp
19	980	310.36738320623186	287.58936639951213	21/02/24 15:38:00
19	980	311.1000485048991	283.6794021053163	21/02/24 15:38:01
19	911	314.5882445185791	281.94764300047444	21/02/24 15:38:02
19	897	319.01521359261704	283.59757186890573	21/02/24 15:38:03
19	897	319.01521359261704	283.59757186890573	21/02/24 15:38:04
19	897	319.01521359261704	283.59757186890573	21/02/24 15:38:05
19	911	321.43497119517593	280.68483158670483	21/02/24 15:38:06
19	911	321.43497119517593	280.6848315867048	21/02/24 15:38:07
19	911	321.43497119517593	280.6848315867048	21/02/24 15:38:08
19	938	320.06540842682995	274.628200335538	21/02/24 15:38:09
19	909	326.737153683381	273.3535535783339	21/02/24 15:38:10
19	900	325.33470491008825	269.6240183086286	21/02/24 15:38:11
19	900	325.33470491008825	269.6240183086286	21/02/24 15:38:12
19	900	322.74561175648233	266.3469506524756	21/02/24 15:38:13
19	900	322.74561175648233	266.34695065247564	21/02/24 15:38:14
19	900	322.74561175648233	266.34695065247564	21/02/24 15:38:15
19	900	322.74561175648233	266.3469506524756	21/02/24 15:38:16
19	900	322.74561175648233	266.3469506524756	21/02/24 15:38:17
19	900	322.74561175648233	266.34695065247564	21/02/24 15:38:18
19	900	322.74561175648233	266.34695065247564	21/02/24 15:38:19
19	900	322.74561175648233	266.34695065247564	21/02/24 15:38:20
19	900	322.74561175648233	266.34695065247564	21/02/24 15:38:21
19	900	322.74561175648233	266.34695065247564	21/02/24 15:38:22
19	900	322.74561175648233	266.34695065247564	21/02/24 15:38:23
19	900	322.74561175648233	266.3469506524756	21/02/24 15:38:24
19	900	322.74561175648233	266.34695065247564	21/02/24 15:38:25
19	900	322.74561175648233	266.3469506524756	21/02/24 15:38:26
19	900	322.74561175648233	266.34695065247564	21/02/24 15:38:27
19	900	322.74561175648233	266.3469506524756	21/02/24 15:38:28
19	900	322.74561175648233	266.34695065247564	21/02/24 15:38:29
19	900	322.74561175648233	266.34695065247564	21/02/24 15:38:30
19	900	322.74561175648233	266.34695065247564	21/02/24 15:38:31
19	900	322.74561175648233	266.34695065247564	21/02/24 15:38:32
19	900	322.74561175648233	266.34695065247564	21/02/24 15:38:33
19	900	322.74561175648233	266.34695065247564	21/02/24 15:38:34
19	900	322.74561175648233	266.34695065247564	21/02/24 15:38:35
19	900	322.74561175648233	266.3469506524756	21/02/24 15:38:36
19	900	322.74561175648233	266.34695065247564	21/02/24 15:38:37
19	900	322.74561175648233	266.3469506524756	21/02/24 15:38:38
19	900	322.74561175648233	266.34695065247564	21/02/24 15:38:39
19	900	322.74561175648233	266.3469506524756	21/02/24 15:38:40
19	900	322.74561175648233	266.3469506524756	21/02/24 15:38:41
19	900	322.74561175648233	266.34695065247564	21/02/24 15:38:42
19	900	322.74561175648233	266.34695065247564	21/02/24 15:38:43
19	900	325.33470491008825	269.6240183086286	21/02/24 15:38:44
19	900	325.33470491008825	269.6240183086286	21/02/24 15:38:45
19	900	327.2230053463675	269.6378469350531	21/02/24 15:38:46
19	900	327.22300534636753	269.6378469350531	21/02/24 15:38:47
19	909	330.28838250879846	271.703362840502	21/02/24 15:38:48
19	909	332.94477462052106	270.4919384994539	21/02/24 15:38:49
19	950	335.24432386191205	269.68948620372345	21/02/24 15:38:50
19	950	335.24432386191205	269.68948620372345	21/02/24 15:38:51
19	NULL	337.73701806888556	270.34580290420837	21/02/24 15:38:52
19	NULL	337.73701806888556	270.34580290420837	21/02/24 15:38:53
19	919	341.8507959684553	269.41861351939014	21/02/24 15:38:54
19	919	341.8507959684553	269.41861351939014	21/02/24 15:38:55
19	919	341.8507959684553	269.41861351939014	21/02/24 15:38:56
19	954	351.0914713947272	276.75392450645927	21/02/24 15:38:57
19	954	351.0914713947271	276.75392450645927	21/02/24 15:38:58
19	964	349.72234002988336	284.71465847817086	21/02/24 15:38:59
19	940	347.9711572177418	278.13370891448585	21/02/24 15:39:00
19	954	349.64467777791396	276.690730939874	21/02/24 15:39:01
19	904	345.58406694546534	272.03626967984314	21/02/24 15:39:02
19	904	345.58406694546534	272.03626967984314	21/02/24 15:39:03
19	964	349.72234002988336	284.71465847817086	21/02/24 15:39:04
19	964	344.3155484927012	283.53998029232963	21/02/24 15:39:05
19	909	336.46390262814583	272.33191667978036	21/02/24 15:39:06
19	955	332.13398995625107	274.9863189954403	21/02/24 15:39:07
19	955	327.44520062785523	279.05437229772264	21/02/24 15:39:08
19	955	328.92321811554416	278.4499778858854	21/02/24 15:39:09
19	955	328.92321811554416	278.4499778858854	21/02/24 15:39:10
19	955	328.92321811554416	278.4499778858854	21/02/24 15:39:11
19	955	328.92321811554416	278.4499778858854	21/02/24 15:39:12
19	955	323.9884222877308	280.17133116751256	21/02/24 15:39:13
19	NULL	322.7688919024709	282.9508947625264	21/02/24 15:39:14
19	897	319.01521359261704	283.59757186890573	21/02/24 15:39:15
19	897	319.01521359261704	283.59757186890573	21/02/24 15:39:16
19	897	319.01521359261704	283.59757186890573	21/02/24 15:39:17
19	897	319.01521359261704	283.59757186890573	21/02/24 15:39:18
19	911	314.5882445185791	281.94764300047444	21/02/24 15:39:19
19	980	311.1000485048991	283.6794021053163	21/02/24 15:39:20
19	980	311.1000485048991	283.6794021053163	21/02/24 15:39:21
19	980	309.8797585242773	283.4992197770171	21/02/24 15:39:22
19	980	311.1000485048991	283.6794021053163	21/02/24 15:39:23
19	980	309.8797585242773	283.4992197770171	21/02/24 15:39:24
19	929	307.59178972789636	285.09780219467183	21/02/24 15:39:25
19	929	307.59178972789636	285.0978021946719	21/02/24 15:39:26
19	929	307.59178972789636	285.0978021946719	21/02/24 15:39:27
19	929	307.59178972789636	285.09780219467183	21/02/24 15:39:28
19	980	311.1000485048991	283.6794021053163	21/02/24 15:39:29
19	911	314.5882445185791	281.94764300047444	21/02/24 15:39:30
19	897	319.01521359261704	283.59757186890573	21/02/24 15:39:31
19	897	319.01521359261704	283.59757186890573	21/02/24 15:39:32
19	897	319.01521359261704	283.59757186890573	21/02/24 15:39:33
19	NULL	322.7688919024709	282.9508947625264	21/02/24 15:39:34
19	NULL	322.7688919024709	282.9508947625264	21/02/24 15:39:35
19	NULL	322.7688919024709	282.9508947625264	21/02/24 15:39:36
19	955	328.92321811554416	278.4499778858854	21/02/24 15:39:37
19	955	328.92321811554416	278.4499778858854	21/02/24 15:39:38
19	955	328.92321811554416	278.4499778858854	21/02/24 15:39:39
19	955	328.92321811554416	278.4499778858854	21/02/24 15:39:40
19	955	331.5796102272668	277.2385535448373	21/02/24 15:39:41
19	915	336.54156488011523	280.3558442180772	21/02/24 15:39:42
19	922	328.6294810474165	285.0543241298854	21/02/24 15:39:43
19	964	344.3155484927012	283.53998029232963	21/02/24 15:39:44
19	964	349.72234002988336	284.71465847817086	21/02/24 15:39:45
19	964	349.72234002988336	284.71465847817086	21/02/24 15:39:46
19	964	355.482293890607	282.3613173869535	21/02/24 15:39:47
19	964	355.482293890607	282.3613173869535	21/02/24 15:39:48
19	964	355.482293890607	282.3613173869535	21/02/24 15:39:49
19	964	355.482293890607	282.3613173869535	21/02/24 15:39:50
19	945	357.72180770228624	278.62087605071156	21/02/24 15:39:51
19	NULL	360.5547106147949	283.12207921272073	21/02/24 15:39:52
19	NULL	360.5547106147949	283.12207921272073	21/02/24 15:39:53
19	987	363.64647505929315	279.84759664761776	21/02/24 15:39:54
19	NULL	368.6441963719141	285.32200544753397	21/02/24 15:39:55
19	990	373.5702263177357	281.590961967497	21/02/24 15:39:56
19	990	373.5702263177357	281.590961967497	21/02/24 15:39:57
19	990	373.5702263177357	281.590961967497	21/02/24 15:39:58
19	990	373.5702263177357	281.5909619674969	21/02/24 15:39:59
19	NULL	375.7018838907682	280.5525699379839	21/02/24 15:40:00
19	937	374.63236040462476	279.0631299285737	21/02/24 15:40:01
19	937	374.63236040462476	279.0631299285737	21/02/24 15:40:02
19	NULL	375.70188389076833	280.5525699379839	21/02/24 15:40:03
19	NULL	375.70188389076833	280.5525699379839	21/02/24 15:40:04
19	937	374.63236040462476	279.0631299285737	21/02/24 15:40:05
19	NULL	375.70188389076833	280.5525699379839	21/02/24 15:40:06
19	937	374.63236040462476	279.0631299285737	21/02/24 15:40:07
19	937	374.63236040462476	279.0631299285737	21/02/24 15:40:08
19	937	374.63236040462476	279.0631299285737	21/02/24 15:40:09
19	NULL	375.70188389076833	280.5525699379839	21/02/24 15:40:10
19	NULL	375.70188389076833	280.5525699379839	21/02/24 15:40:11
19	937	374.63236040462476	279.0631299285737	21/02/24 15:40:12
19	937	374.63236040462476	279.0631299285737	21/02/24 15:40:13
19	NULL	375.70188389076833	280.5525699379839	21/02/24 15:40:14
19	937	374.63236040462476	279.0631299285737	21/02/24 15:40:15
19	937	374.63236040462476	279.0631299285737	21/02/24 15:40:16
19	NULL	375.70188389076833	280.5525699379839	21/02/24 15:40:17
19	937	374.63236040462476	279.0631299285737	21/02/24 15:40:18
19	NULL	375.70188389076833	280.5525699379839	21/02/24 15:40:19
19	NULL	375.70188389076833	280.5525699379839	21/02/24 15:40:20
19	NULL	375.70188389076833	280.5525699379839	21/02/24 15:40:21
19	NULL	375.7018838907682	280.5525699379839	21/02/24 15:40:22
19	990	373.5702263177357	281.5909619674969	21/02/24 15:40:23
19	990	373.5702263177357	281.590961967497	21/02/24 15:40:24
19	910	371.49991506597235	283.6424336238178	21/02/24 15:40:25
19	910	371.49991506597235	283.64243362381774	21/02/24 15:40:26
19	NULL	368.6441963719141	285.32200544753397	21/02/24 15:40:27
19	987	363.64647505929315	279.84759664761776	21/02/24 15:40:28
19	987	363.64647505929315	279.84759664761776	21/02/24 15:40:29
19	959	362.3530560401282	287.71527633822046	21/02/24 15:40:30
19	990	363.0255287252569	282.5550180117545	21/02/24 15:40:31
19	958	365.44482048462646	284.4407937731175	21/02/24 15:40:32
19	959	364.13925124804297	284.5462645050939	21/02/24 15:40:33
19	959	362.3530560401282	287.71527633822046	21/02/24 15:40:34
19	959	362.3530560401282	287.71527633822046	21/02/24 15:40:35
19	959	363.5183049140067	287.25368586923065	21/02/24 15:40:36
19	NULL	360.5547106147949	283.12207921272073	21/02/24 15:40:37
19	990	357.82242061436585	282.16385269148645	21/02/24 15:40:38
19	918	358.31519680311567	286.86252054896266	21/02/24 15:40:39
19	964	355.482293890607	282.3613173869535	21/02/24 15:40:40
19	964	355.482293890607	282.3613173869535	21/02/24 15:40:41
19	964	355.482293890607	282.36131738695343	21/02/24 15:40:42
19	968	355.71807547868275	279.11092240486005	21/02/24 15:40:43
19	904	345.5840669454654	272.03626967984314	21/02/24 15:40:44
19	904	347.25758750563756	270.59329170523137	21/02/24 15:40:45
19	919	341.8507959684553	269.41861351939014	21/02/24 15:40:46
19	919	341.8507959684553	269.41861351939014	21/02/24 15:40:47
19	NULL	337.73701806888556	270.34580290420837	21/02/24 15:40:48
19	NULL	337.73701806888556	270.34580290420837	21/02/24 15:40:49
19	NULL	337.73701806888556	270.34580290420837	21/02/24 15:40:50
19	950	335.24432386191205	269.68948620372345	21/02/24 15:40:51
19	950	335.244323861912	269.6894862037234	21/02/24 15:40:52
19	950	332.12560097371966	268.39264382435715	21/02/24 15:40:53
19	950	332.43252915974267	266.3574717486593	21/02/24 15:40:54
19	950	332.43252915974267	266.3574717486593	21/02/24 15:40:55
19	950	332.43252915974267	266.3574717486593	21/02/24 15:40:56
19	950	332.4325291597426	266.3574717486593	21/02/24 15:40:57
19	950	332.43252915974267	266.3574717486593	21/02/24 15:40:58
19	950	332.4325291597426	266.3574717486593	21/02/24 15:40:59
19	950	332.4325291597426	266.3574717486593	21/02/24 15:41:00
19	950	332.43252915974267	266.3574717486593	21/02/24 15:41:01
19	950	332.4325291597426	266.3574717486593	21/02/24 15:41:02
19	950	332.4325291597426	266.3574717486593	21/02/24 15:41:03
19	950	332.4325291597426	266.3574717486593	21/02/24 15:41:04
19	950	332.43252915974267	266.3574717486593	21/02/24 15:41:05
19	950	329.19286192152873	265.9386554950988	21/02/24 15:41:06
19	950	332.4325291597426	266.3574717486593	21/02/24 15:41:07
19	950	332.4325291597426	266.3574717486593	21/02/24 15:41:08
19	950	329.19286192152873	265.9386554950988	21/02/24 15:41:09
19	950	332.12560097371966	268.39264382435715	21/02/24 15:41:10
19	950	332.12560097371966	268.39264382435715	21/02/24 15:41:11
19	909	332.94477462052106	270.4919384994539	21/02/24 15:41:12
19	950	335.24432386191205	269.68948620372345	21/02/24 15:41:13
19	950	335.24432386191205	269.68948620372345	21/02/24 15:41:14
19	NULL	337.73701806888556	270.34580290420837	21/02/24 15:41:15
19	NULL	337.73701806888556	270.34580290420837	21/02/24 15:41:16
19	919	341.8507959684553	269.41861351939014	21/02/24 15:41:17
19	904	347.2575875056375	270.59329170523137	21/02/24 15:41:18
19	904	345.5840669454654	272.03626967984314	21/02/24 15:41:19
19	904	352.1597258472866	270.85810765218207	21/02/24 15:41:20
19	964	355.482293890607	282.3613173869535	21/02/24 15:41:21
19	964	355.482293890607	282.3613173869535	21/02/24 15:41:22
19	964	355.482293890607	282.3613173869535	21/02/24 15:41:23
19	964	355.482293890607	282.3613173869535	21/02/24 15:41:24
19	918	358.31519680311567	286.86252054896266	21/02/24 15:41:25
19	918	358.31519680311567	286.86252054896266	21/02/24 15:41:26
19	918	358.31519680311567	286.86252054896266	21/02/24 15:41:27
19	959	362.3530560401282	287.71527633822046	21/02/24 15:41:28
19	959	362.3530560401282	287.71527633822046	21/02/24 15:41:29
19	959	362.3530560401282	287.71527633822046	21/02/24 15:41:30
19	959	362.3530560401282	287.71527633822046	21/02/24 15:41:31
19	959	362.3530560401282	287.71527633822046	21/02/24 15:41:32
19	959	362.3530560401282	287.71527633822046	21/02/24 15:41:33
19	959	362.3530560401282	287.71527633822046	21/02/24 15:41:34
19	959	362.3530560401282	287.71527633822046	21/02/24 15:41:35
19	959	362.3530560401282	287.71527633822046	21/02/24 15:41:36
19	918	358.31519680311567	286.86252054896266	21/02/24 15:41:37
19	959	362.3530560401282	287.71527633822046	21/02/24 15:41:38
19	918	358.31519680311567	286.86252054896266	21/02/24 15:41:39
19	918	358.31519680311567	286.86252054896266	21/02/24 15:41:40
19	918	358.31519680311567	286.86252054896266	21/02/24 15:41:41
19	964	355.482293890607	282.3613173869535	21/02/24 15:41:42
19	964	355.482293890607	282.3613173869535	21/02/24 15:41:43
19	964	355.482293890607	282.3613173869535	21/02/24 15:41:44
19	904	353.3309852064064	273.01348317021734	21/02/24 15:41:45
19	904	347.25758750563756	270.59329170523137	21/02/24 15:41:46
19	904	347.25758750563756	270.59329170523137	21/02/24 15:41:47
19	919	341.8507959684553	269.41861351939014	21/02/24 15:41:48
19	919	341.8507959684553	269.41861351939014	21/02/24 15:41:49
19	919	340.2475697813879	268.6028650417705	21/02/24 15:41:50
19	919	340.2475697813879	268.6028650417705	21/02/24 15:41:51
19	919	340.2475697813879	268.6028650417705	21/02/24 15:41:52
19	919	340.2475697813879	268.6028650417705	21/02/24 15:41:53
19	919	340.2475697813879	268.6028650417705	21/02/24 15:41:54
19	919	340.2475697813879	268.6028650417705	21/02/24 15:41:55
19	919	340.2475697813879	268.6028650417705	21/02/24 15:41:56
19	NULL	337.73701806888556	270.34580290420837	21/02/24 15:41:57
19	NULL	337.73701806888556	270.34580290420837	21/02/24 15:41:58
19	919	340.2475697813879	268.6028650417705	21/02/24 15:41:59
19	919	340.2475697813879	268.6028650417705	21/02/24 15:42:00
19	919	340.2475697813879	268.6028650417705	21/02/24 15:42:01
19	919	340.2475697813879	268.6028650417705	21/02/24 15:42:02
19	919	340.2475697813879	268.60286504177043	21/02/24 15:42:03
19	919	340.2475697813879	268.60286504177043	21/02/24 15:42:04
19	919	340.2475697813879	268.60286504177043	21/02/24 15:42:05
19	919	340.2475697813879	268.60286504177043	21/02/24 15:42:06
19	919	340.2475697813879	268.6028650417705	21/02/24 15:42:07
19	919	340.2475697813879	268.6028650417705	21/02/24 15:42:08
19	919	341.8507959684553	269.41861351939014	21/02/24 15:42:09
19	919	341.8507959684553	269.41861351939014	21/02/24 15:42:10
19	904	347.25758750563756	270.59329170523137	21/02/24 15:42:11
19	904	347.25758750563756	270.59329170523137	21/02/24 15:42:12
19	954	351.0914713947271	276.75392450645927	21/02/24 15:42:13
19	968	355.71807547868275	279.11092240486005	21/02/24 15:42:14
19	964	355.482293890607	282.3613173869535	21/02/24 15:42:15
19	964	355.45075825430985	281.0224406867282	21/02/24 15:42:16
19	990	357.82242061436574	282.16385269148645	21/02/24 15:42:17
19	918	358.31519680311567	286.86252054896266	21/02/24 15:42:18
19	918	358.31519680311567	286.86252054896266	21/02/24 15:42:19
19	918	358.31519680311567	286.86252054896266	21/02/24 15:42:20
19	918	358.31519680311567	286.86252054896266	21/02/24 15:42:21
19	918	358.31519680311567	286.86252054896266	21/02/24 15:42:22
19	918	358.31519680311567	286.86252054896266	21/02/24 15:42:23
