floorId	partitionId	location_x	location_y	timeStamp
3	42	349.5164949594119	259.9901464221112	20/04/28 05:08:49
3	42	347.94554835318087	258.6717142733518	20/04/28 05:08:50
3	42	347.94554835318087	258.6717142733518	20/04/28 05:08:51
3	42	347.94554835318087	258.6717142733518	20/04/28 05:08:52
3	42	349.5164949594119	259.9901464221112	20/04/28 05:08:53
3	54	350.37914153837863	260.97432627346046	20/04/28 05:08:54
3	54	350.37914153837863	260.97432627346046	20/04/28 05:08:55
3	42	347.94554835318087	258.6717142733518	20/04/28 05:08:56
3	42	347.94554835318087	258.6717142733518	20/04/28 05:08:57
3	42	347.1868785189775	260.3528128347792	20/04/28 05:08:58
3	42	347.9455483531808	258.6717142733518	20/04/28 05:08:59
3	42	347.9455483531808	258.6717142733518	20/04/28 05:09:00
3	42	347.9455483531808	258.6717142733518	20/04/28 05:09:01
3	42	347.94554835318087	258.6717142733518	20/04/28 05:09:02
3	42	347.9455483531808	258.6717142733518	20/04/28 05:09:03
3	42	346.3242319400108	259.3686329834299	20/04/28 05:09:04
3	42	347.9455483531808	258.6717142733518	20/04/28 05:09:05
3	42	347.9455483531808	258.6717142733518	20/04/28 05:09:06
3	42	347.9455483531808	258.6717142733518	20/04/28 05:09:07
3	42	346.32423194001075	259.3686329834299	20/04/28 05:09:08
3	42	347.9455483531808	258.6717142733518	20/04/28 05:09:09
3	42	346.3242319400108	259.3686329834299	20/04/28 05:09:10
3	42	347.9455483531808	258.6717142733518	20/04/28 05:09:11
3	42	347.9455483531808	258.6717142733518	20/04/28 05:09:12
3	42	347.9455483531808	258.6717142733518	20/04/28 05:09:13
3	42	344.3961690322754	258.45831021258545	20/04/28 05:09:14
3	42	344.3961690322754	258.45831021258545	20/04/28 05:09:15
3	42	347.9455483531808	258.6717142733518	20/04/28 05:09:16
3	42	344.3961690322754	258.45831021258545	20/04/28 05:09:17
3	42	347.9455483531808	258.6717142733518	20/04/28 05:09:18
3	42	343.53091080698397	256.9812934275402	20/04/28 05:09:19
3	42	340.39847756944295	257.5774165717636	20/04/28 05:09:20
3	42	340.39847756944295	257.5774165717636	20/04/28 05:09:21
3	42	343.53091080698397	256.98129342754027	20/04/28 05:09:22
3	42	343.53091080698397	256.98129342754027	20/04/28 05:09:23
3	42	346.3242319400108	259.3686329834299	20/04/28 05:09:24
3	42	347.94554835318087	258.6717142733518	20/04/28 05:09:25
3	54	350.37914153837863	260.97432627346046	20/04/28 05:09:26
3	54	350.37914153837863	260.97432627346046	20/04/28 05:09:27
3	42	352.20974435218506	259.0612514241787	20/04/28 05:09:28
3	54	356.6246500946648	261.0341852858323	20/04/28 05:09:29
3	54	358.23287936641947	263.00617074250107	20/04/28 05:09:30
3	54	359.56855835216805	263.2279362811352	20/04/28 05:09:31
3	54	359.5685583521681	263.2279362811352	20/04/28 05:09:32
3	34	362.2167196060361	259.70189758364177	20/04/28 05:09:33
3	68	357.80003138449274	255.68897868820252	20/04/28 05:09:34
3	68	357.80003138449274	255.68897868820252	20/04/28 05:09:35
3	68	357.80003138449274	255.68897868820252	20/04/28 05:09:36
3	68	357.80003138449274	255.68897868820252	20/04/28 05:09:37
3	34	361.2642468288334	255.55936173685848	20/04/28 05:09:38
3	34	361.2642468288334	255.55936173685848	20/04/28 05:09:39
3	34	361.2642468288334	255.55936173685848	20/04/28 05:09:40
3	68	357.80003138449274	255.6889786882025	20/04/28 05:09:41
3	68	357.80003138449274	255.68897868820252	20/04/28 05:09:42
3	68	357.80003138449274	255.68897868820252	20/04/28 05:09:43
3	68	357.80003138449274	255.68897868820252	20/04/28 05:09:44
3	68	357.80003138449274	255.68897868820252	20/04/28 05:09:45
3	68	357.80003138449274	255.68897868820252	20/04/28 05:09:46
3	68	357.80003138449274	255.68897868820252	20/04/28 05:09:47
3	68	357.80003138449274	255.68897868820252	20/04/28 05:09:48
3	68	357.80003138449274	255.68897868820252	20/04/28 05:09:49
3	68	357.80003138449274	255.68897868820252	20/04/28 05:09:50
3	34	361.2642468288334	255.55936173685848	20/04/28 05:09:51
3	68	357.80003138449274	255.68897868820252	20/04/28 05:09:52
3	34	361.2642468288334	255.55936173685848	20/04/28 05:09:53
3	34	361.2642468288334	255.55936173685848	20/04/28 05:09:54
3	68	357.80003138449274	255.68897868820252	20/04/28 05:09:55
3	34	361.2642468288334	255.55936173685848	20/04/28 05:09:56
3	17	359.4808844292199	254.25140562337432	20/04/28 05:09:57
3	34	361.2642468288334	255.55936173685848	20/04/28 05:09:58
3	17	359.4808844292199	254.25140562337432	20/04/28 05:09:59
3	68	357.80003138449274	255.68897868820252	20/04/28 05:10:00
3	68	357.80003138449274	255.68897868820252	20/04/28 05:10:01
3	17	359.4808844292199	254.25140562337432	20/04/28 05:10:02
3	68	357.80003138449274	255.68897868820252	20/04/28 05:10:03
3	68	357.80003138449274	255.68897868820252	20/04/28 05:10:04
3	68	357.80003138449274	255.68897868820252	20/04/28 05:10:05
3	17	359.4808844292199	254.25140562337432	20/04/28 05:10:06
3	17	359.4808844292199	254.25140562337432	20/04/28 05:10:07
3	34	361.2642468288334	255.55936173685845	20/04/28 05:10:08
3	34	361.2642468288334	255.55936173685845	20/04/28 05:10:09
3	34	362.2167196060361	259.70189758364177	20/04/28 05:10:10
3	57	365.8336784609425	258.9548948604074	20/04/28 05:10:11
3	54	367.80245440868674	262.5455232582413	20/04/28 05:10:12
3	54	368.9169651830857	261.65782172430613	20/04/28 05:10:13
3	54	372.48785670166836	262.3595943162643	20/04/28 05:10:14
3	54	372.48785670166836	262.3595943162643	20/04/28 05:10:15
3	57	374.26377240687094	258.097817872792	20/04/28 05:10:16
3	15	379.8755906118027	262.6421307240284	20/04/28 05:10:17
3	15	379.8755906118027	262.6421307240284	20/04/28 05:10:18
3	15	380.97239583354167	266.94453563659977	20/04/28 05:10:19
1	33	381.6109766893215	266.73786054806715	20/04/28 05:10:20
1	33	381.6109766893215	266.73786054806715	20/04/28 05:10:21
1	33	379.51825801393375	263.17204603967434	20/04/28 05:10:22
1	69	376.18075636557654	261.96517202151136	20/04/28 05:10:23
1	69	372.48785670166836	262.3595943162643	20/04/28 05:10:24
1	69	372.48785670166836	262.3595943162643	20/04/28 05:10:25
1	69	368.9169651830857	261.65782172430613	20/04/28 05:10:26
1	69	367.80245440868674	262.5455232582413	20/04/28 05:10:27
3	57	365.6578696297699	259.3576200548633	20/04/28 05:10:28
3	34	360.34474432813596	257.2761703004846	20/04/28 05:10:29
1	64	358.87237025214637	261.21107622709695	20/04/28 05:10:30
1	64	356.02694011127693	259.70882448523747	20/04/28 05:10:31
1	64	356.02694011127693	259.70882448523747	20/04/28 05:10:32
1	41	352.7251685521831	260.56227788261185	20/04/28 05:10:33
1	41	352.7251685521831	260.56227788261185	20/04/28 05:10:34
1	41	352.7251685521831	260.56227788261185	20/04/28 05:10:35
1	41	351.1038521390131	261.25919659268993	20/04/28 05:10:36
1	22	346.48253983850464	261.2777688197779	20/04/28 05:10:37
1	22	343.1917987024697	259.9647561276533	20/04/28 05:10:38
1	22	343.1917987024697	259.9647561276533	20/04/28 05:10:39
1	NULL	341.75641581596034	259.4998576241711	20/04/28 05:10:40
1	69	338.1583683683643	258.3517387010974	20/04/28 05:10:41
1	69	338.1583683683643	258.3517387010974	20/04/28 05:10:42
1	5	334.95421240030805	260.2160082477838	20/04/28 05:10:43
1	5	333.7145018941879	260.9894407549504	20/04/28 05:10:44
1	37	329.2127636639186	262.6803906369539	20/04/28 05:10:45
1	37	326.9602189569582	261.441576379981	20/04/28 05:10:46
1	37	323.9780902572864	261.641853061257	20/04/28 05:10:47
1	37	323.9780902572864	261.641853061257	20/04/28 05:10:48
1	72	321.1077911072469	264.3050039939337	20/04/28 05:10:49
1	81	318.06966812882723	262.69145868280907	20/04/28 05:10:50
1	81	316.8584991431141	264.5437756453438	20/04/28 05:10:51
1	81	314.50318194109644	265.02915212402996	20/04/28 05:10:52
1	81	314.96666300344697	265.07112173294576	20/04/28 05:10:53
1	81	316.8584991431141	264.5437756453438	20/04/28 05:10:54
1	81	317.4633882763735	263.93806291016494	20/04/28 05:10:55
1	81	315.74240883925677	260.5181275582284	20/04/28 05:10:56
1	81	316.8584991431141	264.5437756453438	20/04/28 05:10:57
1	81	317.4633882763735	263.93806291016494	20/04/28 05:10:58
1	81	315.74240883925677	260.5181275582284	20/04/28 05:10:59
1	81	318.06966812882723	262.69145868280907	20/04/28 05:11:00
1	72	321.10779110724695	264.3050039939337	20/04/28 05:11:01
1	37	323.9780902572864	261.641853061257	20/04/28 05:11:02
1	37	323.9780902572864	261.641853061257	20/04/28 05:11:03
1	37	326.9602189569582	261.44157637998103	20/04/28 05:11:04
1	37	328.2564734484187	262.2912795313731	20/04/28 05:11:05
3	54	332.9065526505472	263.50534437986465	20/04/28 05:11:06
1	69	335.2486733223834	258.8873750560347	20/04/28 05:11:07
1	69	338.1583683683643	258.3517387010974	20/04/28 05:11:08
1	69	338.1583683683643	258.3517387010974	20/04/28 05:11:09
1	69	338.1583683683643	258.3517387010974	20/04/28 05:11:10
1	NULL	341.7564158159603	259.49985762417106	20/04/28 05:11:11
1	22	343.1917987024697	259.9647561276533	20/04/28 05:11:12
1	22	346.48253983850464	261.2777688197779	20/04/28 05:11:13
1	41	349.2732493252067	263.17227144197165	20/04/28 05:11:14
1	41	351.1038521390131	261.25919659268993	20/04/28 05:11:15
1	41	351.1038521390131	261.25919659269	20/04/28 05:11:16
1	64	354.49328963180795	262.3471616487957	20/04/28 05:11:17
1	64	354.49328963180795	262.3471616487957	20/04/28 05:11:18
1	64	356.0030407869288	263.6276478520211	20/04/28 05:11:19
3	8	357.8750160648289	266.0533751351783	20/04/28 05:11:20
3	46	364.70031867043167	266.8771548784566	20/04/28 05:11:21
1	13	368.31727752533806	266.1301521552222	20/04/28 05:11:22
1	13	368.31727752533806	266.1301521552222	20/04/28 05:11:23
1	69	368.9169651830857	261.65782172430613	20/04/28 05:11:24
1	69	372.48785670166836	262.3595943162643	20/04/28 05:11:25
1	74	374.7544496259107	264.45130263293123	20/04/28 05:11:26
1	74	374.22324277918716	266.45532414030305	20/04/28 05:11:27
1	86	376.4088055113555	269.3162468994009	20/04/28 05:11:28
1	74	373.5846619234073	266.66199922883567	20/04/28 05:11:29
