floorId	partitionId	location_x	location_y	timeStamp
21	962	344.33487452164525	269.46232070464015	21/02/24 15:38:00
21	962	344.35084694610214	269.4699432388564	21/02/24 15:38:00
21	962	344.35084694610214	269.4699432388564	21/02/24 15:38:00
21	962	344.0428339036919	269.2973255121463	21/02/24 15:38:00
21	962	344.14996040235656	269.18035379229747	21/02/24 15:38:00
21	962	343.9964701501595	269.0910860178275	21/02/24 15:38:00
21	962	343.7856271808888	269.21688941786437	21/02/24 15:38:00
21	962	343.7856271808888	269.21688941786437	21/02/24 15:38:00
21	962	343.7161158375919	269.2007308395092	21/02/24 15:38:00
21	962	343.7161158375919	269.2007308395092	21/02/24 15:38:01
21	962	343.5815982853483	269.02692002712627	21/02/24 15:38:01
21	962	343.4963853169796	269.33560621417297	21/02/24 15:38:01
21	962	343.4963853169796	269.33560621417297	21/02/24 15:38:01
21	962	343.4490031876046	269.3359469351332	21/02/24 15:38:01
21	962	343.2945727668861	269.34395700175895	21/02/24 15:38:01
21	962	343.3023727277081	269.64227369580277	21/02/24 15:38:01
21	962	343.3761357702436	269.659920509531	21/02/24 15:38:01
21	962	343.33630172719234	269.51530862997464	21/02/24 15:38:01
21	962	343.33630172719234	269.51530862997464	21/02/24 15:38:01
21	962	343.7012965729372	269.36347099196985	21/02/24 15:38:02
21	962	343.7743777854058	269.5894613367052	21/02/24 15:38:02
21	962	343.80369900374325	269.34794302954475	21/02/24 15:38:02
21	962	343.7946459231481	269.48635499289907	21/02/24 15:38:02
21	962	343.79922260006947	269.43782269751233	21/02/24 15:38:02
21	962	343.79578743245753	269.4965762460007	21/02/24 15:38:02
21	962	343.9622285714244	269.5959010640597	21/02/24 15:38:02
21	962	343.81264393234875	269.5279610012405	21/02/24 15:38:02
21	962	343.59315282599846	269.70759027317723	21/02/24 15:38:02
21	962	343.53264124811614	269.77785436917014	21/02/24 15:38:03
21	962	343.8113785778378	269.786976597041	21/02/24 15:38:03
21	962	343.7318524014463	269.60403211383795	21/02/24 15:38:03
21	962	343.9058384433782	269.3660794613844	21/02/24 15:38:03
21	962	343.80244754721355	269.62315138868644	21/02/24 15:38:03
21	962	343.77361179902226	269.63500826800674	21/02/24 15:38:03
21	962	343.98490803429087	269.7270000270402	21/02/24 15:38:03
21	962	344.0506285582381	269.9264487612847	21/02/24 15:38:03
21	962	343.8307112909759	269.8767313232454	21/02/24 15:38:03
21	962	343.77777066223746	270.1203827401807	21/02/24 15:38:03
21	962	343.77777066223746	270.1203827401807	21/02/24 15:38:04
21	962	343.8594708566845	269.8476965024912	21/02/24 15:38:04
21	962	343.72694765656024	269.89082633791327	21/02/24 15:38:04
21	962	343.7718851734835	270.0747119848376	21/02/24 15:38:04
21	962	343.7718851734835	270.0747119848376	21/02/24 15:38:04
21	962	343.60911029447675	270.03367425887217	21/02/24 15:38:04
21	962	343.44390927938326	270.23695878292057	21/02/24 15:38:04
21	962	343.4492757555386	270.24390713386356	21/02/24 15:38:04
21	962	343.4904713581233	270.0933853601624	21/02/24 15:38:04
21	962	343.616289124095	270.34414313222	21/02/24 15:38:04
21	962	343.5813945595563	270.1375469874289	21/02/24 15:38:05
21	962	343.78306480309624	270.1765981511831	21/02/24 15:38:05
21	962	343.66974296891505	270.4697648661981	21/02/24 15:38:05
21	962	343.7910511140198	270.47825231471745	21/02/24 15:38:05
21	962	343.80333655128493	270.51222728305146	21/02/24 15:38:05
21	962	343.80333655128493	270.51222728305146	21/02/24 15:38:05
21	962	343.734386624456	270.4695473018281	21/02/24 15:38:05
21	962	343.3658352364836	270.62716182629293	21/02/24 15:38:05
21	962	343.3658352364836	270.62716182629293	21/02/24 15:38:05
21	962	343.4219231982671	270.63059752736274	21/02/24 15:38:06
21	962	343.41351740491547	270.65186628458673	21/02/24 15:38:06
21	962	343.50518759817646	270.57767954484734	21/02/24 15:38:06
21	962	343.4978945682281	270.76300439717016	21/02/24 15:38:06
21	962	343.39245860380447	270.74971290046955	21/02/24 15:38:06
21	962	343.46764074875	270.52222494906346	21/02/24 15:38:06
21	962	343.21533939880186	270.6711794740147	21/02/24 15:38:06
21	962	343.1883497665941	270.91134755800226	21/02/24 15:38:06
21	962	343.1883497665941	270.91134755800226	21/02/24 15:38:06
21	962	343.18933553111384	271.00060215310396	21/02/24 15:38:06
21	962	343.1030131672676	271.0271813788065	21/02/24 15:38:07
21	962	343.32312904178116	270.9856744503973	21/02/24 15:38:07
21	962	343.54786060456195	271.0138691086562	21/02/24 15:38:07
21	962	343.69242321038956	271.1266147745464	21/02/24 15:38:07
21	962	343.57381763899957	271.2217879301814	21/02/24 15:38:07
21	962	343.57381763899957	271.2217879301814	21/02/24 15:38:07
21	962	343.5125337257774	271.0199367582989	21/02/24 15:38:07
21	962	343.5125337257774	271.0199367582989	21/02/24 15:38:07
21	962	343.5695779632238	271.0097279536427	21/02/24 15:38:07
21	962	343.62790685759285	271.0162684051196	21/02/24 15:38:08
21	962	343.60161433810623	271.0040375519841	21/02/24 15:38:08
21	962	343.46036000004926	270.8546975158999	21/02/24 15:38:08
21	962	343.5004258244739	270.80149107637527	21/02/24 15:38:08
21	962	343.61362283964326	270.9385004944307	21/02/24 15:38:08
21	962	343.4018265111762	270.8193189118964	21/02/24 15:38:08
21	962	343.4018265111762	270.8193189118964	21/02/24 15:38:08
21	962	343.53232859414555	270.85777317136115	21/02/24 15:38:08
21	962	343.38389128645434	271.1923123399405	21/02/24 15:38:08
21	962	343.54155230133085	271.1667490460989	21/02/24 15:38:08
21	962	343.61768986477915	271.09290694745465	21/02/24 15:38:09
21	962	343.71890327883057	271.12886424717294	21/02/24 15:38:09
21	962	343.56028595509537	271.1753672901255	21/02/24 15:38:09
21	962	343.52997760864906	271.4253315425684	21/02/24 15:38:09
21	962	343.51117293801246	271.38601205012253	21/02/24 15:38:09
21	962	343.51117293801246	271.38601205012253	21/02/24 15:38:09
21	962	343.6481965509879	271.33670315015013	21/02/24 15:38:09
21	962	343.6716992107627	271.3201445928466	21/02/24 15:38:09
21	962	343.54920990556025	271.39042085347376	21/02/24 15:38:09
21	962	343.72943777563853	271.56890252585737	21/02/24 15:38:09
21	962	343.6753308353149	271.50863965928863	21/02/24 15:38:10
21	962	343.6461449018792	271.5210298811868	21/02/24 15:38:10
21	962	343.70397389303633	271.59048545880165	21/02/24 15:38:10
21	962	343.6093820163498	271.50004276331333	21/02/24 15:38:10
21	962	343.6573909055892	271.6395836292877	21/02/24 15:38:10
21	962	343.6452886644068	271.5730923276064	21/02/24 15:38:10
21	962	343.48259306733286	271.6959278740112	21/02/24 15:38:10
21	962	343.67716775735886	271.7528946205415	21/02/24 15:38:10
21	962	343.44807230133404	271.5860092550136	21/02/24 15:38:10
21	962	343.44807230133404	271.5860092550136	21/02/24 15:38:11
21	962	343.44807230133404	271.5860092550136	21/02/24 15:38:11
21	962	343.44807230133404	271.5860092550136	21/02/24 15:38:11
21	962	343.3713280323342	271.78505142152517	21/02/24 15:38:11
21	962	343.1543842721857	271.8724645206539	21/02/24 15:38:11
21	962	343.00439975379084	271.7887899678143	21/02/24 15:38:11
21	962	342.8590094283422	272.01982224645184	21/02/24 15:38:11
21	962	342.94822138945324	272.07042907734973	21/02/24 15:38:11
21	962	343.2195978851618	272.12025598510337	21/02/24 15:38:11
21	962	343.12394937165635	272.23627352345227	21/02/24 15:38:11
21	962	343.16441140619605	272.15599744669197	21/02/24 15:38:12
21	962	343.37198597856855	272.2110657615617	21/02/24 15:38:12
21	962	343.33001764887166	272.20879881029975	21/02/24 15:38:12
21	962	343.33273061193364	272.2090179740026	21/02/24 15:38:12
21	962	343.31221275548626	272.1529925741209	21/02/24 15:38:12
21	962	343.3630775786069	272.4032128611199	21/02/24 15:38:12
21	962	343.2116227863413	272.43164634778725	21/02/24 15:38:12
21	962	343.3588835741623	272.1881811136047	21/02/24 15:38:12
21	962	343.3566446175004	272.03990436822613	21/02/24 15:38:12
21	962	343.30776258684	272.1050986641737	21/02/24 15:38:12
21	962	343.30307869277704	272.08895235278607	21/02/24 15:38:13
21	962	343.2851056538652	272.10610609001577	21/02/24 15:38:13
21	962	343.2851056538652	272.10610609001577	21/02/24 15:38:13
21	962	343.28339978104367	272.0903370200184	21/02/24 15:38:13
21	962	343.40171206496365	272.1323494569344	21/02/24 15:38:13
21	962	343.495531633708	272.28669606219563	21/02/24 15:38:13
21	962	343.5380889853469	272.32208862405787	21/02/24 15:38:13
21	962	343.63683183558214	272.2387975509852	21/02/24 15:38:13
21	962	343.44958922254335	272.3766591221948	21/02/24 15:38:13
21	962	343.6066437163001	272.4090406390094	21/02/24 15:38:13
21	962	343.6645462972686	272.30727223956916	21/02/24 15:38:14
21	962	343.64052558587343	272.3145000465515	21/02/24 15:38:14
21	962	343.64052558587343	272.3145000465515	21/02/24 15:38:14
21	962	343.14733468450106	272.3943485035298	21/02/24 15:38:14
21	962	343.10062074145145	272.23021437825656	21/02/24 15:38:14
21	962	342.8306334524984	272.13839526761075	21/02/24 15:38:14
21	962	342.8240297238906	272.1514786842431	21/02/24 15:38:14
21	962	342.6613627177411	272.20961113631887	21/02/24 15:38:14
21	962	342.85438030489655	272.0722122962503	21/02/24 15:38:14
21	962	342.85438030489655	272.0722122962503	21/02/24 15:38:15
21	962	343.31727170989086	271.8294042821863	21/02/24 15:38:15
21	962	343.37125651319064	271.9183559087079	21/02/24 15:38:15
21	962	343.36497594671204	272.05443620021913	21/02/24 15:38:15
21	962	343.16228543944635	272.27182739605774	21/02/24 15:38:15
21	962	343.1474256617003	272.1915563487752	21/02/24 15:38:15
21	962	343.33170393973677	272.15505172459797	21/02/24 15:38:15
21	962	343.3123752911749	272.1160862288898	21/02/24 15:38:15
21	962	343.30437268372685	272.037053408898	21/02/24 15:38:15
21	962	343.2655531379895	272.08670713606546	21/02/24 15:38:15
21	962	343.50088884025087	272.21576501185115	21/02/24 15:38:16
21	962	343.4445575317077	272.2118044409922	21/02/24 15:38:16
21	962	343.33070991965735	272.1504722038064	21/02/24 15:38:16
21	962	343.3390174048406	272.08030461671535	21/02/24 15:38:16
21	962	343.21540705342187	271.9092469770561	21/02/24 15:38:16
21	962	343.2222306134627	271.94389784240116	21/02/24 15:38:16
21	962	343.0664936000129	272.0458814631572	21/02/24 15:38:16
21	962	343.07755550639325	272.0413551902214	21/02/24 15:38:16
21	962	342.82262230655385	271.94921487960846	21/02/24 15:38:16
21	962	342.74241722148145	271.99768136057276	21/02/24 15:38:16
21	962	342.512548202478	272.1534759963404	21/02/24 15:38:17
21	962	342.4576492906249	272.23112576750964	21/02/24 15:38:17
21	962	342.36308058503323	272.28451850989705	21/02/24 15:38:17
21	962	342.4769672287749	272.16220030219	21/02/24 15:38:17
21	962	342.44506098546316	272.16345282857594	21/02/24 15:38:17
21	962	342.619802862401	272.21397700232006	21/02/24 15:38:17
21	962	342.63740348380685	272.20145408834014	21/02/24 15:38:17
21	962	342.42901398468086	272.35822610892563	21/02/24 15:38:17
21	962	342.22237512582115	272.39878087238094	21/02/24 15:38:17
21	962	341.9836735993512	272.235028535031	21/02/24 15:38:18
21	962	341.9760803498164	272.1285164670815	21/02/24 15:38:18
21	962	341.98764161364073	272.1250362781522	21/02/24 15:38:18
21	962	341.8148249848532	272.15383207623165	21/02/24 15:38:18
21	962	341.8148249848532	272.15383207623165	21/02/24 15:38:18
21	962	341.8287423278143	272.09361466247015	21/02/24 15:38:18
21	962	341.96432433535	272.0776922201426	21/02/24 15:38:18
21	962	341.81552502326934	272.21556550245896	21/02/24 15:38:18
21	962	341.901677510953	272.3900722332834	21/02/24 15:38:18
21	962	341.66339636264394	272.3769801668141	21/02/24 15:38:18
21	962	341.5552982389773	272.367069996073	21/02/24 15:38:19
21	962	341.5919237663521	272.40112001088863	21/02/24 15:38:19
21	962	341.74701392881326	272.31658899407074	21/02/24 15:38:19
21	962	341.8205897044149	272.30904228287176	21/02/24 15:38:19
21	962	341.7680582186323	272.30985189964963	21/02/24 15:38:19
21	962	341.80793545247843	272.3079101613416	21/02/24 15:38:19
21	962	341.80242707560643	272.43358034124117	21/02/24 15:38:19
21	962	341.90333258100765	272.3868367795069	21/02/24 15:38:19
21	962	341.9040082454248	272.2524254931514	21/02/24 15:38:19
21	962	341.7738315698562	272.313393609314	21/02/24 15:38:19
21	962	341.95992389849823	272.4758746728459	21/02/24 15:38:20
21	962	341.99756660719123	272.5252972462977	21/02/24 15:38:20
21	962	342.06650192421523	272.4883922479808	21/02/24 15:38:20
21	962	341.9176620262278	272.3827764543366	21/02/24 15:38:20
21	962	341.8504260170295	272.28845359501804	21/02/24 15:38:20
21	962	341.9012006582172	272.513846134921	21/02/24 15:38:20
21	962	341.61787485796566	272.5402731543343	21/02/24 15:38:20
21	962	341.54572755157074	272.6215781901879	21/02/24 15:38:20
21	962	341.6432917389677	272.51144892009114	21/02/24 15:38:20
21	962	341.7273796041374	272.2955459631636	21/02/24 15:38:21
21	962	341.72499151117137	272.2705036067546	21/02/24 15:38:21
21	962	341.9002688557954	272.23373634322513	21/02/24 15:38:21
21	962	341.8190061302142	272.1110298604783	21/02/24 15:38:21
21	962	341.81115956207015	271.8781509705933	21/02/24 15:38:21
21	962	341.87428618652245	271.772424439483	21/02/24 15:38:21
21	962	341.83357515802874	271.72476395275254	21/02/24 15:38:21
21	962	341.6817039701545	271.66182595190253	21/02/24 15:38:21
21	962	341.64363385873577	271.59911789519316	21/02/24 15:38:21
21	962	341.8535588935303	271.74729163179325	21/02/24 15:38:21
21	962	341.69917471620914	271.68203567978395	21/02/24 15:38:22
21	962	341.6242679198432	271.71254737101515	21/02/24 15:38:22
21	962	341.4004476309139	271.7376503035323	21/02/24 15:38:22
21	962	341.13953673879575	271.6224141745156	21/02/24 15:38:22
21	962	341.0079916077946	271.5615314278144	21/02/24 15:38:22
21	962	341.1297808490068	271.7379670975559	21/02/24 15:38:22
21	962	340.85060642262937	271.64069210656663	21/02/24 15:38:22
21	962	340.90131879203074	271.6096350241317	21/02/24 15:38:22
21	962	340.8424263338998	271.53979866972196	21/02/24 15:38:22
21	962	340.84656924640456	271.5394597158869	21/02/24 15:38:22
21	962	340.8138066040377	271.504234238873	21/02/24 15:38:23
21	962	340.92065485118013	271.48228446674824	21/02/24 15:38:23
21	962	341.1051074089112	271.38679627723326	21/02/24 15:38:23
21	962	341.1317604504458	271.4623678768273	21/02/24 15:38:23
21	962	341.152317653436	271.34631491052113	21/02/24 15:38:23
21	962	341.33115742803176	271.5814573656153	21/02/24 15:38:23
21	962	341.32235011211253	271.52487074853275	21/02/24 15:38:23
21	962	341.3265680568434	271.52469605222393	21/02/24 15:38:23
21	962	341.3265680568434	271.52469605222393	21/02/24 15:38:23
21	962	341.2520985402396	271.6233255308568	21/02/24 15:38:24
21	962	341.1191625620985	271.7826208328682	21/02/24 15:38:24
21	962	341.27077999267925	271.8767858290545	21/02/24 15:38:24
21	962	341.0463864205958	271.89239200031864	21/02/24 15:38:24
21	962	341.2343101811388	271.85361888105075	21/02/24 15:38:24
21	962	341.12064492414	271.8884664125381	21/02/24 15:38:24
21	962	341.2272427817383	271.83960080654214	21/02/24 15:38:24
21	962	341.1603645049428	271.8902684006787	21/02/24 15:38:24
21	962	341.2861035567713	271.9512865055594	21/02/24 15:38:24
21	962	341.06340200863445	271.79554353480137	21/02/24 15:38:24
21	962	341.02613142205837	271.80710565997987	21/02/24 15:38:25
21	962	341.0868828813487	271.8198027331478	21/02/24 15:38:25
21	962	340.96086030119903	271.72976385092386	21/02/24 15:38:25
21	962	340.8687902477794	271.7795885423394	21/02/24 15:38:25
21	962	340.86269282713226	272.05101623362617	21/02/24 15:38:25
21	962	340.71967544989803	271.8541102227216	21/02/24 15:38:25
21	962	340.49410607760103	271.9182672127954	21/02/24 15:38:25
21	962	340.4175236982403	271.90006838478496	21/02/24 15:38:25
21	962	340.37885061491454	272.02103395282035	21/02/24 15:38:25
21	962	340.0880337722186	272.0497985465836	21/02/24 15:38:25
21	962	340.18794844791233	271.99479844196776	21/02/24 15:38:26
21	962	340.0873162801233	272.09491265475134	21/02/24 15:38:26
21	962	339.9899119833217	271.9166291972395	21/02/24 15:38:26
21	962	340.2054856742343	271.9430558928428	21/02/24 15:38:26
21	962	340.17654245539063	272.0570399573199	21/02/24 15:38:26
21	962	340.3190240721675	271.897135493231	21/02/24 15:38:26
21	962	340.4861203488658	271.7934347084181	21/02/24 15:38:26
21	962	340.5243003056835	271.6721386592893	21/02/24 15:38:26
21	962	340.70138842839043	271.5228870534745	21/02/24 15:38:26
21	962	340.59492929814303	271.62471990015035	21/02/24 15:38:27
21	962	340.3468360296508	271.6757841919665	21/02/24 15:38:27
21	962	340.20955723515226	271.6821293172927	21/02/24 15:38:27
21	962	340.2233118554598	271.61290092188585	21/02/24 15:38:27
21	962	339.991956726669	271.7661053309238	21/02/24 15:38:27
21	962	340.09055472093996	271.80231412138613	21/02/24 15:38:27
21	962	340.09055472093996	271.80231412138613	21/02/24 15:38:27
21	962	339.8567623909138	271.8352229219666	21/02/24 15:38:27
21	962	339.8567623909138	271.8352229219666	21/02/24 15:38:27
21	962	339.75849781554956	271.8096874457487	21/02/24 15:38:27
21	962	339.5710421465429	272.03218029279356	21/02/24 15:38:28
21	962	339.4400985229506	272.0806834528759	21/02/24 15:38:28
21	962	339.3872435453679	272.0225805832637	21/02/24 15:38:28
21	962	339.19890350900886	271.91852177028255	21/02/24 15:38:28
21	962	339.03556023995446	272.161492387698	21/02/24 15:38:28
21	962	339.03556023995446	272.161492387698	21/02/24 15:38:28
21	962	339.17150561919794	272.0342208584709	21/02/24 15:38:28
21	962	339.1489212206407	271.98471812390164	21/02/24 15:38:28
21	962	339.35853767234426	271.82748017840316	21/02/24 15:38:28
21	962	339.35853767234426	271.82748017840316	21/02/24 15:38:28
21	962	339.35853767234426	271.82748017840316	21/02/24 15:38:29
21	962	339.09304008335704	271.7427565452706	21/02/24 15:38:29
21	962	339.08153241651144	272.0212208730212	21/02/24 15:38:29
21	962	338.97464749685173	272.1323716562906	21/02/24 15:38:29
21	962	339.02203195470395	272.39800765115103	21/02/24 15:38:29
21	962	339.2184004455404	272.5215007579969	21/02/24 15:38:29
21	962	339.22354645367545	272.64233595652894	21/02/24 15:38:29
21	962	338.9906043320567	272.6954778081435	21/02/24 15:38:29
21	962	338.9778664167635	272.7778617193678	21/02/24 15:38:29
21	962	339.09381002859044	272.63657358822906	21/02/24 15:38:29
21	962	339.14245366568747	272.660942914411	21/02/24 15:38:30
21	962	339.14245366568747	272.660942914411	21/02/24 15:38:30
21	962	338.82675561212193	272.81035222192537	21/02/24 15:38:30
21	962	338.77940830448586	272.81895253576545	21/02/24 15:38:30
21	962	338.63531393125163	272.8494016235091	21/02/24 15:38:30
21	962	338.82656289680165	272.94364439754	21/02/24 15:38:30
21	962	339.0422645768541	273.07898906639764	21/02/24 15:38:30
21	962	339.0093611763408	273.0198704969623	21/02/24 15:38:30
21	962	339.0201479034822	273.0624413584244	21/02/24 15:38:30
21	962	338.7912605190866	272.97311988233906	21/02/24 15:38:31
21	962	338.8095059734178	272.849241119508	21/02/24 15:38:31
21	962	338.8095059734178	272.849241119508	21/02/24 15:38:31
21	962	338.96946332537897	272.61746015864014	21/02/24 15:38:31
21	962	338.7435369778636	272.64990045906785	21/02/24 15:38:31
21	962	338.89041998915366	272.5441136821674	21/02/24 15:38:31
21	962	338.89041998915366	272.5441136821674	21/02/24 15:38:31
21	962	338.9745085377888	272.44919761458436	21/02/24 15:38:31
21	962	338.737052347299	272.49794551786306	21/02/24 15:38:31
21	962	338.5829000393373	272.42744483662955	21/02/24 15:38:31
21	962	338.5284935486937	272.24156814224	21/02/24 15:38:32
21	962	338.5237306287616	272.24362021487303	21/02/24 15:38:32
21	962	338.56790406975955	272.6442072381555	21/02/24 15:38:32
21	962	338.44546693174567	272.8870049795358	21/02/24 15:38:32
21	962	338.5007607065271	273.1716271705315	21/02/24 15:38:32
21	962	338.4429703003956	273.0364271750001	21/02/24 15:38:32
21	962	338.274292772089	272.88092262869134	21/02/24 15:38:32
21	962	338.31147941173333	272.8057744554395	21/02/24 15:38:32
21	962	338.31147941173333	272.8057744554395	21/02/24 15:38:32
21	962	338.31147941173333	272.8057744554395	21/02/24 15:38:33
21	962	338.25959117810714	272.93877380257413	21/02/24 15:38:33
21	962	338.25959117810714	272.93877380257413	21/02/24 15:38:33
21	962	338.3343262739441	272.9916305715882	21/02/24 15:38:33
21	962	338.1912487979536	273.12762422790445	21/02/24 15:38:33
21	962	337.97507682341774	273.03712303165025	21/02/24 15:38:33
21	962	337.9207886008801	273.07929138776717	21/02/24 15:38:33
21	962	337.667820071771	273.205607626614	21/02/24 15:38:33
21	962	337.8057447027694	273.24704577871825	21/02/24 15:38:33
21	962	337.6630449071905	273.479431792197	21/02/24 15:38:33
21	962	337.60570823940606	273.64732204119224	21/02/24 15:38:34
21	962	337.79864394516284	273.70442973740535	21/02/24 15:38:34
21	962	338.0123136740857	273.70454197166714	21/02/24 15:38:34
21	962	337.83537729837445	273.70773651311265	21/02/24 15:38:34
21	962	337.91044078584326	273.79681131931466	21/02/24 15:38:34
21	962	338.0199949547591	273.6884396675784	21/02/24 15:38:34
21	962	337.7707099018914	273.782774885271	21/02/24 15:38:34
21	962	337.73800681295273	273.9891404302572	21/02/24 15:38:34
21	962	337.8700714633807	274.01129807319734	21/02/24 15:38:34
21	962	337.8882364448555	273.99924382730325	21/02/24 15:38:34
21	962	337.97236066954844	274.0375600008128	21/02/24 15:38:35
21	962	337.9627021936717	274.0151944862962	21/02/24 15:38:35
21	962	337.89148856667174	274.12084800287533	21/02/24 15:38:35
21	962	337.87862520449227	273.92450919092676	21/02/24 15:38:35
21	962	337.85968700330636	273.64153867645285	21/02/24 15:38:35
21	962	337.8789947586125	273.6342206827655	21/02/24 15:38:35
21	962	337.8789947586125	273.6342206827655	21/02/24 15:38:35
21	962	337.81908792138034	273.6275932959463	21/02/24 15:38:35
21	962	337.7938456882891	273.63339523540213	21/02/24 15:38:35
21	962	337.78786051898396	273.6396135051746	21/02/24 15:38:36
21	962	337.77687961653027	273.6543198250501	21/02/24 15:38:36
21	962	337.7808868207747	273.73082461491543	21/02/24 15:38:36
21	962	337.89855090729645	273.9334388258526	21/02/24 15:38:36
21	962	337.9914942652001	274.08275068207945	21/02/24 15:38:36
21	962	338.0827123527181	273.9013264091373	21/02/24 15:38:36
21	962	337.81664457910756	273.8317828091976	21/02/24 15:38:36
21	962	337.6636604389137	273.64115858631595	21/02/24 15:38:36
21	962	337.5002286889282	273.885993428952	21/02/24 15:38:36
21	962	337.3850839075294	273.81066879004794	21/02/24 15:38:36
21	962	337.44269569552125	273.6143495172835	21/02/24 15:38:37
21	962	337.35873535766126	273.5905107979971	21/02/24 15:38:37
21	962	337.17771743426226	273.3806011777605	21/02/24 15:38:37
21	962	337.1656226947961	273.3472327139813	21/02/24 15:38:37
21	962	337.25190852590924	273.39136058738967	21/02/24 15:38:37
21	962	337.2478767615957	273.2641612309623	21/02/24 15:38:37
21	962	337.24511216219923	273.25629349755513	21/02/24 15:38:37
21	962	337.27391897338623	273.319625188416	21/02/24 15:38:37
21	962	337.2877868274012	273.3271575157024	21/02/24 15:38:37
21	962	337.27363698055893	273.41003134887836	21/02/24 15:38:38
21	962	337.1226175652441	273.45577007855553	21/02/24 15:38:38
21	962	337.12327933103313	273.4573587963746	21/02/24 15:38:38
21	962	337.2588998736968	273.5073166987264	21/02/24 15:38:38
21	962	337.2470866422507	273.5220200212068	21/02/24 15:38:38
21	962	337.3612009016081	273.4634771243254	21/02/24 15:38:38
21	962	337.3022879930964	273.3726298211173	21/02/24 15:38:38
21	962	337.3008162711398	273.37157441723303	21/02/24 15:38:38
21	962	337.3568766149814	273.3270759382481	21/02/24 15:38:38
21	962	337.38345432006054	273.3665545384742	21/02/24 15:38:38
21	962	337.55674985558744	273.2621063351777	21/02/24 15:38:39
21	962	337.7574509493276	273.336768895118	21/02/24 15:38:39
21	962	337.8154934425858	273.47958787302264	21/02/24 15:38:39
21	962	337.8154934425858	273.47958787302264	21/02/24 15:38:39
21	962	337.8376898166355	273.7273136571504	21/02/24 15:38:39
21	962	337.7575833270047	273.53749856070993	21/02/24 15:38:39
21	962	337.7078958091992	273.37790981323656	21/02/24 15:38:39
21	962	337.82694322521417	273.2896019549885	21/02/24 15:38:39
21	962	337.82694322521417	273.2896019549885	21/02/24 15:38:39
21	962	337.78228097579824	273.23296259710304	21/02/24 15:38:40
21	962	337.7977809524856	273.2761821751126	21/02/24 15:38:40
21	962	337.7471604424811	273.3444276948716	21/02/24 15:38:40
21	962	337.73129528083757	273.34732853261386	21/02/24 15:38:40
21	962	337.72217644399734	273.04766908267374	21/02/24 15:38:40
21	962	337.6315693504184	272.8253821760887	21/02/24 15:38:40
21	962	337.5886314370486	272.84221768570177	21/02/24 15:38:40
21	962	337.47457287726434	272.77293812079495	21/02/24 15:38:40
21	962	337.18845895245295	272.80763913235666	21/02/24 15:38:40
21	962	337.2869953533507	272.6074498031558	21/02/24 15:38:40
21	962	337.3144025149135	272.89648100476836	21/02/24 15:38:41
21	962	337.3211264422941	272.8889794543431	21/02/24 15:38:41
21	962	337.27295720321064	273.01067963980466	21/02/24 15:38:41
21	962	337.19484435133677	273.2071890870505	21/02/24 15:38:41
21	962	337.2146681731423	273.2533082472108	21/02/24 15:38:41
21	962	337.28407382284223	273.23545680089825	21/02/24 15:38:41
21	962	337.2950239189603	273.39443462593704	21/02/24 15:38:41
21	962	337.2983523259281	273.39521833253076	21/02/24 15:38:41
21	962	337.41948420964223	273.4934595447221	21/02/24 15:38:41
21	962	337.5254664635484	273.46416622230754	21/02/24 15:38:41
21	962	337.589869407194	273.4606461050187	21/02/24 15:38:42
21	962	337.73632408492216	273.3894208807906	21/02/24 15:38:42
21	962	337.45359279843973	273.43322902577205	21/02/24 15:38:42
21	962	337.4245435115829	273.5585235945508	21/02/24 15:38:42
21	962	337.3816674492262	273.42806396418206	21/02/24 15:38:42
21	962	337.5599180840396	273.2378761414716	21/02/24 15:38:42
21	962	337.4760287848628	273.1692255937936	21/02/24 15:38:42
21	962	337.5325678788897	273.18132145484395	21/02/24 15:38:42
21	962	337.44973035677447	273.0179265842304	21/02/24 15:38:42
21	962	337.60689978960016	272.9491029596761	21/02/24 15:38:43
21	962	337.6399353828936	272.9263564360184	21/02/24 15:38:43
21	962	337.5798105367547	272.68198635739145	21/02/24 15:38:43
21	962	337.75903837683063	272.7679675743387	21/02/24 15:38:43
21	962	337.8705214619733	272.8454736705483	21/02/24 15:38:43
21	962	337.79868135722074	272.88316177756735	21/02/24 15:38:43
21	962	337.75647812267727	272.9580392198369	21/02/24 15:38:43
21	962	337.71254100716624	273.150253116568	21/02/24 15:38:43
21	962	337.7103528488919	273.14267990837027	21/02/24 15:38:43
21	962	337.4359739949183	273.1503147024347	21/02/24 15:38:43
21	962	337.6031225642862	272.98913737674576	21/02/24 15:38:44
21	962	337.72852283908685	273.2336766609745	21/02/24 15:38:44
21	962	337.98198860231065	273.3141520525075	21/02/24 15:38:44
21	962	337.8974007441115	273.26602706081235	21/02/24 15:38:44
21	962	337.72567964954993	273.2322910348109	21/02/24 15:38:44
21	962	337.5248977187342	273.0976100797364	21/02/24 15:38:44
21	962	337.6808898711695	273.1666319819542	21/02/24 15:38:44
21	962	337.6528659534322	273.17342708136687	21/02/24 15:38:44
21	962	337.62809245832506	273.0518993559967	21/02/24 15:38:44
21	962	337.7978991555743	272.9786529897613	21/02/24 15:38:44
21	962	337.74489220246323	272.9139800212698	21/02/24 15:38:45
21	962	337.7022615944475	272.98114331720234	21/02/24 15:38:45
21	962	337.66758857898225	272.9622259350513	21/02/24 15:38:45
21	962	337.7873359056832	272.82105786258654	21/02/24 15:38:45
21	962	337.88103404215593	273.0673983717872	21/02/24 15:38:45
21	962	338.05705666007975	273.05647553388667	21/02/24 15:38:45
21	962	338.0828905117438	272.90028571907607	21/02/24 15:38:45
21	962	337.8556691102627	272.89522089227415	21/02/24 15:38:45
21	962	337.84931462796305	273.17789259872615	21/02/24 15:38:45
21	962	337.8646974269322	273.19439080646583	21/02/24 15:38:46
21	962	337.85034113383574	273.2214519627249	21/02/24 15:38:46
21	962	337.96291214038496	273.29611789944744	21/02/24 15:38:46
21	962	337.98841265793527	273.54572717176984	21/02/24 15:38:46
21	962	338.0854752452814	273.4081599325674	21/02/24 15:38:46
21	962	338.05109852020354	273.4227238889599	21/02/24 15:38:46
21	962	338.01930142873596	273.3918746782725	21/02/24 15:38:46
21	962	338.0153975813904	273.39903971553906	21/02/24 15:38:46
21	962	337.83913822805994	273.5501394146834	21/02/24 15:38:46
21	962	337.9044241529239	273.73354274640354	21/02/24 15:38:46
21	962	337.9387575537318	273.73001366936825	21/02/24 15:38:47
21	962	337.9595561954303	273.7331773194872	21/02/24 15:38:47
21	962	338.052934840473	273.84146987287613	21/02/24 15:38:47
21	962	338.127626469867	273.83890048733844	21/02/24 15:38:47
21	962	338.1357368315055	273.80944685291	21/02/24 15:38:47
21	962	338.3165211589359	273.7235356141951	21/02/24 15:38:47
21	962	338.3783328579972	273.7485751775441	21/02/24 15:38:47
21	962	338.38107364315806	273.89437522499253	21/02/24 15:38:47
21	962	338.34700648667075	273.76924760328245	21/02/24 15:38:47
21	962	338.2893718278609	273.4851970704529	21/02/24 15:38:47
21	962	338.0738344863773	273.3938472821265	21/02/24 15:38:48
21	962	337.8596319622863	273.34475799724277	21/02/24 15:38:48
21	962	337.94670896669777	273.11572963573917	21/02/24 15:38:48
21	962	338.1757172115351	273.0808670105369	21/02/24 15:38:48
21	962	338.2775604656694	273.0480959835142	21/02/24 15:38:48
21	962	338.32919360815686	273.1711406261177	21/02/24 15:38:48
21	962	338.3957632353062	273.30528983193966	21/02/24 15:38:48
21	962	338.43349187657293	273.2071678669448	21/02/24 15:38:48
21	962	338.42622387998614	273.12121858739755	21/02/24 15:38:48
21	962	338.3730359905679	273.1532128744071	21/02/24 15:38:49
21	962	338.3475663194058	273.1456119831778	21/02/24 15:38:49
21	962	338.17668651746686	273.1535503704774	21/02/24 15:38:49
21	962	338.3221935277952	273.0717459183254	21/02/24 15:38:49
21	962	338.33442501764307	272.8893688661182	21/02/24 15:38:49
21	962	338.39502111495636	272.92195278829143	21/02/24 15:38:49
21	962	338.38875247340144	272.89330727152986	21/02/24 15:38:49
21	962	338.12492705527603	272.80926916127856	21/02/24 15:38:49
21	962	338.0598977280188	272.5260710016924	21/02/24 15:38:49
21	962	337.82357435970755	272.6639650822806	21/02/24 15:38:49
21	962	337.81343115104636	272.6474632467071	21/02/24 15:38:50
21	962	337.81343115104636	272.6474632467071	21/02/24 15:38:50
21	962	337.76362073210066	272.68671008733907	21/02/24 15:38:50
21	962	337.7658687314147	272.937612279044	21/02/24 15:38:50
21	962	337.816161349569	272.953601712689	21/02/24 15:38:50
21	962	337.7446558224485	273.1738154772692	21/02/24 15:38:50
21	962	337.6676312866386	272.89648004485184	21/02/24 15:38:50
21	962	337.91924255109546	272.76335408071645	21/02/24 15:38:50
21	962	338.1913749266525	272.7634184635822	21/02/24 15:38:50
21	962	338.1877056472841	272.7890304733917	21/02/24 15:38:50
21	962	338.06250983888077	272.97266102232606	21/02/24 15:38:51
21	962	338.070974362208	273.06272616940083	21/02/24 15:38:51
21	962	338.2389735820069	272.84530188421076	21/02/24 15:38:51
21	962	338.2881300488522	273.0785763261739	21/02/24 15:38:51
21	962	338.33754822769595	272.88449012527417	21/02/24 15:38:51
21	962	338.3211470702313	272.8550869268821	21/02/24 15:38:51
21	962	338.32740135414184	272.8538503504202	21/02/24 15:38:51
21	962	338.0840530925596	272.92004402817264	21/02/24 15:38:51
21	962	338.07849783150107	272.86878131099644	21/02/24 15:38:51
21	962	338.0829217291269	272.79610352392046	21/02/24 15:38:52
21	962	338.1522934142402	272.795530269583	21/02/24 15:38:52
21	962	338.1122116987887	272.9539048158436	21/02/24 15:38:52
21	962	338.06136313171476	273.17214135832035	21/02/24 15:38:52
21	962	338.2295284561861	273.15788598341254	21/02/24 15:38:52
21	962	338.26670673060636	273.37240276474375	21/02/24 15:38:52
21	962	338.4685275579828	273.5902003512645	21/02/24 15:38:52
21	962	338.46053947671845	273.64482877946915	21/02/24 15:38:52
21	962	338.48777176532576	273.6471728818672	21/02/24 15:38:52
21	962	338.5499023973452	273.6842630494174	21/02/24 15:38:52
21	962	338.5925994886341	273.46477458214576	21/02/24 15:38:53
21	962	338.6012101257371	273.4656822794181	21/02/24 15:38:53
21	962	338.70761579433383	273.33246806516615	21/02/24 15:38:53
21	962	338.7638526903778	273.37412534201	21/02/24 15:38:53
21	962	338.6322484391663	273.4396080054216	21/02/24 15:38:53
21	962	338.60667372865436	273.4914335978681	21/02/24 15:38:53
21	962	338.77366697630447	273.36709008524394	21/02/24 15:38:53
21	962	338.77366697630447	273.36709008524394	21/02/24 15:38:53
21	962	339.05492497676	273.4259456491607	21/02/24 15:38:53
21	962	339.07812616709913	273.1622608709483	21/02/24 15:38:53
21	962	339.05890546889236	272.89427595629945	21/02/24 15:38:54
21	962	339.10141307285056	273.04643936313084	21/02/24 15:38:54
21	962	339.10141307285056	273.04643936313084	21/02/24 15:38:54
21	962	339.1014970244816	273.1410109391309	21/02/24 15:38:54
21	962	339.1014970244816	273.1410109391309	21/02/24 15:38:54
21	962	339.2176150476603	272.93991523220416	21/02/24 15:38:54
21	962	339.1134665770519	272.78320635914974	21/02/24 15:38:54
21	962	339.26802080531434	272.80095576605714	21/02/24 15:38:54
21	962	339.1678537533657	272.95098405500465	21/02/24 15:38:54
21	962	339.15114233546024	272.98818282119475	21/02/24 15:38:55
21	962	339.17554552965356	273.0696952131601	21/02/24 15:38:55
21	962	338.9521021532634	273.08187500696425	21/02/24 15:38:55
21	962	338.9521021532634	273.08187500696425	21/02/24 15:38:55
21	962	339.040589644534	273.04066389812266	21/02/24 15:38:55
21	962	339.1566457057998	273.0332526143262	21/02/24 15:38:55
21	962	339.2773457699894	272.93803442984023	21/02/24 15:38:55
21	962	339.21032764154324	272.91955044022245	21/02/24 15:38:55
21	962	339.1931807818931	272.82194291956574	21/02/24 15:38:55
21	962	339.1931807818931	272.82194291956574	21/02/24 15:38:55
21	962	339.2078894242867	272.82689280720103	21/02/24 15:38:56
21	962	339.2282971008086	272.82127542364844	21/02/24 15:38:56
21	962	339.20896026960656	272.7689900643357	21/02/24 15:38:56
21	962	339.03478882501093	272.69668756272745	21/02/24 15:38:56
21	962	339.02255287486014	272.6895790329272	21/02/24 15:38:56
21	962	338.9881914817771	272.7502305991459	21/02/24 15:38:56
21	962	339.1246893673876	272.58283490799727	21/02/24 15:38:56
21	962	339.13231435553485	272.484990171103	21/02/24 15:38:56
21	962	339.0909091722142	272.5717429439814	21/02/24 15:38:56
21	962	339.14602191127466	272.51472159306985	21/02/24 15:38:56
21	962	339.16602548393945	272.4236536720157	21/02/24 15:38:57
21	962	339.32611087513055	272.5283536439658	21/02/24 15:38:57
21	962	339.29363183532683	272.67331940876954	21/02/24 15:38:57
21	962	339.3119004642358	272.64884851437745	21/02/24 15:38:57
21	962	339.27503383588737	272.56708695212535	21/02/24 15:38:57
21	962	339.52277823725746	272.676087197022	21/02/24 15:38:57
21	962	339.55659806474574	272.7086776028556	21/02/24 15:38:57
21	962	339.5485533511864	272.6474448197747	21/02/24 15:38:57
21	962	339.47928337022705	272.3707881936973	21/02/24 15:38:57
21	962	339.41752501723937	272.11376827670256	21/02/24 15:38:58
21	962	339.57730471181907	272.1449978338847	21/02/24 15:38:58
21	962	339.4341499786219	272.0972990686106	21/02/24 15:38:58
21	962	339.583124105009	272.21933050400816	21/02/24 15:38:58
21	962	339.40885018624084	272.0625907597752	21/02/24 15:38:58
21	962	339.48918924135273	272.24056294526747	21/02/24 15:38:58
21	962	339.4895832257733	272.25188931358787	21/02/24 15:38:58
21	962	339.54688921263255	272.1027443829109	21/02/24 15:38:58
21	962	339.4780612589491	272.04714688476554	21/02/24 15:38:58
21	962	339.574609733475	272.097871415883	21/02/24 15:38:58
21	962	339.56082256798743	271.92727675530654	21/02/24 15:38:59
21	962	339.71966777665455	271.8282420919438	21/02/24 15:38:59
21	962	339.8792147914853	271.82182208139284	21/02/24 15:38:59
21	962	340.10393227126553	271.81892529757624	21/02/24 15:38:59
21	962	340.19284684548467	271.8860356256051	21/02/24 15:38:59
21	962	340.1732868448527	271.9145292166848	21/02/24 15:38:59
21	962	340.17401651647725	271.8486183531639	21/02/24 15:38:59
21	962	340.20622088847074	271.7685161685538	21/02/24 15:38:59
21	962	340.21129424004397	271.7686986067016	21/02/24 15:38:59
21	962	340.21334120268347	271.76404209868764	21/02/24 15:38:59
21	962	340.2032306409777	271.6085890467657	21/02/24 15:39:00
21	962	340.21198349539446	271.77070555354067	21/02/24 15:39:00
21	962	340.0668271726635	271.76527508278537	21/02/24 15:39:00
21	962	340.1463752996109	271.72073839914606	21/02/24 15:39:00
21	962	340.0212691564665	271.8740986929279	21/02/24 15:39:00
21	962	339.8607923745567	272.079265588023	21/02/24 15:39:00
21	962	339.79813423657015	272.36638684205735	21/02/24 15:39:00
21	962	339.7629756189246	272.274009205068	21/02/24 15:39:00
21	962	339.8635750865856	272.28743675326007	21/02/24 15:39:00
21	962	340.06023485150536	272.0627199004162	21/02/24 15:39:01
21	962	340.2287929464846	272.2489575271707	21/02/24 15:39:01
21	962	340.2285087559315	272.10677035023724	21/02/24 15:39:01
21	962	340.20168629444373	272.1059335475577	21/02/24 15:39:01
21	962	340.3988639976549	272.18256536336094	21/02/24 15:39:01
21	962	340.1490204082486	272.3037471514612	21/02/24 15:39:01
21	962	340.35566524880727	272.20649816541425	21/02/24 15:39:01
21	962	340.3033113411317	272.2094071335351	21/02/24 15:39:01
21	962	340.4055696901332	272.24859699138585	21/02/24 15:39:01
21	962	340.45182945312155	272.5337317116979	21/02/24 15:39:01
21	962	340.45182945312155	272.5337317116979	21/02/24 15:39:02
21	962	340.45182945312155	272.5337317116979	21/02/24 15:39:02
21	962	340.43474000266366	272.538441103938	21/02/24 15:39:02
21	962	340.43886506072283	272.53740571648103	21/02/24 15:39:02
21	962	340.5492070592729	272.3328972281207	21/02/24 15:39:02
21	962	340.47372720861915	272.42027906037794	21/02/24 15:39:02
21	962	340.4316108657934	272.4073167789883	21/02/24 15:39:02
21	962	340.59283787014675	272.5584555253266	21/02/24 15:39:02
21	962	340.55764116890276	272.3611213492801	21/02/24 15:39:02
21	962	340.5548806013757	272.1187107968201	21/02/24 15:39:02
21	962	340.6800630995367	271.8877104222439	21/02/24 15:39:03
21	962	340.78826644417944	271.6924954949812	21/02/24 15:39:03
21	962	340.8525228453767	271.8503043539932	21/02/24 15:39:03
21	962	341.01886923863395	271.68003634480345	21/02/24 15:39:03
21	962	341.03811276276406	271.67459273627634	21/02/24 15:39:03
21	962	341.01338045001637	271.6001211671843	21/02/24 15:39:03
21	962	341.065547229765	271.66305121815407	21/02/24 15:39:03
21	962	341.0769679497898	271.66458401390275	21/02/24 15:39:03
21	962	341.0956844258079	271.7242633278675	21/02/24 15:39:03
21	962	340.9196655180702	271.80971677666685	21/02/24 15:39:04
21	962	340.8890579825938	271.8586933410049	21/02/24 15:39:04
21	962	340.9784438956601	271.8937454636225	21/02/24 15:39:04
21	962	340.90906556290827	271.9834085690895	21/02/24 15:39:04
21	962	340.8629366647663	271.9687780589176	21/02/24 15:39:04
21	962	340.7928562715109	272.0032421739841	21/02/24 15:39:04
21	962	340.5427720090609	272.1390450168166	21/02/24 15:39:04
21	962	340.57063942431836	272.1305024395224	21/02/24 15:39:04
21	962	340.64639129303407	272.17090740949874	21/02/24 15:39:04
21	962	340.74436658588195	271.93862524643947	21/02/24 15:39:04
21	962	340.8408873696802	271.84674009541936	21/02/24 15:39:05
21	962	340.8583017340922	271.78089581267324	21/02/24 15:39:05
21	962	340.7063471348633	271.8182964425753	21/02/24 15:39:05
21	962	340.76463899557143	271.89335533941374	21/02/24 15:39:05
21	962	340.767032188191	271.89770158768005	21/02/24 15:39:05
21	962	340.6569049109725	271.6895965698936	21/02/24 15:39:05
21	962	340.8299504761176	271.8077564885901	21/02/24 15:39:05
21	962	340.88505949353106	271.61532978489583	21/02/24 15:39:05
21	962	340.92969155253155	271.54483284528135	21/02/24 15:39:05
21	962	340.74303924587224	271.76948680586776	21/02/24 15:39:05
21	962	340.6278784862932	271.79696785971095	21/02/24 15:39:06
21	962	340.646862744288	271.80329791599985	21/02/24 15:39:06
21	962	340.5861681772487	271.50958096298785	21/02/24 15:39:06
21	962	340.6514054880056	271.51512367744675	21/02/24 15:39:06
21	962	340.828651076513	271.5472334065504	21/02/24 15:39:06
21	962	340.9104721854208	271.4736276084005	21/02/24 15:39:06
21	962	341.03726575774715	271.5722339267272	21/02/24 15:39:06
21	962	340.82804381086	271.48837229584876	21/02/24 15:39:06
21	962	340.5656824942723	271.36673568021706	21/02/24 15:39:06
21	962	340.48405255810104	271.2462253492391	21/02/24 15:39:07
21	962	340.57366255634184	271.3304531210347	21/02/24 15:39:07
21	962	340.45433772673704	271.13706919743856	21/02/24 15:39:07
21	962	340.5854149576866	271.3963237954762	21/02/24 15:39:07
21	962	340.41764960032907	271.4050089732761	21/02/24 15:39:07
21	962	340.4719962694326	271.2797393885448	21/02/24 15:39:07
21	962	340.4988253273449	271.5218599892666	21/02/24 15:39:07
21	962	340.490977116365	271.48749405176477	21/02/24 15:39:07
21	962	340.5066213935306	271.2460177548543	21/02/24 15:39:07
21	962	340.5441715856722	271.3078980972335	21/02/24 15:39:07
21	962	340.4822948279293	271.039323797325	21/02/24 15:39:08
21	962	340.46955301906115	271.12848539253366	21/02/24 15:39:08
21	962	340.44799624152154	271.3653963825896	21/02/24 15:39:08
21	962	340.55438123138134	271.4753762222912	21/02/24 15:39:08
21	962	340.5165989480546	271.26225563088224	21/02/24 15:39:08
21	962	340.538050102456	271.27786840756147	21/02/24 15:39:08
21	962	340.7033617087413	271.27742624022443	21/02/24 15:39:08
21	962	340.6377007391493	271.33311401515715	21/02/24 15:39:08
21	962	340.63059869398614	271.5598470058089	21/02/24 15:39:08
21	962	340.58613271361673	271.5809559226004	21/02/24 15:39:09
21	962	340.70030379489276	271.72306804420816	21/02/24 15:39:09
21	962	340.67683752426893	271.73163020338257	21/02/24 15:39:09
21	962	340.47444294763477	271.8130876474009	21/02/24 15:39:09
21	962	340.6206656431831	271.9210920361126	21/02/24 15:39:09
21	962	340.6659767218714	271.7671825787623	21/02/24 15:39:09
21	962	340.5545139111282	271.81839752239165	21/02/24 15:39:09
21	962	340.5580502011418	271.7364768399078	21/02/24 15:39:09
21	962	340.3958327462485	271.67708536063174	21/02/24 15:39:09
21	962	340.15516735683224	271.6379946061854	21/02/24 15:39:09
21	962	340.1345310764687	271.8053686335655	21/02/24 15:39:10
21	962	340.0921043527541	271.8303683829489	21/02/24 15:39:10
21	962	339.906852613481	271.6675280304497	21/02/24 15:39:10
21	962	339.83743209660145	271.89617673622155	21/02/24 15:39:10
21	962	339.7930471470376	271.9080800170907	21/02/24 15:39:10
21	962	339.7619095598187	271.69174099608523	21/02/24 15:39:10
21	962	339.89387791020397	271.7265405160472	21/02/24 15:39:10
21	962	339.9146171192517	271.77286527005276	21/02/24 15:39:10
21	962	339.7724866325155	271.77604640413836	21/02/24 15:39:10
21	962	339.8861298499632	271.53368801611254	21/02/24 15:39:10
21	962	340.06800602216686	271.5764429702517	21/02/24 15:39:11
21	962	340.05696076950494	271.583978551848	21/02/24 15:39:11
21	962	340.25867245909365	271.49916399967265	21/02/24 15:39:11
21	962	340.25495371841794	271.5294702328314	21/02/24 15:39:11
21	962	340.249214745063	271.5918923759159	21/02/24 15:39:11
21	962	340.3513988539683	271.6788886280657	21/02/24 15:39:11
21	962	340.2470696347064	271.90197385261285	21/02/24 15:39:11
21	962	340.1788688502004	271.71329420799185	21/02/24 15:39:11
21	962	339.9579052608656	271.6015574570526	21/02/24 15:39:11
21	962	339.92763143435826	271.69533426173774	21/02/24 15:39:12
21	962	339.6471152796027	271.7674937370082	21/02/24 15:39:12
21	962	339.89115264788984	271.7017213964641	21/02/24 15:39:12
21	962	339.70423745858517	271.53270804225895	21/02/24 15:39:12
21	962	339.8246672182183	271.47771322559254	21/02/24 15:39:12
21	962	339.7709693051132	271.53739968071847	21/02/24 15:39:12
21	962	339.5124908998281	271.5536757940798	21/02/24 15:39:12
21	962	339.8051264442173	271.58362964521643	21/02/24 15:39:12
21	962	339.7745048149373	271.6147475513879	21/02/24 15:39:12
21	962	339.7835110337599	271.4225632013374	21/02/24 15:39:12
21	962	339.81905012447004	271.35223811983303	21/02/24 15:39:13
21	962	339.8549308008743	271.1003579667481	21/02/24 15:39:13
21	962	340.04323327370304	271.0632960008633	21/02/24 15:39:13
21	962	340.19516739288184	271.13112362947453	21/02/24 15:39:13
21	962	340.3075965055635	271.2308351856097	21/02/24 15:39:13
21	962	340.46423004680076	271.2429161349343	21/02/24 15:39:13
21	962	340.5540752546744	271.315006539994	21/02/24 15:39:13
21	962	340.534088010916	271.28929593636286	21/02/24 15:39:13
21	962	340.3729798266831	271.313768258225	21/02/24 15:39:13
21	962	340.1532280458562	271.20992047887586	21/02/24 15:39:13
21	962	340.2290906130812	271.0733363626605	21/02/24 15:39:14
21	962	340.29325177551647	271.0479449536748	21/02/24 15:39:14
21	962	340.53489719246414	271.18695364695304	21/02/24 15:39:14
21	962	340.33167222430257	271.3271466357405	21/02/24 15:39:14
21	962	340.33167222430257	271.3271466357405	21/02/24 15:39:14
21	962	340.2380092184083	271.2637484615543	21/02/24 15:39:14
21	962	340.30628735570104	271.1507582272379	21/02/24 15:39:14
21	962	340.30628735570104	271.1507582272379	21/02/24 15:39:14
21	962	340.5158905061324	271.13663720044144	21/02/24 15:39:14
21	962	340.4798850837499	270.95603826443545	21/02/24 15:39:15
21	962	340.4950148568559	270.95645180625695	21/02/24 15:39:15
21	962	340.47179832719723	270.7721525269216	21/02/24 15:39:15
21	962	340.4077362906751	270.80042114279905	21/02/24 15:39:15
21	962	340.4895070093121	270.6990694703952	21/02/24 15:39:15
21	962	340.4715293262204	270.6319766733061	21/02/24 15:39:15
21	962	340.5517621760389	270.3917869672379	21/02/24 15:39:15
21	962	340.308824241601	270.34448687042806	21/02/24 15:39:15
21	962	340.308824241601	270.34448687042806	21/02/24 15:39:15
21	962	340.44309062045045	270.306673797562	21/02/24 15:39:15
21	962	340.3877159621605	270.5197972778898	21/02/24 15:39:16
21	962	340.2477527923949	270.5441769372279	21/02/24 15:39:16
21	962	340.2200599267666	270.61193033569236	21/02/24 15:39:16
21	962	340.2182400250684	270.6162106160892	21/02/24 15:39:16
21	962	340.2182400250684	270.6162106160892	21/02/24 15:39:16
21	962	340.06936958179693	270.3725747448609	21/02/24 15:39:16
21	962	339.9121772567521	270.27614639117166	21/02/24 15:39:16
21	962	339.7552599259331	270.0675945750681	21/02/24 15:39:16
21	962	339.7374235798447	270.11973262252513	21/02/24 15:39:16
21	962	339.7249692502739	270.1749652898756	21/02/24 15:39:16
21	962	339.7302046651402	270.02793375396647	21/02/24 15:39:17
21	962	339.7302046651402	270.02793375396647	21/02/24 15:39:17
21	962	339.7302046651402	270.02793375396647	21/02/24 15:39:17
21	962	339.6960974928888	269.8684586500942	21/02/24 15:39:17
21	962	339.56990204276116	269.8421731154548	21/02/24 15:39:17
21	962	339.62055003516895	269.85601950050426	21/02/24 15:39:17
21	962	339.44370479081005	270.05100161778313	21/02/24 15:39:17
21	962	339.2303177224418	270.2119120594169	21/02/24 15:39:17
21	962	339.4554672672839	270.31864846753746	21/02/24 15:39:17
21	962	339.5125082260333	270.1847516302816	21/02/24 15:39:18
21	962	339.5238146250088	270.3804720685995	21/02/24 15:39:18
21	962	339.4850865669653	270.2368356757019	21/02/24 15:39:18
21	962	339.4039935735428	270.3262996605421	21/02/24 15:39:18
21	962	339.4842080612167	270.44799722592865	21/02/24 15:39:18
21	962	339.58175571560565	270.4857559003279	21/02/24 15:39:18
21	962	339.6498448230968	270.2490726602893	21/02/24 15:39:18
21	962	339.618154283893	270.2385032310067	21/02/24 15:39:18
21	962	339.618154283893	270.2385032310067	21/02/24 15:39:18
21	962	339.4204995151713	270.44954841740537	21/02/24 15:39:18
21	962	339.3987785535178	270.18437446955625	21/02/24 15:39:19
21	962	339.3511425705002	270.401851359418	21/02/24 15:39:19
21	962	339.22911236794727	270.48139284178797	21/02/24 15:39:19
21	962	339.22911236794727	270.48139284178797	21/02/24 15:39:19
21	962	339.14204908355964	270.39500845094693	21/02/24 15:39:19
21	962	338.9702047173904	270.6885087852844	21/02/24 15:39:19
21	962	339.1060418771291	270.67250070762236	21/02/24 15:39:19
21	962	339.2479361097841	270.6875960807778	21/02/24 15:39:19
21	962	339.3788746898907	270.73666740442263	21/02/24 15:39:19
21	962	339.53351790104625	270.86499573019046	21/02/24 15:39:19
21	962	339.5328185042767	270.86088262574634	21/02/24 15:39:20
21	962	339.5157993718912	270.83658471563916	21/02/24 15:39:20
21	962	339.4867595929273	270.9239477354646	21/02/24 15:39:20
21	962	339.30812544014094	270.9766668635728	21/02/24 15:39:20
21	962	339.2436617442804	271.13816152479365	21/02/24 15:39:20
21	962	339.2436617442804	271.13816152479365	21/02/24 15:39:20
21	962	339.005315724813	271.1972724042565	21/02/24 15:39:20
21	962	339.00284352172736	270.91858597490705	21/02/24 15:39:20
21	962	339.04657466452045	270.94171823730807	21/02/24 15:39:20
21	962	338.84673244130767	270.9880421183197	21/02/24 15:39:21
21	962	339.032601133899	270.9265532776834	21/02/24 15:39:21
21	962	338.9530821799584	271.0724001264969	21/02/24 15:39:21
21	962	338.9530821799584	271.0724001264969	21/02/24 15:39:21
21	962	338.9266462397543	271.12970523982864	21/02/24 15:39:21
21	962	338.8899918907549	271.0935566986848	21/02/24 15:39:21
21	962	338.8046688808997	270.8441018843667	21/02/24 15:39:21
21	962	338.792161337588	270.86670339124043	21/02/24 15:39:21
21	962	338.92651819497195	270.8913177606297	21/02/24 15:39:21
21	962	338.9012133977069	270.81286071055155	21/02/24 15:39:21
21	962	339.0069286800281	270.84704027952057	21/02/24 15:39:22
21	962	339.0822732366144	270.81622036662395	21/02/24 15:39:22
21	962	338.99041566765914	270.7569379198318	21/02/24 15:39:22
21	962	338.9610177037518	270.83113618356083	21/02/24 15:39:22
21	962	339.08283981825747	270.9644883272507	21/02/24 15:39:22
21	962	338.9629824670633	270.8786038989729	21/02/24 15:39:22
21	962	338.7770806019028	270.90748926285823	21/02/24 15:39:22
21	962	338.62063336862883	270.83768801965397	21/02/24 15:39:22
21	962	338.53815883064607	270.8860408493853	21/02/24 15:39:22
21	962	338.4701133506618	270.98092205590603	21/02/24 15:39:22
21	962	338.42828612836684	270.99161751840546	21/02/24 15:39:23
21	962	338.4766507212809	270.7920488606833	21/02/24 15:39:23
21	962	338.4766507212809	270.7920488606833	21/02/24 15:39:23
21	962	338.4766507212809	270.7920488606833	21/02/24 15:39:23
21	962	338.20892658035393	270.844843306428	21/02/24 15:39:23
21	962	338.1910249790344	270.9183816915227	21/02/24 15:39:23
21	962	338.19672572028844	270.87426693077174	21/02/24 15:39:23
21	962	338.23538077941953	270.71151127033585	21/02/24 15:39:23
21	962	338.34835615007387	270.8677314966945	21/02/24 15:39:23
21	962	338.352563888221	270.867232870696	21/02/24 15:39:24
21	962	338.26902657557406	270.98831415191967	21/02/24 15:39:24
21	962	338.32796433549265	271.1036196383598	21/02/24 15:39:24
21	962	338.183307065741	271.1239563544365	21/02/24 15:39:24
21	962	338.153832256086	271.08785949544745	21/02/24 15:39:24
21	962	338.1514080038826	271.0807020540482	21/02/24 15:39:24
21	962	338.1205951327865	271.25927555281214	21/02/24 15:39:24
21	962	338.11569918868935	271.55328029226257	21/02/24 15:39:24
21	962	337.99238306416004	271.4690638467969	21/02/24 15:39:24
21	962	338.10020807299	271.43318602491956	21/02/24 15:39:24
21	962	338.16634001678557	271.3366243791421	21/02/24 15:39:25
21	962	338.0139186817642	271.42283336223534	21/02/24 15:39:25
21	962	338.11874171572157	271.45457083600934	21/02/24 15:39:25
21	962	338.14767332489066	271.75283726634774	21/02/24 15:39:25
21	962	338.16054444682123	271.7487164069917	21/02/24 15:39:25
21	962	338.383311996022	271.5892986372776	21/02/24 15:39:25
21	962	338.4251746200816	271.7503047224391	21/02/24 15:39:25
21	962	338.4981092178688	271.54515766613974	21/02/24 15:39:25
21	962	338.77971527573794	271.4443669008366	21/02/24 15:39:25
21	962	338.6726106344018	271.50659202713206	21/02/24 15:39:25
21	962	338.6726106344018	271.50659202713206	21/02/24 15:39:26
21	962	338.60164987725125	271.3638504948901	21/02/24 15:39:26
21	962	338.600146025104	271.3615469814439	21/02/24 15:39:26
21	962	338.600146025104	271.3615469814439	21/02/24 15:39:26
21	962	338.600146025104	271.3615469814439	21/02/24 15:39:26
