floorId	partitionId	location_x	location_y	timeStamp
3	68	354.5855688653578	258.1299205484325	20/04/28 05:17:35
3	68	354.4735671518928	258.30847265274105	20/04/28 05:17:35
3	68	354.3262055659401	258.5433951414431	20/04/28 05:17:35
3	68	354.2086022542134	258.7308772623216	20/04/28 05:17:35
3	68	354.0549137258787	258.9758861045374	20/04/28 05:17:35
3	68	353.96204956323004	259.1239293008671	20/04/28 05:17:36
3	68	353.8628183258932	259.28212282926484	20/04/28 05:17:36
3	68	353.70878825481685	259.5276761557866	20/04/28 05:17:36
3	68	353.58067309812367	259.7319161634944	20/04/28 05:17:36
3	68	353.4970787942229	259.8651814360329	20/04/28 05:17:36
3	68	353.34981172159854	260.0999532524538	20/04/28 05:17:36
3	68	353.2412734119799	260.2729840301173	20/04/28 05:17:36
3	68	353.1071800559662	260.4867544283489	20/04/28 05:17:36
3	15	353.1916490018366	260.59742346975503	20/04/28 05:17:36
3	15	353.3828100743726	260.60904705570334	20/04/28 05:17:36
3	15	353.56858730667875	260.6203432762063	20/04/28 05:17:37
3	15	353.843045928062	260.6370317857056	20/04/28 05:17:37
3	15	354.1170035178622	260.65368982988264	20/04/28 05:17:37
3	15	354.3248965044705	260.66633080309873	20/04/28 05:17:37
3	15	354.56258190021634	260.6807833095084	20/04/28 05:17:37
3	15	354.79063485696975	260.69465011360415	20/04/28 05:17:37
3	15	355.03756882952456	260.7096649815136	20/04/28 05:17:37
3	15	355.20405188709344	260.71978801599397	20/04/28 05:17:37
3	15	355.41134082465265	260.73239225989096	20/04/28 05:17:37
3	15	355.57649355370546	260.7424344034889	20/04/28 05:17:37
3	15	355.764787281948	260.7538836400135	20/04/28 05:17:38
3	15	356.02749218536263	260.7698574624208	20/04/28 05:17:38
3	15	356.18397352630456	260.77937234058936	20/04/28 05:17:38
3	15	356.4290049805168	260.7942715255034	20/04/28 05:17:38
3	15	356.7165059070782	260.8117530748888	20/04/28 05:17:38
3	15	356.91505716797565	260.82382602266824	20/04/28 05:17:38
3	15	357.163444948964	260.8389292896803	20/04/28 05:17:38
3	15	357.4262570670764	260.854909631298	20/04/28 05:17:38
3	15	357.62510303581894	260.8670004988449	20/04/28 05:17:38
3	15	357.803135340966	260.8778257875556	20/04/28 05:17:39
3	15	358.0591632258834	260.89339361256316	20/04/28 05:17:39
3	15	358.21620565092195	260.9029426075586	20/04/28 05:17:39
3	15	358.39696464999224	260.9139336934201	20/04/28 05:17:39
3	15	358.6709045337533	260.93059066097805	20/04/28 05:17:39
3	15	358.8497222036905	260.94146370394657	20/04/28 05:17:39
3	15	359.1226911110942	260.9580616310995	20/04/28 05:17:39
3	15	359.33378066811974	260.97089697239744	20/04/28 05:17:39
3	15	359.6061168198445	260.987456424719	20/04/28 05:17:39
3	15	359.7686295101963	260.9973380402537	20/04/28 05:17:39
3	15	360.0108825066412	261.01206828050636	20/04/28 05:17:40
3	15	360.1758812404565	261.0221010603941	20/04/28 05:17:40
3	15	360.400831926526	261.03577923032157	20/04/28 05:17:40
3	15	360.5880022345373	261.0471601570619	20/04/28 05:17:40
3	15	360.82958591941053	261.06184969969513	20/04/28 05:17:40
3	15	361.07901497525006	261.07701628162573	20/04/28 05:17:40
3	15	361.2993557383385	261.09041414429566	20/04/28 05:17:40
3	15	361.4872468729413	261.1018389010362	20/04/28 05:17:40
3	15	361.64964779911213	261.1117137207283	20/04/28 05:17:40
3	15	361.8985850059538	261.12685039568555	20/04/28 05:17:40
3	15	362.0859219636713	261.1382414555935	20/04/28 05:17:41
3	15	362.310586135687	261.1519022039786	20/04/28 05:17:41
3	15	362.5924582794877	261.16904149414074	20/04/28 05:17:41
3	15	362.7842407815709	261.1807028662327	20/04/28 05:17:41
3	15	363.01423210111636	261.1946875328525	20/04/28 05:17:41
3	15	363.27916132703086	261.2107966056192	20/04/28 05:17:41
3	15	363.5010484446519	261.22428849467525	20/04/28 05:17:41
3	15	363.70754398644453	261.2368444959894	20/04/28 05:17:41
3	15	363.9888406666373	261.25394879497566	20/04/28 05:17:41
3	15	364.2100746681108	261.2674009711782	20/04/28 05:17:41
3	15	364.4792344616354	261.2837672844257	20/04/28 05:17:42
3	15	364.7061597313076	261.29756551929063	20/04/28 05:17:42
3	15	364.85661646973404	261.30671407033924	20/04/28 05:17:42
3	15	365.1441179058165	261.3241956507062	20/04/28 05:17:42
3	15	365.3762114582005	261.33830814399994	20/04/28 05:17:42
3	15	365.56090943189895	261.3495387399748	20/04/28 05:17:42
3	15	365.79010596899263	261.36347507969407	20/04/28 05:17:42
3	15	365.943265415281	261.3727879694164	20/04/28 05:17:42
3	15	366.21092285356775	261.38906293166343	20/04/28 05:17:42
3	15	366.36300430724674	261.39831027383684	20/04/28 05:17:43
3	15	366.6022677517976	261.412858733809	20/04/28 05:17:43
3	15	366.6022677517976	261.412858733809	20/04/28 05:17:43
3	15	366.8092926102831	261.4254469203269	20/04/28 05:17:43
3	15	367.0317890339392	261.4389758583541	20/04/28 05:17:43
3	15	367.2178485408348	261.45028924261806	20/04/28 05:17:43
3	15	367.5164806289479	261.4684476244322	20/04/28 05:17:43
3	15	367.7425627920934	261.48219459404186	20/04/28 05:17:43
3	15	367.9328126347084	261.49376277247876	20/04/28 05:17:43
3	15	368.1441649013556	261.50661408788596	20/04/28 05:17:43
3	15	368.3384103264594	261.51842521848806	20/04/28 05:17:44
3	15	368.49125404127227	261.527718910097	20/04/28 05:17:44
3	15	368.7677635872566	261.54453212646285	20/04/28 05:17:44
3	15	369.0066579361572	261.5590581435027	20/04/28 05:17:44
3	15	369.2352128726805	261.5729554705753	20/04/28 05:17:44
3	15	369.39330379422313	261.5825682196033	20/04/28 05:17:44
3	15	369.58856536853983	261.5944411373546	20/04/28 05:17:44
3	15	369.76873417975423	261.6053963367295	20/04/28 05:17:44
3	15	370.0581871884167	261.6229965828442	20/04/28 05:17:44
3	15	370.24715394674945	261.6344867430935	20/04/28 05:17:45
3	15	370.41706734204513	261.6448183599221	20/04/28 05:17:45
3	15	370.6123960683916	261.65669536086557	20/04/28 05:17:45
3	15	370.77144169921456	261.66636616117574	20/04/28 05:17:45
3	15	370.9576191490605	261.67768671698354	20/04/28 05:17:45
3	15	371.1508657712788	261.68943711518324	20/04/28 05:17:45
3	15	371.30172376506715	261.6986100646416	20/04/28 05:17:45
3	15	371.52391242086424	261.7121202887847	20/04/28 05:17:45
3	15	371.7526427130739	261.72602827839376	20/04/28 05:17:45
3	15	371.946218156049	261.73779867060307	20/04/28 05:17:45
3	15	372.21287323437406	261.754012684159	20/04/28 05:17:46
3	15	372.38256499909676	261.7643308246978	20/04/28 05:17:46
3	15	372.38256499909676	261.7643308246978	20/04/28 05:17:46
3	15	372.6165921353873	261.77856088993457	20/04/28 05:17:46
3	15	372.8730204305476	261.7941530619643	20/04/28 05:17:46
3	15	373.06955983957783	261.8061036787023	20/04/28 05:17:46
3	15	373.3656927319268	261.8241100964351	20/04/28 05:17:46
3	15	373.66425310660577	261.84226411770004	20/04/28 05:17:46
3	15	373.92089390165916	261.85786921082683	20/04/28 05:17:46
3	15	374.1932069268064	261.8744272569324	20/04/28 05:17:46
3	15	374.47781944520005	261.8917331761011	20/04/28 05:17:47
3	15	374.6722743511331	261.9035570442255	20/04/28 05:17:47
3	15	374.967329277247	261.92149791601315	20/04/28 05:17:47
3	15	375.1773990456629	261.9342712488676	20/04/28 05:17:47
3	15	375.45085508579695	261.9508987962203	20/04/28 05:17:47
3	15	375.7401274777968	261.96848805990396	20/04/28 05:17:47
3	15	376.0114772941429	261.9849875379123	20/04/28 05:17:47
3	15	376.1733946363274	261.99483295318663	20/04/28 05:17:47
3	15	376.4575408512409	262.01211051868216	20/04/28 05:17:47
3	15	376.61558810599286	262.0217206125425	20/04/28 05:17:48
3	15	376.8127634532502	262.0337098976272	20/04/28 05:17:48
3	15	377.04272817570217	262.0476929470056	20/04/28 05:17:48
3	15	377.31666340042847	262.06434963127	20/04/28 05:17:48
3	15	377.60910864729794	262.08213182100695	20/04/28 05:17:48
3	15	377.88826787909073	262.09910615203034	20/04/28 05:17:48
3	15	378.155427127344	262.1153508217362	20/04/28 05:17:48
3	15	378.3243510661747	262.12562227447324	20/04/28 05:17:48
3	54	378.6174075646557	262.15329095478245	20/04/28 05:17:48
3	54	378.85948194574564	262.21357753674914	20/04/28 05:17:48
3	54	379.143624339468	262.2843408022885	20/04/28 05:17:49
3	54	379.30266227970503	262.32394785932917	20/04/28 05:17:49
3	54	379.4510898856928	262.36091250215594	20/04/28 05:17:49
3	54	379.62445271768945	262.4040870526147	20/04/28 05:17:49
3	54	379.8840631818603	262.4687408481018	20/04/28 05:17:49
3	54	380.0824027840036	262.5181356524095	20/04/28 05:17:49
3	54	380.29573834102905	262.57126507274353	20/04/28 05:17:49
3	54	380.51360339689467	262.62552252654336	20/04/28 05:17:49
3	54	380.73280935209755	262.6801139200085	20/04/28 05:17:49
3	54	380.98075415744654	262.7418624816018	20/04/28 05:17:49
3	54	381.2320927581539	262.80445623929194	20/04/28 05:17:50
3	54	381.43646434012993	262.85535325727864	20/04/28 05:17:50
3	54	381.72077588952226	262.9261586496103	20/04/28 05:17:50
3	54	381.98907705560237	262.9929767910749	20/04/28 05:17:50
3	54	382.2179329043089	263.0499714090906	20/04/28 05:17:50
3	15	382.50387791111524	263.1211836002079	20/04/28 05:17:50
3	15	382.6801694279397	263.2102767834271	20/04/28 05:17:50
3	15	382.6516477773637	263.2355907087424	20/04/28 05:17:50
3	15	382.7584071875042	263.3111644787946	20/04/28 05:17:50
3	15	382.6422706158531	263.4360859924893	20/04/28 05:17:51
3	15	382.6566856009549	263.37910683922667	20/04/28 05:17:51
3	15	382.38090412153366	263.35898718103954	20/04/28 05:17:51
3	15	382.47359173807286	263.63858361078337	20/04/28 05:17:51
3	15	382.4095159534612	263.50167280139806	20/04/28 05:17:51
3	15	382.29236736529305	263.6110380705605	20/04/28 05:17:51
3	15	382.29668486479756	263.59029368414747	20/04/28 05:17:51
3	15	382.2211103944178	263.5943287738123	20/04/28 05:17:51
3	15	382.1743348456127	263.5940541731883	20/04/28 05:17:51
3	15	382.2103637468279	263.70591401899736	20/04/28 05:17:51
3	15	382.29300923981594	263.63770389872474	20/04/28 05:17:52
3	15	382.276158049764	263.4841087320008	20/04/28 05:17:52
3	15	382.2821458596797	263.5642986386757	20/04/28 05:17:52
3	15	382.23737997424	263.6176900427616	20/04/28 05:17:52
3	15	382.3723020132944	263.5838336200657	20/04/28 05:17:52
3	15	382.32888419357806	263.6416874873968	20/04/28 05:17:52
3	15	382.3723337452925	263.592129179657	20/04/28 05:17:52
3	15	382.28700876928366	263.5928801712117	20/04/28 05:17:52
3	15	382.3104385899326	263.54874499180005	20/04/28 05:17:52
3	15	382.43101748075657	263.63804871488924	20/04/28 05:17:52
3	15	382.50611766065896	263.6360021547361	20/04/28 05:17:53
3	15	382.68330330648547	263.65571140233675	20/04/28 05:17:53
3	15	382.86864298873115	263.51699032889604	20/04/28 05:17:53
3	15	382.81846064625563	263.5608509486217	20/04/28 05:17:53
3	15	382.96065252072833	263.3563347393555	20/04/28 05:17:53
3	15	382.99668393643464	263.61161192934003	20/04/28 05:17:53
3	15	382.99324735897966	263.7228482516384	20/04/28 05:17:53
3	15	382.99482023382063	263.718199769249	20/04/28 05:17:53
3	15	382.9005552806613	263.9483676649262	20/04/28 05:17:53
3	15	382.9662715808542	263.8803376547523	20/04/28 05:17:54
3	15	382.7892389454405	263.86974962343845	20/04/28 05:17:54
3	15	382.7906703709047	263.97097734330816	20/04/28 05:17:54
3	15	382.77749811645066	263.9935703374187	20/04/28 05:17:54
3	15	382.7616583984083	263.9834548321444	20/04/28 05:17:54
3	15	382.66056571896513	264.01505549210543	20/04/28 05:17:54
3	15	382.672678036398	264.00706974335384	20/04/28 05:17:54
3	15	382.39538946195023	264.1173587848492	20/04/28 05:17:54
3	15	382.3969636268865	264.11016085132223	20/04/28 05:17:54
3	15	382.5929121789835	264.27636274716866	20/04/28 05:17:54
3	15	382.4756763060704	264.1882626148547	20/04/28 05:17:55
3	15	382.4336783888311	264.1817115216488	20/04/28 05:17:55
3	15	382.36896411032535	264.2502093637198	20/04/28 05:17:55
3	15	382.33269828354673	264.2335159399199	20/04/28 05:17:55
3	15	382.1958976785247	264.2778026279346	20/04/28 05:17:55
3	15	382.050071393539	264.1432140374444	20/04/28 05:17:55
3	15	382.29406225420496	264.1729732657994	20/04/28 05:17:55
3	15	382.3418314333386	264.0670554117633	20/04/28 05:17:55
3	15	382.33756640070555	264.07736533014946	20/04/28 05:17:55
3	15	382.16907739026914	263.88752985629014	20/04/28 05:17:56
3	15	382.1945046234959	263.8059293291828	20/04/28 05:17:56
3	15	382.1140579414535	263.6893764148474	20/04/28 05:17:56
3	15	382.19027857115503	263.5734922185774	20/04/28 05:17:56
3	15	382.08551573457163	263.82418403400663	20/04/28 05:17:56
3	15	382.1594709977455	264.09616604750374	20/04/28 05:17:56
3	15	382.07639372477223	264.1672963263183	20/04/28 05:17:56
3	15	382.0163350369448	264.33541155187515	20/04/28 05:17:56
3	15	382.0055222840617	264.33280804605835	20/04/28 05:17:56
3	15	382.0116724779	264.40787630680074	20/04/28 05:17:56
3	15	382.04716917781667	264.5142260997061	20/04/28 05:17:57
3	15	381.9680906299948	264.37800589884944	20/04/28 05:17:57
3	15	381.87441047062987	264.3389962843853	20/04/28 05:17:57
3	15	382.0478785186765	264.32189650187814	20/04/28 05:17:57
3	15	381.9708820259661	264.3006847175308	20/04/28 05:17:57
3	15	382.1363287737701	264.1040819689755	20/04/28 05:17:57
3	15	382.0975136718122	264.03993196821534	20/04/28 05:17:57
3	15	382.2421056398551	264.1978353671226	20/04/28 05:17:57
3	15	381.9763896782604	264.24331898187467	20/04/28 05:17:57
3	15	381.9276893321522	264.4177304269703	20/04/28 05:17:57
3	15	381.85839753108894	264.4459024139087	20/04/28 05:17:58
3	15	382.0640017687354	264.658730658229	20/04/28 05:17:58
3	15	382.14347509446367	264.6191410013305	20/04/28 05:17:58
3	15	382.1848753092832	264.5973435142356	20/04/28 05:17:58
3	15	382.3192575537036	264.73902647268994	20/04/28 05:17:58
3	15	382.2846259278405	264.730043198211	20/04/28 05:17:58
3	15	382.4771318472421	264.8737561760451	20/04/28 05:17:58
3	15	382.52681332602043	265.0894940412689	20/04/28 05:17:58
3	15	382.55663129943366	265.09884284229497	20/04/28 05:17:58
3	15	382.52410436522155	265.1939802367202	20/04/28 05:17:59
3	15	382.5823558781056	264.91760540940595	20/04/28 05:17:59
3	15	382.6648366250699	264.898399518418	20/04/28 05:17:59
3	15	382.47464355720774	265.0529599815277	20/04/28 05:17:59
3	15	382.37161755790055	265.157343501319	20/04/28 05:17:59
3	15	382.3601794560323	265.1445307179513	20/04/28 05:17:59
3	15	382.2174993699066	265.39331769851685	20/04/28 05:17:59
3	15	382.22774466022656	265.24907166665287	20/04/28 05:17:59
3	15	382.3214086480882	265.52722111263034	20/04/28 05:17:59
3	15	382.37447221012803	265.522593271449	20/04/28 05:17:59
3	15	382.2939668438684	265.521650225193	20/04/28 05:18:00
3	15	382.3419377656016	265.4337789071363	20/04/28 05:18:00
3	15	382.34131431527237	265.48686014933236	20/04/28 05:18:00
3	15	382.48176012656955	265.50538915648787	20/04/28 05:18:00
3	15	382.69122651308635	265.4687292005142	20/04/28 05:18:00
3	15	382.70890667965557	265.4435421403496	20/04/28 05:18:00
3	15	382.8274285465782	265.4367540024144	20/04/28 05:18:00
3	15	382.8198296588409	265.41690273887923	20/04/28 05:18:00
3	15	382.85800812632124	265.4322672272468	20/04/28 05:18:00
3	15	382.84112017327874	265.5773409034652	20/04/28 05:18:00
3	15	382.69821986896284	265.4912208462244	20/04/28 05:18:01
3	15	382.82556198149166	265.5557646723004	20/04/28 05:18:01
3	15	382.76846399396175	265.5148822499008	20/04/28 05:18:01
3	15	382.6214398153774	265.6937794559621	20/04/28 05:18:01
3	15	382.8989724907617	265.58556526192206	20/04/28 05:18:01
3	15	383.00067972403264	265.5627448425577	20/04/28 05:18:01
3	15	382.99115756872663	265.63706363129774	20/04/28 05:18:01
3	15	383.0038206480549	265.4824140385733	20/04/28 05:18:01
3	15	382.9444718765878	265.39831171034086	20/04/28 05:18:01
3	15	382.9082092380358	265.55787471677627	20/04/28 05:18:02
3	15	382.8197591637127	265.7460053603609	20/04/28 05:18:02
3	15	382.7703463227427	265.67185559152176	20/04/28 05:18:02
3	15	382.54731390953185	265.7966530533364	20/04/28 05:18:02
3	15	382.7600367595083	265.87392199210547	20/04/28 05:18:02
3	15	382.9529583063981	265.8427844228539	20/04/28 05:18:02
3	15	382.7977851444788	265.85562523570576	20/04/28 05:18:02
3	15	382.63074286100823	265.7466472875773	20/04/28 05:18:02
3	15	382.61522991278866	265.61741541498566	20/04/28 05:18:02
3	15	382.6715035128874	265.51593088584724	20/04/28 05:18:02
3	15	382.657316502188	265.3950581761084	20/04/28 05:18:03
3	15	382.6439169866863	265.359007071524	20/04/28 05:18:03
3	15	382.8036956886632	265.38608801318276	20/04/28 05:18:03
3	15	382.760759929804	265.2182903016618	20/04/28 05:18:03
3	15	382.80989093072395	265.17606029922626	20/04/28 05:18:03
3	15	382.6890583888865	265.14840321604464	20/04/28 05:18:03
3	15	382.8970434151236	264.9447211816386	20/04/28 05:18:03
3	15	382.7791640669687	264.93970728577204	20/04/28 05:18:03
3	15	382.7516688907288	265.16614701504284	20/04/28 05:18:03
3	15	382.7461712340081	265.2050349722865	20/04/28 05:18:04
3	15	382.8255936541132	265.225194450883	20/04/28 05:18:04
3	15	382.70592266149345	265.4207414722431	20/04/28 05:18:04
3	15	382.77794279574067	265.1877746019002	20/04/28 05:18:04
3	15	382.86073763370126	265.1195200350235	20/04/28 05:18:04
3	15	382.88236886364365	265.1902544574873	20/04/28 05:18:04
3	15	382.7427366913968	265.09787766377883	20/04/28 05:18:04
3	15	382.8003246984122	265.3024263400206	20/04/28 05:18:04
3	15	382.78338176453593	265.44837402582226	20/04/28 05:18:04
3	15	382.9113989653011	265.26205619956505	20/04/28 05:18:04
3	15	382.84620046783334	265.1325638376681	20/04/28 05:18:05
3	15	382.90746301938015	265.22647987628636	20/04/28 05:18:05
3	15	382.9822936863061	265.6559607248961	20/04/28 05:18:05
3	15	382.9822936863061	265.6559607248961	20/04/28 05:18:05
3	15	382.9151783201144	265.6918118685335	20/04/28 05:18:05
3	15	382.9305843539546	265.40630214220175	20/04/28 05:18:05
3	15	382.98502464973524	265.4284822145907	20/04/28 05:18:05
3	15	382.98502464973524	265.4284822145907	20/04/28 05:18:05
3	15	382.96231308210645	265.47446591455656	20/04/28 05:18:05
3	15	382.95913638441516	265.6168094751797	20/04/28 05:18:05
3	15	382.9368580426108	265.538732129752	20/04/28 05:18:06
3	15	382.9368580426108	265.538732129752	20/04/28 05:18:06
3	15	382.98623750938054	265.4509311105075	20/04/28 05:18:06
3	15	382.86934690302076	265.48645457825756	20/04/28 05:18:06
3	15	382.92490812831943	265.6262157750264	20/04/28 05:18:06
3	15	382.71761822115184	265.67645551844487	20/04/28 05:18:06
3	15	382.5546640877064	265.95168318060223	20/04/28 05:18:06
3	15	382.5546640877064	265.95168318060223	20/04/28 05:18:06
3	15	382.35469675450076	265.93348715805286	20/04/28 05:18:06
3	15	382.35469675450076	265.93348715805286	20/04/28 05:18:07
3	15	382.35958052013416	266.0727528179201	20/04/28 05:18:07
3	15	382.44749497491165	266.10794759969883	20/04/28 05:18:07
3	15	382.3780039100184	266.19149254159333	20/04/28 05:18:07
3	15	382.40429856551464	266.3827269587808	20/04/28 05:18:07
3	15	382.44063941718036	266.3531436159485	20/04/28 05:18:07
3	15	382.86681409391156	266.0808978301384	20/04/28 05:18:07
3	15	382.8870577394356	265.9020356228718	20/04/28 05:18:07
3	15	382.86531472834304	265.9829565908852	20/04/28 05:18:07
3	15	382.86531472834304	265.9829565908852	20/04/28 05:18:07
3	15	382.86531472834304	265.9829565908852	20/04/28 05:18:08
3	15	382.62182563280857	266.0361795592027	20/04/28 05:18:08
3	15	382.57230267054797	266.1362820468621	20/04/28 05:18:08
3	15	382.5707912119273	266.13688216020955	20/04/28 05:18:08
3	15	382.3311145468296	266.00331765308357	20/04/28 05:18:08
3	15	382.189565757751	266.07939110783445	20/04/28 05:18:08
3	15	382.1411989395903	266.0609194342815	20/04/28 05:18:08
3	15	381.958568128266	266.0452358335228	20/04/28 05:18:08
3	15	381.7965728800019	266.1688968515882	20/04/28 05:18:08
3	15	381.8431036066468	266.1806892988001	20/04/28 05:18:08
3	15	382.05343483778915	266.2984094364546	20/04/28 05:18:09
3	15	382.08443827124484	266.33533700015863	20/04/28 05:18:09
3	15	382.08261193690316	266.3229187132148	20/04/28 05:18:09
3	15	382.1815658418791	266.08673866922766	20/04/28 05:18:09
3	15	382.08207021529364	265.83930385633266	20/04/28 05:18:09
3	15	381.7929874023393	265.8524315181707	20/04/28 05:18:09
3	15	382.02663136637517	265.9215545603089	20/04/28 05:18:09
3	15	381.9883980758554	265.6596007823574	20/04/28 05:18:09
3	15	381.98663391129935	265.6600164106174	20/04/28 05:18:09
3	15	381.95051541928285	265.7266388939443	20/04/28 05:18:10
3	15	381.91429893290376	265.81140901122916	20/04/28 05:18:10
3	15	381.9061170654044	265.8275140444678	20/04/28 05:18:10
3	15	381.7598541209508	265.6254272463379	20/04/28 05:18:10
3	15	381.90769160272674	265.4778458156868	20/04/28 05:18:10
3	15	381.92502839588707	265.3808493014207	20/04/28 05:18:10
3	15	381.9745645877201	265.3565401252548	20/04/28 05:18:10
3	15	381.97572517722307	265.3575536970799	20/04/28 05:18:10
3	15	381.9321674381662	265.15057174710415	20/04/28 05:18:10
3	15	381.9262821941399	264.8620648414464	20/04/28 05:18:10
3	15	381.7915702030187	264.637809301134	20/04/28 05:18:11
3	15	381.7877465286713	264.63668151978067	20/04/28 05:18:11
3	15	381.78478410496786	264.58173538314753	20/04/28 05:18:11
3	15	381.9777639461594	264.5433035680522	20/04/28 05:18:11
3	15	381.98112306009585	264.53935979837274	20/04/28 05:18:11
3	15	381.82059648593173	264.5323231341281	20/04/28 05:18:11
3	15	381.95608583635055	264.35278815176963	20/04/28 05:18:11
3	15	381.940601814736	264.4443260956149	20/04/28 05:18:11
3	15	381.97907955302	264.37993950393906	20/04/28 05:18:11
3	15	381.87797752066405	264.28199218927256	20/04/28 05:18:11
3	15	381.87797752066405	264.28199218927256	20/04/28 05:18:12
3	15	382.05870062500327	264.42670119674034	20/04/28 05:18:12
3	15	382.20724521889724	264.5443696905709	20/04/28 05:18:12
3	15	382.2621340793378	264.60760269446706	20/04/28 05:18:12
3	15	382.2388350611181	264.614084742705	20/04/28 05:18:12
3	15	382.2388350611181	264.614084742705	20/04/28 05:18:12
3	15	381.81080051082125	264.4883902763472	20/04/28 05:18:12
3	15	381.7782721749833	264.55665114196466	20/04/28 05:18:12
3	15	381.7782721749833	264.55665114196466	20/04/28 05:18:12
3	15	381.54511046933465	264.31359695229094	20/04/28 05:18:13
3	15	381.64422170241664	264.47336540486504	20/04/28 05:18:13
3	15	381.8525709369635	264.3442903402132	20/04/28 05:18:13
3	15	382.0732985645282	264.531853402591	20/04/28 05:18:13
3	15	382.0732985645282	264.531853402591	20/04/28 05:18:13
3	15	382.51244990768265	264.3576252157303	20/04/28 05:18:13
3	15	382.65697574573585	264.2489898868803	20/04/28 05:18:13
3	15	382.65697574573585	264.2489898868803	20/04/28 05:18:13
3	15	382.5391613307141	264.32185657845514	20/04/28 05:18:13
3	15	382.6067306647589	264.310892097116	20/04/28 05:18:13
3	15	382.5556430165483	264.28447456189576	20/04/28 05:18:14
3	15	382.2862052643346	264.36580096239226	20/04/28 05:18:14
3	15	382.33908655818857	264.2832805348984	20/04/28 05:18:14
3	15	382.54198055231666	264.38457086398097	20/04/28 05:18:14
3	15	382.5068908503524	264.59811216739394	20/04/28 05:18:14
3	15	382.55523152544663	264.4690123022858	20/04/28 05:18:14
3	15	382.7103662826487	264.5640935460521	20/04/28 05:18:14
3	15	382.7124808486046	264.622130257988	20/04/28 05:18:14
3	15	382.9102060936643	264.54798577900675	20/04/28 05:18:14
3	15	382.89670325309385	264.55928028052745	20/04/28 05:18:14
3	15	382.7743173336101	264.62288182429376	20/04/28 05:18:15
3	15	382.7348131261109	264.61354602359654	20/04/28 05:18:15
3	15	382.7334598736869	264.5846018621619	20/04/28 05:18:15
3	15	382.49338815789184	264.55552041864496	20/04/28 05:18:15
3	15	382.40757621837577	264.6117257868364	20/04/28 05:18:15
3	15	382.34094325738243	264.44253673822664	20/04/28 05:18:15
3	15	382.32862003165934	264.4362608557297	20/04/28 05:18:15
3	15	382.33742713811375	264.54715945754964	20/04/28 05:18:15
3	15	382.11354382913294	264.5405402324148	20/04/28 05:18:15
3	15	382.24918391994305	264.5840452994375	20/04/28 05:18:16
3	15	382.3318525665083	264.52633795656675	20/04/28 05:18:16
3	15	382.3318525665083	264.52633795656675	20/04/28 05:18:16
3	15	382.21156276643126	264.6462996309006	20/04/28 05:18:16
3	15	382.1315530708522	264.6233000710039	20/04/28 05:18:16
3	15	382.1315530708522	264.6233000710039	20/04/28 05:18:16
3	15	382.305836085048	264.7518892316879	20/04/28 05:18:16
3	15	382.4935070994262	264.65229738604904	20/04/28 05:18:16
3	15	382.38473798906205	264.6207045756567	20/04/28 05:18:16
3	15	382.434002552429	264.7218845838827	20/04/28 05:18:16
3	15	382.434002552429	264.7218845838827	20/04/28 05:18:17
3	15	382.34544111298067	264.52330200666586	20/04/28 05:18:17
3	15	382.19436404009963	264.69636742745945	20/04/28 05:18:17
3	15	382.3873849199123	264.91246678653624	20/04/28 05:18:17
3	15	382.3930801806305	264.9241948240953	20/04/28 05:18:17
3	15	382.39416665914666	264.9276383350357	20/04/28 05:18:17
3	15	382.4463305078968	265.07195451650887	20/04/28 05:18:17
3	15	382.3118516147088	265.09810316021907	20/04/28 05:18:17
3	15	382.46787971322306	265.10558166653163	20/04/28 05:18:17
3	15	382.437714025525	265.10461771023654	20/04/28 05:18:17
3	15	382.2957211960284	265.2158362491143	20/04/28 05:18:18
3	15	382.40867981031636	265.20440729361155	20/04/28 05:18:18
3	15	382.36824471375184	264.96112622455615	20/04/28 05:18:18
3	15	382.1660927255022	265.141927142493	20/04/28 05:18:18
3	15	382.1660927255022	265.141927142493	20/04/28 05:18:18
3	15	381.9674069443232	265.02003074641345	20/04/28 05:18:18
3	15	381.9667153934987	265.06776759739495	20/04/28 05:18:18
3	15	381.7372198303555	265.2057787478491	20/04/28 05:18:18
3	15	381.6783854361663	265.4058023666062	20/04/28 05:18:18
3	15	381.68092821918	265.4054000325863	20/04/28 05:18:19
3	15	381.6380655160017	265.41520738356377	20/04/28 05:18:19
3	15	381.6487124507836	265.38114807325763	20/04/28 05:18:19
3	15	381.5588987921127	265.33538567352997	20/04/28 05:18:19
3	15	381.4497865283044	265.27093518366286	20/04/28 05:18:19
3	15	381.38298403322983	265.3087161485552	20/04/28 05:18:19
3	15	381.3777511483676	265.3477818070974	20/04/28 05:18:19
3	15	381.38620047143013	265.3284796086228	20/04/28 05:18:19
3	15	381.35705576135774	265.1749935649782	20/04/28 05:18:19
3	15	381.6079794456845	265.24660570296624	20/04/28 05:18:19
3	15	381.47176665460387	264.98463284033056	20/04/28 05:18:20
3	15	381.6800116688804	264.9780758962319	20/04/28 05:18:20
3	15	381.78070423330826	264.9497536162447	20/04/28 05:18:20
3	15	381.76226425187804	265.038127275058	20/04/28 05:18:20
3	15	381.69434756835534	265.2575388529868	20/04/28 05:18:20
3	15	381.7850120534174	265.18709625449185	20/04/28 05:18:20
3	15	381.7491174399335	265.03880126369506	20/04/28 05:18:20
3	15	381.7609325343934	265.08393604095295	20/04/28 05:18:20
3	15	381.7834696375527	265.0574290821352	20/04/28 05:18:20
3	15	381.9483994379904	264.99689423414725	20/04/28 05:18:21
3	15	381.6638623264578	264.95977892982347	20/04/28 05:18:21
3	15	381.6044229179816	264.9242493922916	20/04/28 05:18:21
3	15	381.6245413503583	264.9366800477104	20/04/28 05:18:21
3	15	381.6418515377434	265.00062952539116	20/04/28 05:18:21
3	15	381.7565026632364	265.20944717706914	20/04/28 05:18:21
3	15	381.81793902895004	265.36592586128893	20/04/28 05:18:21
3	15	381.6378587816222	265.1620971677968	20/04/28 05:18:21
3	15	381.79511991099486	265.4101097984523	20/04/28 05:18:21
3	15	381.82142923745306	265.56273157853326	20/04/28 05:18:21
3	15	381.9572952676485	265.6769556503167	20/04/28 05:18:22
3	15	381.9230044830198	265.7075080524563	20/04/28 05:18:22
3	15	381.78751624929237	265.7197322125688	20/04/28 05:18:22
3	15	381.7488496504823	265.6380982872586	20/04/28 05:18:22
3	15	381.4568264846983	265.61322963583353	20/04/28 05:18:22
3	15	381.5862223180194	265.61596090345967	20/04/28 05:18:22
3	15	381.4325120012441	265.73493607967055	20/04/28 05:18:22
3	15	381.3441958823437	265.7490245353474	20/04/28 05:18:22
3	15	381.3379636942969	265.7663213714463	20/04/28 05:18:22
3	15	381.57492669167266	265.7287124497114	20/04/28 05:18:22
3	15	381.57492669167266	265.7287124497114	20/04/28 05:18:23
3	15	381.57492669167266	265.7287124497114	20/04/28 05:18:23
3	15	381.7338426351654	265.6613527962746	20/04/28 05:18:23
3	15	381.54128970735525	265.6730735897955	20/04/28 05:18:23
3	15	381.40940243445095	265.8696986429618	20/04/28 05:18:23
3	15	381.41730702712033	265.88160227930797	20/04/28 05:18:23
3	15	381.60402084086456	266.0437260047102	20/04/28 05:18:23
3	15	381.4629824143648	265.8470479829816	20/04/28 05:18:23
3	15	381.43015422923685	265.83062739775767	20/04/28 05:18:23
3	15	381.4339577702523	266.0652265374851	20/04/28 05:18:24
3	15	381.142289367426	266.0559429663066	20/04/28 05:18:24
3	15	381.25487888919093	266.0766030457281	20/04/28 05:18:24
3	15	381.4256429151841	265.862215574694	20/04/28 05:18:24
3	15	381.40331480763695	265.86299357521955	20/04/28 05:18:24
3	15	381.37899652197524	265.59385723965937	20/04/28 05:18:24
3	15	381.492845227518	265.71521956423175	20/04/28 05:18:24
3	15	381.5048427033434	265.7489941320054	20/04/28 05:18:24
3	15	381.4394077222306	265.61535555124334	20/04/28 05:18:24
3	15	381.4890518775815	265.8393207000901	20/04/28 05:18:24
3	15	381.6242104824253	266.03553817035277	20/04/28 05:18:25
3	15	381.4875884939311	266.07561374552677	20/04/28 05:18:25
3	15	381.6368325327063	266.20793814369085	20/04/28 05:18:25
3	15	381.6881313374169	266.2368139612393	20/04/28 05:18:25
3	15	381.49649289687244	266.3477939927075	20/04/28 05:18:25
3	15	381.50828466575194	266.2460702360165	20/04/28 05:18:25
3	15	381.61629700390154	266.4570106378689	20/04/28 05:18:25
3	15	381.60953436076903	266.4589821288449	20/04/28 05:18:25
3	15	381.3497033027099	266.4602123025392	20/04/28 05:18:25
3	15	381.28463001752556	266.26677096400783	20/04/28 05:18:25
3	15	381.0863094971341	266.3825924228449	20/04/28 05:18:26
3	15	381.0029224952185	266.4200487048185	20/04/28 05:18:26
3	15	380.81001865193764	266.266914228269	20/04/28 05:18:26
3	15	380.7824850309408	266.26854478429277	20/04/28 05:18:26
3	15	380.7897539239156	266.23559353968596	20/04/28 05:18:26
3	15	380.66997104866886	266.05669298514647	20/04/28 05:18:26
3	15	380.66233607137946	266.0466513005485	20/04/28 05:18:26
3	15	380.6260680189999	266.14711869312714	20/04/28 05:18:26
3	15	380.7912336205573	266.0479917437815	20/04/28 05:18:26
3	15	380.49939810822343	266.09816789833286	20/04/28 05:18:27
3	15	380.6806516784229	266.28842345985163	20/04/28 05:18:27
3	15	380.7521458710598	266.1437476460044	20/04/28 05:18:27
3	15	380.7915202600513	266.194937534635	20/04/28 05:18:27
3	15	380.8872775603544	266.089896986944	20/04/28 05:18:27
3	15	380.7683840188295	266.1799870780556	20/04/28 05:18:27
3	15	380.95586434810275	266.1382535039999	20/04/28 05:18:27
3	15	380.92687860614194	266.09866812330574	20/04/28 05:18:27
3	15	381.17321822678974	266.2010097211066	20/04/28 05:18:27
3	15	381.0844643005641	266.14865593912293	20/04/28 05:18:27
3	15	381.00483159416297	266.14505753899925	20/04/28 05:18:28
3	15	380.94168068487073	266.3038199596358	20/04/28 05:18:28
3	15	381.14483649821216	266.4550085217716	20/04/28 05:18:28
3	15	381.2559939192288	266.2764530004441	20/04/28 05:18:28
3	15	381.33434845645763	266.1819555183401	20/04/28 05:18:28
3	15	381.2580377928754	266.2336557933243	20/04/28 05:18:28
3	15	381.2544782715867	266.2062555923759	20/04/28 05:18:28
3	15	381.350044289703	266.3637252426148	20/04/28 05:18:28
3	15	381.41210058301505	266.34663865949153	20/04/28 05:18:28
3	15	381.46938875220786	266.3099575387337	20/04/28 05:18:28
3	15	381.4467013220493	266.09907457555516	20/04/28 05:18:29
3	15	381.4058373574817	266.17743107664654	20/04/28 05:18:29
3	15	381.3688213215624	266.0067238884015	20/04/28 05:18:29
3	15	381.5138562739559	266.1740204600913	20/04/28 05:18:29
3	15	381.66824307169554	266.39253937275737	20/04/28 05:18:29
3	15	381.66124399727266	266.3739139046388	20/04/28 05:18:29
3	15	381.83518324570923	266.1503781800225	20/04/28 05:18:29
3	15	381.90759441169354	266.4016482697103	20/04/28 05:18:29
3	15	381.75008503290434	266.3508338175096	20/04/28 05:18:29
3	15	381.7359117822375	266.4354956281389	20/04/28 05:18:30
3	15	381.76861325063254	266.5259863827327	20/04/28 05:18:30
3	15	381.79667235094615	266.5103527835872	20/04/28 05:18:30
3	15	381.9122346869318	266.61493945049756	20/04/28 05:18:30
3	15	381.90065279088714	266.61521346910865	20/04/28 05:18:30
3	15	381.7360084703351	266.5682274092575	20/04/28 05:18:30
3	15	381.760072163721	266.54482544356625	20/04/28 05:18:30
3	15	381.6235260480724	266.39540844958367	20/04/28 05:18:30
3	15	381.6055220362534	266.3560354346828	20/04/28 05:18:30
3	15	381.6091536815921	266.37693902877913	20/04/28 05:18:30
3	15	381.4294366579524	266.4160763324133	20/04/28 05:18:31
3	15	381.41830364428796	266.42619624799755	20/04/28 05:18:31
3	15	381.5836586172063	266.52080218508223	20/04/28 05:18:31
3	15	381.57733924190165	266.51613766977886	20/04/28 05:18:31
3	15	381.80753784197475	266.6148120969584	20/04/28 05:18:31
3	15	381.7790530635578	266.6068441565614	20/04/28 05:18:31
3	15	381.7215862232818	266.46690358775606	20/04/28 05:18:31
3	15	381.79709074693756	266.62771455707895	20/04/28 05:18:31
3	15	381.56319828184894	266.75822266876344	20/04/28 05:18:31
3	15	381.5162242745333	266.7786680680992	20/04/28 05:18:31
3	15	381.37165077273454	266.7775033685765	20/04/28 05:18:32
3	15	381.36537469820917	267.01914767540836	20/04/28 05:18:32
3	15	381.58834709293654	266.94630746328323	20/04/28 05:18:32
3	15	381.8180819352909	267.0597712799553	20/04/28 05:18:32
3	15	381.9208666812959	267.22336470161673	20/04/28 05:18:32
3	15	382.0461681466712	267.4582643940511	20/04/28 05:18:32
3	15	382.1807138103138	267.39601723881475	20/04/28 05:18:32
3	15	382.2548077885404	267.3446671707876	20/04/28 05:18:32
3	15	382.26578701794983	267.3528960002169	20/04/28 05:18:32
3	15	382.1274925549907	267.17377397898434	20/04/28 05:18:33
3	15	382.11365947680116	267.06163821278443	20/04/28 05:18:33
3	15	382.1026150600622	266.8421298493458	20/04/28 05:18:33
3	15	382.1216229604218	266.966604626144	20/04/28 05:18:33
3	15	382.0364696886222	267.02661176295334	20/04/28 05:18:33
3	15	382.0394376163419	267.01014074224963	20/04/28 05:18:33
3	15	382.1925727348002	267.17030606369025	20/04/28 05:18:33
3	15	382.097666743858	267.1317438294671	20/04/28 05:18:33
3	15	382.08799196219877	267.0938081993788	20/04/28 05:18:33
3	15	382.2793986623611	266.9064795620779	20/04/28 05:18:33
3	15	382.2006011878898	266.63191705542846	20/04/28 05:18:34
3	15	382.25536010673136	266.64298147282705	20/04/28 05:18:34
3	15	382.2858401127031	266.7660456609915	20/04/28 05:18:34
3	15	382.44597248266535	266.7766348416636	20/04/28 05:18:34
3	15	382.420291324629	266.8340212917375	20/04/28 05:18:34
3	15	382.587359609792	266.68490235130827	20/04/28 05:18:34
3	15	382.82250684494267	266.56223778414983	20/04/28 05:18:34
3	15	382.8865829756182	266.43998692833054	20/04/28 05:18:34
3	15	382.88105153959447	266.44359039878543	20/04/28 05:18:34
3	15	382.878289665293	266.4373114060946	20/04/28 05:18:34
3	15	383.0015792249758	266.3871518253648	20/04/28 05:18:35
3	15	382.98037032298646	266.43508679870854	20/04/28 05:18:35
3	15	382.79292961923227	266.41546811185316	20/04/28 05:18:35
3	15	382.91490808350386	266.5384026406949	20/04/28 05:18:35
3	15	382.8724031245024	266.6776405258571	20/04/28 05:18:35
3	15	382.95728092693383	266.4360992413312	20/04/28 05:18:35
3	15	382.93732333683585	266.24550409355976	20/04/28 05:18:35
3	15	382.82869391162376	266.4595431010905	20/04/28 05:18:35
3	15	382.91618664963323	266.4803934646278	20/04/28 05:18:35
3	15	382.8240580623742	266.59176120338793	20/04/28 05:18:36
3	15	382.930015617223	266.8682633107394	20/04/28 05:18:36
3	15	382.7587275328612	267.0000664853395	20/04/28 05:18:36
3	15	382.725978195261	267.18607314860213	20/04/28 05:18:36
3	15	382.81653768102854	267.41853458142634	20/04/28 05:18:36
3	15	382.662298033841	267.2347952640584	20/04/28 05:18:36
3	15	382.6110225065414	267.38118780698886	20/04/28 05:18:36
3	15	382.6966786224956	267.242074165965	20/04/28 05:18:36
3	15	382.7989166150034	267.17457200243433	20/04/28 05:18:36
3	15	382.9513539730881	267.4193837693533	20/04/28 05:18:36
3	15	382.95203008561856	267.41855108955764	20/04/28 05:18:37
3	15	382.9333627260795	267.1968663088856	20/04/28 05:18:37
3	15	382.75950571120154	267.1877220351778	20/04/28 05:18:37
3	15	382.7511650292284	267.14889357262973	20/04/28 05:18:37
3	15	382.5271684334509	267.18455347574553	20/04/28 05:18:37
3	15	382.31990495677485	267.1215378742208	20/04/28 05:18:37
3	15	382.3076456885439	267.09432094654267	20/04/28 05:18:37
3	15	382.10357449923765	267.08942882233123	20/04/28 05:18:37
3	15	382.0461340817221	267.11260286631665	20/04/28 05:18:37
3	15	382.2320602705393	267.2908804509705	20/04/28 05:18:37
3	15	382.248360782101	267.27023025325235	20/04/28 05:18:38
3	15	382.2111115148504	267.22697247009444	20/04/28 05:18:38
3	15	382.3066190284472	267.43746000585423	20/04/28 05:18:38
3	15	382.2966123318342	267.47448585862975	20/04/28 05:18:38
3	15	382.2833210334532	267.424500912364	20/04/28 05:18:38
3	15	382.3414208687356	267.4037436971603	20/04/28 05:18:38
3	15	382.2573951335438	267.39963280672873	20/04/28 05:18:38
3	15	382.1614533646195	267.24028443593767	20/04/28 05:18:38
3	15	382.05437084794795	267.00678018903994	20/04/28 05:18:38
3	15	381.95400331627485	266.8854173132069	20/04/28 05:18:39
3	15	381.98171958471727	266.8495402138765	20/04/28 05:18:39
3	15	382.05253334419353	266.66090628598306	20/04/28 05:18:39
3	15	382.0525916417371	266.66076907547415	20/04/28 05:18:39
3	15	381.8115059878384	266.7025652247284	20/04/28 05:18:39
3	15	381.69285390852593	266.9385021638413	20/04/28 05:18:39
3	15	381.6671821770689	266.93613158648486	20/04/28 05:18:39
3	15	381.6791649758236	266.9367614081466	20/04/28 05:18:39
3	15	381.56841735336974	266.78746763389864	20/04/28 05:18:39
3	15	381.56676762315885	266.7156233121796	20/04/28 05:18:39
3	15	381.56676762315885	266.7156233121796	20/04/28 05:18:40
3	15	381.56676762315885	266.7156233121796	20/04/28 05:18:40
3	15	381.3965286146854	266.61883383689326	20/04/28 05:18:40
3	15	381.39077189293175	266.6293842151866	20/04/28 05:18:40
3	15	381.2949005438708	266.5382592097521	20/04/28 05:18:40
3	15	381.3616384184183	266.7196214284589	20/04/28 05:18:40
3	15	381.49338322570395	266.57635505371803	20/04/28 05:18:40
3	15	381.54863291130687	266.743665318345	20/04/28 05:18:40
3	15	381.55925947468245	266.7094235619228	20/04/28 05:18:40
3	15	381.6504735633835	266.61334815661854	20/04/28 05:18:41
3	15	381.6534057024515	266.51756362931576	20/04/28 05:18:41
3	15	381.84707914706286	266.4702071053753	20/04/28 05:18:41
3	15	381.6610295417699	266.59231288893824	20/04/28 05:18:41
3	15	381.6478741888032	266.65836606705864	20/04/28 05:18:41
3	15	381.5027861935479	266.65786836189085	20/04/28 05:18:41
3	15	381.3533701837669	266.4771519927085	20/04/28 05:18:41
3	15	381.1336411716444	266.46899771925547	20/04/28 05:18:41
3	15	381.308116121243	266.5815668758617	20/04/28 05:18:41
3	15	381.1244768625317	266.7925661517783	20/04/28 05:18:41
3	15	381.09564678838234	266.84097190436665	20/04/28 05:18:42
3	15	381.1884180672688	266.7540923735589	20/04/28 05:18:42
3	15	380.92776893727444	266.7676135668494	20/04/28 05:18:42
3	15	380.8893289972944	266.85690948167	20/04/28 05:18:42
3	15	380.8925618697332	266.7489517002342	20/04/28 05:18:42
3	15	380.76220973988075	266.51463136848224	20/04/28 05:18:42
3	15	380.82876167808155	266.27753653001497	20/04/28 05:18:42
3	15	380.63684328341304	266.25383674311973	20/04/28 05:18:42
3	15	380.6894527695192	265.96520519593633	20/04/28 05:18:42
3	15	380.6770627926413	265.9906479003582	20/04/28 05:18:42
3	15	380.66559462137496	265.97864728219923	20/04/28 05:18:43
3	15	380.6586206588791	266.00683839207403	20/04/28 05:18:43
3	15	380.66990565192856	266.27365185850243	20/04/28 05:18:43
3	15	380.6680146907927	266.27333802987215	20/04/28 05:18:43
3	15	380.6313643014986	266.4637980526075	20/04/28 05:18:43
3	15	380.5737930570652	266.18087897987857	20/04/28 05:18:43
3	15	380.48643754456646	266.28586559846093	20/04/28 05:18:43
3	15	380.34532808358387	266.43496152175214	20/04/28 05:18:43
3	15	380.3187126773299	266.45207188688306	20/04/28 05:18:43
3	15	380.2508445729904	266.31066993177063	20/04/28 05:18:43
3	15	380.181110887354	266.5139843512867	20/04/28 05:18:44
3	15	380.113436380685	266.76028758457807	20/04/28 05:18:44
3	15	379.87422417954195	266.8051838507646	20/04/28 05:18:44
3	15	380.0548954388262	266.6960290906131	20/04/28 05:18:44
3	15	380.08099420019755	266.7205345996615	20/04/28 05:18:44
3	15	380.01899009948846	266.809056922431	20/04/28 05:18:44
3	15	379.98197380249053	266.72064022316783	20/04/28 05:18:44
3	15	379.8352948349139	266.86912735406	20/04/28 05:18:44
3	15	379.71404789139143	266.78844563486916	20/04/28 05:18:44
3	15	379.5808293817084	266.78883145699956	20/04/28 05:18:45
3	15	379.482292359413	266.54249395982265	20/04/28 05:18:45
3	15	379.47469782723465	266.5483020048354	20/04/28 05:18:45
3	15	379.4124786105886	266.56169810137965	20/04/28 05:18:45
3	15	379.5408744357257	266.81089767600554	20/04/28 05:18:45
3	15	379.54552839336975	266.84706420688565	20/04/28 05:18:45
3	15	379.5422416007723	266.9512168953717	20/04/28 05:18:45
3	15	379.5471099056044	266.80925546349954	20/04/28 05:18:45
3	15	379.61901373407454	266.8205608049967	20/04/28 05:18:45
3	15	379.6168856339804	266.8082491661377	20/04/28 05:18:45
3	15	379.5226457680818	266.8653743007568	20/04/28 05:18:46
3	15	379.5783577341682	266.80081067656255	20/04/28 05:18:46
3	15	379.5077959271451	266.72384916181016	20/04/28 05:18:46
3	15	379.4462623734866	266.7155779260173	20/04/28 05:18:46
3	15	379.4553614231501	266.90733474501434	20/04/28 05:18:46
3	15	379.5800066168625	267.124317609915	20/04/28 05:18:46
3	15	379.4247551800567	267.10433811029293	20/04/28 05:18:46
3	15	379.59420287054616	266.86478906915005	20/04/28 05:18:46
3	15	379.4390194231868	267.01158573051123	20/04/28 05:18:46
3	15	379.3076700590994	266.92980553057396	20/04/28 05:18:46
3	15	379.3637489364556	266.99063144995705	20/04/28 05:18:47
3	15	379.3519206327791	267.0064172572968	20/04/28 05:18:47
3	15	379.5024904984186	266.75759845189265	20/04/28 05:18:47
3	15	379.66618952943145	266.86261944453804	20/04/28 05:18:47
3	15	379.6272638829372	266.8831027463739	20/04/28 05:18:47
3	15	379.7964714279215	267.0216631987866	20/04/28 05:18:47
3	15	379.77045264821385	267.24470003399017	20/04/28 05:18:47
3	15	379.7191368562074	267.0170746617085	20/04/28 05:18:47
3	15	379.73487383481995	267.04075830941946	20/04/28 05:18:47
3	15	379.68405878762655	266.7939373208512	20/04/28 05:18:48
3	15	379.4267427223262	266.88184066994046	20/04/28 05:18:48
3	15	379.25628909573237	267.08272565656546	20/04/28 05:18:48
3	15	379.22897671270744	267.1134655454306	20/04/28 05:18:48
3	15	379.1654814590837	266.95506918389657	20/04/28 05:18:48
3	15	379.36988131938057	266.99459937791727	20/04/28 05:18:48
3	15	379.50959092159945	267.01787727864433	20/04/28 05:18:48
3	15	379.5639464777442	267.10027147826196	20/04/28 05:18:48
3	15	379.56533986833887	266.99295849717663	20/04/28 05:18:48
3	15	379.6437946522683	266.99076620913786	20/04/28 05:18:48
3	15	379.6461166737646	267.28492497704485	20/04/28 05:18:49
