floorId	partitionId	location_x	location_y	timeStamp
19	929	307.5917897278964	285.09780219467183	21/02/24 15:40:52
19	929	307.59178972789636	285.0978021946719	21/02/24 15:40:53
19	980	311.1000485048991	283.6794021053163	21/02/24 15:40:54
19	975	315.07586920053365	286.03778962296946	21/02/24 15:40:55
19	897	319.01521359261704	283.59757186890573	21/02/24 15:40:56
19	897	319.01521359261704	283.59757186890573	21/02/24 15:40:57
19	897	319.01521359261704	283.59757186890573	21/02/24 15:40:58
19	897	319.01521359261704	283.59757186890573	21/02/24 15:40:59
19	NULL	322.7688919024709	282.9508947625264	21/02/24 15:41:00
19	NULL	322.7688919024709	282.9508947625264	21/02/24 15:41:01
19	955	325.8767227240101	280.18515979393715	21/02/24 15:41:02
19	955	328.92321811554416	278.4499778858854	21/02/24 15:41:03
19	955	328.92321811554416	278.4499778858854	21/02/24 15:41:04
19	955	328.92321811554416	278.4499778858854	21/02/24 15:41:05
19	955	332.13398995625107	274.9863189954403	21/02/24 15:41:06
19	955	332.13398995625107	274.9863189954403	21/02/24 15:41:07
19	909	333.79691834538926	273.32229963118385	21/02/24 15:41:08
19	NULL	337.73701806888556	270.34580290420837	21/02/24 15:41:09
19	919	341.8507959684553	269.41861351939014	21/02/24 15:41:10
19	909	344.1372733286521	271.97307611325795	21/02/24 15:41:11
19	909	344.1372733286521	271.97307611325795	21/02/24 15:41:12
19	904	347.25758750563756	270.59329170523137	21/02/24 15:41:13
19	904	347.2575875056375	270.5932917052313	21/02/24 15:41:14
19	954	351.0914713947272	276.75392450645927	21/02/24 15:41:15
19	904	345.5840669454654	272.03626967984314	21/02/24 15:41:16
19	904	347.25758750563756	270.59329170523137	21/02/24 15:41:17
19	954	351.0914713947272	276.75392450645927	21/02/24 15:41:18
19	904	353.3309852064064	273.01348317021734	21/02/24 15:41:19
19	904	352.1597258472866	270.85810765218207	21/02/24 15:41:20
19	954	351.0914713947272	276.75392450645927	21/02/24 15:41:21
19	904	347.25758750563756	270.59329170523137	21/02/24 15:41:22
19	904	347.25758750563756	270.59329170523137	21/02/24 15:41:23
19	904	347.25758750563756	270.59329170523137	21/02/24 15:41:24
19	904	347.25758750563756	270.59329170523137	21/02/24 15:41:25
19	904	347.25758750563756	270.59329170523137	21/02/24 15:41:26
19	904	347.25758750563756	270.59329170523137	21/02/24 15:41:27
19	904	347.25758750563756	270.59329170523137	21/02/24 15:41:28
19	904	347.25758750563756	270.59329170523137	21/02/24 15:41:29
19	904	352.1597258472866	270.85810765218207	21/02/24 15:41:30
19	904	347.10115493538325	269.8407367941969	21/02/24 15:41:31
19	904	347.25758750563756	270.59329170523137	21/02/24 15:41:32
19	904	347.25758750563756	270.59329170523137	21/02/24 15:41:33
19	NULL	344.59542586748034	276.6349099049643	21/02/24 15:41:34
19	NULL	337.73701806888556	270.34580290420837	21/02/24 15:41:35
19	NULL	337.73701806888556	270.34580290420837	21/02/24 15:41:36
19	909	333.79691834538926	273.32229963118385	21/02/24 15:41:37
19	909	333.79691834538926	273.32229963118385	21/02/24 15:41:38
19	NULL	337.73701806888556	270.34580290420837	21/02/24 15:41:39
19	NULL	337.73701806888556	270.34580290420837	21/02/24 15:41:40
19	NULL	337.73701806888556	270.34580290420837	21/02/24 15:41:41
19	NULL	337.73701806888556	270.34580290420837	21/02/24 15:41:42
19	NULL	337.73701806888556	270.34580290420837	21/02/24 15:41:43
19	NULL	337.73701806888556	270.34580290420837	21/02/24 15:41:44
19	909	333.79691834538926	273.32229963118385	21/02/24 15:41:45
19	NULL	337.73701806888556	270.34580290420837	21/02/24 15:41:46
19	NULL	337.73701806888556	270.34580290420837	21/02/24 15:41:47
19	NULL	337.73701806888556	270.34580290420837	21/02/24 15:41:48
19	909	336.46390262814583	272.33191667978036	21/02/24 15:41:49
19	NULL	337.73701806888556	270.34580290420837	21/02/24 15:41:50
19	NULL	337.73701806888556	270.34580290420837	21/02/24 15:41:51
19	909	333.79691834538926	273.32229963118385	21/02/24 15:41:52
19	909	333.79691834538926	273.32229963118385	21/02/24 15:41:53
19	909	333.79691834538926	273.32229963118385	21/02/24 15:41:54
19	909	333.7969183453893	273.32229963118385	21/02/24 15:41:55
19	909	333.79691834538926	273.32229963118385	21/02/24 15:41:56
19	909	333.79691834538926	273.32229963118385	21/02/24 15:41:57
19	909	333.4071053969908	273.0002052198683	21/02/24 15:41:58
19	909	333.79691834538926	273.32229963118385	21/02/24 15:41:59
19	NULL	337.73701806888556	270.34580290420837	21/02/24 15:42:00
19	NULL	337.73701806888556	270.34580290420837	21/02/24 15:42:01
19	NULL	337.73701806888556	270.34580290420837	21/02/24 15:42:02
19	909	336.46390262814583	272.33191667978036	21/02/24 15:42:03
19	NULL	337.73701806888556	270.34580290420837	21/02/24 15:42:04
19	NULL	337.73701806888556	270.34580290420837	21/02/24 15:42:05
19	NULL	337.73701806888556	270.34580290420837	21/02/24 15:42:06
19	NULL	337.73701806888556	270.34580290420837	21/02/24 15:42:07
19	NULL	337.73701806888556	270.34580290420837	21/02/24 15:42:08
19	909	333.79691834538926	273.32229963118385	21/02/24 15:42:09
19	955	332.13398995625107	274.9863189954403	21/02/24 15:42:10
19	955	332.13398995625107	274.9863189954403	21/02/24 15:42:11
19	955	328.92321811554416	278.4499778858854	21/02/24 15:42:12
19	955	328.92321811554416	278.4499778858854	21/02/24 15:42:13
19	955	328.92321811554416	278.4499778858854	21/02/24 15:42:14
19	NULL	322.7688919024709	282.9508947625264	21/02/24 15:42:15
19	NULL	322.7688919024709	282.9508947625264	21/02/24 15:42:16
19	NULL	322.7688919024709	282.9508947625264	21/02/24 15:42:17
19	897	319.01521359261704	283.59757186890573	21/02/24 15:42:18
19	897	319.01521359261704	283.59757186890573	21/02/24 15:42:19
19	897	319.01521359261704	283.59757186890573	21/02/24 15:42:20
19	911	314.5882445185791	281.94764300047444	21/02/24 15:42:21
19	911	314.5882445185791	281.94764300047444	21/02/24 15:42:22
19	911	314.5882445185791	281.94764300047444	21/02/24 15:42:23
19	911	314.5882445185791	281.94764300047444	21/02/24 15:42:24
19	911	314.5882445185791	281.94764300047444	21/02/24 15:42:25
19	980	311.1000485048991	283.6794021053163	21/02/24 15:42:26
19	911	314.5882445185791	281.94764300047444	21/02/24 15:42:27
19	911	314.5882445185791	281.94764300047444	21/02/24 15:42:28
19	911	314.5882445185791	281.94764300047444	21/02/24 15:42:29
19	911	314.5882445185791	281.94764300047444	21/02/24 15:42:30
19	980	311.1000485048991	283.6794021053163	21/02/24 15:42:31
19	911	314.5882445185791	281.94764300047444	21/02/24 15:42:32
19	911	314.5882445185791	281.94764300047444	21/02/24 15:42:33
19	980	311.1000485048991	283.6794021053163	21/02/24 15:42:34
19	980	311.1000485048991	283.6794021053163	21/02/24 15:42:35
19	980	311.1000485048991	283.6794021053163	21/02/24 15:42:36
19	980	311.1000485048991	283.6794021053163	21/02/24 15:42:37
19	980	311.1000485048991	283.6794021053163	21/02/24 15:42:38
19	980	311.1000485048991	283.6794021053163	21/02/24 15:42:39
19	980	311.1000485048991	283.6794021053163	21/02/24 15:42:40
19	980	309.8797585242773	283.4992197770171	21/02/24 15:42:41
19	980	309.8797585242773	283.4992197770171	21/02/24 15:42:42
19	980	311.1000485048991	283.6794021053163	21/02/24 15:42:43
19	980	309.8797585242773	283.4992197770171	21/02/24 15:42:44
19	980	311.1000485048991	283.6794021053163	21/02/24 15:42:45
19	980	311.1000485048991	283.6794021053163	21/02/24 15:42:46
19	980	311.1000485048991	283.6794021053163	21/02/24 15:42:47
19	980	311.1000485048991	283.6794021053163	21/02/24 15:42:48
19	980	311.1000485048991	283.6794021053163	21/02/24 15:42:49
19	980	310.0010606121905	283.06209451131787	21/02/24 15:42:50
19	980	311.1000485048991	283.6794021053163	21/02/24 15:42:51
19	980	311.1000485048991	283.6794021053163	21/02/24 15:42:52
19	980	311.1000485048991	283.6794021053163	21/02/24 15:42:53
19	980	311.1000485048991	283.6794021053163	21/02/24 15:42:54
19	980	311.1000485048991	283.6794021053163	21/02/24 15:42:55
19	980	311.1000485048991	283.6794021053163	21/02/24 15:42:56
19	980	311.1000485048991	283.6794021053163	21/02/24 15:42:57
19	980	311.1000485048991	283.6794021053163	21/02/24 15:42:58
19	980	311.1000485048991	283.6794021053163	21/02/24 15:42:59
19	980	311.1000485048991	283.6794021053163	21/02/24 15:43:00
19	911	314.5882445185791	281.94764300047444	21/02/24 15:43:01
19	980	311.1000485048991	283.6794021053163	21/02/24 15:43:02
19	980	311.1000485048991	283.6794021053163	21/02/24 15:43:03
19	980	311.1000485048991	283.6794021053163	21/02/24 15:43:04
19	980	311.1000485048991	283.6794021053163	21/02/24 15:43:05
19	897	319.01521359261704	283.59757186890573	21/02/24 15:43:06
19	897	319.01521359261704	283.59757186890573	21/02/24 15:43:07
19	897	319.01521359261704	283.59757186890573	21/02/24 15:43:08
19	897	319.01521359261704	283.59757186890573	21/02/24 15:43:09
19	NULL	322.7688919024709	282.9508947625264	21/02/24 15:43:10
19	NULL	322.7688919024709	282.9508947625264	21/02/24 15:43:11
19	955	328.92321811554416	278.4499778858854	21/02/24 15:43:12
19	955	328.92321811554416	278.4499778858854	21/02/24 15:43:13
19	955	328.92321811554416	278.4499778858854	21/02/24 15:43:14
19	955	328.92321811554416	278.4499778858854	21/02/24 15:43:15
19	955	328.92321811554416	278.4499778858854	21/02/24 15:43:16
19	915	336.5415648801153	280.3558442180772	21/02/24 15:43:17
19	964	340.04388943277826	286.2192342684243	21/02/24 15:43:18
19	964	340.04388943277826	286.2192342684243	21/02/24 15:43:19
19	964	349.72234002988336	284.71465847817086	21/02/24 15:43:21
19	940	347.9711572177418	278.13370891448585	21/02/24 15:43:22
19	964	349.72234002988336	284.71465847817086	21/02/24 15:43:23
19	954	351.0914713947272	276.75392450645927	21/02/24 15:43:24
19	954	351.0914713947271	276.75392450645927	21/02/24 15:43:25
19	904	345.58406694546534	272.03626967984314	21/02/24 15:43:26
19	904	345.5840669454654	272.03626967984314	21/02/24 15:43:27
19	904	345.58406694546534	272.03626967984314	21/02/24 15:43:28
19	909	344.1372733286521	271.97307611325795	21/02/24 15:43:29
19	964	343.84139071727697	277.30984024212	21/02/24 15:43:30
19	940	347.9711572177418	278.13370891448585	21/02/24 15:43:31
19	904	347.2575875056375	270.5932917052313	21/02/24 15:43:32
19	954	349.64467777791396	276.6907309398741	21/02/24 15:43:33
19	909	344.1372733286521	271.97307611325795	21/02/24 15:43:34
19	954	351.0914713947271	276.75392450645927	21/02/24 15:43:35
19	940	347.9711572177418	278.13370891448585	21/02/24 15:43:36
19	954	351.0914713947271	276.75392450645927	21/02/24 15:43:37
19	964	349.72234002988336	284.71465847817086	21/02/24 15:43:38
19	904	345.5840669454654	272.03626967984314	21/02/24 15:43:39
19	940	347.9711572177418	278.13370891448585	21/02/24 15:43:40
19	904	347.25758750563756	270.59329170523137	21/02/24 15:43:41
19	909	344.1372733286521	271.97307611325795	21/02/24 15:43:42
19	954	351.0914713947271	276.75392450645927	21/02/24 15:43:43
19	954	349.64467777791396	276.6907309398741	21/02/24 15:43:44
19	954	351.0914713947271	276.75392450645927	21/02/24 15:43:45
19	895	344.21493558062156	279.99700365155473	21/02/24 15:43:46
19	964	341.9284582204248	277.4425410576869	21/02/24 15:43:47
19	915	336.54156488011523	280.3558442180772	21/02/24 15:43:48
19	915	336.5415648801153	280.3558442180772	21/02/24 15:43:49
19	955	328.92321811554416	278.4499778858854	21/02/24 15:43:50
19	955	328.92321811554416	278.4499778858854	21/02/24 15:43:51
19	955	328.92321811554416	278.4499778858854	21/02/24 15:43:52
19	955	328.92321811554416	278.4499778858854	21/02/24 15:43:53
19	NULL	326.2665356724085	280.50725420525265	21/02/24 15:43:54
19	NULL	322.7688919024709	282.9508947625264	21/02/24 15:43:55
19	NULL	322.7688919024709	282.9508947625264	21/02/24 15:43:56
19	897	319.01521359261704	283.59757186890573	21/02/24 15:43:57
19	897	319.01521359261704	283.59757186890573	21/02/24 15:43:58
19	897	319.01521359261704	283.59757186890573	21/02/24 15:43:59
19	897	319.01521359261704	283.59757186890573	21/02/24 15:44:00
19	980	311.1000485048991	283.6794021053162	21/02/24 15:44:01
19	929	307.59178972789636	285.0978021946719	21/02/24 15:44:02
19	980	310.36738320623186	287.58936639951213	21/02/24 15:44:03
19	980	310.36738320623186	287.58936639951213	21/02/24 15:44:04
19	980	310.36738320623186	287.58936639951213	21/02/24 15:44:05
19	980	310.36738320623186	287.58936639951213	21/02/24 15:44:06
19	975	315.07586920053365	286.03778962296946	21/02/24 15:44:07
19	975	315.07586920053365	286.03778962296946	21/02/24 15:44:08
19	980	310.36738320623186	287.58936639951213	21/02/24 15:44:09
19	975	315.07586920053365	286.03778962296946	21/02/24 15:44:10
19	980	310.36738320623186	287.58936639951213	21/02/24 15:44:11
19	975	315.07586920053365	286.03778962296946	21/02/24 15:44:12
19	975	315.07586920053365	286.03778962296946	21/02/24 15:44:13
19	980	310.36738320623186	287.58936639951213	21/02/24 15:44:14
19	975	315.07586920053365	286.03778962296946	21/02/24 15:44:15
19	980	310.36738320623186	287.58936639951213	21/02/24 15:44:16
19	980	310.36738320623186	287.58936639951213	21/02/24 15:44:17
19	980	310.36738320623186	287.58936639951213	21/02/24 15:44:18
19	980	310.36738320623186	287.58936639951213	21/02/24 15:44:19
19	980	310.36738320623186	287.58936639951213	21/02/24 15:44:20
19	980	310.36738320623186	287.58936639951213	21/02/24 15:44:21
19	980	310.36738320623186	287.58936639951213	21/02/24 15:44:22
19	980	310.36738320623186	287.58936639951213	21/02/24 15:44:23
19	980	310.36738320623186	287.58936639951213	21/02/24 15:44:24
19	980	310.36738320623186	287.58936639951213	21/02/24 15:44:25
19	980	310.36738320623186	287.58936639951213	21/02/24 15:44:26
19	980	310.36738320623186	287.58936639951213	21/02/24 15:44:27
19	980	310.36738320623186	287.58936639951213	21/02/24 15:44:28
19	980	310.36738320623186	287.58936639951213	21/02/24 15:44:29
19	980	310.36738320623186	287.58936639951213	21/02/24 15:44:30
19	980	310.36738320623186	287.58936639951213	21/02/24 15:44:31
19	980	310.36738320623186	287.58936639951213	21/02/24 15:44:32
19	980	310.36738320623186	287.58936639951213	21/02/24 15:44:33
19	980	311.1000485048991	283.6794021053162	21/02/24 15:44:34
19	975	315.07586920053365	286.03778962296946	21/02/24 15:44:35
19	897	319.01521359261704	283.59757186890573	21/02/24 15:44:36
19	897	319.01521359261704	283.59757186890573	21/02/24 15:44:37
19	897	319.01521359261704	283.59757186890573	21/02/24 15:44:38
19	897	319.01521359261704	283.59757186890573	21/02/24 15:44:39
19	NULL	322.7688919024709	282.9508947625264	21/02/24 15:44:40
19	NULL	322.7688919024709	282.9508947625264	21/02/24 15:44:41
19	955	325.8767227240101	280.18515979393715	21/02/24 15:44:42
19	955	328.92321811554416	278.4499778858854	21/02/24 15:44:43
19	955	328.92321811554416	278.4499778858854	21/02/24 15:44:44
19	955	328.92321811554416	278.4499778858854	21/02/24 15:44:45
19	955	328.92321811554416	278.4499778858854	21/02/24 15:44:46
19	915	336.5415648801153	280.3558442180772	21/02/24 15:44:47
19	964	340.04388943277826	286.2192342684243	21/02/24 15:44:48
19	915	336.54156488011523	280.3558442180772	21/02/24 15:44:49
19	964	349.72234002988336	284.71465847817086	21/02/24 15:44:50
19	964	349.72234002988336	284.71465847817086	21/02/24 15:44:51
19	964	355.482293890607	282.3613173869535	21/02/24 15:44:52
19	964	355.482293890607	282.3613173869535	21/02/24 15:44:53
19	964	355.482293890607	282.3613173869535	21/02/24 15:44:54
19	964	355.482293890607	282.3613173869535	21/02/24 15:44:55
19	964	355.482293890607	282.3613173869535	21/02/24 15:44:56
19	945	357.72180770228624	278.62087605071156	21/02/24 15:44:57
19	NULL	360.5547106147948	283.12207921272073	21/02/24 15:44:58
19	959	362.3530560401282	287.71527633822046	21/02/24 15:44:59
19	958	364.8238741505902	287.1482151372541	21/02/24 15:45:00
19	958	364.8238741505902	287.1482151372541	21/02/24 15:45:01
19	958	365.55243192741585	288.59648801263694	21/02/24 15:45:02
19	958	365.55243192741585	288.59648801263694	21/02/24 15:45:03
19	958	365.55243192741585	288.59648801263694	21/02/24 15:45:04
19	958	365.55243192741585	288.59648801263694	21/02/24 15:45:05
19	958	365.55243192741585	288.59648801263694	21/02/24 15:45:06
19	958	365.55243192741585	288.59648801263694	21/02/24 15:45:07
19	NULL	368.6441963719141	285.32200544753397	21/02/24 15:45:08
19	NULL	368.6441963719141	285.32200544753397	21/02/24 15:45:09
19	910	371.49991506597235	283.64243362381774	21/02/24 15:45:10
19	990	373.5702263177357	281.590961967497	21/02/24 15:45:11
19	990	373.5702263177357	281.5909619674969	21/02/24 15:45:12
19	990	373.5702263177357	281.5909619674969	21/02/24 15:45:13
19	NULL	375.70188389076833	280.5525699379839	21/02/24 15:45:14
19	937	374.63236040462476	279.0631299285737	21/02/24 15:45:15
19	937	374.63236040462476	279.0631299285737	21/02/24 15:45:16
19	NULL	375.70188389076833	280.5525699379839	21/02/24 15:45:17
19	937	374.6323604046247	279.06312992857363	21/02/24 15:45:18
19	937	374.63236040462476	279.0631299285737	21/02/24 15:45:19
19	937	374.63236040462476	279.0631299285737	21/02/24 15:45:20
19	937	374.63236040462476	279.0631299285737	21/02/24 15:45:21
19	937	374.63236040462476	279.0631299285737	21/02/24 15:45:22
19	937	374.6323604046247	279.06312992857363	21/02/24 15:45:23
19	937	374.63236040462476	279.0631299285737	21/02/24 15:45:24
19	NULL	375.70188389076833	280.5525699379839	21/02/24 15:45:25
19	937	374.63236040462476	279.0631299285737	21/02/24 15:45:26
19	937	374.63236040462476	279.0631299285737	21/02/24 15:45:27
19	937	374.63236040462476	279.0631299285737	21/02/24 15:45:28
19	NULL	375.70188389076833	280.5525699379839	21/02/24 15:45:29
19	937	374.63236040462476	279.0631299285737	21/02/24 15:45:30
19	937	374.63236040462476	279.0631299285737	21/02/24 15:45:31
19	937	374.63236040462476	279.0631299285737	21/02/24 15:45:32
19	937	374.63236040462476	279.0631299285737	21/02/24 15:45:33
19	937	374.6323604046247	279.06312992857363	21/02/24 15:45:34
19	937	374.6323604046247	279.06312992857363	21/02/24 15:45:35
19	937	374.63236040462476	279.0631299285737	21/02/24 15:45:36
19	937	374.63236040462476	279.0631299285737	21/02/24 15:45:37
19	937	374.6323604046247	279.06312992857363	21/02/24 15:45:38
19	937	374.63236040462476	279.0631299285737	21/02/24 15:45:39
19	937	374.6323604046247	279.06312992857363	21/02/24 15:45:40
19	937	374.63236040462476	279.0631299285737	21/02/24 15:45:41
19	937	374.6323604046247	279.06312992857363	21/02/24 15:45:42
19	937	374.6323604046247	279.06312992857363	21/02/24 15:45:43
19	937	374.6323604046247	279.06312992857363	21/02/24 15:45:44
