stationId	t_start	t_end	t_max	timeStamp
56	20/04/28 05:08:49	20/04/28 05:08:49	20/04/28 05:08:49
18	20/04/28 05:08:51	20/04/28 05:08:51	20/04/28 05:08:51
45	20/04/28 05:08:53	20/04/28 05:08:53	20/04/28 05:08:53
114	20/04/28 05:08:55	20/04/28 05:08:55	20/04/28 05:08:55
13	20/04/28 05:08:57	20/04/28 05:08:58	20/04/28 05:08:57
53	20/04/28 05:09:00	20/04/28 05:09:00	20/04/28 05:09:00
79	20/04/28 05:09:02	20/04/28 05:09:02	20/04/28 05:09:02
128	20/04/28 05:09:04	20/04/28 05:09:05	20/04/28 05:09:05
26	20/04/28 05:09:07	20/04/28 05:09:07	20/04/28 05:09:07
14	20/04/28 05:09:09	20/04/28 05:09:09	20/04/28 05:09:09
40	20/04/28 05:09:11	20/04/28 05:09:11	20/04/28 05:09:11
147	20/04/28 05:09:13	20/04/28 05:09:13	20/04/28 05:09:13
76	20/04/28 05:09:15	20/04/28 05:09:15	20/04/28 05:09:15
65	20/04/28 05:09:17	20/04/28 05:09:18	20/04/28 05:09:18
25	20/04/28 05:09:20	20/04/28 05:09:20	20/04/28 05:09:20
23	20/04/28 05:09:22	20/04/28 05:09:22	20/04/28 05:09:22
16	20/04/28 05:09:24	20/04/28 05:09:24	20/04/28 05:09:24
32	20/04/28 05:09:26	20/04/28 05:09:26	20/04/28 05:09:26
104	20/04/28 05:09:28	20/04/28 05:09:28	20/04/28 05:09:28
131	20/04/28 05:09:30	20/04/28 05:09:31	20/04/28 05:09:31
142	20/04/28 05:09:33	20/04/28 05:09:33	20/04/28 05:09:33
131	20/04/28 05:09:35	20/04/28 05:09:38	20/04/28 05:09:36
131	20/04/28 05:09:40	20/04/28 05:09:41	20/04/28 05:09:40
131	20/04/28 05:09:43	20/04/28 05:09:45	20/04/28 05:09:44
131	20/04/28 05:09:47	20/04/28 05:09:48	20/04/28 05:09:48
131	20/04/28 05:09:50	20/04/28 05:09:50	20/04/28 05:09:50
131	20/04/28 05:09:52	20/04/28 05:09:52	20/04/28 05:09:52
131	20/04/28 05:09:54	20/04/28 05:10:00	20/04/28 05:09:54
142	20/04/28 05:10:02	20/04/28 05:10:02	20/04/28 05:10:02
131	20/04/28 05:12:16	20/04/28 05:10:13	20/04/28 05:10:09
104	20/04/28 05:10:15	20/04/28 05:10:16	20/04/28 05:10:15
131	20/04/28 05:10:18	20/04/28 05:10:21	20/04/28 05:10:19
142	20/04/28 05:10:23	20/04/28 05:10:23	20/04/28 05:10:23
131	20/04/28 05:10:25	20/04/28 05:10:25	20/04/28 05:10:25
142	20/04/28 05:10:27	20/04/28 05:10:27	20/04/28 05:10:27
131	20/04/28 05:10:29	20/04/28 05:10:29	20/04/28 05:10:29
142	20/04/28 05:10:31	20/04/28 05:10:31	20/04/28 05:10:31
131	20/04/28 05:10:33	20/04/28 05:10:34	20/04/28 05:10:33
131	20/04/28 05:10:36	20/04/28 05:10:36	20/04/28 05:10:36
131	20/04/28 05:10:38	20/04/28 05:10:39	20/04/28 05:10:39
131	20/04/28 05:10:41	20/04/28 05:10:41	20/04/28 05:10:41
131	20/04/28 05:10:43	20/04/28 05:10:45	20/04/28 05:10:45
32	20/04/28 05:10:47	20/04/28 05:10:47	20/04/28 05:10:47
16	20/04/28 05:10:49	20/04/28 05:10:49	20/04/28 05:10:49
11	20/04/28 05:10:51	20/04/28 05:10:51	20/04/28 05:10:51
17	20/04/28 05:10:53	20/04/28 05:10:53	20/04/28 05:10:53
23	20/04/28 05:10:55	20/04/28 05:10:55	20/04/28 05:10:55
131	20/04/28 05:10:57	20/04/28 05:10:57	20/04/28 05:10:57
117	20/04/28 05:10:59	20/04/28 05:11:00	20/04/28 05:11:00
118	20/04/28 05:11:02	20/04/28 05:11:02	20/04/28 05:11:02
68	20/04/28 05:11:04	20/04/28 05:11:04	20/04/28 05:11:04
32	20/04/28 05:11:06	20/04/28 05:11:06	20/04/28 05:11:06
65	20/04/28 05:11:08	20/04/28 05:11:08	20/04/28 05:11:08
73	20/04/28 05:11:10	20/04/28 05:11:10	20/04/28 05:11:10
72	20/04/28 05:11:12	20/04/28 05:11:12	20/04/28 05:11:12
103	20/04/28 05:11:14	20/04/28 05:11:14	20/04/28 05:11:14
86	20/04/28 05:11:16	20/04/28 05:11:16	20/04/28 05:11:16
13	20/04/28 05:11:18	20/04/28 05:11:18	20/04/28 05:11:18
150	20/04/28 05:11:20	20/04/28 05:11:20	20/04/28 05:11:20
142	20/04/28 05:11:22	20/04/28 05:11:22	20/04/28 05:11:22
32	20/04/28 05:11:24	20/04/28 05:11:24	20/04/28 05:11:24
78	20/04/28 05:11:26	20/04/28 05:11:26	20/04/28 05:11:26
88	20/04/28 05:11:28	20/04/28 05:11:28	20/04/28 05:11:28
30	20/04/28 05:11:30	20/04/28 05:11:30	20/04/28 05:11:30
106	20/04/28 05:11:32	20/04/28 05:11:32	20/04/28 05:11:32
133	20/04/28 05:11:34	20/04/28 05:11:34	20/04/28 05:11:34
14	20/04/28 05:11:36	20/04/28 05:11:36	20/04/28 05:11:36
14	20/04/28 05:11:38	20/04/28 05:11:38	20/04/28 05:11:38
114	20/04/28 05:11:40	20/04/28 05:11:40	20/04/28 05:11:40
114	20/04/28 05:11:42	20/04/28 05:11:42	20/04/28 05:11:42
13	20/04/28 05:11:44	20/04/28 05:11:44	20/04/28 05:11:44
14	20/04/28 05:11:46	20/04/28 05:11:46	20/04/28 05:11:46
111	20/04/28 05:11:48	20/04/28 05:11:48	20/04/28 05:11:48
109	20/04/28 05:11:50	20/04/28 05:11:50	20/04/28 05:11:50
114	20/04/28 05:11:52	20/04/28 05:11:54	20/04/28 05:11:53
56	20/04/28 05:11:56	20/04/28 05:11:56	20/04/28 05:11:56
22	20/04/28 05:11:58	20/04/28 05:11:59	20/04/28 05:11:59
114	20/04/28 05:12:01	20/04/28 05:12:01	20/04/28 05:12:01
57	20/04/28 05:12:03	20/04/28 05:12:03	20/04/28 05:12:03
98	20/04/28 05:12:05	20/04/28 05:12:05	20/04/28 05:12:05
44	20/04/28 05:12:07	20/04/28 05:12:07	20/04/28 05:12:07
126	20/04/28 05:12:09	20/04/28 05:12:09	20/04/28 05:12:09
40	20/04/28 05:12:11	20/04/28 05:12:11	20/04/28 05:12:11
75	20/04/28 05:12:13	20/04/28 05:12:13	20/04/28 05:12:13
5	20/04/28 05:12:15	20/04/28 05:12:15	20/04/28 05:12:15
13	20/04/28 05:12:17	20/04/28 05:12:17	20/04/28 05:12:17
41	20/04/28 05:12:19	20/04/28 05:12:19	20/04/28 05:12:19
76	20/04/28 05:12:21	20/04/28 05:12:21	20/04/28 05:12:21
24	20/04/28 05:12:23	20/04/28 05:12:23	20/04/28 05:12:23
67	20/04/28 05:12:25	20/04/28 05:12:25	20/04/28 05:12:25
97	20/04/28 05:12:27	20/04/28 05:12:27	20/04/28 05:12:27
5	20/04/28 05:12:29	20/04/28 05:12:29	20/04/28 05:12:29
117	20/04/28 05:12:31	20/04/28 05:12:31	20/04/28 05:12:31
118	20/04/28 05:12:33	20/04/28 05:12:34	20/04/28 05:12:34
66	20/04/28 05:12:36	20/04/28 05:12:36	20/04/28 05:12:36
67	20/04/28 05:12:38	20/04/28 05:12:38	20/04/28 05:12:38
65	20/04/28 05:12:40	20/04/28 05:12:41	20/04/28 05:12:40
19	20/04/28 05:12:44	20/04/28 05:12:44	20/04/28 05:12:44
24	20/04/28 05:12:46	20/04/28 05:12:46	20/04/28 05:12:46
10	20/04/28 05:12:48	20/04/28 05:12:48	20/04/28 05:12:48
40	20/04/28 05:12:50	20/04/28 05:12:51	20/04/28 05:12:51
83	20/04/28 05:12:53	20/04/28 05:12:53	20/04/28 05:12:53
63	20/04/28 05:12:55	20/04/28 05:12:55	20/04/28 05:12:55
12	20/04/28 05:12:57	20/04/28 05:12:57	20/04/28 05:12:57
130	20/04/28 05:12:59	20/04/28 05:12:59	20/04/28 05:12:59
151	20/04/28 05:13:01	20/04/28 05:13:02	20/04/28 05:13:02
106	20/04/28 05:13:04	20/04/28 05:13:04	20/04/28 05:13:04
156	20/04/28 05:13:06	20/04/28 05:13:06	20/04/28 05:13:06
134	20/04/28 05:13:08	20/04/28 05:13:08	20/04/28 05:13:08
63	20/04/28 05:13:10	20/04/28 05:13:10	20/04/28 05:13:10
29	20/04/28 05:13:12	20/04/28 05:13:12	20/04/28 05:13:12
33	20/04/28 05:13:14	20/04/28 05:13:14	20/04/28 05:13:14
61	20/04/28 05:13:16	20/04/28 05:13:16	20/04/28 05:13:16
111	20/04/28 05:13:18	20/04/28 05:13:20	20/04/28 05:13:20
107	20/04/28 05:13:22	20/04/28 05:13:22	20/04/28 05:13:22
39	20/04/28 05:13:24	20/04/28 05:13:24	20/04/28 05:13:24
11	20/04/28 05:13:26	20/04/28 05:13:26	20/04/28 05:13:26
150	20/04/28 05:13:28	20/04/28 05:13:28	20/04/28 05:13:28
152	20/04/28 05:13:30	20/04/28 05:13:30	20/04/28 05:13:30
108	20/04/28 05:13:32	20/04/28 05:13:32	20/04/28 05:13:32
128	20/04/28 05:13:34	20/04/28 05:13:34	20/04/28 05:13:34
114	20/04/28 05:13:36	20/04/28 05:13:36	20/04/28 05:13:36
62	20/04/28 05:13:38	20/04/28 05:13:38	20/04/28 05:13:38
14	20/04/28 05:13:40	20/04/28 05:13:40	20/04/28 05:13:40
62	20/04/28 05:13:42	20/04/28 05:13:42	20/04/28 05:13:42
62	20/04/28 05:13:44	20/04/28 05:13:44	20/04/28 05:13:44
12	20/04/28 05:13:46	20/04/28 05:13:46	20/04/28 05:13:46
129	20/04/28 05:13:48	20/04/28 05:13:48	20/04/28 05:13:48
13	20/04/28 05:13:50	20/04/28 05:13:50	20/04/28 05:13:50
86	20/04/28 05:13:52	20/04/28 05:13:52	20/04/28 05:13:52
13	20/04/28 05:13:54	20/04/28 05:13:54	20/04/28 05:13:54
129	20/04/28 05:13:56	20/04/28 05:13:56	20/04/28 05:13:56
98	20/04/28 05:13:58	20/04/28 05:13:58	20/04/28 05:13:58
98	20/04/28 05:14:00	20/04/28 05:14:00	20/04/28 05:14:00
104	20/04/28 05:14:02	20/04/28 05:14:02	20/04/28 05:14:02
13	20/04/28 05:14:04	20/04/28 05:14:05	20/04/28 05:14:04
86	20/04/28 05:14:07	20/04/28 05:14:08	20/04/28 05:14:08
12	20/04/28 05:14:10	20/04/28 05:14:10	20/04/28 05:14:10
86	20/04/28 05:14:12	20/04/28 05:14:12	20/04/28 05:14:12
86	20/04/28 05:14:14	20/04/28 05:14:15	20/04/28 05:14:15
36	20/04/28 05:14:17	20/04/28 05:14:18	20/04/28 05:14:18
156	20/04/28 05:14:20	20/04/28 05:14:20	20/04/28 05:14:20
158	20/04/28 05:14:22	20/04/28 05:14:22	20/04/28 05:14:22
158	20/04/28 05:14:24	20/04/28 05:14:25	20/04/28 05:14:25
129	20/04/28 05:14:27	20/04/28 05:14:27	20/04/28 05:14:27
14	20/04/28 05:14:29	20/04/28 05:14:29	20/04/28 05:14:29
