floorId	partitionId	location_x	location_y	timeStamp
20	956	307.2684117968782	276.6587261833767	21/02/21 12:24:48
20	956	307.3967351295141	276.54282544713374	21/02/21 12:24:49
20	956	307.51925666506236	276.432164853429	21/02/21 12:24:49
20	956	307.66820665047965	276.29763426870505	21/02/21 12:24:49
20	956	307.86660706916405	276.1184403986263	21/02/21 12:24:49
20	956	308.05692960890724	275.94654241229176	21/02/21 12:24:49
20	956	308.27514112124913	275.7494553010268	21/02/21 12:24:49
20	956	308.4263261536494	275.6129060375049	21/02/21 12:24:49
20	956	308.4263261536494	275.6129060375049	21/02/21 12:24:49
20	924	308.89613481715674	275.5493672434684	21/02/21 12:24:49
20	924	308.89613481715674	275.5493672434684	21/02/21 12:24:49
20	924	309.0481202405576	275.54101358476674	21/02/21 12:24:50
20	924	309.30885226359857	275.5266828266957	21/02/21 12:24:50
20	924	309.7193457666072	275.50412064575323	21/02/21 12:24:50
20	924	309.98534034306704	275.4895006390544	21/02/21 12:24:50
20	924	310.26837825972893	275.47394386984246	21/02/21 12:24:50
20	924	310.5542879800867	275.4582292560991	21/02/21 12:24:50
20	924	310.8219467490359	275.4435177794701	21/02/21 12:24:50
20	924	310.9997947271074	275.4337426229034	21/02/21 12:24:50
20	924	311.15298609278113	275.42532268133107	21/02/21 12:24:50
20	924	311.4364478155574	275.40974261822976	21/02/21 12:24:51
20	924	311.6638584879737	275.39724331994194	21/02/21 12:24:51
20	924	311.8825580788681	275.38522281363515	21/02/21 12:24:51
20	924	312.1709546056224	275.36937151617946	21/02/21 12:24:51
20	924	312.44689649539015	275.3542047698097	21/02/21 12:24:51
20	924	312.64244633417746	275.3434566561035	21/02/21 12:24:51
20	924	312.8647360823557	275.33123882200067	21/02/21 12:24:51
20	924	313.06196028852986	275.3203986791158	21/02/21 12:24:51
20	924	313.28211029151	275.3082984530091	21/02/21 12:24:51
20	924	313.435867429602	275.29984741457514	21/02/21 12:24:51
20	924	313.680700301466	275.2863905303244	21/02/21 12:24:52
20	924	313.680700301466	275.2863905303244	21/02/21 12:24:52
20	924	313.84719020485096	275.27723965388486	21/02/21 12:24:52
20	924	314.10585780216326	275.2630223639844	21/02/21 12:24:52
20	924	314.35642344749135	275.2492503861421	21/02/21 12:24:52
20	924	314.58718340594686	275.23656699919735	21/02/21 12:24:52
20	924	314.7806043205823	275.2259358987242	21/02/21 12:24:52
20	924	315.0241410798261	275.2125502534267	21/02/21 12:24:52
20	924	315.27177420198416	275.19893945747367	21/02/21 12:24:52
20	924	315.27177420198416	275.19893945747367	21/02/21 12:24:52
20	924	315.55466362147604	275.18339085019363	21/02/21 12:24:53
20	924	315.83185712379566	275.16815531075247	21/02/21 12:24:53
20	924	316.014379337042	275.15812324161834	21/02/21 12:24:53
20	924	316.2461078320037	275.1453866204671	21/02/21 12:24:53
20	924	316.5155325167882	275.13057808283145	21/02/21 12:24:53
20	924	316.801249106593	275.11487408422926	21/02/21 12:24:53
20	924	317.08580982438144	275.0992336164586	21/02/21 12:24:53
20	924	317.3283708899141	275.08590159875297	21/02/21 12:24:53
20	924	317.59245111353516	275.07138681168567	21/02/21 12:24:53
20	924	317.82107042260947	275.05882108243424	21/02/21 12:24:53
20	924	318.0855664075899	275.0442834436459	21/02/21 12:24:54
20	924	318.2947525850004	275.03278582833457	21/02/21 12:24:54
20	924	318.5340393781122	275.01963377627095	21/02/21 12:24:54
20	924	318.8187582992541	275.0039846130821	21/02/21 12:24:54
20	924	319.00896923846165	274.9935299442598	21/02/21 12:24:54
20	924	319.2357833125536	274.98106343713494	21/02/21 12:24:54
20	924	319.49654806102035	274.9667308803582	21/02/21 12:24:54
20	924	319.70825415042776	274.95509476173316	21/02/21 12:24:54
20	924	319.9742023911611	274.94047730181046	21/02/21 12:24:54
20	924	320.18288032626117	274.9290076213017	21/02/21 12:24:54
20	924	320.37460234192025	274.91846989835057	21/02/21 12:24:55
20	924	320.37460234192025	274.91846989835057	21/02/21 12:24:55
20	924	320.6534236039863	274.9031448914522	21/02/21 12:24:55
20	924	320.81360391346067	274.8943408127048	21/02/21 12:24:55
20	924	321.1101633706798	274.8780408515971	21/02/21 12:24:55
20	924	321.3204795410887	274.866481127857	21/02/21 12:24:55
20	924	321.5251388856589	274.85523232335726	21/02/21 12:24:55
20	924	321.81812131395765	274.8391289684642	21/02/21 12:24:55
20	924	321.9753055306378	274.83048956561845	21/02/21 12:24:55
20	924	322.2075610892784	274.8177239751754	21/02/21 12:24:56
20	924	322.4776873613513	274.80287687581045	21/02/21 12:24:56
20	924	322.6972884209998	274.79080682157905	21/02/21 12:24:56
20	924	322.9455937333465	274.77715907966575	21/02/21 12:24:56
20	924	323.15317148236403	274.76574986929177	21/02/21 12:24:56
20	924	323.4134958977503	274.7514415147852	21/02/21 12:24:56
20	924	323.5872042626111	274.74189388606396	21/02/21 12:24:56
20	924	323.74918021327665	274.73299111249884	21/02/21 12:24:56
20	924	323.98492420506074	274.72003378537977	21/02/21 12:24:56
20	924	324.185699435446	274.70899846559143	21/02/21 12:24:56
20	924	324.4214003533047	274.6960435059683	21/02/21 12:24:57
20	924	324.6916039434308	274.68119215692855	21/02/21 12:24:57
20	924	324.85452991257466	274.6722371669735	21/02/21 12:24:57
20	924	325.1522391811122	274.65587400815184	21/02/21 12:24:57
20	924	325.4270964434501	274.6407668767581	21/02/21 12:24:57
20	924	325.6076844065703	274.63084112088114	21/02/21 12:24:57
20	924	325.8040752557093	274.62004678225884	21/02/21 12:24:57
20	924	326.04614385431256	274.60674183228485	21/02/21 12:24:57
20	924	326.2330961472755	274.5964662702345	21/02/21 12:24:57
20	924	326.4106670649122	274.5867063418934	21/02/21 12:24:57
20	924	326.61781794518885	274.5753205937416	21/02/21 12:24:58
20	924	326.7857161207829	274.56609231365945	21/02/21 12:24:58
20	924	327.0125009130451	274.553627415968	21/02/21 12:24:58
20	924	327.2691106149106	274.53952323531064	21/02/21 12:24:58
20	924	327.449014635576	274.52963507134024	21/02/21 12:24:58
20	924	327.74554390975334	274.5133367691998	21/02/21 12:24:58
20	924	328.0006522290023	274.4993151098638	21/02/21 12:24:58
20	924	328.0006522290023	274.4993151098638	21/02/21 12:24:58
20	924	328.2579409165973	274.48517360973915	21/02/21 12:24:58
20	924	328.49252355407185	274.4722801147779	21/02/21 12:24:59
20	924	328.7358203953506	274.4589076562239	21/02/21 12:24:59
20	924	328.9983861595574	274.4444761092252	21/02/21 12:24:59
20	924	329.153016870278	274.4359770561367	21/02/21 12:24:59
20	924	329.40410330597683	274.42217645380583	21/02/21 12:24:59
20	924	329.62366288153515	274.41010867968737	21/02/21 12:24:59
20	924	329.9081017871067	274.39447490714883	21/02/21 12:24:59
20	924	330.11371245384856	274.38317381460354	21/02/21 12:24:59
20	924	330.39378992982745	274.3677797617266	21/02/21 12:24:59
20	924	330.5590181134466	274.3586982338868	21/02/21 12:24:59
20	924	330.83399550156105	274.3435844999537	21/02/21 12:25:00
20	924	331.031609068068	274.33272295644196	21/02/21 12:25:00
20	924	331.2635812876877	274.31997293931784	21/02/21 12:25:00
20	924	331.4856483120832	274.30776734690517	21/02/21 12:25:00
20	924	331.7247418043111	274.2946259193447	21/02/21 12:25:00
20	924	331.9099923664329	274.28444389046564	21/02/21 12:25:00
20	924	332.17214421852043	274.27003509354716	21/02/21 12:25:00
20	924	332.4160197323729	274.2566308290931	21/02/21 12:25:00
20	924	332.60554216032773	274.2462140032948	21/02/21 12:25:00
20	924	332.7810150710238	274.23656938886705	21/02/21 12:25:00
20	924	332.93399150853173	274.2281612605101	21/02/21 12:25:01
20	924	333.0961817296371	274.2192467098805	21/02/21 12:25:01
20	924	333.39188752324804	274.20299366915685	21/02/21 12:25:01
20	924	333.63569790522837	274.18959298458185	21/02/21 12:25:01
20	924	333.7890571652452	274.1811638149401	21/02/21 12:25:01
20	924	333.9773818268992	274.17081282263194	21/02/21 12:25:01
20	924	334.185040147877	274.15939918373687	21/02/21 12:25:01
20	924	334.3528838479476	274.150173897823	21/02/21 12:25:01
20	924	334.57432723820347	274.1380025825577	21/02/21 12:25:01
20	924	334.7533685579329	274.1281618356949	21/02/21 12:25:01
20	924	334.9497155535796	274.11736990741633	21/02/21 12:25:02
20	924	335.1314427541289	274.1073815350038	21/02/21 12:25:02
20	924	335.30355434016514	274.0979216709183	21/02/21 12:25:02
20	924	335.45780529515866	274.08944349055344	21/02/21 12:25:02
20	924	335.6530197889764	274.07871380859785	21/02/21 12:25:02
20	924	335.9312706516885	274.06342015287396	21/02/21 12:25:02
20	924	336.22817957775777	274.04710098371703	21/02/21 12:25:02
20	924	336.4107789155097	274.03706467554616	21/02/21 12:25:02
20	924	336.59679541701036	274.02684054791837	21/02/21 12:25:02
20	924	336.75767552965686	274.01799800550305	21/02/21 12:25:03
20	924	336.9309112459301	274.00847635522695	21/02/21 12:25:03
20	924	337.13348954311806	273.9973419324829	21/02/21 12:25:03
20	924	337.3094790307288	273.9876689251531	21/02/21 12:25:03
20	924	337.56920447499704	273.97339349222665	21/02/21 12:25:03
20	924	337.758997506783	273.96296179308064	21/02/21 12:25:03
20	924	338.0026151045991	273.94957170460805	21/02/21 12:25:03
20	924	338.20417584207723	273.9384932105599	21/02/21 12:25:03
20	924	338.45889728729406	273.9244928151948	21/02/21 12:25:03
20	924	338.6931022716963	273.9116200773878	21/02/21 12:25:03
20	924	338.86028546708525	273.9024310951572	21/02/21 12:25:04
20	924	339.01156337203537	273.8941163241826	21/02/21 12:25:04
20	924	339.3029117988022	273.8781027798175	21/02/21 12:25:04
20	924	339.5477286237416	273.8646467775627	21/02/21 12:25:04
20	924	339.81907783705554	273.84973246100344	21/02/21 12:25:04
20	924	339.98330913650227	273.8407057254586	21/02/21 12:25:04
20	924	340.2658205249098	273.8251778961096	21/02/21 12:25:04
20	924	340.4474110061722	273.81519703827473	21/02/21 12:25:04
20	924	340.71445259316056	273.80051948415843	21/02/21 12:25:04
20	924	340.91423784676726	273.78953857701015	21/02/21 12:25:04
20	924	341.08181383898614	273.78032800527063	21/02/21 12:25:05
20	924	341.28049058209564	273.7694080257965	21/02/21 12:25:05
20	924	341.5616901579614	273.75395229832424	21/02/21 12:25:05
20	924	341.8390885156688	273.73870549930336	21/02/21 12:25:05
20	924	342.01017297557013	273.72930208971843	21/02/21 12:25:05
20	924	342.26375831225175	273.71536413891374	21/02/21 12:25:05
20	972	342.4575667947752	273.7205648543141	21/02/21 12:25:05
20	972	342.67949960360176	273.79250630240034	21/02/21 12:25:05
20	972	342.9143100305876	273.868622142291	21/02/21 12:25:05
20	972	343.10269143561146	273.9296876113471	21/02/21 12:25:05
20	972	343.38490845549853	274.02117071018506	21/02/21 12:25:06
20	972	343.5799089488672	274.08438181423344	21/02/21 12:25:06
20	972	343.7253779237345	274.13153684624024	21/02/21 12:25:06
20	972	343.99547164792494	274.2190900734535	21/02/21 12:25:06
20	972	344.1963332375522	274.28420110277403	21/02/21 12:25:06
20	972	344.41717954932886	274.3557903534023	21/02/21 12:25:06
20	972	344.57137838538347	274.40577524575616	21/02/21 12:25:06
20	972	344.7468071602413	274.4626420072143	21/02/21 12:25:06
20	972	345.02834015824305	274.5539033744155	21/02/21 12:25:06
20	949	345.2260208610704	274.6039751449997	21/02/21 12:25:06
20	949	345.42077984562025	274.5522319163587	21/02/21 12:25:07
20	949	345.59087572246995	274.50704113932187	21/02/21 12:25:07
20	949	345.8353795743185	274.4420817807637	21/02/21 12:25:07
20	949	346.0894850794119	274.3745714716534	21/02/21 12:25:07
20	949	346.27776235128493	274.32455029317504	21/02/21 12:25:07
20	949	346.5032198060498	274.26465114830285	21/02/21 12:25:07
20	949	346.7603621980046	274.19633400436743	21/02/21 12:25:07
20	949	347.0092405267459	274.1302124423886	21/02/21 12:25:07
20	949	347.27994139309277	274.0582931065332	21/02/21 12:25:07
