floorId	partitionId	location_x	location_y	timeStamp
1	50	326.4374437592285	292.7473405462086	20/04/28 05:17:09
1	50	326.27851144413216	292.8117669316517	20/04/28 05:17:09
1	50	326.27851144413216	292.8117669316517	20/04/28 05:17:09
1	50	326.097076915982	292.8853150381913	20/04/28 05:17:09
1	50	325.9140820201037	292.9594956709269	20/04/28 05:17:09
1	50	325.7239732325618	293.03656006160713	20/04/28 05:17:09
1	50	325.5611535985642	293.1025622493389	20/04/28 05:17:09
1	50	325.3433749374501	293.19084317542826	20/04/28 05:17:10
1	50	325.1860657650732	293.25461158758	20/04/28 05:17:10
1	50	324.91972977345375	293.3625761965586	20/04/28 05:17:10
1	50	324.6531727072099	293.4706304225479	20/04/28 05:17:10
1	50	324.39141103001845	293.576740741892	20/04/28 05:17:10
1	50	324.1999296997339	293.6543615201623	20/04/28 05:17:10
1	16	324.12647376255535	293.6982500000004	20/04/28 05:17:10
1	16	324.4026056242091	293.6982500000004	20/04/28 05:17:10
1	16	324.5838200451869	293.6982500000004	20/04/28 05:17:10
1	16	324.5838200451869	293.6982500000004	20/04/28 05:17:10
1	16	324.5838200451869	293.6982500000004	20/04/28 05:17:11
1	16	324.8050460155818	293.6982500000004	20/04/28 05:17:11
1	16	325.0425446032265	293.6982500000004	20/04/28 05:17:11
1	16	325.2552889593893	293.6982500000004	20/04/28 05:17:11
1	16	325.7006136072627	293.6982500000004	20/04/28 05:17:11
1	16	325.7006136072627	293.6982500000004	20/04/28 05:17:11
1	16	326.19608174841795	293.6982500000004	20/04/28 05:17:11
1	16	326.4266922140078	293.6982500000004	20/04/28 05:17:11
1	16	326.63983847345776	293.6982500000004	20/04/28 05:17:11
1	16	326.8758021013284	293.6982500000004	20/04/28 05:17:12
1	16	327.0845435498932	293.6982500000004	20/04/28 05:17:12
1	16	327.3487712183651	293.6982500000004	20/04/28 05:17:12
1	16	327.56773071336073	293.6982500000004	20/04/28 05:17:12
1	16	327.83979090717696	293.6982500000004	20/04/28 05:17:12
1	16	328.1169958075848	293.6982500000004	20/04/28 05:17:12
1	16	328.1169958075848	293.6982500000004	20/04/28 05:17:12
1	16	328.3842140335077	293.6982500000004	20/04/28 05:17:12
1	16	328.5535876420326	293.6982500000004	20/04/28 05:17:12
1	16	328.82242820773706	293.6982500000004	20/04/28 05:17:12
1	16	329.0978570699588	293.6982500000004	20/04/28 05:17:13
1	16	329.27402968236186	293.6982500000004	20/04/28 05:17:13
1	16	329.4712344904239	293.6982500000004	20/04/28 05:17:13
1	16	329.69441180557095	293.6982500000004	20/04/28 05:17:13
1	16	329.8994693857887	293.6982500000004	20/04/28 05:17:13
1	16	330.10310803499436	293.6982500000004	20/04/28 05:17:13
1	16	330.35417303615105	293.6982500000004	20/04/28 05:17:13
1	16	330.52968080196297	293.6982500000004	20/04/28 05:17:13
1	16	330.7386722408073	293.6982500000004	20/04/28 05:17:13
1	16	330.96236566787184	293.6982500000004	20/04/28 05:17:13
1	16	331.2246536142964	293.6982500000004	20/04/28 05:17:14
1	16	331.390424920929	293.6982500000004	20/04/28 05:17:14
1	16	331.66835152988835	293.6982500000004	20/04/28 05:17:14
1	16	331.8398525441439	293.6982500000004	20/04/28 05:17:14
1	16	332.0907782804754	293.6982500000004	20/04/28 05:17:14
1	16	332.26693608955947	293.6982500000004	20/04/28 05:17:14
1	16	332.5267993173975	293.6982500000004	20/04/28 05:17:14
1	16	332.7487571410109	293.6982500000004	20/04/28 05:17:14
1	16	333.0113423616334	293.6982500000004	20/04/28 05:17:14
1	16	333.269228503896	293.6982500000004	20/04/28 05:17:15
1	16	333.5450189558477	293.6982500000004	20/04/28 05:17:15
1	16	333.8121984802391	293.6982500000004	20/04/28 05:17:15
1	16	333.97781487740065	293.6982500000005	20/04/28 05:17:15
1	93	334.10499045958585	293.6905961632206	20/04/28 05:17:15
1	93	333.9259767652685	293.62057054921945	20/04/28 05:17:15
1	93	333.69768327070454	293.53126792804136	20/04/28 05:17:15
1	93	333.45978585564626	293.4382084969052	20/04/28 05:17:15
1	93	333.2507936271519	293.35645604116377	20/04/28 05:17:15
1	93	332.9763283313063	293.24909218312547	20/04/28 05:17:15
1	93	332.7847972839016	293.1741700982763	20/04/28 05:17:16
1	93	332.606825871811	293.10455219863	20/04/28 05:17:16
1	93	332.4370891845798	293.0381555143584	20/04/28 05:17:16
1	93	332.2067848044051	292.9480662857639	20/04/28 05:17:16
1	93	332.04357834374895	292.8842240603968	20/04/28 05:17:16
1	93	331.766350839626	292.77577969658284	20/04/28 05:17:16
1	93	331.5379214111845	292.6864239015217	20/04/28 05:17:16
1	16	331.44111465763547	292.6485555564067	20/04/28 05:17:16
1	16	331.3950141131367	292.83958242746104	20/04/28 05:17:16
1	16	331.4627372386336	292.9368120965399	20/04/28 05:17:17
1	16	331.4328447191453	292.7529860839228	20/04/28 05:17:17
1	16	331.2078550806895	292.64826816173974	20/04/28 05:17:17
1	16	331.3109812323974	292.83999970130554	20/04/28 05:17:17
1	16	331.1726791541215	292.95872194309476	20/04/28 05:17:17
1	16	331.2056574761309	292.8884061390983	20/04/28 05:17:17
1	16	331.4719006194505	292.87486177251554	20/04/28 05:17:17
1	16	331.476995311584	293.08287310231185	20/04/28 05:17:17
1	16	331.5950200352027	292.8734622402971	20/04/28 05:17:17
1	16	331.67189043408285	292.67878258029475	20/04/28 05:17:17
1	16	331.74224363578946	292.8251245420067	20/04/28 05:17:18
1	16	331.70554882327934	292.8062163187458	20/04/28 05:17:18
1	16	331.72368476910594	293.05490419179455	20/04/28 05:17:18
1	16	331.83400637454173	293.2186404347543	20/04/28 05:17:18
1	16	331.713244801375	293.2852304967187	20/04/28 05:17:18
1	16	331.59554838378307	293.3491482049149	20/04/28 05:17:18
1	16	331.73931275063626	293.3496454311098	20/04/28 05:17:18
1	16	331.7465588727672	293.3561499478679	20/04/28 05:17:18
1	16	331.54605330627146	293.1918997640341	20/04/28 05:17:18
1	16	331.81219169177956	293.2207394846822	20/04/28 05:17:18
1	16	331.58282311800065	293.03955473303733	20/04/28 05:17:19
1	16	331.69665172713087	293.0986218638619	20/04/28 05:17:19
1	16	331.53082008477054	293.1770664127363	20/04/28 05:17:19
1	16	331.40391644377775	293.30339319675716	20/04/28 05:17:19
1	16	331.3869408519546	293.27540852002085	20/04/28 05:17:19
1	16	331.54789505289506	293.146808326445	20/04/28 05:17:19
1	16	331.58904671106876	293.2144897833474	20/04/28 05:17:19
1	16	331.6025345898409	293.1119121044456	20/04/28 05:17:19
1	16	331.57729070520713	293.0921053447161	20/04/28 05:17:19
1	16	331.47547513921995	293.09218946054835	20/04/28 05:17:20
1	16	331.44970934054237	293.0970699178388	20/04/28 05:17:20
1	16	331.43321806542195	293.08035280703854	20/04/28 05:17:20
1	16	331.1942976800537	293.2024669738176	20/04/28 05:17:20
1	16	331.06882804534484	293.3758640624959	20/04/28 05:17:20
1	16	330.99848840290656	293.2615078733146	20/04/28 05:17:20
1	16	330.8477536753085	293.03512497783964	20/04/28 05:17:20
1	16	330.97397725703456	293.23071038684986	20/04/28 05:17:20
1	16	330.7298444407354	293.3383349239508	20/04/28 05:17:20
1	16	330.56987485079543	293.3371238440585	20/04/28 05:17:20
1	16	330.6999057040564	293.08512964905	20/04/28 05:17:21
1	16	330.71134301150494	293.12361378956047	20/04/28 05:17:21
1	16	330.7302392933767	293.22935029293234	20/04/28 05:17:21
1	16	330.7468781863159	293.11561503399867	20/04/28 05:17:21
1	16	330.7575269719126	293.03878757126705	20/04/28 05:17:21
1	16	330.7251173207513	293.0802243670785	20/04/28 05:17:21
1	16	330.6551643031069	293.3307051244105	20/04/28 05:17:21
1	16	330.7612209493111	293.32760800547965	20/04/28 05:17:21
1	16	330.9023391489201	293.17892393885256	20/04/28 05:17:21
1	16	330.847104747175	292.96552215556824	20/04/28 05:17:21
1	16	331.0471007784149	293.10377041755936	20/04/28 05:17:22
1	16	331.2104564397131	293.10703820829224	20/04/28 05:17:22
1	16	331.1491565550275	293.0198404525633	20/04/28 05:17:22
1	16	331.4278091543541	293.0096520093399	20/04/28 05:17:22
1	16	331.5150501458394	293.0807927697155	20/04/28 05:17:22
1	16	331.5244445944887	293.11672895181334	20/04/28 05:17:22
1	16	331.5247412671912	293.1165943974617	20/04/28 05:17:22
1	16	331.52583964822236	293.3507998615845	20/04/28 05:17:22
1	16	331.53314747046096	293.26024618938783	20/04/28 05:17:22
1	16	331.28819961605217	293.3480432375173	20/04/28 05:17:22
1	16	331.2601258040881	293.22389391151575	20/04/28 05:17:23
1	16	331.26315736079295	293.4712032642466	20/04/28 05:17:23
1	16	331.2880298790129	293.4558349789789	20/04/28 05:17:23
1	16	331.2243199609897	293.3066060058092	20/04/28 05:17:23
1	16	331.2953664883571	293.28466183635885	20/04/28 05:17:23
1	16	331.09280093028417	293.0757604125763	20/04/28 05:17:23
1	16	331.20615094373056	293.22208366789926	20/04/28 05:17:23
1	16	331.1976143613711	293.2283502183835	20/04/28 05:17:23
1	16	331.11553229645267	293.14382164652363	20/04/28 05:17:23
1	16	331.23214187371303	293.0055149931516	20/04/28 05:17:24
1	16	331.326084750233	292.9250056318338	20/04/28 05:17:24
1	16	331.28391774849854	292.8783324824505	20/04/28 05:17:24
1	16	331.44955630718164	292.8724287083491	20/04/28 05:17:24
1	16	331.44992054462205	292.8894332769283	20/04/28 05:17:24
1	16	331.35737443299223	292.8386355516872	20/04/28 05:17:24
1	16	331.2459914959259	292.693725824436	20/04/28 05:17:24
1	16	331.2400468421956	292.73212403700694	20/04/28 05:17:24
1	16	331.47110940056683	292.65130420586075	20/04/28 05:17:24
1	16	331.31433907138796	292.69290868894893	20/04/28 05:17:24
1	16	331.040923514438	292.6746505656964	20/04/28 05:17:25
1	16	330.7733271416057	292.69021414003265	20/04/28 05:17:25
1	16	330.576362779254	292.7930595355281	20/04/28 05:17:25
1	16	330.77312711520443	292.5909116979673	20/04/28 05:17:25
1	16	330.9107824302872	292.4631584999639	20/04/28 05:17:25
1	16	330.66516156626426	292.38411077805625	20/04/28 05:17:25
1	16	330.9112524993231	292.36529381131976	20/04/28 05:17:25
1	16	330.9128573333447	292.36478716901945	20/04/28 05:17:25
1	16	330.6829738521935	292.4003471454473	20/04/28 05:17:25
1	16	330.53612197998484	292.4628007196082	20/04/28 05:17:25
1	16	330.63659412561606	292.27565641764033	20/04/28 05:17:26
1	16	330.64837096526537	292.2681240910268	20/04/28 05:17:26
1	16	330.7634269530314	292.4753385893774	20/04/28 05:17:26
1	16	330.6069396148681	292.4487715438823	20/04/28 05:17:26
1	16	330.57363960065203	292.45059566671887	20/04/28 05:17:26
1	16	330.53966319707325	292.4021084028376	20/04/28 05:17:26
1	16	330.519519352676	292.511363313334	20/04/28 05:17:26
1	16	330.5895348093031	292.23416778322087	20/04/28 05:17:26
1	16	330.75927823740136	292.1549974179388	20/04/28 05:17:26
1	16	330.782901080001	292.320675933919	20/04/28 05:17:26
1	16	330.6037436290297	292.1198455456984	20/04/28 05:17:27
1	16	330.62215076759657	292.03033136074606	20/04/28 05:17:27
1	16	330.6221982933419	292.03028306109707	20/04/28 05:17:27
1	16	330.4629656690087	291.9375382965031	20/04/28 05:17:27
1	16	330.4187591795065	291.9169735049029	20/04/28 05:17:27
1	16	330.39236402438297	291.73460918171486	20/04/28 05:17:27
1	16	330.13499488504164	291.65819237696513	20/04/28 05:17:27
1	16	330.1250561901975	291.6637741181587	20/04/28 05:17:27
1	16	330.36442716410875	291.7611801860282	20/04/28 05:17:27
1	16	330.1746055175445	291.76335347658136	20/04/28 05:17:28
1	16	330.1274045902384	291.6764457867508	20/04/28 05:17:28
1	16	329.9854557949666	291.7721363790343	20/04/28 05:17:28
1	16	329.8800044163758	291.8780897727431	20/04/28 05:17:28
1	16	329.81003474903343	291.8457036207878	20/04/28 05:17:28
1	16	329.9460157179762	291.99602473113293	20/04/28 05:17:28
1	16	330.11623285885344	292.1550566335415	20/04/28 05:17:28
1	16	330.21347316997435	291.91711494889415	20/04/28 05:17:28
1	16	330.21347316997435	291.91711494889415	20/04/28 05:17:28
1	16	330.2644097950896	291.7160779726825	20/04/28 05:17:28
1	16	330.4752070112996	291.66396962144637	20/04/28 05:17:29
1	16	330.4752070112996	291.66396962144637	20/04/28 05:17:29
1	16	330.65199367114246	291.76656279909116	20/04/28 05:17:29
1	16	330.381718455813	291.7014005474015	20/04/28 05:17:29
1	16	330.3798411848709	291.6965216822399	20/04/28 05:17:29
1	16	330.2722436143087	291.60138774175715	20/04/28 05:17:29
1	16	330.16813863218016	291.66734291583435	20/04/28 05:17:29
1	16	329.8961925307301	291.737136910101	20/04/28 05:17:29
1	16	329.8518935910922	291.9682900233011	20/04/28 05:17:29
1	16	330.0342028808165	291.89901647587436	20/04/28 05:17:29
1	16	330.30147651429843	291.9863733002196	20/04/28 05:17:30
1	16	330.1403810867059	292.1841010993361	20/04/28 05:17:30
1	16	330.0069632185641	292.25997151127916	20/04/28 05:17:30
1	16	330.03665664437546	292.0738943683543	20/04/28 05:17:30
1	16	330.1334151143344	291.8059351190677	20/04/28 05:17:30
1	16	330.2116836437445	291.7682748056661	20/04/28 05:17:30
1	16	330.2285146386713	291.75003888568733	20/04/28 05:17:30
1	16	329.99996603262576	291.63844522161	20/04/28 05:17:30
1	16	329.88708175984186	291.37696810143905	20/04/28 05:17:30
1	16	329.8677442758793	291.35983304298287	20/04/28 05:17:31
1	16	329.86871362390207	291.3635897296749	20/04/28 05:17:31
1	16	330.058135350283	291.41083045300724	20/04/28 05:17:31
1	16	329.9682117650021	291.45342764172744	20/04/28 05:17:31
1	16	329.90936400473316	291.4317344721255	20/04/28 05:17:31
1	16	329.9363278128165	291.446313354039	20/04/28 05:17:31
1	16	330.01855525889505	291.262111842745	20/04/28 05:17:31
1	16	329.86650747034474	291.13383541556607	20/04/28 05:17:31
1	16	329.98959932572814	291.2803751638434	20/04/28 05:17:31
1	16	330.1999066217203	291.30617581488997	20/04/28 05:17:31
1	16	330.1272509963802	291.3453025060629	20/04/28 05:17:32
1	16	330.0140845783847	291.4803698719142	20/04/28 05:17:32
1	16	330.01610641297134	291.4562221046218	20/04/28 05:17:32
1	16	330.03392309545603	291.4199314374851	20/04/28 05:17:32
1	16	329.7720122953047	291.3774881914445	20/04/28 05:17:32
1	16	329.859532512762	291.25874944017005	20/04/28 05:17:32
1	16	329.85118562146107	291.2364500897502	20/04/28 05:17:32
1	16	329.85118562146107	291.2364500897502	20/04/28 05:17:32
1	16	329.9179470411476	291.139618534454	20/04/28 05:17:32
1	16	329.8743387695884	291.1278989688216	20/04/28 05:17:32
1	16	329.81480492367734	291.0930896340598	20/04/28 05:17:33
1	16	329.81780291170026	291.14130494642325	20/04/28 05:17:33
1	16	329.74957486701567	291.06657683287676	20/04/28 05:17:33
1	16	329.8623563694654	291.0477925370719	20/04/28 05:17:33
1	16	329.81735676686816	290.9001695356514	20/04/28 05:17:33
1	16	330.0303210445552	290.88873651957226	20/04/28 05:17:33
1	16	330.12935880150405	290.7752607920047	20/04/28 05:17:33
1	16	329.93053378602445	290.87819215628326	20/04/28 05:17:33
1	16	329.9072100589822	291.0002002248959	20/04/28 05:17:33
1	16	329.99937623884836	291.0594634003976	20/04/28 05:17:34
1	16	329.96275016764946	291.354762657163	20/04/28 05:17:34
1	16	330.20095212819956	291.32860424849264	20/04/28 05:17:34
1	16	330.20044039510395	291.330886455297	20/04/28 05:17:34
1	16	330.1063408526153	291.26359391082707	20/04/28 05:17:34
1	16	330.1063408526153	291.26359391082707	20/04/28 05:17:34
1	16	330.4049622346658	291.2566113338635	20/04/28 05:17:34
1	16	330.30583226978075	291.20591666798646	20/04/28 05:17:34
1	16	330.3825624314627	291.40239950624414	20/04/28 05:17:34
1	16	330.3825624314627	291.40239950624414	20/04/28 05:17:34
1	16	330.575834357762	291.3512356230225	20/04/28 05:17:35
1	16	330.48100756745	291.2418655707493	20/04/28 05:17:35
1	16	330.6195985904709	291.23504045498083	20/04/28 05:17:35
1	16	330.62532910747694	291.4567189159131	20/04/28 05:17:35
1	16	330.78779015062236	291.22822188511986	20/04/28 05:17:35
1	16	330.97804117004813	291.14496063218826	20/04/28 05:17:35
1	16	330.97475086865154	291.10404165136555	20/04/28 05:17:35
1	16	330.9405616075071	291.119866383883	20/04/28 05:17:35
1	16	331.0888773195381	290.8606200098032	20/04/28 05:17:35
1	16	331.0735201255097	290.8525612205477	20/04/28 05:17:35
1	16	331.1326929340431	291.0327422946002	20/04/28 05:17:36
1	16	331.0594122323209	291.0650391664631	20/04/28 05:17:36
1	16	331.1135988840408	291.04008152304095	20/04/28 05:17:36
1	16	330.92056391382226	290.83926849251384	20/04/28 05:17:36
1	16	330.7251082246609	290.71808242154947	20/04/28 05:17:36
1	16	330.62588131853147	290.7364837721836	20/04/28 05:17:36
1	16	330.5638299692267	290.69284837788314	20/04/28 05:17:36
1	16	330.5134168380345	290.66435089945475	20/04/28 05:17:36
1	16	330.6025735986979	290.6268779905532	20/04/28 05:17:36
1	16	330.4484611419424	290.66363543519674	20/04/28 05:17:37
1	16	330.35625726458386	290.766409317412	20/04/28 05:17:37
1	16	330.47052320524534	290.546445695916	20/04/28 05:17:37
1	16	330.4963411376208	290.51526974130553	20/04/28 05:17:37
1	16	330.54362478856115	290.5041655118135	20/04/28 05:17:37
1	16	330.5827860129869	290.39358473771784	20/04/28 05:17:37
1	16	330.37013915639454	290.44751124510367	20/04/28 05:17:37
1	16	330.34299659814	290.4954973249704	20/04/28 05:17:37
1	16	330.3385935260465	290.59289265101086	20/04/28 05:17:37
1	16	330.2727570158904	290.61924925319295	20/04/28 05:17:37
1	16	330.31608581595043	290.5762778240502	20/04/28 05:17:38
1	16	330.3163504014174	290.6149463410105	20/04/28 05:17:38
1	16	330.1750510296184	290.43923047058325	20/04/28 05:17:38
1	16	329.96722569409343	290.26462458707664	20/04/28 05:17:38
1	16	330.0115619685196	290.2137533640252	20/04/28 05:17:38
1	16	330.2989865468794	290.1833035677975	20/04/28 05:17:38
1	16	330.2750542258213	290.1299600570567	20/04/28 05:17:38
1	16	330.03014082527625	290.2606334532561	20/04/28 05:17:38
1	16	330.2807968191393	290.29143567991406	20/04/28 05:17:38
1	16	330.1184964035275	290.05422315606904	20/04/28 05:17:38
1	16	329.939634651865	289.8396855022647	20/04/28 05:17:39
1	16	330.00924392493005	289.8846427144392	20/04/28 05:17:39
1	16	329.8636857927184	289.9324366223039	20/04/28 05:17:39
1	16	329.8851363580967	290.0967204075322	20/04/28 05:17:39
1	16	330.1222145140313	290.1188565169184	20/04/28 05:17:39
1	16	330.3554754503915	290.1275685624356	20/04/28 05:17:39
1	16	330.26089016940693	290.02563656464105	20/04/28 05:17:39
1	16	330.2050529406522	289.95226593986945	20/04/28 05:17:39
1	16	329.92655082041904	289.92131902404	20/04/28 05:17:39
1	16	329.7802877932636	289.7925479723813	20/04/28 05:17:40
1	16	329.7851525686845	289.79376027138017	20/04/28 05:17:40
1	16	329.7851525686845	289.79376027138017	20/04/28 05:17:40
1	16	329.8662283014318	289.6916236435311	20/04/28 05:17:40
1	16	329.8662283014318	289.6916236435311	20/04/28 05:17:40
1	16	329.9339055484627	289.7743228227152	20/04/28 05:17:40
1	16	330.06121523094157	289.8237448613276	20/04/28 05:17:40
1	16	329.8426798155928	290.0108775878946	20/04/28 05:17:40
1	16	329.8507404560049	290.0028442105652	20/04/28 05:17:40
1	16	329.9900442972368	289.949749682281	20/04/28 05:17:40
1	16	330.0300022738711	290.23637592834126	20/04/28 05:17:41
1	16	330.09431792261466	290.10988578392875	20/04/28 05:17:41
1	16	330.09431792261466	290.10988578392875	20/04/28 05:17:41
1	16	330.0666128207157	290.0171639572059	20/04/28 05:17:41
1	16	329.91113827696915	289.7797696159533	20/04/28 05:17:41
1	16	329.77884180882114	289.788342616917	20/04/28 05:17:41
1	16	329.75923676426953	289.8813965260004	20/04/28 05:17:41
1	16	329.8674972193578	289.6262050543602	20/04/28 05:17:41
1	16	330.0253624503511	289.7472994456726	20/04/28 05:17:41
1	16	329.980283868954	289.88124258527915	20/04/28 05:17:41
1	16	329.97671771516747	289.87592727186325	20/04/28 05:17:42
1	16	330.10039562964613	289.71903033177665	20/04/28 05:17:42
1	16	329.9368127925848	289.5842915189888	20/04/28 05:17:42
1	16	329.94304328920816	289.71295368760946	20/04/28 05:17:42
1	16	329.9504750656305	289.71185416377193	20/04/28 05:17:42
1	16	329.93529788298684	289.66220833771354	20/04/28 05:17:42
1	16	329.93529788298684	289.66220833771354	20/04/28 05:17:42
1	16	330.17857676641984	289.6225041346221	20/04/28 05:17:42
1	16	330.1319596799622	289.5063003009048	20/04/28 05:17:42
1	16	330.1140754762726	289.64593470745496	20/04/28 05:17:43
1	16	330.27571264235183	289.5236289511188	20/04/28 05:17:43
1	16	330.33127659375396	289.3627531767522	20/04/28 05:17:43
1	16	330.32189322288826	289.4038554903387	20/04/28 05:17:43
1	16	330.2734194262245	289.3859853172411	20/04/28 05:17:43
1	16	330.2488759834299	289.3977286009904	20/04/28 05:17:43
1	16	330.26293685521125	289.2041710184636	20/04/28 05:17:43
1	16	330.1248864119815	288.9395583205959	20/04/28 05:17:43
1	16	330.07576593228447	288.88554898574125	20/04/28 05:17:43
1	16	330.2394457897747	288.89143839041736	20/04/28 05:17:43
1	16	330.2003205872693	289.10344216936403	20/04/28 05:17:44
1	16	330.086680324499	288.9699912841435	20/04/28 05:17:44
1	16	329.88480775235695	289.0795542666127	20/04/28 05:17:44
1	16	329.91307622664095	288.9474304693038	20/04/28 05:17:44
1	16	329.8494891158105	288.93508809890955	20/04/28 05:17:44
1	16	329.94862181737847	288.76519960227824	20/04/28 05:17:44
1	16	329.98454315583126	288.80668374399085	20/04/28 05:17:44
1	16	330.03344535065645	288.96750563796974	20/04/28 05:17:44
1	16	329.8842380539464	289.1365854171607	20/04/28 05:17:44
1	16	329.85430661960834	289.09347095801417	20/04/28 05:17:45
1	16	329.77060450839946	288.903892776406	20/04/28 05:17:45
1	16	329.77094613037127	288.90345894637466	20/04/28 05:17:45
1	16	329.7532098852178	288.88484434682	20/04/28 05:17:45
1	16	329.7763703347472	288.92886413906103	20/04/28 05:17:45
1	16	329.8434453155843	288.99818505729746	20/04/28 05:17:45
1	16	329.79024480954916	288.9563483241987	20/04/28 05:17:45
1	16	329.76239691161055	288.93443284009254	20/04/28 05:17:45
1	16	329.85541656013714	289.1189057241986	20/04/28 05:17:45
1	16	329.8941413781321	289.1335741344862	20/04/28 05:17:45
1	16	329.9124534466924	289.13855614436886	20/04/28 05:17:46
1	16	329.75941537736475	289.2076424779154	20/04/28 05:17:46
1	16	329.80513864636646	289.04647034116977	20/04/28 05:17:46
1	16	329.8903122702533	288.85546376981097	20/04/28 05:17:46
1	16	329.7611672533524	288.90026544682394	20/04/28 05:17:46
1	16	329.8088478661261	288.7829520226743	20/04/28 05:17:46
1	16	329.8032842980129	288.7971766038272	20/04/28 05:17:46
1	16	329.77968235479057	288.7369594091595	20/04/28 05:17:46
1	16	329.9378522524139	288.4889872285725	20/04/28 05:17:46
1	16	329.9343452467603	288.75987460018155	20/04/28 05:17:46
1	16	329.9343452467603	288.75987460018155	20/04/28 05:17:47
1	16	329.9343452467603	288.75987460018155	20/04/28 05:17:47
1	16	329.92751548765233	288.7727152222019	20/04/28 05:17:47
1	16	330.0094756624718	288.7616066713889	20/04/28 05:17:47
1	16	329.93155038638054	288.7954820107734	20/04/28 05:17:47
1	16	329.94262577895233	288.85343572315486	20/04/28 05:17:47
1	16	330.0128298652335	289.13932347065344	20/04/28 05:17:47
1	16	330.0543251558015	289.2036012381975	20/04/28 05:17:47
1	16	329.9980222780634	289.24222623571643	20/04/28 05:17:47
1	16	329.9957588218782	289.1982245992191	20/04/28 05:17:48
1	16	329.95098462948465	289.4591105614343	20/04/28 05:17:48
1	16	329.9538745636787	289.4041285849104	20/04/28 05:17:48
1	16	329.99325792536365	289.38631170326784	20/04/28 05:17:48
1	16	330.0784563460641	289.6312318400793	20/04/28 05:17:48
1	16	330.0594576873632	289.6175224641246	20/04/28 05:17:48
1	16	330.14077483364764	289.74426179999466	20/04/28 05:17:48
1	16	330.32108471292935	289.77600129367846	20/04/28 05:17:48
1	16	330.25545701210905	289.5013526302615	20/04/28 05:17:48
1	16	330.2672290850261	289.3724941888836	20/04/28 05:17:48
1	16	330.1005445857387	289.35354667565144	20/04/28 05:17:49
1	16	329.8950886724258	289.22816470687866	20/04/28 05:17:49
1	16	329.7808988664724	289.1375681523645	20/04/28 05:17:49
1	16	329.8409798147512	289.12940586344655	20/04/28 05:17:49
1	16	329.91894871852116	289.26084493785544	20/04/28 05:17:49
1	16	329.81999262404275	289.1512529038351	20/04/28 05:17:49
1	16	329.8637027600413	289.36248892766775	20/04/28 05:17:49
1	16	329.874961821255	289.6050851326073	20/04/28 05:17:49
1	16	329.8178197548265	289.8079923554104	20/04/28 05:17:49
1	16	329.78114304850766	289.9118828695423	20/04/28 05:17:49
1	16	329.84096630564204	290.1205346345844	20/04/28 05:17:50
1	16	330.127731056672	290.114827382925	20/04/28 05:17:50
1	16	329.9361960242819	290.1814206712091	20/04/28 05:17:50
1	16	329.8538585713835	290.11115826924623	20/04/28 05:17:50
1	16	330.11568586659587	289.97573160660255	20/04/28 05:17:50
1	16	329.87515087218054	290.03319127132966	20/04/28 05:17:50
1	16	329.93704511964637	289.8371047516023	20/04/28 05:17:50
1	16	329.87551531520626	289.80108837828857	20/04/28 05:17:50
1	16	329.8556375745048	289.8503118752878	20/04/28 05:17:50
1	16	329.9080629776603	289.8004626743156	20/04/28 05:17:51
1	16	329.9080629776603	289.8004626743156	20/04/28 05:17:51
1	16	329.92758807783315	289.7247413718772	20/04/28 05:17:51
1	16	329.92758807783315	289.7247413718772	20/04/28 05:17:51
1	16	329.8726299943814	289.92720610948066	20/04/28 05:17:51
1	16	329.774195518072	289.96489336306456	20/04/28 05:17:51
1	16	330.0136835443728	290.08389276681584	20/04/28 05:17:51
1	16	330.0742687472409	290.15876955484254	20/04/28 05:17:51
1	16	330.13056330096884	290.18052691893763	20/04/28 05:17:51
1	16	329.9810170566297	290.14735968867967	20/04/28 05:17:51
1	16	330.0607802437926	290.10512519623114	20/04/28 05:17:52
1	16	330.1827826539207	289.8319392695197	20/04/28 05:17:52
1	16	330.14909649629493	289.79977051834123	20/04/28 05:17:52
1	16	330.2045430562913	289.7206010083781	20/04/28 05:17:52
1	16	330.2045430562913	289.7206010083781	20/04/28 05:17:52
1	16	330.24084855699647	289.4709473429689	20/04/28 05:17:52
1	16	330.233896132908	289.466025084793	20/04/28 05:17:52
1	16	330.0516646052324	289.4130433449791	20/04/28 05:17:52
1	16	330.13628050473994	289.1966176431384	20/04/28 05:17:52
1	16	330.264471615478	289.18985634633975	20/04/28 05:17:52
1	16	330.24687963147875	289.2303012776748	20/04/28 05:17:53
1	16	329.9697433062928	289.1778566305277	20/04/28 05:17:53
1	16	329.8358881526613	289.3562996090337	20/04/28 05:17:53
1	16	329.7855428448559	289.30971845416974	20/04/28 05:17:53
1	16	329.88734324711595	289.18032362448207	20/04/28 05:17:53
1	16	329.88734324711595	289.18032362448207	20/04/28 05:17:53
1	16	329.79370485802724	289.03980563165607	20/04/28 05:17:53
1	16	329.79370485802724	289.03980563165607	20/04/28 05:17:53
1	16	329.79512937538306	289.14439265758733	20/04/28 05:17:53
1	16	329.8039530431868	289.0663778264434	20/04/28 05:17:54
1	16	329.95882223761754	288.9645558933777	20/04/28 05:17:54
1	16	330.0663985851232	288.99107322082995	20/04/28 05:17:54
1	16	330.0663985851232	288.99107322082995	20/04/28 05:17:54
1	16	330.194740863484	288.89590293052254	20/04/28 05:17:54
1	16	330.1245577740207	288.67544136743584	20/04/28 05:17:54
1	16	330.1760322302062	288.80733854525056	20/04/28 05:17:54
1	16	329.9226131736583	288.9154188987251	20/04/28 05:17:54
1	16	329.8857538057461	289.11102843552646	20/04/28 05:17:54
1	16	329.989493124545	289.16015854361046	20/04/28 05:17:54
1	16	329.989493124545	289.16015854361046	20/04/28 05:17:55
1	16	330.12062594508717	289.2290724276789	20/04/28 05:17:55
1	16	330.3597479901323	289.4044709977123	20/04/28 05:17:55
1	16	330.36373507212267	289.41190313725843	20/04/28 05:17:55
1	16	330.3654322958044	289.4718528585977	20/04/28 05:17:55
1	16	330.31387360459416	289.463074658643	20/04/28 05:17:55
1	16	330.04554735910756	289.42985237461613	20/04/28 05:17:55
1	16	330.159064065662	289.2654514563942	20/04/28 05:17:55
1	16	330.22990848467686	288.98130223385846	20/04/28 05:17:55
1	16	330.0717664028405	288.86100066820035	20/04/28 05:17:56
1	16	329.963648875836	288.981100514333	20/04/28 05:17:56
1	16	329.7884119771149	288.94462364167845	20/04/28 05:17:56
1	16	329.7785904043165	288.94843963573175	20/04/28 05:17:56
1	16	329.8520106028924	289.02143597924135	20/04/28 05:17:56
1	16	330.10546370375545	288.86284189885146	20/04/28 05:17:56
1	16	330.2170875500789	288.8845780231615	20/04/28 05:17:56
1	16	330.17852814862135	289.00893235274793	20/04/28 05:17:56
1	16	330.10442372261406	289.0154621855045	20/04/28 05:17:56
1	16	330.06663854144307	288.8589096782135	20/04/28 05:17:56
1	16	330.0971964869712	288.8011775717441	20/04/28 05:17:57
1	16	329.9302403957605	288.8001179490751	20/04/28 05:17:57
1	16	329.9771857337629	288.7007996078946	20/04/28 05:17:57
1	16	330.082030081738	288.92457314689733	20/04/28 05:17:57
1	16	329.95443914677594	288.9742860957189	20/04/28 05:17:57
1	16	330.12528516568955	288.8418103775763	20/04/28 05:17:57
1	16	330.19510985835257	288.7509516887329	20/04/28 05:17:57
1	16	330.22910853298765	288.5281341108534	20/04/28 05:17:57
1	16	330.33464137647616	288.437380081321	20/04/28 05:17:57
1	16	330.5031746842008	288.5775227849159	20/04/28 05:17:58
1	16	330.27628664406524	288.6355095206418	20/04/28 05:17:58
1	16	330.51640764327186	288.6064674272201	20/04/28 05:17:58
1	16	330.4990932556068	288.58032168310405	20/04/28 05:17:58
1	16	330.3891938591648	288.47169505592154	20/04/28 05:17:58
1	16	330.35018163789135	288.27153585684533	20/04/28 05:17:58
1	16	330.32900974007686	288.2617894425614	20/04/28 05:17:58
1	16	330.31555306663034	288.1552240654984	20/04/28 05:17:58
1	16	330.22195472141823	288.33562165312605	20/04/28 05:17:58
1	16	330.42979781612604	288.4681529285097	20/04/28 05:17:58
1	16	330.40556410637805	288.35056750156116	20/04/28 05:17:59
1	16	330.56392854683565	288.29010457331884	20/04/28 05:17:59
1	16	330.33074920157696	288.22419037402494	20/04/28 05:17:59
1	16	330.39840759187837	288.3047608470291	20/04/28 05:17:59
1	16	330.47631866261247	288.40532582129083	20/04/28 05:17:59
1	16	330.5791721278165	288.4050940007074	20/04/28 05:17:59
1	16	330.6101946873053	288.3961681053419	20/04/28 05:17:59
1	16	330.45230596041233	288.4721398053851	20/04/28 05:17:59
1	16	330.41518940715355	288.65471836854704	20/04/28 05:17:59
1	16	330.38311159576693	288.63611268881954	20/04/28 05:17:59
1	16	330.3865000325137	288.63338223633855	20/04/28 05:18:00
1	16	330.52878768441803	288.4469465564072	20/04/28 05:18:00
1	16	330.4678410342522	288.42217639924536	20/04/28 05:18:00
1	16	330.73241152608944	288.5551637836702	20/04/28 05:18:00
1	16	330.73238486180213	288.5524050380859	20/04/28 05:18:00
1	16	330.6086810448822	288.7937314339509	20/04/28 05:18:00
1	16	330.67602066631713	288.7987449061924	20/04/28 05:18:00
1	16	330.45030991584	288.9351169520291	20/04/28 05:18:00
1	16	330.48951108773264	288.9506246258659	20/04/28 05:18:00
1	16	330.5006155467081	288.84135121577197	20/04/28 05:18:01
1	16	330.4238083162359	288.9384039561548	20/04/28 05:18:01
1	16	330.68176092251554	288.8214091099733	20/04/28 05:18:01
1	16	330.68652309482985	288.9867456502656	20/04/28 05:18:01
1	16	330.7729260636321	288.9943279877508	20/04/28 05:18:01
1	16	330.76603276545205	289.0030087982317	20/04/28 05:18:01
1	16	330.8359460533496	288.8883118968934	20/04/28 05:18:01
1	16	330.88928260583293	289.11527601567366	20/04/28 05:18:01
1	16	330.8369640243141	289.1174084505878	20/04/28 05:18:01
1	16	330.8689375217359	288.9306503211673	20/04/28 05:18:01
1	16	330.9807820813922	288.8306333626563	20/04/28 05:18:02
1	16	330.783032094137	288.6538703113977	20/04/28 05:18:02
1	16	330.75315336954174	288.5198480055381	20/04/28 05:18:02
1	16	330.74234041725543	288.52874826774695	20/04/28 05:18:02
1	16	330.87559256661183	288.63161371872974	20/04/28 05:18:02
1	16	330.8746633134709	288.6399055018616	20/04/28 05:18:02
1	16	330.7895430477188	288.61545564664596	20/04/28 05:18:02
1	16	330.74914020703386	288.6672505938189	20/04/28 05:18:02
1	16	330.7832412251266	288.75951914755876	20/04/28 05:18:02
1	16	330.80854488210633	288.77440897077855	20/04/28 05:18:02
1	16	330.8362347574839	288.5213958182431	20/04/28 05:18:03
1	16	330.91111749212143	288.5537054050292	20/04/28 05:18:03
1	16	330.9553162861662	288.47363639405233	20/04/28 05:18:03
1	16	330.9436880981455	288.4857223829479	20/04/28 05:18:03
1	16	331.0789487340747	288.5651938238185	20/04/28 05:18:03
1	16	330.9203152702292	288.33598793063805	20/04/28 05:18:03
1	16	330.8731626133357	288.40904649727486	20/04/28 05:18:03
1	16	330.7813577035872	288.3176653249477	20/04/28 05:18:03
1	16	330.67729412118234	288.5572113343281	20/04/28 05:18:03
1	16	330.70072440701955	288.656678627448	20/04/28 05:18:04
1	16	330.5382608226852	288.63367305169095	20/04/28 05:18:04
1	16	330.6068357264213	288.45972745456766	20/04/28 05:18:04
1	16	330.6068357264213	288.45972745456766	20/04/28 05:18:04
1	16	330.479917129719	288.5922021767563	20/04/28 05:18:04
1	16	330.479917129719	288.5922021767563	20/04/28 05:18:04
1	16	330.2050502530456	288.4432757456085	20/04/28 05:18:04
1	16	330.2050502530456	288.4432757456085	20/04/28 05:18:04
1	16	330.44804587551783	288.45228185347736	20/04/28 05:18:04
1	16	330.4645430264475	288.2015705525908	20/04/28 05:18:04
1	16	330.4645430264475	288.2015705525908	20/04/28 05:18:05
1	16	330.7269512288418	288.1210848849347	20/04/28 05:18:05
1	16	330.7826589684321	288.01697266644715	20/04/28 05:18:05
1	16	330.72511829418914	287.7576826583054	20/04/28 05:18:05
1	16	330.6954759145859	287.79576166772574	20/04/28 05:18:05
1	16	330.561576714566	287.9745988508117	20/04/28 05:18:05
1	16	330.52155548052394	288.14426461880487	20/04/28 05:18:05
1	16	330.53437006392403	288.1805692202934	20/04/28 05:18:05
1	16	330.6771049128074	288.1400323284499	20/04/28 05:18:05
1	16	330.6493547700175	288.13907747248015	20/04/28 05:18:05
1	16	330.9326097531852	288.1045769282029	20/04/28 05:18:06
1	16	330.84607356630016	288.30126745544226	20/04/28 05:18:06
1	16	331.0793121969352	288.3285294221967	20/04/28 05:18:06
1	16	331.0717370715926	288.39281692983457	20/04/28 05:18:06
1	16	331.05423532847726	288.48550230258803	20/04/28 05:18:06
1	16	330.9105514431234	288.2451715621953	20/04/28 05:18:06
1	16	330.90524539082395	288.3362010380448	20/04/28 05:18:06
1	16	330.7949399921657	288.2328509653142	20/04/28 05:18:06
1	16	330.6551156579658	288.11570899990767	20/04/28 05:18:06
1	16	330.6600886416132	288.1140289820103	20/04/28 05:18:07
1	16	330.9111169970038	287.9899158212311	20/04/28 05:18:07
1	16	331.1017637801126	288.0399027576918	20/04/28 05:18:07
1	16	331.1017637801126	288.0399027576918	20/04/28 05:18:07
1	16	331.1017637801126	288.0399027576918	20/04/28 05:18:07
1	16	331.1017637801126	288.0399027576918	20/04/28 05:18:07
1	16	331.1017637801126	288.0399027576918	20/04/28 05:18:07
1	16	331.0380700675527	288.1115652092833	20/04/28 05:18:07
1	16	331.217831555628	288.14503453307486	20/04/28 05:18:07
1	16	331.01580474914505	288.1406415000583	20/04/28 05:18:07
1	16	331.1753903047248	288.2429650633769	20/04/28 05:18:08
1	16	331.08931552162994	288.28986337292184	20/04/28 05:18:08
1	16	330.9943446740344	288.12397902138684	20/04/28 05:18:08
1	16	330.97882144657575	288.1599138286625	20/04/28 05:18:08
1	16	330.92729106801744	287.9281448347086	20/04/28 05:18:08
1	16	330.94629752577066	288.03585437877723	20/04/28 05:18:08
1	16	330.9655028167496	287.7831519902335	20/04/28 05:18:08
1	16	330.9116378603046	287.9379332629334	20/04/28 05:18:08
1	16	330.88148519340166	287.95691543721864	20/04/28 05:18:08
1	16	330.8874925053502	287.91809551708656	20/04/28 05:18:08
1	16	330.8499498939835	287.8791694037096	20/04/28 05:18:09
1	16	330.88678201420345	287.8753140646448	20/04/28 05:18:09
1	16	330.84811344791035	287.831068914637	20/04/28 05:18:09
1	16	330.643428485054	287.7710826877654	20/04/28 05:18:09
1	16	330.8894112874581	287.78935172299583	20/04/28 05:18:09
1	16	330.8496739724709	287.7662882102681	20/04/28 05:18:09
1	16	330.7369169666677	287.8661240650566	20/04/28 05:18:09
1	16	330.7857134547174	288.15483078882255	20/04/28 05:18:09
1	16	330.73520863628306	288.2487088751856	20/04/28 05:18:09
1	16	330.7148927396674	288.1241738824223	20/04/28 05:18:10
1	16	330.6031153466449	288.2298338324008	20/04/28 05:18:10
1	16	330.7876729320065	288.258675309876	20/04/28 05:18:10
1	16	330.78402659914104	288.22445870756025	20/04/28 05:18:10
1	16	330.64502829359134	288.08315763608454	20/04/28 05:18:10
1	16	330.4291364044535	288.05295667163415	20/04/28 05:18:10
1	16	330.59187235472814	287.8120420159124	20/04/28 05:18:10
1	16	330.35619700766006	287.89371235084474	20/04/28 05:18:10
1	16	330.3378592531718	288.03456079571765	20/04/28 05:18:10
1	16	330.31726532239344	288.0448207907383	20/04/28 05:18:10
1	16	330.43446988089386	287.82994328624017	20/04/28 05:18:11
1	16	330.3492791834671	287.67011348216596	20/04/28 05:18:11
1	16	330.5056708894336	287.85896250470876	20/04/28 05:18:11
1	16	330.53072810117686	287.93359025579673	20/04/28 05:18:11
1	16	330.45383513874253	287.87423319561833	20/04/28 05:18:11
1	16	330.6732271391167	287.7270380554477	20/04/28 05:18:11
1	16	330.7739434124747	287.5304322841171	20/04/28 05:18:11
1	16	330.956982825527	287.4204961137134	20/04/28 05:18:11
1	16	330.956982825527	287.4204961137134	20/04/28 05:18:11
1	16	330.940360296085	287.4273394138988	20/04/28 05:18:11
1	16	330.9738279454008	287.22401131484935	20/04/28 05:18:12
1	16	331.0889667310113	287.15390551042566	20/04/28 05:18:12
1	16	331.31362753617407	287.23615108225226	20/04/28 05:18:12
1	16	331.4895357663439	287.29029178194924	20/04/28 05:18:12
1	16	331.6223093592126	287.4698923225523	20/04/28 05:18:12
1	16	331.4581508571448	287.50592254861687	20/04/28 05:18:12
1	16	331.6652798744411	287.3902210753757	20/04/28 05:18:12
1	16	331.47901327114204	287.3931413350818	20/04/28 05:18:12
1	16	331.3279003224463	287.50613443504295	20/04/28 05:18:12
1	16	331.1681093112233	287.44256120010454	20/04/28 05:18:13
1	16	331.23235990158213	287.5177819416195	20/04/28 05:18:13
1	16	331.3361913113233	287.5112865687481	20/04/28 05:18:13
1	16	331.1514686347225	287.3229642021779	20/04/28 05:18:13
1	16	331.16089754493345	287.28481797693235	20/04/28 05:18:13
1	16	331.24801510313165	287.3200598896861	20/04/28 05:18:13
1	16	331.24640732457357	287.28969974414946	20/04/28 05:18:13
1	16	331.25312772980215	287.2816453740634	20/04/28 05:18:13
1	16	331.25312772980215	287.2816453740634	20/04/28 05:18:13
1	16	331.26848556714384	287.2886279015583	20/04/28 05:18:13
1	16	331.3955040082355	287.20113763000774	20/04/28 05:18:14
1	16	331.3955040082355	287.20113763000774	20/04/28 05:18:14
1	16	331.6045224888626	287.28847593972336	20/04/28 05:18:14
1	16	331.5630408996089	287.15523182594893	20/04/28 05:18:14
1	16	331.769725337321	287.07544036829955	20/04/28 05:18:14
1	16	331.8319871482152	286.9108465444238	20/04/28 05:18:14
1	16	331.8319871482152	286.9108465444238	20/04/28 05:18:14
1	16	331.9868705071385	286.9179604140964	20/04/28 05:18:14
1	16	331.89761024189266	287.0876336289649	20/04/28 05:18:14
1	16	331.89761024189266	287.0876336289649	20/04/28 05:18:15
1	16	331.85356627380503	287.08620247047037	20/04/28 05:18:15
1	16	332.03615106269353	287.1369882035688	20/04/28 05:18:15
1	16	332.14219537701	286.93947002249655	20/04/28 05:18:15
1	16	332.07431677379117	286.9101666577127	20/04/28 05:18:15
1	16	332.0293253951705	286.9421983850286	20/04/28 05:18:15
1	16	331.9443406436618	286.83820909661296	20/04/28 05:18:15
1	16	331.96380806682487	286.9591180159492	20/04/28 05:18:15
1	16	331.9632319755187	286.9682281950628	20/04/28 05:18:15
1	16	331.6784202901768	287.0324158246408	20/04/28 05:18:15
1	16	331.6813430721797	287.0315400519812	20/04/28 05:18:16
1	16	331.81070033613577	287.14177740220697	20/04/28 05:18:16
1	16	331.7376914332846	287.0978621323774	20/04/28 05:18:16
1	16	331.7763528825044	287.2212023316582	20/04/28 05:18:16
1	16	331.6860054803223	287.2316247030925	20/04/28 05:18:16
1	16	331.90125084649645	287.33944898258295	20/04/28 05:18:16
1	16	331.82628839334166	287.2204035980893	20/04/28 05:18:16
1	16	331.72964735815475	287.299464924362	20/04/28 05:18:16
1	16	331.8983661948569	287.3103616875444	20/04/28 05:18:16
1	16	332.0000752618307	287.42365774717183	20/04/28 05:18:16
1	16	332.03862471060705	287.5574206808637	20/04/28 05:18:17
1	16	331.8084655281912	287.5792074507648	20/04/28 05:18:17
1	16	331.7854028275575	287.48484101772755	20/04/28 05:18:17
1	16	331.8019433388099	287.6897783792287	20/04/28 05:18:17
1	16	331.9245102040131	287.73036293412065	20/04/28 05:18:17
1	16	331.6713724023522	287.87087194424805	20/04/28 05:18:17
1	16	331.8885124220756	287.76014950974326	20/04/28 05:18:17
1	16	331.8846451280589	287.86804118217447	20/04/28 05:18:17
1	16	331.8543505118476	287.88456585921034	20/04/28 05:18:17
1	16	331.676959103139	287.98480483421326	20/04/28 05:18:18
1	16	331.7510769851967	288.11174146235567	20/04/28 05:18:18
1	16	331.66658530362514	288.1957925270479	20/04/28 05:18:18
1	16	331.705389649367	288.1791984981095	20/04/28 05:18:18
1	16	331.6053311579213	287.8967711277073	20/04/28 05:18:18
1	16	331.55045219594444	287.87910276002947	20/04/28 05:18:18
1	16	331.5424967842285	287.98751958178843	20/04/28 05:18:18
1	16	331.43646350832677	287.75577243145733	20/04/28 05:18:18
1	16	331.3220651364962	287.54268209890625	20/04/28 05:18:18
1	16	331.3227127551629	287.5438966870619	20/04/28 05:18:18
1	16	331.32103636128073	287.52410544085564	20/04/28 05:18:19
1	16	331.32103636128073	287.52410544085564	20/04/28 05:18:19
1	16	331.43013114416476	287.6011817548451	20/04/28 05:18:19
1	16	331.4370328819349	287.6694213741864	20/04/28 05:18:19
1	16	331.45788020782834	287.78729566998595	20/04/28 05:18:19
1	16	331.3286043187404	288.0980469724154	20/04/28 05:18:19
1	16	331.3858825934649	288.0056504395439	20/04/28 05:18:19
1	16	331.3994420844776	287.9054497622394	20/04/28 05:18:19
1	16	331.3994420844776	287.9054497622394	20/04/28 05:18:19
1	16	331.53368778336284	287.9171613540336	20/04/28 05:18:19
1	16	331.6476153045281	287.87123821051904	20/04/28 05:18:20
1	16	331.72318471409477	287.9179045850479	20/04/28 05:18:20
1	16	331.797085877147	288.00798219135794	20/04/28 05:18:20
1	16	331.7972154784568	288.03692562998947	20/04/28 05:18:20
1	16	331.75571039032155	288.17575018335407	20/04/28 05:18:20
1	16	331.763327315864	288.2022958834734	20/04/28 05:18:20
1	16	331.6004667015603	288.1307369923945	20/04/28 05:18:20
1	16	331.6066526881951	288.13040282209346	20/04/28 05:18:20
1	16	331.3938355314344	288.2120347846017	20/04/28 05:18:20
1	16	331.32305731397054	288.2832544182334	20/04/28 05:18:20
1	16	331.2198763418837	288.1413972500837	20/04/28 05:18:21
1	16	331.3828266922803	288.23130605881	20/04/28 05:18:21
1	16	331.3866711244487	288.1291785890206	20/04/28 05:18:21
1	16	331.4497274367426	288.0692439706218	20/04/28 05:18:21
1	16	331.35725181894577	287.9545132074292	20/04/28 05:18:21
1	16	331.3598415283754	287.9712927131464	20/04/28 05:18:21
1	16	331.4913888312576	288.03673675634826	20/04/28 05:18:21
1	16	331.4886497878762	288.11035852597337	20/04/28 05:18:21
1	16	331.42927888495836	288.21227970038257	20/04/28 05:18:21
1	16	331.4649935138649	288.2389512683883	20/04/28 05:18:22
1	16	331.4583126802015	288.239083342818	20/04/28 05:18:22
1	16	331.4934196440835	288.49395248865727	20/04/28 05:18:22
1	16	331.3284231736891	288.3558249024888	20/04/28 05:18:22
1	16	331.12888681391223	288.3091130781987	20/04/28 05:18:22
1	16	330.99642445274105	287.97050685003745	20/04/28 05:18:22
1	16	331.1252083239813	288.0736232633858	20/04/28 05:18:22
1	16	331.1252083239813	288.0736232633858	20/04/28 05:18:22
1	16	330.8832444133079	288.26413436725556	20/04/28 05:18:22
1	16	331.1279913370391	288.3760414404111	20/04/28 05:18:22
1	16	331.14797228055664	288.17855340281284	20/04/28 05:18:23
1	16	331.10449504777426	288.23383238518375	20/04/28 05:18:23
1	16	331.27770634465924	288.0841512412995	20/04/28 05:18:23
1	16	331.27770634465924	288.0841512412995	20/04/28 05:18:23
1	16	331.1737272120197	288.1660346338997	20/04/28 05:18:23
1	16	331.27753427353014	288.2905509894866	20/04/28 05:18:23
1	16	331.238834243345	288.2349625586435	20/04/28 05:18:23
1	16	331.16292831711183	288.4682707098431	20/04/28 05:18:23
1	16	331.0672076116208	288.4193131392596	20/04/28 05:18:23
1	16	331.08322043758426	288.40672753889305	20/04/28 05:18:24
1	16	331.10595961335014	288.51432817595685	20/04/28 05:18:24
1	16	330.9247591985965	288.30658130793086	20/04/28 05:18:24
1	16	330.7870794989857	288.3787390901336	20/04/28 05:18:24
1	16	330.75883010071897	288.5204846816448	20/04/28 05:18:24
1	16	330.52079731804145	288.69142066469425	20/04/28 05:18:24
1	16	330.52079731804145	288.69142066469425	20/04/28 05:18:24
1	16	330.33652910174743	288.5434321893894	20/04/28 05:18:24
1	16	330.3054432021631	288.5466917410114	20/04/28 05:18:24
1	16	330.3493747214959	288.57069231748693	20/04/28 05:18:24
1	16	330.2745466568546	288.30942287139123	20/04/28 05:18:25
1	16	330.2585356968747	288.3220353870954	20/04/28 05:18:25
1	16	330.3004138211709	288.53162571256223	20/04/28 05:18:25
1	16	330.3513885048722	288.51818174907874	20/04/28 05:18:25
1	16	330.33161574328756	288.58197694468896	20/04/28 05:18:25
1	16	330.3233624132557	288.58011497023665	20/04/28 05:18:25
1	16	330.5936180392939	288.5369504325778	20/04/28 05:18:25
1	16	330.5997690774781	288.5239439990995	20/04/28 05:18:25
1	16	330.66135762222257	288.70236107832085	20/04/28 05:18:25
1	16	330.6273497736497	288.5546413492689	20/04/28 05:18:25
1	16	330.40252810270573	288.58516867109745	20/04/28 05:18:26
1	16	330.35839363466823	288.75968880315	20/04/28 05:18:26
1	16	330.3908617328892	288.9748318239833	20/04/28 05:18:26
1	16	330.3667476588465	288.73197187036817	20/04/28 05:18:26
1	16	330.3514829676249	288.7604062278973	20/04/28 05:18:26
1	16	330.3832486309417	288.66168331853	20/04/28 05:18:26
1	16	330.3684223827385	288.64687241877624	20/04/28 05:18:26
1	16	330.608567078129	288.80510131773804	20/04/28 05:18:26
1	16	330.6525427997665	288.85639783717403	20/04/28 05:18:26
1	16	330.74210372664226	288.68510627666353	20/04/28 05:18:27
1	16	330.5599522339308	288.50263501157997	20/04/28 05:18:27
1	16	330.4409406005983	288.32408187451443	20/04/28 05:18:27
1	16	330.513512444629	288.03656714552847	20/04/28 05:18:27
1	16	330.5745970750085	288.00499451289426	20/04/28 05:18:27
1	16	330.53723078725034	288.0310043976393	20/04/28 05:18:27
1	16	330.57709708250974	288.04418857752324	20/04/28 05:18:27
1	16	330.66678355972476	288.2733778063246	20/04/28 05:18:27
1	16	330.76013879806237	288.106493288976	20/04/28 05:18:27
1	16	330.48147247209937	288.1369114038882	20/04/28 05:18:27
1	16	330.61219927037547	287.9499598825579	20/04/28 05:18:28
1	16	330.64763742630197	287.94121687919534	20/04/28 05:18:28
1	16	330.6166798369076	287.89851284534376	20/04/28 05:18:28
1	16	330.40617778232644	287.85541085964394	20/04/28 05:18:28
1	16	330.6149904692426	287.77416592908753	20/04/28 05:18:28
1	16	330.86128273142674	287.8829405116614	20/04/28 05:18:28
1	16	330.9485645623306	288.0116686044716	20/04/28 05:18:28
1	16	331.1292377749985	287.8310416601638	20/04/28 05:18:28
1	16	331.1292377749985	287.8310416601638	20/04/28 05:18:28
1	16	330.901664906602	287.7009820789318	20/04/28 05:18:28
1	16	330.78979850408757	287.7248064473291	20/04/28 05:18:29
1	16	330.7184855890956	287.5266692168344	20/04/28 05:18:29
1	16	330.73522234945483	287.2392848353268	20/04/28 05:18:29
1	16	330.9361939530284	287.3282305325071	20/04/28 05:18:29
1	16	330.90137688138054	287.4746873721291	20/04/28 05:18:29
1	16	330.87014495951047	287.5178748965907	20/04/28 05:18:29
1	16	330.79040921154615	287.60595739335696	20/04/28 05:18:29
1	16	330.60546651267873	287.5671646266216	20/04/28 05:18:29
1	16	330.610757903413	287.5646789889446	20/04/28 05:18:29
1	16	330.60601177523984	287.83116380777295	20/04/28 05:18:30
1	16	330.7260296527144	287.98738355080735	20/04/28 05:18:30
1	16	330.9268181288739	288.0605351487707	20/04/28 05:18:30
1	16	330.91527444383104	288.0873122940192	20/04/28 05:18:30
1	16	330.6179319329617	288.066849868364	20/04/28 05:18:30
1	16	330.78822776802764	288.2760548480935	20/04/28 05:18:30
1	16	330.95200732942806	288.0568321060183	20/04/28 05:18:30
1	16	330.92300014797434	288.0555210901689	20/04/28 05:18:30
1	16	330.9383861338265	288.06589995541896	20/04/28 05:18:30
1	16	331.1623456789533	288.13175488054424	20/04/28 05:18:30
1	16	330.9978430504882	287.96003795292114	20/04/28 05:18:31
1	16	330.80978025066975	287.95620282361597	20/04/28 05:18:31
1	16	330.8354030580988	287.89845103048424	20/04/28 05:18:31
1	16	331.0016473164778	287.74853905094267	20/04/28 05:18:31
1	16	330.96099058582735	287.8627919468747	20/04/28 05:18:31
1	16	330.7874579787715	288.0728568065607	20/04/28 05:18:31
1	16	330.7887074287854	288.07210955231824	20/04/28 05:18:31
1	16	330.8010922796359	288.30185654465663	20/04/28 05:18:31
1	16	330.76041740024635	288.0572115813811	20/04/28 05:18:31
1	16	330.7025415622443	287.9432484056974	20/04/28 05:18:31
1	16	330.4858189356341	287.7693595289154	20/04/28 05:18:32
1	16	330.39484624578523	287.6716625176452	20/04/28 05:18:32
1	16	330.3756862010482	287.8981689800594	20/04/28 05:18:32
1	16	330.19217809386987	287.7943521358076	20/04/28 05:18:32
1	16	330.1810842101678	287.6369799293727	20/04/28 05:18:32
1	16	330.20318569138374	287.6348087383632	20/04/28 05:18:32
1	16	330.2199276443404	287.7311811408245	20/04/28 05:18:32
1	16	330.29135536104855	287.7969411147553	20/04/28 05:18:32
1	16	330.09459143820396	287.7777070121721	20/04/28 05:18:32
1	16	330.1037437062801	287.85636083410463	20/04/28 05:18:33
1	16	330.0674810609989	287.91651479802516	20/04/28 05:18:33
1	16	330.2463563784686	287.8813066110408	20/04/28 05:18:33
1	16	330.34596457329286	287.8741832330269	20/04/28 05:18:33
1	16	330.3169962382974	287.8715579303892	20/04/28 05:18:33
1	16	330.5005322547922	287.84343696755644	20/04/28 05:18:33
1	16	330.5064728518453	287.7739536263278	20/04/28 05:18:33
1	16	330.6829278220583	288.01499687612545	20/04/28 05:18:33
1	16	330.7393279345806	288.0222298885661	20/04/28 05:18:33
1	16	330.8237815351614	287.987158928198	20/04/28 05:18:33
1	16	330.87669302709213	287.83134729610356	20/04/28 05:18:34
1	16	330.8024875478945	287.6845845996819	20/04/28 05:18:34
1	16	330.8931838613324	287.7893569536537	20/04/28 05:18:34
1	16	330.7887730080435	287.8419764410361	20/04/28 05:18:34
1	16	330.92187978560247	287.9775900842582	20/04/28 05:18:34
1	16	331.1782874975219	288.12872741678024	20/04/28 05:18:34
1	16	331.2908963544822	288.25343475191204	20/04/28 05:18:34
1	16	331.3001579367022	288.21035149975603	20/04/28 05:18:34
1	16	331.49391018682684	288.1560893395326	20/04/28 05:18:34
1	16	331.65390232297256	288.3611890538986	20/04/28 05:18:34
1	16	331.60588772883733	288.4187981287649	20/04/28 05:18:35
1	16	331.83193261236414	288.4363930919599	20/04/28 05:18:35
1	16	331.7486745727065	288.6961165215705	20/04/28 05:18:35
1	16	331.9027526455276	288.85905424294197	20/04/28 05:18:35
1	16	332.0352299741112	288.78112585105345	20/04/28 05:18:35
1	16	331.82240732904444	288.78360412988576	20/04/28 05:18:35
1	16	331.6907915548706	288.646498593952	20/04/28 05:18:35
1	16	331.6907915548706	288.646498593952	20/04/28 05:18:35
1	16	331.6907915548706	288.646498593952	20/04/28 05:18:35
1	16	331.66504118178017	288.4185180427757	20/04/28 05:18:36
1	16	331.5295943847977	288.29696108162585	20/04/28 05:18:36
1	16	331.6502212361885	288.2398385797862	20/04/28 05:18:36
1	16	331.41481433404334	288.4146479667013	20/04/28 05:18:36
1	16	331.5718159209112	288.5763074471675	20/04/28 05:18:36
1	16	331.5959105981748	288.6291814918115	20/04/28 05:18:36
1	16	331.66696778462966	288.38796441770825	20/04/28 05:18:36
1	16	331.74543994896277	288.2837030775132	20/04/28 05:18:36
1	16	331.7470670737504	288.28756554588807	20/04/28 05:18:36
1	16	331.6619402266839	288.3766366673891	20/04/28 05:18:36
1	16	331.6282469916554	288.5284258357099	20/04/28 05:18:37
1	16	331.76067994295886	288.70120767700513	20/04/28 05:18:37
1	16	331.7517166283458	288.69349412109347	20/04/28 05:18:37
1	16	331.7344064500187	288.5336148517648	20/04/28 05:18:37
1	16	331.9873187331483	288.5632748687038	20/04/28 05:18:37
1	16	331.9444275384578	288.39508651040325	20/04/28 05:18:37
1	16	332.0257643048688	288.31287496839775	20/04/28 05:18:37
1	16	331.87474491253835	288.24812349270854	20/04/28 05:18:37
1	16	331.9369241417277	288.1631220809123	20/04/28 05:18:37
1	16	331.96480352147097	288.112748070956	20/04/28 05:18:37
1	16	331.8935889220488	287.89599339420636	20/04/28 05:18:38
1	16	331.924666351257	287.90356361594644	20/04/28 05:18:38
1	16	331.7051114145951	288.06581638873786	20/04/28 05:18:38
1	16	331.808807299371	287.8517888532468	20/04/28 05:18:38
1	16	331.82147280671	287.84320188719624	20/04/28 05:18:38
1	16	331.6620952064656	287.7487979349049	20/04/28 05:18:38
1	16	331.84396695583297	287.81969358351245	20/04/28 05:18:38
1	16	331.8127549824294	287.81534044911433	20/04/28 05:18:38
1	16	331.53884475179564	287.6964713739795	20/04/28 05:18:38
1	16	331.4360822685146	287.6864867740118	20/04/28 05:18:39
1	16	331.4312116601853	287.65601683492736	20/04/28 05:18:39
1	16	331.48671353587855	287.66821370118413	20/04/28 05:18:39
1	16	331.381493314011	287.62736538815165	20/04/28 05:18:39
1	16	331.46674918624024	287.44716588361257	20/04/28 05:18:39
1	16	331.3390283007739	287.4310662414953	20/04/28 05:18:39
1	16	331.508480500521	287.42955791727456	20/04/28 05:18:39
1	16	331.44861492882126	287.5578203698357	20/04/28 05:18:39
1	16	331.61669207546856	287.7912391800828	20/04/28 05:18:39
1	16	331.6619709269974	287.7415495257576	20/04/28 05:18:39
1	16	331.71977318714113	287.51769504547553	20/04/28 05:18:40
1	16	331.9151950116319	287.4269143056487	20/04/28 05:18:40
1	16	331.749311744778	287.6374863055674	20/04/28 05:18:40
1	16	331.74519330401523	287.63072044766363	20/04/28 05:18:40
1	16	331.5318095568845	287.77230831304337	20/04/28 05:18:40
1	16	331.7254384405572	287.5888985111187	20/04/28 05:18:40
1	16	331.98996551357715	287.64738754984273	20/04/28 05:18:40
1	16	331.8753901255588	287.58993709804844	20/04/28 05:18:40
1	16	331.65806125572084	287.4403342169485	20/04/28 05:18:40
1	16	331.8746816895015	287.60797822488547	20/04/28 05:18:40
1	16	331.66290513950577	287.5374641677794	20/04/28 05:18:41
1	16	331.81070052925173	287.6546737270141	20/04/28 05:18:41
1	16	331.76819667359916	287.42093300506343	20/04/28 05:18:41
1	16	331.7301619013301	287.47398503040245	20/04/28 05:18:41
1	16	331.6653715918563	287.50726599027576	20/04/28 05:18:41
1	16	331.45894207066414	287.519379997221	20/04/28 05:18:41
1	16	331.54560312319035	287.5127009150023	20/04/28 05:18:41
1	16	331.5907129639328	287.4671483925565	20/04/28 05:18:41
1	16	331.57795749298845	287.47168305466414	20/04/28 05:18:41
1	16	331.5755677261478	287.29417661393444	20/04/28 05:18:42
1	16	331.82962609401517	287.4224486177707	20/04/28 05:18:42
1	16	331.9053570210832	287.48956735278045	20/04/28 05:18:42
1	16	331.94977471063766	287.19485732041414	20/04/28 05:18:42
1	16	332.156324002391	287.2848794204073	20/04/28 05:18:42
1	16	332.2566987051513	287.31791415379644	20/04/28 05:18:42
1	16	332.49470118784944	287.46454756112206	20/04/28 05:18:42
1	16	332.49100290977356	287.46742820412345	20/04/28 05:18:42
1	16	332.43313326571024	287.5186436132101	20/04/28 05:18:42
1	16	332.4331315580204	287.51834142809844	20/04/28 05:18:42
1	16	332.25779537083116	287.6442537518196	20/04/28 05:18:43
1	16	332.31013014962076	287.6102739375149	20/04/28 05:18:43
1	16	332.3409523566933	287.3832559596835	20/04/28 05:18:43
1	16	332.3808435019079	287.3490106545173	20/04/28 05:18:43
1	16	332.3333100649292	287.37904640153295	20/04/28 05:18:43
1	16	332.5290035080432	287.3985203959568	20/04/28 05:18:43
1	16	332.52547105592737	287.4592687042354	20/04/28 05:18:43
1	16	332.6161161424334	287.4700281722369	20/04/28 05:18:43
1	16	332.70806654574915	287.58627007742956	20/04/28 05:18:43
1	16	332.6729694284149	287.5513499161509	20/04/28 05:18:43
1	16	332.5290051300058	287.2936927980591	20/04/28 05:18:44
1	16	332.6387694433886	287.5543529754968	20/04/28 05:18:44
1	16	332.768201611351	287.29955885395276	20/04/28 05:18:44
1	16	332.8180196051189	287.3103847470343	20/04/28 05:18:44
1	16	332.7970321692353	287.41626152491347	20/04/28 05:18:44
1	16	332.9487630636465	287.24884219889276	20/04/28 05:18:44
1	16	332.9057417348476	287.21838446590283	20/04/28 05:18:44
1	16	332.77001284803345	287.2133531958552	20/04/28 05:18:44
1	16	332.6135258695886	287.4264003383016	20/04/28 05:18:44
1	16	332.572242079892	287.33955300388845	20/04/28 05:18:45
1	16	332.58283922387426	287.13779935970695	20/04/28 05:18:45
1	16	332.54007615842266	287.01157689769883	20/04/28 05:18:45
1	16	332.54007615842266	287.01157689769883	20/04/28 05:18:45
1	16	332.4916894754852	287.24036346198193	20/04/28 05:18:45
1	16	332.355327720818	286.9905037931318	20/04/28 05:18:45
1	16	332.37785572017907	286.8442931054683	20/04/28 05:18:45
1	16	332.30855414893523	286.82235968364785	20/04/28 05:18:45
1	16	332.57970264302367	286.7986457618988	20/04/28 05:18:45
1	16	332.66382485863363	286.7967985860558	20/04/28 05:18:45
1	16	332.66382485863363	286.7967985860558	20/04/28 05:18:46
1	16	332.6575171649941	286.80087493434945	20/04/28 05:18:46
1	16	332.578193453083	286.7955080170337	20/04/28 05:18:46
1	16	332.6749117684918	286.8506157001533	20/04/28 05:18:46
1	16	333.06720422804415	286.84242308073556	20/04/28 05:18:46
1	16	333.2260426865809	286.78088411136815	20/04/28 05:18:46
1	16	333.192981427997	286.82016084826154	20/04/28 05:18:46
1	16	333.2248951526441	286.78577622350616	20/04/28 05:18:46
1	16	333.24312079485304	286.711598581982	20/04/28 05:18:46
1	16	333.257434321668	286.5840444193773	20/04/28 05:18:47
1	16	333.2530156353067	286.5833996867702	20/04/28 05:18:47
1	16	333.2530156353067	286.5833996867702	20/04/28 05:18:47
1	16	333.1409165406898	286.5419576603111	20/04/28 05:18:47
