stationId	t_start	t_end	t_max	timeStamp
92	20/04/28 05:08:49	20/04/28 05:08:49	20/04/28 05:08:49
141	20/04/28 05:08:51	20/04/28 05:08:51	20/04/28 05:08:51
141	20/04/28 05:08:53	20/04/28 05:08:53	20/04/28 05:08:53
141	20/04/28 05:08:55	20/04/28 05:08:55	20/04/28 05:08:55
108	20/04/28 05:08:57	20/04/28 05:08:57	20/04/28 05:08:57
6	20/04/28 05:08:59	20/04/28 05:08:59	20/04/28 05:08:59
108	20/04/28 05:09:01	20/04/28 05:09:02	20/04/28 05:09:01
85	20/04/28 05:09:04	20/04/28 05:09:04	20/04/28 05:09:04
96	20/04/28 05:09:06	20/04/28 05:09:06	20/04/28 05:09:06
49	20/04/28 05:09:08	20/04/28 05:09:08	20/04/28 05:09:08
108	20/04/28 05:09:10	20/04/28 05:09:10	20/04/28 05:09:10
108	20/04/28 05:09:12	20/04/28 05:09:12	20/04/28 05:09:12
6	20/04/28 05:09:14	20/04/28 05:09:14	20/04/28 05:09:14
141	20/04/28 05:09:16	20/04/28 05:09:16	20/04/28 05:09:16
141	20/04/28 05:09:18	20/04/28 05:09:18	20/04/28 05:09:18
108	20/04/28 05:09:20	20/04/28 05:09:22	20/04/28 05:09:22
49	20/04/28 05:09:24	20/04/28 05:09:25	20/04/28 05:09:25
45	20/04/28 05:09:27	20/04/28 05:09:28	20/04/28 05:09:28
108	20/04/28 05:09:30	20/04/28 05:09:30	20/04/28 05:09:30
141	20/04/28 05:09:32	20/04/28 05:09:32	20/04/28 05:09:32
25	20/04/28 05:09:34	20/04/28 05:09:34	20/04/28 05:09:34
48	20/04/28 05:09:36	20/04/28 05:09:36	20/04/28 05:09:36
141	20/04/28 05:09:38	20/04/28 05:09:40	20/04/28 05:09:40
85	20/04/28 05:09:42	20/04/28 05:09:43	20/04/28 05:09:42
84	20/04/28 05:09:45	20/04/28 05:09:45	20/04/28 05:09:45
141	20/04/28 05:09:47	20/04/28 05:09:47	20/04/28 05:09:47
49	20/04/28 05:09:49	20/04/28 05:09:49	20/04/28 05:09:49
25	20/04/28 05:09:51	20/04/28 05:09:51	20/04/28 05:09:51
92	20/04/28 05:09:53	20/04/28 05:09:53	20/04/28 05:09:53
45	20/04/28 05:09:55	20/04/28 05:09:55	20/04/28 05:09:55
141	20/04/28 05:09:57	20/04/28 05:09:57	20/04/28 05:09:57
108	20/04/28 05:09:59	20/04/28 05:09:59	20/04/28 05:09:59
96	20/04/28 05:10:01	20/04/28 05:10:01	20/04/28 05:10:01
63	20/04/28 05:10:03	20/04/28 05:10:03	20/04/28 05:10:03
85	20/04/28 05:10:05	20/04/28 05:10:05	20/04/28 05:10:05
96	20/04/28 05:10:07	20/04/28 05:10:07	20/04/28 05:10:07
85	20/04/28 05:10:09	20/04/28 05:10:09	20/04/28 05:10:09
10	20/04/28 05:10:11	20/04/28 05:10:11	20/04/28 05:10:11
82	20/04/28 05:10:13	20/04/28 05:10:13	20/04/28 05:10:13
82	20/04/28 05:10:15	20/04/28 05:10:15	20/04/28 05:10:15
108	20/04/28 05:10:17	20/04/28 05:10:18	20/04/28 05:10:18
108	20/04/28 05:10:20	20/04/28 05:10:20	20/04/28 05:10:20
139	20/04/28 05:10:22	20/04/28 05:10:22	20/04/28 05:10:22
101	20/04/28 05:10:24	20/04/28 05:10:24	20/04/28 05:10:24
99	20/04/28 05:10:26	20/04/28 05:10:26	20/04/28 05:10:26
92	20/04/28 05:10:28	20/04/28 05:10:28	20/04/28 05:10:28
41	20/04/28 05:10:30	20/04/28 05:10:30	20/04/28 05:10:30
20	20/04/28 05:10:32	20/04/28 05:10:32	20/04/28 05:10:32
85	20/04/28 05:10:34	20/04/28 05:10:35	20/04/28 05:10:35
21	20/04/28 05:10:37	20/04/28 05:11:35	20/04/28 05:10:37
20	20/04/28 05:10:39	20/04/28 05:10:39	20/04/28 05:10:39
142	20/04/28 05:10:41	20/04/28 05:10:41	20/04/28 05:10:41
85	20/04/28 05:10:43	20/04/28 05:10:43	20/04/28 05:10:43
103	20/04/28 05:10:45	20/04/28 05:10:45	20/04/28 05:10:45
121	20/04/28 05:10:47	20/04/28 05:10:47	20/04/28 05:10:47
64	20/04/28 05:10:49	20/04/28 05:10:49	20/04/28 05:10:49
31	20/04/28 05:10:51	20/04/28 05:10:51	20/04/28 05:10:51
84	20/04/28 05:10:53	20/04/28 05:10:54	20/04/28 05:10:54
109	20/04/28 05:10:56	20/04/28 05:10:56	20/04/28 05:10:56
26	20/04/28 05:10:58	20/04/28 05:10:58	20/04/28 05:10:58
78	20/04/28 05:11:00	20/04/28 05:11:00	20/04/28 05:11:00
95	20/04/28 05:11:02	20/04/28 05:11:02	20/04/28 05:11:02
95	20/04/28 05:11:04	20/04/28 05:11:04	20/04/28 05:11:04
78	20/04/28 05:11:06	20/04/28 05:11:06	20/04/28 05:11:06
76	20/04/28 05:11:08	20/04/28 05:11:09	20/04/28 05:11:08
76	20/04/28 05:11:11	20/04/28 05:13:24	20/04/28 05:11:11
76	20/04/28 05:11:13	20/04/28 05:11:13	20/04/28 05:11:13
76	20/04/28 05:11:15	20/04/28 05:11:15	20/04/28 05:11:15
95	20/04/28 05:11:17	20/04/28 05:11:17	20/04/28 05:11:17
93	20/04/28 05:11:19	20/04/28 05:11:21	20/04/28 05:11:21
