floorId	partitionId	location_x	location_y	timeStamp
19	955	328.92321811554416	278.4499778858854	21/02/24 15:41:45
19	955	328.92321811554416	278.4499778858854	21/02/24 15:41:46
19	955	323.9884222877308	280.17133116751256	21/02/24 15:41:47
19	NULL	322.7688919024709	282.9508947625264	21/02/24 15:41:48
19	911	321.43497119517593	280.68483158670483	21/02/24 15:41:49
19	897	319.01521359261704	283.59757186890573	21/02/24 15:41:50
19	897	319.01521359261704	283.59757186890573	21/02/24 15:41:51
19	897	319.01521359261704	283.59757186890573	21/02/24 15:41:52
19	897	319.01521359261704	283.59757186890573	21/02/24 15:41:53
19	897	319.01521359261704	283.59757186890573	21/02/24 15:41:54
19	897	319.01521359261704	283.59757186890573	21/02/24 15:41:55
19	897	319.01521359261704	283.59757186890573	21/02/24 15:41:56
19	897	319.01521359261704	283.59757186890573	21/02/24 15:41:57
19	897	319.01521359261704	283.59757186890573	21/02/24 15:41:58
19	897	319.01521359261704	283.59757186890573	21/02/24 15:41:59
19	897	319.01521359261704	283.59757186890573	21/02/24 15:42:00
19	897	319.01521359261704	283.59757186890573	21/02/24 15:42:01
19	897	319.01521359261704	283.59757186890573	21/02/24 15:42:02
19	897	319.01521359261704	283.59757186890573	21/02/24 15:42:03
19	897	319.01521359261704	283.59757186890573	21/02/24 15:42:04
19	897	319.01521359261704	283.59757186890573	21/02/24 15:42:05
19	NULL	322.7688919024709	282.9508947625264	21/02/24 15:42:06
19	NULL	322.7688919024709	282.9508947625264	21/02/24 15:42:07
19	NULL	322.7688919024709	282.9508947625264	21/02/24 15:42:08
19	NULL	326.26653567240857	280.50725420525265	21/02/24 15:42:09
19	955	328.92321811554416	278.4499778858854	21/02/24 15:42:10
19	955	328.92321811554416	278.4499778858854	21/02/24 15:42:11
19	955	328.92321811554416	278.4499778858854	21/02/24 15:42:12
19	955	331.57961022726676	277.2385535448373	21/02/24 15:42:13
19	955	331.5796102272668	277.2385535448373	21/02/24 15:42:14
19	964	340.04388943277826	286.2192342684243	21/02/24 15:42:15
19	964	344.3155484927012	283.53998029232963	21/02/24 15:42:16
19	895	344.21493558062156	279.99700365155473	21/02/24 15:42:17
19	964	349.72234002988336	284.71465847817086	21/02/24 15:42:18
19	964	355.482293890607	282.3613173869535	21/02/24 15:42:19
19	964	355.482293890607	282.3613173869535	21/02/24 15:42:20
19	964	355.482293890607	282.3613173869535	21/02/24 15:42:21
19	964	355.482293890607	282.3613173869535	21/02/24 15:42:22
19	990	357.82242061436574	282.16385269148645	21/02/24 15:42:23
19	NULL	360.5547106147949	283.12207921272073	21/02/24 15:42:24
19	NULL	360.5547106147949	283.12207921272073	21/02/24 15:42:25
19	987	363.64647505929315	279.84759664761776	21/02/24 15:42:26
19	987	363.64647505929315	279.84759664761776	21/02/24 15:42:27
19	990	373.5702263177357	281.590961967497	21/02/24 15:42:28
19	990	373.5702263177357	281.590961967497	21/02/24 15:42:29
19	990	373.5702263177357	281.590961967497	21/02/24 15:42:30
19	990	371.87975649755595	282.80894332222346	21/02/24 15:42:31
19	916	368.9161621983441	278.6773366657135	21/02/24 15:42:32
19	990	371.87975649755595	282.80894332222346	21/02/24 15:42:33
19	910	371.49991506597235	283.64243362381774	21/02/24 15:42:34
19	916	368.5363207667605	279.5108269673078	21/02/24 15:42:35
19	990	373.5702263177357	281.590961967497	21/02/24 15:42:36
19	990	371.87975649755595	282.80894332222346	21/02/24 15:42:37
19	990	373.5702263177357	281.590961967497	21/02/24 15:42:38
19	910	371.49991506597235	283.6424336238178	21/02/24 15:42:39
19	990	373.5702263177357	281.590961967497	21/02/24 15:42:40
19	990	371.87975649755595	282.80894332222346	21/02/24 15:42:41
19	990	371.87975649755595	282.80894332222346	21/02/24 15:42:42
19	990	371.87975649755595	282.80894332222346	21/02/24 15:42:43
19	990	373.5702263177357	281.590961967497	21/02/24 15:42:44
19	916	368.9161621983441	278.6773366657135	21/02/24 15:42:45
19	990	371.87975649755595	282.80894332222346	21/02/24 15:42:46
19	990	373.5702263177357	281.590961967497	21/02/24 15:42:47
19	990	373.5702263177357	281.590961967497	21/02/24 15:42:48
19	990	371.87975649755595	282.80894332222346	21/02/24 15:42:49
19	910	371.49991506597235	283.6424336238178	21/02/24 15:42:50
19	990	373.5702263177357	281.590961967497	21/02/24 15:42:51
19	910	370.71450762367743	283.2705337912132	21/02/24 15:42:52
19	990	373.5702263177357	281.590961967497	21/02/24 15:42:53
19	990	373.5702263177357	281.590961967497	21/02/24 15:42:54
19	990	373.5702263177357	281.590961967497	21/02/24 15:42:55
19	990	373.5702263177357	281.590961967497	21/02/24 15:42:56
19	990	371.87975649755595	282.80894332222346	21/02/24 15:42:57
19	910	371.49991506597235	283.6424336238178	21/02/24 15:42:58
19	910	371.49991506597235	283.6424336238178	21/02/24 15:42:59
19	990	373.5702263177357	281.590961967497	21/02/24 15:43:00
19	990	373.5702263177357	281.590961967497	21/02/24 15:43:01
19	990	371.87975649755595	282.80894332222346	21/02/24 15:43:02
19	990	373.5702263177357	281.590961967497	21/02/24 15:43:03
19	990	373.5702263177357	281.590961967497	21/02/24 15:43:04
19	990	373.5702263177357	281.590961967497	21/02/24 15:43:05
19	990	373.5702263177357	281.5909619674969	21/02/24 15:43:06
19	905	375.09542798338026	284.54571340969284	21/02/24 15:43:07
19	905	375.1484764138781	287.03143447263193	21/02/24 15:43:08
19	905	375.1484764138781	287.03143447263193	21/02/24 15:43:09
19	905	375.1484764138781	287.03143447263193	21/02/24 15:43:10
19	905	375.1484764138781	287.03143447263193	21/02/24 15:43:11
19	905	375.1484764138781	287.03143447263193	21/02/24 15:43:12
19	905	375.1484764138781	287.03143447263193	21/02/24 15:43:13
19	905	375.1484764138781	287.03143447263193	21/02/24 15:43:14
19	905	375.1484764138781	287.03143447263193	21/02/24 15:43:15
19	905	375.1484764138781	287.03143447263193	21/02/24 15:43:16
19	905	375.1484764138781	287.03143447263193	21/02/24 15:43:17
19	905	375.1484764138781	287.03143447263193	21/02/24 15:43:18
19	905	375.1484764138781	287.03143447263193	21/02/24 15:43:19
19	905	375.1484764138781	287.03143447263193	21/02/24 15:43:20
19	905	375.1484764138781	287.03143447263193	21/02/24 15:43:21
19	905	375.1484764138781	287.03143447263193	21/02/24 15:43:22
19	905	375.1484764138781	287.03143447263193	21/02/24 15:43:23
19	905	375.1484764138781	287.03143447263193	21/02/24 15:43:24
19	905	375.1484764138781	287.03143447263193	21/02/24 15:43:25
19	905	375.1484764138781	287.03143447263193	21/02/24 15:43:26
19	905	375.1484764138781	287.03143447263193	21/02/24 15:43:27
19	905	375.1484764138781	287.03143447263193	21/02/24 15:43:28
19	905	375.1484764138781	287.03143447263193	21/02/24 15:43:29
19	905	375.1484764138781	287.03143447263193	21/02/24 15:43:30
19	905	375.1484764138781	287.03143447263193	21/02/24 15:43:31
19	905	375.1484764138781	287.03143447263193	21/02/24 15:43:32
19	905	375.1484764138781	287.03143447263193	21/02/24 15:43:33
19	905	375.1484764138781	287.03143447263193	21/02/24 15:43:34
19	905	375.1484764138781	287.03143447263193	21/02/24 15:43:35
19	905	375.1484764138781	287.03143447263193	21/02/24 15:43:36
19	905	375.1484764138781	287.03143447263193	21/02/24 15:43:37
19	905	375.1484764138781	287.03143447263193	21/02/24 15:43:38
19	905	373.45800659369826	288.2494158273584	21/02/24 15:43:39
19	905	375.1484764138781	287.03143447263193	21/02/24 15:43:40
19	905	375.1484764138781	287.03143447263193	21/02/24 15:43:41
19	905	375.09542798338026	284.54571340969284	21/02/24 15:43:42
19	990	373.5702263177357	281.5909619674969	21/02/24 15:43:43
19	990	373.5702263177357	281.590961967497	21/02/24 15:43:44
19	910	371.49991506597235	283.6424336238178	21/02/24 15:43:45
19	NULL	368.6441963719141	285.32200544753397	21/02/24 15:43:46
19	958	364.8238741505902	287.1482151372541	21/02/24 15:43:47
19	959	362.3530560401282	287.71527633822046	21/02/24 15:43:48
19	959	362.3530560401282	287.71527633822046	21/02/24 15:43:49
19	NULL	360.5547106147948	283.12207921272073	21/02/24 15:43:50
19	918	358.31519680311567	286.86252054896266	21/02/24 15:43:51
19	964	355.482293890607	282.36131738695343	21/02/24 15:43:52
19	968	355.71807547868275	279.11092240486005	21/02/24 15:43:53
19	945	357.7218077022862	278.62087605071156	21/02/24 15:43:54
19	968	355.71807547868275	279.11092240486005	21/02/24 15:43:55
19	964	355.482293890607	282.36131738695343	21/02/24 15:43:56
19	945	357.72180770228624	278.62087605071156	21/02/24 15:43:57
19	968	355.71807547868275	279.11092240486005	21/02/24 15:43:58
19	945	357.7218077022862	278.62087605071156	21/02/24 15:43:59
19	945	357.72180770228624	278.62087605071156	21/02/24 15:44:00
19	968	355.71807547868275	279.11092240486005	21/02/24 15:44:01
19	964	355.482293890607	282.3613173869535	21/02/24 15:44:02
19	964	355.482293890607	282.3613173869535	21/02/24 15:44:03
19	945	357.7218077022862	278.62087605071156	21/02/24 15:44:04
19	945	357.72180770228624	278.62087605071156	21/02/24 15:44:05
19	945	357.7218077022862	278.62087605071156	21/02/24 15:44:06
19	968	355.71807547868275	279.11092240486005	21/02/24 15:44:07
19	945	357.72180770228624	278.62087605071156	21/02/24 15:44:08
19	945	357.7218077022862	278.62087605071156	21/02/24 15:44:09
19	968	355.71807547868275	279.11092240486005	21/02/24 15:44:10
19	945	357.72180770228624	278.62087605071156	21/02/24 15:44:11
19	945	357.72180770228624	278.62087605071156	21/02/24 15:44:12
19	945	357.7218077022862	278.62087605071156	21/02/24 15:44:13
19	968	355.71807547868275	279.11092240486005	21/02/24 15:44:14
19	968	355.71807547868275	279.11092240486005	21/02/24 15:44:15
19	945	357.7218077022862	278.62087605071156	21/02/24 15:44:16
19	945	357.72180770228624	278.62087605071156	21/02/24 15:44:17
19	945	357.72180770228624	278.62087605071156	21/02/24 15:44:18
19	945	357.72180770228624	278.62087605071156	21/02/24 15:44:19
19	945	357.7218077022862	278.62087605071156	21/02/24 15:44:20
19	964	355.482293890607	282.3613173869535	21/02/24 15:44:21
19	945	357.7218077022862	278.62087605071156	21/02/24 15:44:22
19	964	355.482293890607	282.3613173869535	21/02/24 15:44:23
19	968	355.71807547868275	279.11092240486005	21/02/24 15:44:24
19	964	355.482293890607	282.3613173869535	21/02/24 15:44:25
19	968	355.71807547868275	279.11092240486005	21/02/24 15:44:26
19	945	357.72180770228624	278.62087605071156	21/02/24 15:44:27
19	964	355.482293890607	282.36131738695343	21/02/24 15:44:28
19	945	357.72180770228624	278.62087605071156	21/02/24 15:44:29
19	964	355.482293890607	282.36131738695343	21/02/24 15:44:30
19	945	357.72180770228624	278.62087605071156	21/02/24 15:44:31
19	968	355.71807547868275	279.11092240486005	21/02/24 15:44:32
19	968	355.71807547868275	279.11092240486005	21/02/24 15:44:33
19	968	355.71807547868275	279.11092240486005	21/02/24 15:44:35
19	964	355.482293890607	282.3613173869535	21/02/24 15:44:36
19	945	357.7218077022862	278.62087605071156	21/02/24 15:44:37
19	964	355.482293890607	282.3613173869535	21/02/24 15:44:38
19	964	355.482293890607	282.3613173869535	21/02/24 15:44:39
19	964	355.482293890607	282.3613173869535	21/02/24 15:44:40
19	945	357.7218077022862	278.62087605071156	21/02/24 15:44:41
19	968	355.71807547868275	279.11092240486005	21/02/24 15:44:42
19	964	355.482293890607	282.3613173869535	21/02/24 15:44:43
19	968	355.71807547868275	279.11092240486005	21/02/24 15:44:44
19	968	355.71807547868275	279.11092240486005	21/02/24 15:44:45
19	964	355.482293890607	282.3613173869535	21/02/24 15:44:46
19	964	355.482293890607	282.36131738695343	21/02/24 15:44:47
19	968	355.71807547868275	279.11092240486005	21/02/24 15:44:48
19	968	355.71807547868275	279.11092240486005	21/02/24 15:44:49
19	945	357.72180770228624	278.62087605071156	21/02/24 15:44:50
19	964	355.482293890607	282.3613173869535	21/02/24 15:44:51
19	968	355.71807547868275	279.11092240486005	21/02/24 15:44:52
19	968	355.71807547868275	279.11092240486005	21/02/24 15:44:53
19	968	355.71807547868275	279.11092240486005	21/02/24 15:44:54
19	964	355.482293890607	282.3613173869535	21/02/24 15:44:55
19	968	355.71807547868275	279.11092240486005	21/02/24 15:44:56
19	968	355.71807547868275	279.11092240486005	21/02/24 15:44:57
19	945	357.7218077022862	278.62087605071156	21/02/24 15:44:58
19	964	355.482293890607	282.3613173869535	21/02/24 15:44:59
19	945	357.72180770228624	278.62087605071156	21/02/24 15:45:00
19	945	357.72180770228624	278.62087605071156	21/02/24 15:45:01
19	968	355.71807547868275	279.11092240486005	21/02/24 15:45:02
19	968	355.71807547868275	279.11092240486005	21/02/24 15:45:03
19	968	355.71807547868275	279.11092240486005	21/02/24 15:45:04
19	964	355.482293890607	282.3613173869535	21/02/24 15:45:05
19	964	355.482293890607	282.3613173869535	21/02/24 15:45:06
19	968	355.71807547868275	279.11092240486005	21/02/24 15:45:07
19	968	355.71807547868275	279.11092240486005	21/02/24 15:45:08
19	964	355.482293890607	282.36131738695343	21/02/24 15:45:09
19	968	355.71807547868275	279.11092240486005	21/02/24 15:45:10
19	968	355.71807547868275	279.11092240486005	21/02/24 15:45:11
19	945	357.7218077022862	278.62087605071156	21/02/24 15:45:12
19	964	355.482293890607	282.3613173869535	21/02/24 15:45:13
19	945	357.72180770228624	278.62087605071156	21/02/24 15:45:14
19	945	357.72180770228624	278.62087605071156	21/02/24 15:45:15
19	945	357.7218077022862	278.62087605071156	21/02/24 15:45:16
19	964	355.482293890607	282.36131738695343	21/02/24 15:45:17
19	968	355.71807547868275	279.11092240486005	21/02/24 15:45:18
19	964	355.482293890607	282.3613173869535	21/02/24 15:45:19
