floorId	partitionId	location_x	location_y	timeStamp
1	93	328.79084630992185	296.9912736704645	20/04/28 05:16:02
1	NULL	325.10665004993047	306.78063567872346	20/04/28 05:16:03
1	93	328.8807185783794	295.3720814225117	20/04/28 05:16:04
1	93	330.8342045067989	295.0035892194314	20/04/28 05:16:05
1	93	328.79084630992185	296.9912736704645	20/04/28 05:16:06
1	93	330.8342045067989	295.0035892194314	20/04/28 05:16:07
1	93	330.8342045067989	295.0035892194314	20/04/28 05:16:08
1	93	330.8342045067989	295.0035892194314	20/04/28 05:16:09
1	93	330.07485293217565	294.77316651876737	20/04/28 05:16:10
1	93	331.8474126053512	298.3506628820678	20/04/28 05:16:11
1	93	331.2687762588511	298.2814485476688	20/04/28 05:16:12
1	93	328.8807185783794	295.3720814225117	20/04/28 05:16:13
1	93	328.52677509836946	297.7242657498841	20/04/28 05:16:14
1	93	328.79084630992185	296.9912736704645	20/04/28 05:16:15
1	93	328.79084630992185	296.9912736704645	20/04/28 05:16:16
1	93	328.88071857837946	295.3720814225117	20/04/28 05:16:17
1	93	328.88071857837946	295.3720814225117	20/04/28 05:16:18
1	93	328.79084630992185	296.9912736704645	20/04/28 05:16:19
1	93	331.2687762588511	298.2814485476688	20/04/28 05:16:20
1	93	328.79084630992185	296.9912736704645	20/04/28 05:16:21
1	93	328.52677509836946	297.7242657498841	20/04/28 05:16:22
1	93	328.79084630992185	296.9912736704645	20/04/28 05:16:23
1	93	328.52677509836946	297.7242657498841	20/04/28 05:16:24
1	93	328.79084630992185	296.9912736704645	20/04/28 05:16:25
1	93	328.79084630992185	296.9912736704645	20/04/28 05:16:26
1	93	328.79084630992185	296.9912736704645	20/04/28 05:16:27
1	93	325.2351698940949	295.7424387172771	20/04/28 05:16:28
1	93	325.2351698940949	295.7424387172771	20/04/28 05:16:29
1	93	326.45134060531365	296.51760048966685	20/04/28 05:16:30
1	93	324.9710986825425	296.4754307966967	20/04/28 05:16:31
1	93	325.2351698940949	295.7424387172771	20/04/28 05:16:32
1	93	324.9710986825425	296.4754307966967	20/04/28 05:16:33
1	93	324.9710986825425	296.4754307966967	20/04/28 05:16:34
1	93	324.9710986825425	296.4754307966967	20/04/28 05:16:35
1	93	325.2351698940949	295.7424387172771	20/04/28 05:16:36
1	93	325.2351698940949	295.7424387172771	20/04/28 05:16:37
1	93	324.9710986825425	296.4754307966967	20/04/28 05:16:38
1	93	325.2351698940949	295.7424387172771	20/04/28 05:16:39
1	93	324.9710986825425	296.4754307966967	20/04/28 05:16:40
1	93	325.2351698940949	295.7424387172771	20/04/28 05:16:41
1	93	324.9710986825425	296.4754307966967	20/04/28 05:16:42
1	93	325.2351698940949	295.7424387172771	20/04/28 05:16:43
1	93	324.9710986825425	296.4754307966967	20/04/28 05:16:44
1	93	324.9710986825425	296.4754307966967	20/04/28 05:16:45
1	93	325.2351698940949	295.7424387172771	20/04/28 05:16:46
1	93	324.9710986825425	296.4754307966967	20/04/28 05:16:47
1	93	324.9710986825425	296.4754307966967	20/04/28 05:16:48
1	93	325.2351698940949	295.7424387172771	20/04/28 05:16:49
1	93	325.2351698940949	295.7424387172771	20/04/28 05:16:50
1	93	325.2351698940949	295.7424387172771	20/04/28 05:16:51
1	93	325.2351698940949	295.7424387172771	20/04/28 05:16:52
1	93	325.2351698940949	295.7424387172771	20/04/28 05:16:53
1	93	324.9710986825425	296.4754307966967	20/04/28 05:16:54
1	93	325.2351698940949	295.7424387172771	20/04/28 05:16:55
1	93	324.9710986825425	296.4754307966967	20/04/28 05:16:56
1	93	325.2351698940949	295.7424387172771	20/04/28 05:16:57
1	93	325.2351698940949	295.7424387172771	20/04/28 05:16:58
1	93	325.2351698940949	295.7424387172771	20/04/28 05:16:59
1	93	326.45134060531365	296.51760048966685	20/04/28 05:17:00
1	93	324.9710986825425	296.4754307966967	20/04/28 05:17:01
1	93	328.52677509836946	297.72426574988407	20/04/28 05:17:02
1	93	328.52677509836946	297.72426574988407	20/04/28 05:17:03
1	93	325.2351698940949	295.7424387172771	20/04/28 05:17:04
1	93	325.2351698940949	295.7424387172771	20/04/28 05:17:05
1	93	324.9710986825425	296.4754307966967	20/04/28 05:17:06
1	93	324.9710986825425	296.4754307966967	20/04/28 05:17:07
1	93	324.9710986825425	296.4754307966967	20/04/28 05:17:08
1	93	325.2351698940949	295.7424387172771	20/04/28 05:17:09
1	93	328.79084630992185	296.9912736704645	20/04/28 05:17:10
1	93	328.79084630992185	296.9912736704645	20/04/28 05:17:11
1	93	325.2351698940949	295.7424387172771	20/04/28 05:17:12
1	93	325.2351698940949	295.7424387172771	20/04/28 05:17:13
1	93	326.45134060531365	296.51760048966685	20/04/28 05:17:14
1	93	324.9710986825425	296.4754307966967	20/04/28 05:17:15
1	93	325.32504216255245	294.1232464693243	20/04/28 05:17:16
1	93	328.8807185783794	295.3720814225117	20/04/28 05:17:17
1	93	325.2351698940949	295.7424387172771	20/04/28 05:17:18
1	93	325.2351698940949	295.7424387172771	20/04/28 05:17:19
1	93	325.2351698940949	295.7424387172771	20/04/28 05:17:20
1	93	325.2351698940949	295.7424387172771	20/04/28 05:17:21
1	93	324.9710986825425	296.4754307966967	20/04/28 05:17:22
1	93	325.32504216255245	294.1232464693243	20/04/28 05:17:23
1	93	325.3250421625525	294.12324646932433	20/04/28 05:17:24
1	93	325.2351698940949	295.7424387172771	20/04/28 05:17:25
1	93	325.2351698940949	295.7424387172771	20/04/28 05:17:26
1	93	326.80528408532365	294.16541616229443	20/04/28 05:17:27
1	93	325.3250421625525	294.12324646932433	20/04/28 05:17:28
1	93	325.2351698940949	295.7424387172771	20/04/28 05:17:29
1	93	325.3250421625525	294.12324646932433	20/04/28 05:17:30
1	93	325.2351698940949	295.7424387172771	20/04/28 05:17:31
1	93	325.3250421625525	294.12324646932433	20/04/28 05:17:32
1	93	324.9710986825425	296.4754307966967	20/04/28 05:17:33
1	93	325.2351698940949	295.7424387172771	20/04/28 05:17:34
1	93	325.2351698940949	295.7424387172771	20/04/28 05:17:35
1	93	325.2351698940949	295.7424387172771	20/04/28 05:17:36
1	93	325.2351698940949	295.7424387172771	20/04/28 05:17:37
1	93	324.9710986825425	296.4754307966967	20/04/28 05:17:38
1	93	325.3250421625525	294.12324646932433	20/04/28 05:17:39
1	93	325.3250421625525	294.12324646932433	20/04/28 05:17:40
1	93	325.3250421625525	294.12324646932433	20/04/28 05:17:41
1	93	324.9710986825425	296.4754307966967	20/04/28 05:17:42
1	93	324.9710986825425	296.4754307966967	20/04/28 05:17:43
1	93	325.2351698940949	295.7424387172771	20/04/28 05:17:44
1	93	325.3250421625525	294.12324646932433	20/04/28 05:17:45
1	93	325.2351698940949	295.7424387172771	20/04/28 05:17:46
1	93	324.9710986825425	296.4754307966967	20/04/28 05:17:47
1	93	325.2351698940949	295.7424387172771	20/04/28 05:17:48
1	93	325.2351698940949	295.7424387172771	20/04/28 05:17:49
1	93	324.9710986825425	296.4754307966967	20/04/28 05:17:50
1	93	325.2351698940949	295.7424387172771	20/04/28 05:17:51
1	93	324.9710986825425	296.4754307966967	20/04/28 05:17:52
1	93	324.9710986825425	296.4754307966967	20/04/28 05:17:53
1	93	325.2351698940949	295.7424387172771	20/04/28 05:17:54
1	93	324.9710986825425	296.4754307966967	20/04/28 05:17:55
1	93	324.9710986825425	296.4754307966967	20/04/28 05:17:56
1	93	324.9710986825425	296.4754307966967	20/04/28 05:17:57
1	93	324.9710986825425	296.4754307966967	20/04/28 05:17:58
1	93	325.2351698940949	295.7424387172771	20/04/28 05:17:59
1	93	325.3250421625525	294.12324646932433	20/04/28 05:18:00
1	93	325.2351698940949	295.7424387172771	20/04/28 05:18:01
1	93	324.9710986825425	296.4754307966967	20/04/28 05:18:02
1	93	325.2351698940949	295.7424387172771	20/04/28 05:18:03
1	93	325.2351698940949	295.7424387172771	20/04/28 05:18:04
