deviceId	device_location_x	device_location_y	rssi_measurement	timeStamp
114	381.5992223502213	289.5952994882171	-67	21/02/24 15:47:21
116	377.9647653672978	286.9907349984353	-61	21/02/24 15:47:21
115	377.751717565356	288.3800056854842	-62	21/02/24 15:47:21
96	377.44892680179316	276.8922953490967	-65	21/02/24 15:47:21
94	371.72787175525207	289.5180158335357	-53	21/02/24 15:47:21
92	370.6727223195025	288.1316940639638	-50	21/02/24 15:47:21
110	367.98757076589385	277.42210180952264	-60	21/02/24 15:47:21
93	366.9922408772935	287.5344913496744	-38	21/02/24 15:47:21
109	365.34205862707444	280.9445005087476	-55	21/02/24 15:47:21
112	360.33084939037263	282.2851479696295	-58	21/02/24 15:47:21
111	349.3574161788773	282.0413831973989	-70	21/02/24 15:47:21
102	348.60037065169166	290.2443240990335	-68	21/02/24 15:47:21
119	363.6527972760671	276.499073089803	-62	21/02/24 15:47:21
118	357.09356967635637	275.4844405310735	-68	21/02/24 15:47:21
117	369.239898205492	274.21448833832176	-62	21/02/24 15:47:21
108	354.5433741308232	271.8469578377465	-71	21/02/24 15:47:21
97	362.5947869084557	269.0761103596411	-70	21/02/24 15:47:21

114	381.5992223502213	289.5952994882171	-64	21/02/24 15:47:22
116	377.9647653672978	286.9907349984353	-63	21/02/24 15:47:22
115	377.751717565356	288.3800056854842	-60	21/02/24 15:47:22
96	377.44892680179316	276.8922953490967	-63	21/02/24 15:47:22
94	371.72787175525207	289.5180158335357	-53	21/02/24 15:47:22
92	370.6727223195025	288.1316940639638	-46	21/02/24 15:47:22
110	367.98757076589385	277.42210180952264	-59	21/02/24 15:47:22
93	366.9922408772935	287.5344913496744	-39	21/02/24 15:47:22
109	365.34205862707444	280.9445005087476	-56	21/02/24 15:47:22
112	360.33084939037263	282.2851479696295	-58	21/02/24 15:47:22
111	349.3574161788773	282.0413831973989	-72	21/02/24 15:47:22
102	348.60037065169166	290.2443240990335	-70	21/02/24 15:47:22
119	363.6527972760671	276.499073089803	-62	21/02/24 15:47:22
118	357.09356967635637	275.4844405310735	-67	21/02/24 15:47:22
117	369.239898205492	274.21448833832176	-64	21/02/24 15:47:22
108	354.5433741308232	271.8469578377465	-69	21/02/24 15:47:22
97	362.5947869084557	269.0761103596411	-69	21/02/24 15:47:22

114	381.5992223502213	289.5952994882171	-68	21/02/24 15:47:23
116	377.9647653672978	286.9907349984353	-61	21/02/24 15:47:23
115	377.751717565356	288.3800056854842	-60	21/02/24 15:47:23
96	377.44892680179316	276.8922953490967	-66	21/02/24 15:47:23
94	371.72787175525207	289.5180158335357	-51	21/02/24 15:47:23
92	370.6727223195025	288.1316940639638	-50	21/02/24 15:47:23
110	367.98757076589385	277.42210180952264	-61	21/02/24 15:47:23
93	366.9922408772935	287.5344913496744	-40	21/02/24 15:47:23
109	365.34205862707444	280.9445005087476	-56	21/02/24 15:47:23
112	360.33084939037263	282.2851479696295	-60	21/02/24 15:47:23
111	349.3574161788773	282.0413831973989	-69	21/02/24 15:47:23
102	348.60037065169166	290.2443240990335	-70	21/02/24 15:47:23
119	363.6527972760671	276.499073089803	-61	21/02/24 15:47:23
118	357.09356967635637	275.4844405310735	-67	21/02/24 15:47:23
117	369.239898205492	274.21448833832176	-63	21/02/24 15:47:23
108	354.5433741308232	271.8469578377465	-72	21/02/24 15:47:23
97	362.5947869084557	269.0761103596411	-67	21/02/24 15:47:23

114	381.5992223502213	289.5952994882171	-67	21/02/24 15:47:24
116	377.9647653672978	286.9907349984353	-63	21/02/24 15:47:24
115	377.751717565356	288.3800056854842	-61	21/02/24 15:47:24
96	377.44892680179316	276.8922953490967	-64	21/02/24 15:47:24
94	371.72787175525207	289.5180158335357	-54	21/02/24 15:47:24
92	370.6727223195025	288.1316940639638	-49	21/02/24 15:47:24
110	367.98757076589385	277.42210180952264	-61	21/02/24 15:47:24
93	366.9922408772935	287.5344913496744	-39	21/02/24 15:47:24
109	365.34205862707444	280.9445005087476	-52	21/02/24 15:47:24
112	360.33084939037263	282.2851479696295	-59	21/02/24 15:47:24
111	349.3574161788773	282.0413831973989	-71	21/02/24 15:47:24
102	348.60037065169166	290.2443240990335	-69	21/02/24 15:47:24
119	363.6527972760671	276.499073089803	-63	21/02/24 15:47:24
118	357.09356967635637	275.4844405310735	-68	21/02/24 15:47:24
117	369.239898205492	274.21448833832176	-62	21/02/24 15:47:24
108	354.5433741308232	271.8469578377465	-69	21/02/24 15:47:24
97	362.5947869084557	269.0761103596411	-68	21/02/24 15:47:24

114	381.5992223502213	289.5952994882171	-67	21/02/24 15:47:25
116	377.9647653672978	286.9907349984353	-64	21/02/24 15:47:25
115	377.751717565356	288.3800056854842	-62	21/02/24 15:47:25
96	377.44892680179316	276.8922953490967	-65	21/02/24 15:47:25
94	371.72787175525207	289.5180158335357	-53	21/02/24 15:47:25
92	370.6727223195025	288.1316940639638	-48	21/02/24 15:47:25
110	367.98757076589385	277.42210180952264	-58	21/02/24 15:47:25
93	366.9922408772935	287.5344913496744	-37	21/02/24 15:47:25
109	365.34205862707444	280.9445005087476	-54	21/02/24 15:47:25
112	360.33084939037263	282.2851479696295	-60	21/02/24 15:47:25
111	349.3574161788773	282.0413831973989	-71	21/02/24 15:47:25
102	348.60037065169166	290.2443240990335	-72	21/02/24 15:47:25
119	363.6527972760671	276.499073089803	-62	21/02/24 15:47:25
118	357.09356967635637	275.4844405310735	-68	21/02/24 15:47:25
117	369.239898205492	274.21448833832176	-62	21/02/24 15:47:25
108	354.5433741308232	271.8469578377465	-71	21/02/24 15:47:25
97	362.5947869084557	269.0761103596411	-70	21/02/24 15:47:25

114	381.5992223502213	289.5952994882171	-67	21/02/24 15:47:26
116	377.9647653672978	286.9907349984353	-61	21/02/24 15:47:26
115	377.751717565356	288.3800056854842	-60	21/02/24 15:47:26
96	377.44892680179316	276.8922953490967	-64	21/02/24 15:47:26
94	371.72787175525207	289.5180158335357	-52	21/02/24 15:47:26
92	370.6727223195025	288.1316940639638	-47	21/02/24 15:47:26
110	367.98757076589385	277.42210180952264	-58	21/02/24 15:47:26
93	366.9922408772935	287.5344913496744	-37	21/02/24 15:47:26
109	365.34205862707444	280.9445005087476	-53	21/02/24 15:47:26
112	360.33084939037263	282.2851479696295	-60	21/02/24 15:47:26
111	349.3574161788773	282.0413831973989	-69	21/02/24 15:47:26
102	348.60037065169166	290.2443240990335	-71	21/02/24 15:47:26
119	363.6527972760671	276.499073089803	-63	21/02/24 15:47:26
118	357.09356967635637	275.4844405310735	-68	21/02/24 15:47:26
117	369.239898205492	274.21448833832176	-64	21/02/24 15:47:26
108	354.5433741308232	271.8469578377465	-69	21/02/24 15:47:26
97	362.5947869084557	269.0761103596411	-69	21/02/24 15:47:26

114	381.5992223502213	289.5952994882171	-66	21/02/24 15:47:27
116	377.9647653672978	286.9907349984353	-63	21/02/24 15:47:27
115	377.751717565356	288.3800056854842	-61	21/02/24 15:47:27
96	377.44892680179316	276.8922953490967	-67	21/02/24 15:47:27
94	371.72787175525207	289.5180158335357	-56	21/02/24 15:47:27
92	370.6727223195025	288.1316940639638	-47	21/02/24 15:47:27
110	367.98757076589385	277.42210180952264	-61	21/02/24 15:47:27
93	366.9922408772935	287.5344913496744	-38	21/02/24 15:47:27
109	365.34205862707444	280.9445005087476	-53	21/02/24 15:47:27
112	360.33084939037263	282.2851479696295	-57	21/02/24 15:47:27
111	349.3574161788773	282.0413831973989	-69	21/02/24 15:47:27
102	348.60037065169166	290.2443240990335	-71	21/02/24 15:47:27
119	363.6527972760671	276.499073089803	-61	21/02/24 15:47:27
118	357.09356967635637	275.4844405310735	-65	21/02/24 15:47:27
117	369.239898205492	274.21448833832176	-62	21/02/24 15:47:27
108	354.5433741308232	271.8469578377465	-69	21/02/24 15:47:27
97	362.5947869084557	269.0761103596411	-70	21/02/24 15:47:27

114	381.5992223502213	289.5952994882171	-67	21/02/24 15:47:28
116	377.9647653672978	286.9907349984353	-62	21/02/24 15:47:28
115	377.751717565356	288.3800056854842	-63	21/02/24 15:47:28
96	377.44892680179316	276.8922953490967	-66	21/02/24 15:47:28
94	371.72787175525207	289.5180158335357	-54	21/02/24 15:47:28
92	370.6727223195025	288.1316940639638	-47	21/02/24 15:47:28
110	367.98757076589385	277.42210180952264	-57	21/02/24 15:47:28
93	366.9922408772935	287.5344913496744	-41	21/02/24 15:47:28
109	365.34205862707444	280.9445005087476	-55	21/02/24 15:47:28
112	360.33084939037263	282.2851479696295	-60	21/02/24 15:47:28
111	349.3574161788773	282.0413831973989	-71	21/02/24 15:47:28
102	348.60037065169166	290.2443240990335	-70	21/02/24 15:47:28
119	363.6527972760671	276.499073089803	-61	21/02/24 15:47:28
118	357.09356967635637	275.4844405310735	-68	21/02/24 15:47:28
117	369.239898205492	274.21448833832176	-62	21/02/24 15:47:28
108	354.5433741308232	271.8469578377465	-69	21/02/24 15:47:28
97	362.5947869084557	269.0761103596411	-68	21/02/24 15:47:28

114	381.5992223502213	289.5952994882171	-66	21/02/24 15:47:29
116	377.9647653672978	286.9907349984353	-62	21/02/24 15:47:29
115	377.751717565356	288.3800056854842	-63	21/02/24 15:47:29
96	377.44892680179316	276.8922953490967	-67	21/02/24 15:47:29
94	371.72787175525207	289.5180158335357	-52	21/02/24 15:47:29
92	370.6727223195025	288.1316940639638	-47	21/02/24 15:47:29
110	367.98757076589385	277.42210180952264	-60	21/02/24 15:47:29
93	366.9922408772935	287.5344913496744	-36	21/02/24 15:47:29
109	365.34205862707444	280.9445005087476	-53	21/02/24 15:47:29
112	360.33084939037263	282.2851479696295	-60	21/02/24 15:47:29
111	349.3574161788773	282.0413831973989	-71	21/02/24 15:47:29
102	348.60037065169166	290.2443240990335	-72	21/02/24 15:47:29
119	363.6527972760671	276.499073089803	-64	21/02/24 15:47:29
118	357.09356967635637	275.4844405310735	-69	21/02/24 15:47:29
117	369.239898205492	274.21448833832176	-64	21/02/24 15:47:29
108	354.5433741308232	271.8469578377465	-69	21/02/24 15:47:29
97	362.5947869084557	269.0761103596411	-70	21/02/24 15:47:29

114	381.5992223502213	289.5952994882171	-66	21/02/24 15:47:30
116	377.9647653672978	286.9907349984353	-59	21/02/24 15:47:30
115	377.751717565356	288.3800056854842	-62	21/02/24 15:47:30
96	377.44892680179316	276.8922953490967	-67	21/02/24 15:47:30
94	371.72787175525207	289.5180158335357	-53	21/02/24 15:47:30
92	370.6727223195025	288.1316940639638	-45	21/02/24 15:47:30
110	367.98757076589385	277.42210180952264	-58	21/02/24 15:47:30
93	366.9922408772935	287.5344913496744	-40	21/02/24 15:47:30
109	365.34205862707444	280.9445005087476	-57	21/02/24 15:47:30
112	360.33084939037263	282.2851479696295	-61	21/02/24 15:47:30
111	349.3574161788773	282.0413831973989	-69	21/02/24 15:47:30
119	363.6527972760671	276.499073089803	-63	21/02/24 15:47:30
118	357.09356967635637	275.4844405310735	-67	21/02/24 15:47:30
117	369.239898205492	274.21448833832176	-65	21/02/24 15:47:30
97	362.5947869084557	269.0761103596411	-69	21/02/24 15:47:30

114	381.5992223502213	289.5952994882171	-65	21/02/24 15:47:31
116	377.9647653672978	286.9907349984353	-64	21/02/24 15:47:31
115	377.751717565356	288.3800056854842	-63	21/02/24 15:47:31
96	377.44892680179316	276.8922953490967	-65	21/02/24 15:47:31
94	371.72787175525207	289.5180158335357	-53	21/02/24 15:47:31
92	370.6727223195025	288.1316940639638	-47	21/02/24 15:47:31
110	367.98757076589385	277.42210180952264	-62	21/02/24 15:47:31
93	366.9922408772935	287.5344913496744	-33	21/02/24 15:47:31
109	365.34205862707444	280.9445005087476	-56	21/02/24 15:47:31
112	360.33084939037263	282.2851479696295	-58	21/02/24 15:47:31
111	349.3574161788773	282.0413831973989	-69	21/02/24 15:47:31
102	348.60037065169166	290.2443240990335	-69	21/02/24 15:47:31
119	363.6527972760671	276.499073089803	-63	21/02/24 15:47:31
118	357.09356967635637	275.4844405310735	-68	21/02/24 15:47:31
117	369.239898205492	274.21448833832176	-64	21/02/24 15:47:31
108	354.5433741308232	271.8469578377465	-71	21/02/24 15:47:31
97	362.5947869084557	269.0761103596411	-70	21/02/24 15:47:31

114	381.5992223502213	289.5952994882171	-64	21/02/24 15:47:32
116	377.9647653672978	286.9907349984353	-60	21/02/24 15:47:32
115	377.751717565356	288.3800056854842	-63	21/02/24 15:47:32
96	377.44892680179316	276.8922953490967	-64	21/02/24 15:47:32
94	371.72787175525207	289.5180158335357	-53	21/02/24 15:47:32
92	370.6727223195025	288.1316940639638	-45	21/02/24 15:47:32
110	367.98757076589385	277.42210180952264	-60	21/02/24 15:47:32
93	366.9922408772935	287.5344913496744	-34	21/02/24 15:47:32
109	365.34205862707444	280.9445005087476	-55	21/02/24 15:47:32
112	360.33084939037263	282.2851479696295	-61	21/02/24 15:47:32
111	349.3574161788773	282.0413831973989	-69	21/02/24 15:47:32
102	348.60037065169166	290.2443240990335	-72	21/02/24 15:47:32
119	363.6527972760671	276.499073089803	-61	21/02/24 15:47:32
118	357.09356967635637	275.4844405310735	-65	21/02/24 15:47:32
117	369.239898205492	274.21448833832176	-64	21/02/24 15:47:32
97	362.5947869084557	269.0761103596411	-70	21/02/24 15:47:32

114	381.5992223502213	289.5952994882171	-66	21/02/24 15:47:33
116	377.9647653672978	286.9907349984353	-62	21/02/24 15:47:33
115	377.751717565356	288.3800056854842	-62	21/02/24 15:47:33
96	377.44892680179316	276.8922953490967	-66	21/02/24 15:47:33
94	371.72787175525207	289.5180158335357	-53	21/02/24 15:47:33
92	370.6727223195025	288.1316940639638	-47	21/02/24 15:47:33
110	367.98757076589385	277.42210180952264	-59	21/02/24 15:47:33
93	366.9922408772935	287.5344913496744	-39	21/02/24 15:47:33
109	365.34205862707444	280.9445005087476	-55	21/02/24 15:47:33
112	360.33084939037263	282.2851479696295	-62	21/02/24 15:47:33
111	349.3574161788773	282.0413831973989	-69	21/02/24 15:47:33
119	363.6527972760671	276.499073089803	-61	21/02/24 15:47:33
118	357.09356967635637	275.4844405310735	-66	21/02/24 15:47:33
117	369.239898205492	274.21448833832176	-63	21/02/24 15:47:33
108	354.5433741308232	271.8469578377465	-70	21/02/24 15:47:33
97	362.5947869084557	269.0761103596411	-70	21/02/24 15:47:33

114	381.5992223502213	289.5952994882171	-67	21/02/24 15:47:34
116	377.9647653672978	286.9907349984353	-60	21/02/24 15:47:34
115	377.751717565356	288.3800056854842	-62	21/02/24 15:47:34
96	377.44892680179316	276.8922953490967	-66	21/02/24 15:47:34
94	371.72787175525207	289.5180158335357	-52	21/02/24 15:47:34
92	370.6727223195025	288.1316940639638	-44	21/02/24 15:47:34
110	367.98757076589385	277.42210180952264	-60	21/02/24 15:47:34
93	366.9922408772935	287.5344913496744	-35	21/02/24 15:47:34
109	365.34205862707444	280.9445005087476	-59	21/02/24 15:47:34
112	360.33084939037263	282.2851479696295	-60	21/02/24 15:47:34
111	349.3574161788773	282.0413831973989	-69	21/02/24 15:47:34
102	348.60037065169166	290.2443240990335	-72	21/02/24 15:47:34
119	363.6527972760671	276.499073089803	-65	21/02/24 15:47:34
118	357.09356967635637	275.4844405310735	-66	21/02/24 15:47:34
117	369.239898205492	274.21448833832176	-65	21/02/24 15:47:34
97	362.5947869084557	269.0761103596411	-68	21/02/24 15:47:34

114	381.5992223502213	289.5952994882171	-65	21/02/24 15:47:35
116	377.9647653672978	286.9907349984353	-62	21/02/24 15:47:35
115	377.751717565356	288.3800056854842	-61	21/02/24 15:47:35
96	377.44892680179316	276.8922953490967	-64	21/02/24 15:47:35
94	371.72787175525207	289.5180158335357	-52	21/02/24 15:47:35
92	370.6727223195025	288.1316940639638	-47	21/02/24 15:47:35
110	367.98757076589385	277.42210180952264	-62	21/02/24 15:47:35
93	366.9922408772935	287.5344913496744	-39	21/02/24 15:47:35
109	365.34205862707444	280.9445005087476	-56	21/02/24 15:47:35
112	360.33084939037263	282.2851479696295	-60	21/02/24 15:47:35
111	349.3574161788773	282.0413831973989	-69	21/02/24 15:47:35
102	348.60037065169166	290.2443240990335	-71	21/02/24 15:47:35
119	363.6527972760671	276.499073089803	-63	21/02/24 15:47:35
118	357.09356967635637	275.4844405310735	-68	21/02/24 15:47:35
117	369.239898205492	274.21448833832176	-63	21/02/24 15:47:35
108	354.5433741308232	271.8469578377465	-72	21/02/24 15:47:35
97	362.5947869084557	269.0761103596411	-70	21/02/24 15:47:35

114	381.5992223502213	289.5952994882171	-66	21/02/24 15:47:36
116	377.9647653672978	286.9907349984353	-64	21/02/24 15:47:36
115	377.751717565356	288.3800056854842	-62	21/02/24 15:47:36
96	377.44892680179316	276.8922953490967	-66	21/02/24 15:47:36
94	371.72787175525207	289.5180158335357	-51	21/02/24 15:47:36
92	370.6727223195025	288.1316940639638	-49	21/02/24 15:47:36
110	367.98757076589385	277.42210180952264	-63	21/02/24 15:47:36
93	366.9922408772935	287.5344913496744	-29	21/02/24 15:47:36
109	365.34205862707444	280.9445005087476	-55	21/02/24 15:47:36
112	360.33084939037263	282.2851479696295	-60	21/02/24 15:47:36
111	349.3574161788773	282.0413831973989	-69	21/02/24 15:47:36
102	348.60037065169166	290.2443240990335	-71	21/02/24 15:47:36
119	363.6527972760671	276.499073089803	-63	21/02/24 15:47:36
118	357.09356967635637	275.4844405310735	-65	21/02/24 15:47:36
117	369.239898205492	274.21448833832176	-66	21/02/24 15:47:36
108	354.5433741308232	271.8469578377465	-70	21/02/24 15:47:36
97	362.5947869084557	269.0761103596411	-70	21/02/24 15:47:36

114	381.5992223502213	289.5952994882171	-66	21/02/24 15:47:37
116	377.9647653672978	286.9907349984353	-62	21/02/24 15:47:37
115	377.751717565356	288.3800056854842	-63	21/02/24 15:47:37
96	377.44892680179316	276.8922953490967	-64	21/02/24 15:47:37
94	371.72787175525207	289.5180158335357	-53	21/02/24 15:47:37
92	370.6727223195025	288.1316940639638	-49	21/02/24 15:47:37
110	367.98757076589385	277.42210180952264	-60	21/02/24 15:47:37
93	366.9922408772935	287.5344913496744	-37	21/02/24 15:47:37
109	365.34205862707444	280.9445005087476	-55	21/02/24 15:47:37
112	360.33084939037263	282.2851479696295	-58	21/02/24 15:47:37
111	349.3574161788773	282.0413831973989	-70	21/02/24 15:47:37
102	348.60037065169166	290.2443240990335	-72	21/02/24 15:47:37
119	363.6527972760671	276.499073089803	-61	21/02/24 15:47:37
118	357.09356967635637	275.4844405310735	-68	21/02/24 15:47:37
117	369.239898205492	274.21448833832176	-63	21/02/24 15:47:37
108	354.5433741308232	271.8469578377465	-68	21/02/24 15:47:37
97	362.5947869084557	269.0761103596411	-69	21/02/24 15:47:37

114	381.5992223502213	289.5952994882171	-65	21/02/24 15:47:38
116	377.9647653672978	286.9907349984353	-62	21/02/24 15:47:38
115	377.751717565356	288.3800056854842	-61	21/02/24 15:47:38
96	377.44892680179316	276.8922953490967	-64	21/02/24 15:47:38
94	371.72787175525207	289.5180158335357	-51	21/02/24 15:47:38
92	370.6727223195025	288.1316940639638	-48	21/02/24 15:47:38
110	367.98757076589385	277.42210180952264	-60	21/02/24 15:47:38
93	366.9922408772935	287.5344913496744	-35	21/02/24 15:47:38
109	365.34205862707444	280.9445005087476	-56	21/02/24 15:47:38
112	360.33084939037263	282.2851479696295	-60	21/02/24 15:47:38
111	349.3574161788773	282.0413831973989	-71	21/02/24 15:47:38
102	348.60037065169166	290.2443240990335	-68	21/02/24 15:47:38
119	363.6527972760671	276.499073089803	-62	21/02/24 15:47:38
118	357.09356967635637	275.4844405310735	-68	21/02/24 15:47:38
117	369.239898205492	274.21448833832176	-65	21/02/24 15:47:38
108	354.5433741308232	271.8469578377465	-69	21/02/24 15:47:38
97	362.5947869084557	269.0761103596411	-71	21/02/24 15:47:38

114	381.5992223502213	289.5952994882171	-67	21/02/24 15:47:39
116	377.9647653672978	286.9907349984353	-62	21/02/24 15:47:39
115	377.751717565356	288.3800056854842	-59	21/02/24 15:47:39
96	377.44892680179316	276.8922953490967	-65	21/02/24 15:47:39
94	371.72787175525207	289.5180158335357	-51	21/02/24 15:47:39
92	370.6727223195025	288.1316940639638	-45	21/02/24 15:47:39
110	367.98757076589385	277.42210180952264	-60	21/02/24 15:47:39
93	366.9922408772935	287.5344913496744	-34	21/02/24 15:47:39
109	365.34205862707444	280.9445005087476	-56	21/02/24 15:47:39
112	360.33084939037263	282.2851479696295	-61	21/02/24 15:47:39
111	349.3574161788773	282.0413831973989	-72	21/02/24 15:47:39
102	348.60037065169166	290.2443240990335	-72	21/02/24 15:47:39
119	363.6527972760671	276.499073089803	-61	21/02/24 15:47:39
118	357.09356967635637	275.4844405310735	-66	21/02/24 15:47:39
117	369.239898205492	274.21448833832176	-65	21/02/24 15:47:39
97	362.5947869084557	269.0761103596411	-68	21/02/24 15:47:39

114	381.5992223502213	289.5952994882171	-66	21/02/24 15:47:40
116	377.9647653672978	286.9907349984353	-63	21/02/24 15:47:40
115	377.751717565356	288.3800056854842	-64	21/02/24 15:47:40
96	377.44892680179316	276.8922953490967	-67	21/02/24 15:47:40
94	371.72787175525207	289.5180158335357	-54	21/02/24 15:47:40
92	370.6727223195025	288.1316940639638	-49	21/02/24 15:47:40
110	367.98757076589385	277.42210180952264	-59	21/02/24 15:47:40
93	366.9922408772935	287.5344913496744	-25	21/02/24 15:47:40
109	365.34205862707444	280.9445005087476	-54	21/02/24 15:47:40
112	360.33084939037263	282.2851479696295	-61	21/02/24 15:47:40
111	349.3574161788773	282.0413831973989	-70	21/02/24 15:47:40
102	348.60037065169166	290.2443240990335	-70	21/02/24 15:47:40
119	363.6527972760671	276.499073089803	-64	21/02/24 15:47:40
118	357.09356967635637	275.4844405310735	-67	21/02/24 15:47:40
117	369.239898205492	274.21448833832176	-64	21/02/24 15:47:40
108	354.5433741308232	271.8469578377465	-71	21/02/24 15:47:40
97	362.5947869084557	269.0761103596411	-71	21/02/24 15:47:40

114	381.5992223502213	289.5952994882171	-66	21/02/24 15:47:41
116	377.9647653672978	286.9907349984353	-64	21/02/24 15:47:41
115	377.751717565356	288.3800056854842	-63	21/02/24 15:47:41
96	377.44892680179316	276.8922953490967	-66	21/02/24 15:47:41
94	371.72787175525207	289.5180158335357	-52	21/02/24 15:47:41
92	370.6727223195025	288.1316940639638	-49	21/02/24 15:47:41
110	367.98757076589385	277.42210180952264	-60	21/02/24 15:47:41
93	366.9922408772935	287.5344913496744	-24	21/02/24 15:47:41
109	365.34205862707444	280.9445005087476	-58	21/02/24 15:47:41
112	360.33084939037263	282.2851479696295	-58	21/02/24 15:47:41
111	349.3574161788773	282.0413831973989	-72	21/02/24 15:47:41
102	348.60037065169166	290.2443240990335	-68	21/02/24 15:47:41
119	363.6527972760671	276.499073089803	-65	21/02/24 15:47:41
118	357.09356967635637	275.4844405310735	-68	21/02/24 15:47:41
117	369.239898205492	274.21448833832176	-66	21/02/24 15:47:41
108	354.5433741308232	271.8469578377465	-70	21/02/24 15:47:41
97	362.5947869084557	269.0761103596411	-71	21/02/24 15:47:41

114	381.5992223502213	289.5952994882171	-65	21/02/24 15:47:42
116	377.9647653672978	286.9907349984353	-63	21/02/24 15:47:42
115	377.751717565356	288.3800056854842	-62	21/02/24 15:47:42
96	377.44892680179316	276.8922953490967	-67	21/02/24 15:47:42
94	371.72787175525207	289.5180158335357	-56	21/02/24 15:47:42
92	370.6727223195025	288.1316940639638	-50	21/02/24 15:47:42
110	367.98757076589385	277.42210180952264	-61	21/02/24 15:47:42
93	366.9922408772935	287.5344913496744	-34	21/02/24 15:47:42
109	365.34205862707444	280.9445005087476	-55	21/02/24 15:47:42
112	360.33084939037263	282.2851479696295	-60	21/02/24 15:47:42
111	349.3574161788773	282.0413831973989	-67	21/02/24 15:47:42
102	348.60037065169166	290.2443240990335	-69	21/02/24 15:47:42
119	363.6527972760671	276.499073089803	-63	21/02/24 15:47:42
118	357.09356967635637	275.4844405310735	-67	21/02/24 15:47:42
117	369.239898205492	274.21448833832176	-63	21/02/24 15:47:42
108	354.5433741308232	271.8469578377465	-69	21/02/24 15:47:42
97	362.5947869084557	269.0761103596411	-70	21/02/24 15:47:42

114	381.5992223502213	289.5952994882171	-69	21/02/24 15:47:43
116	377.9647653672978	286.9907349984353	-62	21/02/24 15:47:43
115	377.751717565356	288.3800056854842	-62	21/02/24 15:47:43
96	377.44892680179316	276.8922953490967	-65	21/02/24 15:47:43
94	371.72787175525207	289.5180158335357	-57	21/02/24 15:47:43
92	370.6727223195025	288.1316940639638	-53	21/02/24 15:47:43
110	367.98757076589385	277.42210180952264	-62	21/02/24 15:47:43
93	366.9922408772935	287.5344913496744	-34	21/02/24 15:47:43
109	365.34205862707444	280.9445005087476	-53	21/02/24 15:47:43
112	360.33084939037263	282.2851479696295	-57	21/02/24 15:47:43
111	349.3574161788773	282.0413831973989	-67	21/02/24 15:47:43
102	348.60037065169166	290.2443240990335	-70	21/02/24 15:47:43
119	363.6527972760671	276.499073089803	-61	21/02/24 15:47:43
118	357.09356967635637	275.4844405310735	-65	21/02/24 15:47:43
117	369.239898205492	274.21448833832176	-63	21/02/24 15:47:43
108	354.5433741308232	271.8469578377465	-69	21/02/24 15:47:43
97	362.5947869084557	269.0761103596411	-69	21/02/24 15:47:43

114	381.5992223502213	289.5952994882171	-65	21/02/24 15:47:44
116	377.9647653672978	286.9907349984353	-65	21/02/24 15:47:44
115	377.751717565356	288.3800056854842	-65	21/02/24 15:47:44
96	377.44892680179316	276.8922953490967	-65	21/02/24 15:47:44
94	371.72787175525207	289.5180158335357	-55	21/02/24 15:47:44
92	370.6727223195025	288.1316940639638	-52	21/02/24 15:47:44
110	367.98757076589385	277.42210180952264	-60	21/02/24 15:47:44
93	366.9922408772935	287.5344913496744	-38	21/02/24 15:47:44
109	365.34205862707444	280.9445005087476	-51	21/02/24 15:47:44
112	360.33084939037263	282.2851479696295	-58	21/02/24 15:47:44
111	349.3574161788773	282.0413831973989	-69	21/02/24 15:47:44
102	348.60037065169166	290.2443240990335	-69	21/02/24 15:47:44
119	363.6527972760671	276.499073089803	-60	21/02/24 15:47:44
118	357.09356967635637	275.4844405310735	-64	21/02/24 15:47:44
117	369.239898205492	274.21448833832176	-63	21/02/24 15:47:44
108	354.5433741308232	271.8469578377465	-71	21/02/24 15:47:44
97	362.5947869084557	269.0761103596411	-70	21/02/24 15:47:44

114	381.5992223502213	289.5952994882171	-69	21/02/24 15:47:45
116	377.9647653672978	286.9907349984353	-65	21/02/24 15:47:45
115	377.751717565356	288.3800056854842	-66	21/02/24 15:47:45
96	377.44892680179316	276.8922953490967	-68	21/02/24 15:47:45
94	371.72787175525207	289.5180158335357	-58	21/02/24 15:47:45
92	370.6727223195025	288.1316940639638	-53	21/02/24 15:47:45
110	367.98757076589385	277.42210180952264	-59	21/02/24 15:47:45
93	366.9922408772935	287.5344913496744	-42	21/02/24 15:47:45
109	365.34205862707444	280.9445005087476	-51	21/02/24 15:47:45
112	360.33084939037263	282.2851479696295	-54	21/02/24 15:47:45
111	349.3574161788773	282.0413831973989	-70	21/02/24 15:47:45
102	348.60037065169166	290.2443240990335	-69	21/02/24 15:47:45
119	363.6527972760671	276.499073089803	-62	21/02/24 15:47:45
118	357.09356967635637	275.4844405310735	-66	21/02/24 15:47:45
117	369.239898205492	274.21448833832176	-65	21/02/24 15:47:45
108	354.5433741308232	271.8469578377465	-70	21/02/24 15:47:45
107	352.24436078636603	271.4962331820773	-69	21/02/24 15:47:45
106	352.82196230706245	270.7390515122939	-72	21/02/24 15:47:45
97	362.5947869084557	269.0761103596411	-68	21/02/24 15:47:45
100	345.6304273143794	285.66832195343085	-69	21/02/24 15:47:45

114	381.5992223502213	289.5952994882171	-67	21/02/24 15:47:46
116	377.9647653672978	286.9907349984353	-64	21/02/24 15:47:46
115	377.751717565356	288.3800056854842	-66	21/02/24 15:47:46
96	377.44892680179316	276.8922953490967	-66	21/02/24 15:47:46
94	371.72787175525207	289.5180158335357	-60	21/02/24 15:47:46
92	370.6727223195025	288.1316940639638	-57	21/02/24 15:47:46
110	367.98757076589385	277.42210180952264	-57	21/02/24 15:47:46
93	366.9922408772935	287.5344913496744	-44	21/02/24 15:47:46
109	365.34205862707444	280.9445005087476	-50	21/02/24 15:47:46
112	360.33084939037263	282.2851479696295	-55	21/02/24 15:47:46
111	349.3574161788773	282.0413831973989	-69	21/02/24 15:47:46
102	348.60037065169166	290.2443240990335	-69	21/02/24 15:47:46
119	363.6527972760671	276.499073089803	-59	21/02/24 15:47:46
118	357.09356967635637	275.4844405310735	-64	21/02/24 15:47:46
117	369.239898205492	274.21448833832176	-62	21/02/24 15:47:46
108	354.5433741308232	271.8469578377465	-70	21/02/24 15:47:46
107	352.24436078636603	271.4962331820773	-70	21/02/24 15:47:46
106	352.82196230706245	270.7390515122939	-70	21/02/24 15:47:46
97	362.5947869084557	269.0761103596411	-67	21/02/24 15:47:46
100	345.6304273143794	285.66832195343085	-70	21/02/24 15:47:46

114	381.5992223502213	289.5952994882171	-68	21/02/24 15:47:47
116	377.9647653672978	286.9907349984353	-66	21/02/24 15:47:47
115	377.751717565356	288.3800056854842	-65	21/02/24 15:47:47
96	377.44892680179316	276.8922953490967	-64	21/02/24 15:47:47
94	371.72787175525207	289.5180158335357	-60	21/02/24 15:47:47
92	370.6727223195025	288.1316940639638	-56	21/02/24 15:47:47
110	367.98757076589385	277.42210180952264	-58	21/02/24 15:47:47
93	366.9922408772935	287.5344913496744	-45	21/02/24 15:47:47
109	365.34205862707444	280.9445005087476	-50	21/02/24 15:47:47
112	360.33084939037263	282.2851479696295	-53	21/02/24 15:47:47
111	349.3574161788773	282.0413831973989	-67	21/02/24 15:47:47
102	348.60037065169166	290.2443240990335	-69	21/02/24 15:47:47
119	363.6527972760671	276.499073089803	-59	21/02/24 15:47:47
118	357.09356967635637	275.4844405310735	-64	21/02/24 15:47:47
117	369.239898205492	274.21448833832176	-61	21/02/24 15:47:47
108	354.5433741308232	271.8469578377465	-67	21/02/24 15:47:47
107	352.24436078636603	271.4962331820773	-69	21/02/24 15:47:47
106	352.82196230706245	270.7390515122939	-71	21/02/24 15:47:47
97	362.5947869084557	269.0761103596411	-66	21/02/24 15:47:47

114	381.5992223502213	289.5952994882171	-66	21/02/24 15:47:48
116	377.9647653672978	286.9907349984353	-62	21/02/24 15:47:48
115	377.751717565356	288.3800056854842	-64	21/02/24 15:47:48
96	377.44892680179316	276.8922953490967	-64	21/02/24 15:47:48
94	371.72787175525207	289.5180158335357	-59	21/02/24 15:47:48
92	370.6727223195025	288.1316940639638	-53	21/02/24 15:47:48
110	367.98757076589385	277.42210180952264	-58	21/02/24 15:47:48
93	366.9922408772935	287.5344913496744	-43	21/02/24 15:47:48
109	365.34205862707444	280.9445005087476	-51	21/02/24 15:47:48
112	360.33084939037263	282.2851479696295	-55	21/02/24 15:47:48
111	349.3574161788773	282.0413831973989	-67	21/02/24 15:47:48
102	348.60037065169166	290.2443240990335	-68	21/02/24 15:47:48
119	363.6527972760671	276.499073089803	-59	21/02/24 15:47:48
118	357.09356967635637	275.4844405310735	-65	21/02/24 15:47:48
117	369.239898205492	274.21448833832176	-65	21/02/24 15:47:48
108	354.5433741308232	271.8469578377465	-67	21/02/24 15:47:48
107	352.24436078636603	271.4962331820773	-71	21/02/24 15:47:48
106	352.82196230706245	270.7390515122939	-72	21/02/24 15:47:48
97	362.5947869084557	269.0761103596411	-69	21/02/24 15:47:48

114	381.5992223502213	289.5952994882171	-68	21/02/24 15:47:49
116	377.9647653672978	286.9907349984353	-63	21/02/24 15:47:49
115	377.751717565356	288.3800056854842	-63	21/02/24 15:47:49
96	377.44892680179316	276.8922953490967	-65	21/02/24 15:47:49
94	371.72787175525207	289.5180158335357	-56	21/02/24 15:47:49
92	370.6727223195025	288.1316940639638	-53	21/02/24 15:47:49
110	367.98757076589385	277.42210180952264	-60	21/02/24 15:47:49
93	366.9922408772935	287.5344913496744	-45	21/02/24 15:47:49
109	365.34205862707444	280.9445005087476	-51	21/02/24 15:47:49
112	360.33084939037263	282.2851479696295	-56	21/02/24 15:47:49
111	349.3574161788773	282.0413831973989	-68	21/02/24 15:47:49
102	348.60037065169166	290.2443240990335	-70	21/02/24 15:47:49
119	363.6527972760671	276.499073089803	-62	21/02/24 15:47:49
118	357.09356967635637	275.4844405310735	-65	21/02/24 15:47:49
117	369.239898205492	274.21448833832176	-62	21/02/24 15:47:49
108	354.5433741308232	271.8469578377465	-70	21/02/24 15:47:49
107	352.24436078636603	271.4962331820773	-69	21/02/24 15:47:49
106	352.82196230706245	270.7390515122939	-71	21/02/24 15:47:49
97	362.5947869084557	269.0761103596411	-68	21/02/24 15:47:49

114	381.5992223502213	289.5952994882171	-67	21/02/24 15:47:50
116	377.9647653672978	286.9907349984353	-64	21/02/24 15:47:50
115	377.751717565356	288.3800056854842	-64	21/02/24 15:47:50
96	377.44892680179316	276.8922953490967	-66	21/02/24 15:47:50
94	371.72787175525207	289.5180158335357	-58	21/02/24 15:47:50
92	370.6727223195025	288.1316940639638	-53	21/02/24 15:47:50
110	367.98757076589385	277.42210180952264	-58	21/02/24 15:47:50
93	366.9922408772935	287.5344913496744	-46	21/02/24 15:47:50
109	365.34205862707444	280.9445005087476	-49	21/02/24 15:47:50
112	360.33084939037263	282.2851479696295	-54	21/02/24 15:47:50
111	349.3574161788773	282.0413831973989	-69	21/02/24 15:47:50
102	348.60037065169166	290.2443240990335	-70	21/02/24 15:47:50
119	363.6527972760671	276.499073089803	-59	21/02/24 15:47:50
118	357.09356967635637	275.4844405310735	-67	21/02/24 15:47:50
117	369.239898205492	274.21448833832176	-65	21/02/24 15:47:50
108	354.5433741308232	271.8469578377465	-67	21/02/24 15:47:50
107	352.24436078636603	271.4962331820773	-70	21/02/24 15:47:50
106	352.82196230706245	270.7390515122939	-71	21/02/24 15:47:50
97	362.5947869084557	269.0761103596411	-69	21/02/24 15:47:50

114	381.5992223502213	289.5952994882171	-68	21/02/24 15:47:51
116	377.9647653672978	286.9907349984353	-65	21/02/24 15:47:51
115	377.751717565356	288.3800056854842	-65	21/02/24 15:47:51
96	377.44892680179316	276.8922953490967	-66	21/02/24 15:47:51
94	371.72787175525207	289.5180158335357	-57	21/02/24 15:47:51
92	370.6727223195025	288.1316940639638	-54	21/02/24 15:47:51
110	367.98757076589385	277.42210180952264	-59	21/02/24 15:47:51
93	366.9922408772935	287.5344913496744	-46	21/02/24 15:47:51
109	365.34205862707444	280.9445005087476	-50	21/02/24 15:47:51
112	360.33084939037263	282.2851479696295	-54	21/02/24 15:47:51
111	349.3574161788773	282.0413831973989	-68	21/02/24 15:47:51
102	348.60037065169166	290.2443240990335	-68	21/02/24 15:47:51
119	363.6527972760671	276.499073089803	-58	21/02/24 15:47:51
118	357.09356967635637	275.4844405310735	-63	21/02/24 15:47:51
117	369.239898205492	274.21448833832176	-61	21/02/24 15:47:51
108	354.5433741308232	271.8469578377465	-68	21/02/24 15:47:51
107	352.24436078636603	271.4962331820773	-69	21/02/24 15:47:51
106	352.82196230706245	270.7390515122939	-70	21/02/24 15:47:51
97	362.5947869084557	269.0761103596411	-67	21/02/24 15:47:51

114	381.5992223502213	289.5952994882171	-69	21/02/24 15:47:52
116	377.9647653672978	286.9907349984353	-66	21/02/24 15:47:52
115	377.751717565356	288.3800056854842	-63	21/02/24 15:47:52
96	377.44892680179316	276.8922953490967	-65	21/02/24 15:47:52
94	371.72787175525207	289.5180158335357	-59	21/02/24 15:47:52
92	370.6727223195025	288.1316940639638	-53	21/02/24 15:47:52
110	367.98757076589385	277.42210180952264	-58	21/02/24 15:47:52
93	366.9922408772935	287.5344913496744	-46	21/02/24 15:47:52
109	365.34205862707444	280.9445005087476	-50	21/02/24 15:47:52
112	360.33084939037263	282.2851479696295	-53	21/02/24 15:47:52
111	349.3574161788773	282.0413831973989	-67	21/02/24 15:47:52
102	348.60037065169166	290.2443240990335	-69	21/02/24 15:47:52
119	363.6527972760671	276.499073089803	-61	21/02/24 15:47:52
118	357.09356967635637	275.4844405310735	-63	21/02/24 15:47:52
117	369.239898205492	274.21448833832176	-63	21/02/24 15:47:52
108	354.5433741308232	271.8469578377465	-70	21/02/24 15:47:52
107	352.24436078636603	271.4962331820773	-70	21/02/24 15:47:52
106	352.82196230706245	270.7390515122939	-70	21/02/24 15:47:52
97	362.5947869084557	269.0761103596411	-67	21/02/24 15:47:52

114	381.5992223502213	289.5952994882171	-67	21/02/24 15:47:53
116	377.9647653672978	286.9907349984353	-66	21/02/24 15:47:53
115	377.751717565356	288.3800056854842	-65	21/02/24 15:47:53
96	377.44892680179316	276.8922953490967	-64	21/02/24 15:47:53
94	371.72787175525207	289.5180158335357	-59	21/02/24 15:47:53
92	370.6727223195025	288.1316940639638	-55	21/02/24 15:47:53
110	367.98757076589385	277.42210180952264	-58	21/02/24 15:47:53
93	366.9922408772935	287.5344913496744	-50	21/02/24 15:47:53
109	365.34205862707444	280.9445005087476	-46	21/02/24 15:47:53
112	360.33084939037263	282.2851479696295	-55	21/02/24 15:47:53
111	349.3574161788773	282.0413831973989	-67	21/02/24 15:47:53
102	348.60037065169166	290.2443240990335	-70	21/02/24 15:47:53
119	363.6527972760671	276.499073089803	-60	21/02/24 15:47:53
118	357.09356967635637	275.4844405310735	-66	21/02/24 15:47:53
117	369.239898205492	274.21448833832176	-62	21/02/24 15:47:53
108	354.5433741308232	271.8469578377465	-69	21/02/24 15:47:53
107	352.24436078636603	271.4962331820773	-69	21/02/24 15:47:53
106	352.82196230706245	270.7390515122939	-71	21/02/24 15:47:53
97	362.5947869084557	269.0761103596411	-67	21/02/24 15:47:53
99	360.0550977801786	265.17619063766165	-70	21/02/24 15:47:53

114	381.5992223502213	289.5952994882171	-70	21/02/24 15:47:54
116	377.9647653672978	286.9907349984353	-66	21/02/24 15:47:54
115	377.751717565356	288.3800056854842	-66	21/02/24 15:47:54
96	377.44892680179316	276.8922953490967	-67	21/02/24 15:47:54
94	371.72787175525207	289.5180158335357	-60	21/02/24 15:47:54
92	370.6727223195025	288.1316940639638	-57	21/02/24 15:47:54
110	367.98757076589385	277.42210180952264	-56	21/02/24 15:47:54
93	366.9922408772935	287.5344913496744	-49	21/02/24 15:47:54
109	365.34205862707444	280.9445005087476	-43	21/02/24 15:47:54
112	360.33084939037263	282.2851479696295	-54	21/02/24 15:47:54
111	349.3574161788773	282.0413831973989	-68	21/02/24 15:47:54
102	348.60037065169166	290.2443240990335	-68	21/02/24 15:47:54
119	363.6527972760671	276.499073089803	-57	21/02/24 15:47:54
118	357.09356967635637	275.4844405310735	-64	21/02/24 15:47:54
117	369.239898205492	274.21448833832176	-62	21/02/24 15:47:54
108	354.5433741308232	271.8469578377465	-69	21/02/24 15:47:54
107	352.24436078636603	271.4962331820773	-69	21/02/24 15:47:54
106	352.82196230706245	270.7390515122939	-71	21/02/24 15:47:54
97	362.5947869084557	269.0761103596411	-65	21/02/24 15:47:54
99	360.0550977801786	265.17619063766165	-72	21/02/24 15:47:54

114	381.5992223502213	289.5952994882171	-68	21/02/24 15:47:55
116	377.9647653672978	286.9907349984353	-64	21/02/24 15:47:55
115	377.751717565356	288.3800056854842	-66	21/02/24 15:47:55
96	377.44892680179316	276.8922953490967	-65	21/02/24 15:47:55
94	371.72787175525207	289.5180158335357	-60	21/02/24 15:47:55
92	370.6727223195025	288.1316940639638	-57	21/02/24 15:47:55
110	367.98757076589385	277.42210180952264	-56	21/02/24 15:47:55
93	366.9922408772935	287.5344913496744	-50	21/02/24 15:47:55
109	365.34205862707444	280.9445005087476	-41	21/02/24 15:47:55
112	360.33084939037263	282.2851479696295	-52	21/02/24 15:47:55
111	349.3574161788773	282.0413831973989	-69	21/02/24 15:47:55
102	348.60037065169166	290.2443240990335	-69	21/02/24 15:47:55
119	363.6527972760671	276.499073089803	-57	21/02/24 15:47:55
118	357.09356967635637	275.4844405310735	-64	21/02/24 15:47:55
117	369.239898205492	274.21448833832176	-60	21/02/24 15:47:55
108	354.5433741308232	271.8469578377465	-67	21/02/24 15:47:55
107	352.24436078636603	271.4962331820773	-70	21/02/24 15:47:55
106	352.82196230706245	270.7390515122939	-68	21/02/24 15:47:55
97	362.5947869084557	269.0761103596411	-64	21/02/24 15:47:55
99	360.0550977801786	265.17619063766165	-69	21/02/24 15:47:55
100	345.6304273143794	285.66832195343085	-70	21/02/24 15:47:55

114	381.5992223502213	289.5952994882171	-68	21/02/24 15:47:56
116	377.9647653672978	286.9907349984353	-65	21/02/24 15:47:56
115	377.751717565356	288.3800056854842	-65	21/02/24 15:47:56
96	377.44892680179316	276.8922953490967	-65	21/02/24 15:47:56
94	371.72787175525207	289.5180158335357	-59	21/02/24 15:47:56
92	370.6727223195025	288.1316940639638	-56	21/02/24 15:47:56
110	367.98757076589385	277.42210180952264	-56	21/02/24 15:47:56
93	366.9922408772935	287.5344913496744	-51	21/02/24 15:47:56
109	365.34205862707444	280.9445005087476	-42	21/02/24 15:47:56
112	360.33084939037263	282.2851479696295	-53	21/02/24 15:47:56
111	349.3574161788773	282.0413831973989	-69	21/02/24 15:47:56
102	348.60037065169166	290.2443240990335	-68	21/02/24 15:47:56
119	363.6527972760671	276.499073089803	-56	21/02/24 15:47:56
118	357.09356967635637	275.4844405310735	-64	21/02/24 15:47:56
117	369.239898205492	274.21448833832176	-61	21/02/24 15:47:56
108	354.5433741308232	271.8469578377465	-68	21/02/24 15:47:56
107	352.24436078636603	271.4962331820773	-68	21/02/24 15:47:56
106	352.82196230706245	270.7390515122939	-70	21/02/24 15:47:56
97	362.5947869084557	269.0761103596411	-66	21/02/24 15:47:56
99	360.0550977801786	265.17619063766165	-71	21/02/24 15:47:56
100	345.6304273143794	285.66832195343085	-72	21/02/24 15:47:56

114	381.5992223502213	289.5952994882171	-67	21/02/24 15:47:57
116	377.9647653672978	286.9907349984353	-65	21/02/24 15:47:57
115	377.751717565356	288.3800056854842	-65	21/02/24 15:47:57
96	377.44892680179316	276.8922953490967	-66	21/02/24 15:47:57
94	371.72787175525207	289.5180158335357	-58	21/02/24 15:47:57
92	370.6727223195025	288.1316940639638	-58	21/02/24 15:47:57
110	367.98757076589385	277.42210180952264	-54	21/02/24 15:47:57
93	366.9922408772935	287.5344913496744	-51	21/02/24 15:47:57
109	365.34205862707444	280.9445005087476	-44	21/02/24 15:47:57
112	360.33084939037263	282.2851479696295	-53	21/02/24 15:47:57
111	349.3574161788773	282.0413831973989	-69	21/02/24 15:47:57
102	348.60037065169166	290.2443240990335	-70	21/02/24 15:47:57
119	363.6527972760671	276.499073089803	-57	21/02/24 15:47:57
118	357.09356967635637	275.4844405310735	-62	21/02/24 15:47:57
117	369.239898205492	274.21448833832176	-60	21/02/24 15:47:57
108	354.5433741308232	271.8469578377465	-69	21/02/24 15:47:57
107	352.24436078636603	271.4962331820773	-70	21/02/24 15:47:57
106	352.82196230706245	270.7390515122939	-69	21/02/24 15:47:57
97	362.5947869084557	269.0761103596411	-66	21/02/24 15:47:57
99	360.0550977801786	265.17619063766165	-71	21/02/24 15:47:57
100	345.6304273143794	285.66832195343085	-70	21/02/24 15:47:57

114	381.5992223502213	289.5952994882171	-69	21/02/24 15:47:58
116	377.9647653672978	286.9907349984353	-67	21/02/24 15:47:58
115	377.751717565356	288.3800056854842	-64	21/02/24 15:47:58
96	377.44892680179316	276.8922953490967	-66	21/02/24 15:47:58
94	371.72787175525207	289.5180158335357	-59	21/02/24 15:47:58
92	370.6727223195025	288.1316940639638	-57	21/02/24 15:47:58
110	367.98757076589385	277.42210180952264	-56	21/02/24 15:47:58
93	366.9922408772935	287.5344913496744	-51	21/02/24 15:47:58
109	365.34205862707444	280.9445005087476	-45	21/02/24 15:47:58
112	360.33084939037263	282.2851479696295	-51	21/02/24 15:47:58
111	349.3574161788773	282.0413831973989	-68	21/02/24 15:47:58
102	348.60037065169166	290.2443240990335	-67	21/02/24 15:47:58
119	363.6527972760671	276.499073089803	-57	21/02/24 15:47:58
118	357.09356967635637	275.4844405310735	-64	21/02/24 15:47:58
117	369.239898205492	274.21448833832176	-61	21/02/24 15:47:58
108	354.5433741308232	271.8469578377465	-67	21/02/24 15:47:58
107	352.24436078636603	271.4962331820773	-71	21/02/24 15:47:58
106	352.82196230706245	270.7390515122939	-69	21/02/24 15:47:58
97	362.5947869084557	269.0761103596411	-65	21/02/24 15:47:58
99	360.0550977801786	265.17619063766165	-70	21/02/24 15:47:58
100	345.6304273143794	285.66832195343085	-72	21/02/24 15:47:58

114	381.5992223502213	289.5952994882171	-71	21/02/24 15:47:59
116	377.9647653672978	286.9907349984353	-65	21/02/24 15:47:59
115	377.751717565356	288.3800056854842	-64	21/02/24 15:47:59
96	377.44892680179316	276.8922953490967	-67	21/02/24 15:47:59
94	371.72787175525207	289.5180158335357	-59	21/02/24 15:47:59
92	370.6727223195025	288.1316940639638	-58	21/02/24 15:47:59
110	367.98757076589385	277.42210180952264	-57	21/02/24 15:47:59
93	366.9922408772935	287.5344913496744	-50	21/02/24 15:47:59
109	365.34205862707444	280.9445005087476	-41	21/02/24 15:47:59
112	360.33084939037263	282.2851479696295	-53	21/02/24 15:47:59
111	349.3574161788773	282.0413831973989	-70	21/02/24 15:47:59
102	348.60037065169166	290.2443240990335	-69	21/02/24 15:47:59
119	363.6527972760671	276.499073089803	-58	21/02/24 15:47:59
118	357.09356967635637	275.4844405310735	-63	21/02/24 15:47:59
117	369.239898205492	274.21448833832176	-61	21/02/24 15:47:59
108	354.5433741308232	271.8469578377465	-68	21/02/24 15:47:59
107	352.24436078636603	271.4962331820773	-67	21/02/24 15:47:59
106	352.82196230706245	270.7390515122939	-69	21/02/24 15:47:59
97	362.5947869084557	269.0761103596411	-66	21/02/24 15:47:59
99	360.0550977801786	265.17619063766165	-69	21/02/24 15:47:59

