floorId	partitionId	location_x	location_y	timeStamp
3	17	359.4808844292199	254.25140562337432	20/04/28 05:16:29
3	17	362.3945272480641	251.57317905073432	20/04/28 05:16:30
3	17	362.3945272480641	251.57317905073432	20/04/28 05:16:31
3	17	362.3945272480641	251.57317905073432	20/04/28 05:16:32
3	17	362.3945272480641	251.57317905073432	20/04/28 05:16:33
3	17	362.3945272480641	251.57317905073432	20/04/28 05:16:34
3	17	362.3945272480641	251.57317905073432	20/04/28 05:16:35
3	17	362.3945272480641	251.57317905073432	20/04/28 05:16:36
3	17	362.3945272480641	251.57317905073432	20/04/28 05:16:37
3	17	362.3945272480641	251.57317905073432	20/04/28 05:16:38
3	17	362.3945272480641	251.57317905073432	20/04/28 05:16:39
3	17	362.3945272480641	251.57317905073432	20/04/28 05:16:40
3	17	362.3945272480641	251.57317905073432	20/04/28 05:16:41
3	17	362.3945272480641	251.57317905073432	20/04/28 05:16:42
3	17	362.3945272480641	251.57317905073432	20/04/28 05:16:43
3	17	359.96968039487183	251.3655491305634	20/04/28 05:16:44
3	17	362.3945272480641	251.57317905073432	20/04/28 05:16:45
3	17	362.3945272480641	251.57317905073432	20/04/28 05:16:46
3	17	362.3945272480641	251.57317905073432	20/04/28 05:16:47
3	17	362.3945272480641	251.57317905073432	20/04/28 05:16:48
3	17	362.3945272480641	251.57317905073432	20/04/28 05:16:49
3	17	362.3945272480641	251.57317905073432	20/04/28 05:16:50
3	17	362.3945272480641	251.57317905073432	20/04/28 05:16:51
3	17	362.3945272480641	251.57317905073432	20/04/28 05:16:52
3	17	362.3945272480641	251.57317905073432	20/04/28 05:16:53
3	17	362.3945272480641	251.57317905073432	20/04/28 05:16:54
3	17	362.3945272480641	251.57317905073432	20/04/28 05:16:55
3	17	362.3945272480641	251.57317905073432	20/04/28 05:16:56
3	17	362.3945272480641	251.57317905073432	20/04/28 05:16:57
3	30	363.7510885757444	247.501779512455	20/04/28 05:16:58
3	30	363.7510885757444	247.501779512455	20/04/28 05:16:59
3	30	363.7510885757444	247.501779512455	20/04/28 05:17:00
3	30	365.5344509753579	248.80973562593917	20/04/28 05:17:01
3	30	363.12031496140963	247.33199182958694	20/04/28 05:17:02
3	17	362.3945272480641	251.57317905073432	20/04/28 05:17:03
3	17	362.3945272480641	251.57317905073432	20/04/28 05:17:04
3	17	363.0633788732786	253.76883669815365	20/04/28 05:17:05
3	17	361.9057312824121	254.45903554354518	20/04/28 05:17:06
3	34	361.2642468288334	255.55936173685845	20/04/28 05:17:07
3	57	365.8336784609425	258.95489486040736	20/04/28 05:17:08
3	34	362.2167196060361	259.70189758364177	20/04/28 05:17:09
3	57	365.8336784609425	258.9548948604074	20/04/28 05:17:10
3	57	370.51908075392413	258.7689659184304	20/04/28 05:17:11
3	54	372.48785670166836	262.3595943162643	20/04/28 05:17:12
3	54	372.48785670166836	262.3595943162643	20/04/28 05:17:13
3	54	375.1867774942457	263.7731434229599	20/04/28 05:17:14
3	54	376.35656519674916	261.5624468270555	20/04/28 05:17:15
3	46	374.77284073484725	264.6119154739458	20/04/28 05:17:16
3	15	380.97239583354167	266.94453563659977	20/04/28 05:17:17
3	15	380.97239583354167	266.94453563659977	20/04/28 05:17:18
1	33	381.6109766893215	266.73786054806715	20/04/28 05:17:19
1	33	379.51825801393375	263.17204603967434	20/04/28 05:17:20
1	69	376.18075636557654	261.96517202151136	20/04/28 05:17:21
1	74	374.7544496259107	264.45130263293123	20/04/28 05:17:22
1	74	374.7544496259107	264.45130263293123	20/04/28 05:17:23
1	69	372.48785670166836	262.3595943162643	20/04/28 05:17:24
1	69	368.9169651830857	261.65782172430613	20/04/28 05:17:25
1	13	368.31727752533806	266.1301521552222	20/04/28 05:17:26
3	54	364.18549555378036	263.2925259814757	20/04/28 05:17:27
3	54	358.87237025214637	261.21107622709695	20/04/28 05:17:28
3	54	358.87237025214637	261.21107622709695	20/04/28 05:17:29
3	54	358.87237025214637	261.21107622709695	20/04/28 05:17:30
3	54	358.87237025214637	261.21107622709695	20/04/28 05:17:31
3	54	358.87237025214637	261.21107622709695	20/04/28 05:17:32
3	54	357.6965830742679	260.8022089979779	20/04/28 05:17:33
3	54	358.87237025214637	261.21107622709695	20/04/28 05:17:34
1	64	358.87237025214637	261.21107622709695	20/04/28 05:17:35
3	54	358.87237025214637	261.21107622709695	20/04/28 05:17:36
1	64	357.3387197726773	263.8494133906552	20/04/28 05:17:37
3	54	358.87237025214637	261.21107622709695	20/04/28 05:17:38
1	64	359.7450566703883	261.7485007314006	20/04/28 05:17:39
3	54	358.87237025214637	261.21107622709695	20/04/28 05:17:40
1	64	358.2114061909192	264.3868378949589	20/04/28 05:17:41
3	54	360.0352469025501	262.00891114944136	20/04/28 05:17:42
1	64	358.87237025214637	261.21107622709695	20/04/28 05:17:43
3	54	360.0352469025501	262.00891114944136	20/04/28 05:17:44
3	54	357.6965830742679	260.80220899797797	20/04/28 05:17:45
3	54	358.87237025214637	261.21107622709695	20/04/28 05:17:46
1	64	354.49328963180795	262.3471616487957	20/04/28 05:17:47
1	64	354.49328963180795	262.3471616487957	20/04/28 05:17:48
1	41	352.7251685521831	260.56227788261185	20/04/28 05:17:49
1	41	351.1038521390131	261.25919659269	20/04/28 05:17:50
1	41	349.2732493252067	263.17227144197165	20/04/28 05:17:51
1	41	350.03191915941005	261.4911728805443	20/04/28 05:17:52
1	22	346.48253983850464	261.2777688197779	20/04/28 05:17:53
1	22	343.1917987024697	259.9647561276533	20/04/28 05:17:54
1	NULL	341.75641581596034	259.4998576241711	20/04/28 05:17:55
1	69	340.1854692097293	258.18142547541174	20/04/28 05:17:56
1	53	337.94213707957925	260.2324305968438	20/04/28 05:17:57
1	5	334.73798111152297	262.0967001435302	20/04/28 05:17:58
1	5	332.9065526505472	263.50534437986465	20/04/28 05:17:59
1	37	329.2127636639186	262.68039063695386	20/04/28 05:18:00
1	37	325.93617404217133	264.20930050997885	20/04/28 05:18:01
1	37	323.9780902572864	261.641853061257	20/04/28 05:18:02
1	37	323.6597216964546	264.1572674834102	20/04/28 05:18:03
1	72	322.34915620924	265.0152899264337	20/04/28 05:18:04
1	72	321.1077911072469	264.3050039939337	20/04/28 05:18:05
1	81	317.4633882763735	263.93806291016494	20/04/28 05:18:06
1	81	314.50318194109644	265.02915212402996	20/04/28 05:18:07
1	81	314.50318194109644	265.02915212402996	20/04/28 05:18:08
1	81	311.6591172126105	263.4112042347413	20/04/28 05:18:09
1	56	307.159840217744	263.3357311024059	20/04/28 05:18:10
1	56	307.159840217744	263.3357311024059	20/04/28 05:18:11
1	98	303.28594423312194	264.61216223098285	20/04/28 05:18:12
1	98	303.28594423312194	264.61216223098285	20/04/28 05:18:13
3	47	302.3157990937455	265.96754816044853	20/04/28 05:18:14
3	47	302.8570592601016	265.6207358146814	20/04/28 05:18:15
3	47	305.42047124180004	265.2616066172563	20/04/28 05:18:16
3	20	308.1866193271433	264.17491998155526	20/04/28 05:18:17
3	NULL	309.29436722642214	263.9851754886793	20/04/28 05:18:18
1	81	313.2523840549326	264.4074609667819	20/04/28 05:18:19
1	81	313.2523840549326	264.4074609667819	20/04/28 05:18:20
3	54	318.067754688647	263.500663028811	20/04/28 05:18:21
3	54	318.718225726321	262.2630310087092	20/04/28 05:18:22
3	18	323.5974156050991	264.28862562276623	20/04/28 05:18:24
3	54	324.01518066743233	262.76750572012435	20/04/28 05:18:25
3	18	323.5974156050991	264.28862562276623	20/04/28 05:18:26
3	54	327.3540763805351	261.1072377077433	20/04/28 05:18:27
3	54	327.3540763805351	261.1072377077433	20/04/28 05:18:28
3	54	334.4407240787428	261.4032786809491	20/04/28 05:18:29
3	54	334.4407240787428	261.4032786809491	20/04/28 05:18:30
3	54	334.4407240787428	261.4032786809491	20/04/28 05:18:31
3	NULL	337.70753542622793	260.45953294809686	20/04/28 05:18:32
3	NULL	337.70753542622793	260.4595329480968	20/04/28 05:18:33
3	99	339.59375125487367	258.8166372045796	20/04/28 05:18:34
3	42	343.1917987024697	259.9647561276533	20/04/28 05:18:35
3	42	346.3242319400108	259.3686329834299	20/04/28 05:18:36
3	54	349.17477120857285	262.4807721885283	20/04/28 05:18:37
3	54	350.37914153837863	260.97432627346046	20/04/28 05:18:38
3	54	350.37914153837863	260.97432627346046	20/04/28 05:18:39
3	54	352.7460406443366	261.2652131687019	20/04/28 05:18:40
3	54	354.93110780732565	263.85962413987545	20/04/28 05:18:41
3	54	359.56855835216805	263.2279362811352	20/04/28 05:18:42
3	54	359.5685583521681	263.2279362811352	20/04/28 05:18:43
3	46	361.61703194828846	264.17422801455785	20/04/28 05:18:44
3	54	364.361304384953	262.8898007870198	20/04/28 05:18:45
3	54	368.9169651830857	261.65782172430613	20/04/28 05:18:46
3	57	370.51908075392413	258.7689659184303	20/04/28 05:18:47
3	54	372.48785670166836	262.3595943162643	20/04/28 05:18:48
3	54	372.48785670166836	262.3595943162643	20/04/28 05:18:49
