floorId	partitionId	location_x	location_y	timeStamp
1	93	324.9710986825425	296.4754307966967	20/04/28 05:12:04
1	93	325.54973502904267	296.5446451310957	20/04/28 05:12:05
1	93	325.54973502904267	296.5446451310957	20/04/28 05:12:06
1	93	325.54973502904267	296.5446451310957	20/04/28 05:12:07
1	93	325.2351698940949	295.7424387172771	20/04/28 05:12:08
1	93	325.54973502904267	296.5446451310957	20/04/28 05:12:09
1	93	324.9710986825425	296.4754307966967	20/04/28 05:12:10
1	93	324.9710986825425	296.4754307966967	20/04/28 05:12:11
1	93	325.54973502904267	296.5446451310957	20/04/28 05:12:12
1	93	324.9710986825425	296.4754307966967	20/04/28 05:12:13
1	93	324.9710986825425	296.4754307966967	20/04/28 05:12:14
3	80	324.9710986825425	296.4754307966967	20/04/28 05:12:15
1	93	324.9710986825425	296.4754307966967	20/04/28 05:12:16
1	93	325.54973502904267	296.5446451310957	20/04/28 05:12:17
1	93	325.54973502904267	296.5446451310957	20/04/28 05:12:18
1	93	325.54973502904267	296.5446451310957	20/04/28 05:12:19
3	80	325.54973502904267	296.54464513109576	20/04/28 05:12:20
1	93	324.9710986825425	296.4754307966967	20/04/28 05:12:21
1	93	325.54973502904267	296.5446451310957	20/04/28 05:12:22
3	80	325.54973502904267	296.5446451310957	20/04/28 05:12:23
3	80	325.54973502904267	296.5446451310957	20/04/28 05:12:24
3	80	325.54973502904267	296.5446451310957	20/04/28 05:12:25
1	93	325.54973502904267	296.5446451310957	20/04/28 05:12:26
3	80	325.05942992810674	296.2909599991277	20/04/28 05:12:27
1	93	324.9710986825425	296.4754307966967	20/04/28 05:12:28
3	80	325.54973502904267	296.5446451310957	20/04/28 05:12:29
3	80	325.54973502904267	296.5446451310957	20/04/28 05:12:30
3	80	325.54973502904267	296.5446451310957	20/04/28 05:12:31
1	93	324.9710986825425	296.4754307966967	20/04/28 05:12:32
3	80	325.54973502904267	296.5446451310957	20/04/28 05:12:33
3	80	324.9710986825425	296.4754307966967	20/04/28 05:12:34
3	80	325.54973502904267	296.5446451310957	20/04/28 05:12:35
3	80	325.54973502904267	296.5446451310957	20/04/28 05:12:36
3	80	324.9710986825425	296.4754307966967	20/04/28 05:12:37
3	80	325.54973502904267	296.5446451310957	20/04/28 05:12:38
1	93	325.54973502904267	296.5446451310957	20/04/28 05:12:39
3	80	325.54973502904267	296.5446451310957	20/04/28 05:12:40
1	93	325.54973502904267	296.5446451310957	20/04/28 05:12:41
3	80	325.54973502904267	296.54464513109576	20/04/28 05:12:42
1	93	324.9710986825425	296.4754307966967	20/04/28 05:12:43
3	80	324.26141086195287	297.54299209078044	20/04/28 05:12:44
1	93	325.54973502904267	296.5446451310957	20/04/28 05:12:45
3	80	325.54973502904267	296.54464513109576	20/04/28 05:12:46
1	93	325.54973502904267	296.5446451310957	20/04/28 05:12:47
3	80	325.54973502904267	296.5446451310957	20/04/28 05:12:48
3	80	324.26141086195287	297.54299209078044	20/04/28 05:12:49
1	93	325.54973502904267	296.5446451310957	20/04/28 05:12:50
1	93	325.54973502904267	296.5446451310957	20/04/28 05:12:51
1	93	324.9710986825425	296.4754307966967	20/04/28 05:12:52
1	93	324.9710986825425	296.4754307966967	20/04/28 05:12:53
3	80	324.26141086195287	297.54299209078044	20/04/28 05:12:54
1	93	325.54973502904267	296.5446451310957	20/04/28 05:12:55
1	93	324.9710986825425	296.4754307966967	20/04/28 05:12:56
1	93	325.54973502904267	296.5446451310957	20/04/28 05:12:57
1	93	325.54973502904267	296.5446451310957	20/04/28 05:12:58
1	93	324.9710986825425	296.4754307966967	20/04/28 05:12:59
3	80	325.54973502904267	296.5446451310957	20/04/28 05:13:00
1	93	324.9710986825425	296.4754307966967	20/04/28 05:13:01
1	93	325.54973502904267	296.5446451310957	20/04/28 05:13:02
1	93	324.9710986825425	296.4754307966967	20/04/28 05:13:03
1	93	325.54973502904267	296.5446451310957	20/04/28 05:13:04
1	93	325.54973502904267	296.5446451310957	20/04/28 05:13:05
3	80	325.05942992810674	296.2909599991277	20/04/28 05:13:06
3	80	324.9710986825425	296.4754307966967	20/04/28 05:13:07
1	93	324.9710986825425	296.4754307966967	20/04/28 05:13:08
3	80	324.9710986825425	296.4754307966967	20/04/28 05:13:09
1	93	324.9710986825425	296.4754307966967	20/04/28 05:13:10
1	93	324.9710986825425	296.4754307966967	20/04/28 05:13:11
1	93	324.9710986825425	296.4754307966967	20/04/28 05:13:12
3	80	325.54973502904267	296.5446451310957	20/04/28 05:13:13
1	93	325.2351698940949	295.7424387172771	20/04/28 05:13:14
1	93	325.2351698940949	295.7424387172771	20/04/28 05:13:15
1	93	325.54973502904267	296.5446451310957	20/04/28 05:13:16
3	80	324.9710986825425	296.4754307966967	20/04/28 05:13:17
1	93	325.54973502904267	296.5446451310957	20/04/28 05:13:18
1	93	324.9710986825425	296.4754307966967	20/04/28 05:13:19
3	80	324.9710986825425	296.4754307966967	20/04/28 05:13:20
1	93	325.54973502904267	296.5446451310957	20/04/28 05:13:21
1	93	325.54973502904267	296.5446451310957	20/04/28 05:13:22
1	93	325.2351698940949	295.7424387172771	20/04/28 05:13:23
1	93	324.9710986825425	296.4754307966967	20/04/28 05:13:24
3	80	325.54973502904267	296.5446451310957	20/04/28 05:13:25
1	93	325.54973502904267	296.5446451310957	20/04/28 05:13:26
1	93	324.9710986825425	296.4754307966967	20/04/28 05:13:27
1	93	325.2351698940949	295.7424387172771	20/04/28 05:13:28
1	93	324.9710986825425	296.4754307966967	20/04/28 05:13:29
1	93	324.9710986825425	296.4754307966967	20/04/28 05:13:30
3	80	324.9710986825425	296.4754307966967	20/04/28 05:13:31
1	93	324.9710986825425	296.4754307966967	20/04/28 05:13:32
1	93	324.9710986825425	296.4754307966967	20/04/28 05:13:33
1	93	325.54973502904267	296.5446451310957	20/04/28 05:13:34
1	93	324.9710986825425	296.4754307966967	20/04/28 05:13:35
1	93	325.54973502904267	296.5446451310957	20/04/28 05:13:36
3	80	325.54973502904267	296.5446451310957	20/04/28 05:13:37
1	93	325.54973502904267	296.5446451310957	20/04/28 05:13:38
3	80	325.54973502904267	296.5446451310957	20/04/28 05:13:39
1	93	325.2351698940949	295.7424387172771	20/04/28 05:13:40
3	80	325.54973502904267	296.5446451310957	20/04/28 05:13:41
1	93	325.54973502904267	296.5446451310957	20/04/28 05:13:42
3	80	325.54973502904267	296.5446451310957	20/04/28 05:13:43
3	80	325.54973502904267	296.5446451310957	20/04/28 05:13:44
3	80	324.9710986825425	296.4754307966967	20/04/28 05:13:45
1	93	325.54973502904267	296.5446451310957	20/04/28 05:13:46
3	80	325.54973502904267	296.5446451310957	20/04/28 05:13:47
1	93	324.9710986825425	296.4754307966967	20/04/28 05:13:48
3	80	324.9710986825425	296.4754307966967	20/04/28 05:13:49
3	80	325.54973502904267	296.5446451310957	20/04/28 05:13:50
3	80	325.54973502904267	296.5446451310957	20/04/28 05:13:51
3	80	325.54973502904267	296.5446451310957	20/04/28 05:13:52
3	80	325.54973502904267	296.5446451310957	20/04/28 05:13:53
3	80	325.54973502904267	296.5446451310957	20/04/28 05:13:54
3	80	325.54973502904267	296.54464513109576	20/04/28 05:13:55
3	80	324.9710986825425	296.4754307966967	20/04/28 05:13:56
3	80	324.9710986825425	296.4754307966967	20/04/28 05:13:57
3	80	324.9710986825425	296.4754307966967	20/04/28 05:13:58
1	93	325.54973502904267	296.5446451310957	20/04/28 05:13:59
3	80	324.9710986825425	296.4754307966967	20/04/28 05:14:00
1	93	325.54973502904267	296.5446451310957	20/04/28 05:14:01
1	93	324.9710986825425	296.4754307966967	20/04/28 05:14:02
3	80	324.9710986825425	296.4754307966967	20/04/28 05:14:03
1	93	325.54973502904267	296.5446451310957	20/04/28 05:14:04
3	80	326.3075981815729	296.7406310285486	20/04/28 05:14:05
3	80	325.54973502904267	296.5446451310957	20/04/28 05:14:06
3	80	325.54973502904267	296.5446451310957	20/04/28 05:14:07
1	93	325.2351698940949	295.7424387172771	20/04/28 05:14:08
3	80	324.9710986825425	296.4754307966967	20/04/28 05:14:09
1	93	325.54973502904267	296.5446451310957	20/04/28 05:14:10
3	80	325.54973502904267	296.5446451310957	20/04/28 05:14:11
3	80	325.54973502904267	296.54464513109576	20/04/28 05:14:12
1	93	325.54973502904267	296.5446451310957	20/04/28 05:14:13
3	80	325.54973502904267	296.5446451310957	20/04/28 05:14:14
1	93	325.54973502904267	296.5446451310957	20/04/28 05:14:15
3	80	326.3075981815729	296.7406310285486	20/04/28 05:14:16
3	80	325.54973502904267	296.5446451310957	20/04/28 05:14:17
1	93	325.54973502904267	296.5446451310957	20/04/28 05:14:18
3	80	325.54973502904267	296.5446451310957	20/04/28 05:14:19
1	93	324.9710986825425	296.4754307966967	20/04/28 05:14:20
1	93	324.9710986825425	296.4754307966967	20/04/28 05:14:21
3	80	326.45134060531365	296.5176004896669	20/04/28 05:14:22
1	93	324.9710986825425	296.4754307966967	20/04/28 05:14:23
1	93	325.54973502904267	296.5446451310957	20/04/28 05:14:24
1	93	325.54973502904267	296.5446451310957	20/04/28 05:14:25
1	93	325.54973502904267	296.5446451310957	20/04/28 05:14:26
3	80	325.54973502904267	296.5446451310957	20/04/28 05:14:27
3	80	325.54973502904267	296.5446451310957	20/04/28 05:14:28
1	93	325.54973502904267	296.5446451310957	20/04/28 05:14:29
1	93	325.54973502904267	296.5446451310957	20/04/28 05:14:30
3	80	325.54973502904267	296.5446451310957	20/04/28 05:14:31
1	93	324.9710986825425	296.4754307966967	20/04/28 05:14:32
1	93	324.9710986825425	296.4754307966967	20/04/28 05:14:33
1	93	325.54973502904267	296.5446451310957	20/04/28 05:14:34
1	93	324.9710986825425	296.4754307966967	20/04/28 05:14:35
1	93	325.54973502904267	296.5446451310957	20/04/28 05:14:36
1	93	325.54973502904267	296.5446451310957	20/04/28 05:14:37
1	93	325.2351698940949	295.7424387172771	20/04/28 05:14:38
1	93	324.9710986825425	296.4754307966967	20/04/28 05:14:39
1	93	324.9710986825425	296.4754307966967	20/04/28 05:14:40
1	93	324.9710986825425	296.4754307966967	20/04/28 05:14:41
1	93	325.2351698940949	295.7424387172771	20/04/28 05:14:42
1	93	325.54973502904267	296.5446451310957	20/04/28 05:14:43
1	93	325.54973502904267	296.5446451310957	20/04/28 05:14:44
1	93	324.9710986825425	296.4754307966967	20/04/28 05:14:45
1	93	325.54973502904267	296.5446451310957	20/04/28 05:14:46
3	80	324.9710986825425	296.4754307966967	20/04/28 05:14:47
1	93	325.2351698940949	295.7424387172771	20/04/28 05:14:48
1	93	324.9710986825425	296.4754307966967	20/04/28 05:14:49
1	93	324.9710986825425	296.4754307966967	20/04/28 05:14:50
1	93	325.54973502904267	296.5446451310957	20/04/28 05:14:51
1	93	325.54973502904267	296.5446451310957	20/04/28 05:14:52
1	93	325.2351698940949	295.7424387172771	20/04/28 05:14:53
1	93	325.2351698940949	295.7424387172771	20/04/28 05:14:54
1	93	325.54973502904267	296.5446451310957	20/04/28 05:14:55
