floorId	partitionId	location_x	location_y	timeStamp
19	958	365.55243192741585	288.59648801263694	21/02/24 15:47:21
19	958	365.55243192741585	288.59648801263694	21/02/24 15:47:22
19	958	365.55243192741585	288.59648801263694	21/02/24 15:47:23
19	958	364.8238741505902	287.1482151372541	21/02/24 15:47:24
19	958	364.8238741505902	287.1482151372541	21/02/24 15:47:25
19	959	362.3530560401282	287.71527633822046	21/02/24 15:47:26
19	NULL	360.5547106147948	283.12207921272073	21/02/24 15:47:27
19	990	357.82242061436585	282.16385269148645	21/02/24 15:47:28
19	964	355.482293890607	282.3613173869535	21/02/24 15:47:29
19	968	355.71807547868275	279.11092240486005	21/02/24 15:47:30
19	964	355.482293890607	282.3613173869535	21/02/24 15:47:31
19	968	355.71807547868275	279.11092240486005	21/02/24 15:47:32
19	904	347.25758750563756	270.59329170523137	21/02/24 15:47:33
19	904	345.58406694546534	272.03626967984314	21/02/24 15:47:34
19	904	345.58406694546534	272.03626967984314	21/02/24 15:47:35
19	919	341.8507959684553	269.41861351939014	21/02/24 15:47:36
19	NULL	337.73701806888556	270.34580290420837	21/02/24 15:47:37
19	NULL	337.73701806888556	270.34580290420837	21/02/24 15:47:38
19	950	335.24432386191205	269.68948620372345	21/02/24 15:47:39
19	950	335.24432386191205	269.68948620372345	21/02/24 15:47:40
19	909	332.94477462052106	270.4919384994539	21/02/24 15:47:41
19	950	332.12560097371966	268.39264382435715	21/02/24 15:47:42
19	950	332.12560097371966	268.39264382435715	21/02/24 15:47:43
19	950	332.12560097371966	268.39264382435715	21/02/24 15:47:44
19	909	330.2883825087984	271.703362840502	21/02/24 15:47:45
19	950	332.2582390839596	268.0041714005477	21/02/24 15:47:46
19	950	332.12560097371966	268.39264382435715	21/02/24 15:47:47
19	950	332.12560097371966	268.3926438243572	21/02/24 15:47:48
19	950	332.12560097371966	268.39264382435715	21/02/24 15:47:49
19	950	332.12560097371966	268.39264382435715	21/02/24 15:47:50
19	950	332.2582390839596	268.0041714005477	21/02/24 15:47:51
19	950	332.12560097371966	268.39264382435715	21/02/24 15:47:52
19	950	334.5577883253506	267.2017191048172	21/02/24 15:47:53
19	950	332.12560097371966	268.3926438243571	21/02/24 15:47:54
19	950	332.12560097371966	268.3926438243571	21/02/24 15:47:55
19	950	332.12560097371966	268.3926438243571	21/02/24 15:47:56
19	950	332.12560097371966	268.39264382435715	21/02/24 15:47:57
19	950	334.5577883253506	267.2017191048172	21/02/24 15:47:58
19	950	334.5577883253506	267.2017191048172	21/02/24 15:47:59
