floorId	partitionId	location_x	location_y	timeStamp
3	42	347.7398772555066	258.15998221692	20/04/28 05:16:29
3	42	347.97911643533104	258.32294246033496	20/04/28 05:16:29
3	42	348.20484952437926	258.47670289023233	20/04/28 05:16:29
3	42	348.4119933811402	258.6178010721624	20/04/28 05:16:29
3	42	348.5619450694581	258.71994221663005	20/04/28 05:16:29
3	42	348.7260530743031	258.83172608261515	20/04/28 05:16:29
3	42	348.87134527076824	258.9306933659825	20/04/28 05:16:29
3	42	348.87134527076824	258.9306933659825	20/04/28 05:16:29
3	42	349.0160638039915	259.0292698926953	20/04/28 05:16:29
3	42	349.2283382194104	259.1738628077555	20/04/28 05:16:30
3	42	349.38061708212393	259.2775891311485	20/04/28 05:16:30
3	42	349.5068515402313	259.36357503878963	20/04/28 05:16:30
3	42	349.7507985431968	259.5297420646621	20/04/28 05:16:30
3	42	349.93701683057117	259.6565865784291	20/04/28 05:16:30
3	42	350.16367162283535	259.81097483601144	20/04/28 05:16:30
3	42	350.3680445965505	259.95018560227675	20/04/28 05:16:30
3	42	350.59105202438036	260.1020894198252	20/04/28 05:16:30
3	42	350.75991318155366	260.2171109447129	20/04/28 05:16:30
3	42	351.0070945720394	260.3854811071201	20/04/28 05:16:30
3	42	351.2048929774023	260.5202135381068	20/04/28 05:16:31
3	34	351.6006926033948	260.588410000001	20/04/28 05:16:31
3	34	351.8656840723702	260.588410000001	20/04/28 05:16:31
3	34	351.8656840723702	260.588410000001	20/04/28 05:16:31
3	34	352.23535391172095	260.588410000001	20/04/28 05:16:31
3	34	352.4288196052082	260.588410000001	20/04/28 05:16:31
3	34	352.660170182854	260.588410000001	20/04/28 05:16:31
3	34	352.88492370086897	260.588410000001	20/04/28 05:16:31
3	34	353.1818365017778	260.588410000001	20/04/28 05:16:31
3	34	353.41826863903975	260.588410000001	20/04/28 05:16:32
3	34	353.68943485477496	260.588410000001	20/04/28 05:16:32
3	34	353.8860216944358	260.588410000001	20/04/28 05:16:32
3	34	354.13930033356235	260.588410000001	20/04/28 05:16:32
3	34	354.3938189776813	260.588410000001	20/04/28 05:16:32
3	34	354.6571153830204	260.588410000001	20/04/28 05:16:32
3	34	354.9442446602119	260.588410000001	20/04/28 05:16:32
3	34	355.1657368216852	260.588410000001	20/04/28 05:16:32
3	34	355.36376393946017	260.588410000001	20/04/28 05:16:32
3	34	355.5622858655722	260.588410000001	20/04/28 05:16:32
3	34	355.856342835541	260.588410000001	20/04/28 05:16:33
3	34	356.1147226692483	260.588410000001	20/04/28 05:16:33
3	34	356.29478066443045	260.588410000001	20/04/28 05:16:33
3	34	356.5753328928552	260.588410000001	20/04/28 05:16:33
3	34	356.7464112594817	260.588410000001	20/04/28 05:16:33
3	34	357.0459187958717	260.588410000001	20/04/28 05:16:33
3	34	357.28396048395194	260.588410000001	20/04/28 05:16:33
3	34	357.45374419741376	260.588410000001	20/04/28 05:16:33
3	34	357.7123089261621	260.588410000001	20/04/28 05:16:33
3	34	357.9185460542809	260.588410000001	20/04/28 05:16:33
3	34	358.1764258099069	260.588410000001	20/04/28 05:16:34
3	34	358.41519424627035	260.588410000001	20/04/28 05:16:34
3	34	358.5996971553446	260.588410000001	20/04/28 05:16:34
3	34	358.89618114658464	260.588410000001	20/04/28 05:16:34
3	34	359.1371625638029	260.588410000001	20/04/28 05:16:34
3	34	359.39935327328277	260.588410000001	20/04/28 05:16:34
3	34	359.39935327328277	260.588410000001	20/04/28 05:16:34
3	34	359.68633968516065	260.588410000001	20/04/28 05:16:34
3	34	359.90627144865414	260.588410000001	20/04/28 05:16:34
3	34	360.1011652173543	260.588410000001	20/04/28 05:16:35
3	34	360.3781208716551	260.588410000001	20/04/28 05:16:35
3	34	360.5305989174444	260.588410000001	20/04/28 05:16:35
3	34	360.7542661090354	260.588410000001	20/04/28 05:16:35
3	34	360.95721196996567	260.588410000001	20/04/28 05:16:35
3	34	361.24549447616005	260.588410000001	20/04/28 05:16:35
3	34	361.5253643205082	260.588410000001	20/04/28 05:16:35
3	34	361.78086386333524	260.588410000001	20/04/28 05:16:35
3	34	361.96172013397705	260.588410000001	20/04/28 05:16:35
3	34	362.182416723757	260.588410000001	20/04/28 05:16:35
3	34	362.4784271377425	260.58841000000103	20/04/28 05:16:36
3	34	362.4784271377425	260.58841000000103	20/04/28 05:16:36
3	34	362.4784271377425	260.58841000000103	20/04/28 05:16:36
3	34	362.72399310825324	260.58841000000103	20/04/28 05:16:36
3	34	362.8963288178925	260.58841000000103	20/04/28 05:16:36
3	34	363.1615384714627	260.5884100000011	20/04/28 05:16:36
3	34	363.3574327206529	260.58841000000115	20/04/28 05:16:36
3	34	363.514978680475	260.4845660965737	20/04/28 05:16:36
3	34	363.5667574766788	260.19922089019667	20/04/28 05:16:36
3	34	363.6170847739151	259.9218746776704	20/04/28 05:16:36
3	34	363.6702923732632	259.6286555507319	20/04/28 05:16:37
3	34	363.72338276907084	259.33608231498584	20/04/28 05:16:37
3	34	363.75282666355	259.17382141356114	20/04/28 05:16:37
3	34	363.79646205089205	258.9333533162064	20/04/28 05:16:37
3	34	363.82787567877995	258.76023750838726	20/04/28 05:16:37
3	34	363.85660019707336	258.60194098159565	20/04/28 05:16:37
3	34	363.8834902707251	258.45375380502554	20/04/28 05:16:37
3	34	363.92577384940455	258.2207353231519	20/04/28 05:16:37
3	34	363.96595893563756	257.9992813194838	20/04/28 05:16:37
3	34	364.00512699350554	257.78343200711777	20/04/28 05:16:38
3	34	364.0518570097343	257.5259098725296	20/04/28 05:16:38
3	34	364.1008288547584	257.256033354542	20/04/28 05:16:38
3	34	364.1439570873811	257.01836011103944	20/04/28 05:16:38
3	34	364.18874885211346	256.771519390733	20/04/28 05:16:38
3	34	364.22095234923825	256.59405073161287	20/04/28 05:16:38
3	34	364.2619914122853	256.3678905893688	20/04/28 05:16:38
3	34	364.3055477639299	256.1278580459289	20/04/28 05:16:38
3	34	364.3334050899053	255.97434048638047	20/04/28 05:16:38
3	17	364.33608333333336	255.8078266018714	20/04/28 05:16:38
3	17	364.33608333333336	255.5784212892869	20/04/28 05:16:39
3	17	364.33608333333336	255.39876883853128	20/04/28 05:16:39
3	17	364.33608333333336	255.11908099052695	20/04/28 05:16:39
3	17	364.33608333333336	254.8430571617136	20/04/28 05:16:39
3	17	364.33608333333336	254.6425992035328	20/04/28 05:16:39
3	17	364.33608333333336	254.413859935024	20/04/28 05:16:39
3	17	364.33608333333336	254.19369174393535	20/04/28 05:16:39
3	17	364.33608333333336	253.96730338337437	20/04/28 05:16:39
3	17	364.33608333333336	253.66835194538228	20/04/28 05:16:39
3	17	364.33608333333336	253.36855689885058	20/04/28 05:16:39
3	17	364.33608333333336	253.08249141015762	20/04/28 05:16:40
3	17	364.33608333333336	252.92528899452842	20/04/28 05:16:40
3	17	364.33608333333336	252.73738404445322	20/04/28 05:16:40
3	17	364.33608333333336	252.48304504356804	20/04/28 05:16:40
3	17	364.33608333333336	252.217923583399	20/04/28 05:16:40
3	17	364.33608333333336	252.04314797354817	20/04/28 05:16:40
3	17	364.33608333333336	251.86754558496472	20/04/28 05:16:40
3	17	364.33608333333336	251.6429320934704	20/04/28 05:16:40
3	17	364.33608333333336	251.48806890192077	20/04/28 05:16:40
3	17	364.33608333333336	251.32016895785134	20/04/28 05:16:41
3	57	364.21528318679077	251.2148908524156	20/04/28 05:16:41
3	57	364.0157975158959	251.26871922242455	20/04/28 05:16:41
3	57	363.7656136483998	251.3362277794524	20/04/28 05:16:41
3	57	363.48302488324964	251.41248033705534	20/04/28 05:16:41
3	57	363.2905761119463	251.4644098998305	20/04/28 05:16:41
3	57	363.1457317478503	251.50349409063628	20/04/28 05:16:41
3	57	362.88300223236087	251.57438791227568	20/04/28 05:16:41
3	57	362.60264619410805	251.6500380002926	20/04/28 05:16:41
3	57	362.41192922635685	251.70150026051934	20/04/28 05:16:41
3	57	362.206711856416	251.7568752479652	20/04/28 05:16:42
3	57	362.02687252429786	251.80540233298336	20/04/28 05:16:42
3	57	361.74478757113064	251.88151894409094	20/04/28 05:16:42
3	57	361.5935473788629	251.922328958129	20/04/28 05:16:42
3	57	361.34843497431893	251.988469053036	20/04/28 05:16:42
3	57	361.13789539655494	252.04528016253857	20/04/28 05:16:42
3	57	360.9880417468044	252.0857160378061	20/04/28 05:16:42
3	57	360.77700817203043	252.14266044537325	20/04/28 05:16:42
3	57	360.6254155566511	252.1835655557737	20/04/28 05:16:42
3	17	360.3564001325465	252.25615554041698	20/04/28 05:16:42
3	17	360.3649481784631	252.2494127851532	20/04/28 05:16:43
3	17	360.5814095137458	252.0713657977398	20/04/28 05:16:43
3	17	360.729745427821	252.083729907596	20/04/28 05:16:43
3	17	360.5898408703976	251.9067908458552	20/04/28 05:16:43
3	17	360.60255417428687	251.99432289533104	20/04/28 05:16:43
3	17	360.78266827388967	252.1158999176223	20/04/28 05:16:43
3	17	360.7873983897706	252.1385842072613	20/04/28 05:16:43
3	17	360.92051036732107	252.01926520516702	20/04/28 05:16:43
3	17	360.7425233083361	251.8759658163719	20/04/28 05:16:43
3	17	360.82963907748444	251.94765291917133	20/04/28 05:16:44
3	17	360.9460971458466	252.02963529551548	20/04/28 05:16:44
3	17	360.95099371864615	251.9920490543292	20/04/28 05:16:44
3	17	361.2170176159249	252.0145149264815	20/04/28 05:16:44
3	17	361.4070081561497	252.0604637812931	20/04/28 05:16:44
3	17	361.3867073170099	252.19429435279605	20/04/28 05:16:44
3	17	361.2256069190687	252.0201139051624	20/04/28 05:16:44
3	17	361.32300436200353	251.73989302659686	20/04/28 05:16:44
3	17	361.30040611397635	251.62969341159797	20/04/28 05:16:44
3	17	361.2965412757528	251.6085549710628	20/04/28 05:16:44
3	17	361.5055651885014	251.67297349442345	20/04/28 05:16:45
3	17	361.4082122008241	251.66099726702154	20/04/28 05:16:45
3	17	361.25289975110525	251.69748804055348	20/04/28 05:16:45
3	17	361.36689551292454	251.82014935505129	20/04/28 05:16:45
3	17	361.3278736491602	251.58598277599583	20/04/28 05:16:45
3	17	361.3579607826221	251.55132112440586	20/04/28 05:16:45
3	17	361.52013560067167	251.42682950704574	20/04/28 05:16:45
3	17	361.55578131320505	251.50741246065374	20/04/28 05:16:45
3	17	361.642566232128	251.63369200501916	20/04/28 05:16:45
3	17	361.4800827025468	251.43557439237415	20/04/28 05:16:45
3	17	361.3152074307347	251.64663388590182	20/04/28 05:16:46
3	17	361.36670188341077	251.75719004011896	20/04/28 05:16:46
3	17	361.58792504909525	251.93179573447884	20/04/28 05:16:46
3	17	361.77324474078256	251.7882279096306	20/04/28 05:16:46
3	17	361.90587932941816	251.8790400572097	20/04/28 05:16:46
3	17	361.90188589958717	251.98971578762348	20/04/28 05:16:46
3	17	362.07369474984466	252.23481941307566	20/04/28 05:16:46
3	17	362.04555320065083	252.2428134745392	20/04/28 05:16:46
3	17	362.0484589395136	252.25218728365428	20/04/28 05:16:46
3	17	362.11233309336535	252.18606809514236	20/04/28 05:16:47
3	17	362.15342527055606	251.94440492997145	20/04/28 05:16:47
3	17	362.1738073204884	252.1819420602827	20/04/28 05:16:47
3	17	362.03381512604864	252.2841120671221	20/04/28 05:16:47
3	17	362.1501940035465	252.29558877311212	20/04/28 05:16:47
3	17	362.1840244565163	252.48142294058712	20/04/28 05:16:47
3	17	362.23227747969736	252.5244105219394	20/04/28 05:16:47
3	17	362.00471109518725	252.44249651222043	20/04/28 05:16:47
3	17	362.20481547840546	252.5616682996636	20/04/28 05:16:47
3	17	362.1213010443816	252.72936852539164	20/04/28 05:16:47
3	17	362.14496616881934	252.82070495417776	20/04/28 05:16:48
3	17	361.98809672399636	252.62068703552066	20/04/28 05:16:48
3	17	362.18252674468755	252.62892258530636	20/04/28 05:16:48
3	17	362.24308748218164	252.36388342365885	20/04/28 05:16:48
3	17	362.20514006724113	252.46413800817618	20/04/28 05:16:48
3	17	362.23060944749005	252.42717623393972	20/04/28 05:16:48
3	17	362.32848414100073	252.5357609440202	20/04/28 05:16:48
3	17	362.13293119925925	252.4796294237509	20/04/28 05:16:48
3	17	362.15427165152363	252.55167475215407	20/04/28 05:16:48
3	17	362.19508936963854	252.63201135520745	20/04/28 05:16:48
3	17	361.94968178919703	252.79938994275372	20/04/28 05:16:49
3	17	362.0266893413693	252.5333763194041	20/04/28 05:16:49
3	17	361.9248996717542	252.4706255003193	20/04/28 05:16:49
3	17	361.7262934017478	252.68156966579616	20/04/28 05:16:49
3	17	361.940120238702	252.76040509050537	20/04/28 05:16:49
3	17	361.89867494523025	252.82165061306483	20/04/28 05:16:49
3	17	361.91128720323604	252.76847730198395	20/04/28 05:16:49
3	17	361.8794490560304	252.78750631328396	20/04/28 05:16:49
3	17	361.8794490560304	252.78750631328396	20/04/28 05:16:49
3	17	361.8794490560304	252.78750631328396	20/04/28 05:16:50
3	17	362.073948975087	252.59490573434894	20/04/28 05:16:50
3	17	362.27511812266744	252.3957010535666	20/04/28 05:16:50
3	17	362.3942134950953	252.2777686770939	20/04/28 05:16:50
3	17	362.5438380912369	252.1296052023759	20/04/28 05:16:50
3	17	362.7073381754697	251.9677017371616	20/04/28 05:16:50
3	17	362.8261154285893	251.85008437348299	20/04/28 05:16:50
3	17	362.94006893605336	251.73724365038285	20/04/28 05:16:50
3	17	363.1088618259005	251.57009906511848	20/04/28 05:16:50
3	17	363.311719254301	251.36922258999846	20/04/28 05:16:50
3	17	363.47158777829316	251.21091522193512	20/04/28 05:16:51
3	17	363.63386806556844	251.05021964205744	20/04/28 05:16:51
3	17	363.8359029675364	250.8501576611947	20/04/28 05:16:51
3	17	364.0344498475425	250.65354964089119	20/04/28 05:16:51
3	17	364.2443461185864	250.4457030591782	20/04/28 05:16:51
3	34	364.33608333333336	250.39474977188934	20/04/28 05:16:51
3	34	364.33608333333336	250.554964799069	20/04/28 05:16:51
3	34	364.33608333333336	250.82176463318294	20/04/28 05:16:51
3	34	364.33608333333336	251.03901602938058	20/04/28 05:16:51
3	34	364.33608333333336	251.33147397209686	20/04/28 05:16:51
3	34	364.33608333333336	251.58020689533123	20/04/28 05:16:52
3	34	364.33608333333336	251.86820176100733	20/04/28 05:16:52
3	34	364.33608333333336	252.02085662564355	20/04/28 05:16:52
3	34	364.33608333333336	252.3169574644759	20/04/28 05:16:52
3	34	364.33608333333336	252.61515498650127	20/04/28 05:16:52
3	34	364.33608333333336	252.8428125092072	20/04/28 05:16:52
3	34	364.33608333333336	253.09876762361918	20/04/28 05:16:52
3	34	364.33608333333336	253.30710874446544	20/04/28 05:16:52
3	34	364.33608333333336	253.5468352734819	20/04/28 05:16:52
3	34	364.33608333333336	253.77810417203423	20/04/28 05:16:52
3	34	364.33608333333336	254.04610641359665	20/04/28 05:16:53
3	34	364.33608333333336	254.23207892544016	20/04/28 05:16:53
3	34	364.33608333333336	254.43502533057597	20/04/28 05:16:53
3	34	364.33608333333336	254.68341223142204	20/04/28 05:16:53
3	34	364.33608333333336	254.8775654538355	20/04/28 05:16:53
3	34	364.33608333333336	255.11345171334025	20/04/28 05:16:53
3	34	364.33608333333336	255.36837494098123	20/04/28 05:16:53
3	34	364.33608333333336	255.66080222045284	20/04/28 05:16:53
3	34	364.3239625817486	255.84398260436592	20/04/28 05:16:53
3	34	364.22437759845695	256.0968296373193	20/04/28 05:16:54
3	34	364.144140790478	256.3005515054217	20/04/28 05:16:54
3	34	364.0345483081549	256.5788076548276	20/04/28 05:16:54
3	34	363.936620794571	256.8274463595375	20/04/28 05:16:54
3	34	363.8412634736484	257.06955932545577	20/04/28 05:16:54
3	34	363.76485278560835	257.26356664581914	20/04/28 05:16:54
3	34	363.7070775386127	257.41025843908096	20/04/28 05:16:54
3	34	363.6319411732867	257.6010302443434	20/04/28 05:16:54
3	34	363.5287520139441	257.8630283078096	20/04/28 05:16:54
3	34	363.4443334721373	258.0773676300303	20/04/28 05:16:54
3	34	363.381908006465	258.2358663640187	20/04/28 05:16:55
3	34	363.30981893937104	258.4189010558025	20/04/28 05:16:55
3	34	363.21799936294025	258.6520316614438	20/04/28 05:16:55
3	34	363.1419867611422	258.84502823779917	20/04/28 05:16:55
3	34	363.0489950327547	259.0811349462086	20/04/28 05:16:55
3	34	362.98882373840337	259.2339103220014	20/04/28 05:16:55
3	34	362.89827123512964	259.4638238192223	20/04/28 05:16:55
3	34	362.82817254222914	259.6418049357315	20/04/28 05:16:55
3	34	362.76268851174024	259.8080693891426	20/04/28 05:16:55
3	34	362.66853588609825	260.04712362454495	20/04/28 05:16:55
3	34	362.6056603184851	260.20676517079784	20/04/28 05:16:56
3	34	362.52070378421604	260.4224704599881	20/04/28 05:16:56
3	15	362.5118773182749	260.5935471541204	20/04/28 05:16:56
3	15	362.69574990419204	260.61025666348957	20/04/28 05:16:56
3	15	362.9686831573824	260.63505960368093	20/04/28 05:16:56
3	15	363.17488223768555	260.65379804392774	20/04/28 05:16:56
3	15	363.38615794371213	260.6729978249702	20/04/28 05:16:56
3	15	363.5522472888662	260.68809127381206	20/04/28 05:16:56
3	15	363.73090623490265	260.7043269911583	20/04/28 05:16:56
3	15	363.912446598983	260.7208245587503	20/04/28 05:16:57
3	15	364.12547193869983	260.7401833385929	20/04/28 05:16:57
3	15	364.41099146308363	260.7661300622111	20/04/28 05:16:57
3	15	364.6821526650524	260.79077196639844	20/04/28 05:16:57
3	15	364.9783157645497	260.81768593000623	20/04/28 05:16:57
3	15	365.2444246002281	260.8418686979855	20/04/28 05:16:57
3	15	365.4521963021838	260.86075005097865	20/04/28 05:16:57
3	15	365.6431951807648	260.87810716560904	20/04/28 05:16:57
3	15	365.8754922695341	260.8992172748831	20/04/28 05:16:57
3	15	366.1572254809893	260.92481991549926	20/04/28 05:16:57
3	15	366.4076386060441	260.94757632825315	20/04/28 05:16:58
3	15	366.69907265154694	260.9740605368127	20/04/28 05:16:58
3	15	366.9771405863252	260.99933009365424	20/04/28 05:16:58
3	15	367.23081313766716	261.02238270833413	20/04/28 05:16:58
3	15	367.5035849660659	261.0471709789702	20/04/28 05:16:58
3	15	367.8015965906141	261.07425292817794	20/04/28 05:16:58
3	15	368.0981341175054	261.1012009180546	20/04/28 05:16:58
3	15	368.24797245814074	261.11481754907226	20/04/28 05:16:58
3	15	368.45584772148726	261.1337083132565	20/04/28 05:16:58
3	15	368.7252211025563	261.1581877483627	20/04/28 05:16:58
3	15	368.94206319170496	261.1778933771392	20/04/28 05:16:59
3	15	369.0940802229083	261.19170799770643	20/04/28 05:16:59
3	15	369.36010087177914	261.21588275166727	20/04/28 05:16:59
3	15	369.5803661595234	261.23589946525675	20/04/28 05:16:59
3	15	369.87614343023506	261.2627783664887	20/04/28 05:16:59
3	15	370.07031702251936	261.2804239847484	20/04/28 05:16:59
3	15	370.2583984093524	261.2975159709179	20/04/28 05:16:59
3	15	370.46944424843093	261.3166948626913	20/04/28 05:16:59
3	15	370.70693407944725	261.33827686490577	20/04/28 05:16:59
3	15	370.8972212102885	261.35556929911917	20/04/28 05:16:59
3	15	371.0650232149764	261.370818386717	20/04/28 05:17:00
3	15	371.3139893684018	261.3934433052306	20/04/28 05:17:00
3	15	371.4932901923275	261.4097373535377	20/04/28 05:17:00
3	15	371.7070805006346	261.4291656502676	20/04/28 05:17:00
3	15	371.8935175407251	261.4461082056388	20/04/28 05:17:00
3	15	372.18616668876786	261.472702837224	20/04/28 05:17:00
3	15	372.39917699132025	261.4920602505571	20/04/28 05:17:00
3	15	372.68468640454176	261.5180060553186	20/04/28 05:17:00
3	15	372.98270911320583	261.54508901180066	20/04/28 05:17:00
3	15	373.13873767830245	261.559268182433	20/04/28 05:17:01
3	15	373.3862370034132	261.5817598022205	20/04/28 05:17:01
3	15	373.5472384875823	261.59639088925695	20/04/28 05:17:01
3	15	373.6982873565934	261.61011752762096	20/04/28 05:17:01
3	15	373.88170553672654	261.6267857426467	20/04/28 05:17:01
3	15	374.1803257223326	261.6539229951322	20/04/28 05:17:01
3	15	374.4008472789062	261.6739629972743	20/04/28 05:17:01
3	15	374.55411156088905	261.6878909623539	20/04/28 05:17:01
3	15	374.7054209396889	261.7016412746698	20/04/28 05:17:01
3	15	374.86381863466494	261.7160357411154	20/04/28 05:17:01
3	15	375.1346340461674	261.74064622142834	20/04/28 05:17:02
3	15	375.4203062155621	261.7666068167351	20/04/28 05:17:02
3	15	375.69030792412326	261.79114335140326	20/04/28 05:17:02
3	15	375.8885842379477	261.8091618064492	20/04/28 05:17:02
3	15	376.098747151033	261.8282604618998	20/04/28 05:17:02
3	15	376.29984908820273	261.84653569682143	20/04/28 05:17:02
3	15	376.4738425920308	261.86234743987103	20/04/28 05:17:02
3	15	376.67836526934036	261.88093353619234	20/04/28 05:17:02
3	15	376.92967480544735	261.90377141073026	20/04/28 05:17:02
3	15	377.1985218690212	261.92820301648186	20/04/28 05:17:02
3	15	377.3598390809697	261.94286279543155	20/04/28 05:17:03
3	15	377.3598390809697	261.94286279543155	20/04/28 05:17:03
3	15	377.654906264243	261.96967716712726	20/04/28 05:17:03
3	15	377.8688750836252	261.9891216861366	20/04/28 05:17:03
3	15	378.2979598947159	262.02811497399034	20/04/28 05:17:03
3	15	378.50490522788226	262.04692123032373	20/04/28 05:17:03
3	15	378.6749047010462	262.1492099180952	20/04/28 05:17:03
3	15	378.6749047010462	262.1492099180952	20/04/28 05:17:03
3	15	378.8145413298495	262.2723154211089	20/04/28 05:17:03
3	15	379.02198795339893	262.4552031143984	20/04/28 05:17:04
3	15	379.2313080298188	262.63974246857344	20/04/28 05:17:04
3	15	379.38156136545933	262.7722078010728	20/04/28 05:17:04
3	15	379.54400143285636	262.9154171178393	20/04/28 05:17:04
3	15	379.6991157986578	263.0521679989676	20/04/28 05:17:04
3	15	380.01909340700416	263.33426450019516	20/04/28 05:17:04
3	15	380.01909340700416	263.33426450019516	20/04/28 05:17:04
3	15	380.23872862569226	263.5278978205342	20/04/28 05:17:04
3	15	380.42924632990986	263.6958607541264	20/04/28 05:17:04
3	15	380.55941669030494	263.81062066942405	20/04/28 05:17:04
3	15	380.69771609846475	263.93254726099195	20/04/28 05:17:05
3	15	380.9213978773543	264.1297480824469	20/04/28 05:17:05
3	15	381.2350527357508	264.4062703635025	20/04/28 05:17:05
3	15	381.4543509784708	264.599606601361	20/04/28 05:17:05
3	15	381.4543509784708	264.599606601361	20/04/28 05:17:05
3	15	381.67638004569415	264.79535037030223	20/04/28 05:17:05
1	33	381.78966089754624	264.9951057985918	20/04/28 05:17:05
1	33	381.69512270283815	265.13768256220925	20/04/28 05:17:05
1	33	381.5988203736516	265.2829198863049	20/04/28 05:17:05
1	33	381.44272453662603	265.5183341474508	20/04/28 05:17:05
1	33	381.3287564854039	265.69021384061824	20/04/28 05:17:06
1	33	381.24571788909145	265.81544760834703	20/04/28 05:17:06
1	33	381.0876632471156	266.0538160201537	20/04/28 05:17:06
1	33	380.9761683094603	266.22196591364064	20/04/28 05:17:06
1	33	380.87273843287636	266.3779525718398	20/04/28 05:17:06
1	33	380.7614039915659	266.54586041448704	20/04/28 05:17:06
1	33	380.58534976569223	266.81137470554944	20/04/28 05:17:06
1	33	380.58534976569223	266.81137470554944	20/04/28 05:17:06
1	33	380.57991621043243	266.84711847210923	20/04/28 05:17:06
1	33	380.5993221949729	266.8376794050529	20/04/28 05:17:07
1	33	380.51661098337183	266.99369466645385	20/04/28 05:17:07
1	33	380.3531264601016	267.2138829610337	20/04/28 05:17:07
1	33	380.3752123784107	267.2191640048569	20/04/28 05:17:07
1	33	380.2886677182137	267.0260708237714	20/04/28 05:17:07
1	33	380.20796853760896	266.9954942144068	20/04/28 05:17:07
1	33	380.4890995860881	266.98679786392455	20/04/28 05:17:07
1	33	380.58574141762597	266.8375816349048	20/04/28 05:17:07
1	33	380.6799153200681	266.9329053207568	20/04/28 05:17:07
1	33	380.94618363116786	266.9882969316873	20/04/28 05:17:07
1	33	380.9345043890732	266.80105573503585	20/04/28 05:17:08
1	33	380.9058725378051	267.0345745647136	20/04/28 05:17:08
1	33	381.0318110614942	267.06498897704614	20/04/28 05:17:08
1	33	381.0228628390533	267.2551995503115	20/04/28 05:17:08
1	33	380.90136650705426	267.19569951064756	20/04/28 05:17:08
1	33	380.69322140824994	267.0077299520756	20/04/28 05:17:08
1	33	380.48083462966036	267.18856281519425	20/04/28 05:17:08
1	33	380.48810621169395	267.2713271491652	20/04/28 05:17:08
1	33	380.39272578764445	267.39702522437034	20/04/28 05:17:08
1	33	380.3876980722396	267.4019602191993	20/04/28 05:17:08
1	33	380.3371725076075	267.41690122833927	20/04/28 05:17:09
1	33	380.3308701482555	267.45265782414316	20/04/28 05:17:09
1	33	380.3087104030426	267.4379246435451	20/04/28 05:17:09
1	33	380.4429401487883	267.36189740309163	20/04/28 05:17:09
1	33	380.26727401413217	267.1219007656258	20/04/28 05:17:09
1	33	379.9927071776394	267.16033676979157	20/04/28 05:17:09
1	33	379.97808448491736	267.1786390314271	20/04/28 05:17:09
1	33	379.8280270461029	267.2025277518557	20/04/28 05:17:09
1	33	379.61410733004925	267.2065927264012	20/04/28 05:17:09
1	33	379.5879822972953	267.06565408783155	20/04/28 05:17:10
1	33	379.37726662054604	266.99916357732207	20/04/28 05:17:10
1	33	379.4626447298133	266.99406897456964	20/04/28 05:17:10
1	33	379.4508415480822	266.99250072659737	20/04/28 05:17:10
1	33	379.4951178921944	267.0489463670326	20/04/28 05:17:10
1	33	379.46716461538654	267.06454471289845	20/04/28 05:17:10
1	33	379.23460777639656	267.20536980236227	20/04/28 05:17:10
1	33	379.23460777639656	267.20536980236227	20/04/28 05:17:10
1	33	379.2303777706112	267.284331613516	20/04/28 05:17:10
1	33	379.0948749843379	267.1854755018054	20/04/28 05:17:10
1	33	379.0889581069115	267.437829245291	20/04/28 05:17:11
1	33	379.25048558220413	267.2726224318034	20/04/28 05:17:11
1	33	379.31592009934116	267.0903199450089	20/04/28 05:17:11
1	33	379.041455731856	267.12806395389197	20/04/28 05:17:11
1	33	379.1097284320107	266.9967203274229	20/04/28 05:17:11
1	33	379.15436749898777	267.0566410304986	20/04/28 05:17:11
1	33	378.99562352361164	267.2939724416304	20/04/28 05:17:11
1	33	379.20396900784857	267.4796178634733	20/04/28 05:17:11
1	33	379.09775318431707	267.2845461952477	20/04/28 05:17:11
1	33	379.37194814901886	267.4017131816392	20/04/28 05:17:11
1	33	379.3617772380406	267.32594594501916	20/04/28 05:17:12
1	33	379.50492127591014	267.4858901253927	20/04/28 05:17:12
1	33	379.50459904502435	267.5336254194589	20/04/28 05:17:12
1	33	379.50459904502435	267.5336254194589	20/04/28 05:17:12
1	33	379.54624941688064	267.44227614895556	20/04/28 05:17:12
1	33	379.39477784636097	267.58787051434473	20/04/28 05:17:12
1	33	379.475832253596	267.4553010711558	20/04/28 05:17:12
1	33	379.3176668719782	267.6952329120432	20/04/28 05:17:12
1	33	379.4962473031588	267.7917360958011	20/04/28 05:17:12
1	33	379.6701924591104	267.91000741069183	20/04/28 05:17:13
1	33	379.52808646959045	267.740495032069	20/04/28 05:17:13
1	33	379.45366933347134	267.9290663438621	20/04/28 05:17:13
1	33	379.43860610126717	267.80631978927227	20/04/28 05:17:13
1	33	379.5464379193463	267.8306657957183	20/04/28 05:17:13
1	33	379.47472976919215	267.8281941523782	20/04/28 05:17:13
1	33	379.6306148815994	268.05666179409707	20/04/28 05:17:13
1	33	379.63358514384913	267.96246152573605	20/04/28 05:17:13
1	33	379.85886064212883	268.0717449593632	20/04/28 05:17:13
1	33	379.79812877530566	267.7928607552877	20/04/28 05:17:13
1	33	379.7848634080208	267.79978436913666	20/04/28 05:17:14
1	33	379.81552371714105	267.8358267738786	20/04/28 05:17:14
1	33	380.01346498788354	267.7864744903263	20/04/28 05:17:14
1	33	380.1037184109327	267.9971765854092	20/04/28 05:17:14
1	33	380.11548400049134	268.0463645127414	20/04/28 05:17:14
1	33	380.03611109527486	267.8764613244405	20/04/28 05:17:14
1	33	380.00598266272	267.8856625776706	20/04/28 05:17:14
1	33	380.2176209598907	267.83048451630435	20/04/28 05:17:14
1	33	380.33246797327195	267.93418826065016	20/04/28 05:17:14
1	33	380.3965676833479	267.90821452520095	20/04/28 05:17:14
1	33	380.5387831541878	267.95540676096056	20/04/28 05:17:15
1	33	380.62818677721145	268.15645553942096	20/04/28 05:17:15
1	33	380.5034931400991	267.9777483358018	20/04/28 05:17:15
1	33	380.23835346156386	268.1049548784664	20/04/28 05:17:15
1	33	380.3015531627517	268.0812543947838	20/04/28 05:17:15
1	33	380.3102850210004	268.1134867535098	20/04/28 05:17:15
1	33	380.49067865009584	268.2161043630799	20/04/28 05:17:15
1	33	380.49313911884906	268.2079330531676	20/04/28 05:17:15
1	33	380.59833954685047	268.35938767564465	20/04/28 05:17:15
1	33	380.5961980677222	268.3589073148882	20/04/28 05:17:16
1	33	380.47683578870266	268.304606527813	20/04/28 05:17:16
1	33	380.4723453552974	268.19185378788484	20/04/28 05:17:16
1	33	380.45754276714206	268.3080123425569	20/04/28 05:17:16
1	33	380.36973083228935	268.0971578096813	20/04/28 05:17:16
1	33	380.2098521770475	267.9656601320755	20/04/28 05:17:16
1	33	380.1910533244752	267.8622245756394	20/04/28 05:17:16
1	33	380.4465919443926	267.95726195350943	20/04/28 05:17:16
1	33	380.4128455445605	267.971910143723	20/04/28 05:17:16
1	33	380.45222102998724	267.69381358502534	20/04/28 05:17:16
1	33	380.263590176337	267.5833834119312	20/04/28 05:17:17
1	33	380.35058827838174	267.85994738872023	20/04/28 05:17:17
1	33	380.3671798950889	267.757306954397	20/04/28 05:17:17
1	33	380.31237871700154	267.70616841156834	20/04/28 05:17:17
1	33	380.4435330554733	267.56646596307877	20/04/28 05:17:17
1	33	380.4350029518193	267.568407434591	20/04/28 05:17:17
1	33	380.5171833938468	267.48015357802177	20/04/28 05:17:17
1	33	380.50905237822184	267.54429593821817	20/04/28 05:17:17
1	33	380.35768727320055	267.7724967618181	20/04/28 05:17:17
1	33	380.60581797960936	267.9229013693769	20/04/28 05:17:17
1	33	380.6296867980089	268.1550885561045	20/04/28 05:17:18
1	33	380.7433592650541	268.14239531806203	20/04/28 05:17:18
1	33	380.6781744383631	268.08370523963794	20/04/28 05:17:18
1	33	380.7874413561774	267.8071781039288	20/04/28 05:17:18
1	33	380.73377597075444	267.8151340763493	20/04/28 05:17:18
1	33	380.71054559859544	268.0332413060684	20/04/28 05:17:18
1	33	380.7891531043264	268.1620535238561	20/04/28 05:17:18
1	33	380.9484469389544	268.32316602642777	20/04/28 05:17:18
1	33	380.9547822539415	268.31879049622466	20/04/28 05:17:18
1	33	380.94836180698115	268.24235059083014	20/04/28 05:17:19
1	33	380.92519362384894	268.1755350955182	20/04/28 05:17:19
1	33	380.86595643548327	268.09643149778964	20/04/28 05:17:19
1	33	380.9061951931184	268.0882190784611	20/04/28 05:17:19
1	33	380.80960229674815	267.8294430471258	20/04/28 05:17:19
1	33	380.5433336211202	267.73686311195354	20/04/28 05:17:19
1	33	380.5023065203123	267.83616995616165	20/04/28 05:17:19
1	33	380.78394373013595	267.819180762398	20/04/28 05:17:19
1	33	380.7480727333576	267.74772941893104	20/04/28 05:17:19
1	33	380.5609679487248	267.82071865706484	20/04/28 05:17:19
1	33	380.7239201224773	267.6339233425658	20/04/28 05:17:20
1	33	380.86075539877737	267.5062409344476	20/04/28 05:17:20
1	33	380.74891428285486	267.7120564659265	20/04/28 05:17:20
1	33	380.8110056552398	267.8027417802594	20/04/28 05:17:20
1	33	380.68481600486933	267.7227580596623	20/04/28 05:17:20
1	33	380.76668623701886	267.70194294211285	20/04/28 05:17:20
1	33	380.6682326275045	267.70366986685536	20/04/28 05:17:20
1	33	380.68101824487115	267.5429334288319	20/04/28 05:17:20
1	33	380.6144795008727	267.50100018246013	20/04/28 05:17:20
1	33	380.62070577348567	267.3999007043656	20/04/28 05:17:20
1	33	380.4762908953961	267.4494428242871	20/04/28 05:17:21
1	33	380.26760061784745	267.28855096199976	20/04/28 05:17:21
1	33	380.4402357313354	267.4633977540327	20/04/28 05:17:21
1	33	380.21638751679734	267.61485085526056	20/04/28 05:17:21
1	33	380.4801745932935	267.52218496715625	20/04/28 05:17:21
1	33	380.3277320435586	267.3182116256107	20/04/28 05:17:21
1	33	380.27632306928587	267.1622649423867	20/04/28 05:17:21
1	33	380.248783068144	266.9347224592327	20/04/28 05:17:21
1	33	380.04716348212986	266.7601340489066	20/04/28 05:17:21
1	33	380.05203554004834	266.7786602509568	20/04/28 05:17:22
1	33	380.0688425653909	266.77103785240223	20/04/28 05:17:22
1	33	380.33497723031337	266.6768495267392	20/04/28 05:17:22
1	33	380.3058299972483	266.79382197730956	20/04/28 05:17:22
1	33	380.3144867014771	266.79147736503796	20/04/28 05:17:22
1	33	380.2564582895484	266.8802124452526	20/04/28 05:17:22
1	33	380.34657919468293	267.1017330228838	20/04/28 05:17:22
1	33	380.2547077152756	266.8635942335337	20/04/28 05:17:22
1	33	380.30310998332527	266.88205261025837	20/04/28 05:17:22
1	33	380.5253814860342	266.9690563072779	20/04/28 05:17:22
1	33	380.60227983164407	266.9737889004518	20/04/28 05:17:23
1	33	380.7301011194258	266.9856081498741	20/04/28 05:17:23
1	33	380.55090528855703	266.8558952571343	20/04/28 05:17:23
1	33	380.6638459422461	266.89234313367996	20/04/28 05:17:23
1	33	380.705206192013	266.7536549686917	20/04/28 05:17:23
1	33	380.7511329832824	267.00768756131896	20/04/28 05:17:23
1	33	380.75091834852446	266.91744138355193	20/04/28 05:17:23
1	33	380.64181788010654	266.7259801245574	20/04/28 05:17:23
1	33	380.73033514980295	266.5293283600317	20/04/28 05:17:23
1	33	380.6956460833939	266.52757896946855	20/04/28 05:17:23
1	33	380.74665123188987	266.591265801175	20/04/28 05:17:24
1	33	380.71880880857043	266.6741692553744	20/04/28 05:17:24
1	33	380.60989224216166	266.7679263482987	20/04/28 05:17:24
1	33	380.4244885718859	266.7228931685951	20/04/28 05:17:24
1	33	380.4244885718859	266.7228931685951	20/04/28 05:17:24
1	33	380.4244885718859	266.7228931685951	20/04/28 05:17:24
1	33	380.4108321720946	266.70304908593374	20/04/28 05:17:24
1	33	380.46953204011976	266.4848172763199	20/04/28 05:17:24
1	33	380.72766503843167	266.4303405115489	20/04/28 05:17:24
1	33	380.55528218273645	266.20484165125197	20/04/28 05:17:25
1	33	380.5596366779811	266.2059541044798	20/04/28 05:17:25
1	33	380.5295118076138	266.1562881824479	20/04/28 05:17:25
1	33	380.23510190879216	266.1785373564387	20/04/28 05:17:25
1	33	380.06264167637664	266.28916187685525	20/04/28 05:17:25
1	33	379.93505621879456	266.4295366845934	20/04/28 05:17:25
1	33	379.6674115201648	266.3990982360675	20/04/28 05:17:25
1	33	379.60306170869814	266.51665994591616	20/04/28 05:17:25
1	33	379.8730059368263	266.6004796140387	20/04/28 05:17:25
1	33	379.68713914882295	266.5567417625624	20/04/28 05:17:25
1	33	379.6859538213798	266.6940683732319	20/04/28 05:17:26
1	33	379.53126751817894	266.76387973331487	20/04/28 05:17:26
1	33	379.53126751817894	266.76387973331487	20/04/28 05:17:26
1	33	379.5379068811475	266.74122430152056	20/04/28 05:17:26
1	33	379.56670689126935	266.8266292101628	20/04/28 05:17:26
1	33	379.82271290744194	266.7973161256566	20/04/28 05:17:26
1	33	379.77683718584836	266.80101176261473	20/04/28 05:17:26
1	33	379.7803205584387	266.7984180072934	20/04/28 05:17:26
1	33	379.86144089027704	267.0493651014418	20/04/28 05:17:26
1	33	379.7585168675232	266.9884916606176	20/04/28 05:17:26
1	33	379.53437159020933	266.92947484984376	20/04/28 05:17:27
1	33	379.75153786985277	266.89241328111666	20/04/28 05:17:27
1	33	379.98849853117156	266.7133042730519	20/04/28 05:17:27
1	33	379.51353316449973	266.7310851292105	20/04/28 05:17:27
1	33	379.52378066911564	266.7216543483995	20/04/28 05:17:27
1	33	379.26647174470196	266.75851405940523	20/04/28 05:17:27
1	33	379.26647174470196	266.75851405940523	20/04/28 05:17:27
1	33	379.2192130423802	266.8390145832256	20/04/28 05:17:27
1	33	379.0131221773763	266.644182285599	20/04/28 05:17:27
1	33	379.041212318197	266.6210432223561	20/04/28 05:17:27
1	33	378.7890445985574	266.54039796049466	20/04/28 05:17:28
1	33	378.8036233229976	266.53104839327136	20/04/28 05:17:28
1	33	378.8549549157898	266.55520753254865	20/04/28 05:17:28
1	33	379.0914566469386	266.50010518090477	20/04/28 05:17:28
1	33	379.16675985938053	266.5356716262114	20/04/28 05:17:28
1	33	379.3758900111187	266.58993659123496	20/04/28 05:17:28
1	33	379.26893942521366	266.53781083874105	20/04/28 05:17:28
1	33	379.2821807426131	266.80655499722786	20/04/28 05:17:28
1	33	379.37119934295265	266.7823800078408	20/04/28 05:17:28
1	33	379.13941841840466	266.912091224911	20/04/28 05:17:29
1	33	379.0801297945848	266.89876833682996	20/04/28 05:17:29
1	33	379.06797938719734	266.80932940527975	20/04/28 05:17:29
1	33	379.1341779118057	266.6381633711039	20/04/28 05:17:29
1	33	379.1721893318295	266.65875431575944	20/04/28 05:17:29
1	33	379.2115093272565	266.7421981711155	20/04/28 05:17:29
1	33	379.3763763976098	266.93193192427225	20/04/28 05:17:29
1	33	379.3242643861888	266.8493259173864	20/04/28 05:17:29
1	33	379.42507514278066	266.70529144443236	20/04/28 05:17:29
1	33	379.4162333629767	266.7894043383263	20/04/28 05:17:29
1	33	379.45196225436774	266.7063022259632	20/04/28 05:17:30
1	33	379.49866260371124	266.7282110274513	20/04/28 05:17:30
1	33	379.4357964046755	266.7140376469478	20/04/28 05:17:30
1	33	379.6398132992199	266.6675168748316	20/04/28 05:17:30
1	33	379.5481138115322	266.39725320419717	20/04/28 05:17:30
1	33	379.36787402440405	266.2646477368514	20/04/28 05:17:30
1	33	379.5881325044078	266.31595031276777	20/04/28 05:17:30
1	33	379.7107508174512	266.57425107246	20/04/28 05:17:30
1	33	379.7107508174512	266.57425107246	20/04/28 05:17:30
1	33	379.5328592472473	266.7104461801216	20/04/28 05:17:30
1	33	379.6463272885736	266.7116640191527	20/04/28 05:17:31
1	33	379.4750341261521	266.8031510670375	20/04/28 05:17:31
1	33	379.50055932680385	266.83193083977034	20/04/28 05:17:31
1	33	379.5099013490922	266.7658642783264	20/04/28 05:17:31
1	33	379.5888231631496	267.02955676653033	20/04/28 05:17:31
1	33	379.4813485477811	267.17652210722633	20/04/28 05:17:31
1	33	379.28029029014965	267.1098255404574	20/04/28 05:17:31
1	33	379.48861859709245	267.2378439429488	20/04/28 05:17:31
1	33	379.4640740564282	267.3339940704233	20/04/28 05:17:31
1	33	379.5387442406612	267.39142271392126	20/04/28 05:17:32
1	33	379.44854328565884	267.6080054482233	20/04/28 05:17:32
1	33	379.46502557751955	267.60454650432496	20/04/28 05:17:32
1	33	379.7484783605952	267.5533079980747	20/04/28 05:17:32
1	33	379.71431490316377	267.42349728125316	20/04/28 05:17:32
1	33	379.5976491421253	267.5446014132614	20/04/28 05:17:32
1	33	379.6614511994592	267.67164283038557	20/04/28 05:17:32
1	33	379.6651651134288	267.73239939594896	20/04/28 05:17:32
1	33	379.6126995228205	267.4423605237438	20/04/28 05:17:32
1	33	379.488899538203	267.4878665824471	20/04/28 05:17:32
1	33	379.67672093405287	267.70474667142565	20/04/28 05:17:33
1	33	379.5351301371348	267.9062055551745	20/04/28 05:17:33
1	33	379.5788462675408	268.06403698291706	20/04/28 05:17:33
1	33	379.38832013564684	268.2082374919924	20/04/28 05:17:33
1	33	379.2104535825377	268.21231635259244	20/04/28 05:17:33
1	33	378.97974838438165	268.03383966964543	20/04/28 05:17:33
1	33	378.9753014035318	267.9665522575781	20/04/28 05:17:33
1	33	379.0380778580765	267.9954009894826	20/04/28 05:17:33
1	33	379.1020782111591	268.0009320192941	20/04/28 05:17:33
1	33	379.17295180113956	267.7275231632049	20/04/28 05:17:33
1	33	379.10016628859256	267.59539494411507	20/04/28 05:17:34
1	33	379.224441976067	267.6552311675254	20/04/28 05:17:34
1	33	379.3271643875908	267.88009654393835	20/04/28 05:17:34
1	33	379.3271497497704	267.88009320174064	20/04/28 05:17:34
1	33	379.2963131725265	267.9866968336712	20/04/28 05:17:34
1	33	379.15277801434434	268.21454455762364	20/04/28 05:17:34
1	33	379.18555063547427	268.14713116297713	20/04/28 05:17:34
1	33	379.2877289885913	268.05862038870555	20/04/28 05:17:34
1	33	379.35999847113766	268.0462950621444	20/04/28 05:17:34
1	33	379.55653148565364	268.2233286480474	20/04/28 05:17:35
1	33	379.6631766711408	268.21489777012283	20/04/28 05:17:35
1	33	379.7870895286856	268.3646149623218	20/04/28 05:17:35
1	33	379.49949262537274	268.30800669248265	20/04/28 05:17:35
1	33	379.6213638531606	268.25945514962746	20/04/28 05:17:35
1	33	379.4816266612042	268.25048345075106	20/04/28 05:17:35
1	33	379.5040883029385	268.28991554843344	20/04/28 05:17:35
1	33	379.33975695564897	268.31750836723	20/04/28 05:17:35
1	33	379.49548454102916	268.5548203479292	20/04/28 05:17:35
1	33	379.57274381524877	268.7483848400689	20/04/28 05:17:35
1	33	379.6692646810197	268.7054029939364	20/04/28 05:17:36
1	33	379.64039646738496	268.77168120337296	20/04/28 05:17:36
1	33	379.65783494583786	268.72593324663717	20/04/28 05:17:36
1	33	379.9003942678018	268.73895826748327	20/04/28 05:17:36
1	33	380.1082916703315	268.7817577437371	20/04/28 05:17:36
1	33	380.06630954232367	268.8166142424804	20/04/28 05:17:36
1	33	380.08519471647054	268.74250944773104	20/04/28 05:17:36
1	33	380.1031850753821	268.7767735528146	20/04/28 05:17:36
1	33	380.1177406849396	268.76361733031723	20/04/28 05:17:36
1	33	380.15923769883835	268.9665469067995	20/04/28 05:17:36
1	33	380.19603342077664	268.9342605254887	20/04/28 05:17:37
1	33	380.1234186859825	268.8170464178855	20/04/28 05:17:37
1	33	380.106759642657	269.0006851502264	20/04/28 05:17:37
1	33	380.107580571553	269.0100877521682	20/04/28 05:17:37
1	33	380.1517372189506	269.03960977068516	20/04/28 05:17:37
1	33	380.1895532566509	269.2802382824135	20/04/28 05:17:37
1	33	380.2076337428852	269.1181796828028	20/04/28 05:17:37
1	33	380.09419364872247	269.2042015517696	20/04/28 05:17:37
1	33	380.2993379032907	269.0978000142056	20/04/28 05:17:37
1	33	380.3764464337988	269.1940654381681	20/04/28 05:17:38
1	33	380.3073029372838	269.1035374739787	20/04/28 05:17:38
1	33	380.15835225806507	269.08234681475375	20/04/28 05:17:38
1	33	380.3493716449473	269.1985227684313	20/04/28 05:17:38
1	33	380.0939122481836	269.23846739235375	20/04/28 05:17:38
1	33	380.0447447757446	269.3189962026	20/04/28 05:17:38
1	33	380.218307746283	269.09013144147036	20/04/28 05:17:38
1	33	380.13150935714305	268.98702054190704	20/04/28 05:17:38
1	33	380.11957713226514	269.02260314018605	20/04/28 05:17:38
1	33	380.385291870721	269.06536009690996	20/04/28 05:17:38
1	33	380.19054931100715	269.00114271759134	20/04/28 05:17:39
1	33	380.1927112961615	269.0082206479685	20/04/28 05:17:39
1	33	380.17277159685295	269.00572217934194	20/04/28 05:17:39
1	33	380.16440055818003	268.79759733865774	20/04/28 05:17:39
1	33	380.2320977130834	268.815767525316	20/04/28 05:17:39
1	33	380.4178522578817	268.83910080185257	20/04/28 05:17:39
1	33	380.3625074547477	268.72583585928334	20/04/28 05:17:39
1	33	380.2324009525165	268.8359401688019	20/04/28 05:17:39
1	33	380.3272100329594	268.7836526452431	20/04/28 05:17:39
1	33	380.3366522526103	268.7694161124678	20/04/28 05:17:39
1	33	380.3338075774473	268.5664572409663	20/04/28 05:17:40
1	33	380.3225866245826	268.5345275027221	20/04/28 05:17:40
1	33	380.2786377200818	268.53847533886955	20/04/28 05:17:40
1	33	380.35022951099984	268.38925283144005	20/04/28 05:17:40
1	33	380.4219731898035	268.2785650522356	20/04/28 05:17:40
1	33	380.6192921378375	268.23130334173914	20/04/28 05:17:40
1	33	380.5740768638611	267.98157832126645	20/04/28 05:17:40
1	33	380.4097805434307	267.9979648377996	20/04/28 05:17:40
1	33	380.4744162840715	267.830141167635	20/04/28 05:17:40
1	33	380.4594486751328	267.56750988793715	20/04/28 05:17:41
1	33	380.60325363196796	267.67399128922426	20/04/28 05:17:41
1	33	380.6842174655541	267.6625645110302	20/04/28 05:17:41
1	33	380.59340491277317	267.81435648991385	20/04/28 05:17:41
1	33	380.5483163354633	267.5975750947907	20/04/28 05:17:41
1	33	380.7151993151288	267.73413779895475	20/04/28 05:17:41
1	33	380.738844251339	267.4397171432785	20/04/28 05:17:41
1	33	380.6525391778544	267.546821820103	20/04/28 05:17:41
1	33	380.6789982295719	267.55681629397395	20/04/28 05:17:41
1	33	380.746212717021	267.5299960804566	20/04/28 05:17:41
1	33	381.02354063588217	267.571995762584	20/04/28 05:17:42
1	33	381.0529675305061	267.6114252480755	20/04/28 05:17:42
1	33	381.1203653972052	267.7103813873174	20/04/28 05:17:42
1	33	381.0970549409793	267.6111445605838	20/04/28 05:17:42
1	33	381.0850975807292	267.61954763220064	20/04/28 05:17:42
1	33	381.08498295308954	267.77323380124386	20/04/28 05:17:42
1	33	381.2060742694714	267.79604655650786	20/04/28 05:17:42
1	33	381.3200704666815	267.7773270384747	20/04/28 05:17:42
1	33	381.31104933444806	267.7713618176587	20/04/28 05:17:42
1	33	381.3400370519138	267.89494230069505	20/04/28 05:17:42
1	33	381.32809922420535	267.81245695196674	20/04/28 05:17:43
1	33	381.32656390209627	267.7636415541864	20/04/28 05:17:43
1	33	381.29193715501395	267.73395444949927	20/04/28 05:17:43
1	33	381.29193715501395	267.73395444949927	20/04/28 05:17:43
1	33	381.29193715501395	267.73395444949927	20/04/28 05:17:43
1	33	381.4894414035596	267.61850371811875	20/04/28 05:17:43
1	33	381.51652974962263	267.58730523602765	20/04/28 05:17:43
1	33	381.52383366008314	267.6423051164278	20/04/28 05:17:43
1	33	381.4969723459183	267.7358628604754	20/04/28 05:17:43
1	33	381.61547600614733	267.756033726288	20/04/28 05:17:44
1	33	381.84177978878336	267.5691369823317	20/04/28 05:17:44
1	33	381.87710639787963	267.6865381193414	20/04/28 05:17:44
1	33	382.06436737839806	267.58116206787844	20/04/28 05:17:44
1	33	382.0686565903316	267.6601158279305	20/04/28 05:17:44
1	33	382.29310093395947	267.7118856171469	20/04/28 05:17:44
1	33	382.08198650661734	267.68515320718336	20/04/28 05:17:44
1	33	381.98863157330663	267.9039810036648	20/04/28 05:17:44
1	33	381.9722205836289	267.73470819650163	20/04/28 05:17:44
1	33	381.9502223136453	267.70896084219333	20/04/28 05:17:44
1	33	381.98739634816394	267.70661221728665	20/04/28 05:17:45
1	33	382.119043558568	267.81386892652273	20/04/28 05:17:45
1	33	382.1219192365434	267.7339275351172	20/04/28 05:17:45
1	33	382.26689683457636	267.7839897466279	20/04/28 05:17:45
1	33	382.1878442185777	267.92403503819526	20/04/28 05:17:45
1	33	382.11822370759603	267.915504049768	20/04/28 05:17:45
1	33	382.2438440045992	267.8170186062924	20/04/28 05:17:45
1	33	382.1800536408623	268.0499931659258	20/04/28 05:17:45
1	33	382.32958824921513	268.22348931071474	20/04/28 05:17:45
1	33	382.41822401362754	268.2159140065078	20/04/28 05:17:46
1	33	382.55532350214224	268.3577457908391	20/04/28 05:17:46
1	33	382.34435775992523	268.2999087324377	20/04/28 05:17:46
1	33	382.3898458453108	268.2752694428388	20/04/28 05:17:46
1	33	382.5193261513013	268.0421986725326	20/04/28 05:17:46
1	33	382.5857199744348	267.92117479050285	20/04/28 05:17:46
1	33	382.7446775721408	267.9956382720436	20/04/28 05:17:46
1	33	382.6837264494093	267.9395550314583	20/04/28 05:17:46
1	33	382.7179650318009	268.0379262263447	20/04/28 05:17:46
1	33	382.72326092262296	267.9973046447116	20/04/28 05:17:46
1	33	382.80902967237864	268.0643588280367	20/04/28 05:17:47
1	33	382.9804430720343	268.1295300564446	20/04/28 05:17:47
1	33	382.9731741902128	268.29317745138593	20/04/28 05:17:47
1	33	382.8845260657377	268.17891609693885	20/04/28 05:17:47
1	33	382.88104169274175	268.1788225949415	20/04/28 05:17:47
1	33	382.68267606584567	268.1803486737745	20/04/28 05:17:47
1	33	382.77422403592755	268.13456600453634	20/04/28 05:17:47
1	33	382.5286853349578	268.2890952224156	20/04/28 05:17:47
1	33	382.5849787362367	268.5674052768471	20/04/28 05:17:47
1	33	382.8137950607277	268.715697926124	20/04/28 05:17:47
1	33	382.5324815937752	268.64189583537416	20/04/28 05:17:48
1	33	382.5450607892612	268.6638636659362	20/04/28 05:17:48
1	33	382.4414925070268	268.71682453462057	20/04/28 05:17:48
1	33	382.4372030716415	268.95119900220817	20/04/28 05:17:48
1	33	382.41192912951357	269.1130328257575	20/04/28 05:17:48
1	33	382.70137383363317	269.11740914732684	20/04/28 05:17:48
1	33	382.75647966726945	268.95388247953025	20/04/28 05:17:48
1	33	382.91915676405944	269.1492005004567	20/04/28 05:17:48
1	33	382.6957189058018	269.24820671373095	20/04/28 05:17:48
1	33	382.4969868727527	269.44242836132634	20/04/28 05:17:49
1	33	382.4338345601991	269.3981550319105	20/04/28 05:17:49
1	33	382.4397489236147	269.3081967936976	20/04/28 05:17:49
1	33	382.47523407359193	269.215838668796	20/04/28 05:17:49
1	33	382.3142769766336	268.99725186849827	20/04/28 05:17:49
1	33	382.3059570967574	268.9177425729064	20/04/28 05:17:49
1	33	382.3037756538123	268.90922451754506	20/04/28 05:17:49
1	33	382.331120515507	268.86733393609103	20/04/28 05:17:49
1	33	382.23874029454333	268.64154039384897	20/04/28 05:17:49
1	33	382.2668586136214	268.6859072562483	20/04/28 05:17:49
1	33	382.5593881403218	268.7497667390859	20/04/28 05:17:50
1	33	382.53516833211876	268.8756002115023	20/04/28 05:17:50
1	33	382.5728120989263	268.90423093873386	20/04/28 05:17:50
1	33	382.564180408605	268.8455216631728	20/04/28 05:17:50
1	33	382.3019873878209	268.7815676615266	20/04/28 05:17:50
1	33	382.54086424045823	268.8919706848018	20/04/28 05:17:50
1	33	382.4602637467771	268.85405186641367	20/04/28 05:17:50
1	33	382.21382111426976	268.9608091608679	20/04/28 05:17:50
1	33	382.21382111426976	268.9608091608679	20/04/28 05:17:50
1	33	382.23319554525636	268.96644908779376	20/04/28 05:17:51
1	33	382.154539567374	268.86291903449364	20/04/28 05:17:51
1	33	382.0638705305001	268.92290200651	20/04/28 05:17:51
1	33	382.08552551822294	269.0504445819908	20/04/28 05:17:51
1	33	382.2405000137498	269.1726909501251	20/04/28 05:17:51
1	33	382.30371080529636	269.0453838895453	20/04/28 05:17:51
1	33	382.156720351181	269.1982088744237	20/04/28 05:17:51
1	33	382.27521947735954	268.96613967621	20/04/28 05:17:51
1	33	382.25292606767584	268.86795710906426	20/04/28 05:17:51
1	33	382.3333803644151	268.8112781386695	20/04/28 05:17:51
1	33	382.2625175721543	268.761492662199	20/04/28 05:17:52
1	33	382.0396761938609	268.9263731170527	20/04/28 05:17:52
1	33	382.1993997858405	268.7743453217005	20/04/28 05:17:52
1	33	382.1449288541542	268.8238094415461	20/04/28 05:17:52
1	33	381.98473377493633	268.8394412912684	20/04/28 05:17:52
1	33	381.8837674996697	269.1167405353073	20/04/28 05:17:52
1	33	381.7755554449744	268.9890115846243	20/04/28 05:17:52
1	33	381.6706931605624	269.1709841417422	20/04/28 05:17:52
1	33	381.5546136197895	269.1157290808307	20/04/28 05:17:52
1	33	381.4747135910962	269.18912254845935	20/04/28 05:17:52
1	33	381.29503882918624	269.114721081363	20/04/28 05:17:53
1	33	381.49450377255243	269.0325753343458	20/04/28 05:17:53
1	33	381.2866829039677	268.84696659263506	20/04/28 05:17:53
1	33	381.414930206463	268.8693956385188	20/04/28 05:17:53
1	33	381.4674093435029	268.85442511951635	20/04/28 05:17:53
1	33	381.46532424378216	268.74087657053815	20/04/28 05:17:53
1	33	381.45956314202834	268.7401924833274	20/04/28 05:17:53
1	33	381.44595414071205	268.74959767790847	20/04/28 05:17:53
1	33	381.4456517365961	268.5753457742571	20/04/28 05:17:53
1	33	381.3089954995973	268.6919111805617	20/04/28 05:17:54
1	33	381.1156144353813	268.5753829653535	20/04/28 05:17:54
1	33	381.14095153211724	268.5351230714095	20/04/28 05:17:54
1	33	381.11251620646726	268.47423551422366	20/04/28 05:17:54
1	33	381.1734956609202	268.3267811227399	20/04/28 05:17:54
1	33	381.08640759241626	268.28262882519994	20/04/28 05:17:54
1	33	381.1767733224435	268.4076156473198	20/04/28 05:17:54
1	33	381.1414897645806	268.3789268679198	20/04/28 05:17:54
1	33	380.9254069674626	268.26263500475744	20/04/28 05:17:54
1	33	380.78924166552775	268.27771003027624	20/04/28 05:17:54
1	33	380.8479120428203	268.17725129513167	20/04/28 05:17:55
1	33	380.8230254939536	268.2285475989893	20/04/28 05:17:55
1	33	380.550055124606	268.1874691600207	20/04/28 05:17:55
1	33	380.60301429735745	268.3290575394658	20/04/28 05:17:55
1	33	380.45032719954673	268.2382384732652	20/04/28 05:17:55
1	33	380.4856073128388	268.3680730101907	20/04/28 05:17:55
1	33	380.4658916190112	268.1725212725217	20/04/28 05:17:55
1	33	380.6289850683917	268.1477280440058	20/04/28 05:17:55
1	33	380.70572031021163	268.2607532156822	20/04/28 05:17:55
1	33	380.73721370451545	268.3389851240851	20/04/28 05:17:56
1	33	380.9851805685343	268.2176386222701	20/04/28 05:17:56
1	33	381.0712473857842	268.25687432380255	20/04/28 05:17:56
1	33	380.8494396724975	268.2735739158457	20/04/28 05:17:56
1	33	381.0223558229929	268.3846835300133	20/04/28 05:17:56
1	33	381.24467882628795	268.5346867314694	20/04/28 05:17:56
1	33	381.20021832904206	268.821763033976	20/04/28 05:17:56
1	33	381.26590066774725	268.87788071654677	20/04/28 05:17:56
1	33	381.23711196622315	268.84726848091856	20/04/28 05:17:56
1	33	381.04425569985216	268.8388953045284	20/04/28 05:17:56
1	33	381.0803894968378	268.7546762297048	20/04/28 05:17:57
1	33	381.09092742431045	268.7789040497718	20/04/28 05:17:57
1	33	381.0001445976775	268.91630689984385	20/04/28 05:17:57
1	33	380.79006050464426	268.92245848321727	20/04/28 05:17:57
1	33	380.71906693312695	269.1286087648699	20/04/28 05:17:57
1	33	380.6624713056214	269.2127671897865	20/04/28 05:17:57
1	33	380.47303957466613	269.14962325756215	20/04/28 05:17:57
1	33	380.4158768797895	269.08898337259745	20/04/28 05:17:57
1	33	380.20406254896585	269.0561214803386	20/04/28 05:17:57
1	33	380.4221035648009	268.9983856724856	20/04/28 05:17:58
1	33	380.5200340839436	269.156088037581	20/04/28 05:17:58
1	33	380.54393611526103	269.1293870795198	20/04/28 05:17:58
1	33	380.6403374001483	269.16488722747584	20/04/28 05:17:58
1	33	380.5112293621296	269.20805850847694	20/04/28 05:17:58
1	33	380.6508130705141	269.40437337972486	20/04/28 05:17:58
1	33	380.7472193624822	269.40571358150885	20/04/28 05:17:58
1	33	380.67492596523107	269.40284822573227	20/04/28 05:17:58
1	33	380.52906023199466	269.5785603232073	20/04/28 05:17:58
1	33	380.68090212760694	269.6223313720051	20/04/28 05:17:58
1	33	380.5982717411987	269.6845353047401	20/04/28 05:17:59
1	33	380.59334245792803	269.56751492663454	20/04/28 05:17:59
1	33	380.6905320518889	269.4417493626357	20/04/28 05:17:59
1	33	380.69225796076466	269.44586767743215	20/04/28 05:17:59
1	33	380.6916803623305	269.14767898735795	20/04/28 05:17:59
1	33	380.5722988708688	268.95421955094616	20/04/28 05:17:59
1	33	380.6102364574295	268.9551226969381	20/04/28 05:17:59
1	33	380.7183080012223	269.2217506099058	20/04/28 05:17:59
1	33	380.59650334668265	269.01623832077746	20/04/28 05:17:59
1	33	380.36935655498803	268.9758251668913	20/04/28 05:17:59
1	33	380.54879242112673	269.05548295004974	20/04/28 05:18:00
1	33	380.44620326749447	269.1820862706549	20/04/28 05:18:00
1	33	380.357564155436	269.2179024829272	20/04/28 05:18:00
1	33	380.33898739126397	269.08127347546406	20/04/28 05:18:00
1	33	380.3825648808254	269.2033650685484	20/04/28 05:18:00
1	33	380.1984455522731	269.20491183200653	20/04/28 05:18:00
1	33	380.2959742212438	269.1400146987922	20/04/28 05:18:00
1	33	380.1660769207184	269.31629404328555	20/04/28 05:18:00
1	33	380.1831032858064	269.1453282573623	20/04/28 05:18:00
1	33	380.4152007192507	269.2490151694225	20/04/28 05:18:01
1	33	380.45072904082946	269.2958339386393	20/04/28 05:18:01
1	33	380.3424355838603	269.1858404648316	20/04/28 05:18:01
1	33	380.3385376347052	269.1783948680541	20/04/28 05:18:01
1	33	380.61675922752187	269.2468719144647	20/04/28 05:18:01
1	33	380.63713032973214	269.20469416387135	20/04/28 05:18:01
1	33	380.7293910851457	269.1894018873969	20/04/28 05:18:01
1	33	380.6659164521876	269.06349965341576	20/04/28 05:18:01
1	33	380.79996951063623	268.99140920276153	20/04/28 05:18:01
1	33	380.7729770702056	269.0645139627805	20/04/28 05:18:01
1	33	380.94727912723516	268.8526774677315	20/04/28 05:18:02
1	33	380.95045194942395	268.8870097910837	20/04/28 05:18:02
1	33	380.95045194942395	268.8870097910837	20/04/28 05:18:02
