floorId	partitionId	location_x	location_y	timeStamp
20	901	356.75697097034134	264.5795494417325	21/02/24 15:38:00
20	901	356.76647220014013	264.57519898060906	21/02/24 15:38:00
20	901	356.8834835821911	264.62946120236785	21/02/24 15:38:00
20	901	356.8834835821911	264.62946120236785	21/02/24 15:38:00
20	901	356.8208382319099	264.7113015094386	21/02/24 15:38:00
20	901	356.9851028090465	264.734497281482	21/02/24 15:38:00
20	901	356.93646956130533	264.7752431637315	21/02/24 15:38:00
20	901	356.98543850620035	264.794224520233	21/02/24 15:38:00
20	901	356.89623585111207	264.83608309069655	21/02/24 15:38:00
20	901	356.86314698141047	264.5656720584776	21/02/24 15:38:01
20	901	356.9209175799341	264.73607385494336	21/02/24 15:38:01
20	901	356.83801719675694	264.6985623228495	21/02/24 15:38:01
20	901	356.94820230608127	264.77573551988473	21/02/24 15:38:01
20	901	356.86223547580056	264.50394162856213	21/02/24 15:38:01
20	901	356.9453816971038	264.3580130002274	21/02/24 15:38:01
20	901	357.01543852335845	264.20903874981906	21/02/24 15:38:01
20	901	357.01543852335845	264.20903874981906	21/02/24 15:38:01
20	901	357.01543852335845	264.20903874981906	21/02/24 15:38:01
20	901	357.21432507418734	264.149454174588	21/02/24 15:38:01
20	901	357.170082563838	264.00095318956505	21/02/24 15:38:02
20	901	357.24722744218406	263.8112612992935	21/02/24 15:38:02
20	901	357.1069889209171	263.6572670040297	21/02/24 15:38:02
20	901	356.94231401119856	263.61893791188174	21/02/24 15:38:02
20	901	357.1751149253795	263.7951626881123	21/02/24 15:38:02
20	901	357.1797668150234	263.8034472967823	21/02/24 15:38:02
20	901	357.1094512844096	263.70064628077773	21/02/24 15:38:02
20	901	357.00938210382157	263.6627267563884	21/02/24 15:38:02
20	901	356.9209029907135	263.8481670409306	21/02/24 15:38:02
20	901	356.7956201884706	263.7587815774984	21/02/24 15:38:03
20	901	357.04337305191194	263.8497126687758	21/02/24 15:38:03
20	901	356.9869595876647	263.8330745102727	21/02/24 15:38:03
20	901	357.19960837590503	264.0252837118165	21/02/24 15:38:03
20	901	357.10485384192816	263.89474796449923	21/02/24 15:38:03
20	901	357.19241272234535	263.9246366853858	21/02/24 15:38:03
20	901	357.36944888124924	263.91792921018	21/02/24 15:38:03
20	901	357.30643907806797	263.9351336672899	21/02/24 15:38:03
20	901	357.2969659135133	263.8857471316838	21/02/24 15:38:03
20	901	357.32142532062704	263.8637280860953	21/02/24 15:38:03
20	901	357.29402009128063	264.05218787977515	21/02/24 15:38:04
20	901	357.169485514756	264.12149271678265	21/02/24 15:38:04
20	901	357.22481566305146	264.1884378173134	21/02/24 15:38:04
20	901	357.16560780413073	264.4069700166567	21/02/24 15:38:04
20	901	357.1795065056842	264.4040658756786	21/02/24 15:38:04
20	901	357.0951561724383	264.4543261104501	21/02/24 15:38:04
20	901	357.08891471260466	264.46048063566536	21/02/24 15:38:04
20	901	356.8863630463304	264.4987599665996	21/02/24 15:38:04
20	901	356.7219106320268	264.32003993118974	21/02/24 15:38:04
20	901	356.7477300026088	264.341646243877	21/02/24 15:38:04
20	901	357.01036435692544	264.4799991430193	21/02/24 15:38:05
20	901	357.227450825678	264.56912313870504	21/02/24 15:38:05
20	901	357.19387841596387	264.58473290697907	21/02/24 15:38:05
20	901	357.2547827717556	264.5513295146704	21/02/24 15:38:05
20	901	357.4416546723625	264.5881362917471	21/02/24 15:38:05
20	901	357.4270775213693	264.5738360688167	21/02/24 15:38:05
20	901	357.3623623976371	264.6438169243586	21/02/24 15:38:05
20	901	357.43263174543796	264.7302435951015	21/02/24 15:38:05
20	901	357.67762965964835	264.7230462933114	21/02/24 15:38:05
20	901	357.38797693854207	264.7036125848879	21/02/24 15:38:06
20	901	357.5665754808427	264.9380369868382	21/02/24 15:38:06
20	901	357.7549283377394	265.15243330111724	21/02/24 15:38:06
20	901	357.5936890172723	265.3083165023419	21/02/24 15:38:06
20	901	357.86786198106904	265.2445220190532	21/02/24 15:38:06
20	901	357.8518157903201	265.33808764408985	21/02/24 15:38:06
20	901	358.05386666579403	265.5178456614331	21/02/24 15:38:06
20	901	357.87928527627616	265.33541431533604	21/02/24 15:38:06
20	901	357.90031912772434	265.2107608841798	21/02/24 15:38:06
20	901	357.8692987969187	265.1412498951937	21/02/24 15:38:06
20	901	357.8564679472143	265.06078720503496	21/02/24 15:38:07
20	901	357.9433170682263	264.92183702116256	21/02/24 15:38:07
20	901	357.8260579951015	265.09677313942154	21/02/24 15:38:07
20	901	357.8029495338985	264.8078261341431	21/02/24 15:38:07
20	901	357.7576398219439	264.85411912457727	21/02/24 15:38:07
20	901	357.8295137934026	264.8956222356756	21/02/24 15:38:07
20	901	357.8357284793563	264.81712670997547	21/02/24 15:38:07
20	901	357.78376878913485	264.57082794798475	21/02/24 15:38:07
20	901	357.68094961766957	264.3443454281768	21/02/24 15:38:07
20	901	357.6928756249855	264.3341014022426	21/02/24 15:38:07
20	901	357.59060520179986	264.35865701289003	21/02/24 15:38:08
20	901	357.7028923828369	264.43180810959547	21/02/24 15:38:08
20	901	357.61237562755707	264.53842875261296	21/02/24 15:38:08
20	901	357.6472909053972	264.35206274392846	21/02/24 15:38:08
20	901	357.5652118386868	264.2847204424428	21/02/24 15:38:08
20	901	357.78173622376926	264.1361635875483	21/02/24 15:38:08
20	901	357.931957902489	264.26258078575154	21/02/24 15:38:08
20	901	357.67992565823783	264.2782159624401	21/02/24 15:38:08
20	901	357.60404441004135	264.28766688845707	21/02/24 15:38:08
20	901	357.77356085025866	264.2677437732024	21/02/24 15:38:09
20	901	357.64325510933384	264.0067073208091	21/02/24 15:38:09
20	901	357.55904849175084	263.90919278676023	21/02/24 15:38:09
20	901	357.659062077676	263.7205578702674	21/02/24 15:38:09
20	901	357.8450737674058	263.6626890884721	21/02/24 15:38:09
20	901	358.09834260572654	263.5923589043969	21/02/24 15:38:09
20	901	358.22858550863987	263.638785211853	21/02/24 15:38:09
20	901	358.2693767970533	263.6866585716259	21/02/24 15:38:09
20	901	358.28519973742164	263.6051168417854	21/02/24 15:38:09
20	901	358.2771601018133	263.69724551875015	21/02/24 15:38:09
20	901	358.3285588836321	263.8774388164315	21/02/24 15:38:10
20	901	358.32788039790995	263.87826903741774	21/02/24 15:38:10
20	901	358.44223166949723	263.87025222220433	21/02/24 15:38:10
20	901	358.30957023911935	263.8593227043079	21/02/24 15:38:10
20	901	358.2154116831283	263.9475623782956	21/02/24 15:38:10
20	901	358.129254636958	263.7988502471187	21/02/24 15:38:10
20	901	358.0430525992171	263.9131501278067	21/02/24 15:38:10
20	901	357.9253384638038	264.09510486826304	21/02/24 15:38:10
20	901	358.086836471746	264.20078212500533	21/02/24 15:38:10
20	901	358.00510720465314	264.33915747785824	21/02/24 15:38:11
20	901	358.006653149251	264.3303551083035	21/02/24 15:38:11
20	901	358.02029262193497	264.38861098040206	21/02/24 15:38:11
20	901	357.84876676750764	264.3757752201888	21/02/24 15:38:11
20	901	358.04043931292034	264.27540458125225	21/02/24 15:38:11
20	901	358.10706820579315	264.4024154761903	21/02/24 15:38:11
20	901	358.16715065581076	264.18588913763057	21/02/24 15:38:11
20	901	358.23660200302186	264.1063829202955	21/02/24 15:38:11
20	901	358.4428002123265	264.0699181499153	21/02/24 15:38:11
20	901	358.4418998107997	264.0556577387528	21/02/24 15:38:11
20	901	358.2105962221484	264.10839285000463	21/02/24 15:38:12
20	901	358.2110060440158	264.40466329804764	21/02/24 15:38:12
20	901	358.0665013139276	264.62996220108477	21/02/24 15:38:12
20	901	358.1045884343829	264.50481008374385	21/02/24 15:38:12
20	901	358.1889982919768	264.4283153056623	21/02/24 15:38:12
20	901	358.11655157616144	264.17997348877407	21/02/24 15:38:12
20	901	358.22075620186007	264.36557241826023	21/02/24 15:38:12
20	901	358.1855373006378	264.2105446584172	21/02/24 15:38:12
20	901	358.15379607199293	264.18645592598915	21/02/24 15:38:12
20	901	358.2748298606245	264.45359170166097	21/02/24 15:38:12
20	901	358.26137515684496	264.4053338904895	21/02/24 15:38:13
20	901	358.32969114286936	264.47799732351206	21/02/24 15:38:13
20	901	358.18257472601084	264.3250327013749	21/02/24 15:38:13
20	901	357.9384410369305	264.3250995467184	21/02/24 15:38:13
20	901	357.874963386265	264.26628407112753	21/02/24 15:38:13
20	901	357.9635461898702	264.3795718754318	21/02/24 15:38:13
20	901	357.8230624779117	264.14311906105365	21/02/24 15:38:13
20	901	357.85886782007157	264.4063633133126	21/02/24 15:38:13
20	901	357.93930447393484	264.3193365001613	21/02/24 15:38:13
20	901	357.88918987614755	264.2558746572484	21/02/24 15:38:13
20	901	357.9193693083074	264.2611187417549	21/02/24 15:38:14
20	901	357.9492184953508	264.07536114084184	21/02/24 15:38:14
20	901	357.99780896732614	264.2969695278849	21/02/24 15:38:14
20	901	357.9280600251639	264.4082175717563	21/02/24 15:38:14
20	901	357.88408373016193	264.3030762506827	21/02/24 15:38:14
20	901	358.1406335225345	264.313203543944	21/02/24 15:38:14
20	901	358.1318014436446	264.30943774624825	21/02/24 15:38:14
20	901	357.91421302780003	264.3566432162239	21/02/24 15:38:14
20	901	357.7559863591006	264.31559734376896	21/02/24 15:38:14
20	901	357.77206848788074	264.385584707068	21/02/24 15:38:15
20	901	357.77419789858635	264.38561660164476	21/02/24 15:38:15
20	901	357.83160836651984	264.3832983340397	21/02/24 15:38:15
20	901	357.8428999633227	264.38486189399185	21/02/24 15:38:15
20	901	358.0114873686609	264.4449538565692	21/02/24 15:38:15
20	901	358.23329514381754	264.2945638142087	21/02/24 15:38:15
20	901	358.2611006356274	264.2598783261417	21/02/24 15:38:15
20	901	358.21631608398326	264.3931989374209	21/02/24 15:38:15
20	901	358.17924251155614	264.1271776408315	21/02/24 15:38:15
20	901	358.36320704468824	264.28929457480507	21/02/24 15:38:15
20	901	358.2973722000398	264.07802342566686	21/02/24 15:38:16
20	901	358.12487186737565	263.83976477417565	21/02/24 15:38:16
20	901	358.3561848964368	263.8920545171132	21/02/24 15:38:16
20	901	358.4246925915413	263.9325991590397	21/02/24 15:38:16
20	901	358.3456562466538	264.0487099071595	21/02/24 15:38:16
20	901	358.2223569887179	264.2186113414831	21/02/24 15:38:16
20	901	358.22003104334624	264.2180648379153	21/02/24 15:38:16
20	901	358.29285251333175	264.3303792561313	21/02/24 15:38:16
20	901	358.34684617610696	264.3582202895716	21/02/24 15:38:16
20	901	358.2789217190026	264.620055714845	21/02/24 15:38:16
20	901	358.20637817064295	264.6154926843068	21/02/24 15:38:17
20	901	358.1578209019377	264.6312865360628	21/02/24 15:38:17
20	901	358.20016658298147	264.66133594479516	21/02/24 15:38:17
20	901	358.30918142673124	264.84167105050375	21/02/24 15:38:17
20	901	358.13232259226	264.8519357884343	21/02/24 15:38:17
20	901	358.1202346152266	264.8023064350245	21/02/24 15:38:17
20	901	358.30901351419203	264.86192710422984	21/02/24 15:38:17
20	901	358.24616257446166	264.6954686380174	21/02/24 15:38:17
20	901	358.07975581003035	264.55280007918117	21/02/24 15:38:17
20	901	358.0306538449225	264.5812168695088	21/02/24 15:38:18
20	901	358.0104191754902	264.48084219787273	21/02/24 15:38:18
20	901	358.16223121237874	264.68024636735447	21/02/24 15:38:18
20	901	357.9491389549538	264.82426642878534	21/02/24 15:38:18
20	901	357.9833669132329	264.55695149733464	21/02/24 15:38:18
20	901	357.9852760728666	264.5553767104817	21/02/24 15:38:18
20	901	358.1585816129089	264.51658183983517	21/02/24 15:38:18
20	901	358.1585671088837	264.5167072722718	21/02/24 15:38:18
20	901	358.17515025209633	264.30202763257665	21/02/24 15:38:18
20	901	358.16299023975876	264.20227703524154	21/02/24 15:38:18
20	901	358.2888609737187	264.45294825907206	21/02/24 15:38:19
20	901	358.3990058840151	264.5250182104192	21/02/24 15:38:19
20	901	358.3080497048051	264.6526106977913	21/02/24 15:38:19
20	901	358.2184600233716	264.53638409219843	21/02/24 15:38:19
20	901	358.2796198428103	264.6271800477266	21/02/24 15:38:19
20	901	358.14382535904065	264.5708840307385	21/02/24 15:38:19
20	901	358.11807531984	264.56999981528514	21/02/24 15:38:19
20	901	358.0461468461789	264.55088214463143	21/02/24 15:38:19
20	901	358.0063986764806	264.58722739860013	21/02/24 15:38:19
20	901	358.0806059943866	264.45933506030656	21/02/24 15:38:19
20	901	358.12817678439825	264.6540506790665	21/02/24 15:38:20
20	901	358.1054221292718	264.6487419093683	21/02/24 15:38:20
20	901	358.13750542028197	264.65236566731807	21/02/24 15:38:20
20	901	358.21828301630046	264.59129996898594	21/02/24 15:38:20
20	901	358.42176172693195	264.42519594148644	21/02/24 15:38:20
20	901	358.3335771877235	264.47612645246716	21/02/24 15:38:20
20	901	358.42356140772705	264.694795061137	21/02/24 15:38:20
20	901	358.37644264204914	264.72554265691366	21/02/24 15:38:20
20	901	358.3401571686363	264.66595022968374	21/02/24 15:38:20
20	901	358.4159203237918	264.5353892681738	21/02/24 15:38:21
20	901	358.5229259357372	264.5644995477086	21/02/24 15:38:21
20	901	358.54243974989873	264.50645167079955	21/02/24 15:38:21
20	901	358.5132276378377	264.62883886704253	21/02/24 15:38:21
20	901	358.54360310571445	264.4990688605866	21/02/24 15:38:21
20	901	358.42112086537156	264.4835040136888	21/02/24 15:38:21
20	901	358.6671590395938	264.34612190892256	21/02/24 15:38:21
20	901	358.67578309984515	264.26805703571995	21/02/24 15:38:21
20	901	358.5012178490219	264.1658425744597	21/02/24 15:38:21
20	901	358.28298758659355	264.0012002069325	21/02/24 15:38:21
20	901	358.3421457191778	263.9583196250386	21/02/24 15:38:22
20	901	358.4016180889943	263.8635878549461	21/02/24 15:38:22
20	901	358.20489779765165	263.7188777859845	21/02/24 15:38:22
20	901	358.198889693481	263.723039313439	21/02/24 15:38:22
20	901	358.1041367169879	263.7421481475955	21/02/24 15:38:22
20	901	358.19667050993775	263.8770566612031	21/02/24 15:38:22
20	901	358.21848313929394	263.90810925728545	21/02/24 15:38:22
20	901	358.2753567249935	263.67321672744623	21/02/24 15:38:22
20	901	358.25158230992963	263.62575336257146	21/02/24 15:38:22
20	901	358.0946125108246	263.6931110825905	21/02/24 15:38:22
20	901	358.20510300180086	263.643858622217	21/02/24 15:38:23
20	901	358.35314177135143	263.6324763146118	21/02/24 15:38:23
20	901	358.54782336952985	263.5816251458871	21/02/24 15:38:23
20	901	358.5492899038438	263.53529507396416	21/02/24 15:38:23
20	901	358.38954667858843	263.72852643875126	21/02/24 15:38:23
20	901	358.4816216809984	263.5708461100881	21/02/24 15:38:23
20	901	358.441609000594	263.57217771079223	21/02/24 15:38:23
20	901	358.40848020668784	263.4671004755928	21/02/24 15:38:23
20	901	358.29950968390887	263.65400695158246	21/02/24 15:38:23
20	901	358.2821454349273	263.7293817601648	21/02/24 15:38:24
20	901	358.20175699801314	263.9397954646183	21/02/24 15:38:24
20	901	358.3767755654057	263.8123053740823	21/02/24 15:38:24
20	901	358.43404690203164	263.8658091582676	21/02/24 15:38:24
20	901	358.5269292480248	263.9361141663503	21/02/24 15:38:24
20	901	358.4920002015837	263.9890768742724	21/02/24 15:38:24
20	901	358.61097121411956	263.82620182766937	21/02/24 15:38:24
20	901	358.5982354071019	263.7592304685116	21/02/24 15:38:24
20	901	358.7840130323148	263.75268114222825	21/02/24 15:38:24
20	901	358.96893251004656	263.6906703585649	21/02/24 15:38:24
20	901	358.9607266408669	263.7202335700496	21/02/24 15:38:25
20	901	358.73021213937557	263.9018742006883	21/02/24 15:38:25
20	901	358.85094166793016	263.8606862953269	21/02/24 15:38:25
20	901	358.63735542476127	263.8044589752013	21/02/24 15:38:25
20	901	358.8102007059698	263.87298562856256	21/02/24 15:38:25
20	901	358.8880386277537	263.7211111209636	21/02/24 15:38:25
20	901	358.77051211290046	263.71464930392335	21/02/24 15:38:25
20	901	358.77805670354616	263.5940998736835	21/02/24 15:38:25
20	901	358.7649419317359	263.6072845501737	21/02/24 15:38:25
20	901	358.6728330835654	263.53523354939483	21/02/24 15:38:25
20	901	358.74485400053925	263.5704474795927	21/02/24 15:38:26
20	901	358.81636017503376	263.7537250854145	21/02/24 15:38:26
20	901	358.8646928879176	263.66208916807125	21/02/24 15:38:26
20	901	359.00499471003144	263.74675059202286	21/02/24 15:38:26
20	901	358.8031200918377	263.6237039653829	21/02/24 15:38:26
20	901	358.7223055670975	263.7169063972968	21/02/24 15:38:26
20	901	358.75680748987327	263.85286645731577	21/02/24 15:38:26
20	901	358.5354419632178	264.02946277287384	21/02/24 15:38:26
20	901	358.50127903244095	264.0599104886818	21/02/24 15:38:26
20	901	358.52229679185257	264.0370382293022	21/02/24 15:38:27
20	901	358.67367518401466	264.11866146563585	21/02/24 15:38:27
20	901	358.6202987142855	264.33215682506983	21/02/24 15:38:27
20	901	358.5396474890983	264.39135521788387	21/02/24 15:38:27
20	901	358.6526741217131	264.2070602626425	21/02/24 15:38:27
20	901	358.623429459449	264.14274725324157	21/02/24 15:38:27
20	901	358.6567170182941	264.05920591212424	21/02/24 15:38:27
20	901	358.6266873029592	264.0517284884124	21/02/24 15:38:27
20	901	358.81658676617445	264.0448319748496	21/02/24 15:38:27
20	901	358.7432541609179	263.9419575901338	21/02/24 15:38:27
20	901	358.74125330767396	263.6818631559327	21/02/24 15:38:28
20	901	358.83536706492634	263.57860547146043	21/02/24 15:38:28
20	901	358.7937267049839	263.57812471843573	21/02/24 15:38:28
20	901	358.6322426391035	263.45792402446796	21/02/24 15:38:28
20	901	358.7180745132845	263.6064162865318	21/02/24 15:38:28
20	901	358.72740252317607	263.6083286051883	21/02/24 15:38:28
20	901	358.6606054253286	263.82360735901227	21/02/24 15:38:28
20	901	358.5913640211231	263.6145006520415	21/02/24 15:38:28
20	901	358.5273394161713	263.60931625521886	21/02/24 15:38:28
20	901	358.65970290116195	263.4987652724539	21/02/24 15:38:28
20	901	358.57098776422225	263.45176176774294	21/02/24 15:38:29
20	901	358.6927875611241	263.4956887974326	21/02/24 15:38:29
20	901	358.6927875611241	263.4956887974326	21/02/24 15:38:29
20	901	358.6927875611241	263.4956887974326	21/02/24 15:38:29
20	901	358.67634976183234	263.46428177672396	21/02/24 15:38:29
20	901	358.6817471817603	263.5417641528841	21/02/24 15:38:29
20	901	358.5478013046397	263.59142849903213	21/02/24 15:38:29
20	901	358.5348589508061	263.70444564249885	21/02/24 15:38:29
20	901	358.48488170510905	263.88553819231424	21/02/24 15:38:29
20	901	358.48488170510905	263.88553819231424	21/02/24 15:38:30
20	901	358.6843995057563	263.7464384690522	21/02/24 15:38:30
20	901	358.6843995057563	263.7464384690522	21/02/24 15:38:30
20	901	358.4414090446602	263.6722819515574	21/02/24 15:38:30
20	901	358.5420337929705	263.6843285734077	21/02/24 15:38:30
20	901	358.55028287899603	263.6849102128853	21/02/24 15:38:30
20	901	358.42465182957505	263.83779808768946	21/02/24 15:38:30
20	901	358.42465182957505	263.83779808768946	21/02/24 15:38:30
20	901	358.4954166938625	264.1305054098064	21/02/24 15:38:30
20	901	358.4954166938625	264.1305054098064	21/02/24 15:38:30
20	901	358.3896250615557	264.13142008994066	21/02/24 15:38:31
20	901	358.3899985216843	264.13029746805745	21/02/24 15:38:31
20	901	358.3356547028375	264.3011407695931	21/02/24 15:38:31
20	901	358.3356547028375	264.3011407695931	21/02/24 15:38:31
20	901	358.50052472735973	264.3823405023949	21/02/24 15:38:31
20	901	358.50052472735973	264.3823405023949	21/02/24 15:38:31
20	901	358.34960286147185	264.62507229878815	21/02/24 15:38:31
20	901	358.41916025907113	264.40530488417414	21/02/24 15:38:31
20	901	358.3724307910064	264.645691089305	21/02/24 15:38:31
20	901	358.3627910850631	264.8571498839268	21/02/24 15:38:31
20	901	358.3453623223209	264.5756308035514	21/02/24 15:38:32
20	901	358.379668632446	264.46022141108523	21/02/24 15:38:32
20	901	358.62249107383474	264.6281664096474	21/02/24 15:38:32
20	901	358.7239177151044	264.6531659874261	21/02/24 15:38:32
20	901	358.9457184006175	264.59540425986745	21/02/24 15:38:32
20	901	358.68777844634775	264.64364651839554	21/02/24 15:38:32
20	901	358.65345296534014	264.56885139488776	21/02/24 15:38:32
20	901	358.60934353980326	264.33120145048275	21/02/24 15:38:32
20	901	358.46820946466	264.3825684114242	21/02/24 15:38:32
20	901	358.46820946466	264.3825684114242	21/02/24 15:38:33
20	901	358.54993057853386	264.2922015286957	21/02/24 15:38:33
20	901	358.53902414299716	264.30389342055753	21/02/24 15:38:33
20	901	358.4109907693929	264.35151925625064	21/02/24 15:38:33
20	901	358.26855471000306	264.14467010414927	21/02/24 15:38:33
20	901	358.15170185583645	264.35137848519247	21/02/24 15:38:33
20	901	358.1310337090696	264.4240592275874	21/02/24 15:38:33
20	901	358.00405941325363	264.68274515841995	21/02/24 15:38:33
20	901	358.00180111318826	264.63298051221494	21/02/24 15:38:33
20	901	358.0718547585533	264.7062353840039	21/02/24 15:38:33
20	901	358.2162513148058	264.570097917214	21/02/24 15:38:34
20	901	358.2162513148058	264.570097917214	21/02/24 15:38:34
20	901	358.34966701571364	264.8868828222596	21/02/24 15:38:34
20	901	358.0728486377439	264.77433778393237	21/02/24 15:38:34
20	901	358.028238459917	264.78032656335864	21/02/24 15:38:34
20	901	357.81096972752954	264.8331943647466	21/02/24 15:38:34
20	901	357.81096972752954	264.8331943647466	21/02/24 15:38:34
20	901	357.64555007168525	264.7470150078706	21/02/24 15:38:34
20	901	357.92191136830576	264.7775336092732	21/02/24 15:38:34
20	901	357.74856309985614	264.8816760172916	21/02/24 15:38:34
20	901	357.64028724630487	264.99184307335554	21/02/24 15:38:35
20	901	357.65893514046815	264.8778627798108	21/02/24 15:38:35
20	901	357.604175819966	265.1356665105854	21/02/24 15:38:35
20	901	357.42464622999415	265.2995574845997	21/02/24 15:38:35
20	901	357.3699799550892	265.45988424508505	21/02/24 15:38:35
20	901	357.2335973582535	265.5212392151171	21/02/24 15:38:35
20	901	357.119038304065	265.50454303751496	21/02/24 15:38:35
20	901	357.05587705192397	265.5075397029764	21/02/24 15:38:35
20	901	356.92925400720674	265.70275663142417	21/02/24 15:38:35
20	901	356.7634774294633	265.7578124721401	21/02/24 15:38:36
20	901	356.71958900538885	265.86049603902507	21/02/24 15:38:36
20	901	356.70457067616815	265.60871629500514	21/02/24 15:38:36
20	901	356.70457067616815	265.60871629500514	21/02/24 15:38:36
20	901	356.9717103472974	265.4820071184267	21/02/24 15:38:36
20	901	356.9294608793982	265.366208952938	21/02/24 15:38:36
20	901	356.79751431461193	265.38278728169985	21/02/24 15:38:36
20	901	356.91616864041526	265.35070715595566	21/02/24 15:38:36
20	901	357.0060161970881	265.56673606975613	21/02/24 15:38:36
20	901	357.2224805967373	265.57928198664655	21/02/24 15:38:36
20	901	357.25962642521876	265.59298486901633	21/02/24 15:38:37
20	901	357.16189925841525	265.4126598925385	21/02/24 15:38:37
20	901	357.09131318920504	265.528320796049	21/02/24 15:38:37
20	901	356.80361673959965	265.48681688112936	21/02/24 15:38:37
20	901	356.9176914885339	265.55398099436576	21/02/24 15:38:37
20	901	356.9235485724177	265.55688392761937	21/02/24 15:38:37
20	901	357.001274238118	265.5250792930108	21/02/24 15:38:37
20	901	356.99077242060645	265.69823390574925	21/02/24 15:38:37
20	901	356.9711727344094	265.758682631219	21/02/24 15:38:37
20	901	357.2571892520795	265.8241841148568	21/02/24 15:38:38
20	901	357.20346193592184	265.8431457801564	21/02/24 15:38:38
20	901	357.0115042292937	265.9486429911212	21/02/24 15:38:38
20	901	356.8306879087219	265.83312272207996	21/02/24 15:38:38
20	901	356.8754424422674	265.73312415483076	21/02/24 15:38:38
20	901	357.15971769680374	265.75137847376226	21/02/24 15:38:38
20	901	357.2161420227387	266.0129150868818	21/02/24 15:38:38
20	901	357.22039098439063	266.01136051119397	21/02/24 15:38:38
20	901	357.1664052691904	266.259497318688	21/02/24 15:38:38
20	901	357.1876867342727	266.2681377878367	21/02/24 15:38:38
20	901	357.33980446307714	266.40935811315285	21/02/24 15:38:39
20	901	357.386123528032	266.41732880794723	21/02/24 15:38:39
20	901	357.29601689550594	266.5355334993192	21/02/24 15:38:39
20	901	357.30231421597693	266.44536054198403	21/02/24 15:38:39
20	901	357.32914507748256	266.3874052988573	21/02/24 15:38:39
20	901	357.38794361765434	266.36464594425513	21/02/24 15:38:39
20	901	357.37471559788975	266.4095512172395	21/02/24 15:38:39
20	901	357.42655347508855	266.27046641049066	21/02/24 15:38:39
20	901	357.20390158481746	266.11382072731334	21/02/24 15:38:39
20	901	357.1643416660514	266.0987291711776	21/02/24 15:38:40
20	901	356.87906338830055	266.0579593988157	21/02/24 15:38:40
20	901	356.8595736753118	266.1278747678529	21/02/24 15:38:40
20	901	356.83192718951113	266.10640236408216	21/02/24 15:38:40
20	901	356.96109449700737	266.00018479214145	21/02/24 15:38:40
20	901	356.8024383621336	265.866631706694	21/02/24 15:38:40
20	901	356.9034974167408	265.99034286220535	21/02/24 15:38:40
20	901	356.84416909389444	266.0121947524596	21/02/24 15:38:40
20	901	356.9829353790582	266.11027799120404	21/02/24 15:38:40
20	901	357.0355774515645	266.12293450209347	21/02/24 15:38:40
20	901	356.8481453919374	266.037232150905	21/02/24 15:38:41
20	901	356.88403927073534	266.19550348251727	21/02/24 15:38:41
20	901	356.7675194144489	266.0290472741108	21/02/24 15:38:41
20	901	356.7024002872367	266.0015031817058	21/02/24 15:38:41
20	901	356.7342514785397	265.9870626534444	21/02/24 15:38:41
20	901	356.7724041345797	266.07678372326393	21/02/24 15:38:41
20	901	356.8930862600105	265.9284348533639	21/02/24 15:38:41
20	901	356.8225351502038	266.2143925945693	21/02/24 15:38:41
20	901	357.01328202873884	266.2223355619038	21/02/24 15:38:41
20	901	357.07779535435947	266.1711044508056	21/02/24 15:38:41
20	901	356.8741492877441	265.9758524192134	21/02/24 15:38:42
20	901	356.8705054796092	266.0442127872438	21/02/24 15:38:42
20	901	356.85646667763484	266.0449766941245	21/02/24 15:38:42
20	901	357.0279881073541	266.02206266501554	21/02/24 15:38:42
20	901	357.130260368088	265.76035159191673	21/02/24 15:38:42
20	901	357.2778455140633	265.50610267086347	21/02/24 15:38:42
20	901	357.34734046937587	265.52672741366655	21/02/24 15:38:42
20	901	357.14484656577366	265.5076619433358	21/02/24 15:38:42
20	901	357.07796036806593	265.46400225770395	21/02/24 15:38:42
20	901	357.10588777413307	265.4197568755141	21/02/24 15:38:43
20	901	357.1819694229404	265.3280112383557	21/02/24 15:38:43
20	901	357.02287100718627	265.3217618813281	21/02/24 15:38:43
20	901	357.1638507184114	265.31786262586695	21/02/24 15:38:43
20	901	357.15946886821456	265.3154290949452	21/02/24 15:38:43
20	901	356.94001569379736	265.1127635312623	21/02/24 15:38:43
20	901	356.9548498485873	265.1656317551971	21/02/24 15:38:43
20	901	356.92334274651546	265.19734826842983	21/02/24 15:38:43
20	901	357.0137345610344	265.32150348656984	21/02/24 15:38:43
20	901	357.00333619359867	265.4861011841212	21/02/24 15:38:43
20	901	356.82727516578234	265.61166206662944	21/02/24 15:38:44
20	901	356.99582691560494	265.83604971373273	21/02/24 15:38:44
20	901	356.9944308156257	265.9006030934987	21/02/24 15:38:44
20	901	357.2410674532982	265.93640484920667	21/02/24 15:38:44
20	901	357.36305411564575	265.79803948672424	21/02/24 15:38:44
20	901	357.3881119516202	265.6497546922571	21/02/24 15:38:44
20	901	357.5665380675905	265.76700850963584	21/02/24 15:38:44
20	901	357.4144356046767	265.8523509182968	21/02/24 15:38:44
20	901	357.2599819358898	265.9937705134827	21/02/24 15:38:44
20	901	357.45688061863075	266.10585267898125	21/02/24 15:38:44
20	901	357.4246620044498	266.29935442470713	21/02/24 15:38:45
20	901	357.2808101216613	266.1604033275555	21/02/24 15:38:45
20	901	357.2763030827732	266.2758015410411	21/02/24 15:38:45
20	901	357.24874330240743	266.2399113422133	21/02/24 15:38:45
20	901	357.3934570602644	266.2969848706645	21/02/24 15:38:45
20	901	357.3919762748459	266.2603992774262	21/02/24 15:38:45
20	901	357.3556382845112	266.334756115939	21/02/24 15:38:45
20	901	357.33870051811476	266.05960537369293	21/02/24 15:38:45
20	901	357.2389911541606	266.1395524860837	21/02/24 15:38:45
20	901	356.9484672171258	266.17453991191076	21/02/24 15:38:46
20	901	356.9470862701888	266.1777208630239	21/02/24 15:38:46
20	901	356.90573040024833	266.27934946770176	21/02/24 15:38:46
20	901	357.031659270721	266.1847858365143	21/02/24 15:38:46
20	901	357.0168560846065	266.0225248262421	21/02/24 15:38:46
20	901	357.017302898666	266.0129412753634	21/02/24 15:38:46
20	901	356.9762625003959	266.1824151067699	21/02/24 15:38:46
20	901	356.7739563201472	266.0719693017882	21/02/24 15:38:46
20	901	356.91978662321605	266.3123272100853	21/02/24 15:38:46
20	901	356.9498695063732	266.2427549761905	21/02/24 15:38:46
20	901	356.94772926420995	266.2443643541408	21/02/24 15:38:47
20	901	356.9910466961983	266.3811761744062	21/02/24 15:38:47
20	901	356.91820265674045	266.4991025738352	21/02/24 15:38:47
20	901	356.91820265674045	266.4991025738352	21/02/24 15:38:47
20	901	356.91820265674045	266.4991025738352	21/02/24 15:38:47
20	901	356.9200274983846	266.50476901798316	21/02/24 15:38:47
20	901	356.8061903435068	266.2926164680774	21/02/24 15:38:47
20	901	356.8001341230606	266.3220058559056	21/02/24 15:38:47
20	901	356.9664703062262	266.5426444310174	21/02/24 15:38:47
20	901	356.8773895433048	266.5023990645343	21/02/24 15:38:47
20	901	356.83509510782415	266.5811670791561	21/02/24 15:38:48
20	901	356.69662430804584	266.70284456768513	21/02/24 15:38:48
20	901	356.7422693807953	266.787936567058	21/02/24 15:38:48
20	901	356.84604154803856	266.55523653489917	21/02/24 15:38:48
20	901	356.9310565038719	266.2737133305178	21/02/24 15:38:48
20	901	356.8282420680157	266.02119961971795	21/02/24 15:38:48
20	901	356.8235397102899	266.0188117287666	21/02/24 15:38:48
20	901	356.8693793710294	266.04922836832236	21/02/24 15:38:48
20	901	357.0709229793745	265.92469113126134	21/02/24 15:38:48
20	901	357.02727255803865	265.9317704350573	21/02/24 15:38:49
20	901	357.109729235201	265.9612260089141	21/02/24 15:38:49
20	901	357.1431308031458	265.7813301255333	21/02/24 15:38:49
20	901	357.13107435561267	265.88653325490736	21/02/24 15:38:49
20	901	357.14683361783136	265.8589007014977	21/02/24 15:38:49
20	901	357.22131098621344	265.91197845486937	21/02/24 15:38:49
20	901	357.0502089877802	266.10113734554926	21/02/24 15:38:49
20	901	357.0093048939203	266.08132412492574	21/02/24 15:38:49
20	901	356.9792357288865	266.00982838358885	21/02/24 15:38:49
20	901	356.97514735888717	265.84041004554035	21/02/24 15:38:49
20	901	356.86080102311814	266.0245923117126	21/02/24 15:38:50
20	901	356.8850218733137	265.9733299138185	21/02/24 15:38:50
20	901	356.85498368985094	265.98560142309753	21/02/24 15:38:50
20	901	356.9988901619404	265.87103254761047	21/02/24 15:38:50
20	901	357.17291529147485	266.081624887382	21/02/24 15:38:50
20	901	357.1528907543543	266.03088163925446	21/02/24 15:38:50
20	901	357.19406305193814	266.0775475509106	21/02/24 15:38:50
20	901	357.19040491037066	265.78110584558266	21/02/24 15:38:50
20	901	357.28849821471005	265.8944776566177	21/02/24 15:38:50
20	901	357.417131675835	265.89631836276294	21/02/24 15:38:50
20	901	357.4860974548733	265.7515245784659	21/02/24 15:38:51
20	901	357.52303734033245	265.91150252131456	21/02/24 15:38:51
20	901	357.61337596535276	266.1039905768193	21/02/24 15:38:51
20	901	357.62819859507835	265.99455107196445	21/02/24 15:38:51
20	901	357.55184349223254	265.88849432858166	21/02/24 15:38:51
20	901	357.603114531055	266.07781237917106	21/02/24 15:38:51
20	901	357.6690792646489	266.286603447137	21/02/24 15:38:51
20	901	357.6119332372682	266.5051236089734	21/02/24 15:38:51
20	901	357.52095767427323	266.72756238003996	21/02/24 15:38:51
20	901	357.6705774196636	266.95790403297747	21/02/24 15:38:52
20	901	357.4142704591612	266.9547860018392	21/02/24 15:38:52
20	901	357.39276586272166	267.1312664263464	21/02/24 15:38:52
20	901	357.42168072377274	267.17164769608564	21/02/24 15:38:52
20	901	357.45884656032626	267.37739861775316	21/02/24 15:38:52
20	901	357.4420628538659	267.39468787739276	21/02/24 15:38:52
20	901	357.2698463685528	267.42191128350674	21/02/24 15:38:52
20	901	357.2794988925221	267.42067515631595	21/02/24 15:38:52
20	901	357.48631835654453	267.52939327516276	21/02/24 15:38:52
20	901	357.50580282742146	267.34545264589065	21/02/24 15:38:52
20	901	357.56165030537227	267.4338970998096	21/02/24 15:38:53
20	901	357.650041262376	267.2727435351539	21/02/24 15:38:53
20	901	357.61449689634634	267.35269819104843	21/02/24 15:38:53
20	901	357.75633108687924	267.5876483291618	21/02/24 15:38:53
20	901	357.73328677229995	267.48457381011707	21/02/24 15:38:53
20	901	357.7391085459681	267.48055777024706	21/02/24 15:38:53
20	901	357.94621984201063	267.6377462771631	21/02/24 15:38:53
20	901	357.9607280119623	267.7453550792345	21/02/24 15:38:53
20	901	357.8162437334755	267.8672635980662	21/02/24 15:38:53
20	901	357.52770046846734	267.8558541942419	21/02/24 15:38:53
20	901	357.71328105795453	268.05741838019594	21/02/24 15:38:54
20	901	357.89082393259457	268.2369827578998	21/02/24 15:38:54
20	901	358.03028861247464	268.39428326529986	21/02/24 15:38:54
20	901	358.27867127714967	268.4312918347382	21/02/24 15:38:54
20	901	358.5174117812673	268.29886053446467	21/02/24 15:38:54
20	901	358.50414294801345	268.2917218840616	21/02/24 15:38:54
20	901	358.52469834565863	268.5372555371522	21/02/24 15:38:54
20	901	358.32434567388015	268.5761761535561	21/02/24 15:38:54
20	901	358.4323546650339	268.7958292358158	21/02/24 15:38:54
20	901	358.40372315293115	269.02966143154504	21/02/24 15:38:55
20	901	358.4036717077705	269.02954995642773	21/02/24 15:38:55
20	901	358.46315183191683	269.06540688301914	21/02/24 15:38:55
20	901	358.60746594763157	269.0621903774464	21/02/24 15:38:55
20	901	358.5848357073738	269.0833235760933	21/02/24 15:38:55
20	901	358.3593627937293	269.1945913793112	21/02/24 15:38:55
20	901	358.2350162931765	269.3639211140986	21/02/24 15:38:55
20	901	358.2198405366498	269.401238480333	21/02/24 15:38:55
20	901	358.22763200759266	269.4017870876921	21/02/24 15:38:55
20	901	358.09863651178404	269.45363218013	21/02/24 15:38:55
20	901	358.09708828931844	269.409416255873	21/02/24 15:38:56
20	901	358.2140802174865	269.6394408277515	21/02/24 15:38:56
20	901	358.3122010416649	269.6222136821434	21/02/24 15:38:56
20	901	358.24718511624707	269.6473981079649	21/02/24 15:38:56
20	901	358.23476472578244	269.549821781983	21/02/24 15:38:56
20	901	358.52154007164654	269.6063434479621	21/02/24 15:38:56
20	901	358.4324820156346	269.44359819066574	21/02/24 15:38:56
20	901	358.3261537903032	269.58543790464523	21/02/24 15:38:56
20	901	358.1412683331888	269.56913058683523	21/02/24 15:38:56
20	901	358.1009230066424	269.62985591979447	21/02/24 15:38:56
20	901	358.0531937896387	269.4884798163496	21/02/24 15:38:57
20	901	358.0962528186288	269.50073115663196	21/02/24 15:38:57
20	901	358.0413470536879	269.6505917178663	21/02/24 15:38:57
20	901	357.91653955927427	269.42774385159044	21/02/24 15:38:57
20	901	357.8715202335991	269.44797292247006	21/02/24 15:38:57
20	901	357.7255685489258	269.6588605858237	21/02/24 15:38:57
20	901	357.75951224289264	269.497294387638	21/02/24 15:38:57
20	901	357.9193452460263	269.29903798047155	21/02/24 15:38:57
20	901	357.8772765852897	269.54326054954487	21/02/24 15:38:57
20	901	358.02428085665485	269.61184563175755	21/02/24 15:38:58
20	901	357.89990092179676	269.77759713208866	21/02/24 15:38:58
20	901	357.7601202916892	269.6353976397449	21/02/24 15:38:58
20	901	357.7562349487686	269.6374078131156	21/02/24 15:38:58
20	901	357.8465712094067	269.8500468397076	21/02/24 15:38:58
20	901	357.95782474636064	269.71185829177193	21/02/24 15:38:58
20	901	357.99551871133616	269.6940894939723	21/02/24 15:38:58
20	901	357.8459974164723	269.6153669146993	21/02/24 15:38:58
20	901	357.85661157662724	269.6192509806245	21/02/24 15:38:58
20	901	358.0088367186581	269.5036974209798	21/02/24 15:38:58
20	901	358.0318862850343	269.31204411122724	21/02/24 15:38:59
20	901	358.26722630218603	269.4768582712277	21/02/24 15:38:59
20	901	358.15742820211716	269.5086882367942	21/02/24 15:38:59
20	901	358.07688992414415	269.6389763657712	21/02/24 15:38:59
20	901	357.7782379897852	269.6112350132789	21/02/24 15:38:59
20	901	357.96852240107387	269.7393472193526	21/02/24 15:38:59
20	901	357.93640189282615	269.76837467696413	21/02/24 15:38:59
20	901	357.9434097403683	269.84731417345984	21/02/24 15:38:59
20	901	357.99379001793557	269.8259182552862	21/02/24 15:38:59
20	901	357.9532572687257	269.7248375827145	21/02/24 15:39:00
20	901	357.88278606512677	269.75843011118184	21/02/24 15:39:00
20	901	357.70323338601753	269.6520828531247	21/02/24 15:39:00
20	901	357.5548506691059	269.66879442556467	21/02/24 15:39:00
20	901	357.61675678032054	269.43848211098066	21/02/24 15:39:00
20	901	357.79468708341994	269.38160164597036	21/02/24 15:39:00
20	901	357.78452221723387	269.2872060049807	21/02/24 15:39:00
20	901	357.8755593446273	269.35157850883826	21/02/24 15:39:00
20	901	358.00523883360546	269.4799235541531	21/02/24 15:39:00
20	901	357.7845468492428	269.5283383256247	21/02/24 15:39:00
20	901	357.72765592651956	269.5162354839312	21/02/24 15:39:01
20	901	357.7287880025154	269.51453191832076	21/02/24 15:39:01
20	901	357.73314502454474	269.4774229856029	21/02/24 15:39:01
20	901	357.93340315477565	269.58806815253826	21/02/24 15:39:01
20	901	357.9649405388337	269.5989670105628	21/02/24 15:39:01
20	901	357.95559428724056	269.80740803989187	21/02/24 15:39:01
20	901	358.1658215847899	269.74779720981945	21/02/24 15:39:01
20	901	358.1555274748272	269.79062334551026	21/02/24 15:39:01
20	901	358.1555274748272	269.79062334551026	21/02/24 15:39:01
20	901	358.1555274748272	269.79062334551026	21/02/24 15:39:02
20	901	358.176493012805	269.7851563327907	21/02/24 15:39:02
20	901	358.4262216687671	269.7007268528086	21/02/24 15:39:02
20	901	358.4540496115217	269.69301856779117	21/02/24 15:39:02
20	901	358.3945506876445	269.6419559538999	21/02/24 15:39:02
20	901	358.2870130238588	269.44169199522196	21/02/24 15:39:02
20	901	358.3724801515656	269.15962726252377	21/02/24 15:39:02
20	901	358.4142600301885	269.2182134594256	21/02/24 15:39:02
20	901	358.3536883164805	269.29469232600326	21/02/24 15:39:02
20	901	358.5204553675256	269.40849319716324	21/02/24 15:39:02
20	901	358.4280722216339	269.3117244345214	21/02/24 15:39:03
20	901	358.4706761822331	269.240752743374	21/02/24 15:39:03
20	901	358.6417568121529	269.2365811831963	21/02/24 15:39:03
20	901	358.6147333604563	269.17518461696636	21/02/24 15:39:03
20	901	358.6818373206388	269.15130136461494	21/02/24 15:39:03
20	901	358.6602002434477	268.94445362863706	21/02/24 15:39:03
20	901	358.4981475810922	268.8521722051301	21/02/24 15:39:03
20	901	358.6518073377171	269.0475604624315	21/02/24 15:39:03
20	901	358.81346494028253	269.0263353492922	21/02/24 15:39:03
20	901	358.7328637761771	268.8800177004982	21/02/24 15:39:03
20	901	358.62936824966823	268.6004307732175	21/02/24 15:39:04
20	901	358.78224919067776	268.7562472413686	21/02/24 15:39:04
20	901	358.8837505358619	268.72171108795123	21/02/24 15:39:04
20	901	358.88694547591444	268.7232565862954	21/02/24 15:39:04
20	901	358.8562658341605	268.5954755387239	21/02/24 15:39:04
20	901	358.89144700102383	268.5355122832805	21/02/24 15:39:04
20	901	359.01090678119886	268.7526229822073	21/02/24 15:39:04
20	901	358.89295859443155	268.4853669003331	21/02/24 15:39:04
20	901	358.636192009211	268.5670775998686	21/02/24 15:39:04
20	901	358.34789315485483	268.56621861437077	21/02/24 15:39:05
20	901	358.46699023280365	268.5511655226119	21/02/24 15:39:05
20	901	358.3274923549124	268.47703214338213	21/02/24 15:39:05
20	901	358.2005298547294	268.27996117661314	21/02/24 15:39:05
20	901	358.2071783406722	268.2276304039939	21/02/24 15:39:05
20	901	358.3446477289036	268.40143988999023	21/02/24 15:39:05
20	901	358.6211251646618	268.4027126068874	21/02/24 15:39:05
20	901	358.46563190823457	268.3803892442819	21/02/24 15:39:05
20	901	358.44280698435836	268.4354318640785	21/02/24 15:39:05
20	901	358.4149113741113	268.45149785783497	21/02/24 15:39:05
20	901	358.18424653727834	268.35686860213394	21/02/24 15:39:06
20	901	358.4780406427594	268.40943650284555	21/02/24 15:39:06
20	901	358.57440827883835	268.4649784781133	21/02/24 15:39:06
20	901	358.6766590032127	268.48565917948343	21/02/24 15:39:06
20	901	358.70892115397754	268.59542294885017	21/02/24 15:39:06
20	901	358.908359746318	268.4679926539131	21/02/24 15:39:06
20	901	358.9579111102695	268.2634663432147	21/02/24 15:39:06
20	901	359.0016059757389	268.49270407996926	21/02/24 15:39:06
20	901	358.99922134890954	268.4760146693429	21/02/24 15:39:06
20	901	358.9067544064759	268.5330622040205	21/02/24 15:39:06
20	901	358.9428175249559	268.4917858610753	21/02/24 15:39:07
20	901	359.03514374197647	268.5663870417622	21/02/24 15:39:07
20	901	359.2124681804002	268.70000045479657	21/02/24 15:39:07
20	901	359.2645826842639	268.53880721187755	21/02/24 15:39:07
20	901	359.2991197369051	268.589098555794	21/02/24 15:39:07
20	901	359.3910194409218	268.6095726994892	21/02/24 15:39:07
20	901	359.2601406406952	268.5107125529478	21/02/24 15:39:07
20	901	359.3843324995605	268.61492275818813	21/02/24 15:39:07
20	901	359.3646390227837	268.6548390617492	21/02/24 15:39:07
20	901	359.36261631682436	268.65900883441014	21/02/24 15:39:08
20	901	359.3129841677497	268.89741104054946	21/02/24 15:39:08
20	901	359.355129055434	268.9047542734121	21/02/24 15:39:08
20	901	359.28945433406716	268.86651920438794	21/02/24 15:39:08
20	901	359.37145484189415	268.78286718142346	21/02/24 15:39:08
20	901	359.4394316661487	268.75528609409776	21/02/24 15:39:08
20	901	359.4677374788089	268.88741061035245	21/02/24 15:39:08
20	901	359.4445747524667	268.8581688554064	21/02/24 15:39:08
20	901	359.67626359363805	268.82426112325936	21/02/24 15:39:08
20	901	359.7584963248425	268.90262463592853	21/02/24 15:39:08
20	901	359.6726543126257	268.7683215141783	21/02/24 15:39:09
20	901	359.80686770226356	268.69754345666473	21/02/24 15:39:09
20	901	359.7526911011097	268.709166106259	21/02/24 15:39:09
20	901	359.9157325886851	268.7158239596037	21/02/24 15:39:09
20	901	359.895507170702	268.7635200893185	21/02/24 15:39:09
20	901	359.7941304233003	268.7808526363612	21/02/24 15:39:09
20	901	359.9407725319724	268.9840164539176	21/02/24 15:39:09
20	901	360.19460280909243	268.92402040650165	21/02/24 15:39:09
20	901	360.0649110495711	268.95793566402637	21/02/24 15:39:09
20	901	359.96066877214366	268.98210883848907	21/02/24 15:39:09
20	901	359.81925443614756	269.036691007112	21/02/24 15:39:10
20	901	359.8901199838831	269.00805211652334	21/02/24 15:39:10
20	901	359.7169863239975	269.12702105592354	21/02/24 15:39:10
20	901	359.7236091565119	269.17867555305315	21/02/24 15:39:10
20	901	359.66985763273266	269.189882446079	21/02/24 15:39:10
20	901	359.78874489619517	268.9565581067411	21/02/24 15:39:10
20	901	359.94364865328913	269.18790374483484	21/02/24 15:39:10
20	901	359.91992457179435	269.201804655989	21/02/24 15:39:10
20	901	360.0543114483784	269.08020622355747	21/02/24 15:39:10
20	901	360.0688541656052	269.0457382017714	21/02/24 15:39:11
20	901	360.0615344774736	269.0635891842735	21/02/24 15:39:11
20	901	360.1494017203826	269.3335872045858	21/02/24 15:39:11
20	901	360.3214222167032	269.2918186696021	21/02/24 15:39:11
20	901	360.2463103554074	269.3213321405125	21/02/24 15:39:11
20	901	360.20652047987306	269.2654338713344	21/02/24 15:39:11
20	901	360.1835335212531	269.1064371998628	21/02/24 15:39:11
20	901	360.18203708668267	269.0869211151985	21/02/24 15:39:11
20	901	360.1153996568455	269.2447242087697	21/02/24 15:39:11
20	901	360.088936601553	269.3037397926455	21/02/24 15:39:11
20	901	360.0637927503423	269.3174983826669	21/02/24 15:39:12
20	901	359.8374869013446	269.2771664611936	21/02/24 15:39:12
20	901	359.9641458249128	269.3302906249529	21/02/24 15:39:12
20	901	360.02720443639043	269.50334562822127	21/02/24 15:39:12
20	901	360.03038975971697	269.4817960269947	21/02/24 15:39:12
20	901	360.0409463994796	269.6467646601216	21/02/24 15:39:12
20	901	360.0762258618675	269.459210300805	21/02/24 15:39:12
20	901	360.2004626412812	269.3739445852322	21/02/24 15:39:12
20	901	360.3341394990116	269.38925726079776	21/02/24 15:39:12
20	901	360.3615560839283	269.3609205198127	21/02/24 15:39:12
20	901	360.359913730865	269.35575342554347	21/02/24 15:39:13
20	901	360.5321342447844	269.5603269441857	21/02/24 15:39:13
20	901	360.5676210962935	269.7067471449914	21/02/24 15:39:13
20	901	360.5521939632607	269.66724542372276	21/02/24 15:39:13
20	901	360.55019139308143	269.66913721030085	21/02/24 15:39:13
20	901	360.3284619650549	269.6521965679868	21/02/24 15:39:13
20	901	360.4128066480416	269.6129679713292	21/02/24 15:39:13
20	901	360.45398980448795	269.33082002087116	21/02/24 15:39:13
20	901	360.4749584571008	269.2994758159426	21/02/24 15:39:13
20	901	360.4773782561492	269.3035020943377	21/02/24 15:39:13
20	901	360.43057882963984	269.222551979451	21/02/24 15:39:14
20	901	360.3262492413169	269.2799250578321	21/02/24 15:39:14
20	901	360.51125349360825	269.45507851624006	21/02/24 15:39:14
20	901	360.2412617491777	269.40872625475055	21/02/24 15:39:14
20	901	360.3671860051727	269.4964862071565	21/02/24 15:39:14
20	901	360.3671860051727	269.4964862071565	21/02/24 15:39:14
20	901	360.3366723862332	269.45031665123753	21/02/24 15:39:14
20	901	360.1060790155953	269.4629238799202	21/02/24 15:39:14
20	901	360.1060790155953	269.4629238799202	21/02/24 15:39:14
20	901	360.2788494158227	269.36568927587723	21/02/24 15:39:15
20	901	360.4223048737922	269.21093530716394	21/02/24 15:39:15
20	901	360.4824462699999	269.25009923229885	21/02/24 15:39:15
20	901	360.4335246396842	269.3882937540073	21/02/24 15:39:15
20	901	360.5617858845879	269.5292413909763	21/02/24 15:39:15
20	901	360.39493605192183	269.5166911391863	21/02/24 15:39:15
20	901	360.3987199549957	269.6895567925776	21/02/24 15:39:15
20	901	360.23267316463176	269.87082480398954	21/02/24 15:39:15
20	901	360.22420406604857	269.8655489223231	21/02/24 15:39:15
20	901	360.24168148294524	269.8895244678536	21/02/24 15:39:15
20	901	360.12663427210055	269.9338620956283	21/02/24 15:39:16
20	901	360.0145555954079	270.1712532855199	21/02/24 15:39:16
20	901	360.06337907525165	270.00133517937275	21/02/24 15:39:16
20	901	359.9157242300254	269.9387843598103	21/02/24 15:39:16
20	901	359.9157242300254	269.9387843598103	21/02/24 15:39:16
20	901	359.9157242300254	269.9387843598103	21/02/24 15:39:16
20	901	359.91465149533235	269.9051385763561	21/02/24 15:39:16
20	901	359.994747977493	269.945598975447	21/02/24 15:39:16
20	901	360.1225702663714	270.18663102476955	21/02/24 15:39:16
20	901	360.03205965661675	270.07797283748766	21/02/24 15:39:16
20	901	360.05330455005	270.0599685545598	21/02/24 15:39:17
20	901	360.0686100876186	270.02557375032177	21/02/24 15:39:17
20	901	360.1259836694233	269.94117167135454	21/02/24 15:39:17
20	901	360.112894594981	270.00656648657133	21/02/24 15:39:17
20	901	360.15670250273695	270.05723680328856	21/02/24 15:39:17
20	901	360.2526441966391	269.9330546527899	21/02/24 15:39:17
20	901	359.99996373254936	270.00513852192523	21/02/24 15:39:17
20	901	359.75341007990045	269.9389502190945	21/02/24 15:39:17
20	901	359.6774525915724	270.2136451864488	21/02/24 15:39:17
20	901	359.863103493649	270.1417538344523	21/02/24 15:39:18
20	901	359.7507495675973	270.06520307741874	21/02/24 15:39:18
20	901	359.5798443986665	270.0573140204633	21/02/24 15:39:18
20	901	359.3049944760458	270.13778890485736	21/02/24 15:39:18
20	901	359.3013197130666	270.18038067265246	21/02/24 15:39:18
20	901	359.3101176399229	270.2433799158647	21/02/24 15:39:18
20	901	359.124464379936	270.21262966496386	21/02/24 15:39:18
20	901	359.0746705923496	270.4751621730742	21/02/24 15:39:18
20	901	359.01137059489224	270.40717111530273	21/02/24 15:39:18
20	901	358.8716816425602	270.5011266870436	21/02/24 15:39:18
20	901	358.9215714376006	270.48604246723903	21/02/24 15:39:19
20	901	358.9281659645373	270.43072798754514	21/02/24 15:39:19
20	901	358.9281659645373	270.43072798754514	21/02/24 15:39:19
20	901	358.96113828848326	270.69474731344076	21/02/24 15:39:19
20	901	358.96113828848326	270.69474731344076	21/02/24 15:39:19
20	901	358.96113828848326	270.69474731344076	21/02/24 15:39:19
