floorId	partitionId	location_x	location_y	timeStamp
3	51	308.18346015268696	279.09157025314767	20/04/28 05:16:10
3	51	308.08964067892595	279.1940401945182	20/04/28 05:16:10
3	51	308.1811358690041	279.2242953665176	20/04/28 05:16:10
3	51	308.0442084216948	278.988265289594	20/04/28 05:16:10
3	51	308.23514737421664	278.93250006645275	20/04/28 05:16:10
3	51	308.08591939932205	279.1004409504331	20/04/28 05:16:10
3	51	308.08591939932205	279.1004409504331	20/04/28 05:16:10
3	51	308.091755957822	278.88815541177655	20/04/28 05:16:10
3	51	308.0993262118883	278.89931289828513	20/04/28 05:16:11
3	51	308.2001556083342	278.8465252112519	20/04/28 05:16:11
3	51	308.2704239670574	279.0004556646535	20/04/28 05:16:11
3	51	308.2405157085057	278.95630000179403	20/04/28 05:16:11
3	51	308.2776583107872	278.92979782628294	20/04/28 05:16:11
3	51	308.2776583107872	278.92979782628294	20/04/28 05:16:11
3	51	308.2140593701946	278.71020566925466	20/04/28 05:16:11
3	51	308.3660365309845	278.8916589872267	20/04/28 05:16:11
3	51	308.2734049556003	278.9739088876683	20/04/28 05:16:11
3	51	308.2734049556003	278.9739088876683	20/04/28 05:16:11
3	51	308.2812835670903	278.93793955141797	20/04/28 05:16:12
3	51	308.11328881090725	278.69855163139596	20/04/28 05:16:12
3	51	308.11328881090725	278.69855163139596	20/04/28 05:16:12
3	51	308.0670101250338	278.5998183647138	20/04/28 05:16:12
3	51	308.07579651268844	278.6136445624869	20/04/28 05:16:12
3	51	308.07579651268844	278.6136445624869	20/04/28 05:16:12
3	51	308.0909727903867	278.6543792460377	20/04/28 05:16:12
3	51	308.14487626851854	278.6763983276213	20/04/28 05:16:12
3	51	307.9150254378206	278.78344159582224	20/04/28 05:16:12
3	51	307.8768915570251	278.7844395058976	20/04/28 05:16:12
3	51	307.973917643606	278.65841610404095	20/04/28 05:16:13
3	51	308.13219730381974	278.740582626532	20/04/28 05:16:13
3	51	308.3772601839656	278.59237197562356	20/04/28 05:16:13
3	51	308.43201535215434	278.8203659101799	20/04/28 05:16:13
3	51	308.5616085102036	279.0391929900964	20/04/28 05:16:13
3	51	308.5527754052436	279.09729226028844	20/04/28 05:16:13
3	51	308.4994202255332	279.0565061967991	20/04/28 05:16:13
3	51	308.2302742367189	279.0096747711682	20/04/28 05:16:13
3	51	308.3600062652285	279.04704426874224	20/04/28 05:16:13
3	51	308.47752806980486	278.7965398144441	20/04/28 05:16:14
3	51	308.47752806980486	278.7965398144441	20/04/28 05:16:14
3	51	308.149942983159	278.90965149990944	20/04/28 05:16:14
3	51	308.1340064080264	278.9189862996416	20/04/28 05:16:14
3	51	308.2452888717441	278.80502802629354	20/04/28 05:16:14
3	51	308.1990086662569	278.6676854293764	20/04/28 05:16:14
3	51	308.2813240603639	278.708195516036	20/04/28 05:16:14
3	51	308.2813240603639	278.708195516036	20/04/28 05:16:14
3	51	308.29695292923833	278.8851953313762	20/04/28 05:16:14
3	51	308.23431385626793	278.887069029575	20/04/28 05:16:14
3	51	308.21111300608953	278.7817308566322	20/04/28 05:16:15
3	51	308.1712469049513	278.71644497285	20/04/28 05:16:15
3	51	308.17257310669737	278.75820270372685	20/04/28 05:16:15
3	51	307.9560015899106	278.87288606838143	20/04/28 05:16:15
3	51	308.0016521269418	278.61205448056	20/04/28 05:16:15
3	51	308.04658873696565	278.60375429169005	20/04/28 05:16:15
3	51	308.0681664419918	278.53479959475874	20/04/28 05:16:15
3	51	308.08773481677287	278.4077566699659	20/04/28 05:16:15
3	51	308.254147517206	278.64657056098383	20/04/28 05:16:15
3	51	308.474005678387	278.6833517948461	20/04/28 05:16:15
3	51	308.474005678387	278.6833517948461	20/04/28 05:16:16
3	51	308.46719868535973	278.71079278067117	20/04/28 05:16:16
3	51	308.33688783532995	278.5260664065834	20/04/28 05:16:16
3	51	308.1858012362505	278.5635848492073	20/04/28 05:16:16
3	51	308.2310975646038	278.56805364889	20/04/28 05:16:16
3	51	308.1315672542728	278.69467264278074	20/04/28 05:16:16
3	51	308.17269842081964	278.4002917741445	20/04/28 05:16:16
3	51	308.18409576662253	278.57391566260327	20/04/28 05:16:16
3	51	308.1097860197531	278.42877701737837	20/04/28 05:16:16
3	51	308.0453293021187	278.43526213882166	20/04/28 05:16:17
3	51	308.38955301331094	278.4921631400684	20/04/28 05:16:17
3	51	308.12039779861317	278.4000408205251	20/04/28 05:16:17
3	51	308.1677242675853	278.4994440688736	20/04/28 05:16:17
3	51	308.0554723816669	278.6409433920239	20/04/28 05:16:17
3	51	308.0554723816669	278.6409433920239	20/04/28 05:16:17
3	51	308.40030434243437	278.44255319960365	20/04/28 05:16:17
3	51	308.40030434243437	278.44255319960365	20/04/28 05:16:17
3	51	308.28771753488655	278.38532087728765	20/04/28 05:16:17
3	51	308.44456470347643	278.3349298998351	20/04/28 05:16:17
3	51	308.4840482324239	278.38340978956785	20/04/28 05:16:18
3	51	308.25872295658155	278.1948905899743	20/04/28 05:16:18
3	51	308.19767724441294	278.0941857563738	20/04/28 05:16:18
3	51	308.1526732974435	278.1551107447262	20/04/28 05:16:18
3	51	308.1297687023786	278.1564937517777	20/04/28 05:16:18
3	51	308.01959146384473	278.40268131963353	20/04/28 05:16:18
3	51	307.96778197790417	278.40450240576877	20/04/28 05:16:18
3	51	308.021946778196	278.4306806557571	20/04/28 05:16:18
3	51	308.00455259043054	278.2942909417852	20/04/28 05:16:18
3	51	307.8592745278488	278.2861587723785	20/04/28 05:16:18
3	51	307.76803288550815	278.18017372236494	20/04/28 05:16:19
3	51	307.7760206016775	278.1918112601521	20/04/28 05:16:19
3	51	307.8030871723959	278.0380864865567	20/04/28 05:16:19
3	51	308.0026766148067	277.9568115737673	20/04/28 05:16:19
3	51	307.88277167770093	278.21695383972303	20/04/28 05:16:19
3	51	307.6590629547657	278.26112907288615	20/04/28 05:16:19
3	51	307.9362713338908	278.3068601500044	20/04/28 05:16:19
3	51	307.7624734866241	278.32258975134334	20/04/28 05:16:19
3	51	307.9380352539053	278.4076755865347	20/04/28 05:16:19
3	51	307.80075886202974	278.46900349652327	20/04/28 05:16:20
3	51	307.6968717711214	278.7368439997626	20/04/28 05:16:20
3	51	307.7090796276665	278.78454317621964	20/04/28 05:16:20
3	51	307.6412235943222	278.845368328038	20/04/28 05:16:20
3	51	307.70643385252777	279.067135334303	20/04/28 05:16:20
3	51	307.7617988649663	279.05687112677595	20/04/28 05:16:20
3	51	307.87212154124063	279.23043281305286	20/04/28 05:16:20
3	51	308.12378691774984	279.3332278695175	20/04/28 05:16:20
3	51	308.3997377804937	279.2556077029604	20/04/28 05:16:20
3	51	308.43560668507683	279.18440631787803	20/04/28 05:16:20
3	51	308.628642584108	279.1724867989814	20/04/28 05:16:21
3	51	308.5625517808838	279.19018565547293	20/04/28 05:16:21
3	51	308.53062857677713	279.0649518794258	20/04/28 05:16:21
3	51	308.8102123138853	278.96066564832563	20/04/28 05:16:21
3	51	309.04469630410847	278.8279426233333	20/04/28 05:16:21
3	51	309.0450202741783	278.948855095137	20/04/28 05:16:21
3	51	308.9566857003349	279.1488703182401	20/04/28 05:16:21
3	51	309.18690488601106	279.23020160355696	20/04/28 05:16:21
3	51	309.2440802866002	279.1665269966149	20/04/28 05:16:21
3	51	309.1515401096974	279.1510900898165	20/04/28 05:16:21
3	51	309.0486044027789	279.2159166169741	20/04/28 05:16:22
3	51	308.85203931655934	279.15659614760904	20/04/28 05:16:22
3	51	308.83088987330206	279.09414140620964	20/04/28 05:16:22
3	51	308.8178267571039	279.14187862412695	20/04/28 05:16:22
3	51	308.9212399341925	278.9875974562064	20/04/28 05:16:22
3	51	308.7607096309204	279.16065172234073	20/04/28 05:16:22
3	51	308.6565311411837	279.1102840628226	20/04/28 05:16:22
3	51	308.72037612330763	279.08580968653246	20/04/28 05:16:22
3	51	308.86657059268316	279.1164945078954	20/04/28 05:16:22
3	51	308.61497378839	279.0611692338186	20/04/28 05:16:23
3	51	308.3507944021027	279.0363010437232	20/04/28 05:16:23
3	51	308.3309068773975	278.92616234035984	20/04/28 05:16:23
3	51	308.36392510201136	278.809113058606	20/04/28 05:16:23
3	51	308.3630893453088	278.88255299231923	20/04/28 05:16:23
3	51	308.28273340960567	279.1506493349272	20/04/28 05:16:23
3	51	308.0236402072925	279.19121903192047	20/04/28 05:16:23
3	51	308.13552550229707	279.01955191873924	20/04/28 05:16:23
3	51	308.1289202175417	278.9904769159907	20/04/28 05:16:23
3	51	308.22804560285346	278.987732908485	20/04/28 05:16:23
3	51	308.2359491778259	279.0308706509148	20/04/28 05:16:24
3	51	308.19168111858176	279.3002985159165	20/04/28 05:16:24
3	51	308.1689719305325	279.3914318606514	20/04/28 05:16:24
3	51	308.3622409218097	279.5546080861828	20/04/28 05:16:24
3	51	308.3502753607194	279.61091211328585	20/04/28 05:16:24
3	51	308.40424817860605	279.52670933242837	20/04/28 05:16:24
3	51	308.3168464317659	279.435788291061	20/04/28 05:16:24
3	51	308.59431427690055	279.4068881813343	20/04/28 05:16:24
3	51	308.88797163592596	279.3578409587126	20/04/28 05:16:24
3	51	308.65816235476433	279.3959157671589	20/04/28 05:16:24
3	51	308.7742152598375	279.63703155391534	20/04/28 05:16:25
3	51	309.0286690453628	279.521712292833	20/04/28 05:16:25
3	51	308.7771156661737	279.4540269251555	20/04/28 05:16:25
3	51	308.792771755394	279.3150669527136	20/04/28 05:16:25
3	51	308.8180872366648	279.02474822071196	20/04/28 05:16:25
3	51	308.9655680249378	279.0677732437259	20/04/28 05:16:25
3	51	308.8194802781786	279.0291097362102	20/04/28 05:16:25
3	51	308.7808126767145	279.04297597760484	20/04/28 05:16:25
3	51	308.98073283815796	278.84154925046334	20/04/28 05:16:25
3	51	308.803870123165	278.78733911116717	20/04/28 05:16:26
3	51	308.73301111484534	278.8325661485041	20/04/28 05:16:26
3	51	308.5659604705511	278.9446960218744	20/04/28 05:16:26
3	51	308.66557701489893	278.9623451777614	20/04/28 05:16:26
3	51	308.6266465284227	278.93227000084244	20/04/28 05:16:26
3	51	308.6600071392573	279.1211173570093	20/04/28 05:16:26
3	51	308.70909427061366	279.15270676310865	20/04/28 05:16:26
3	51	308.72621872724227	279.1928700763665	20/04/28 05:16:26
3	51	308.6146839946278	279.21043022860243	20/04/28 05:16:26
3	51	308.6930817890496	279.2136577994031	20/04/28 05:16:26
3	51	308.59665199623686	279.0538576242086	20/04/28 05:16:27
3	51	308.5630841486316	278.8134765624485	20/04/28 05:16:27
3	51	308.5895223100364	279.06658966317156	20/04/28 05:16:27
3	51	308.5597699681641	279.2194433282772	20/04/28 05:16:27
3	51	308.5735000556153	279.1659638328751	20/04/28 05:16:27
3	51	308.65034085654435	279.2118033703528	20/04/28 05:16:27
3	51	308.5100036407548	279.01670965303737	20/04/28 05:16:27
3	51	308.4202495673078	279.14842409074015	20/04/28 05:16:27
3	51	308.386756424071	279.2368071442796	20/04/28 05:16:27
3	51	308.3323153382349	279.4372040674935	20/04/28 05:16:27
3	51	308.4410366470748	279.43939988124623	20/04/28 05:16:28
3	51	308.5468761242542	279.4981774690873	20/04/28 05:16:28
3	51	308.3136181845231	279.34182984776385	20/04/28 05:16:28
3	51	308.3398599694904	279.31036284778605	20/04/28 05:16:28
3	51	308.3704518570505	279.0698440550327	20/04/28 05:16:28
3	51	308.4542578877498	278.8229419287515	20/04/28 05:16:28
3	51	308.4511234703642	278.96741969681204	20/04/28 05:16:28
3	51	308.4552983527363	278.9333111884897	20/04/28 05:16:28
3	51	308.449559387252	278.91943403550266	20/04/28 05:16:28
3	51	308.6677389029098	279.04506329443797	20/04/28 05:16:28
3	51	308.71410820422017	278.806132135157	20/04/28 05:16:29
3	51	308.7648382746513	278.8957410858875	20/04/28 05:16:29
3	51	308.78317100869407	278.80660748230724	20/04/28 05:16:29
3	51	308.57273646618444	278.7888531432638	20/04/28 05:16:29
3	51	308.45849337149576	278.7564412444546	20/04/28 05:16:29
3	51	308.24143163268315	278.70688591414466	20/04/28 05:16:29
3	51	308.2286025313161	278.65754431843726	20/04/28 05:16:29
3	51	308.1780727426063	278.92873872887685	20/04/28 05:16:29
3	51	308.1787714500424	278.9328744101517	20/04/28 05:16:29
3	51	308.1787714500424	278.9328744101517	20/04/28 05:16:30
3	51	308.01358728502555	279.1308923928207	20/04/28 05:16:30
3	51	308.102839659658	278.95144361575046	20/04/28 05:16:30
3	51	308.0838290203028	278.9245899181697	20/04/28 05:16:30
3	51	308.07689610087755	278.80393031463905	20/04/28 05:16:30
3	51	308.1076951965486	278.55611084754014	20/04/28 05:16:30
3	51	308.32606073626886	278.4212622683611	20/04/28 05:16:30
3	51	308.3450317511143	278.374604392242	20/04/28 05:16:30
3	51	308.28090132051716	278.3854139900771	20/04/28 05:16:30
3	51	308.2455651399957	278.2559989556408	20/04/28 05:16:30
3	51	308.0464218930822	278.41716892918987	20/04/28 05:16:31
3	51	308.0306550779405	278.4493477553133	20/04/28 05:16:31
3	51	308.15146408844464	278.543966693763	20/04/28 05:16:31
3	51	308.2208334717339	278.50305496599196	20/04/28 05:16:31
3	51	308.4405230014086	278.31961303424447	20/04/28 05:16:31
3	51	308.4162326788431	278.30662668429267	20/04/28 05:16:31
3	51	308.36865388444477	278.2778943806528	20/04/28 05:16:31
3	51	308.47016489459617	278.17633894887524	20/04/28 05:16:31
3	51	308.38615387500283	278.25572497697	20/04/28 05:16:31
3	51	308.670745862327	278.3459157758377	20/04/28 05:16:32
3	51	308.6715464288437	278.34296846566036	20/04/28 05:16:32
3	51	308.69209717939805	278.4081850126223	20/04/28 05:16:32
3	51	308.6897250017244	278.388532120965	20/04/28 05:16:32
3	51	308.8472427746161	278.5940768132925	20/04/28 05:16:32
3	51	308.8615023636609	278.6676997430648	20/04/28 05:16:32
3	51	308.86630192094293	278.7979803713021	20/04/28 05:16:32
3	51	309.15611585523305	278.8159123939941	20/04/28 05:16:32
3	51	308.96240596857245	278.8226892168608	20/04/28 05:16:32
3	51	309.25166884911044	278.77283707637764	20/04/28 05:16:32
3	51	309.29166089990713	279.05473629051005	20/04/28 05:16:33
3	51	309.279449930873	279.2173700833402	20/04/28 05:16:33
3	51	309.2766473805853	279.2234156714824	20/04/28 05:16:33
3	51	309.0935513882096	279.09650734484575	20/04/28 05:16:33
3	51	309.02059250637825	279.37066510753704	20/04/28 05:16:33
3	51	309.16965389348553	279.319960256529	20/04/28 05:16:33
3	51	309.3466817483227	279.48440803694285	20/04/28 05:16:33
3	51	309.5490834755875	279.4123130516337	20/04/28 05:16:33
3	51	309.544611521227	279.4149953016938	20/04/28 05:16:33
3	51	309.522549342989	279.4226028160343	20/04/28 05:16:33
3	51	309.77253078990134	279.4333721705302	20/04/28 05:16:34
3	51	309.8092032397382	279.19348525771915	20/04/28 05:16:34
3	51	309.9023917245842	279.34866062909765	20/04/28 05:16:34
3	51	309.96831899472994	279.2999030744266	20/04/28 05:16:34
3	51	309.9663168073418	279.2497005876621	20/04/28 05:16:34
3	51	309.98707852118315	279.3634355821729	20/04/28 05:16:34
3	51	310.13163398556605	279.49187012471157	20/04/28 05:16:34
3	51	310.2324087597503	279.45979157036885	20/04/28 05:16:34
3	51	310.04601829698623	279.42091239664444	20/04/28 05:16:34
3	51	309.9403341435781	279.39122276992936	20/04/28 05:16:35
3	51	310.0564326846809	279.6034511062095	20/04/28 05:16:35
3	51	310.2316551686393	279.47944113062636	20/04/28 05:16:35
3	51	310.0814029009625	279.46082648469877	20/04/28 05:16:35
3	51	310.0565924432666	279.27083272156045	20/04/28 05:16:35
3	51	310.2482201288214	279.20538261581856	20/04/28 05:16:35
3	51	310.0693105680706	279.2722122721469	20/04/28 05:16:35
3	51	310.1037161845204	279.3494798900527	20/04/28 05:16:35
3	51	310.29027467820623	279.3888627336433	20/04/28 05:16:35
3	51	310.28529559179833	279.38926104693934	20/04/28 05:16:35
3	51	310.43938025409375	279.40266336655617	20/04/28 05:16:36
3	51	310.46681646562155	279.4239157641227	20/04/28 05:16:36
3	51	310.57359430500037	279.44853418450845	20/04/28 05:16:36
3	51	310.5165185447859	279.18762504551074	20/04/28 05:16:36
3	51	310.5133851862635	279.16466871778744	20/04/28 05:16:36
3	51	310.5133851862635	279.16466871778744	20/04/28 05:16:36
3	51	310.5133851862635	279.16466871778744	20/04/28 05:16:36
3	51	310.46534989378796	278.9771179574553	20/04/28 05:16:36
3	51	310.644559420422	278.9325087866883	20/04/28 05:16:36
3	51	310.75008662116545	278.82933604245136	20/04/28 05:16:36
3	51	310.7348539406098	278.874475693593	20/04/28 05:16:37
3	51	310.72516604735046	278.87663870495334	20/04/28 05:16:37
3	51	310.6683466656585	279.07144068265796	20/04/28 05:16:37
3	51	310.5798903971803	279.27703212710674	20/04/28 05:16:37
3	51	310.65287072885087	279.22046304172443	20/04/28 05:16:37
3	51	310.6104605076806	279.43454886382955	20/04/28 05:16:37
3	51	310.4845153111647	279.52266553425613	20/04/28 05:16:37
3	51	310.68100147453094	279.3996907411903	20/04/28 05:16:37
3	51	310.8943700668762	279.39480387147125	20/04/28 05:16:37
3	51	310.8778102040924	279.19809658592635	20/04/28 05:16:38
3	51	310.7665802301601	279.1734869659665	20/04/28 05:16:38
3	51	310.6893680288608	279.22514102383167	20/04/28 05:16:38
3	51	310.6823448865889	278.9675887172262	20/04/28 05:16:38
3	51	310.68338369401727	279.0126928259524	20/04/28 05:16:38
3	51	310.69122006592943	279.02274021142847	20/04/28 05:16:38
3	51	310.4939682502642	279.1346391393389	20/04/28 05:16:38
3	51	310.53982455667153	279.0406556707263	20/04/28 05:16:38
3	51	310.4082234565762	278.78011723040123	20/04/28 05:16:38
3	51	310.3306415083061	278.843663621249	20/04/28 05:16:38
3	51	310.5942883330642	278.87066212505664	20/04/28 05:16:39
3	51	310.62708802092027	278.6726236894737	20/04/28 05:16:39
3	51	310.6673031270837	278.68808395071176	20/04/28 05:16:39
3	51	310.90716985587494	278.6882795218701	20/04/28 05:16:39
3	51	311.07051058055913	278.69810903434495	20/04/28 05:16:39
3	51	310.97399027854755	278.77481477055915	20/04/28 05:16:39
3	51	311.0612697361429	278.87237724768534	20/04/28 05:16:39
3	51	311.11282048163156	278.87110820953814	20/04/28 05:16:39
3	51	311.21031133984286	278.8295020751586	20/04/28 05:16:39
3	51	311.3860379285219	278.78896569512256	20/04/28 05:16:39
3	51	311.4940467313929	279.0108616641024	20/04/28 05:16:40
3	51	311.50699080714253	278.805665767511	20/04/28 05:16:40
3	51	311.41615903302596	278.68092294356506	20/04/28 05:16:40
3	51	311.52145020562057	278.69569966135737	20/04/28 05:16:40
3	51	311.5218316451054	278.69399718550267	20/04/28 05:16:40
3	51	311.5961184399551	278.629898776844	20/04/28 05:16:40
3	51	311.6362235852743	278.62761423753125	20/04/28 05:16:40
3	51	311.45777251743783	278.73125912699453	20/04/28 05:16:40
3	51	311.5522687931013	278.78477423470207	20/04/28 05:16:40
3	51	311.55341519226994	278.7836451499032	20/04/28 05:16:41
3	51	311.5917742753947	278.7787285849719	20/04/28 05:16:41
3	51	311.84011554315606	278.6795703692138	20/04/28 05:16:41
3	51	311.97871638269726	278.5219284953436	20/04/28 05:16:41
3	51	311.8494233701558	278.645750677968	20/04/28 05:16:41
3	51	311.93445446043194	278.586740865348	20/04/28 05:16:41
3	51	312.0259884004616	278.50265431703514	20/04/28 05:16:41
3	51	311.9754558773495	278.6942356464396	20/04/28 05:16:41
3	51	311.9383649031033	278.75160684871497	20/04/28 05:16:41
3	51	311.9839321468334	279.04559608073095	20/04/28 05:16:41
3	51	312.1541474881025	279.1951864920807	20/04/28 05:16:42
3	51	312.40249281251073	279.13517441722814	20/04/28 05:16:42
3	51	312.4825608307703	278.87456147444954	20/04/28 05:16:42
3	51	312.50976233913775	278.74660877498405	20/04/28 05:16:42
3	51	312.5026727304043	278.85693050438033	20/04/28 05:16:42
3	51	312.3062923851068	279.063902687068	20/04/28 05:16:42
3	51	312.38361251786444	279.0011357372316	20/04/28 05:16:42
3	51	312.38339342666126	279.00419289980584	20/04/28 05:16:42
3	51	312.1276080180272	278.8552969878955	20/04/28 05:16:42
3	51	312.08683350366005	278.7855529903856	20/04/28 05:16:42
3	51	311.9975909027542	278.98196432246965	20/04/28 05:16:43
3	51	311.86365044728535	279.10476069086525	20/04/28 05:16:43
3	51	311.8004675202008	278.88231152413357	20/04/28 05:16:43
3	51	312.0364928345439	279.05673063077245	20/04/28 05:16:43
3	51	312.0253537832627	279.0641205324152	20/04/28 05:16:43
3	51	311.78030460931666	279.0925210667341	20/04/28 05:16:43
3	51	311.6854280327325	279.1830235588112	20/04/28 05:16:43
3	51	311.62799939528264	279.14534508846015	20/04/28 05:16:43
3	51	311.5727066947574	279.1667205707988	20/04/28 05:16:43
3	51	311.6989216383302	279.0183715600965	20/04/28 05:16:44
3	51	311.5666258450485	279.1631740722085	20/04/28 05:16:44
3	51	311.55475069616716	278.99658594125765	20/04/28 05:16:44
3	51	311.5780105373064	278.9378380641949	20/04/28 05:16:44
3	51	311.49948673796223	278.9861409714976	20/04/28 05:16:44
3	51	311.5710759501768	278.85034109254804	20/04/28 05:16:44
3	51	311.4804778092262	278.76291520935087	20/04/28 05:16:44
3	51	311.44547614471566	278.96485660334156	20/04/28 05:16:44
3	51	311.45954990086534	279.0581991880703	20/04/28 05:16:44
3	51	311.65135192117276	278.8335682713959	20/04/28 05:16:44
3	51	311.43119333407833	278.9610191876397	20/04/28 05:16:45
3	51	311.51055300384456	278.980629620851	20/04/28 05:16:45
3	51	311.4628322826621	278.94285565080344	20/04/28 05:16:45
3	51	311.18153264301077	278.8881112048624	20/04/28 05:16:45
3	51	311.43039449763364	278.80604872714986	20/04/28 05:16:45
3	51	311.331126517222	278.8475675892626	20/04/28 05:16:45
3	51	311.32495298760415	278.6726469616027	20/04/28 05:16:45
3	51	311.3253872482622	278.58934903971425	20/04/28 05:16:45
3	51	311.2225646935188	278.4461194262054	20/04/28 05:16:45
3	51	311.1421171046777	278.4258161116112	20/04/28 05:16:45
3	51	311.3048484471544	278.29274414295855	20/04/28 05:16:46
3	51	311.34344128338256	278.439618777901	20/04/28 05:16:46
3	51	311.1767753735399	278.6752944067728	20/04/28 05:16:46
3	51	311.12615056341434	278.48728373776987	20/04/28 05:16:46
3	51	311.1161674150668	278.2397456981713	20/04/28 05:16:46
3	51	310.8300877365016	278.1756167712858	20/04/28 05:16:46
3	51	310.79616120864415	278.141964003716	20/04/28 05:16:46
3	51	310.88733934390365	278.19731596297584	20/04/28 05:16:46
3	51	310.67942230654813	278.09316202440596	20/04/28 05:16:46
3	51	310.6248692419878	278.1623207680776	20/04/28 05:16:47
3	51	310.72534339430825	278.21580195157964	20/04/28 05:16:47
3	51	310.781020374235	277.95180119812153	20/04/28 05:16:47
3	51	310.79689407002104	277.9430687669996	20/04/28 05:16:47
3	51	310.72529353834244	277.8048781422602	20/04/28 05:16:47
3	51	310.71231538486666	277.82159514597583	20/04/28 05:16:47
3	51	310.75123078576496	277.8063215457177	20/04/28 05:16:47
3	51	310.7027024581676	277.78405067053296	20/04/28 05:16:47
3	51	310.8771928144638	277.80510621081754	20/04/28 05:16:47
3	51	310.8866733026263	277.79155359273045	20/04/28 05:16:47
3	51	310.8356361878673	277.86135873945665	20/04/28 05:16:48
3	51	310.96553695295967	277.646589572944	20/04/28 05:16:48
3	51	310.91833320211714	277.72067187250076	20/04/28 05:16:48
3	51	310.8547292959167	277.74625148259645	20/04/28 05:16:48
3	51	311.10867363350775	277.60599065206645	20/04/28 05:16:48
3	51	311.2993671723136	277.5869800816266	20/04/28 05:16:48
3	51	311.21007146051875	277.356025397256	20/04/28 05:16:48
3	51	311.2501810116082	277.572468269661	20/04/28 05:16:48
3	51	311.0008956665247	277.427523133215	20/04/28 05:16:48
3	51	311.0327279922403	277.62165262596375	20/04/28 05:16:48
3	51	311.14941109680376	277.8662165589247	20/04/28 05:16:49
3	51	311.17515269670673	277.8412343381649	20/04/28 05:16:49
3	51	310.9339299098891	277.8018669985887	20/04/28 05:16:49
3	51	311.00794615210265	278.01136927369015	20/04/28 05:16:49
3	51	311.0084547729123	278.1040602057708	20/04/28 05:16:49
3	51	311.0871954745082	278.0203899715864	20/04/28 05:16:49
3	51	311.04050371105416	278.0336031717326	20/04/28 05:16:49
3	51	311.04450256566025	278.1748769183143	20/04/28 05:16:49
3	51	311.20833810527256	278.31226917779435	20/04/28 05:16:49
3	51	311.21185565434007	278.3180874074093	20/04/28 05:16:49
3	51	311.41107673399904	278.3585955638501	20/04/28 05:16:50
3	51	311.5632550205438	278.21264709912566	20/04/28 05:16:50
3	51	311.5622080626529	278.19235730248255	20/04/28 05:16:50
3	51	311.55759820665736	278.2216196271295	20/04/28 05:16:50
3	51	311.5976860918399	278.13471753898114	20/04/28 05:16:50
3	51	311.35845832698067	277.96471374417723	20/04/28 05:16:50
3	51	311.5496290341857	278.1175930628468	20/04/28 05:16:50
3	51	311.7533636904027	278.13273346823337	20/04/28 05:16:50
3	51	311.7714004647391	277.9313074967724	20/04/28 05:16:50
3	51	311.55266205051726	277.901873538305	20/04/28 05:16:51
3	51	311.319909573695	278.06533025907254	20/04/28 05:16:51
3	51	311.44465988525775	278.30591184054225	20/04/28 05:16:51
3	51	311.44465988525775	278.30591184054225	20/04/28 05:16:51
3	51	311.44465988525775	278.30591184054225	20/04/28 05:16:51
3	51	311.47932056329654	278.41003593186053	20/04/28 05:16:51
3	51	311.3353067044909	278.4350006795395	20/04/28 05:16:51
3	51	311.0639560892387	278.4855068860706	20/04/28 05:16:51
3	51	310.8727712958698	278.44656752553135	20/04/28 05:16:51
3	51	310.67622324724226	278.52435255910603	20/04/28 05:16:51
3	51	310.431306045273	278.47515613382575	20/04/28 05:16:52
3	51	310.3257461801431	278.25906678123715	20/04/28 05:16:52
3	51	310.3135684095017	278.09740034861767	20/04/28 05:16:52
3	51	310.3900202259679	277.8340573413925	20/04/28 05:16:52
3	51	310.4303054715336	277.5458433370498	20/04/28 05:16:52
3	51	310.5929941748505	277.7809163819842	20/04/28 05:16:52
3	51	310.668892486436	277.49552012825524	20/04/28 05:16:52
3	51	310.70061780901443	277.40994895256796	20/04/28 05:16:52
3	51	310.5735193889158	277.47427664204355	20/04/28 05:16:52
3	51	310.82644245196394	277.46097415372634	20/04/28 05:16:52
3	51	310.86458773443223	277.37685677575206	20/04/28 05:16:53
3	51	310.8656210119399	277.3335750294064	20/04/28 05:16:53
3	51	310.8656210119399	277.3335750294064	20/04/28 05:16:53
3	51	310.8656210119399	277.3335750294064	20/04/28 05:16:53
3	51	310.87268227164407	277.33501391634655	20/04/28 05:16:53
3	51	310.68164416457006	277.30242164150496	20/04/28 05:16:53
3	51	310.6769495986166	277.352956675686	20/04/28 05:16:53
3	51	310.66693915914664	277.53179218602673	20/04/28 05:16:53
3	51	310.8190227213366	277.7506612032535	20/04/28 05:16:53
3	51	310.9823776482036	277.5154728004704	20/04/28 05:16:54
3	51	311.0106047509862	277.68888107446276	20/04/28 05:16:54
3	51	311.1061662061153	277.4696300101084	20/04/28 05:16:54
3	51	310.847866677532	277.5038932242268	20/04/28 05:16:54
3	51	310.78364734480283	277.51614345604827	20/04/28 05:16:54
3	51	310.74598952834475	277.5155839778436	20/04/28 05:16:54
3	51	310.8609461219959	277.7685412390537	20/04/28 05:16:54
3	51	310.81023145260275	277.9066119079284	20/04/28 05:16:54
3	51	310.9326286165748	277.94300954024163	20/04/28 05:16:54
3	51	310.6693399423374	277.96310948964816	20/04/28 05:16:54
3	51	310.4460168969476	277.9757362606142	20/04/28 05:16:55
3	51	310.5639754971844	277.9572332288428	20/04/28 05:16:55
3	51	310.5795830114335	277.96553303081714	20/04/28 05:16:55
3	51	310.44474078091116	277.9088991539189	20/04/28 05:16:55
3	51	310.4206796225562	277.69684091517024	20/04/28 05:16:55
3	51	310.47492312366825	277.71073095745317	20/04/28 05:16:55
3	51	310.4784729931919	277.69932493205147	20/04/28 05:16:55
3	51	310.6054864351468	277.5366545255204	20/04/28 05:16:55
3	51	310.38529071835916	277.67371615003947	20/04/28 05:16:55
3	51	310.2279051329328	277.5948217200004	20/04/28 05:16:55
3	51	310.21403088817283	277.5044126756344	20/04/28 05:16:56
3	51	310.3260052348771	277.25753650987303	20/04/28 05:16:56
3	51	310.29317400467215	277.2201420101473	20/04/28 05:16:56
3	51	310.322018916663	277.1885653668144	20/04/28 05:16:56
3	51	310.27411409945637	277.3181737525376	20/04/28 05:16:56
3	51	310.27347411858204	277.31182969202484	20/04/28 05:16:56
3	51	310.52819950553817	277.328170837816	20/04/28 05:16:56
3	51	310.59597816944864	277.5688386852578	20/04/28 05:16:56
3	51	310.75165461094576	277.49839760249654	20/04/28 05:16:56
3	51	310.58023948878474	277.7160650805494	20/04/28 05:16:56
3	51	310.71646130263804	277.4572224808931	20/04/28 05:16:57
3	51	310.66820022941135	277.46077825637997	20/04/28 05:16:57
3	51	310.67302253320565	277.4752550014146	20/04/28 05:16:57
3	51	310.6989004446708	277.51495646535494	20/04/28 05:16:57
3	51	310.6063742438313	277.3741412460076	20/04/28 05:16:57
3	51	310.6099006209767	277.36937828157676	20/04/28 05:16:57
3	51	310.7882728399399	277.198015312872	20/04/28 05:16:57
3	51	310.5921862657743	277.19241927597506	20/04/28 05:16:57
3	51	310.58820761820095	277.2241008268384	20/04/28 05:16:57
3	51	310.6114743132243	277.06088030127955	20/04/28 05:16:58
3	51	310.61601270254937	277.0628410803644	20/04/28 05:16:58
3	51	310.82626937689713	276.9653440612585	20/04/28 05:16:58
3	51	311.0759271628483	276.9112089858311	20/04/28 05:16:58
3	51	311.12172019514674	277.1297717924733	20/04/28 05:16:58
3	51	311.1140128488286	276.9388907033455	20/04/28 05:16:58
3	51	310.92498191868225	276.9352085923798	20/04/28 05:16:58
3	51	311.0122491842869	276.71640965049795	20/04/28 05:16:58
3	51	311.1052116427375	276.7366909646208	20/04/28 05:16:58
3	51	310.98176399335136	276.7267959258149	20/04/28 05:16:58
3	51	311.0277698732982	276.73039838633497	20/04/28 05:16:59
3	51	310.873769799093	276.7232913997041	20/04/28 05:16:59
3	51	310.90354417767134	276.80899632074903	20/04/28 05:16:59
3	51	310.93810937483573	276.7891095249494	20/04/28 05:16:59
3	51	311.2030783504488	276.65900651803724	20/04/28 05:16:59
3	51	310.9114786136978	276.7051919209327	20/04/28 05:16:59
3	51	310.71961037786815	276.68946360440975	20/04/28 05:16:59
3	51	310.5831231298037	276.83668519899015	20/04/28 05:16:59
3	51	310.42483660466524	277.0602350542062	20/04/28 05:16:59
3	51	310.12883518576933	277.051708071262	20/04/28 05:16:59
3	51	310.12883518576933	277.051708071262	20/04/28 05:17:00
3	51	310.12883518576933	277.051708071262	20/04/28 05:17:00
3	51	310.24496442252365	277.26989216358896	20/04/28 05:17:00
3	51	310.12799134768875	277.19511604335725	20/04/28 05:17:00
3	51	310.2802457564315	276.988255948368	20/04/28 05:17:00
3	51	310.2146528428	277.080713534459	20/04/28 05:17:00
3	51	310.2993113866848	277.1629967742402	20/04/28 05:17:00
3	51	310.488440723732	277.19882481815	20/04/28 05:17:00
3	51	310.5400660896609	277.45588771221117	20/04/28 05:17:00
3	51	310.35533922893677	277.3645082551634	20/04/28 05:17:01
3	51	310.17833350956386	277.1815587138141	20/04/28 05:17:01
3	51	309.9805857584932	277.2387327048907	20/04/28 05:17:01
3	51	309.7512187322364	277.0880494653151	20/04/28 05:17:01
3	51	309.93647416774	277.2875335040498	20/04/28 05:17:01
3	51	309.96843442404787	277.31926922596585	20/04/28 05:17:01
3	51	310.10574289644927	277.3862991398678	20/04/28 05:17:01
3	51	310.10730240825694	277.39183977628363	20/04/28 05:17:01
3	51	310.05420107966324	277.4804257769607	20/04/28 05:17:01
3	51	310.0616872076452	277.35813411214116	20/04/28 05:17:01
3	51	310.0229410032712	277.49078739930036	20/04/28 05:17:02
3	51	310.0521124664219	277.57254035815345	20/04/28 05:17:02
3	51	310.16908489595806	277.4973929852784	20/04/28 05:17:02
3	51	310.27124731258704	277.6202730876209	20/04/28 05:17:02
3	51	310.22023322021903	277.3458815531951	20/04/28 05:17:02
3	51	310.2573175589386	277.59780454637263	20/04/28 05:17:02
3	51	310.13505717075327	277.3253015738512	20/04/28 05:17:02
3	51	309.96829078638234	277.2701818601824	20/04/28 05:17:02
3	51	310.0844428062765	277.50916609648	20/04/28 05:17:02
3	51	310.00816943097476	277.598137596884	20/04/28 05:17:02
3	51	310.1386877193371	277.39710431655857	20/04/28 05:17:03
3	51	310.0696633424663	277.37366485227614	20/04/28 05:17:03
3	51	310.2369791967643	277.559196230764	20/04/28 05:17:03
3	51	310.4379311531743	277.45527955206154	20/04/28 05:17:03
3	51	310.2721948579728	277.5112176632966	20/04/28 05:17:03
3	51	310.2274728986089	277.7915782396033	20/04/28 05:17:03
3	51	310.2112556006449	277.787960730186	20/04/28 05:17:03
3	51	310.22790780057414	277.77623280487256	20/04/28 05:17:03
3	51	310.23668094582473	277.6446674634399	20/04/28 05:17:03
3	51	310.09655705537784	277.62914085082036	20/04/28 05:17:04
3	51	310.0745234441633	277.47456847584743	20/04/28 05:17:04
3	51	310.20782114407973	277.48342944036733	20/04/28 05:17:04
3	51	310.2855207534997	277.62785380333656	20/04/28 05:17:04
3	51	310.23892482447116	277.8680377439515	20/04/28 05:17:04
3	51	310.2085164793825	277.86465319144077	20/04/28 05:17:04
3	51	310.0885295740002	277.9266068724291	20/04/28 05:17:04
3	51	310.0846421796719	277.67498599078505	20/04/28 05:17:04
3	51	310.13957296897325	277.55914019942236	20/04/28 05:17:04
3	51	309.9812083997408	277.3948426065213	20/04/28 05:17:04
3	51	310.09015353825276	277.3421009309774	20/04/28 05:17:05
3	51	310.200597409192	277.3345025530338	20/04/28 05:17:05
3	51	310.1680301014407	277.3733141680614	20/04/28 05:17:05
3	51	310.35988460118915	277.42973585756624	20/04/28 05:17:05
3	51	310.3817275440237	277.43162914439523	20/04/28 05:17:05
3	51	310.40785048534065	277.4410187309872	20/04/28 05:17:05
3	51	310.66933525326687	277.46147128337304	20/04/28 05:17:05
3	51	310.88859880045425	277.4011179628334	20/04/28 05:17:05
3	51	310.72042300245494	277.2008629236653	20/04/28 05:17:05
3	51	310.5476859199697	277.1370439789248	20/04/28 05:17:05
3	51	310.41684812487466	277.2241414192472	20/04/28 05:17:06
3	51	310.17805790509914	277.14685589700383	20/04/28 05:17:06
3	51	310.27243905286485	277.04178996598404	20/04/28 05:17:06
3	51	310.3586161668915	276.84442408161925	20/04/28 05:17:06
3	51	310.53020721762135	276.6986418768014	20/04/28 05:17:06
3	51	310.40347330784397	276.8677920466107	20/04/28 05:17:06
3	51	310.4342718308122	276.8148868841361	20/04/28 05:17:06
3	51	310.41282583770226	276.65265886134557	20/04/28 05:17:06
3	51	310.45567674406794	276.4370768565864	20/04/28 05:17:06
3	51	310.4824907983867	276.43767563575557	20/04/28 05:17:07
3	51	310.2875781228054	276.42925227217336	20/04/28 05:17:07
3	51	310.3643219401035	276.323062678344	20/04/28 05:17:07
3	51	310.3371203693777	276.15572915528776	20/04/28 05:17:07
3	51	310.25442853585514	276.36227415607556	20/04/28 05:17:07
3	51	310.46327316258214	276.1758417714821	20/04/28 05:17:07
3	51	310.53362988706886	275.97577933684056	20/04/28 05:17:07
3	51	310.44912127280907	275.9779396565927	20/04/28 05:17:07
3	51	310.46533741843587	275.90833925074406	20/04/28 05:17:07
3	51	310.60608956073077	275.9743035358282	20/04/28 05:17:07
3	51	310.337105321516	276.069181176961	20/04/28 05:17:08
3	51	310.322833843346	276.14190074408924	20/04/28 05:17:08
3	51	310.3523185779467	276.0989109720581	20/04/28 05:17:08
3	51	310.49086973543876	276.2886098463004	20/04/28 05:17:08
3	51	310.3144677566412	276.41260385772875	20/04/28 05:17:08
3	51	310.1271578491186	276.3180241001285	20/04/28 05:17:08
3	51	310.0536851552029	276.59942212702947	20/04/28 05:17:08
3	51	310.11743609381796	276.78244940886265	20/04/28 05:17:08
3	51	310.062739205214	276.7055909920541	20/04/28 05:17:08
3	51	310.28839756984223	276.51205694125923	20/04/28 05:17:08
3	51	310.24949655195894	276.60651919445917	20/04/28 05:17:09
3	51	310.03502432496146	276.6279506360235	20/04/28 05:17:09
3	51	309.94615549576764	276.6945164025522	20/04/28 05:17:09
3	51	309.97523453336584	276.45439347604486	20/04/28 05:17:09
3	51	309.8911261645005	276.2821937220593	20/04/28 05:17:09
3	51	309.759416353653	276.20816394230593	20/04/28 05:17:09
3	51	309.77269447212586	276.22485191511834	20/04/28 05:17:09
3	51	309.62238894532385	276.2343340110505	20/04/28 05:17:09
3	51	309.55903526796146	276.0281964643282	20/04/28 05:17:09
3	51	309.437503819322	276.2579905839416	20/04/28 05:17:10
3	51	309.6274998465024	276.19354520924185	20/04/28 05:17:10
3	51	309.79444328665454	276.08720296782656	20/04/28 05:17:10
3	51	309.9215338509215	275.90810483834383	20/04/28 05:17:10
3	51	309.9812264116029	275.9125851205465	20/04/28 05:17:10
3	51	310.0045990699709	275.9117609896049	20/04/28 05:17:10
3	51	309.8362080160029	275.749726657601	20/04/28 05:17:10
3	51	309.8445264659878	275.99087079575907	20/04/28 05:17:10
3	51	309.94744589332345	276.2193905872203	20/04/28 05:17:10
3	51	310.15414514491187	276.2814975708572	20/04/28 05:17:10
3	51	310.13017449253084	276.3833014709958	20/04/28 05:17:11
3	51	310.04958356451016	276.26104249069255	20/04/28 05:17:11
3	51	309.9423240171847	276.0109694980809	20/04/28 05:17:11
3	51	309.92011228834883	275.7300749236272	20/04/28 05:17:11
3	51	309.8873740372922	275.61456758183056	20/04/28 05:17:11
3	51	309.8761176118801	275.8646926334597	20/04/28 05:17:11
3	51	309.9186336911085	275.9494341893774	20/04/28 05:17:11
3	51	309.6928166306714	275.9511422878155	20/04/28 05:17:11
3	51	309.64977070726405	275.86692443966353	20/04/28 05:17:11
3	51	309.63750705202796	275.9086528250244	20/04/28 05:17:11
3	51	309.8120087903616	276.0122209660998	20/04/28 05:17:12
3	51	309.83302384156104	276.02990559642865	20/04/28 05:17:12
3	51	309.83839794806096	275.7375132907321	20/04/28 05:17:12
3	51	309.7988743661555	275.73512910915235	20/04/28 05:17:12
3	51	309.8115191085127	275.74141345266645	20/04/28 05:17:12
3	51	309.68956170341403	275.6557978878771	20/04/28 05:17:12
3	51	309.72394612522936	275.77921376970033	20/04/28 05:17:12
3	51	310.0043501665172	275.7050588020258	20/04/28 05:17:12
3	51	309.85881427088486	275.80321044163435	20/04/28 05:17:12
3	51	310.139305418013	275.8697029240155	20/04/28 05:17:13
3	51	310.1725807717313	276.04961507359866	20/04/28 05:17:13
3	51	309.98839795175275	276.1559828167944	20/04/28 05:17:13
3	51	310.17382835329465	276.2308218705078	20/04/28 05:17:13
3	51	310.05906288725237	276.235837876368	20/04/28 05:17:13
3	51	310.06111591035506	276.3098663757146	20/04/28 05:17:13
3	51	310.0654699592702	276.2798645877747	20/04/28 05:17:13
3	51	309.9339167527578	276.4608896045358	20/04/28 05:17:13
3	51	309.9520851186758	276.42412441429576	20/04/28 05:17:13
3	51	310.0795063695999	276.47039146091277	20/04/28 05:17:13
3	51	309.8713469904342	276.60913591116173	20/04/28 05:17:14
3	51	310.05725452972325	276.3973725071197	20/04/28 05:17:14
3	51	310.0199521374823	276.1720065297937	20/04/28 05:17:14
3	51	309.8895799989747	276.09915000928044	20/04/28 05:17:14
3	51	310.141143788097	276.1472418007457	20/04/28 05:17:14
3	51	310.1422984390973	276.1755425296834	20/04/28 05:17:14
3	51	310.14177919118646	276.1637359332741	20/04/28 05:17:14
3	51	310.4260695647071	276.21237638055374	20/04/28 05:17:14
3	51	310.5194529052245	276.18892779001595	20/04/28 05:17:14
3	51	310.4573776980283	276.1230787416873	20/04/28 05:17:14
3	51	310.4546357385158	276.243508195032	20/04/28 05:17:15
3	51	310.45635471333605	276.16513795050975	20/04/28 05:17:15
3	51	310.4824688966668	276.408942381948	20/04/28 05:17:15
3	51	310.4829094040433	276.41248333983646	20/04/28 05:17:15
3	51	310.5343291253179	276.31158393398727	20/04/28 05:17:15
3	51	310.67092384326145	276.56274407289277	20/04/28 05:17:15
3	51	310.6738539942832	276.5883378555191	20/04/28 05:17:15
3	51	310.4553342612427	276.58895516864845	20/04/28 05:17:15
3	51	310.3028555623947	276.55193471412235	20/04/28 05:17:15
3	51	310.1776490271754	276.2894533152749	20/04/28 05:17:16
3	51	310.2150494015165	276.1301344796948	20/04/28 05:17:16
3	51	310.46822413852266	276.24876274397354	20/04/28 05:17:16
3	51	310.44098908346865	276.1935487124851	20/04/28 05:17:16
3	51	310.5476766731991	276.459895847536	20/04/28 05:17:16
3	51	310.46956639266585	276.552861001195	20/04/28 05:17:16
3	51	310.18044946969945	276.5653015840614	20/04/28 05:17:16
3	51	310.18044946969945	276.5653015840614	20/04/28 05:17:16
3	51	310.01426927499256	276.383201659477	20/04/28 05:17:16
3	51	310.0364527370042	276.19891191742227	20/04/28 05:17:16
3	51	310.3054248897173	276.17390385234614	20/04/28 05:17:17
3	51	310.23552347628515	276.3098285429371	20/04/28 05:17:17
3	51	310.2568706681545	276.3536786105298	20/04/28 05:17:17
3	51	310.17216172248254	276.4163512689497	20/04/28 05:17:17
3	51	310.2793820684193	276.5027726714663	20/04/28 05:17:17
3	51	310.29478122565814	276.4504075773229	20/04/28 05:17:17
3	51	310.2800467317829	276.43988421394	20/04/28 05:17:17
3	51	310.4114915853141	276.4553074478243	20/04/28 05:17:17
3	51	310.2135547333526	276.4602165256674	20/04/28 05:17:17
3	51	310.46430957013484	276.3044019556076	20/04/28 05:17:17
3	51	310.7083442859197	276.3488561067349	20/04/28 05:17:18
3	51	310.8123482292973	276.34157743249034	20/04/28 05:17:18
3	51	310.8062038182902	276.3165000910524	20/04/28 05:17:18
3	51	310.92511559648244	276.27136138215684	20/04/28 05:17:18
3	51	310.9142069650012	276.42665646148436	20/04/28 05:17:18
3	51	310.84091168015635	276.2062232860211	20/04/28 05:17:18
3	51	310.77577081081296	276.0262870358536	20/04/28 05:17:18
3	51	310.74294732805146	276.1768278821984	20/04/28 05:17:18
3	51	310.65008445302226	276.22618983568515	20/04/28 05:17:18
3	51	310.69732212267525	276.225687122537	20/04/28 05:17:19
3	51	310.8184978934674	276.0100952369904	20/04/28 05:17:19
3	51	310.82770776480555	276.0143338955326	20/04/28 05:17:19
3	51	310.97745762661214	276.17810184876214	20/04/28 05:17:19
3	51	310.8273389790445	276.0365399437905	20/04/28 05:17:19
3	51	310.7630285928086	276.1316594779511	20/04/28 05:17:19
3	51	310.71835817794056	276.010109329171	20/04/28 05:17:19
3	51	310.8344624682368	275.98701614572735	20/04/28 05:17:19
3	51	310.57441889673345	275.8515605321771	20/04/28 05:17:19
3	51	310.57148058118594	276.1272431885235	20/04/28 05:17:19
3	51	310.5002529655876	276.03656386288793	20/04/28 05:17:20
3	51	310.47865928220807	276.103685126157	20/04/28 05:17:20
3	51	310.4942712623588	276.12392776451355	20/04/28 05:17:20
3	51	310.5550047192446	275.9812646709266	20/04/28 05:17:20
3	51	310.3722585204957	275.8273702018012	20/04/28 05:17:20
3	51	310.3431212731785	275.86750294576956	20/04/28 05:17:20
3	51	310.4747941070038	275.71569743819936	20/04/28 05:17:20
3	51	310.592490640857	275.53180465747505	20/04/28 05:17:20
3	51	310.4321477163745	275.4295607881156	20/04/28 05:17:20
3	51	310.4009474927184	275.2665347892713	20/04/28 05:17:20
3	51	310.5579581529066	275.3695377269602	20/04/28 05:17:21
3	51	310.7326456342875	275.27020882097855	20/04/28 05:17:21
3	51	310.72485509657145	275.27772609275763	20/04/28 05:17:21
3	51	310.7377584514064	275.2462919310583	20/04/28 05:17:21
3	51	310.84000714244524	275.34392647743005	20/04/28 05:17:21
3	51	310.794332857918	275.34093330352005	20/04/28 05:17:21
3	51	310.9875664571207	275.19988768980267	20/04/28 05:17:21
3	51	310.9480449143588	275.3447265680578	20/04/28 05:17:21
3	51	310.9922500165425	275.37450722117165	20/04/28 05:17:21
3	51	311.2409642336369	275.3014923394487	20/04/28 05:17:22
3	51	310.98308471548506	275.24601051689336	20/04/28 05:17:22
3	51	311.021656438134	275.2208889955853	20/04/28 05:17:22
3	51	311.0506646733762	275.36867396757685	20/04/28 05:17:22
3	51	311.2176750194044	275.37604654548386	20/04/28 05:17:22
3	51	311.30720111217266	275.3180987409941	20/04/28 05:17:22
3	51	311.2091511166093	275.5256065346899	20/04/28 05:17:22
3	51	311.13007153172896	275.7123982678387	20/04/28 05:17:22
3	51	311.1469635343301	275.6959433139009	20/04/28 05:17:22
3	51	310.9878399306446	275.5204740944669	20/04/28 05:17:22
3	51	311.19772696480493	275.46147955477494	20/04/28 05:17:23
3	51	311.396410734623	275.3853826994766	20/04/28 05:17:23
3	51	311.5878998576816	275.5737691956895	20/04/28 05:17:23
3	51	311.3261228724144	275.60310170311897	20/04/28 05:17:23
3	51	311.33267986471037	275.7880518376962	20/04/28 05:17:23
3	51	311.3298693857509	275.8153431066126	20/04/28 05:17:23
3	51	311.4227254765433	275.99568598259566	20/04/28 05:17:23
3	51	311.3527883988312	275.9493206939394	20/04/28 05:17:23
3	51	311.35658009439715	275.92568547722215	20/04/28 05:17:23
3	51	311.1446548700171	275.78962827699087	20/04/28 05:17:23
3	51	311.1438489308318	275.74580744724653	20/04/28 05:17:24
3	51	311.00640504625744	275.8998138040121	20/04/28 05:17:24
3	51	311.07412046297094	275.95573023446684	20/04/28 05:17:24
3	51	311.0712493404754	275.98656471005165	20/04/28 05:17:24
3	51	311.06541448953527	275.80753033698585	20/04/28 05:17:24
3	51	310.94119834966756	275.8529562455855	20/04/28 05:17:24
3	51	311.1041725234781	275.7779304989576	20/04/28 05:17:24
3	51	311.2724383124311	275.66868030050694	20/04/28 05:17:24
3	51	311.30433714771016	275.70076041413233	20/04/28 05:17:24
3	51	311.2641857195939	275.90152825521113	20/04/28 05:17:25
3	51	311.2653118149106	276.006949509538	20/04/28 05:17:25
3	51	311.3295428791758	276.00861139880294	20/04/28 05:17:25
3	51	311.34168165230875	276.0065473688286	20/04/28 05:17:25
3	51	311.2940337544891	275.7536107837707	20/04/28 05:17:25
3	51	311.41999649582647	275.79842552005	20/04/28 05:17:25
3	51	311.5349930404061	275.76642988984594	20/04/28 05:17:25
3	51	311.67994646580905	275.67881827647824	20/04/28 05:17:25
3	51	311.86352296891386	275.4800807549722	20/04/28 05:17:25
3	51	311.78006177255565	275.2268134939172	20/04/28 05:17:25
3	51	311.7819934334843	275.10987454262875	20/04/28 05:17:26
3	51	311.75944861080296	274.9681953263634	20/04/28 05:17:26
3	51	311.7253172392998	274.9429625179654	20/04/28 05:17:26
3	51	311.4983580494709	274.9088508479093	20/04/28 05:17:26
3	51	311.7096390680186	274.69693349500506	20/04/28 05:17:26
3	51	311.7433578684943	274.71870324480926	20/04/28 05:17:26
3	51	311.72629446277125	274.90976588978685	20/04/28 05:17:26
3	51	311.7924917392396	274.75211809406164	20/04/28 05:17:26
3	51	311.7853956659701	274.75210877415833	20/04/28 05:17:26
3	51	312.05523559987574	274.65380838193386	20/04/28 05:17:26
3	51	312.07995324940117	274.39810103326084	20/04/28 05:17:27
3	51	312.0488871677869	274.44151406615003	20/04/28 05:17:27
3	51	312.0868220718156	274.59917316362146	20/04/28 05:17:27
3	51	311.8451022926847	274.4764498602715	20/04/28 05:17:27
3	51	311.91450492062427	274.73323702756016	20/04/28 05:17:27
3	51	311.8664541083475	274.943391648502	20/04/28 05:17:27
3	51	311.9316708445954	274.88054869983	20/04/28 05:17:27
3	51	311.8824404928954	274.5855703244278	20/04/28 05:17:27
3	51	311.87514042582654	274.580311369208	20/04/28 05:17:27
3	51	311.95895939976646	274.6520108075512	20/04/28 05:17:27
3	51	311.9301083607051	274.6807655492265	20/04/28 05:17:28
3	51	311.9188057238419	274.6627592344516	20/04/28 05:17:28
3	51	311.9588112578498	274.9258846019048	20/04/28 05:17:28
3	51	311.8206501084568	275.0391085937925	20/04/28 05:17:28
3	51	311.84086040717125	275.0624233137741	20/04/28 05:17:28
3	51	311.88650599155403	275.02881249253954	20/04/28 05:17:28
3	51	311.93468810563854	275.0074377927105	20/04/28 05:17:28
3	51	312.0596012948671	274.7986247566414	20/04/28 05:17:28
3	51	312.0472395282904	274.79096471732873	20/04/28 05:17:28
3	51	311.9724853246385	274.85112026859116	20/04/28 05:17:29
3	51	311.92297997448776	274.93867590612854	20/04/28 05:17:29
3	51	311.9214406745927	274.9423064299708	20/04/28 05:17:29
3	51	311.6870533179326	274.9150130081946	20/04/28 05:17:29
3	51	311.7564025334016	274.9937422112096	20/04/28 05:17:29
3	51	311.66089092733256	274.9787080966435	20/04/28 05:17:29
3	51	311.6627817545281	275.23436537601896	20/04/28 05:17:29
3	51	311.67131591352467	275.25024143641053	20/04/28 05:17:29
3	51	311.61759388473075	275.092288892413	20/04/28 05:17:29
3	51	311.60171895670265	275.1499736182424	20/04/28 05:17:29
3	51	311.772341476071	275.05316491311044	20/04/28 05:17:30
3	51	311.9601438062298	275.05272701291415	20/04/28 05:17:30
3	51	311.95747121866594	275.1003894917708	20/04/28 05:17:30
3	51	311.97291018341076	275.1828043216601	20/04/28 05:17:30
3	51	312.01112169430075	275.3842490198127	20/04/28 05:17:30
3	51	312.103834990901	275.34705714902975	20/04/28 05:17:30
3	51	312.19802321412993	275.5202244793885	20/04/28 05:17:30
3	51	312.0997612029328	275.63401719296263	20/04/28 05:17:30
3	51	312.0997612029328	275.63401719296263	20/04/28 05:17:30
3	51	312.0997612029328	275.63401719296263	20/04/28 05:17:30
3	51	312.0671047599228	275.6595372327415	20/04/28 05:17:31
3	51	311.96722729555825	275.8381129048526	20/04/28 05:17:31
3	51	311.9545126409664	275.8345042904674	20/04/28 05:17:31
3	51	312.0396346988918	275.9441624464906	20/04/28 05:17:31
3	51	312.0220010633828	275.89505161722997	20/04/28 05:17:31
3	51	312.0504069541386	275.86267647398864	20/04/28 05:17:31
3	51	312.2850223562983	275.9701123724066	20/04/28 05:17:31
3	51	312.5631133070577	275.89567116095213	20/04/28 05:17:31
3	51	312.3231210467319	276.0081599225938	20/04/28 05:17:31
3	51	312.1135333135262	275.9621039488352	20/04/28 05:17:32
3	51	312.11495420423626	275.9590829005708	20/04/28 05:17:32
3	51	312.0444690190983	275.76276056187965	20/04/28 05:17:32
3	51	312.0410380950197	275.946806860985	20/04/28 05:17:32
3	51	311.9536899816698	275.7804612783741	20/04/28 05:17:32
3	51	312.027096492081	275.8037043376432	20/04/28 05:17:32
3	51	311.9048469632721	275.8383198697258	20/04/28 05:17:32
3	51	311.8374350561645	275.8719433735935	20/04/28 05:17:32
3	51	311.62014403894244	275.92181424007885	20/04/28 05:17:32
3	51	311.67849034452644	276.0364999007859	20/04/28 05:17:32
3	51	311.74899580446805	275.9718725580336	20/04/28 05:17:33
3	51	311.76441915402813	275.9664446219014	20/04/28 05:17:33
3	51	312.0153508150203	275.96887250929757	20/04/28 05:17:33
3	51	312.23499755456766	275.919944489283	20/04/28 05:17:33
3	51	312.1609263416942	275.86207835055023	20/04/28 05:17:33
3	51	312.3009152891065	275.9063676594722	20/04/28 05:17:33
3	51	312.282449300213	275.94870643841995	20/04/28 05:17:33
3	51	312.19394093634054	275.9840912254633	20/04/28 05:17:33
3	51	312.41611217542516	275.9862259979663	20/04/28 05:17:33
3	51	312.3474434090312	276.1018651326761	20/04/28 05:17:34
3	51	312.203926684819	276.0781195762569	20/04/28 05:17:34
3	51	312.118338139773	276.09893292185654	20/04/28 05:17:34
3	51	312.39531469719884	275.9976972672598	20/04/28 05:17:34
3	51	312.393409869855	275.91395120217095	20/04/28 05:17:34
3	51	312.5082576286306	275.79031139256404	20/04/28 05:17:34
3	51	312.6051741643226	275.7699015618513	20/04/28 05:17:34
3	51	312.4995532535723	276.02749355257845	20/04/28 05:17:34
3	51	312.52446924640174	276.02515249631114	20/04/28 05:17:34
3	51	312.61704526553103	276.2512378994777	20/04/28 05:17:34
3	51	312.6951212184849	276.123026279105	20/04/28 05:17:35
3	51	312.68911876951853	276.12065485202993	20/04/28 05:17:35
3	51	312.55442570077946	276.0916743742554	20/04/28 05:17:35
3	51	312.4986322460491	276.0167289733018	20/04/28 05:17:35
3	51	312.4509699160821	276.033844153743	20/04/28 05:17:35
3	51	312.6418033310055	276.0632744930495	20/04/28 05:17:35
3	51	312.3626373262448	276.07865007390205	20/04/28 05:17:35
3	51	312.49890152979907	276.06398386975724	20/04/28 05:17:35
3	51	312.44660569321064	276.04244392779276	20/04/28 05:17:35
3	51	312.49037457770834	275.95424747210274	20/04/28 05:17:35
3	51	312.2455155476882	275.87714864982877	20/04/28 05:17:36
3	51	312.11878600993265	275.83534191106304	20/04/28 05:17:36
3	51	312.023554428204	275.8391408801787	20/04/28 05:17:36
3	51	312.01920242042297	275.8356653203151	20/04/28 05:17:36
3	51	312.03890897020204	275.8675859821277	20/04/28 05:17:36
3	51	312.03213202398365	275.8988150681603	20/04/28 05:17:36
3	51	311.91310524683115	275.8683539040592	20/04/28 05:17:36
3	51	312.0220772386612	275.66787037077364	20/04/28 05:17:36
3	51	312.1096480729237	275.62136188473534	20/04/28 05:17:36
3	51	312.27250696500835	275.62280944512986	20/04/28 05:17:37
3	51	312.4276327569031	275.66031651693453	20/04/28 05:17:37
3	51	312.44962632107956	275.5112057560325	20/04/28 05:17:37
3	51	312.4341152376929	275.56183847814367	20/04/28 05:17:37
3	51	312.4654590775798	275.6195286956571	20/04/28 05:17:37
3	51	312.74148367835045	275.53765694870566	20/04/28 05:17:37
3	51	312.8493709694677	275.5392309876103	20/04/28 05:17:37
3	51	313.08044512376244	275.41745328975793	20/04/28 05:17:37
3	51	313.2903216726847	275.36220257193173	20/04/28 05:17:37
3	51	313.21521110566965	275.1629075812692	20/04/28 05:17:37
3	51	313.2069607803637	275.1631310764999	20/04/28 05:17:38
3	51	313.2760717226618	275.3047348044054	20/04/28 05:17:38
3	51	313.17562436343303	275.2364854661434	20/04/28 05:17:38
3	51	313.09517639261406	275.26686671858187	20/04/28 05:17:38
3	51	313.22031845358697	275.1007898274098	20/04/28 05:17:38
3	51	312.9498109001009	275.0710930033717	20/04/28 05:17:38
3	51	312.8852878733079	274.8204309876	20/04/28 05:17:38
3	51	312.9031425411222	274.80045618865955	20/04/28 05:17:38
3	51	312.9173836294004	274.8007735141876	20/04/28 05:17:38
3	51	312.9541645686396	274.7333840020221	20/04/28 05:17:38
3	51	312.9057225456721	274.90186735874886	20/04/28 05:17:39
3	51	312.8604589739498	274.97311615238647	20/04/28 05:17:39
3	51	312.6746926519668	274.93025596495943	20/04/28 05:17:39
3	51	312.73156490130214	274.9772762563047	20/04/28 05:17:39
3	51	312.7790664722741	275.16973735742937	20/04/28 05:17:39
3	51	312.7837460634009	275.17503928239904	20/04/28 05:17:39
3	51	312.78807359443135	274.91479712498386	20/04/28 05:17:39
3	51	313.0538348488872	274.92887313964604	20/04/28 05:17:39
3	51	313.0623961974416	274.9301694174248	20/04/28 05:17:39
3	51	313.0398290220709	275.12111728373475	20/04/28 05:17:40
3	51	313.0610897417812	275.138681199968	20/04/28 05:17:40
3	51	313.12528961542654	275.3309573211283	20/04/28 05:17:40
3	51	313.25144006741186	275.3899024121303	20/04/28 05:17:40
3	51	313.14935161667734	275.45471076205905	20/04/28 05:17:40
3	51	313.0956518951175	275.35812984975763	20/04/28 05:17:40
3	51	313.1420245184421	275.4008172352679	20/04/28 05:17:40
3	51	313.07624063360424	275.3448808767565	20/04/28 05:17:40
3	51	313.0604522156471	275.1224894725796	20/04/28 05:17:40
3	51	313.0564836848078	274.9544612184786	20/04/28 05:17:40
3	51	313.16763456159543	274.98366756953334	20/04/28 05:17:41
3	51	313.105015053072	274.9193534073665	20/04/28 05:17:41
3	51	313.1178245105137	275.0238783909509	20/04/28 05:17:41
3	51	313.39450804821297	275.0370754481617	20/04/28 05:17:41
3	51	313.4405342165389	274.9911620223537	20/04/28 05:17:41
3	51	313.7116207510183	274.8667094542735	20/04/28 05:17:41
3	51	313.65760067887305	275.04736895879074	20/04/28 05:17:41
3	51	313.7896978787042	275.2445152367991	20/04/28 05:17:41
3	51	313.65799342941744	275.25624657064037	20/04/28 05:17:41
3	51	313.7552238441045	275.2541309276664	20/04/28 05:17:41
3	51	313.72728909627335	275.0407505180024	20/04/28 05:17:42
3	51	313.72643285301393	275.04032338297134	20/04/28 05:17:42
3	51	313.9158951827548	275.16666997310324	20/04/28 05:17:42
3	51	313.9539909203027	275.21225416935584	20/04/28 05:17:42
3	51	313.9658884130661	275.36906380244125	20/04/28 05:17:42
3	51	314.08007650049973	275.3278056689729	20/04/28 05:17:42
3	51	313.96522579108205	275.3978811953184	20/04/28 05:17:42
3	51	313.8935707505262	275.4416482211125	20/04/28 05:17:42
3	51	313.9103475965321	275.4487331102359	20/04/28 05:17:42
3	51	313.8278518023132	275.43746407982576	20/04/28 05:17:43
3	51	313.6563949417382	275.2598278423595	20/04/28 05:17:43
3	51	313.8352012515857	275.3816620592189	20/04/28 05:17:43
3	51	313.65898287916036	275.35777539642794	20/04/28 05:17:43
3	51	313.4102854009392	275.2227560251626	20/04/28 05:17:43
3	51	313.63237083621823	275.21428348875276	20/04/28 05:17:43
3	51	313.6009252602489	275.2896040655794	20/04/28 05:17:43
3	51	313.67517052279607	275.05808103355605	20/04/28 05:17:43
3	51	313.87032581296666	275.14963456615413	20/04/28 05:17:43
3	51	313.876128432701	275.17254084542213	20/04/28 05:17:43
3	51	313.9850593103012	275.3380875835287	20/04/28 05:17:44
3	51	313.77496482832447	275.410316248878	20/04/28 05:17:44
3	51	313.84296668333803	275.3267702026118	20/04/28 05:17:44
3	51	313.8337580237619	275.32307024474477	20/04/28 05:17:44
3	51	313.8740318651828	275.5056838276468	20/04/28 05:17:44
3	51	313.9123086932316	275.52153837022746	20/04/28 05:17:44
3	51	313.8105199704552	275.58413480645476	20/04/28 05:17:44
3	51	313.68933760905	275.67724988088116	20/04/28 05:17:44
3	51	313.7907962735871	275.9076041468577	20/04/28 05:17:44
3	51	313.8502692848273	275.81556667264186	20/04/28 05:17:44
3	51	314.1073917200353	275.9307696993864	20/04/28 05:17:45
3	51	314.14347232174583	275.95840247057714	20/04/28 05:17:45
3	51	314.2121199085466	275.9897075512972	20/04/28 05:17:45
3	51	314.10339930571314	276.2619935726745	20/04/28 05:17:45
3	51	313.92643260888383	276.1652479213693	20/04/28 05:17:45
3	51	314.0141927338914	276.146592037321	20/04/28 05:17:45
3	51	314.05181627682737	276.1398447468949	20/04/28 05:17:45
3	51	314.03596849129804	276.1731956733327	20/04/28 05:17:45
3	51	313.9904814538368	276.19033323610586	20/04/28 05:17:45
3	51	314.106003131202	276.4362238175248	20/04/28 05:17:46
3	51	314.05246175144833	276.3440139230593	20/04/28 05:17:46
3	51	314.04590620008145	276.34830912719383	20/04/28 05:17:46
3	51	313.98748536106797	276.2886481074741	20/04/28 05:17:46
3	51	313.95208300798595	276.29982069407873	20/04/28 05:17:46
3	51	314.13966097537235	276.2805491764414	20/04/28 05:17:46
3	51	314.11412822637124	276.35990329528397	20/04/28 05:17:46
3	51	314.2960187113645	276.26765797554356	20/04/28 05:17:46
3	51	314.08308795027074	276.4147833501706	20/04/28 05:17:46
3	51	314.1153118219848	276.40449646178223	20/04/28 05:17:46
3	51	314.1193731257505	276.3790361455992	20/04/28 05:17:47
3	51	314.08571385727265	276.31053035103355	20/04/28 05:17:47
3	51	314.10132190550166	276.496249463023	20/04/28 05:17:47
3	51	314.1393277593795	276.4575312282498	20/04/28 05:17:47
3	51	314.03352041068456	276.573434384138	20/04/28 05:17:47
3	51	314.25056346375027	276.4875684614499	20/04/28 05:17:47
3	51	314.4863176427308	276.4310394606185	20/04/28 05:17:47
3	51	314.51979336261206	276.47773654908156	20/04/28 05:17:47
3	51	314.5235097602405	276.4445387519702	20/04/28 05:17:47
3	51	314.4116792957877	276.45886512477506	20/04/28 05:17:48
3	51	314.62403944231676	276.53148655290295	20/04/28 05:17:48
3	51	314.738476171746	276.7045395070072	20/04/28 05:17:48
3	51	315.00894411383837	276.63314433265407	20/04/28 05:17:48
3	51	315.01803037980693	276.42427785419557	20/04/28 05:17:48
3	51	315.10042837183664	276.5746910234097	20/04/28 05:17:48
3	51	315.192989705552	276.53643212293554	20/04/28 05:17:48
3	51	315.3358632492928	276.382888195777	20/04/28 05:17:48
3	51	315.1089085119416	276.55443075559003	20/04/28 05:17:48
3	51	315.0719684067938	276.80939559636016	20/04/28 05:17:48
3	51	315.0573103097895	276.69424708084426	20/04/28 05:17:49
3	51	315.04826665512064	276.6975058865599	20/04/28 05:17:49
3	51	315.19375144528937	276.85418924346965	20/04/28 05:17:49
3	51	315.18987175262123	276.85651370349	20/04/28 05:17:49
3	51	315.18987175262123	276.85651370349	20/04/28 05:17:49
3	51	315.18987175262123	276.85651370349	20/04/28 05:17:49
3	51	315.18671761856956	276.8896227832379	20/04/28 05:17:49
3	51	315.11236059393724	277.152178838763	20/04/28 05:17:49
3	51	315.08695657335693	277.136902610807	20/04/28 05:17:49
3	51	315.0415176575713	277.0934436979263	20/04/28 05:17:49
3	51	315.09243699358865	277.12421632301806	20/04/28 05:17:50
3	51	315.1021689770103	277.14672080408604	20/04/28 05:17:50
3	51	315.1884340096736	277.22510495774765	20/04/28 05:17:50
3	51	315.2199051046845	277.452606957841	20/04/28 05:17:50
3	51	315.0270409688047	277.3017229936368	20/04/28 05:17:50
3	51	314.9364542589461	277.16487724194377	20/04/28 05:17:50
3	51	314.9423068957693	277.27406603746954	20/04/28 05:17:50
3	51	314.86519972235993	277.51471934842124	20/04/28 05:17:50
3	51	314.67725462926535	277.28114356859544	20/04/28 05:17:50
3	51	314.86405141438684	277.3436258780388	20/04/28 05:17:51
3	51	314.86405141438684	277.3436258780388	20/04/28 05:17:51
3	51	314.86405141438684	277.3436258780388	20/04/28 05:17:51
3	51	314.7500289100636	277.59632745722473	20/04/28 05:17:51
3	51	314.7533824235361	277.67075270149905	20/04/28 05:17:51
3	51	314.76699310353257	277.6627652647251	20/04/28 05:17:51
3	51	314.7591898125218	277.6406813945521	20/04/28 05:17:51
3	51	314.70508274702195	277.59635174881913	20/04/28 05:17:51
3	51	314.6368042103945	277.32525580418894	20/04/28 05:17:51
3	51	314.4944298119068	277.5424538104438	20/04/28 05:17:51
3	51	314.72417696329035	277.6293240640026	20/04/28 05:17:52
3	51	314.6694089285419	277.9224083365812	20/04/28 05:17:52
3	51	314.6317172831788	277.8410294273472	20/04/28 05:17:52
3	51	314.4678630243402	277.6809296579698	20/04/28 05:17:52
3	51	314.34001040125844	277.91073200098646	20/04/28 05:17:52
3	51	314.32770872814893	278.07213248923824	20/04/28 05:17:52
3	51	314.48714494003787	277.9380672343506	20/04/28 05:17:52
3	51	314.5720713229955	277.87886622943597	20/04/28 05:17:52
3	51	314.65519936604363	278.03798892798704	20/04/28 05:17:52
3	51	314.62977570436055	277.914498350744	20/04/28 05:17:52
3	51	314.6246311597157	277.916068172764	20/04/28 05:17:53
3	51	314.476099267415	277.9029441336698	20/04/28 05:17:53
3	51	314.4969566370989	277.8215501918973	20/04/28 05:17:53
3	51	314.45510914163924	277.9695755049159	20/04/28 05:17:53
3	51	314.393775677989	278.01229093453355	20/04/28 05:17:53
3	51	314.4609140961991	278.25192521597563	20/04/28 05:17:53
3	51	314.36072533710944	278.2737207806855	20/04/28 05:17:53
3	51	314.40538898596117	278.29795550851037	20/04/28 05:17:53
3	51	314.43264310942493	278.140535097989	20/04/28 05:17:53
3	51	314.45814527274075	278.08200202093474	20/04/28 05:17:54
3	51	314.5121469498513	278.1297686014432	20/04/28 05:17:54
3	51	314.7108632674495	277.96023929017656	20/04/28 05:17:54
3	51	314.6967886666862	277.90961351732795	20/04/28 05:17:54
3	51	314.5515802790714	277.9501426112946	20/04/28 05:17:54
3	51	314.6617095175963	277.9470109978264	20/04/28 05:17:54
3	51	314.490147514966	277.73816926913184	20/04/28 05:17:54
3	51	314.3128219709065	277.8853808204014	20/04/28 05:17:54
3	51	314.3979515834222	277.6977549171245	20/04/28 05:17:54
3	51	314.2908987106414	277.70583009561	20/04/28 05:17:54
3	51	314.3693254593798	277.43796020601326	20/04/28 05:17:55
3	51	314.3824335190216	277.4204542049784	20/04/28 05:17:55
3	51	314.40528304731737	277.2973094329952	20/04/28 05:17:55
3	51	314.4002841308203	277.23188944861585	20/04/28 05:17:55
3	51	314.2350562455476	277.1410946400528	20/04/28 05:17:55
3	51	314.0492836224816	277.1983949446636	20/04/28 05:17:55
3	51	314.28708067851426	277.32542055251093	20/04/28 05:17:55
3	51	314.39732436190053	277.48975608414605	20/04/28 05:17:55
3	51	314.54426944199975	277.6829325320408	20/04/28 05:17:55
3	51	314.31916733718055	277.8591180835924	20/04/28 05:17:56
3	51	314.5474852876457	277.6936280004716	20/04/28 05:17:56
3	51	314.5578449271857	277.61535850613734	20/04/28 05:17:56
3	51	314.7135609750586	277.3633183663349	20/04/28 05:17:56
3	51	314.5916840453697	277.58801079642524	20/04/28 05:17:56
3	51	314.5624660247553	277.69189607457486	20/04/28 05:17:56
3	51	314.5538049580311	277.65440703789636	20/04/28 05:17:56
3	51	314.5001907589219	277.75499419055603	20/04/28 05:17:56
3	51	314.49564689396755	277.76639850714616	20/04/28 05:17:56
3	51	314.6650758200551	277.71769002507835	20/04/28 05:17:56
3	51	314.5286355884802	277.5750827314425	20/04/28 05:17:57
3	51	314.6626145313967	277.58524840536376	20/04/28 05:17:57
3	51	314.85985714882173	277.5229750595212	20/04/28 05:17:57
3	51	315.1046920468082	277.4728111238411	20/04/28 05:17:57
3	51	315.0645331007202	277.5573901520461	20/04/28 05:17:57
3	51	315.0222045993084	277.300080135682	20/04/28 05:17:57
3	51	315.20160265187263	277.4051202413778	20/04/28 05:17:57
3	51	315.0488398026216	277.4984718386548	20/04/28 05:17:57
3	51	314.8874674399478	277.53888616513143	20/04/28 05:17:57
3	51	314.8266255747502	277.3161394254064	20/04/28 05:17:57
3	51	315.0594154288834	277.2862926990464	20/04/28 05:17:58
3	51	314.9557554830602	277.376801922503	20/04/28 05:17:58
3	51	315.047141680264	277.3477834897251	20/04/28 05:17:58
3	51	314.8387280660842	277.2135736083268	20/04/28 05:17:58
3	51	314.6395218647552	277.0294245684183	20/04/28 05:17:58
3	51	314.8695746623254	276.88718278642455	20/04/28 05:17:58
3	51	314.9312186400889	276.8828041340123	20/04/28 05:17:58
3	51	314.9829470845361	276.7382520320036	20/04/28 05:17:58
3	51	314.89417519892	276.9494713829285	20/04/28 05:17:58
3	51	314.69721355002	277.03674286854516	20/04/28 05:17:59
3	51	314.7888224389178	277.01965773184156	20/04/28 05:17:59
3	51	314.8801001635215	276.90147414131394	20/04/28 05:17:59
3	51	314.709592746667	276.9020666997752	20/04/28 05:17:59
3	51	314.69684928530324	276.81425685796256	20/04/28 05:17:59
3	51	314.6708763596604	276.5788736868244	20/04/28 05:17:59
3	51	314.4256451960373	276.6164709631772	20/04/28 05:17:59
3	51	314.31603626768054	276.4852327890301	20/04/28 05:17:59
3	51	314.4950315997904	276.39616383168357	20/04/28 05:17:59
3	51	314.65703480274533	276.5281039903493	20/04/28 05:17:59
3	51	314.58605482588024	276.57236486973784	20/04/28 05:18:00
3	51	314.610033581949	276.5259828014922	20/04/28 05:18:00
3	51	314.7138281327318	276.38414641163524	20/04/28 05:18:00
3	51	314.66201317200716	276.25383175335213	20/04/28 05:18:00
3	51	314.6517231590043	276.2448051156276	20/04/28 05:18:00
3	51	314.3879860157659	276.37482121910745	20/04/28 05:18:00
3	51	314.28457676427547	276.5185415207183	20/04/28 05:18:00
3	51	314.06535195351563	276.56726559882134	20/04/28 05:18:00
3	51	314.03554403940274	276.7145206538705	20/04/28 05:18:00
3	51	314.0258248173588	276.57431593520204	20/04/28 05:18:00
3	51	313.92153030067465	276.5760664579973	20/04/28 05:18:01
3	51	313.84182278459554	276.8560434182633	20/04/28 05:18:01
3	51	313.8418447790237	276.8483871732404	20/04/28 05:18:01
3	51	314.0770972959016	277.01477382990805	20/04/28 05:18:01
3	51	313.96424469186746	276.8439874956912	20/04/28 05:18:01
3	51	313.96424469186746	276.8439874956912	20/04/28 05:18:01
3	51	313.9994805555801	276.90076189829995	20/04/28 05:18:01
3	51	314.1400678829223	277.04781117616443	20/04/28 05:18:01
3	51	314.14353307882647	277.0433051098271	20/04/28 05:18:01
3	51	314.384386011845	277.0589339962451	20/04/28 05:18:02
3	51	314.384386011845	277.0589339962451	20/04/28 05:18:02
3	51	314.4498522170659	277.1402945805176	20/04/28 05:18:02
