stationId	t_start	t_end	t_max	timeStamp
156	20/04/28 05:08:49	20/04/28 05:08:49	20/04/28 05:08:49
114	20/04/28 05:08:51	20/04/28 05:08:51	20/04/28 05:08:51
87	20/04/28 05:08:53	20/04/28 05:08:53	20/04/28 05:08:53
18	20/04/28 05:08:55	20/04/28 05:08:55	20/04/28 05:08:55
128	20/04/28 05:08:57	20/04/28 05:08:57	20/04/28 05:08:57
151	20/04/28 05:08:59	20/04/28 05:08:59	20/04/28 05:08:59
135	20/04/28 05:09:53	20/04/28 05:09:01	20/04/28 05:09:01
43	20/04/28 05:09:03	20/04/28 05:09:03	20/04/28 05:09:03
77	20/04/28 05:09:05	20/04/28 05:09:05	20/04/28 05:09:05
11	20/04/28 05:09:07	20/04/28 05:09:09	20/04/28 05:09:07
11	20/04/28 05:09:11	20/04/28 05:09:11	20/04/28 05:09:11
43	20/04/28 05:09:13	20/04/28 05:09:13	20/04/28 05:09:13
26	20/04/28 05:09:15	20/04/28 05:09:15	20/04/28 05:09:15
47	20/04/28 05:09:17	20/04/28 05:09:17	20/04/28 05:09:17
47	20/04/28 05:09:19	20/04/28 05:09:19	20/04/28 05:09:19
43	20/04/28 05:09:21	20/04/28 05:09:21	20/04/28 05:09:21
43	20/04/28 05:09:23	20/04/28 05:09:23	20/04/28 05:09:23
69	20/04/28 05:09:25	20/04/28 05:09:25	20/04/28 05:09:25
3	20/04/28 05:09:27	20/04/28 05:09:27	20/04/28 05:09:27
100	20/04/28 05:09:29	20/04/28 05:09:29	20/04/28 05:09:29
128	20/04/28 05:09:31	20/04/28 05:09:31	20/04/28 05:09:31
12	20/04/28 05:09:33	20/04/28 05:09:33	20/04/28 05:09:33
1	20/04/28 05:09:35	20/04/28 05:09:35	20/04/28 05:09:35
40	20/04/28 05:09:37	20/04/28 05:09:37	20/04/28 05:09:37
19	20/04/28 05:09:39	20/04/28 05:09:39	20/04/28 05:09:39
24	20/04/28 05:09:41	20/04/28 05:09:41	20/04/28 05:09:41
11	20/04/28 05:09:43	20/04/28 05:09:43	20/04/28 05:09:43
147	20/04/28 05:09:45	20/04/28 05:09:45	20/04/28 05:09:45
74	20/04/28 05:09:47	20/04/28 05:09:47	20/04/28 05:09:47
41	20/04/28 05:09:49	20/04/28 05:09:49	20/04/28 05:09:49
105	20/04/28 05:09:51	20/04/28 05:09:55	20/04/28 05:09:52
118	20/04/28 05:09:57	20/04/28 05:16:04	20/04/28 05:09:57
91	20/04/28 05:09:59	20/04/28 05:09:59	20/04/28 05:09:59
91	20/04/28 05:10:01	20/04/28 05:10:02	20/04/28 05:10:02
117	20/04/28 05:10:04	20/04/28 05:10:04	20/04/28 05:10:04
117	20/04/28 05:10:06	20/04/28 05:10:06	20/04/28 05:10:06
68	20/04/28 05:10:08	20/04/28 05:10:08	20/04/28 05:10:08
103	20/04/28 05:10:10	20/04/28 05:10:10	20/04/28 05:10:10
65	20/04/28 05:10:12	20/04/28 05:10:12	20/04/28 05:10:12
67	20/04/28 05:10:14	20/04/28 05:10:14	20/04/28 05:10:14
94	20/04/28 05:10:16	20/04/28 05:10:16	20/04/28 05:10:16
11	20/04/28 05:10:18	20/04/28 05:10:18	20/04/28 05:10:18
125	20/04/28 05:10:20	20/04/28 05:10:20	20/04/28 05:10:20
99	20/04/28 05:10:22	20/04/28 05:10:22	20/04/28 05:10:22
131	20/04/28 05:10:24	20/04/28 05:10:24	20/04/28 05:10:24
16	20/04/28 05:10:26	20/04/28 05:10:26	20/04/28 05:10:26
142	20/04/28 05:10:28	20/04/28 05:10:28	20/04/28 05:10:28
81	20/04/28 05:10:30	20/04/28 05:10:30	20/04/28 05:10:30
81	20/04/28 05:10:32	20/04/28 05:10:32	20/04/28 05:10:32
7	20/04/28 05:10:34	20/04/28 05:10:34	20/04/28 05:10:34
16	20/04/28 05:10:36	20/04/28 05:10:36	20/04/28 05:10:36
16	20/04/28 05:10:38	20/04/28 05:10:38	20/04/28 05:10:38
73	20/04/28 05:10:40	20/04/28 05:10:40	20/04/28 05:10:40
16	20/04/28 05:10:42	20/04/28 05:10:43	20/04/28 05:10:42
7	20/04/28 05:10:45	20/04/28 05:10:45	20/04/28 05:10:45
7	20/04/28 05:10:47	20/04/28 05:10:49	20/04/28 05:10:49
16	20/04/28 05:10:51	20/04/28 05:10:51	20/04/28 05:10:51
23	20/04/28 05:10:53	20/04/28 05:10:53	20/04/28 05:10:53
16	20/04/28 05:10:55	20/04/28 05:10:56	20/04/28 05:10:56
98	20/04/28 05:10:58	20/04/28 05:10:58	20/04/28 05:10:58
21	20/04/28 05:11:00	20/04/28 05:11:00	20/04/28 05:11:00
76	20/04/28 05:11:02	20/04/28 05:11:02	20/04/28 05:11:02
39	20/04/28 05:11:04	20/04/28 05:11:04	20/04/28 05:11:04
72	20/04/28 05:11:06	20/04/28 05:11:06	20/04/28 05:11:06
42	20/04/28 05:11:08	20/04/28 05:11:08	20/04/28 05:11:08
72	20/04/28 05:11:10	20/04/28 05:11:10	20/04/28 05:11:10
28	20/04/28 05:11:12	20/04/28 05:11:12	20/04/28 05:11:12
120	20/04/28 05:11:14	20/04/28 05:11:14	20/04/28 05:11:14
76	20/04/28 05:11:16	20/04/28 05:11:16	20/04/28 05:11:16
117	20/04/28 05:11:18	20/04/28 05:11:18	20/04/28 05:11:18
58	20/04/28 05:11:20	20/04/28 05:11:20	20/04/28 05:11:20
136	20/04/28 05:11:22	20/04/28 05:11:22	20/04/28 05:11:22
78	20/04/28 05:11:24	20/04/28 05:11:24	20/04/28 05:11:24
28	20/04/28 05:11:26	20/04/28 05:11:26	20/04/28 05:11:26
78	20/04/28 05:11:28	20/04/28 05:11:28	20/04/28 05:11:28
95	20/04/28 05:11:30	20/04/28 05:11:30	20/04/28 05:11:30
11	20/04/28 05:11:32	20/04/28 05:11:32	20/04/28 05:11:32
147	20/04/28 05:11:34	20/04/28 05:11:34	20/04/28 05:11:34
87	20/04/28 05:11:36	20/04/28 05:11:37	20/04/28 05:11:36
117	20/04/28 05:11:39	20/04/28 05:11:40	20/04/28 05:11:40
68	20/04/28 05:11:42	20/04/28 05:11:42	20/04/28 05:11:42
142	20/04/28 05:11:44	20/04/28 05:11:44	20/04/28 05:11:44
23	20/04/28 05:11:47	20/04/28 05:11:47	20/04/28 05:11:47
65	20/04/28 05:11:49	20/04/28 05:11:49	20/04/28 05:11:49
98	20/04/28 05:11:51	20/04/28 05:11:51	20/04/28 05:11:51
158	20/04/28 05:11:53	20/04/28 05:11:53	20/04/28 05:11:53
114	20/04/28 05:11:55	20/04/28 05:11:55	20/04/28 05:11:55
87	20/04/28 05:11:57	20/04/28 05:11:57	20/04/28 05:11:57
71	20/04/28 05:11:59	20/04/28 05:11:59	20/04/28 05:11:59
68	20/04/28 05:12:01	20/04/28 05:12:01	20/04/28 05:12:01
18	20/04/28 05:12:03	20/04/28 05:12:03	20/04/28 05:12:03
25	20/04/28 05:12:05	20/04/28 05:12:05	20/04/28 05:12:05
95	20/04/28 05:12:07	20/04/28 05:12:07	20/04/28 05:12:07
25	20/04/28 05:12:08	20/04/28 05:12:09	20/04/28 05:12:09
68	20/04/28 05:12:11	20/04/28 05:12:11	20/04/28 05:12:11
109	20/04/28 05:12:13	20/04/28 05:12:13	20/04/28 05:12:13
109	20/04/28 05:12:15	20/04/28 05:12:15	20/04/28 05:12:15
151	20/04/28 05:12:17	20/04/28 05:12:17	20/04/28 05:12:17
5	20/04/28 05:12:19	20/04/28 05:12:19	20/04/28 05:12:19
91	20/04/28 05:12:21	20/04/28 05:12:21	20/04/28 05:12:21
18	20/04/28 05:12:23	20/04/28 05:12:23	20/04/28 05:12:23
94	20/04/28 05:12:25	20/04/28 05:12:27	20/04/28 05:12:27
147	20/04/28 05:12:29	20/04/28 05:12:29	20/04/28 05:12:29
147	20/04/28 05:12:31	20/04/28 05:12:31	20/04/28 05:12:31
11	20/04/28 05:12:33	20/04/28 05:12:33	20/04/28 05:12:33
99	20/04/28 05:12:35	20/04/28 05:12:35	20/04/28 05:12:35
67	20/04/28 05:12:37	20/04/28 05:12:37	20/04/28 05:12:37
103	20/04/28 05:12:39	20/04/28 05:12:39	20/04/28 05:12:39
68	20/04/28 05:12:41	20/04/28 05:12:41	20/04/28 05:12:41
103	20/04/28 05:12:43	20/04/28 05:12:43	20/04/28 05:12:43
103	20/04/28 05:12:45	20/04/28 05:12:45	20/04/28 05:12:45
103	20/04/28 05:12:47	20/04/28 05:12:47	20/04/28 05:12:47
68	20/04/28 05:12:49	20/04/28 05:12:50	20/04/28 05:12:50
101	20/04/28 05:12:52	20/04/28 05:12:52	20/04/28 05:12:52
117	20/04/28 05:12:54	20/04/28 05:12:54	20/04/28 05:12:54
65	20/04/28 05:12:56	20/04/28 05:12:56	20/04/28 05:12:56
42	20/04/28 05:12:58	20/04/28 05:12:58	20/04/28 05:12:58
10	20/04/28 05:13:00	20/04/28 05:13:00	20/04/28 05:13:00
86	20/04/28 05:13:02	20/04/28 05:13:02	20/04/28 05:13:02
1	20/04/28 05:13:04	20/04/28 05:13:04	20/04/28 05:13:04
95	20/04/28 05:13:06	20/04/28 05:13:06	20/04/28 05:13:06
109	20/04/28 05:13:08	20/04/28 05:13:09	20/04/28 05:13:09
135	20/04/28 05:13:11	20/04/28 05:13:11	20/04/28 05:13:11
126	20/04/28 05:13:13	20/04/28 05:13:13	20/04/28 05:13:13
11	20/04/28 05:15:44	20/04/28 05:15:44	20/04/28 05:15:44
143	20/04/28 05:13:17	20/04/28 05:13:17	20/04/28 05:13:17
11	20/04/28 05:13:19	20/04/28 05:13:19	20/04/28 05:13:19
44	20/04/28 05:13:21	20/04/28 05:13:21	20/04/28 05:13:21
88	20/04/28 05:13:23	20/04/28 05:13:24	20/04/28 05:13:23
151	20/04/28 05:13:26	20/04/28 05:13:26	20/04/28 05:13:26
89	20/04/28 05:13:28	20/04/28 05:13:32	20/04/28 05:13:32
89	20/04/28 05:13:34	20/04/28 05:13:34	20/04/28 05:13:34
89	20/04/28 05:13:36	20/04/28 05:13:36	20/04/28 05:13:36
89	20/04/28 05:13:38	20/04/28 05:13:38	20/04/28 05:13:38
79	20/04/28 05:13:40	20/04/28 05:13:40	20/04/28 05:13:40
22	20/04/28 05:13:42	20/04/28 05:13:42	20/04/28 05:13:42
151	20/04/28 05:13:44	20/04/28 05:13:44	20/04/28 05:13:44
126	20/04/28 05:13:46	20/04/28 05:13:46	20/04/28 05:13:46
108	20/04/28 05:13:48	20/04/28 05:13:48	20/04/28 05:13:48
40	20/04/28 05:13:50	20/04/28 05:13:50	20/04/28 05:13:50
74	20/04/28 05:13:52	20/04/28 05:13:52	20/04/28 05:13:52
152	20/04/28 05:13:54	20/04/28 05:13:54	20/04/28 05:13:54
157	20/04/28 05:13:56	20/04/28 05:13:56	20/04/28 05:13:56
158	20/04/28 05:13:58	20/04/28 05:13:58	20/04/28 05:13:58
19	20/04/28 05:14:00	20/04/28 05:14:00	20/04/28 05:14:00
96	20/04/28 05:14:02	20/04/28 05:14:02	20/04/28 05:14:02
19	20/04/28 05:14:04	20/04/28 05:14:04	20/04/28 05:14:04
67	20/04/28 05:14:06	20/04/28 05:14:06	20/04/28 05:14:06
87	20/04/28 05:14:08	20/04/28 05:14:08	20/04/28 05:14:08
117	20/04/28 05:14:10	20/04/28 05:14:10	20/04/28 05:14:10
68	20/04/28 05:14:12	20/04/28 05:14:12	20/04/28 05:14:12
91	20/04/28 05:14:14	20/04/28 05:14:14	20/04/28 05:14:14
113	20/04/28 05:14:16	20/04/28 05:14:16	20/04/28 05:14:16
