floorId	partitionId	location_x	location_y	timeStamp
1	97	336.53585426801055	287.8812247794712	20/04/28 05:17:21
1	NULL	338.7950920964135	285.0161233311299	20/04/28 05:17:22
1	97	336.53585426801055	287.8812247794712	20/04/28 05:17:23
1	97	336.53585426801055	287.8812247794712	20/04/28 05:17:24
1	97	336.53585426801055	287.8812247794712	20/04/28 05:17:25
1	97	336.53585426801055	287.8812247794712	20/04/28 05:17:26
1	97	336.53585426801055	287.8812247794712	20/04/28 05:17:27
1	97	336.53585426801055	287.8812247794712	20/04/28 05:17:28
1	97	336.53585426801055	287.8812247794712	20/04/28 05:17:29
1	97	336.53585426801055	287.8812247794712	20/04/28 05:17:30
1	97	336.53585426801055	287.8812247794712	20/04/28 05:17:31
1	97	337.5607221213916	286.380934101518	20/04/28 05:17:32
1	97	336.53585426801055	287.8812247794712	20/04/28 05:17:33
1	97	336.53585426801055	287.8812247794712	20/04/28 05:17:34
1	97	336.53585426801055	287.8812247794712	20/04/28 05:17:35
1	97	336.53585426801055	287.8812247794712	20/04/28 05:17:36
1	NULL	338.7950920964135	285.0161233311299	20/04/28 05:17:37
1	NULL	338.7950920964135	285.0161233311299	20/04/28 05:17:38
1	97	339.4344475351989	287.82523322481603	20/04/28 05:17:39
1	97	337.5607221213916	286.380934101518	20/04/28 05:17:40
1	97	336.53585426801055	287.8812247794712	20/04/28 05:17:41
1	97	336.53585426801055	287.8812247794712	20/04/28 05:17:42
1	97	336.53585426801055	287.8812247794712	20/04/28 05:17:43
1	97	336.53585426801055	287.8812247794712	20/04/28 05:17:44
1	97	336.53585426801055	287.8812247794712	20/04/28 05:17:45
1	97	336.53585426801055	287.8812247794712	20/04/28 05:17:46
1	97	336.53585426801055	287.8812247794712	20/04/28 05:17:47
1	97	336.53585426801055	287.8812247794712	20/04/28 05:17:48
1	97	336.53585426801055	287.8812247794712	20/04/28 05:17:49
1	97	336.53585426801055	287.8812247794712	20/04/28 05:17:50
1	97	336.53585426801055	287.8812247794712	20/04/28 05:17:51
1	97	336.53585426801055	287.8812247794712	20/04/28 05:17:52
1	97	336.53585426801055	287.8812247794712	20/04/28 05:17:53
1	97	336.53585426801055	287.8812247794712	20/04/28 05:17:54
1	97	336.53585426801055	287.8812247794712	20/04/28 05:17:55
1	97	336.53585426801055	287.8812247794712	20/04/28 05:17:56
1	97	336.53585426801055	287.8812247794712	20/04/28 05:17:57
1	97	336.53585426801055	287.8812247794712	20/04/28 05:17:58
1	97	336.53585426801055	287.8812247794712	20/04/28 05:17:59
1	97	336.53585426801055	287.8812247794712	20/04/28 05:18:00
1	97	336.53585426801055	287.8812247794712	20/04/28 05:18:01
1	97	336.53585426801055	287.8812247794712	20/04/28 05:18:02
1	97	336.53585426801055	287.8812247794712	20/04/28 05:18:03
1	97	336.53585426801055	287.8812247794712	20/04/28 05:18:04
1	97	336.53585426801055	287.8812247794712	20/04/28 05:18:05
1	97	336.53585426801055	287.8812247794712	20/04/28 05:18:06
1	97	340.629387065862	286.9381600623282	20/04/28 05:18:07
1	97	336.53585426801055	287.8812247794712	20/04/28 05:18:08
1	97	339.4344475351989	287.82523322481603	20/04/28 05:18:09
1	97	339.4344475351989	287.82523322481603	20/04/28 05:18:10
1	97	336.53585426801055	287.8812247794712	20/04/28 05:18:11
1	97	336.53585426801055	287.8812247794712	20/04/28 05:18:12
1	97	336.53585426801055	287.8812247794712	20/04/28 05:18:13
1	97	340.629387065862	286.9381600623282	20/04/28 05:18:14
1	97	336.53585426801055	287.8812247794712	20/04/28 05:18:15
1	97	336.53585426801055	287.8812247794712	20/04/28 05:18:16
1	97	336.53585426801055	287.8812247794712	20/04/28 05:18:17
1	97	336.93802742136114	291.11775827377863	20/04/28 05:18:18
1	97	336.93802742136114	291.11775827377863	20/04/28 05:18:19
1	97	336.93802742136114	291.11775827377863	20/04/28 05:18:20
3	100	336.93802742136114	291.11775827377863	20/04/28 05:18:21
1	97	336.93802742136114	291.11775827377863	20/04/28 05:18:22
1	97	336.93802742136114	291.11775827377863	20/04/28 05:18:23
1	97	336.93802742136114	291.11775827377863	20/04/28 05:18:24
1	93	336.97010371753987	294.31210798502894	20/04/28 05:18:25
1	97	336.93802742136114	291.11775827377863	20/04/28 05:18:26
1	97	336.93802742136114	291.11775827377863	20/04/28 05:18:27
1	97	338.71348369947503	290.0443604866455	20/04/28 05:18:28
1	97	339.4305406561234	290.4854027362428	20/04/28 05:18:29
1	97	338.71348369947503	290.0443604866455	20/04/28 05:18:30
1	97	340.7799935809384	292.30431416119154	20/04/28 05:18:31
1	97	338.4871677637345	289.2428552941747	20/04/28 05:18:32
3	100	340.7799935809384	292.30431416119154	20/04/28 05:18:33
1	97	336.93802742136114	291.11775827377863	20/04/28 05:18:34
1	97	340.7799935809384	292.30431416119154	20/04/28 05:18:35
3	100	340.06293662429005	291.86327191159415	20/04/28 05:18:36
1	97	339.4305406561234	290.4854027362428	20/04/28 05:18:37
1	83	342.55544985905226	291.2309163740584	20/04/28 05:18:38
1	97	340.7799935809384	292.30431416119154	20/04/28 05:18:39
1	97	340.7799935809384	292.30431416119154	20/04/28 05:18:40
3	100	337.08552498854306	291.31346665974314	20/04/28 05:18:41
1	97	336.93802742136114	291.11775827377863	20/04/28 05:18:42
1	97	339.4305406561234	290.4854027362428	20/04/28 05:18:43
1	97	336.93802742136114	291.11775827377863	20/04/28 05:18:44
1	97	336.93802742136114	291.11775827377863	20/04/28 05:18:45
3	100	340.7799935809384	292.30431416119154	20/04/28 05:18:46
1	97	336.93802742136114	291.11775827377863	20/04/28 05:18:47
1	97	336.93802742136114	291.11775827377863	20/04/28 05:18:48
