floorId	partitionId	location_x	location_y	timeStamp
3	42	350.8504155226365	255.55820699744214	20/04/28 05:17:35
3	42	350.86145652538795	255.54902792861466	20/04/28 05:17:35
3	42	350.81611785175215	255.46757258287337	20/04/28 05:17:35
3	42	350.7775880540278	255.51716208792516	20/04/28 05:17:35
3	42	350.67250825079003	255.70506568574942	20/04/28 05:17:35
3	42	350.6583876192888	255.70329127225634	20/04/28 05:17:36
3	42	350.64143973250486	255.79193498416058	20/04/28 05:17:36
3	42	350.66851769945066	255.94125736468308	20/04/28 05:17:36
3	42	350.8826662982951	255.92469857511065	20/04/28 05:17:36
3	42	350.8846887435113	255.9156206034334	20/04/28 05:17:36
3	42	350.9459748953659	256.1904438515763	20/04/28 05:17:36
3	42	350.95983983160176	256.0742486313111	20/04/28 05:17:36
3	42	350.96982410452296	255.94584777654978	20/04/28 05:17:36
3	42	351.0272085381052	255.97197522672428	20/04/28 05:17:36
3	42	351.023044971785	255.99698279959406	20/04/28 05:17:36
3	42	350.7620648034065	256.13065278391997	20/04/28 05:17:37
3	42	350.80967062982006	256.1266246294649	20/04/28 05:17:37
3	42	350.70534683673577	255.97513296988532	20/04/28 05:17:37
3	42	350.63137773044485	255.77404072184285	20/04/28 05:17:37
3	42	350.6133157419239	255.6481844076639	20/04/28 05:17:37
3	42	350.33569367903937	255.7139699524268	20/04/28 05:17:37
3	42	350.324148429057	255.71377485075428	20/04/28 05:17:37
3	42	350.3427003754094	255.67453289529712	20/04/28 05:17:37
3	42	350.3700743987226	255.7718786977822	20/04/28 05:17:37
3	42	350.36981377790863	255.77182732422904	20/04/28 05:17:37
3	42	350.36935732630155	255.77256859839716	20/04/28 05:17:38
3	42	350.20127428644963	255.90688311002964	20/04/28 05:17:38
3	42	350.2089858612755	255.90574356211607	20/04/28 05:17:38
3	42	350.42988076803175	255.91301007687505	20/04/28 05:17:38
3	42	350.34192289830963	255.9721133429278	20/04/28 05:17:38
3	42	350.34059333067813	255.95678981208766	20/04/28 05:17:38
3	42	350.44642816574054	255.85552914809153	20/04/28 05:17:38
3	42	350.56819269723417	255.81691038067007	20/04/28 05:17:38
3	42	350.58071704796527	255.9020451408949	20/04/28 05:17:38
3	42	350.56422929269104	255.89838615518585	20/04/28 05:17:39
3	42	350.43785246611276	255.90813271683862	20/04/28 05:17:39
3	42	350.3927753196206	256.05312422439823	20/04/28 05:17:39
3	42	350.3049897971601	255.86292924540174	20/04/28 05:17:39
3	42	350.2596753652863	256.09114199948795	20/04/28 05:17:39
3	42	350.0403057796212	256.01713959918794	20/04/28 05:17:39
3	42	349.8465075388417	255.96499959897525	20/04/28 05:17:39
3	42	349.6552613852393	256.0824875180306	20/04/28 05:17:39
3	42	349.80011206261287	255.93743562045614	20/04/28 05:17:39
3	42	349.8903864954079	255.80293123759557	20/04/28 05:17:39
3	42	349.8814714369951	255.79804294047855	20/04/28 05:17:40
3	42	349.89339430192007	255.87727693042385	20/04/28 05:17:40
3	42	349.7184977013864	255.98575955199723	20/04/28 05:17:40
3	42	349.8104579824264	256.24966424321207	20/04/28 05:17:40
3	42	349.6155774306161	256.1377984945043	20/04/28 05:17:40
3	42	349.60383861562167	255.9747545539513	20/04/28 05:17:40
3	42	349.52010221287634	256.05595793953086	20/04/28 05:17:40
3	42	349.65075668882315	255.90539083830726	20/04/28 05:17:40
3	42	349.47743881150046	255.71838794506448	20/04/28 05:17:40
3	42	349.4545259298584	255.54204851624553	20/04/28 05:17:40
3	42	349.50351358505975	255.5505475110027	20/04/28 05:17:41
3	42	349.5354843872759	255.53620339822052	20/04/28 05:17:41
3	42	349.4649072281001	255.48279002486373	20/04/28 05:17:41
3	42	349.5891069903634	255.2517783270022	20/04/28 05:17:41
3	42	349.63586313788335	255.40597008031696	20/04/28 05:17:41
3	42	349.52894011164545	255.65796466316078	20/04/28 05:17:41
3	42	349.47536844319734	255.7292400090451	20/04/28 05:17:41
3	42	349.4761318810038	255.71475186493717	20/04/28 05:17:41
3	42	349.50168454691885	255.68342997227242	20/04/28 05:17:41
3	42	349.5172422218957	255.50914995583125	20/04/28 05:17:42
3	42	349.65791910917955	255.40221778229184	20/04/28 05:17:42
3	42	349.6120904637637	255.2854993225238	20/04/28 05:17:42
3	42	349.40555932956437	255.29962715500892	20/04/28 05:17:42
3	42	349.50799919084983	255.16355149518634	20/04/28 05:17:42
3	42	349.56281850714527	255.43994145430585	20/04/28 05:17:42
3	42	349.4877502754388	255.4296555629624	20/04/28 05:17:42
3	42	349.3669116302013	255.2018108780932	20/04/28 05:17:42
3	42	349.3603901062972	255.09611320314207	20/04/28 05:17:42
3	42	349.3656031065416	255.07073255942652	20/04/28 05:17:42
3	42	349.3077575118488	255.24288416811595	20/04/28 05:17:43
3	42	349.26236771882674	255.38246784417322	20/04/28 05:17:43
3	42	349.27071056831494	255.27921500522473	20/04/28 05:17:43
3	42	349.4783981140663	255.4515800351812	20/04/28 05:17:43
3	42	349.2418057158083	255.30677215782205	20/04/28 05:17:43
3	42	349.21631739419473	255.3194479041707	20/04/28 05:17:43
3	42	349.0974317894518	255.20293475460366	20/04/28 05:17:43
3	42	349.0198782349787	255.21275128169142	20/04/28 05:17:43
3	42	349.178797376871	255.12583172994198	20/04/28 05:17:43
3	42	349.17360960042043	255.08676708242032	20/04/28 05:17:43
3	42	349.1763277945661	255.1539555691172	20/04/28 05:17:44
3	42	349.3058091579081	255.28321705014312	20/04/28 05:17:44
3	42	349.2811843356131	255.22409874658896	20/04/28 05:17:44
3	42	349.1435420716965	255.3455865405505	20/04/28 05:17:44
3	42	349.1695935273432	255.18456120568254	20/04/28 05:17:44
3	42	348.97276809367696	255.01612747475002	20/04/28 05:17:44
3	42	348.7518746421694	255.2028611911261	20/04/28 05:17:44
3	42	348.54069232148953	255.1693473135336	20/04/28 05:17:44
3	42	348.4380182786994	255.29228050598738	20/04/28 05:17:44
3	42	348.1946077462476	255.43752718775704	20/04/28 05:17:45
3	42	348.42323045785497	255.5633475340126	20/04/28 05:17:45
3	42	348.33164862717877	255.65670282448573	20/04/28 05:17:45
3	42	348.3876584354284	255.72280065101347	20/04/28 05:17:45
3	42	348.4368634972047	255.9412193272713	20/04/28 05:17:45
3	42	348.25707137139966	255.95523872430303	20/04/28 05:17:45
3	42	348.0950392507263	256.1423937235691	20/04/28 05:17:45
3	42	348.0486488525621	256.05511918162625	20/04/28 05:17:45
3	42	348.0491734495506	256.0531638020291	20/04/28 05:17:45
3	42	348.156887143537	255.78400223036937	20/04/28 05:17:45
3	42	348.2494051198783	255.60743492298542	20/04/28 05:17:46
3	42	348.29814056971895	255.76615641449837	20/04/28 05:17:46
3	42	348.1395243554541	255.9625129055299	20/04/28 05:17:46
3	42	347.85480338060455	255.90586214807385	20/04/28 05:17:46
3	42	347.8944682459974	256.09010159672175	20/04/28 05:17:46
3	42	347.8184646196913	256.16050234864923	20/04/28 05:17:46
3	42	347.74346258999805	256.1835980969436	20/04/28 05:17:46
3	42	347.8023710951871	256.3547353206377	20/04/28 05:17:46
3	42	347.7499915071003	256.4122090589397	20/04/28 05:17:46
3	42	347.91674301840857	256.35593190084944	20/04/28 05:17:46
3	42	348.0864731878112	256.341534398728	20/04/28 05:17:47
3	42	348.10033305316233	256.19160469645544	20/04/28 05:17:47
3	42	348.13323998978296	256.1902875827992	20/04/28 05:17:47
3	42	348.14523788379444	256.28855832823604	20/04/28 05:17:47
3	42	348.1163497902818	256.29652606038223	20/04/28 05:17:47
3	42	347.9578026432991	256.29143837508695	20/04/28 05:17:47
3	42	347.95285008243843	256.25435606510996	20/04/28 05:17:47
3	42	348.12965651074893	256.0154411809958	20/04/28 05:17:47
3	42	348.1346448195512	256.300465330036	20/04/28 05:17:47
3	42	348.14103818224083	256.29613956714184	20/04/28 05:17:48
3	42	347.99962179375854	256.29093502148817	20/04/28 05:17:48
3	42	348.24993096227115	256.23808144139764	20/04/28 05:17:48
3	42	348.18753033711437	256.4322326512323	20/04/28 05:17:48
3	42	348.1889639477796	256.4335001342619	20/04/28 05:17:48
3	42	348.11863901831856	256.3596270206996	20/04/28 05:17:48
3	42	347.96125642011964	256.4247233000228	20/04/28 05:17:48
3	42	347.98005343810286	256.4150812408853	20/04/28 05:17:48
3	42	347.84027492406136	256.3588758957137	20/04/28 05:17:48
3	42	347.8255244380417	256.46917462671473	20/04/28 05:17:48
3	42	347.84423774430695	256.378630089175	20/04/28 05:17:49
3	42	347.84300472140455	256.3926372484061	20/04/28 05:17:49
3	42	347.99542790409055	256.45692565211453	20/04/28 05:17:49
3	42	347.8812402506527	256.5276197640801	20/04/28 05:17:49
3	42	347.78563450139006	256.27447081920155	20/04/28 05:17:49
3	42	347.6143371586451	256.2657585765709	20/04/28 05:17:49
3	42	347.6143371586451	256.2657585765709	20/04/28 05:17:49
3	42	347.51076335931884	256.3623132998744	20/04/28 05:17:49
3	42	347.50642062110353	256.36758900764534	20/04/28 05:17:49
3	42	347.3748321501862	256.477721316996	20/04/28 05:17:49
3	42	347.157341780342	256.4249063731815	20/04/28 05:17:50
3	42	347.1916081097968	256.5776393489752	20/04/28 05:17:50
3	42	347.2157185465075	256.7117000122394	20/04/28 05:17:50
3	42	347.3864197274059	256.77787889876805	20/04/28 05:17:50
3	42	347.4066828779734	256.7354832682622	20/04/28 05:17:50
3	42	347.38345479788364	256.52924396024747	20/04/28 05:17:50
3	42	347.3222957932093	256.60923265878876	20/04/28 05:17:50
3	42	347.48018129318814	256.45632752011113	20/04/28 05:17:50
3	42	347.36114119356745	256.4745785503861	20/04/28 05:17:50
3	42	347.3787015569015	256.4999467999731	20/04/28 05:17:51
3	42	347.4956924300905	256.52040774481304	20/04/28 05:17:51
3	42	347.5152751043507	256.4229695587916	20/04/28 05:17:51
3	42	347.56251831449293	256.39294212482855	20/04/28 05:17:51
3	42	347.58644930967705	256.4252103440785	20/04/28 05:17:51
3	42	347.7272040328704	256.3291239451396	20/04/28 05:17:51
3	42	347.6981035987251	256.3216665356291	20/04/28 05:17:51
3	42	347.61849096190485	256.32168123974435	20/04/28 05:17:51
3	42	347.67141235071205	256.05577890523665	20/04/28 05:17:51
3	42	347.6541424043763	255.9981150347515	20/04/28 05:17:51
3	42	347.87651842087297	255.8834517945549	20/04/28 05:17:52
3	42	347.76634902915714	255.62988140572372	20/04/28 05:17:52
3	42	347.7630679333016	255.63281595320458	20/04/28 05:17:52
3	42	347.9960329044859	255.51144795889567	20/04/28 05:17:52
3	42	347.99841801130026	255.4884585073103	20/04/28 05:17:52
3	42	347.9687805667485	255.44365308278614	20/04/28 05:17:52
3	42	347.83644103144616	255.6906591241415	20/04/28 05:17:52
3	42	347.9374378390544	255.47893784056873	20/04/28 05:17:52
3	42	347.97816173122334	255.48195028804435	20/04/28 05:17:52
3	42	348.0946296603906	255.44710473647046	20/04/28 05:17:53
3	42	348.1957052817321	255.53399868195103	20/04/28 05:17:53
3	42	348.13372095912445	255.29439828132237	20/04/28 05:17:53
3	42	348.3304951343089	255.13832704944775	20/04/28 05:17:53
3	42	348.5234674745022	255.35740623037947	20/04/28 05:17:53
3	42	348.5744661344017	255.45044689010692	20/04/28 05:17:53
3	42	348.5516028687105	255.36408262770036	20/04/28 05:17:53
3	42	348.5433514372708	255.53924276261992	20/04/28 05:17:53
3	42	348.40481429202833	255.55574790853112	20/04/28 05:17:53
3	42	348.3342505968624	255.5133824043315	20/04/28 05:17:53
3	42	348.32912251153533	255.59376599017662	20/04/28 05:17:54
3	42	348.23770443900906	255.55484043581046	20/04/28 05:17:54
3	42	348.15104266958593	255.5061280643861	20/04/28 05:17:54
3	42	348.0982795726723	255.56984302539797	20/04/28 05:17:54
3	42	347.8741332959097	255.4908843946667	20/04/28 05:17:54
3	42	347.9678689964123	255.43930221986543	20/04/28 05:17:54
3	42	348.13384543844063	255.39367973371654	20/04/28 05:17:54
3	42	348.358891108196	255.35761399741955	20/04/28 05:17:54
3	42	348.59366957186484	255.25277449766472	20/04/28 05:17:54
3	42	348.626430703988	255.30561032273337	20/04/28 05:17:54
3	42	348.67924940999234	255.33313848197272	20/04/28 05:17:55
3	42	348.56213147672196	255.54730304899536	20/04/28 05:17:55
3	42	348.52125474786163	255.6857892452277	20/04/28 05:17:55
3	42	348.5215013090481	255.68797752907	20/04/28 05:17:55
3	42	348.69358943817815	255.88751986642785	20/04/28 05:17:55
3	42	348.68255016402264	255.89602712103542	20/04/28 05:17:55
3	42	348.87034905650336	256.1006166258376	20/04/28 05:17:55
3	42	349.01141915405174	256.14298758125	20/04/28 05:17:55
3	42	348.94014357852006	256.42029918973753	20/04/28 05:17:55
3	42	349.0287581725491	256.6963532304759	20/04/28 05:17:56
3	42	348.9602878849158	256.6686664437638	20/04/28 05:17:56
3	42	348.83088683704034	256.561319453117	20/04/28 05:17:56
3	42	348.7025131736986	256.70536904106666	20/04/28 05:17:56
3	42	348.6811143743002	256.53530635257965	20/04/28 05:17:56
3	42	348.7340123392765	256.573345098518	20/04/28 05:17:56
3	42	348.87354905311616	256.39804756068327	20/04/28 05:17:56
3	42	348.9361526246924	256.3495645831185	20/04/28 05:17:56
3	42	349.08328149308534	256.29613327426415	20/04/28 05:17:56
3	42	349.14483765206813	256.17228807090765	20/04/28 05:17:56
3	42	349.13335041726947	256.21940008860395	20/04/28 05:17:57
3	42	348.9836817829396	256.12477064933256	20/04/28 05:17:57
3	42	349.0787480107188	256.0738547355115	20/04/28 05:17:57
3	42	349.1631383300864	256.2224775758138	20/04/28 05:17:57
3	42	349.1480773971956	256.2557906646801	20/04/28 05:17:57
3	42	349.3808162967577	256.21124554515734	20/04/28 05:17:57
3	42	349.35532896369347	256.31506861610075	20/04/28 05:17:57
3	42	349.34906423124573	256.3049647549731	20/04/28 05:17:57
3	42	349.44138972889886	256.43132445545734	20/04/28 05:17:57
3	42	349.3600090618285	256.44574634338557	20/04/28 05:17:57
3	42	349.38788630943384	256.4645595764248	20/04/28 05:17:58
3	42	349.39801929190213	256.4480969869551	20/04/28 05:17:58
3	42	349.4045405466176	256.45469340330567	20/04/28 05:17:58
3	42	349.2919565042845	256.56707930601226	20/04/28 05:17:58
3	42	349.2399750400702	256.8025766473013	20/04/28 05:17:58
3	42	349.26478204021237	256.8034362302772	20/04/28 05:17:58
3	42	349.280748951921	256.51081915782163	20/04/28 05:17:58
3	42	349.23892818761504	256.3979400120739	20/04/28 05:17:58
3	42	349.3907364422245	256.2939693348213	20/04/28 05:17:58
3	42	349.2322954923151	256.2885627527664	20/04/28 05:17:59
3	42	349.277154441479	256.19463834918383	20/04/28 05:17:59
3	42	349.2299903866012	256.2578293178554	20/04/28 05:17:59
3	42	349.3130349260315	256.2116705004502	20/04/28 05:17:59
3	42	349.0649008822327	256.2140543761956	20/04/28 05:17:59
3	42	348.9955643687494	256.15504051891463	20/04/28 05:17:59
3	42	348.9823625571615	256.1413217848047	20/04/28 05:17:59
3	42	349.04702881340376	256.1889434295779	20/04/28 05:17:59
3	42	348.8683312063195	256.1610036540166	20/04/28 05:17:59
3	42	348.73757460380546	256.0573596615577	20/04/28 05:17:59
3	42	348.61257373165023	255.8696251183808	20/04/28 05:18:00
3	42	348.51739435442124	255.80735414793992	20/04/28 05:18:00
3	42	348.5649717650879	255.72286717174927	20/04/28 05:18:00
3	42	348.62969712371125	255.7345770797659	20/04/28 05:18:00
3	42	348.6294590142575	255.7186421223897	20/04/28 05:18:00
3	42	348.8340459019646	255.54616311216844	20/04/28 05:18:00
3	42	348.8267503140062	255.5529330163852	20/04/28 05:18:00
3	42	348.72699091090146	255.53107945916867	20/04/28 05:18:00
3	42	348.59643605800204	255.58697581694176	20/04/28 05:18:00
3	42	348.61163241968086	255.534431674136	20/04/28 05:18:00
3	42	348.72943264668197	255.35855500351937	20/04/28 05:18:01
3	42	348.79530610268097	255.23505649310954	20/04/28 05:18:01
3	42	348.91125673505377	255.01083409183485	20/04/28 05:18:01
3	42	348.6830713476664	254.97352738070887	20/04/28 05:18:01
3	42	348.6533273145511	255.07948413983556	20/04/28 05:18:01
3	42	348.62945134590166	254.98358011247268	20/04/28 05:18:01
3	42	348.61681118827585	255.09425935582675	20/04/28 05:18:01
3	42	348.609852968372	254.8292815456948	20/04/28 05:18:01
3	42	348.6387087399327	255.10671290766058	20/04/28 05:18:01
3	42	348.8171735921117	255.16317459208713	20/04/28 05:18:02
3	42	348.6806408424013	255.2339039830984	20/04/28 05:18:02
3	42	348.8442782228432	255.22850280458835	20/04/28 05:18:02
3	42	348.8527426886167	255.49523517574173	20/04/28 05:18:02
3	42	348.78083524725946	255.49889651679524	20/04/28 05:18:02
3	42	348.8889487234793	255.31931861846653	20/04/28 05:18:02
3	42	348.9738646819358	255.2859939432564	20/04/28 05:18:02
3	42	348.9746896034623	255.27869060653418	20/04/28 05:18:02
3	42	349.22606629695105	255.18345418623292	20/04/28 05:18:02
3	42	349.1937290511224	255.41767141862113	20/04/28 05:18:02
3	42	349.39977276259	255.40611048016896	20/04/28 05:18:03
3	42	349.2361462217649	255.50823632998834	20/04/28 05:18:03
3	42	349.24263281277024	255.49883741941937	20/04/28 05:18:03
3	42	349.07513549057416	255.57978280892078	20/04/28 05:18:03
3	42	349.1347837940331	255.38061677578014	20/04/28 05:18:03
3	42	348.9104038452865	255.2610200068095	20/04/28 05:18:03
3	42	348.89529389188675	255.2508971011315	20/04/28 05:18:03
3	42	349.0152877110494	255.305689698968	20/04/28 05:18:03
3	42	349.0150627155066	255.3620213791354	20/04/28 05:18:03
3	42	349.05431879825494	255.29992494343284	20/04/28 05:18:04
3	42	349.1352711306137	255.56091180684112	20/04/28 05:18:04
3	42	349.1401582516824	255.51226529318023	20/04/28 05:18:04
3	42	349.09748653543755	255.4287473349782	20/04/28 05:18:04
3	42	348.85821338391077	255.48218378122542	20/04/28 05:18:04
3	42	348.73918400077457	255.60507096166222	20/04/28 05:18:04
3	42	348.6925342319287	255.46094267183125	20/04/28 05:18:04
3	42	348.6850420694839	255.450786326991	20/04/28 05:18:04
3	42	348.6668923558462	255.49973929938096	20/04/28 05:18:04
3	42	348.429264933566	255.34464323351202	20/04/28 05:18:04
3	42	348.65292388900565	255.32538939439314	20/04/28 05:18:05
3	42	348.8996475889137	255.392702310046	20/04/28 05:18:05
3	42	348.76453889337404	255.5481927047957	20/04/28 05:18:05
3	42	348.72650586153395	255.64510825706526	20/04/28 05:18:05
3	42	348.76327269985325	255.7053025776421	20/04/28 05:18:05
3	42	348.6404559748298	255.5064312256483	20/04/28 05:18:05
3	42	348.6404559748298	255.5064312256483	20/04/28 05:18:05
3	42	348.6404559748298	255.5064312256483	20/04/28 05:18:05
3	42	348.64003210894117	255.50002102373628	20/04/28 05:18:05
3	42	348.5823110431298	255.4636821295523	20/04/28 05:18:05
3	42	348.59619196710617	255.51138272444092	20/04/28 05:18:06
3	42	348.48537460893016	255.5465522589906	20/04/28 05:18:06
3	42	348.6922112205672	255.3565437483488	20/04/28 05:18:06
3	42	348.6509891016395	255.29182328870812	20/04/28 05:18:06
3	42	348.53543021353863	255.34098199649029	20/04/28 05:18:06
3	42	348.4576914866091	255.27018893920027	20/04/28 05:18:06
3	42	348.7176344527282	255.16742022238404	20/04/28 05:18:06
3	42	348.476961506563	254.99143071741904	20/04/28 05:18:06
3	42	348.34660365880785	254.90364880643864	20/04/28 05:18:06
3	42	348.39509415263785	254.85493160166325	20/04/28 05:18:07
3	42	348.4955764932892	255.0992246144452	20/04/28 05:18:07
3	42	348.58865969616	254.9391843466099	20/04/28 05:18:07
3	42	348.6898334800119	254.84330005995116	20/04/28 05:18:07
3	42	348.5947849923614	254.84971919186475	20/04/28 05:18:07
3	42	348.8352461504973	254.73690902276056	20/04/28 05:18:07
3	42	348.879766880884	254.72807783674202	20/04/28 05:18:07
3	42	349.1629206575701	254.73689345188907	20/04/28 05:18:07
3	42	349.1627737536324	254.73710486039613	20/04/28 05:18:07
3	42	349.2231862114487	254.75095746059245	20/04/28 05:18:07
3	42	349.1771333821272	254.9459997874291	20/04/28 05:18:08
3	42	349.1818678654486	254.8108577928435	20/04/28 05:18:08
3	42	349.0089074603408	254.84382804129905	20/04/28 05:18:08
3	42	348.96870459364044	254.87774332307592	20/04/28 05:18:08
3	42	349.0031057514496	254.77484165207255	20/04/28 05:18:08
3	42	349.0455730479381	254.92024453284404	20/04/28 05:18:08
3	42	348.84011727332853	254.90727986975818	20/04/28 05:18:08
3	42	348.9082632883209	254.83962863102053	20/04/28 05:18:08
3	42	349.0658597170962	254.62699697030789	20/04/28 05:18:08
3	42	349.1689177257007	254.60688005031025	20/04/28 05:18:08
3	42	349.0999544496505	254.74448380947305	20/04/28 05:18:09
3	42	349.01872450038627	254.72342459867474	20/04/28 05:18:09
3	42	348.95383296461	254.7429358963616	20/04/28 05:18:09
3	42	348.97972009329806	254.8675628285462	20/04/28 05:18:09
3	42	349.0237395892379	254.91020604191496	20/04/28 05:18:09
3	42	348.78588756160866	254.88109206021903	20/04/28 05:18:09
3	42	348.9577915722809	255.00003945990522	20/04/28 05:18:09
3	42	348.9592028895016	255.00847759002127	20/04/28 05:18:09
3	42	349.1495423247184	255.1579807591662	20/04/28 05:18:09
3	42	349.14277880429665	255.1880021748414	20/04/28 05:18:10
3	42	349.09771668365624	255.1454823932336	20/04/28 05:18:10
3	42	349.25205134242094	255.12189572305755	20/04/28 05:18:10
3	42	349.27011188522306	255.0811977759098	20/04/28 05:18:10
3	42	349.3600232220023	255.07303080226123	20/04/28 05:18:10
3	42	349.065022708069	255.09652076943618	20/04/28 05:18:10
3	42	349.2980991291303	255.19269985169265	20/04/28 05:18:10
3	42	349.14008892736445	255.33571883401365	20/04/28 05:18:10
3	42	349.2275357957285	255.28666294930233	20/04/28 05:18:10
3	42	349.1722375120566	255.39732593410784	20/04/28 05:18:10
3	42	348.97712491697143	255.28407927410169	20/04/28 05:18:11
3	42	348.87216209226364	255.33054378863247	20/04/28 05:18:11
3	42	348.8858776713435	255.0823284967184	20/04/28 05:18:11
3	42	348.9990640982027	255.0298794333213	20/04/28 05:18:11
3	42	349.2424955749166	255.0498638557881	20/04/28 05:18:11
3	42	349.32266694234727	254.8799196487325	20/04/28 05:18:11
3	42	349.2370701468259	254.99069062805813	20/04/28 05:18:11
3	42	349.17830483730836	254.89988806545628	20/04/28 05:18:11
3	42	349.21728202319747	254.82868392678964	20/04/28 05:18:11
3	42	349.2116628987749	254.91579036686932	20/04/28 05:18:12
3	42	349.2841201040324	255.0686450323899	20/04/28 05:18:12
3	42	349.21245418820104	254.80117197755607	20/04/28 05:18:12
3	42	349.11583713948056	254.88808203458353	20/04/28 05:18:12
3	42	349.2161785859438	254.63582001640486	20/04/28 05:18:12
3	42	349.1948408126579	254.55676836642516	20/04/28 05:18:12
3	42	349.2040984546188	254.5928832374537	20/04/28 05:18:12
3	42	349.24805703470236	254.61937001036142	20/04/28 05:18:12
3	42	349.36472686812016	254.65754338385375	20/04/28 05:18:12
3	42	349.2440850428803	254.86780412421822	20/04/28 05:18:12
3	42	349.10121056370593	255.00297747446942	20/04/28 05:18:13
3	42	348.91472618128154	255.039419900657	20/04/28 05:18:13
3	42	349.1151213230874	254.9858743037734	20/04/28 05:18:13
3	42	348.9850019456187	255.15874689121964	20/04/28 05:18:13
3	42	349.1137556266295	254.97991379894975	20/04/28 05:18:13
3	42	348.9816109899354	255.0403484476156	20/04/28 05:18:13
3	42	349.07754053970666	255.1256094997546	20/04/28 05:18:13
3	42	348.8375205994076	255.07939838898992	20/04/28 05:18:13
3	42	348.827526975366	255.1085218925033	20/04/28 05:18:13
3	42	348.92335779581447	255.28192536465116	20/04/28 05:18:13
3	42	348.91142645739797	255.3516481785467	20/04/28 05:18:14
3	42	348.8827951128592	255.3742941952566	20/04/28 05:18:14
3	42	348.781060511846	255.2441786192088	20/04/28 05:18:14
3	42	348.77802992862235	255.3053938350419	20/04/28 05:18:14
3	42	348.75777084582154	255.15158562609017	20/04/28 05:18:14
3	42	348.774464681214	255.14809163950304	20/04/28 05:18:14
3	42	348.90524072019235	254.95670157242085	20/04/28 05:18:14
3	42	348.86520526923385	255.20750316469483	20/04/28 05:18:14
3	42	348.79571072612424	255.1209329300987	20/04/28 05:18:14
3	42	348.84132614422344	255.2152412350217	20/04/28 05:18:15
3	42	348.9880592714922	255.4487711571413	20/04/28 05:18:15
3	42	348.99631961974785	255.44953900454666	20/04/28 05:18:15
3	42	349.15275663220007	255.29555445055794	20/04/28 05:18:15
3	42	349.1006330662703	255.22147381953047	20/04/28 05:18:15
3	42	349.2364586566786	255.31527065089196	20/04/28 05:18:15
3	42	349.225800898421	255.3301798449551	20/04/28 05:18:15
3	42	349.2233573085547	255.3506713922346	20/04/28 05:18:15
3	42	349.32367103809736	255.55332796974835	20/04/28 05:18:15
3	42	349.5237606710363	255.58971404041364	20/04/28 05:18:15
3	42	349.66803485526333	255.55033825123311	20/04/28 05:18:16
3	42	349.45665309917206	255.42115964823515	20/04/28 05:18:16
3	42	349.6937155601541	255.50417699751014	20/04/28 05:18:16
3	42	349.8181169669073	255.46144306045068	20/04/28 05:18:16
3	42	349.89025422909714	255.3071391800972	20/04/28 05:18:16
3	42	349.84153772817564	255.36181911768253	20/04/28 05:18:16
3	42	349.90439796902876	255.13858637613006	20/04/28 05:18:16
3	42	349.9938037813169	255.12100576153676	20/04/28 05:18:16
3	42	350.1869474357081	255.0150313517465	20/04/28 05:18:16
3	42	350.19786671857275	254.96425063665242	20/04/28 05:18:16
3	42	349.9464789102897	255.03863091458365	20/04/28 05:18:17
3	42	350.01215806321295	255.08881610702156	20/04/28 05:18:17
3	42	349.9078449580499	255.130181789533	20/04/28 05:18:17
3	42	349.8372447786787	255.00117482725872	20/04/28 05:18:17
3	42	349.79092602672625	254.92884295410613	20/04/28 05:18:17
3	42	349.90962915563426	254.7556989727267	20/04/28 05:18:17
3	42	349.9375826706606	254.87081633900038	20/04/28 05:18:17
3	42	350.01778631135113	254.9794269031955	20/04/28 05:18:17
3	42	350.0289689845555	254.96308382743823	20/04/28 05:18:17
3	42	350.02503485430884	254.90440821029196	20/04/28 05:18:17
3	42	349.95677915849683	254.69516445678659	20/04/28 05:18:18
3	42	350.0694179943709	254.81714883366018	20/04/28 05:18:18
3	42	350.0595284581754	254.63290508541562	20/04/28 05:18:18
3	42	349.93420315092044	254.85351566875875	20/04/28 05:18:18
3	42	349.8537408784331	254.81728665677238	20/04/28 05:18:18
3	42	349.934115323241	254.96024446195764	20/04/28 05:18:18
3	42	350.08809143464015	255.19434244168565	20/04/28 05:18:18
3	42	350.0869954689783	255.19023377667233	20/04/28 05:18:18
3	42	350.07341845098404	255.17939494785037	20/04/28 05:18:18
3	42	350.0596006636219	255.26673898204027	20/04/28 05:18:19
3	42	350.0075612523659	255.07993299950093	20/04/28 05:18:19
3	42	350.0075612523659	255.07993299950093	20/04/28 05:18:19
3	42	349.9913087676524	255.32381229093505	20/04/28 05:18:19
3	42	350.1813918113056	255.10041408897894	20/04/28 05:18:19
3	42	350.161753796613	255.32122659227966	20/04/28 05:18:19
3	42	350.2366433244354	255.1288566212774	20/04/28 05:18:19
3	42	350.2366433244354	255.1288566212774	20/04/28 05:18:19
3	42	350.2173984701719	255.47462661781043	20/04/28 05:18:19
3	42	350.29444029327414	255.63788078706705	20/04/28 05:18:19
3	42	350.21195257812315	255.40084711087437	20/04/28 05:18:20
3	42	350.20155675966157	255.4628284295879	20/04/28 05:18:20
3	42	350.17865035424546	255.6454448494225	20/04/28 05:18:20
3	42	349.99409055397126	255.61566482784897	20/04/28 05:18:20
3	42	350.1268230411844	255.64798944544464	20/04/28 05:18:20
3	42	350.0859325222574	255.66050319433248	20/04/28 05:18:20
3	42	350.01404943480395	255.6551947693635	20/04/28 05:18:20
3	42	350.15956055221864	255.54079865599746	20/04/28 05:18:20
3	42	350.0749691908665	255.53394020432106	20/04/28 05:18:20
3	42	350.07522775403703	255.56062494473125	20/04/28 05:18:21
3	42	349.99056896359957	255.6591756109762	20/04/28 05:18:21
3	42	350.0794488920681	255.72264569599923	20/04/28 05:18:21
3	42	349.9109135530962	255.72473946179838	20/04/28 05:18:21
3	42	349.71497789841874	255.8363731896757	20/04/28 05:18:21
3	42	349.6727200946499	255.99327197709258	20/04/28 05:18:21
3	42	349.5189340869313	255.98958865379174	20/04/28 05:18:21
3	42	349.7236266053954	256.1944278822822	20/04/28 05:18:21
3	42	349.88168269873785	256.1438552270332	20/04/28 05:18:21
3	42	349.88168269873785	256.1438552270332	20/04/28 05:18:21
3	42	349.67782007006235	256.0853077225447	20/04/28 05:18:22
3	42	349.67782007006235	256.0853077225447	20/04/28 05:18:22
3	42	349.73327062244846	256.05012085587936	20/04/28 05:18:22
3	42	349.85364867051044	256.1699859440187	20/04/28 05:18:22
3	42	350.0791980865046	256.1672785968621	20/04/28 05:18:22
3	42	349.8912507064039	256.1032312937581	20/04/28 05:18:22
3	42	349.7313351661959	256.32436764062413	20/04/28 05:18:22
3	42	349.73265875249	256.38924827027336	20/04/28 05:18:22
3	42	349.4548553805531	256.5008225001967	20/04/28 05:18:22
3	42	349.72332047199666	256.4575782000315	20/04/28 05:18:22
3	42	349.94572755360116	256.57478120059466	20/04/28 05:18:23
3	42	349.987585594929	256.7981321786583	20/04/28 05:18:23
3	42	349.72970282216403	256.8475000551121	20/04/28 05:18:23
3	42	349.8426291350444	257.03806341855915	20/04/28 05:18:23
3	42	349.88255962632974	257.267845776774	20/04/28 05:18:23
3	42	350.1755492350719	257.24851199601295	20/04/28 05:18:23
3	42	350.35981227624393	257.04898333179625	20/04/28 05:18:23
3	42	350.3497066021576	257.0450969278626	20/04/28 05:18:23
3	42	350.3497066021576	257.0450969278626	20/04/28 05:18:23
3	42	350.37317674460206	256.993405509448	20/04/28 05:18:24
3	42	350.4254531138671	257.25768146965686	20/04/28 05:18:24
3	42	350.5678445449583	257.36314795820834	20/04/28 05:18:24
3	42	350.6482797544977	257.07775193918735	20/04/28 05:18:24
3	42	350.60993038997066	257.2731771937134	20/04/28 05:18:24
3	42	350.76266266924085	257.11637110390325	20/04/28 05:18:24
3	42	350.76266266924085	257.11637110390325	20/04/28 05:18:24
3	42	350.5720201133034	257.0047738398576	20/04/28 05:18:24
3	42	350.52437067344766	257.16379386936	20/04/28 05:18:24
3	42	350.59819249215207	257.4018727149996	20/04/28 05:18:24
3	42	350.3617996504576	257.3334520008579	20/04/28 05:18:25
3	42	350.3176469049899	257.18322192084935	20/04/28 05:18:25
3	42	350.2572451211948	257.1865347082541	20/04/28 05:18:25
3	42	350.2191681787086	256.90288252165453	20/04/28 05:18:25
3	42	350.2185446068957	256.86591308181966	20/04/28 05:18:25
3	42	350.27953195494973	256.71506686663395	20/04/28 05:18:25
3	42	350.41933689014377	256.7596983172533	20/04/28 05:18:25
3	42	350.5533748209566	256.900383506422	20/04/28 05:18:25
3	42	350.31689576697255	256.7375707538551	20/04/28 05:18:25
3	42	350.33617353386745	256.78063448554326	20/04/28 05:18:25
3	42	350.47675213795304	256.99337586178876	20/04/28 05:18:26
3	42	350.64541280792247	256.99744110585425	20/04/28 05:18:26
3	42	350.80238403045945	256.8357696765771	20/04/28 05:18:26
3	42	350.84350641824625	256.72591507549714	20/04/28 05:18:26
3	42	350.6048330650913	256.64794365857915	20/04/28 05:18:26
3	42	350.85728767013103	256.64311719909006	20/04/28 05:18:26
3	42	350.8331148104087	256.82622912040995	20/04/28 05:18:26
3	42	350.5430117752921	256.8148467615149	20/04/28 05:18:26
3	42	350.53640803265216	256.9875813688679	20/04/28 05:18:26
3	42	350.52037275223415	256.99608650224417	20/04/28 05:18:27
3	42	350.47936163916444	256.96209454233286	20/04/28 05:18:27
3	42	350.45037016477653	257.14390127687324	20/04/28 05:18:27
3	42	350.4876999380013	257.1413229854325	20/04/28 05:18:27
3	42	350.7188433397895	257.31444166423483	20/04/28 05:18:27
3	42	350.77953465982125	257.3379853901235	20/04/28 05:18:27
3	42	350.5625078082386	257.2860367447848	20/04/28 05:18:27
3	42	350.6972266530255	257.16418121685666	20/04/28 05:18:27
3	42	350.7826411806475	257.23398501487355	20/04/28 05:18:27
3	42	350.7201492278936	257.25869054291707	20/04/28 05:18:27
3	42	350.68786174280876	257.2323515933035	20/04/28 05:18:28
3	42	350.65137778582937	257.3418374590454	20/04/28 05:18:28
3	42	350.67548798676467	257.46219311049003	20/04/28 05:18:28
3	42	350.95035674855154	257.3687675264023	20/04/28 05:18:28
3	42	350.97668160454117	257.32000072020776	20/04/28 05:18:28
3	42	350.98120337412615	257.2501412519552	20/04/28 05:18:28
3	42	350.91441520198293	257.29890868077143	20/04/28 05:18:28
3	42	350.9822811038652	257.43242992715636	20/04/28 05:18:28
3	42	350.6915236224535	257.40306113117833	20/04/28 05:18:28
3	42	350.7102101917955	257.3553302493485	20/04/28 05:18:28
3	42	350.7242920784397	257.3171156482632	20/04/28 05:18:29
3	42	350.6557726857943	257.280860560784	20/04/28 05:18:29
3	42	350.7131818281309	257.3262556522703	20/04/28 05:18:29
3	42	350.7972125593439	257.5544812859516	20/04/28 05:18:29
3	42	350.75857782651485	257.47229171262	20/04/28 05:18:29
3	42	350.614767105731	257.3751789934098	20/04/28 05:18:29
3	42	350.7632870799687	257.623746304795	20/04/28 05:18:29
3	42	350.768154019692	257.6387063228929	20/04/28 05:18:29
3	42	350.8940190884081	257.38851615004444	20/04/28 05:18:29
3	42	350.9061199416821	257.40552829242597	20/04/28 05:18:30
3	42	351.03043374518643	257.4092504176535	20/04/28 05:18:30
3	42	351.287173373672	257.27764733589146	20/04/28 05:18:30
3	42	351.2914029201149	257.2677272356029	20/04/28 05:18:30
3	42	351.187802493543	257.33087097172637	20/04/28 05:18:30
3	42	351.4161288521798	257.4831531783786	20/04/28 05:18:30
3	42	351.4057522708623	257.47278719486707	20/04/28 05:18:30
3	42	351.4971365649618	257.4122748613803	20/04/28 05:18:30
3	42	351.22600589575603	257.4886147204808	20/04/28 05:18:30
3	42	350.9602604136925	257.5646020503563	20/04/28 05:18:30
3	42	350.9084094403277	257.4457496869497	20/04/28 05:18:31
3	42	351.1029370401361	257.5492476636054	20/04/28 05:18:31
3	42	351.2372814299905	257.48079964093336	20/04/28 05:18:31
3	42	351.2105278342461	257.2708647417981	20/04/28 05:18:31
3	42	351.3527531617178	257.23615284979877	20/04/28 05:18:31
3	42	351.0940860534656	257.08433274639395	20/04/28 05:18:31
3	42	351.0259889227317	257.016350354965	20/04/28 05:18:31
3	42	351.05580972002605	256.99628871096047	20/04/28 05:18:31
3	42	351.07900915207694	256.99666840676167	20/04/28 05:18:31
3	42	351.14756284581	257.06356505707214	20/04/28 05:18:31
3	42	350.96885969766834	257.16435844176254	20/04/28 05:18:32
3	42	350.9783867746635	257.18105274764423	20/04/28 05:18:32
3	42	350.93104915848096	257.2669072063015	20/04/28 05:18:32
3	42	350.75329048293014	257.3363469124577	20/04/28 05:18:32
3	42	350.87201305740615	257.3132142605611	20/04/28 05:18:32
3	42	350.98234470487523	257.3017504632379	20/04/28 05:18:32
3	42	351.1474638682379	257.4865692551481	20/04/28 05:18:32
3	42	351.21711506001213	257.5356119651721	20/04/28 05:18:32
3	42	351.0747218506907	257.6823689623714	20/04/28 05:18:32
3	42	351.0501115263384	257.64511925854396	20/04/28 05:18:32
3	42	351.03655797957305	257.6670591389977	20/04/28 05:18:33
3	42	350.95602595084046	257.44466709915963	20/04/28 05:18:33
3	42	351.0365360086502	257.27241009664016	20/04/28 05:18:33
3	42	350.8090025120365	257.28818936032144	20/04/28 05:18:33
3	42	350.79775938404657	257.4063515679244	20/04/28 05:18:33
3	42	350.78950824985446	257.39168864995395	20/04/28 05:18:33
3	42	350.52935071436656	257.5042851487093	20/04/28 05:18:33
3	42	350.39412242778434	257.677282599774	20/04/28 05:18:33
3	42	350.3699537562713	257.68586568211794	20/04/28 05:18:33
3	42	350.31644699199984	257.7263291229444	20/04/28 05:18:34
3	42	350.2875113409975	257.7121099271885	20/04/28 05:18:34
3	42	350.27643213388023	257.720855169287	20/04/28 05:18:34
3	42	350.47764508973404	257.9161979506439	20/04/28 05:18:34
3	42	350.47764508973404	257.9161979506439	20/04/28 05:18:34
3	42	350.47764508973404	257.9161979506439	20/04/28 05:18:34
3	42	350.52307627910886	258.13330772038364	20/04/28 05:18:34
3	42	350.6378016926637	257.89473300869037	20/04/28 05:18:34
3	42	350.638284054257	258.12645318403656	20/04/28 05:18:34
3	42	350.638284054257	258.12645318403656	20/04/28 05:18:34
3	42	350.59927303527235	258.090390291591	20/04/28 05:18:35
3	42	350.34569919693445	258.0427119812234	20/04/28 05:18:35
3	42	350.404466480224	257.9838466674949	20/04/28 05:18:35
3	42	350.47914992423097	257.8837125283545	20/04/28 05:18:35
3	42	350.2797520018313	258.019767179928	20/04/28 05:18:35
3	42	350.1080434714747	258.1904175070146	20/04/28 05:18:35
3	42	350.1437152031842	258.23324060694705	20/04/28 05:18:35
3	42	350.09782940917717	258.21463496453583	20/04/28 05:18:35
3	42	350.2228153769844	258.069198880383	20/04/28 05:18:35
3	42	350.2228153769844	258.069198880383	20/04/28 05:18:35
3	42	350.0955405710166	257.90842775083036	20/04/28 05:18:36
3	42	349.8474460528617	257.93150266164446	20/04/28 05:18:36
3	42	349.59176708373514	257.9276778498646	20/04/28 05:18:36
3	42	349.59176708373514	257.9276778498646	20/04/28 05:18:36
3	42	349.4391404069427	258.15438033579625	20/04/28 05:18:36
3	42	349.4280486986975	258.2384386422863	20/04/28 05:18:36
3	42	349.2860295107856	258.1432671828767	20/04/28 05:18:36
3	42	349.1955453589599	258.16241166008575	20/04/28 05:18:36
3	42	349.2294073688346	257.9466216891583	20/04/28 05:18:36
3	42	349.19267626808573	258.0218378074973	20/04/28 05:18:37
3	42	349.0364271583847	257.94680760670093	20/04/28 05:18:37
3	42	348.94429959216654	257.8835893142214	20/04/28 05:18:37
3	42	348.89869234165207	257.76094139016004	20/04/28 05:18:37
3	42	348.88203053826356	257.59906068762535	20/04/28 05:18:37
3	42	348.88203053826356	257.59906068762535	20/04/28 05:18:37
3	42	348.8493036044735	257.61450459916824	20/04/28 05:18:37
3	42	349.03989070045486	257.7292384226624	20/04/28 05:18:37
3	42	349.0922834402981	257.7293741760009	20/04/28 05:18:37
3	42	349.2669868038234	257.8349534170667	20/04/28 05:18:37
3	42	349.066270310888	257.67358274650604	20/04/28 05:18:38
3	42	349.0749533437916	257.6447565234736	20/04/28 05:18:38
3	42	349.18316258867543	257.5765619342707	20/04/28 05:18:38
3	42	349.0733248818973	257.73525587849934	20/04/28 05:18:38
3	42	348.99240206561615	257.84193557761336	20/04/28 05:18:38
3	42	348.7514466921201	257.78812184727076	20/04/28 05:18:38
3	42	348.62799975432324	257.907889814333	20/04/28 05:18:38
3	42	348.9100569207603	257.99787209969514	20/04/28 05:18:38
3	42	348.9100569207603	257.99787209969514	20/04/28 05:18:38
3	42	349.1095892721336	257.97747951247203	20/04/28 05:18:38
3	42	349.14447296074474	258.20182922006916	20/04/28 05:18:39
3	42	349.13960948622787	258.50023043732705	20/04/28 05:18:39
3	42	348.85695506953095	258.1122273491432	20/04/28 05:18:39
3	42	348.5771633598483	258.05546919484414	20/04/28 05:18:39
3	42	348.64864287156746	258.2473863164602	20/04/28 05:18:39
3	42	348.71146311559494	258.3393034126642	20/04/28 05:18:39
3	42	348.60529161467787	258.2780319340445	20/04/28 05:18:39
3	42	348.50040683748546	258.15262712579397	20/04/28 05:18:39
3	42	348.58533922927137	258.290652130936	20/04/28 05:18:39
3	42	348.7093157518313	258.23776297961416	20/04/28 05:18:40
3	42	348.78422995973693	258.0282735206023	20/04/28 05:18:40
3	42	348.6220970703686	257.9895826780964	20/04/28 05:18:40
3	42	348.5122767888988	258.0045576169789	20/04/28 05:18:40
3	42	348.27813986234713	257.9999076267383	20/04/28 05:18:40
3	42	348.3900945358145	258.2168651512129	20/04/28 05:18:40
3	42	348.3900945358145	258.2168651512129	20/04/28 05:18:40
3	42	348.28560843908645	258.257371784032	20/04/28 05:18:40
3	42	347.92616751441585	258.2933107662787	20/04/28 05:18:40
3	42	347.92616751441585	258.2933107662787	20/04/28 05:18:40
3	42	348.1044525664179	258.33148329195745	20/04/28 05:18:41
3	42	348.35691956334205	258.3989046101652	20/04/28 05:18:41
3	42	348.3162662840558	258.2407715459759	20/04/28 05:18:41
3	42	348.2186815820415	258.47206503828306	20/04/28 05:18:41
3	42	348.27809074679936	258.3641981396821	20/04/28 05:18:41
3	42	348.2854134970642	258.4057458118838	20/04/28 05:18:41
3	42	348.25372059824315	258.47482838724335	20/04/28 05:18:41
3	42	348.1345870540746	258.38473799234094	20/04/28 05:18:41
3	42	348.1345870540746	258.38473799234094	20/04/28 05:18:41
3	42	348.2802135155223	258.4987715211726	20/04/28 05:18:41
3	42	348.1493915703553	258.30206819637897	20/04/28 05:18:42
3	42	347.9724442810991	258.0868330044459	20/04/28 05:18:42
3	42	347.73584403182065	258.23777699768607	20/04/28 05:18:42
3	42	347.95506916242846	258.122897192565	20/04/28 05:18:42
3	42	347.9396438891205	258.1064601720246	20/04/28 05:18:42
3	42	347.8961221495062	258.0308457151172	20/04/28 05:18:42
3	42	347.87069175748087	258.0581028723588	20/04/28 05:18:42
3	42	348.02642311434363	258.00161239869965	20/04/28 05:18:42
3	42	347.8394851657111	257.7930115888157	20/04/28 05:18:42
3	42	347.8876291273028	257.92685796087886	20/04/28 05:18:43
3	42	347.8523308928561	258.02696401473804	20/04/28 05:18:43
3	42	347.75869000781273	258.02079068023966	20/04/28 05:18:43
3	42	347.76977427086564	258.1038665364057	20/04/28 05:18:43
3	42	347.76977427086564	258.1038665364057	20/04/28 05:18:43
3	42	347.7768962597548	258.0396482403719	20/04/28 05:18:43
3	42	347.7626057420025	258.0699371757646	20/04/28 05:18:43
3	42	347.9241149919583	258.3012954437925	20/04/28 05:18:43
3	42	347.9401015599565	258.08339021105115	20/04/28 05:18:43
3	42	347.9401015599565	258.08339021105115	20/04/28 05:18:43
3	42	347.7830956114108	258.0217226901719	20/04/28 05:18:44
3	42	347.7830956114108	258.0217226901719	20/04/28 05:18:44
3	42	347.7721343401512	257.99582239599374	20/04/28 05:18:44
3	42	347.7721343401512	257.99582239599374	20/04/28 05:18:44
3	42	348.1108827021607	257.9325957286791	20/04/28 05:18:44
3	42	348.0951147936021	258.0827275158928	20/04/28 05:18:44
3	42	348.0951147936021	258.0827275158928	20/04/28 05:18:44
3	42	348.20970639511995	258.3191318639523	20/04/28 05:18:44
3	42	348.14851236723933	258.3944867171128	20/04/28 05:18:44
3	42	347.9250375718424	258.50322245572295	20/04/28 05:18:44
3	42	347.92349331421156	258.4585555365202	20/04/28 05:18:45
3	42	347.86983561035686	258.3651207673642	20/04/28 05:18:45
3	42	347.9716510278382	258.1907048584384	20/04/28 05:18:45
3	42	347.93159249064223	258.19445889478976	20/04/28 05:18:45
3	42	348.0073328070762	258.1856671524182	20/04/28 05:18:45
3	42	348.05239076709864	258.23454370276784	20/04/28 05:18:45
3	42	347.96485186194894	258.20905586132244	20/04/28 05:18:45
3	42	348.1745388569727	258.1455946756391	20/04/28 05:18:45
3	42	348.1815573989169	258.1424859977737	20/04/28 05:18:45
3	42	348.17705552959404	258.14106473122035	20/04/28 05:18:46
3	42	348.1755913622571	258.1938575509704	20/04/28 05:18:46
3	42	348.15249598824	258.17925427859535	20/04/28 05:18:46
3	42	348.24793114616426	257.9254078327816	20/04/28 05:18:46
3	42	348.2476284003797	257.8600245886689	20/04/28 05:18:46
3	42	348.22504971788146	257.81834470268376	20/04/28 05:18:46
3	42	348.2265439980617	257.8403226511679	20/04/28 05:18:46
3	42	348.03087990485915	257.7233172177633	20/04/28 05:18:46
3	42	348.0417687295583	257.7985002467858	20/04/28 05:18:46
3	42	348.24631820746276	257.98377331234167	20/04/28 05:18:46
3	42	348.26961915668477	258.1054952492433	20/04/28 05:18:47
3	42	348.23702362792216	257.86911525569843	20/04/28 05:18:47
3	42	348.424657423639	257.6775895181554	20/04/28 05:18:47
3	42	348.5088898046352	257.6521450422104	20/04/28 05:18:47
3	42	348.622735933777	257.91662595207544	20/04/28 05:18:47
3	42	348.6405501982801	257.8203823000738	20/04/28 05:18:47
3	42	348.88317968708924	257.77596274653064	20/04/28 05:18:47
3	42	348.8706241070505	257.8489405737134	20/04/28 05:18:47
3	42	348.9101430941388	257.9475580049624	20/04/28 05:18:47
3	42	349.0133997403545	258.18995107037233	20/04/28 05:18:48
3	42	349.1681548745372	258.2199939426512	20/04/28 05:18:48
3	42	349.006587874114	258.1307410619183	20/04/28 05:18:48
3	42	349.02637746390604	258.34334039430007	20/04/28 05:18:48
3	42	349.26277437732045	258.2306079222961	20/04/28 05:18:48
3	42	349.2359281040967	258.2833792851588	20/04/28 05:18:48
3	42	349.0246079002448	258.19091970726737	20/04/28 05:18:48
3	42	348.7967772763036	258.2944374884309	20/04/28 05:18:48
3	42	348.71796637281835	258.36532244576676	20/04/28 05:18:48
3	42	348.9897930963943	258.40408899653846	20/04/28 05:18:48
3	42	349.15241788987976	258.59045382855226	20/04/28 05:18:49
