deviceId	device_location_x	device_location_y	rssi_measurement	timeStamp
114	381.5992223502213	289.5952994882171	-63	21/02/24 15:40:14
116	377.9647653672978	286.9907349984353	-56	21/02/24 15:40:14
115	377.751717565356	288.3800056854842	-54	21/02/24 15:40:14
96	377.44892680179316	276.8922953490967	-63	21/02/24 15:40:14
94	371.72787175525207	289.5180158335357	-44	21/02/24 15:40:14
92	370.6727223195025	288.1316940639638	-37	21/02/24 15:40:14
110	367.98757076589385	277.42210180952264	-60	21/02/24 15:40:14
93	366.9922408772935	287.5344913496744	-51	21/02/24 15:40:14
109	365.34205862707444	280.9445005087476	-61	21/02/24 15:40:14
112	360.33084939037263	282.2851479696295	-63	21/02/24 15:40:14
119	363.6527972760671	276.499073089803	-66	21/02/24 15:40:14
118	357.09356967635637	275.4844405310735	-71	21/02/24 15:40:14
117	369.239898205492	274.21448833832176	-65	21/02/24 15:40:14

114	381.5992223502213	289.5952994882171	-62	21/02/24 15:40:15
116	377.9647653672978	286.9907349984353	-53	21/02/24 15:40:15
115	377.751717565356	288.3800056854842	-53	21/02/24 15:40:15
96	377.44892680179316	276.8922953490967	-62	21/02/24 15:40:15
94	371.72787175525207	289.5180158335357	-42	21/02/24 15:40:15
92	370.6727223195025	288.1316940639638	-39	21/02/24 15:40:15
110	367.98757076589385	277.42210180952264	-61	21/02/24 15:40:15
93	366.9922408772935	287.5344913496744	-52	21/02/24 15:40:15
109	365.34205862707444	280.9445005087476	-59	21/02/24 15:40:15
112	360.33084939037263	282.2851479696295	-66	21/02/24 15:40:15
119	363.6527972760671	276.499073089803	-67	21/02/24 15:40:15
118	357.09356967635637	275.4844405310735	-72	21/02/24 15:40:15
117	369.239898205492	274.21448833832176	-66	21/02/24 15:40:15

114	381.5992223502213	289.5952994882171	-60	21/02/24 15:40:16
116	377.9647653672978	286.9907349984353	-55	21/02/24 15:40:16
115	377.751717565356	288.3800056854842	-52	21/02/24 15:40:16
96	377.44892680179316	276.8922953490967	-63	21/02/24 15:40:16
94	371.72787175525207	289.5180158335357	-40	21/02/24 15:40:16
92	370.6727223195025	288.1316940639638	-35	21/02/24 15:40:16
110	367.98757076589385	277.42210180952264	-61	21/02/24 15:40:16
93	366.9922408772935	287.5344913496744	-51	21/02/24 15:40:16
109	365.34205862707444	280.9445005087476	-62	21/02/24 15:40:16
112	360.33084939037263	282.2851479696295	-63	21/02/24 15:40:16
119	363.6527972760671	276.499073089803	-65	21/02/24 15:40:16
118	357.09356967635637	275.4844405310735	-72	21/02/24 15:40:16
117	369.239898205492	274.21448833832176	-64	21/02/24 15:40:16

114	381.5992223502213	289.5952994882171	-60	21/02/24 15:40:17
116	377.9647653672978	286.9907349984353	-54	21/02/24 15:40:17
115	377.751717565356	288.3800056854842	-56	21/02/24 15:40:17
96	377.44892680179316	276.8922953490967	-62	21/02/24 15:40:17
94	371.72787175525207	289.5180158335357	-40	21/02/24 15:40:17
92	370.6727223195025	288.1316940639638	-40	21/02/24 15:40:17
110	367.98757076589385	277.42210180952264	-62	21/02/24 15:40:17
93	366.9922408772935	287.5344913496744	-52	21/02/24 15:40:17
109	365.34205862707444	280.9445005087476	-60	21/02/24 15:40:17
112	360.33084939037263	282.2851479696295	-63	21/02/24 15:40:17
119	363.6527972760671	276.499073089803	-65	21/02/24 15:40:17
118	357.09356967635637	275.4844405310735	-68	21/02/24 15:40:17
117	369.239898205492	274.21448833832176	-64	21/02/24 15:40:17

114	381.5992223502213	289.5952994882171	-61	21/02/24 15:40:18
116	377.9647653672978	286.9907349984353	-53	21/02/24 15:40:18
115	377.751717565356	288.3800056854842	-54	21/02/24 15:40:18
96	377.44892680179316	276.8922953490967	-62	21/02/24 15:40:18
94	371.72787175525207	289.5180158335357	-41	21/02/24 15:40:18
92	370.6727223195025	288.1316940639638	-38	21/02/24 15:40:18
110	367.98757076589385	277.42210180952264	-62	21/02/24 15:40:18
93	366.9922408772935	287.5344913496744	-51	21/02/24 15:40:18
109	365.34205862707444	280.9445005087476	-58	21/02/24 15:40:18
112	360.33084939037263	282.2851479696295	-63	21/02/24 15:40:18
119	363.6527972760671	276.499073089803	-65	21/02/24 15:40:18
118	357.09356967635637	275.4844405310735	-70	21/02/24 15:40:18
117	369.239898205492	274.21448833832176	-65	21/02/24 15:40:18

114	381.5992223502213	289.5952994882171	-61	21/02/24 15:40:19
116	377.9647653672978	286.9907349984353	-55	21/02/24 15:40:19
115	377.751717565356	288.3800056854842	-53	21/02/24 15:40:19
96	377.44892680179316	276.8922953490967	-63	21/02/24 15:40:19
94	371.72787175525207	289.5180158335357	-37	21/02/24 15:40:19
92	370.6727223195025	288.1316940639638	-41	21/02/24 15:40:19
110	367.98757076589385	277.42210180952264	-63	21/02/24 15:40:19
93	366.9922408772935	287.5344913496744	-53	21/02/24 15:40:19
109	365.34205862707444	280.9445005087476	-61	21/02/24 15:40:19
112	360.33084939037263	282.2851479696295	-66	21/02/24 15:40:19
119	363.6527972760671	276.499073089803	-67	21/02/24 15:40:19
118	357.09356967635637	275.4844405310735	-71	21/02/24 15:40:19
117	369.239898205492	274.21448833832176	-67	21/02/24 15:40:19

114	381.5992223502213	289.5952994882171	-61	21/02/24 15:40:20
116	377.9647653672978	286.9907349984353	-55	21/02/24 15:40:20
115	377.751717565356	288.3800056854842	-54	21/02/24 15:40:20
96	377.44892680179316	276.8922953490967	-65	21/02/24 15:40:20
94	371.72787175525207	289.5180158335357	-32	21/02/24 15:40:20
92	370.6727223195025	288.1316940639638	-39	21/02/24 15:40:20
110	367.98757076589385	277.42210180952264	-65	21/02/24 15:40:20
93	366.9922408772935	287.5344913496744	-53	21/02/24 15:40:20
109	365.34205862707444	280.9445005087476	-63	21/02/24 15:40:20
112	360.33084939037263	282.2851479696295	-64	21/02/24 15:40:20
119	363.6527972760671	276.499073089803	-66	21/02/24 15:40:20
117	369.239898205492	274.21448833832176	-67	21/02/24 15:40:20

114	381.5992223502213	289.5952994882171	-61	21/02/24 15:40:21
116	377.9647653672978	286.9907349984353	-56	21/02/24 15:40:21
115	377.751717565356	288.3800056854842	-52	21/02/24 15:40:21
96	377.44892680179316	276.8922953490967	-66	21/02/24 15:40:21
94	371.72787175525207	289.5180158335357	-33	21/02/24 15:40:21
92	370.6727223195025	288.1316940639638	-38	21/02/24 15:40:21
110	367.98757076589385	277.42210180952264	-65	21/02/24 15:40:21
93	366.9922408772935	287.5344913496744	-54	21/02/24 15:40:21
109	365.34205862707444	280.9445005087476	-60	21/02/24 15:40:21
112	360.33084939037263	282.2851479696295	-65	21/02/24 15:40:21
119	363.6527972760671	276.499073089803	-67	21/02/24 15:40:21
117	369.239898205492	274.21448833832176	-65	21/02/24 15:40:21

114	381.5992223502213	289.5952994882171	-61	21/02/24 15:40:22
116	377.9647653672978	286.9907349984353	-54	21/02/24 15:40:22
115	377.751717565356	288.3800056854842	-54	21/02/24 15:40:22
96	377.44892680179316	276.8922953490967	-66	21/02/24 15:40:22
94	371.72787175525207	289.5180158335357	-36	21/02/24 15:40:22
92	370.6727223195025	288.1316940639638	-37	21/02/24 15:40:22
110	367.98757076589385	277.42210180952264	-63	21/02/24 15:40:22
93	366.9922408772935	287.5344913496744	-53	21/02/24 15:40:22
109	365.34205862707444	280.9445005087476	-61	21/02/24 15:40:22
112	360.33084939037263	282.2851479696295	-64	21/02/24 15:40:22
119	363.6527972760671	276.499073089803	-66	21/02/24 15:40:22
118	357.09356967635637	275.4844405310735	-70	21/02/24 15:40:22
117	369.239898205492	274.21448833832176	-66	21/02/24 15:40:22

114	381.5992223502213	289.5952994882171	-62	21/02/24 15:40:23
116	377.9647653672978	286.9907349984353	-53	21/02/24 15:40:23
115	377.751717565356	288.3800056854842	-53	21/02/24 15:40:23
96	377.44892680179316	276.8922953490967	-63	21/02/24 15:40:23
94	371.72787175525207	289.5180158335357	-36	21/02/24 15:40:23
92	370.6727223195025	288.1316940639638	-35	21/02/24 15:40:23
110	367.98757076589385	277.42210180952264	-65	21/02/24 15:40:23
93	366.9922408772935	287.5344913496744	-52	21/02/24 15:40:23
109	365.34205862707444	280.9445005087476	-61	21/02/24 15:40:23
112	360.33084939037263	282.2851479696295	-63	21/02/24 15:40:23
119	363.6527972760671	276.499073089803	-65	21/02/24 15:40:23
118	357.09356967635637	275.4844405310735	-69	21/02/24 15:40:23
117	369.239898205492	274.21448833832176	-67	21/02/24 15:40:23

114	381.5992223502213	289.5952994882171	-59	21/02/24 15:40:24
116	377.9647653672978	286.9907349984353	-53	21/02/24 15:40:24
115	377.751717565356	288.3800056854842	-53	21/02/24 15:40:24
96	377.44892680179316	276.8922953490967	-64	21/02/24 15:40:24
94	371.72787175525207	289.5180158335357	-35	21/02/24 15:40:24
92	370.6727223195025	288.1316940639638	-38	21/02/24 15:40:24
110	367.98757076589385	277.42210180952264	-64	21/02/24 15:40:24
93	366.9922408772935	287.5344913496744	-54	21/02/24 15:40:24
109	365.34205862707444	280.9445005087476	-61	21/02/24 15:40:24
112	360.33084939037263	282.2851479696295	-66	21/02/24 15:40:24
119	363.6527972760671	276.499073089803	-68	21/02/24 15:40:24
118	357.09356967635637	275.4844405310735	-71	21/02/24 15:40:24
117	369.239898205492	274.21448833832176	-67	21/02/24 15:40:24

114	381.5992223502213	289.5952994882171	-61	21/02/24 15:40:25
116	377.9647653672978	286.9907349984353	-53	21/02/24 15:40:25
115	377.751717565356	288.3800056854842	-52	21/02/24 15:40:25
96	377.44892680179316	276.8922953490967	-63	21/02/24 15:40:25
94	371.72787175525207	289.5180158335357	-31	21/02/24 15:40:25
92	370.6727223195025	288.1316940639638	-41	21/02/24 15:40:25
110	367.98757076589385	277.42210180952264	-65	21/02/24 15:40:25
93	366.9922408772935	287.5344913496744	-54	21/02/24 15:40:25
109	365.34205862707444	280.9445005087476	-61	21/02/24 15:40:25
112	360.33084939037263	282.2851479696295	-65	21/02/24 15:40:25
119	363.6527972760671	276.499073089803	-69	21/02/24 15:40:25
117	369.239898205492	274.21448833832176	-66	21/02/24 15:40:25

114	381.5992223502213	289.5952994882171	-60	21/02/24 15:40:26
116	377.9647653672978	286.9907349984353	-55	21/02/24 15:40:26
115	377.751717565356	288.3800056854842	-55	21/02/24 15:40:26
96	377.44892680179316	276.8922953490967	-64	21/02/24 15:40:26
94	371.72787175525207	289.5180158335357	-26	21/02/24 15:40:26
92	370.6727223195025	288.1316940639638	-42	21/02/24 15:40:26
110	367.98757076589385	277.42210180952264	-63	21/02/24 15:40:26
93	366.9922408772935	287.5344913496744	-55	21/02/24 15:40:26
109	365.34205862707444	280.9445005087476	-63	21/02/24 15:40:26
112	360.33084939037263	282.2851479696295	-66	21/02/24 15:40:26
119	363.6527972760671	276.499073089803	-66	21/02/24 15:40:26
117	369.239898205492	274.21448833832176	-66	21/02/24 15:40:26

114	381.5992223502213	289.5952994882171	-61	21/02/24 15:40:27
116	377.9647653672978	286.9907349984353	-54	21/02/24 15:40:27
115	377.751717565356	288.3800056854842	-54	21/02/24 15:40:27
96	377.44892680179316	276.8922953490967	-64	21/02/24 15:40:27
94	371.72787175525207	289.5180158335357	-16	21/02/24 15:40:27
92	370.6727223195025	288.1316940639638	-42	21/02/24 15:40:27
110	367.98757076589385	277.42210180952264	-64	21/02/24 15:40:27
93	366.9922408772935	287.5344913496744	-54	21/02/24 15:40:27
109	365.34205862707444	280.9445005087476	-61	21/02/24 15:40:27
112	360.33084939037263	282.2851479696295	-67	21/02/24 15:40:27
119	363.6527972760671	276.499073089803	-67	21/02/24 15:40:27
117	369.239898205492	274.21448833832176	-66	21/02/24 15:40:27

114	381.5992223502213	289.5952994882171	-63	21/02/24 15:40:28
116	377.9647653672978	286.9907349984353	-56	21/02/24 15:40:28
115	377.751717565356	288.3800056854842	-55	21/02/24 15:40:28
96	377.44892680179316	276.8922953490967	-64	21/02/24 15:40:28
94	371.72787175525207	289.5180158335357	-16	21/02/24 15:40:28
92	370.6727223195025	288.1316940639638	-39	21/02/24 15:40:28
110	367.98757076589385	277.42210180952264	-65	21/02/24 15:40:28
93	366.9922408772935	287.5344913496744	-54	21/02/24 15:40:28
109	365.34205862707444	280.9445005087476	-64	21/02/24 15:40:28
112	360.33084939037263	282.2851479696295	-67	21/02/24 15:40:28
119	363.6527972760671	276.499073089803	-65	21/02/24 15:40:28
117	369.239898205492	274.21448833832176	-69	21/02/24 15:40:28

114	381.5992223502213	289.5952994882171	-62	21/02/24 15:40:29
116	377.9647653672978	286.9907349984353	-55	21/02/24 15:40:29
115	377.751717565356	288.3800056854842	-55	21/02/24 15:40:29
96	377.44892680179316	276.8922953490967	-66	21/02/24 15:40:29
94	371.72787175525207	289.5180158335357	-31	21/02/24 15:40:29
92	370.6727223195025	288.1316940639638	-45	21/02/24 15:40:29
110	367.98757076589385	277.42210180952264	-66	21/02/24 15:40:29
93	366.9922408772935	287.5344913496744	-53	21/02/24 15:40:29
109	365.34205862707444	280.9445005087476	-64	21/02/24 15:40:29
112	360.33084939037263	282.2851479696295	-65	21/02/24 15:40:29
119	363.6527972760671	276.499073089803	-69	21/02/24 15:40:29
117	369.239898205492	274.21448833832176	-68	21/02/24 15:40:29

114	381.5992223502213	289.5952994882171	-61	21/02/24 15:40:30
116	377.9647653672978	286.9907349984353	-55	21/02/24 15:40:30
115	377.751717565356	288.3800056854842	-57	21/02/24 15:40:30
96	377.44892680179316	276.8922953490967	-67	21/02/24 15:40:30
94	371.72787175525207	289.5180158335357	-35	21/02/24 15:40:30
92	370.6727223195025	288.1316940639638	-46	21/02/24 15:40:30
110	367.98757076589385	277.42210180952264	-65	21/02/24 15:40:30
93	366.9922408772935	287.5344913496744	-57	21/02/24 15:40:30
109	365.34205862707444	280.9445005087476	-63	21/02/24 15:40:30
112	360.33084939037263	282.2851479696295	-65	21/02/24 15:40:30
119	363.6527972760671	276.499073089803	-70	21/02/24 15:40:30
117	369.239898205492	274.21448833832176	-69	21/02/24 15:40:30

114	381.5992223502213	289.5952994882171	-63	21/02/24 15:40:31
116	377.9647653672978	286.9907349984353	-57	21/02/24 15:40:31
115	377.751717565356	288.3800056854842	-55	21/02/24 15:40:31
96	377.44892680179316	276.8922953490967	-65	21/02/24 15:40:31
94	371.72787175525207	289.5180158335357	-25	21/02/24 15:40:31
92	370.6727223195025	288.1316940639638	-44	21/02/24 15:40:31
110	367.98757076589385	277.42210180952264	-65	21/02/24 15:40:31
93	366.9922408772935	287.5344913496744	-53	21/02/24 15:40:31
109	365.34205862707444	280.9445005087476	-64	21/02/24 15:40:31
112	360.33084939037263	282.2851479696295	-67	21/02/24 15:40:31
119	363.6527972760671	276.499073089803	-69	21/02/24 15:40:31
117	369.239898205492	274.21448833832176	-68	21/02/24 15:40:31

114	381.5992223502213	289.5952994882171	-60	21/02/24 15:40:32
116	377.9647653672978	286.9907349984353	-54	21/02/24 15:40:32
115	377.751717565356	288.3800056854842	-56	21/02/24 15:40:32
96	377.44892680179316	276.8922953490967	-66	21/02/24 15:40:32
94	371.72787175525207	289.5180158335357	-20	21/02/24 15:40:32
92	370.6727223195025	288.1316940639638	-43	21/02/24 15:40:32
110	367.98757076589385	277.42210180952264	-65	21/02/24 15:40:32
93	366.9922408772935	287.5344913496744	-54	21/02/24 15:40:32
109	365.34205862707444	280.9445005087476	-63	21/02/24 15:40:32
112	360.33084939037263	282.2851479696295	-65	21/02/24 15:40:32
119	363.6527972760671	276.499073089803	-66	21/02/24 15:40:32
117	369.239898205492	274.21448833832176	-68	21/02/24 15:40:32

114	381.5992223502213	289.5952994882171	-61	21/02/24 15:40:33
116	377.9647653672978	286.9907349984353	-56	21/02/24 15:40:33
115	377.751717565356	288.3800056854842	-53	21/02/24 15:40:33
96	377.44892680179316	276.8922953490967	-65	21/02/24 15:40:33
94	371.72787175525207	289.5180158335357	-29	21/02/24 15:40:33
92	370.6727223195025	288.1316940639638	-40	21/02/24 15:40:33
110	367.98757076589385	277.42210180952264	-65	21/02/24 15:40:33
93	366.9922408772935	287.5344913496744	-52	21/02/24 15:40:33
109	365.34205862707444	280.9445005087476	-63	21/02/24 15:40:33
112	360.33084939037263	282.2851479696295	-65	21/02/24 15:40:33
119	363.6527972760671	276.499073089803	-67	21/02/24 15:40:33
117	369.239898205492	274.21448833832176	-66	21/02/24 15:40:33

114	381.5992223502213	289.5952994882171	-62	21/02/24 15:40:34
116	377.9647653672978	286.9907349984353	-55	21/02/24 15:40:34
115	377.751717565356	288.3800056854842	-54	21/02/24 15:40:34
96	377.44892680179316	276.8922953490967	-64	21/02/24 15:40:34
94	371.72787175525207	289.5180158335357	-34	21/02/24 15:40:34
92	370.6727223195025	288.1316940639638	-41	21/02/24 15:40:34
110	367.98757076589385	277.42210180952264	-63	21/02/24 15:40:34
93	366.9922408772935	287.5344913496744	-55	21/02/24 15:40:34
109	365.34205862707444	280.9445005087476	-62	21/02/24 15:40:34
112	360.33084939037263	282.2851479696295	-65	21/02/24 15:40:34
119	363.6527972760671	276.499073089803	-68	21/02/24 15:40:34
117	369.239898205492	274.21448833832176	-66	21/02/24 15:40:34

114	381.5992223502213	289.5952994882171	-61	21/02/24 15:40:35
116	377.9647653672978	286.9907349984353	-54	21/02/24 15:40:35
115	377.751717565356	288.3800056854842	-55	21/02/24 15:40:35
96	377.44892680179316	276.8922953490967	-63	21/02/24 15:40:35
94	371.72787175525207	289.5180158335357	-36	21/02/24 15:40:35
92	370.6727223195025	288.1316940639638	-37	21/02/24 15:40:35
110	367.98757076589385	277.42210180952264	-64	21/02/24 15:40:35
93	366.9922408772935	287.5344913496744	-55	21/02/24 15:40:35
109	365.34205862707444	280.9445005087476	-63	21/02/24 15:40:35
112	360.33084939037263	282.2851479696295	-64	21/02/24 15:40:35
119	363.6527972760671	276.499073089803	-65	21/02/24 15:40:35
118	357.09356967635637	275.4844405310735	-71	21/02/24 15:40:35
117	369.239898205492	274.21448833832176	-67	21/02/24 15:40:35

114	381.5992223502213	289.5952994882171	-60	21/02/24 15:40:36
116	377.9647653672978	286.9907349984353	-56	21/02/24 15:40:36
115	377.751717565356	288.3800056854842	-54	21/02/24 15:40:36
96	377.44892680179316	276.8922953490967	-65	21/02/24 15:40:36
94	371.72787175525207	289.5180158335357	-36	21/02/24 15:40:36
92	370.6727223195025	288.1316940639638	-35	21/02/24 15:40:36
110	367.98757076589385	277.42210180952264	-63	21/02/24 15:40:36
93	366.9922408772935	287.5344913496744	-52	21/02/24 15:40:36
109	365.34205862707444	280.9445005087476	-61	21/02/24 15:40:36
112	360.33084939037263	282.2851479696295	-63	21/02/24 15:40:36
119	363.6527972760671	276.499073089803	-67	21/02/24 15:40:36
118	357.09356967635637	275.4844405310735	-70	21/02/24 15:40:36
117	369.239898205492	274.21448833832176	-65	21/02/24 15:40:36

114	381.5992223502213	289.5952994882171	-61	21/02/24 15:40:37
116	377.9647653672978	286.9907349984353	-55	21/02/24 15:40:37
115	377.751717565356	288.3800056854842	-56	21/02/24 15:40:37
96	377.44892680179316	276.8922953490967	-64	21/02/24 15:40:37
94	371.72787175525207	289.5180158335357	-38	21/02/24 15:40:37
92	370.6727223195025	288.1316940639638	-24	21/02/24 15:40:37
110	367.98757076589385	277.42210180952264	-62	21/02/24 15:40:37
93	366.9922408772935	287.5344913496744	-51	21/02/24 15:40:37
109	365.34205862707444	280.9445005087476	-59	21/02/24 15:40:37
112	360.33084939037263	282.2851479696295	-64	21/02/24 15:40:37
119	363.6527972760671	276.499073089803	-64	21/02/24 15:40:37
118	357.09356967635637	275.4844405310735	-69	21/02/24 15:40:37
117	369.239898205492	274.21448833832176	-67	21/02/24 15:40:37

114	381.5992223502213	289.5952994882171	-60	21/02/24 15:40:38
116	377.9647653672978	286.9907349984353	-55	21/02/24 15:40:38
115	377.751717565356	288.3800056854842	-56	21/02/24 15:40:38
96	377.44892680179316	276.8922953490967	-64	21/02/24 15:40:38
94	371.72787175525207	289.5180158335357	-39	21/02/24 15:40:38
92	370.6727223195025	288.1316940639638	-32	21/02/24 15:40:38
110	367.98757076589385	277.42210180952264	-62	21/02/24 15:40:38
93	366.9922408772935	287.5344913496744	-50	21/02/24 15:40:38
109	365.34205862707444	280.9445005087476	-61	21/02/24 15:40:38
112	360.33084939037263	282.2851479696295	-64	21/02/24 15:40:38
119	363.6527972760671	276.499073089803	-64	21/02/24 15:40:38
118	357.09356967635637	275.4844405310735	-69	21/02/24 15:40:38
117	369.239898205492	274.21448833832176	-67	21/02/24 15:40:38

114	381.5992223502213	289.5952994882171	-61	21/02/24 15:40:39
116	377.9647653672978	286.9907349984353	-55	21/02/24 15:40:39
115	377.751717565356	288.3800056854842	-58	21/02/24 15:40:39
96	377.44892680179316	276.8922953490967	-64	21/02/24 15:40:39
94	371.72787175525207	289.5180158335357	-39	21/02/24 15:40:39
92	370.6727223195025	288.1316940639638	-28	21/02/24 15:40:39
110	367.98757076589385	277.42210180952264	-62	21/02/24 15:40:39
93	366.9922408772935	287.5344913496744	-52	21/02/24 15:40:39
109	365.34205862707444	280.9445005087476	-62	21/02/24 15:40:39
112	360.33084939037263	282.2851479696295	-63	21/02/24 15:40:39
119	363.6527972760671	276.499073089803	-66	21/02/24 15:40:39
118	357.09356967635637	275.4844405310735	-71	21/02/24 15:40:39
117	369.239898205492	274.21448833832176	-67	21/02/24 15:40:39

114	381.5992223502213	289.5952994882171	-60	21/02/24 15:40:40
116	377.9647653672978	286.9907349984353	-56	21/02/24 15:40:40
115	377.751717565356	288.3800056854842	-56	21/02/24 15:40:40
96	377.44892680179316	276.8922953490967	-65	21/02/24 15:40:40
94	371.72787175525207	289.5180158335357	-37	21/02/24 15:40:40
92	370.6727223195025	288.1316940639638	-26	21/02/24 15:40:40
110	367.98757076589385	277.42210180952264	-63	21/02/24 15:40:40
93	366.9922408772935	287.5344913496744	-50	21/02/24 15:40:40
109	365.34205862707444	280.9445005087476	-61	21/02/24 15:40:40
112	360.33084939037263	282.2851479696295	-64	21/02/24 15:40:40
119	363.6527972760671	276.499073089803	-66	21/02/24 15:40:40
118	357.09356967635637	275.4844405310735	-70	21/02/24 15:40:40
117	369.239898205492	274.21448833832176	-66	21/02/24 15:40:40

114	381.5992223502213	289.5952994882171	-63	21/02/24 15:40:41
116	377.9647653672978	286.9907349984353	-57	21/02/24 15:40:41
115	377.751717565356	288.3800056854842	-55	21/02/24 15:40:41
96	377.44892680179316	276.8922953490967	-65	21/02/24 15:40:41
94	371.72787175525207	289.5180158335357	-38	21/02/24 15:40:41
92	370.6727223195025	288.1316940639638	-32	21/02/24 15:40:41
110	367.98757076589385	277.42210180952264	-62	21/02/24 15:40:41
93	366.9922408772935	287.5344913496744	-52	21/02/24 15:40:41
109	365.34205862707444	280.9445005087476	-59	21/02/24 15:40:41
112	360.33084939037263	282.2851479696295	-63	21/02/24 15:40:41
119	363.6527972760671	276.499073089803	-66	21/02/24 15:40:41
118	357.09356967635637	275.4844405310735	-68	21/02/24 15:40:41
117	369.239898205492	274.21448833832176	-67	21/02/24 15:40:41

114	381.5992223502213	289.5952994882171	-62	21/02/24 15:40:42
116	377.9647653672978	286.9907349984353	-58	21/02/24 15:40:42
115	377.751717565356	288.3800056854842	-56	21/02/24 15:40:42
96	377.44892680179316	276.8922953490967	-63	21/02/24 15:40:42
94	371.72787175525207	289.5180158335357	-39	21/02/24 15:40:42
92	370.6727223195025	288.1316940639638	-28	21/02/24 15:40:42
110	367.98757076589385	277.42210180952264	-61	21/02/24 15:40:42
93	366.9922408772935	287.5344913496744	-50	21/02/24 15:40:42
109	365.34205862707444	280.9445005087476	-60	21/02/24 15:40:42
112	360.33084939037263	282.2851479696295	-64	21/02/24 15:40:42
119	363.6527972760671	276.499073089803	-67	21/02/24 15:40:42
118	357.09356967635637	275.4844405310735	-68	21/02/24 15:40:42
117	369.239898205492	274.21448833832176	-65	21/02/24 15:40:42

114	381.5992223502213	289.5952994882171	-64	21/02/24 15:40:43
116	377.9647653672978	286.9907349984353	-56	21/02/24 15:40:43
115	377.751717565356	288.3800056854842	-58	21/02/24 15:40:43
96	377.44892680179316	276.8922953490967	-64	21/02/24 15:40:43
94	371.72787175525207	289.5180158335357	-39	21/02/24 15:40:43
92	370.6727223195025	288.1316940639638	-8	21/02/24 15:40:43
110	367.98757076589385	277.42210180952264	-64	21/02/24 15:40:43
93	366.9922408772935	287.5344913496744	-49	21/02/24 15:40:43
109	365.34205862707444	280.9445005087476	-60	21/02/24 15:40:43
112	360.33084939037263	282.2851479696295	-62	21/02/24 15:40:43
119	363.6527972760671	276.499073089803	-65	21/02/24 15:40:43
118	357.09356967635637	275.4844405310735	-70	21/02/24 15:40:43
117	369.239898205492	274.21448833832176	-68	21/02/24 15:40:43

114	381.5992223502213	289.5952994882171	-62	21/02/24 15:40:44
116	377.9647653672978	286.9907349984353	-59	21/02/24 15:40:44
115	377.751717565356	288.3800056854842	-57	21/02/24 15:40:44
96	377.44892680179316	276.8922953490967	-64	21/02/24 15:40:44
94	371.72787175525207	289.5180158335357	-38	21/02/24 15:40:44
92	370.6727223195025	288.1316940639638	-12	21/02/24 15:40:44
110	367.98757076589385	277.42210180952264	-63	21/02/24 15:40:44
93	366.9922408772935	287.5344913496744	-51	21/02/24 15:40:44
109	365.34205862707444	280.9445005087476	-60	21/02/24 15:40:44
112	360.33084939037263	282.2851479696295	-65	21/02/24 15:40:44
119	363.6527972760671	276.499073089803	-67	21/02/24 15:40:44
118	357.09356967635637	275.4844405310735	-68	21/02/24 15:40:44
117	369.239898205492	274.21448833832176	-65	21/02/24 15:40:44

114	381.5992223502213	289.5952994882171	-63	21/02/24 15:40:45
116	377.9647653672978	286.9907349984353	-56	21/02/24 15:40:45
115	377.751717565356	288.3800056854842	-56	21/02/24 15:40:45
96	377.44892680179316	276.8922953490967	-66	21/02/24 15:40:45
94	371.72787175525207	289.5180158335357	-44	21/02/24 15:40:45
92	370.6727223195025	288.1316940639638	-23	21/02/24 15:40:45
110	367.98757076589385	277.42210180952264	-60	21/02/24 15:40:45
93	366.9922408772935	287.5344913496744	-46	21/02/24 15:40:45
109	365.34205862707444	280.9445005087476	-61	21/02/24 15:40:45
112	360.33084939037263	282.2851479696295	-61	21/02/24 15:40:45
119	363.6527972760671	276.499073089803	-65	21/02/24 15:40:45
118	357.09356967635637	275.4844405310735	-69	21/02/24 15:40:45
117	369.239898205492	274.21448833832176	-66	21/02/24 15:40:45

114	381.5992223502213	289.5952994882171	-64	21/02/24 15:40:46
116	377.9647653672978	286.9907349984353	-58	21/02/24 15:40:46
115	377.751717565356	288.3800056854842	-56	21/02/24 15:40:46
96	377.44892680179316	276.8922953490967	-67	21/02/24 15:40:46
94	371.72787175525207	289.5180158335357	-36	21/02/24 15:40:46
92	370.6727223195025	288.1316940639638	-13	21/02/24 15:40:46
110	367.98757076589385	277.42210180952264	-62	21/02/24 15:40:46
93	366.9922408772935	287.5344913496744	-49	21/02/24 15:40:46
109	365.34205862707444	280.9445005087476	-60	21/02/24 15:40:46
112	360.33084939037263	282.2851479696295	-65	21/02/24 15:40:46
119	363.6527972760671	276.499073089803	-66	21/02/24 15:40:46
118	357.09356967635637	275.4844405310735	-71	21/02/24 15:40:46
117	369.239898205492	274.21448833832176	-67	21/02/24 15:40:46

114	381.5992223502213	289.5952994882171	-62	21/02/24 15:40:47
116	377.9647653672978	286.9907349984353	-57	21/02/24 15:40:47
115	377.751717565356	288.3800056854842	-55	21/02/24 15:40:47
96	377.44892680179316	276.8922953490967	-66	21/02/24 15:40:47
94	371.72787175525207	289.5180158335357	-39	21/02/24 15:40:47
92	370.6727223195025	288.1316940639638	-14	21/02/24 15:40:47
110	367.98757076589385	277.42210180952264	-64	21/02/24 15:40:47
93	366.9922408772935	287.5344913496744	-50	21/02/24 15:40:47
109	365.34205862707444	280.9445005087476	-62	21/02/24 15:40:47
112	360.33084939037263	282.2851479696295	-65	21/02/24 15:40:47
119	363.6527972760671	276.499073089803	-64	21/02/24 15:40:47
118	357.09356967635637	275.4844405310735	-71	21/02/24 15:40:47
117	369.239898205492	274.21448833832176	-64	21/02/24 15:40:47

114	381.5992223502213	289.5952994882171	-62	21/02/24 15:40:48
116	377.9647653672978	286.9907349984353	-59	21/02/24 15:40:48
115	377.751717565356	288.3800056854842	-56	21/02/24 15:40:48
96	377.44892680179316	276.8922953490967	-66	21/02/24 15:40:48
94	371.72787175525207	289.5180158335357	-36	21/02/24 15:40:48
92	370.6727223195025	288.1316940639638	-13	21/02/24 15:40:48
110	367.98757076589385	277.42210180952264	-64	21/02/24 15:40:48
93	366.9922408772935	287.5344913496744	-50	21/02/24 15:40:48
109	365.34205862707444	280.9445005087476	-61	21/02/24 15:40:48
112	360.33084939037263	282.2851479696295	-63	21/02/24 15:40:48
119	363.6527972760671	276.499073089803	-66	21/02/24 15:40:48
118	357.09356967635637	275.4844405310735	-71	21/02/24 15:40:48
117	369.239898205492	274.21448833832176	-66	21/02/24 15:40:48

114	381.5992223502213	289.5952994882171	-61	21/02/24 15:40:49
116	377.9647653672978	286.9907349984353	-59	21/02/24 15:40:49
115	377.751717565356	288.3800056854842	-56	21/02/24 15:40:49
96	377.44892680179316	276.8922953490967	-64	21/02/24 15:40:49
94	371.72787175525207	289.5180158335357	-37	21/02/24 15:40:49
92	370.6727223195025	288.1316940639638	-22	21/02/24 15:40:49
110	367.98757076589385	277.42210180952264	-65	21/02/24 15:40:49
93	366.9922408772935	287.5344913496744	-50	21/02/24 15:40:49
109	365.34205862707444	280.9445005087476	-62	21/02/24 15:40:49
112	360.33084939037263	282.2851479696295	-63	21/02/24 15:40:49
119	363.6527972760671	276.499073089803	-68	21/02/24 15:40:49
118	357.09356967635637	275.4844405310735	-69	21/02/24 15:40:49
117	369.239898205492	274.21448833832176	-65	21/02/24 15:40:49

114	381.5992223502213	289.5952994882171	-62	21/02/24 15:40:50
116	377.9647653672978	286.9907349984353	-59	21/02/24 15:40:50
115	377.751717565356	288.3800056854842	-57	21/02/24 15:40:50
96	377.44892680179316	276.8922953490967	-67	21/02/24 15:40:50
94	371.72787175525207	289.5180158335357	-36	21/02/24 15:40:50
92	370.6727223195025	288.1316940639638	-25	21/02/24 15:40:50
110	367.98757076589385	277.42210180952264	-63	21/02/24 15:40:50
93	366.9922408772935	287.5344913496744	-50	21/02/24 15:40:50
109	365.34205862707444	280.9445005087476	-61	21/02/24 15:40:50
112	360.33084939037263	282.2851479696295	-65	21/02/24 15:40:50
119	363.6527972760671	276.499073089803	-66	21/02/24 15:40:50
118	357.09356967635637	275.4844405310735	-68	21/02/24 15:40:50
117	369.239898205492	274.21448833832176	-66	21/02/24 15:40:50

114	381.5992223502213	289.5952994882171	-65	21/02/24 15:40:51
116	377.9647653672978	286.9907349984353	-60	21/02/24 15:40:51
115	377.751717565356	288.3800056854842	-56	21/02/24 15:40:51
96	377.44892680179316	276.8922953490967	-65	21/02/24 15:40:51
94	371.72787175525207	289.5180158335357	-41	21/02/24 15:40:51
92	370.6727223195025	288.1316940639638	-25	21/02/24 15:40:51
110	367.98757076589385	277.42210180952264	-61	21/02/24 15:40:51
93	366.9922408772935	287.5344913496744	-46	21/02/24 15:40:51
109	365.34205862707444	280.9445005087476	-62	21/02/24 15:40:51
112	360.33084939037263	282.2851479696295	-64	21/02/24 15:40:51
119	363.6527972760671	276.499073089803	-66	21/02/24 15:40:51
118	357.09356967635637	275.4844405310735	-68	21/02/24 15:40:51
117	369.239898205492	274.21448833832176	-64	21/02/24 15:40:51

114	381.5992223502213	289.5952994882171	-63	21/02/24 15:40:52
116	377.9647653672978	286.9907349984353	-57	21/02/24 15:40:52
115	377.751717565356	288.3800056854842	-57	21/02/24 15:40:52
96	377.44892680179316	276.8922953490967	-64	21/02/24 15:40:52
94	371.72787175525207	289.5180158335357	-40	21/02/24 15:40:52
92	370.6727223195025	288.1316940639638	-18	21/02/24 15:40:52
110	367.98757076589385	277.42210180952264	-65	21/02/24 15:40:52
93	366.9922408772935	287.5344913496744	-46	21/02/24 15:40:52
109	365.34205862707444	280.9445005087476	-59	21/02/24 15:40:52
112	360.33084939037263	282.2851479696295	-64	21/02/24 15:40:52
119	363.6527972760671	276.499073089803	-67	21/02/24 15:40:52
118	357.09356967635637	275.4844405310735	-68	21/02/24 15:40:52
117	369.239898205492	274.21448833832176	-68	21/02/24 15:40:52

114	381.5992223502213	289.5952994882171	-62	21/02/24 15:40:53
116	377.9647653672978	286.9907349984353	-58	21/02/24 15:40:53
115	377.751717565356	288.3800056854842	-56	21/02/24 15:40:53
96	377.44892680179316	276.8922953490967	-66	21/02/24 15:40:53
94	371.72787175525207	289.5180158335357	-40	21/02/24 15:40:53
92	370.6727223195025	288.1316940639638	-26	21/02/24 15:40:53
110	367.98757076589385	277.42210180952264	-64	21/02/24 15:40:53
93	366.9922408772935	287.5344913496744	-47	21/02/24 15:40:53
109	365.34205862707444	280.9445005087476	-59	21/02/24 15:40:53
112	360.33084939037263	282.2851479696295	-63	21/02/24 15:40:53
119	363.6527972760671	276.499073089803	-64	21/02/24 15:40:53
118	357.09356967635637	275.4844405310735	-70	21/02/24 15:40:53
117	369.239898205492	274.21448833832176	-66	21/02/24 15:40:53

114	381.5992223502213	289.5952994882171	-64	21/02/24 15:40:54
116	377.9647653672978	286.9907349984353	-60	21/02/24 15:40:54
115	377.751717565356	288.3800056854842	-58	21/02/24 15:40:54
96	377.44892680179316	276.8922953490967	-64	21/02/24 15:40:54
94	371.72787175525207	289.5180158335357	-38	21/02/24 15:40:54
92	370.6727223195025	288.1316940639638	-20	21/02/24 15:40:54
110	367.98757076589385	277.42210180952264	-62	21/02/24 15:40:54
93	366.9922408772935	287.5344913496744	-48	21/02/24 15:40:54
109	365.34205862707444	280.9445005087476	-60	21/02/24 15:40:54
112	360.33084939037263	282.2851479696295	-63	21/02/24 15:40:54
119	363.6527972760671	276.499073089803	-66	21/02/24 15:40:54
118	357.09356967635637	275.4844405310735	-69	21/02/24 15:40:54
117	369.239898205492	274.21448833832176	-66	21/02/24 15:40:54

114	381.5992223502213	289.5952994882171	-65	21/02/24 15:40:55
116	377.9647653672978	286.9907349984353	-58	21/02/24 15:40:55
115	377.751717565356	288.3800056854842	-59	21/02/24 15:40:55
96	377.44892680179316	276.8922953490967	-68	21/02/24 15:40:55
94	371.72787175525207	289.5180158335357	-42	21/02/24 15:40:55
92	370.6727223195025	288.1316940639638	-32	21/02/24 15:40:55
110	367.98757076589385	277.42210180952264	-65	21/02/24 15:40:55
93	366.9922408772935	287.5344913496744	-46	21/02/24 15:40:55
109	365.34205862707444	280.9445005087476	-62	21/02/24 15:40:55
112	360.33084939037263	282.2851479696295	-61	21/02/24 15:40:55
119	363.6527972760671	276.499073089803	-65	21/02/24 15:40:55
118	357.09356967635637	275.4844405310735	-69	21/02/24 15:40:55
117	369.239898205492	274.21448833832176	-68	21/02/24 15:40:55

114	381.5992223502213	289.5952994882171	-64	21/02/24 15:40:56
116	377.9647653672978	286.9907349984353	-58	21/02/24 15:40:56
115	377.751717565356	288.3800056854842	-58	21/02/24 15:40:56
96	377.44892680179316	276.8922953490967	-66	21/02/24 15:40:56
94	371.72787175525207	289.5180158335357	-40	21/02/24 15:40:56
92	370.6727223195025	288.1316940639638	-33	21/02/24 15:40:56
110	367.98757076589385	277.42210180952264	-63	21/02/24 15:40:56
93	366.9922408772935	287.5344913496744	-47	21/02/24 15:40:56
109	365.34205862707444	280.9445005087476	-62	21/02/24 15:40:56
112	360.33084939037263	282.2851479696295	-65	21/02/24 15:40:56
119	363.6527972760671	276.499073089803	-65	21/02/24 15:40:56
118	357.09356967635637	275.4844405310735	-72	21/02/24 15:40:56
117	369.239898205492	274.21448833832176	-66	21/02/24 15:40:56

114	381.5992223502213	289.5952994882171	-64	21/02/24 15:40:57
116	377.9647653672978	286.9907349984353	-59	21/02/24 15:40:57
115	377.751717565356	288.3800056854842	-58	21/02/24 15:40:57
96	377.44892680179316	276.8922953490967	-65	21/02/24 15:40:57
94	371.72787175525207	289.5180158335357	-39	21/02/24 15:40:57
92	370.6727223195025	288.1316940639638	-34	21/02/24 15:40:57
110	367.98757076589385	277.42210180952264	-65	21/02/24 15:40:57
93	366.9922408772935	287.5344913496744	-46	21/02/24 15:40:57
109	365.34205862707444	280.9445005087476	-61	21/02/24 15:40:57
112	360.33084939037263	282.2851479696295	-62	21/02/24 15:40:57
119	363.6527972760671	276.499073089803	-65	21/02/24 15:40:57
118	357.09356967635637	275.4844405310735	-68	21/02/24 15:40:57
117	369.239898205492	274.21448833832176	-66	21/02/24 15:40:57

114	381.5992223502213	289.5952994882171	-64	21/02/24 15:40:58
116	377.9647653672978	286.9907349984353	-60	21/02/24 15:40:58
115	377.751717565356	288.3800056854842	-59	21/02/24 15:40:58
96	377.44892680179316	276.8922953490967	-67	21/02/24 15:40:58
94	371.72787175525207	289.5180158335357	-38	21/02/24 15:40:58
92	370.6727223195025	288.1316940639638	-29	21/02/24 15:40:58
110	367.98757076589385	277.42210180952264	-64	21/02/24 15:40:58
93	366.9922408772935	287.5344913496744	-49	21/02/24 15:40:58
109	365.34205862707444	280.9445005087476	-60	21/02/24 15:40:58
112	360.33084939037263	282.2851479696295	-64	21/02/24 15:40:58
119	363.6527972760671	276.499073089803	-64	21/02/24 15:40:58
118	357.09356967635637	275.4844405310735	-70	21/02/24 15:40:58
117	369.239898205492	274.21448833832176	-68	21/02/24 15:40:58

114	381.5992223502213	289.5952994882171	-66	21/02/24 15:40:59
116	377.9647653672978	286.9907349984353	-60	21/02/24 15:40:59
115	377.751717565356	288.3800056854842	-60	21/02/24 15:40:59
96	377.44892680179316	276.8922953490967	-67	21/02/24 15:40:59
94	371.72787175525207	289.5180158335357	-43	21/02/24 15:40:59
92	370.6727223195025	288.1316940639638	-33	21/02/24 15:40:59
110	367.98757076589385	277.42210180952264	-62	21/02/24 15:40:59
93	366.9922408772935	287.5344913496744	-44	21/02/24 15:40:59
109	365.34205862707444	280.9445005087476	-59	21/02/24 15:40:59
112	360.33084939037263	282.2851479696295	-63	21/02/24 15:40:59
119	363.6527972760671	276.499073089803	-67	21/02/24 15:40:59
118	357.09356967635637	275.4844405310735	-71	21/02/24 15:40:59
117	369.239898205492	274.21448833832176	-68	21/02/24 15:40:59

114	381.5992223502213	289.5952994882171	-64	21/02/24 15:41:00
116	377.9647653672978	286.9907349984353	-61	21/02/24 15:41:00
115	377.751717565356	288.3800056854842	-60	21/02/24 15:41:00
96	377.44892680179316	276.8922953490967	-65	21/02/24 15:41:00
94	371.72787175525207	289.5180158335357	-45	21/02/24 15:41:00
92	370.6727223195025	288.1316940639638	-37	21/02/24 15:41:00
110	367.98757076589385	277.42210180952264	-63	21/02/24 15:41:00
93	366.9922408772935	287.5344913496744	-42	21/02/24 15:41:00
109	365.34205862707444	280.9445005087476	-61	21/02/24 15:41:00
112	360.33084939037263	282.2851479696295	-62	21/02/24 15:41:00
119	363.6527972760671	276.499073089803	-65	21/02/24 15:41:00
118	357.09356967635637	275.4844405310735	-70	21/02/24 15:41:00
117	369.239898205492	274.21448833832176	-66	21/02/24 15:41:00

114	381.5992223502213	289.5952994882171	-66	21/02/24 15:41:01
116	377.9647653672978	286.9907349984353	-63	21/02/24 15:41:01
115	377.751717565356	288.3800056854842	-62	21/02/24 15:41:01
96	377.44892680179316	276.8922953490967	-66	21/02/24 15:41:01
94	371.72787175525207	289.5180158335357	-45	21/02/24 15:41:01
92	370.6727223195025	288.1316940639638	-41	21/02/24 15:41:01
110	367.98757076589385	277.42210180952264	-64	21/02/24 15:41:01
93	366.9922408772935	287.5344913496744	-43	21/02/24 15:41:01
109	365.34205862707444	280.9445005087476	-60	21/02/24 15:41:01
112	360.33084939037263	282.2851479696295	-63	21/02/24 15:41:01
119	363.6527972760671	276.499073089803	-66	21/02/24 15:41:01
118	357.09356967635637	275.4844405310735	-70	21/02/24 15:41:01
117	369.239898205492	274.21448833832176	-66	21/02/24 15:41:01

114	381.5992223502213	289.5952994882171	-65	21/02/24 15:41:02
116	377.9647653672978	286.9907349984353	-62	21/02/24 15:41:02
115	377.751717565356	288.3800056854842	-60	21/02/24 15:41:02
96	377.44892680179316	276.8922953490967	-67	21/02/24 15:41:02
94	371.72787175525207	289.5180158335357	-45	21/02/24 15:41:02
92	370.6727223195025	288.1316940639638	-42	21/02/24 15:41:02
110	367.98757076589385	277.42210180952264	-64	21/02/24 15:41:02
93	366.9922408772935	287.5344913496744	-41	21/02/24 15:41:02
109	365.34205862707444	280.9445005087476	-61	21/02/24 15:41:02
112	360.33084939037263	282.2851479696295	-62	21/02/24 15:41:02
102	348.60037065169166	290.2443240990335	-69	21/02/24 15:41:02
119	363.6527972760671	276.499073089803	-67	21/02/24 15:41:02
118	357.09356967635637	275.4844405310735	-67	21/02/24 15:41:02
117	369.239898205492	274.21448833832176	-68	21/02/24 15:41:02

114	381.5992223502213	289.5952994882171	-67	21/02/24 15:41:03
116	377.9647653672978	286.9907349984353	-60	21/02/24 15:41:03
115	377.751717565356	288.3800056854842	-60	21/02/24 15:41:03
96	377.44892680179316	276.8922953490967	-66	21/02/24 15:41:03
94	371.72787175525207	289.5180158335357	-48	21/02/24 15:41:03
92	370.6727223195025	288.1316940639638	-46	21/02/24 15:41:03
110	367.98757076589385	277.42210180952264	-64	21/02/24 15:41:03
93	366.9922408772935	287.5344913496744	-45	21/02/24 15:41:03
109	365.34205862707444	280.9445005087476	-60	21/02/24 15:41:03
112	360.33084939037263	282.2851479696295	-63	21/02/24 15:41:03
102	348.60037065169166	290.2443240990335	-69	21/02/24 15:41:03
119	363.6527972760671	276.499073089803	-66	21/02/24 15:41:03
118	357.09356967635637	275.4844405310735	-70	21/02/24 15:41:03
117	369.239898205492	274.21448833832176	-68	21/02/24 15:41:03

114	381.5992223502213	289.5952994882171	-65	21/02/24 15:41:04
116	377.9647653672978	286.9907349984353	-63	21/02/24 15:41:04
115	377.751717565356	288.3800056854842	-63	21/02/24 15:41:04
96	377.44892680179316	276.8922953490967	-67	21/02/24 15:41:04
94	371.72787175525207	289.5180158335357	-49	21/02/24 15:41:04
92	370.6727223195025	288.1316940639638	-45	21/02/24 15:41:04
110	367.98757076589385	277.42210180952264	-64	21/02/24 15:41:04
93	366.9922408772935	287.5344913496744	-45	21/02/24 15:41:04
109	365.34205862707444	280.9445005087476	-62	21/02/24 15:41:04
112	360.33084939037263	282.2851479696295	-63	21/02/24 15:41:04
102	348.60037065169166	290.2443240990335	-71	21/02/24 15:41:04
119	363.6527972760671	276.499073089803	-65	21/02/24 15:41:04
118	357.09356967635637	275.4844405310735	-68	21/02/24 15:41:04
117	369.239898205492	274.21448833832176	-68	21/02/24 15:41:04

114	381.5992223502213	289.5952994882171	-66	21/02/24 15:41:05
116	377.9647653672978	286.9907349984353	-60	21/02/24 15:41:05
115	377.751717565356	288.3800056854842	-61	21/02/24 15:41:05
96	377.44892680179316	276.8922953490967	-66	21/02/24 15:41:05
94	371.72787175525207	289.5180158335357	-46	21/02/24 15:41:05
92	370.6727223195025	288.1316940639638	-41	21/02/24 15:41:05
110	367.98757076589385	277.42210180952264	-63	21/02/24 15:41:05
93	366.9922408772935	287.5344913496744	-43	21/02/24 15:41:05
109	365.34205862707444	280.9445005087476	-61	21/02/24 15:41:05
112	360.33084939037263	282.2851479696295	-65	21/02/24 15:41:05
119	363.6527972760671	276.499073089803	-64	21/02/24 15:41:05
118	357.09356967635637	275.4844405310735	-70	21/02/24 15:41:05
117	369.239898205492	274.21448833832176	-68	21/02/24 15:41:05

114	381.5992223502213	289.5952994882171	-65	21/02/24 15:41:06
116	377.9647653672978	286.9907349984353	-60	21/02/24 15:41:06
115	377.751717565356	288.3800056854842	-60	21/02/24 15:41:06
96	377.44892680179316	276.8922953490967	-67	21/02/24 15:41:06
94	371.72787175525207	289.5180158335357	-46	21/02/24 15:41:06
92	370.6727223195025	288.1316940639638	-41	21/02/24 15:41:06
110	367.98757076589385	277.42210180952264	-63	21/02/24 15:41:06
93	366.9922408772935	287.5344913496744	-46	21/02/24 15:41:06
109	365.34205862707444	280.9445005087476	-59	21/02/24 15:41:06
112	360.33084939037263	282.2851479696295	-62	21/02/24 15:41:06
119	363.6527972760671	276.499073089803	-68	21/02/24 15:41:06
118	357.09356967635637	275.4844405310735	-71	21/02/24 15:41:06
117	369.239898205492	274.21448833832176	-69	21/02/24 15:41:06

114	381.5992223502213	289.5952994882171	-66	21/02/24 15:41:07
116	377.9647653672978	286.9907349984353	-63	21/02/24 15:41:07
115	377.751717565356	288.3800056854842	-61	21/02/24 15:41:07
96	377.44892680179316	276.8922953490967	-67	21/02/24 15:41:07
94	371.72787175525207	289.5180158335357	-45	21/02/24 15:41:07
92	370.6727223195025	288.1316940639638	-44	21/02/24 15:41:07
110	367.98757076589385	277.42210180952264	-66	21/02/24 15:41:07
93	366.9922408772935	287.5344913496744	-50	21/02/24 15:41:07
109	365.34205862707444	280.9445005087476	-62	21/02/24 15:41:07
112	360.33084939037263	282.2851479696295	-63	21/02/24 15:41:07
119	363.6527972760671	276.499073089803	-67	21/02/24 15:41:07
118	357.09356967635637	275.4844405310735	-71	21/02/24 15:41:07
117	369.239898205492	274.21448833832176	-68	21/02/24 15:41:07

114	381.5992223502213	289.5952994882171	-65	21/02/24 15:41:08
116	377.9647653672978	286.9907349984353	-61	21/02/24 15:41:08
115	377.751717565356	288.3800056854842	-60	21/02/24 15:41:08
96	377.44892680179316	276.8922953490967	-65	21/02/24 15:41:08
94	371.72787175525207	289.5180158335357	-43	21/02/24 15:41:08
92	370.6727223195025	288.1316940639638	-42	21/02/24 15:41:08
110	367.98757076589385	277.42210180952264	-63	21/02/24 15:41:08
93	366.9922408772935	287.5344913496744	-49	21/02/24 15:41:08
109	365.34205862707444	280.9445005087476	-63	21/02/24 15:41:08
112	360.33084939037263	282.2851479696295	-65	21/02/24 15:41:08
119	363.6527972760671	276.499073089803	-65	21/02/24 15:41:08
118	357.09356967635637	275.4844405310735	-70	21/02/24 15:41:08
117	369.239898205492	274.21448833832176	-67	21/02/24 15:41:08

114	381.5992223502213	289.5952994882171	-64	21/02/24 15:41:09
116	377.9647653672978	286.9907349984353	-61	21/02/24 15:41:09
115	377.751717565356	288.3800056854842	-61	21/02/24 15:41:09
96	377.44892680179316	276.8922953490967	-68	21/02/24 15:41:09
94	371.72787175525207	289.5180158335357	-42	21/02/24 15:41:09
92	370.6727223195025	288.1316940639638	-43	21/02/24 15:41:09
110	367.98757076589385	277.42210180952264	-67	21/02/24 15:41:09
93	366.9922408772935	287.5344913496744	-50	21/02/24 15:41:09
109	365.34205862707444	280.9445005087476	-63	21/02/24 15:41:09
112	360.33084939037263	282.2851479696295	-63	21/02/24 15:41:09
119	363.6527972760671	276.499073089803	-68	21/02/24 15:41:09
118	357.09356967635637	275.4844405310735	-69	21/02/24 15:41:09
117	369.239898205492	274.21448833832176	-68	21/02/24 15:41:09

114	381.5992223502213	289.5952994882171	-63	21/02/24 15:41:10
116	377.9647653672978	286.9907349984353	-63	21/02/24 15:41:10
115	377.751717565356	288.3800056854842	-59	21/02/24 15:41:10
96	377.44892680179316	276.8922953490967	-69	21/02/24 15:41:10
94	371.72787175525207	289.5180158335357	-45	21/02/24 15:41:10
92	370.6727223195025	288.1316940639638	-42	21/02/24 15:41:10
110	367.98757076589385	277.42210180952264	-64	21/02/24 15:41:10
93	366.9922408772935	287.5344913496744	-47	21/02/24 15:41:10
109	365.34205862707444	280.9445005087476	-62	21/02/24 15:41:10
112	360.33084939037263	282.2851479696295	-62	21/02/24 15:41:10
119	363.6527972760671	276.499073089803	-67	21/02/24 15:41:10
118	357.09356967635637	275.4844405310735	-68	21/02/24 15:41:10
117	369.239898205492	274.21448833832176	-68	21/02/24 15:41:10

114	381.5992223502213	289.5952994882171	-65	21/02/24 15:41:11
116	377.9647653672978	286.9907349984353	-59	21/02/24 15:41:11
115	377.751717565356	288.3800056854842	-62	21/02/24 15:41:11
96	377.44892680179316	276.8922953490967	-68	21/02/24 15:41:11
94	371.72787175525207	289.5180158335357	-45	21/02/24 15:41:11
92	370.6727223195025	288.1316940639638	-42	21/02/24 15:41:11
110	367.98757076589385	277.42210180952264	-64	21/02/24 15:41:11
93	366.9922408772935	287.5344913496744	-45	21/02/24 15:41:11
109	365.34205862707444	280.9445005087476	-61	21/02/24 15:41:11
112	360.33084939037263	282.2851479696295	-62	21/02/24 15:41:11
119	363.6527972760671	276.499073089803	-66	21/02/24 15:41:11
118	357.09356967635637	275.4844405310735	-68	21/02/24 15:41:11
117	369.239898205492	274.21448833832176	-66	21/02/24 15:41:11

114	381.5992223502213	289.5952994882171	-64	21/02/24 15:41:12
116	377.9647653672978	286.9907349984353	-62	21/02/24 15:41:12
115	377.751717565356	288.3800056854842	-58	21/02/24 15:41:12
96	377.44892680179316	276.8922953490967	-67	21/02/24 15:41:12
94	371.72787175525207	289.5180158335357	-40	21/02/24 15:41:12
92	370.6727223195025	288.1316940639638	-42	21/02/24 15:41:12
110	367.98757076589385	277.42210180952264	-66	21/02/24 15:41:12
93	366.9922408772935	287.5344913496744	-46	21/02/24 15:41:12
109	365.34205862707444	280.9445005087476	-60	21/02/24 15:41:12
112	360.33084939037263	282.2851479696295	-66	21/02/24 15:41:12
119	363.6527972760671	276.499073089803	-65	21/02/24 15:41:12
118	357.09356967635637	275.4844405310735	-71	21/02/24 15:41:12
117	369.239898205492	274.21448833832176	-66	21/02/24 15:41:12

114	381.5992223502213	289.5952994882171	-63	21/02/24 15:41:13
116	377.9647653672978	286.9907349984353	-60	21/02/24 15:41:13
115	377.751717565356	288.3800056854842	-61	21/02/24 15:41:13
96	377.44892680179316	276.8922953490967	-68	21/02/24 15:41:13
94	371.72787175525207	289.5180158335357	-42	21/02/24 15:41:13
92	370.6727223195025	288.1316940639638	-43	21/02/24 15:41:13
110	367.98757076589385	277.42210180952264	-66	21/02/24 15:41:13
93	366.9922408772935	287.5344913496744	-47	21/02/24 15:41:13
109	365.34205862707444	280.9445005087476	-60	21/02/24 15:41:13
112	360.33084939037263	282.2851479696295	-64	21/02/24 15:41:13
119	363.6527972760671	276.499073089803	-66	21/02/24 15:41:13
118	357.09356967635637	275.4844405310735	-71	21/02/24 15:41:13
117	369.239898205492	274.21448833832176	-68	21/02/24 15:41:13

114	381.5992223502213	289.5952994882171	-63	21/02/24 15:41:14
116	377.9647653672978	286.9907349984353	-59	21/02/24 15:41:14
115	377.751717565356	288.3800056854842	-57	21/02/24 15:41:14
96	377.44892680179316	276.8922953490967	-69	21/02/24 15:41:14
94	371.72787175525207	289.5180158335357	-41	21/02/24 15:41:14
92	370.6727223195025	288.1316940639638	-43	21/02/24 15:41:14
110	367.98757076589385	277.42210180952264	-64	21/02/24 15:41:14
93	366.9922408772935	287.5344913496744	-49	21/02/24 15:41:14
109	365.34205862707444	280.9445005087476	-62	21/02/24 15:41:14
112	360.33084939037263	282.2851479696295	-64	21/02/24 15:41:14
119	363.6527972760671	276.499073089803	-66	21/02/24 15:41:14
118	357.09356967635637	275.4844405310735	-70	21/02/24 15:41:14
117	369.239898205492	274.21448833832176	-67	21/02/24 15:41:14

114	381.5992223502213	289.5952994882171	-64	21/02/24 15:41:15
116	377.9647653672978	286.9907349984353	-59	21/02/24 15:41:15
115	377.751717565356	288.3800056854842	-57	21/02/24 15:41:15
96	377.44892680179316	276.8922953490967	-67	21/02/24 15:41:15
94	371.72787175525207	289.5180158335357	-40	21/02/24 15:41:15
92	370.6727223195025	288.1316940639638	-36	21/02/24 15:41:15
110	367.98757076589385	277.42210180952264	-64	21/02/24 15:41:15
93	366.9922408772935	287.5344913496744	-48	21/02/24 15:41:15
109	365.34205862707444	280.9445005087476	-62	21/02/24 15:41:15
112	360.33084939037263	282.2851479696295	-63	21/02/24 15:41:15
119	363.6527972760671	276.499073089803	-64	21/02/24 15:41:15
118	357.09356967635637	275.4844405310735	-69	21/02/24 15:41:15
117	369.239898205492	274.21448833832176	-65	21/02/24 15:41:15

114	381.5992223502213	289.5952994882171	-64	21/02/24 15:41:16
116	377.9647653672978	286.9907349984353	-59	21/02/24 15:41:16
115	377.751717565356	288.3800056854842	-57	21/02/24 15:41:16
96	377.44892680179316	276.8922953490967	-68	21/02/24 15:41:16
94	371.72787175525207	289.5180158335357	-39	21/02/24 15:41:16
92	370.6727223195025	288.1316940639638	-30	21/02/24 15:41:16
110	367.98757076589385	277.42210180952264	-63	21/02/24 15:41:16
93	366.9922408772935	287.5344913496744	-47	21/02/24 15:41:16
109	365.34205862707444	280.9445005087476	-62	21/02/24 15:41:16
112	360.33084939037263	282.2851479696295	-63	21/02/24 15:41:16
119	363.6527972760671	276.499073089803	-68	21/02/24 15:41:16
118	357.09356967635637	275.4844405310735	-68	21/02/24 15:41:16
117	369.239898205492	274.21448833832176	-68	21/02/24 15:41:16

114	381.5992223502213	289.5952994882171	-62	21/02/24 15:41:17
116	377.9647653672978	286.9907349984353	-57	21/02/24 15:41:17
115	377.751717565356	288.3800056854842	-57	21/02/24 15:41:17
96	377.44892680179316	276.8922953490967	-65	21/02/24 15:41:17
94	371.72787175525207	289.5180158335357	-38	21/02/24 15:41:17
92	370.6727223195025	288.1316940639638	-29	21/02/24 15:41:17
110	367.98757076589385	277.42210180952264	-64	21/02/24 15:41:17
93	366.9922408772935	287.5344913496744	-49	21/02/24 15:41:17
109	365.34205862707444	280.9445005087476	-59	21/02/24 15:41:17
112	360.33084939037263	282.2851479696295	-64	21/02/24 15:41:17
119	363.6527972760671	276.499073089803	-65	21/02/24 15:41:17
118	357.09356967635637	275.4844405310735	-68	21/02/24 15:41:17
117	369.239898205492	274.21448833832176	-68	21/02/24 15:41:17

114	381.5992223502213	289.5952994882171	-64	21/02/24 15:41:18
116	377.9647653672978	286.9907349984353	-59	21/02/24 15:41:18
115	377.751717565356	288.3800056854842	-56	21/02/24 15:41:18
96	377.44892680179316	276.8922953490967	-67	21/02/24 15:41:18
94	371.72787175525207	289.5180158335357	-37	21/02/24 15:41:18
92	370.6727223195025	288.1316940639638	-33	21/02/24 15:41:18
110	367.98757076589385	277.42210180952264	-65	21/02/24 15:41:18
93	366.9922408772935	287.5344913496744	-46	21/02/24 15:41:18
109	365.34205862707444	280.9445005087476	-60	21/02/24 15:41:18
112	360.33084939037263	282.2851479696295	-63	21/02/24 15:41:18
119	363.6527972760671	276.499073089803	-66	21/02/24 15:41:18
118	357.09356967635637	275.4844405310735	-71	21/02/24 15:41:18
117	369.239898205492	274.21448833832176	-66	21/02/24 15:41:18

114	381.5992223502213	289.5952994882171	-62	21/02/24 15:41:19
116	377.9647653672978	286.9907349984353	-58	21/02/24 15:41:19
115	377.751717565356	288.3800056854842	-60	21/02/24 15:41:19
96	377.44892680179316	276.8922953490967	-67	21/02/24 15:41:19
94	371.72787175525207	289.5180158335357	-40	21/02/24 15:41:19
92	370.6727223195025	288.1316940639638	-35	21/02/24 15:41:19
110	367.98757076589385	277.42210180952264	-63	21/02/24 15:41:19
93	366.9922408772935	287.5344913496744	-45	21/02/24 15:41:19
109	365.34205862707444	280.9445005087476	-58	21/02/24 15:41:19
112	360.33084939037263	282.2851479696295	-63	21/02/24 15:41:19
119	363.6527972760671	276.499073089803	-67	21/02/24 15:41:19
118	357.09356967635637	275.4844405310735	-69	21/02/24 15:41:19
117	369.239898205492	274.21448833832176	-67	21/02/24 15:41:19

114	381.5992223502213	289.5952994882171	-65	21/02/24 15:41:20
116	377.9647653672978	286.9907349984353	-58	21/02/24 15:41:20
115	377.751717565356	288.3800056854842	-57	21/02/24 15:41:20
96	377.44892680179316	276.8922953490967	-65	21/02/24 15:41:20
94	371.72787175525207	289.5180158335357	-37	21/02/24 15:41:20
92	370.6727223195025	288.1316940639638	-30	21/02/24 15:41:20
110	367.98757076589385	277.42210180952264	-63	21/02/24 15:41:20
93	366.9922408772935	287.5344913496744	-49	21/02/24 15:41:20
109	365.34205862707444	280.9445005087476	-61	21/02/24 15:41:20
112	360.33084939037263	282.2851479696295	-65	21/02/24 15:41:20
119	363.6527972760671	276.499073089803	-67	21/02/24 15:41:20
118	357.09356967635637	275.4844405310735	-71	21/02/24 15:41:20
117	369.239898205492	274.21448833832176	-67	21/02/24 15:41:20

114	381.5992223502213	289.5952994882171	-64	21/02/24 15:41:21
116	377.9647653672978	286.9907349984353	-59	21/02/24 15:41:21
115	377.751717565356	288.3800056854842	-56	21/02/24 15:41:21
96	377.44892680179316	276.8922953490967	-67	21/02/24 15:41:21
94	371.72787175525207	289.5180158335357	-39	21/02/24 15:41:21
92	370.6727223195025	288.1316940639638	-23	21/02/24 15:41:21
110	367.98757076589385	277.42210180952264	-65	21/02/24 15:41:21
93	366.9922408772935	287.5344913496744	-48	21/02/24 15:41:21
109	365.34205862707444	280.9445005087476	-61	21/02/24 15:41:21
112	360.33084939037263	282.2851479696295	-64	21/02/24 15:41:21
119	363.6527972760671	276.499073089803	-68	21/02/24 15:41:21
118	357.09356967635637	275.4844405310735	-68	21/02/24 15:41:21
117	369.239898205492	274.21448833832176	-65	21/02/24 15:41:21

114	381.5992223502213	289.5952994882171	-64	21/02/24 15:41:22
116	377.9647653672978	286.9907349984353	-59	21/02/24 15:41:22
115	377.751717565356	288.3800056854842	-58	21/02/24 15:41:22
96	377.44892680179316	276.8922953490967	-66	21/02/24 15:41:22
94	371.72787175525207	289.5180158335357	-37	21/02/24 15:41:22
92	370.6727223195025	288.1316940639638	-24	21/02/24 15:41:22
110	367.98757076589385	277.42210180952264	-65	21/02/24 15:41:22
93	366.9922408772935	287.5344913496744	-50	21/02/24 15:41:22
109	365.34205862707444	280.9445005087476	-62	21/02/24 15:41:22
112	360.33084939037263	282.2851479696295	-63	21/02/24 15:41:22
119	363.6527972760671	276.499073089803	-65	21/02/24 15:41:22
118	357.09356967635637	275.4844405310735	-71	21/02/24 15:41:22
117	369.239898205492	274.21448833832176	-67	21/02/24 15:41:22

114	381.5992223502213	289.5952994882171	-62	21/02/24 15:41:23
116	377.9647653672978	286.9907349984353	-58	21/02/24 15:41:23
115	377.751717565356	288.3800056854842	-56	21/02/24 15:41:23
96	377.44892680179316	276.8922953490967	-68	21/02/24 15:41:23
94	371.72787175525207	289.5180158335357	-34	21/02/24 15:41:23
92	370.6727223195025	288.1316940639638	-36	21/02/24 15:41:23
110	367.98757076589385	277.42210180952264	-64	21/02/24 15:41:23
93	366.9922408772935	287.5344913496744	-51	21/02/24 15:41:23
109	365.34205862707444	280.9445005087476	-62	21/02/24 15:41:23
112	360.33084939037263	282.2851479696295	-64	21/02/24 15:41:23
119	363.6527972760671	276.499073089803	-65	21/02/24 15:41:23
118	357.09356967635637	275.4844405310735	-71	21/02/24 15:41:23
117	369.239898205492	274.21448833832176	-66	21/02/24 15:41:23

114	381.5992223502213	289.5952994882171	-63	21/02/24 15:41:24
116	377.9647653672978	286.9907349984353	-59	21/02/24 15:41:24
115	377.751717565356	288.3800056854842	-56	21/02/24 15:41:24
96	377.44892680179316	276.8922953490967	-67	21/02/24 15:41:24
94	371.72787175525207	289.5180158335357	-26	21/02/24 15:41:24
92	370.6727223195025	288.1316940639638	-36	21/02/24 15:41:24
110	367.98757076589385	277.42210180952264	-64	21/02/24 15:41:24
93	366.9922408772935	287.5344913496744	-53	21/02/24 15:41:24
109	365.34205862707444	280.9445005087476	-61	21/02/24 15:41:24
112	360.33084939037263	282.2851479696295	-63	21/02/24 15:41:24
119	363.6527972760671	276.499073089803	-68	21/02/24 15:41:24
118	357.09356967635637	275.4844405310735	-70	21/02/24 15:41:24
117	369.239898205492	274.21448833832176	-69	21/02/24 15:41:24

114	381.5992223502213	289.5952994882171	-60	21/02/24 15:41:25
116	377.9647653672978	286.9907349984353	-58	21/02/24 15:41:25
115	377.751717565356	288.3800056854842	-57	21/02/24 15:41:25
96	377.44892680179316	276.8922953490967	-64	21/02/24 15:41:25
94	371.72787175525207	289.5180158335357	-31	21/02/24 15:41:25
92	370.6727223195025	288.1316940639638	-29	21/02/24 15:41:25
110	367.98757076589385	277.42210180952264	-64	21/02/24 15:41:25
93	366.9922408772935	287.5344913496744	-50	21/02/24 15:41:25
109	365.34205862707444	280.9445005087476	-60	21/02/24 15:41:25
112	360.33084939037263	282.2851479696295	-66	21/02/24 15:41:25
119	363.6527972760671	276.499073089803	-68	21/02/24 15:41:25
118	357.09356967635637	275.4844405310735	-70	21/02/24 15:41:25
117	369.239898205492	274.21448833832176	-66	21/02/24 15:41:25

114	381.5992223502213	289.5952994882171	-60	21/02/24 15:41:26
116	377.9647653672978	286.9907349984353	-55	21/02/24 15:41:26
115	377.751717565356	288.3800056854842	-55	21/02/24 15:41:26
96	377.44892680179316	276.8922953490967	-67	21/02/24 15:41:26
94	371.72787175525207	289.5180158335357	-26	21/02/24 15:41:26
92	370.6727223195025	288.1316940639638	-32	21/02/24 15:41:26
110	367.98757076589385	277.42210180952264	-64	21/02/24 15:41:26
93	366.9922408772935	287.5344913496744	-53	21/02/24 15:41:26
109	365.34205862707444	280.9445005087476	-62	21/02/24 15:41:26
112	360.33084939037263	282.2851479696295	-65	21/02/24 15:41:26
119	363.6527972760671	276.499073089803	-66	21/02/24 15:41:26
118	357.09356967635637	275.4844405310735	-70	21/02/24 15:41:26
117	369.239898205492	274.21448833832176	-65	21/02/24 15:41:26

114	381.5992223502213	289.5952994882171	-63	21/02/24 15:41:27
116	377.9647653672978	286.9907349984353	-57	21/02/24 15:41:27
115	377.751717565356	288.3800056854842	-55	21/02/24 15:41:27
96	377.44892680179316	276.8922953490967	-67	21/02/24 15:41:27
94	371.72787175525207	289.5180158335357	-23	21/02/24 15:41:27
92	370.6727223195025	288.1316940639638	-37	21/02/24 15:41:27
110	367.98757076589385	277.42210180952264	-64	21/02/24 15:41:27
93	366.9922408772935	287.5344913496744	-54	21/02/24 15:41:27
109	365.34205862707444	280.9445005087476	-61	21/02/24 15:41:27
112	360.33084939037263	282.2851479696295	-66	21/02/24 15:41:27
119	363.6527972760671	276.499073089803	-67	21/02/24 15:41:27
118	357.09356967635637	275.4844405310735	-69	21/02/24 15:41:27
117	369.239898205492	274.21448833832176	-65	21/02/24 15:41:27

114	381.5992223502213	289.5952994882171	-63	21/02/24 15:41:28
116	377.9647653672978	286.9907349984353	-57	21/02/24 15:41:28
115	377.751717565356	288.3800056854842	-55	21/02/24 15:41:28
96	377.44892680179316	276.8922953490967	-64	21/02/24 15:41:28
94	371.72787175525207	289.5180158335357	-21	21/02/24 15:41:28
92	370.6727223195025	288.1316940639638	-35	21/02/24 15:41:28
110	367.98757076589385	277.42210180952264	-65	21/02/24 15:41:28
93	366.9922408772935	287.5344913496744	-52	21/02/24 15:41:28
109	365.34205862707444	280.9445005087476	-63	21/02/24 15:41:28
112	360.33084939037263	282.2851479696295	-64	21/02/24 15:41:28
119	363.6527972760671	276.499073089803	-68	21/02/24 15:41:28
118	357.09356967635637	275.4844405310735	-69	21/02/24 15:41:28
117	369.239898205492	274.21448833832176	-66	21/02/24 15:41:28

114	381.5992223502213	289.5952994882171	-63	21/02/24 15:41:29
116	377.9647653672978	286.9907349984353	-57	21/02/24 15:41:29
115	377.751717565356	288.3800056854842	-54	21/02/24 15:41:29
96	377.44892680179316	276.8922953490967	-66	21/02/24 15:41:29
94	371.72787175525207	289.5180158335357	-17	21/02/24 15:41:29
92	370.6727223195025	288.1316940639638	-34	21/02/24 15:41:29
110	367.98757076589385	277.42210180952264	-66	21/02/24 15:41:29
93	366.9922408772935	287.5344913496744	-51	21/02/24 15:41:29
109	365.34205862707444	280.9445005087476	-60	21/02/24 15:41:29
112	360.33084939037263	282.2851479696295	-63	21/02/24 15:41:29
119	363.6527972760671	276.499073089803	-66	21/02/24 15:41:29
118	357.09356967635637	275.4844405310735	-71	21/02/24 15:41:29
117	369.239898205492	274.21448833832176	-65	21/02/24 15:41:29

114	381.5992223502213	289.5952994882171	-61	21/02/24 15:41:30
116	377.9647653672978	286.9907349984353	-57	21/02/24 15:41:30
115	377.751717565356	288.3800056854842	-54	21/02/24 15:41:30
96	377.44892680179316	276.8922953490967	-65	21/02/24 15:41:30
94	371.72787175525207	289.5180158335357	-17	21/02/24 15:41:30
92	370.6727223195025	288.1316940639638	-36	21/02/24 15:41:30
110	367.98757076589385	277.42210180952264	-64	21/02/24 15:41:30
93	366.9922408772935	287.5344913496744	-51	21/02/24 15:41:30
109	365.34205862707444	280.9445005087476	-60	21/02/24 15:41:30
112	360.33084939037263	282.2851479696295	-67	21/02/24 15:41:30
119	363.6527972760671	276.499073089803	-67	21/02/24 15:41:30
117	369.239898205492	274.21448833832176	-65	21/02/24 15:41:30

114	381.5992223502213	289.5952994882171	-61	21/02/24 15:41:31
116	377.9647653672978	286.9907349984353	-55	21/02/24 15:41:31
115	377.751717565356	288.3800056854842	-53	21/02/24 15:41:31
96	377.44892680179316	276.8922953490967	-65	21/02/24 15:41:31
94	371.72787175525207	289.5180158335357	-26	21/02/24 15:41:31
92	370.6727223195025	288.1316940639638	-43	21/02/24 15:41:31
110	367.98757076589385	277.42210180952264	-64	21/02/24 15:41:31
93	366.9922408772935	287.5344913496744	-53	21/02/24 15:41:31
109	365.34205862707444	280.9445005087476	-61	21/02/24 15:41:31
112	360.33084939037263	282.2851479696295	-67	21/02/24 15:41:31
119	363.6527972760671	276.499073089803	-68	21/02/24 15:41:31
117	369.239898205492	274.21448833832176	-67	21/02/24 15:41:31

114	381.5992223502213	289.5952994882171	-62	21/02/24 15:41:32
116	377.9647653672978	286.9907349984353	-56	21/02/24 15:41:32
115	377.751717565356	288.3800056854842	-55	21/02/24 15:41:32
96	377.44892680179316	276.8922953490967	-65	21/02/24 15:41:32
94	371.72787175525207	289.5180158335357	-33	21/02/24 15:41:32
92	370.6727223195025	288.1316940639638	-39	21/02/24 15:41:32
110	367.98757076589385	277.42210180952264	-65	21/02/24 15:41:32
93	366.9922408772935	287.5344913496744	-56	21/02/24 15:41:32
109	365.34205862707444	280.9445005087476	-61	21/02/24 15:41:32
112	360.33084939037263	282.2851479696295	-67	21/02/24 15:41:32
119	363.6527972760671	276.499073089803	-68	21/02/24 15:41:32
117	369.239898205492	274.21448833832176	-65	21/02/24 15:41:32

114	381.5992223502213	289.5952994882171	-61	21/02/24 15:41:33
116	377.9647653672978	286.9907349984353	-55	21/02/24 15:41:33
115	377.751717565356	288.3800056854842	-55	21/02/24 15:41:33
96	377.44892680179316	276.8922953490967	-66	21/02/24 15:41:33
94	371.72787175525207	289.5180158335357	-33	21/02/24 15:41:33
92	370.6727223195025	288.1316940639638	-39	21/02/24 15:41:33
110	367.98757076589385	277.42210180952264	-66	21/02/24 15:41:33
93	366.9922408772935	287.5344913496744	-52	21/02/24 15:41:33
109	365.34205862707444	280.9445005087476	-61	21/02/24 15:41:33
112	360.33084939037263	282.2851479696295	-64	21/02/24 15:41:33
119	363.6527972760671	276.499073089803	-68	21/02/24 15:41:33
117	369.239898205492	274.21448833832176	-67	21/02/24 15:41:33

114	381.5992223502213	289.5952994882171	-61	21/02/24 15:41:34
116	377.9647653672978	286.9907349984353	-56	21/02/24 15:41:34
115	377.751717565356	288.3800056854842	-54	21/02/24 15:41:34
96	377.44892680179316	276.8922953490967	-64	21/02/24 15:41:34
94	371.72787175525207	289.5180158335357	-35	21/02/24 15:41:34
92	370.6727223195025	288.1316940639638	-37	21/02/24 15:41:34
110	367.98757076589385	277.42210180952264	-65	21/02/24 15:41:34
93	366.9922408772935	287.5344913496744	-52	21/02/24 15:41:34
109	365.34205862707444	280.9445005087476	-63	21/02/24 15:41:34
112	360.33084939037263	282.2851479696295	-64	21/02/24 15:41:34
119	363.6527972760671	276.499073089803	-65	21/02/24 15:41:34
118	357.09356967635637	275.4844405310735	-69	21/02/24 15:41:34
117	369.239898205492	274.21448833832176	-66	21/02/24 15:41:34

114	381.5992223502213	289.5952994882171	-62	21/02/24 15:41:35
116	377.9647653672978	286.9907349984353	-55	21/02/24 15:41:35
115	377.751717565356	288.3800056854842	-54	21/02/24 15:41:35
96	377.44892680179316	276.8922953490967	-62	21/02/24 15:41:35
94	371.72787175525207	289.5180158335357	-41	21/02/24 15:41:35
92	370.6727223195025	288.1316940639638	-39	21/02/24 15:41:35
110	367.98757076589385	277.42210180952264	-62	21/02/24 15:41:35
93	366.9922408772935	287.5344913496744	-53	21/02/24 15:41:35
109	365.34205862707444	280.9445005087476	-59	21/02/24 15:41:35
112	360.33084939037263	282.2851479696295	-65	21/02/24 15:41:35
119	363.6527972760671	276.499073089803	-66	21/02/24 15:41:35
118	357.09356967635637	275.4844405310735	-69	21/02/24 15:41:35
117	369.239898205492	274.21448833832176	-65	21/02/24 15:41:35

114	381.5992223502213	289.5952994882171	-63	21/02/24 15:41:36
116	377.9647653672978	286.9907349984353	-57	21/02/24 15:41:36
115	377.751717565356	288.3800056854842	-53	21/02/24 15:41:36
96	377.44892680179316	276.8922953490967	-66	21/02/24 15:41:36
94	371.72787175525207	289.5180158335357	-36	21/02/24 15:41:36
92	370.6727223195025	288.1316940639638	-39	21/02/24 15:41:36
110	367.98757076589385	277.42210180952264	-64	21/02/24 15:41:36
93	366.9922408772935	287.5344913496744	-52	21/02/24 15:41:36
109	365.34205862707444	280.9445005087476	-60	21/02/24 15:41:36
112	360.33084939037263	282.2851479696295	-66	21/02/24 15:41:36
119	363.6527972760671	276.499073089803	-65	21/02/24 15:41:36
118	357.09356967635637	275.4844405310735	-72	21/02/24 15:41:36
117	369.239898205492	274.21448833832176	-67	21/02/24 15:41:36

114	381.5992223502213	289.5952994882171	-62	21/02/24 15:41:37
116	377.9647653672978	286.9907349984353	-55	21/02/24 15:41:37
115	377.751717565356	288.3800056854842	-54	21/02/24 15:41:37
96	377.44892680179316	276.8922953490967	-65	21/02/24 15:41:37
94	371.72787175525207	289.5180158335357	-36	21/02/24 15:41:37
92	370.6727223195025	288.1316940639638	-39	21/02/24 15:41:37
110	367.98757076589385	277.42210180952264	-62	21/02/24 15:41:37
93	366.9922408772935	287.5344913496744	-52	21/02/24 15:41:37
109	365.34205862707444	280.9445005087476	-60	21/02/24 15:41:37
112	360.33084939037263	282.2851479696295	-67	21/02/24 15:41:37
119	363.6527972760671	276.499073089803	-66	21/02/24 15:41:37
118	357.09356967635637	275.4844405310735	-70	21/02/24 15:41:37
117	369.239898205492	274.21448833832176	-66	21/02/24 15:41:37

114	381.5992223502213	289.5952994882171	-61	21/02/24 15:41:38
116	377.9647653672978	286.9907349984353	-56	21/02/24 15:41:38
115	377.751717565356	288.3800056854842	-53	21/02/24 15:41:38
96	377.44892680179316	276.8922953490967	-63	21/02/24 15:41:38
94	371.72787175525207	289.5180158335357	-34	21/02/24 15:41:38
92	370.6727223195025	288.1316940639638	-39	21/02/24 15:41:38
110	367.98757076589385	277.42210180952264	-64	21/02/24 15:41:38
93	366.9922408772935	287.5344913496744	-55	21/02/24 15:41:38
109	365.34205862707444	280.9445005087476	-64	21/02/24 15:41:38
112	360.33084939037263	282.2851479696295	-64	21/02/24 15:41:38
119	363.6527972760671	276.499073089803	-67	21/02/24 15:41:38
118	357.09356967635637	275.4844405310735	-71	21/02/24 15:41:38
117	369.239898205492	274.21448833832176	-66	21/02/24 15:41:38

114	381.5992223502213	289.5952994882171	-61	21/02/24 15:41:39
116	377.9647653672978	286.9907349984353	-54	21/02/24 15:41:39
115	377.751717565356	288.3800056854842	-55	21/02/24 15:41:39
96	377.44892680179316	276.8922953490967	-63	21/02/24 15:41:39
94	371.72787175525207	289.5180158335357	-39	21/02/24 15:41:39
92	370.6727223195025	288.1316940639638	-38	21/02/24 15:41:39
110	367.98757076589385	277.42210180952264	-61	21/02/24 15:41:39
93	366.9922408772935	287.5344913496744	-53	21/02/24 15:41:39
109	365.34205862707444	280.9445005087476	-62	21/02/24 15:41:39
112	360.33084939037263	282.2851479696295	-64	21/02/24 15:41:39
119	363.6527972760671	276.499073089803	-68	21/02/24 15:41:39
118	357.09356967635637	275.4844405310735	-71	21/02/24 15:41:39
117	369.239898205492	274.21448833832176	-67	21/02/24 15:41:39

114	381.5992223502213	289.5952994882171	-62	21/02/24 15:41:40
116	377.9647653672978	286.9907349984353	-53	21/02/24 15:41:40
115	377.751717565356	288.3800056854842	-54	21/02/24 15:41:40
96	377.44892680179316	276.8922953490967	-63	21/02/24 15:41:40
94	371.72787175525207	289.5180158335357	-40	21/02/24 15:41:40
92	370.6727223195025	288.1316940639638	-37	21/02/24 15:41:40
110	367.98757076589385	277.42210180952264	-63	21/02/24 15:41:40
93	366.9922408772935	287.5344913496744	-54	21/02/24 15:41:40
109	365.34205862707444	280.9445005087476	-61	21/02/24 15:41:40
112	360.33084939037263	282.2851479696295	-66	21/02/24 15:41:40
119	363.6527972760671	276.499073089803	-65	21/02/24 15:41:40
118	357.09356967635637	275.4844405310735	-71	21/02/24 15:41:40
117	369.239898205492	274.21448833832176	-67	21/02/24 15:41:40

114	381.5992223502213	289.5952994882171	-62	21/02/24 15:41:41
116	377.9647653672978	286.9907349984353	-53	21/02/24 15:41:41
115	377.751717565356	288.3800056854842	-54	21/02/24 15:41:41
96	377.44892680179316	276.8922953490967	-63	21/02/24 15:41:41
94	371.72787175525207	289.5180158335357	-36	21/02/24 15:41:41
92	370.6727223195025	288.1316940639638	-40	21/02/24 15:41:41
110	367.98757076589385	277.42210180952264	-64	21/02/24 15:41:41
93	366.9922408772935	287.5344913496744	-52	21/02/24 15:41:41
109	365.34205862707444	280.9445005087476	-63	21/02/24 15:41:41
112	360.33084939037263	282.2851479696295	-66	21/02/24 15:41:41
119	363.6527972760671	276.499073089803	-67	21/02/24 15:41:41
118	357.09356967635637	275.4844405310735	-71	21/02/24 15:41:41
117	369.239898205492	274.21448833832176	-65	21/02/24 15:41:41

114	381.5992223502213	289.5952994882171	-60	21/02/24 15:41:42
116	377.9647653672978	286.9907349984353	-55	21/02/24 15:41:42
115	377.751717565356	288.3800056854842	-53	21/02/24 15:41:42
96	377.44892680179316	276.8922953490967	-64	21/02/24 15:41:42
94	371.72787175525207	289.5180158335357	-36	21/02/24 15:41:42
92	370.6727223195025	288.1316940639638	-36	21/02/24 15:41:42
110	367.98757076589385	277.42210180952264	-63	21/02/24 15:41:42
93	366.9922408772935	287.5344913496744	-53	21/02/24 15:41:42
109	365.34205862707444	280.9445005087476	-60	21/02/24 15:41:42
112	360.33084939037263	282.2851479696295	-67	21/02/24 15:41:42
119	363.6527972760671	276.499073089803	-65	21/02/24 15:41:42
118	357.09356967635637	275.4844405310735	-69	21/02/24 15:41:42
117	369.239898205492	274.21448833832176	-66	21/02/24 15:41:42

114	381.5992223502213	289.5952994882171	-60	21/02/24 15:41:43
116	377.9647653672978	286.9907349984353	-54	21/02/24 15:41:43
115	377.751717565356	288.3800056854842	-54	21/02/24 15:41:43
96	377.44892680179316	276.8922953490967	-64	21/02/24 15:41:43
94	371.72787175525207	289.5180158335357	-39	21/02/24 15:41:43
92	370.6727223195025	288.1316940639638	-39	21/02/24 15:41:43
110	367.98757076589385	277.42210180952264	-64	21/02/24 15:41:43
93	366.9922408772935	287.5344913496744	-53	21/02/24 15:41:43
109	365.34205862707444	280.9445005087476	-60	21/02/24 15:41:43
112	360.33084939037263	282.2851479696295	-65	21/02/24 15:41:43
119	363.6527972760671	276.499073089803	-65	21/02/24 15:41:43
118	357.09356967635637	275.4844405310735	-71	21/02/24 15:41:43
117	369.239898205492	274.21448833832176	-64	21/02/24 15:41:43

114	381.5992223502213	289.5952994882171	-59	21/02/24 15:41:44
116	377.9647653672978	286.9907349984353	-55	21/02/24 15:41:44
115	377.751717565356	288.3800056854842	-54	21/02/24 15:41:44
96	377.44892680179316	276.8922953490967	-64	21/02/24 15:41:44
94	371.72787175525207	289.5180158335357	-35	21/02/24 15:41:44
92	370.6727223195025	288.1316940639638	-37	21/02/24 15:41:44
110	367.98757076589385	277.42210180952264	-64	21/02/24 15:41:44
93	366.9922408772935	287.5344913496744	-52	21/02/24 15:41:44
109	365.34205862707444	280.9445005087476	-61	21/02/24 15:41:44
112	360.33084939037263	282.2851479696295	-66	21/02/24 15:41:44
119	363.6527972760671	276.499073089803	-67	21/02/24 15:41:44
118	357.09356967635637	275.4844405310735	-70	21/02/24 15:41:44
117	369.239898205492	274.21448833832176	-68	21/02/24 15:41:44

114	381.5992223502213	289.5952994882171	-61	21/02/24 15:41:45
116	377.9647653672978	286.9907349984353	-56	21/02/24 15:41:45
115	377.751717565356	288.3800056854842	-56	21/02/24 15:41:45
96	377.44892680179316	276.8922953490967	-63	21/02/24 15:41:45
94	371.72787175525207	289.5180158335357	-34	21/02/24 15:41:45
92	370.6727223195025	288.1316940639638	-36	21/02/24 15:41:45
110	367.98757076589385	277.42210180952264	-62	21/02/24 15:41:45
93	366.9922408772935	287.5344913496744	-52	21/02/24 15:41:45
109	365.34205862707444	280.9445005087476	-63	21/02/24 15:41:45
112	360.33084939037263	282.2851479696295	-63	21/02/24 15:41:45
119	363.6527972760671	276.499073089803	-65	21/02/24 15:41:45
118	357.09356967635637	275.4844405310735	-69	21/02/24 15:41:45
117	369.239898205492	274.21448833832176	-68	21/02/24 15:41:45

114	381.5992223502213	289.5952994882171	-61	21/02/24 15:41:46
116	377.9647653672978	286.9907349984353	-56	21/02/24 15:41:46
115	377.751717565356	288.3800056854842	-54	21/02/24 15:41:46
96	377.44892680179316	276.8922953490967	-66	21/02/24 15:41:46
94	371.72787175525207	289.5180158335357	-34	21/02/24 15:41:46
92	370.6727223195025	288.1316940639638	-33	21/02/24 15:41:46
110	367.98757076589385	277.42210180952264	-63	21/02/24 15:41:46
93	366.9922408772935	287.5344913496744	-52	21/02/24 15:41:46
109	365.34205862707444	280.9445005087476	-60	21/02/24 15:41:46
112	360.33084939037263	282.2851479696295	-64	21/02/24 15:41:46
119	363.6527972760671	276.499073089803	-67	21/02/24 15:41:46
118	357.09356967635637	275.4844405310735	-70	21/02/24 15:41:46
117	369.239898205492	274.21448833832176	-67	21/02/24 15:41:46

114	381.5992223502213	289.5952994882171	-63	21/02/24 15:41:47
116	377.9647653672978	286.9907349984353	-54	21/02/24 15:41:47
115	377.751717565356	288.3800056854842	-55	21/02/24 15:41:47
96	377.44892680179316	276.8922953490967	-64	21/02/24 15:41:47
94	371.72787175525207	289.5180158335357	-29	21/02/24 15:41:47
92	370.6727223195025	288.1316940639638	-34	21/02/24 15:41:47
110	367.98757076589385	277.42210180952264	-65	21/02/24 15:41:47
93	366.9922408772935	287.5344913496744	-52	21/02/24 15:41:47
109	365.34205862707444	280.9445005087476	-64	21/02/24 15:41:47
112	360.33084939037263	282.2851479696295	-63	21/02/24 15:41:47
119	363.6527972760671	276.499073089803	-67	21/02/24 15:41:47
118	357.09356967635637	275.4844405310735	-72	21/02/24 15:41:47
117	369.239898205492	274.21448833832176	-68	21/02/24 15:41:47

114	381.5992223502213	289.5952994882171	-62	21/02/24 15:41:48
116	377.9647653672978	286.9907349984353	-54	21/02/24 15:41:48
115	377.751717565356	288.3800056854842	-54	21/02/24 15:41:48
96	377.44892680179316	276.8922953490967	-64	21/02/24 15:41:48
94	371.72787175525207	289.5180158335357	-34	21/02/24 15:41:48
92	370.6727223195025	288.1316940639638	-37	21/02/24 15:41:48
110	367.98757076589385	277.42210180952264	-65	21/02/24 15:41:48
93	366.9922408772935	287.5344913496744	-51	21/02/24 15:41:48
109	365.34205862707444	280.9445005087476	-61	21/02/24 15:41:48
112	360.33084939037263	282.2851479696295	-64	21/02/24 15:41:48
119	363.6527972760671	276.499073089803	-65	21/02/24 15:41:48
118	357.09356967635637	275.4844405310735	-70	21/02/24 15:41:48
117	369.239898205492	274.21448833832176	-65	21/02/24 15:41:48

114	381.5992223502213	289.5952994882171	-60	21/02/24 15:41:49
116	377.9647653672978	286.9907349984353	-55	21/02/24 15:41:49
115	377.751717565356	288.3800056854842	-55	21/02/24 15:41:49
96	377.44892680179316	276.8922953490967	-66	21/02/24 15:41:49
94	371.72787175525207	289.5180158335357	-28	21/02/24 15:41:49
92	370.6727223195025	288.1316940639638	-30	21/02/24 15:41:49
110	367.98757076589385	277.42210180952264	-65	21/02/24 15:41:49
93	366.9922408772935	287.5344913496744	-50	21/02/24 15:41:49
109	365.34205862707444	280.9445005087476	-63	21/02/24 15:41:49
112	360.33084939037263	282.2851479696295	-65	21/02/24 15:41:49
119	363.6527972760671	276.499073089803	-67	21/02/24 15:41:49
118	357.09356967635637	275.4844405310735	-72	21/02/24 15:41:49
117	369.239898205492	274.21448833832176	-66	21/02/24 15:41:49

114	381.5992223502213	289.5952994882171	-61	21/02/24 15:41:50
116	377.9647653672978	286.9907349984353	-58	21/02/24 15:41:50
115	377.751717565356	288.3800056854842	-56	21/02/24 15:41:50
96	377.44892680179316	276.8922953490967	-65	21/02/24 15:41:50
94	371.72787175525207	289.5180158335357	-31	21/02/24 15:41:50
92	370.6727223195025	288.1316940639638	-32	21/02/24 15:41:50
110	367.98757076589385	277.42210180952264	-65	21/02/24 15:41:50
93	366.9922408772935	287.5344913496744	-51	21/02/24 15:41:50
109	365.34205862707444	280.9445005087476	-60	21/02/24 15:41:50
112	360.33084939037263	282.2851479696295	-64	21/02/24 15:41:50
119	363.6527972760671	276.499073089803	-66	21/02/24 15:41:50
118	357.09356967635637	275.4844405310735	-71	21/02/24 15:41:50
117	369.239898205492	274.21448833832176	-67	21/02/24 15:41:50

114	381.5992223502213	289.5952994882171	-64	21/02/24 15:41:51
116	377.9647653672978	286.9907349984353	-58	21/02/24 15:41:51
115	377.751717565356	288.3800056854842	-55	21/02/24 15:41:51
96	377.44892680179316	276.8922953490967	-67	21/02/24 15:41:51
94	371.72787175525207	289.5180158335357	-31	21/02/24 15:41:51
92	370.6727223195025	288.1316940639638	-28	21/02/24 15:41:51
110	367.98757076589385	277.42210180952264	-63	21/02/24 15:41:51
93	366.9922408772935	287.5344913496744	-52	21/02/24 15:41:51
109	365.34205862707444	280.9445005087476	-62	21/02/24 15:41:51
112	360.33084939037263	282.2851479696295	-64	21/02/24 15:41:51
119	363.6527972760671	276.499073089803	-66	21/02/24 15:41:51
118	357.09356967635637	275.4844405310735	-70	21/02/24 15:41:51
117	369.239898205492	274.21448833832176	-68	21/02/24 15:41:51

114	381.5992223502213	289.5952994882171	-62	21/02/24 15:41:52
116	377.9647653672978	286.9907349984353	-55	21/02/24 15:41:52
115	377.751717565356	288.3800056854842	-57	21/02/24 15:41:52
96	377.44892680179316	276.8922953490967	-67	21/02/24 15:41:52
94	371.72787175525207	289.5180158335357	-35	21/02/24 15:41:52
92	370.6727223195025	288.1316940639638	-25	21/02/24 15:41:52
110	367.98757076589385	277.42210180952264	-65	21/02/24 15:41:52
93	366.9922408772935	287.5344913496744	-50	21/02/24 15:41:52
109	365.34205862707444	280.9445005087476	-59	21/02/24 15:41:52
112	360.33084939037263	282.2851479696295	-64	21/02/24 15:41:52
119	363.6527972760671	276.499073089803	-68	21/02/24 15:41:52
118	357.09356967635637	275.4844405310735	-70	21/02/24 15:41:52
117	369.239898205492	274.21448833832176	-67	21/02/24 15:41:52

114	381.5992223502213	289.5952994882171	-61	21/02/24 15:41:53
116	377.9647653672978	286.9907349984353	-57	21/02/24 15:41:53
115	377.751717565356	288.3800056854842	-55	21/02/24 15:41:53
96	377.44892680179316	276.8922953490967	-63	21/02/24 15:41:53
94	371.72787175525207	289.5180158335357	-36	21/02/24 15:41:53
92	370.6727223195025	288.1316940639638	-21	21/02/24 15:41:53
110	367.98757076589385	277.42210180952264	-62	21/02/24 15:41:53
93	366.9922408772935	287.5344913496744	-51	21/02/24 15:41:53
109	365.34205862707444	280.9445005087476	-62	21/02/24 15:41:53
112	360.33084939037263	282.2851479696295	-62	21/02/24 15:41:53
119	363.6527972760671	276.499073089803	-64	21/02/24 15:41:53
118	357.09356967635637	275.4844405310735	-70	21/02/24 15:41:53
117	369.239898205492	274.21448833832176	-67	21/02/24 15:41:53

114	381.5992223502213	289.5952994882171	-63	21/02/24 15:41:54
116	377.9647653672978	286.9907349984353	-57	21/02/24 15:41:54
115	377.751717565356	288.3800056854842	-56	21/02/24 15:41:54
96	377.44892680179316	276.8922953490967	-64	21/02/24 15:41:54
94	371.72787175525207	289.5180158335357	-44	21/02/24 15:41:54
92	370.6727223195025	288.1316940639638	-32	21/02/24 15:41:54
110	367.98757076589385	277.42210180952264	-61	21/02/24 15:41:54
93	366.9922408772935	287.5344913496744	-51	21/02/24 15:41:54
109	365.34205862707444	280.9445005087476	-59	21/02/24 15:41:54
112	360.33084939037263	282.2851479696295	-62	21/02/24 15:41:54
119	363.6527972760671	276.499073089803	-66	21/02/24 15:41:54
118	357.09356967635637	275.4844405310735	-71	21/02/24 15:41:54
117	369.239898205492	274.21448833832176	-63	21/02/24 15:41:54
97	362.5947869084557	269.0761103596411	-71	21/02/24 15:41:54

114	381.5992223502213	289.5952994882171	-62	21/02/24 15:41:55
116	377.9647653672978	286.9907349984353	-57	21/02/24 15:41:55
115	377.751717565356	288.3800056854842	-57	21/02/24 15:41:55
96	377.44892680179316	276.8922953490967	-63	21/02/24 15:41:55
94	371.72787175525207	289.5180158335357	-42	21/02/24 15:41:55
92	370.6727223195025	288.1316940639638	-29	21/02/24 15:41:55
110	367.98757076589385	277.42210180952264	-62	21/02/24 15:41:55
93	366.9922408772935	287.5344913496744	-47	21/02/24 15:41:55
109	365.34205862707444	280.9445005087476	-61	21/02/24 15:41:55
112	360.33084939037263	282.2851479696295	-62	21/02/24 15:41:55
119	363.6527972760671	276.499073089803	-63	21/02/24 15:41:55
118	357.09356967635637	275.4844405310735	-68	21/02/24 15:41:55
117	369.239898205492	274.21448833832176	-67	21/02/24 15:41:55
97	362.5947869084557	269.0761103596411	-71	21/02/24 15:41:55

114	381.5992223502213	289.5952994882171	-64	21/02/24 15:41:56
116	377.9647653672978	286.9907349984353	-57	21/02/24 15:41:56
115	377.751717565356	288.3800056854842	-56	21/02/24 15:41:56
96	377.44892680179316	276.8922953490967	-63	21/02/24 15:41:56
94	371.72787175525207	289.5180158335357	-43	21/02/24 15:41:56
92	370.6727223195025	288.1316940639638	-32	21/02/24 15:41:56
110	367.98757076589385	277.42210180952264	-61	21/02/24 15:41:56
93	366.9922408772935	287.5344913496744	-45	21/02/24 15:41:56
109	365.34205862707444	280.9445005087476	-57	21/02/24 15:41:56
112	360.33084939037263	282.2851479696295	-63	21/02/24 15:41:56
119	363.6527972760671	276.499073089803	-66	21/02/24 15:41:56
118	357.09356967635637	275.4844405310735	-70	21/02/24 15:41:56
117	369.239898205492	274.21448833832176	-65	21/02/24 15:41:56
97	362.5947869084557	269.0761103596411	-70	21/02/24 15:41:56

114	381.5992223502213	289.5952994882171	-63	21/02/24 15:41:57
116	377.9647653672978	286.9907349984353	-59	21/02/24 15:41:57
115	377.751717565356	288.3800056854842	-57	21/02/24 15:41:57
96	377.44892680179316	276.8922953490967	-66	21/02/24 15:41:57
94	371.72787175525207	289.5180158335357	-43	21/02/24 15:41:57
92	370.6727223195025	288.1316940639638	-31	21/02/24 15:41:57
110	367.98757076589385	277.42210180952264	-61	21/02/24 15:41:57
93	366.9922408772935	287.5344913496744	-47	21/02/24 15:41:57
109	365.34205862707444	280.9445005087476	-57	21/02/24 15:41:57
112	360.33084939037263	282.2851479696295	-62	21/02/24 15:41:57
119	363.6527972760671	276.499073089803	-65	21/02/24 15:41:57
118	357.09356967635637	275.4844405310735	-71	21/02/24 15:41:57
117	369.239898205492	274.21448833832176	-63	21/02/24 15:41:57
97	362.5947869084557	269.0761103596411	-69	21/02/24 15:41:57

114	381.5992223502213	289.5952994882171	-65	21/02/24 15:41:58
116	377.9647653672978	286.9907349984353	-57	21/02/24 15:41:58
115	377.751717565356	288.3800056854842	-56	21/02/24 15:41:58
96	377.44892680179316	276.8922953490967	-64	21/02/24 15:41:58
94	371.72787175525207	289.5180158335357	-45	21/02/24 15:41:58
92	370.6727223195025	288.1316940639638	-31	21/02/24 15:41:58
110	367.98757076589385	277.42210180952264	-62	21/02/24 15:41:58
93	366.9922408772935	287.5344913496744	-49	21/02/24 15:41:58
109	365.34205862707444	280.9445005087476	-60	21/02/24 15:41:58
112	360.33084939037263	282.2851479696295	-63	21/02/24 15:41:58
119	363.6527972760671	276.499073089803	-66	21/02/24 15:41:58
118	357.09356967635637	275.4844405310735	-70	21/02/24 15:41:58
117	369.239898205492	274.21448833832176	-64	21/02/24 15:41:58
97	362.5947869084557	269.0761103596411	-70	21/02/24 15:41:58

114	381.5992223502213	289.5952994882171	-62	21/02/24 15:41:59
116	377.9647653672978	286.9907349984353	-60	21/02/24 15:41:59
115	377.751717565356	288.3800056854842	-60	21/02/24 15:41:59
96	377.44892680179316	276.8922953490967	-63	21/02/24 15:41:59
94	371.72787175525207	289.5180158335357	-45	21/02/24 15:41:59
92	370.6727223195025	288.1316940639638	-34	21/02/24 15:41:59
110	367.98757076589385	277.42210180952264	-60	21/02/24 15:41:59
93	366.9922408772935	287.5344913496744	-49	21/02/24 15:41:59
109	365.34205862707444	280.9445005087476	-59	21/02/24 15:41:59
112	360.33084939037263	282.2851479696295	-61	21/02/24 15:41:59
119	363.6527972760671	276.499073089803	-64	21/02/24 15:41:59
118	357.09356967635637	275.4844405310735	-71	21/02/24 15:41:59
117	369.239898205492	274.21448833832176	-64	21/02/24 15:41:59
97	362.5947869084557	269.0761103596411	-71	21/02/24 15:41:59

