stationId	t_start	t_end	t_max	timeStamp
24	20/04/28 05:17:35	20/04/28 05:17:35	20/04/28 05:17:35
40	20/04/28 05:17:37	20/04/28 05:17:37	20/04/28 05:17:37
153	20/04/28 05:17:39	20/04/28 05:17:39	20/04/28 05:17:39
44	20/04/28 05:17:41	20/04/28 05:17:41	20/04/28 05:17:41
44	20/04/28 05:17:43	20/04/28 05:17:43	20/04/28 05:17:43
24	20/04/28 05:17:45	20/04/28 05:17:45	20/04/28 05:17:45
79	20/04/28 05:17:47	20/04/28 05:17:47	20/04/28 05:17:47
24	20/04/28 05:17:49	20/04/28 05:17:49	20/04/28 05:17:49
121	20/04/28 05:17:25	20/04/28 05:17:51	20/04/28 05:17:51
44	20/04/28 05:17:53	20/04/28 05:17:53	20/04/28 05:17:53
31	20/04/28 05:17:55	20/04/28 05:17:55	20/04/28 05:17:55
24	20/04/28 05:17:57	20/04/28 05:17:57	20/04/28 05:17:57
11	20/04/28 05:17:59	20/04/28 05:17:59	20/04/28 05:17:59
31	20/04/28 05:18:01	20/04/28 05:18:02	20/04/28 05:18:02
69	20/04/28 05:18:04	20/04/28 05:18:04	20/04/28 05:18:04
158	20/04/28 05:18:06	20/04/28 05:18:06	20/04/28 05:18:06
30	20/04/28 05:18:08	20/04/28 05:18:09	20/04/28 05:18:08
39	20/04/28 05:18:11	20/04/28 05:18:11	20/04/28 05:18:11
28	20/04/28 05:18:13	20/04/28 05:18:13	20/04/28 05:18:13
31	20/04/28 05:18:15	20/04/28 05:18:15	20/04/28 05:18:15
30	20/04/28 05:18:17	20/04/28 05:18:17	20/04/28 05:18:17
39	20/04/28 05:18:19	20/04/28 05:18:19	20/04/28 05:18:19
2	20/04/28 05:18:21	20/04/28 05:18:21	20/04/28 05:18:21
143	20/04/28 05:18:23	20/04/28 05:14:38	20/04/28 05:18:38
151	20/04/28 05:18:25	20/04/28 05:18:25	20/04/28 05:18:25
152	20/04/28 05:18:27	20/04/28 05:18:27	20/04/28 05:18:27
2	20/04/28 05:18:29	20/04/28 05:18:30	20/04/28 05:18:30
40	20/04/28 05:18:32	20/04/28 05:18:32	20/04/28 05:18:32
20	20/04/28 05:18:34	20/04/28 05:18:34	20/04/28 05:18:34
20	20/04/28 05:18:36	20/04/28 05:18:36	20/04/28 05:18:36
28	20/04/28 05:18:38	20/04/28 05:18:38	20/04/28 05:18:38
20	20/04/28 05:18:40	20/04/28 05:18:40	20/04/28 05:18:40
92	20/04/28 05:18:42	20/04/28 05:18:42	20/04/28 05:18:42
119	20/04/28 05:18:44	20/04/28 05:18:44	20/04/28 05:18:44
20	20/04/28 05:18:46	20/04/28 05:18:46	20/04/28 05:18:46
