floorId	partitionId	location_x	location_y	timeStamp
19	980	310.36738320623186	287.58936639951213	21/02/24 15:43:26
19	980	310.36738320623186	287.58936639951213	21/02/24 15:43:27
19	980	310.36738320623186	287.58936639951213	21/02/24 15:43:28
19	980	311.1000485048991	283.6794021053162	21/02/24 15:43:29
19	911	314.5882445185791	281.94764300047444	21/02/24 15:43:30
19	897	319.01521359261704	283.59757186890573	21/02/24 15:43:31
19	897	319.01521359261704	283.59757186890573	21/02/24 15:43:32
19	897	319.01521359261704	283.59757186890573	21/02/24 15:43:33
19	897	319.01521359261704	283.59757186890573	21/02/24 15:43:34
19	NULL	322.7688919024709	282.9508947625264	21/02/24 15:43:35
19	NULL	322.7688919024709	282.9508947625264	21/02/24 15:43:36
19	NULL	322.7688919024709	282.9508947625264	21/02/24 15:43:37
19	955	328.92321811554416	278.4499778858854	21/02/24 15:43:38
19	955	328.92321811554416	278.4499778858854	21/02/24 15:43:39
19	955	328.92321811554416	278.4499778858854	21/02/24 15:43:40
19	955	328.92321811554416	278.4499778858854	21/02/24 15:43:41
19	955	328.92321811554416	278.4499778858854	21/02/24 15:43:42
19	964	333.3307930394084	283.8195031085223	21/02/24 15:43:43
19	964	340.04388943277826	286.2192342684243	21/02/24 15:43:44
19	964	345.55129388204	290.93688909504044	21/02/24 15:43:45
19	964	349.72234002988336	284.71465847817086	21/02/24 15:43:46
19	964	349.72234002988336	284.71465847817086	21/02/24 15:43:47
19	964	355.482293890607	282.3613173869535	21/02/24 15:43:48
19	964	355.482293890607	282.3613173869535	21/02/24 15:43:49
19	964	355.482293890607	282.3613173869535	21/02/24 15:43:50
19	964	355.482293890607	282.3613173869535	21/02/24 15:43:51
19	964	355.482293890607	282.3613173869535	21/02/24 15:43:52
19	990	357.82242061436585	282.16385269148645	21/02/24 15:43:53
19	990	357.82242061436585	282.16385269148645	21/02/24 15:43:54
19	NULL	361.8602798513784	283.01660848074425	21/02/24 15:43:55
19	958	366.610069358505	283.9792033041277	21/02/24 15:43:56
19	910	371.49991506597235	283.64243362381774	21/02/24 15:43:57
19	990	373.5702263177357	281.590961967497	21/02/24 15:43:58
19	990	373.5702263177357	281.590961967497	21/02/24 15:43:59
19	990	373.5702263177357	281.590961967497	21/02/24 15:44:00
19	990	373.5702263177357	281.590961967497	21/02/24 15:44:01
19	916	370.0169351705088	275.34842522846316	21/02/24 15:44:02
19	NULL	364.30073696422824	274.962631965603	21/02/24 15:44:03
19	916	366.89067132959275	274.24837315367546	21/02/24 15:44:04
19	916	369.59845485364957	276.9829949283845	21/02/24 15:44:05
19	916	368.916162198344	278.6773366657135	21/02/24 15:44:06
19	990	373.5702263177357	281.590961967497	21/02/24 15:44:07
19	990	373.5702263177357	281.590961967497	21/02/24 15:44:08
19	990	373.5702263177357	281.590961967497	21/02/24 15:44:09
19	990	373.5702263177357	281.590961967497	21/02/24 15:44:10
19	958	365.44482048462646	284.4407937731175	21/02/24 15:44:11
19	958	364.8238741505902	287.1482151372541	21/02/24 15:44:12
19	NULL	360.5547106147949	283.12207921272073	21/02/24 15:44:13
19	NULL	360.5547106147949	283.12207921272073	21/02/24 15:44:14
19	990	357.82242061436585	282.16385269148645	21/02/24 15:44:15
19	964	355.482293890607	282.3613173869535	21/02/24 15:44:16
19	964	355.482293890607	282.3613173869535	21/02/24 15:44:17
19	964	355.482293890607	282.3613173869535	21/02/24 15:44:18
19	964	355.482293890607	282.3613173869535	21/02/24 15:44:19
19	964	349.72234002988336	284.71465847817086	21/02/24 15:44:20
19	964	349.72234002988336	284.71465847817086	21/02/24 15:44:21
19	964	344.3155484927012	283.53998029232963	21/02/24 15:44:22
19	964	341.9483564172975	281.53052240391844	21/02/24 15:44:23
19	909	333.79691834538926	273.32229963118385	21/02/24 15:44:24
19	955	332.13398995625107	274.9863189954403	21/02/24 15:44:25
19	955	328.92321811554416	278.4499778858854	21/02/24 15:44:26
19	955	327.44520062785523	279.05437229772264	21/02/24 15:44:27
19	955	328.92321811554416	278.4499778858854	21/02/24 15:44:28
19	955	328.92321811554416	278.4499778858854	21/02/24 15:44:29
19	NULL	326.2665356724085	280.50725420525265	21/02/24 15:44:30
19	NULL	322.7688919024709	282.9508947625264	21/02/24 15:44:31
19	NULL	322.7688919024709	282.9508947625264	21/02/24 15:44:32
19	897	319.01521359261704	283.59757186890573	21/02/24 15:44:33
19	897	319.01521359261704	283.59757186890573	21/02/24 15:44:34
19	897	319.01521359261704	283.59757186890573	21/02/24 15:44:35
19	897	319.01521359261704	283.59757186890573	21/02/24 15:44:36
19	897	319.01521359261704	283.59757186890573	21/02/24 15:44:37
19	975	315.07586920053365	286.03778962296946	21/02/24 15:44:38
19	975	315.07586920053365	286.03778962296946	21/02/24 15:44:39
19	897	319.01521359261704	283.59757186890573	21/02/24 15:44:40
19	897	319.9192972394814	288.14314324577873	21/02/24 15:44:41
19	897	319.01521359261704	283.59757186890573	21/02/24 15:44:42
19	922	321.3046457681251	286.51689541134186	21/02/24 15:44:43
19	897	319.9192972394814	288.14314324577873	21/02/24 15:44:44
19	897	319.9192972394814	288.14314324577873	21/02/24 15:44:45
19	897	319.01521359261704	283.59757186890573	21/02/24 15:44:46
19	897	319.01521359261704	283.59757186890573	21/02/24 15:44:47
19	975	315.07586920053365	286.03778962296946	21/02/24 15:44:48
19	897	319.01521359261704	283.59757186890573	21/02/24 15:44:49
19	897	319.9192972394814	288.14314324577873	21/02/24 15:44:50
19	897	319.9192972394814	288.14314324577873	21/02/24 15:44:51
19	897	319.9192972394814	288.14314324577873	21/02/24 15:44:52
19	897	319.9192972394814	288.14314324577873	21/02/24 15:44:53
19	897	319.9192972394814	288.14314324577873	21/02/24 15:44:54
19	897	319.9192972394814	288.14314324577873	21/02/24 15:44:55
19	897	319.9192972394814	288.14314324577873	21/02/24 15:44:56
19	922	321.3046457681251	286.51689541134186	21/02/24 15:44:57
19	897	319.01521359261704	283.59757186890573	21/02/24 15:44:58
19	922	321.3046457681251	286.51689541134186	21/02/24 15:44:59
19	897	319.01521359261704	283.59757186890573	21/02/24 15:45:00
19	897	319.01521359261704	283.59757186890573	21/02/24 15:45:01
19	922	321.3046457681251	286.51689541134186	21/02/24 15:45:02
19	897	319.01521359261704	283.59757186890573	21/02/24 15:45:03
19	897	319.9192972394814	288.14314324577873	21/02/24 15:45:05
19	897	319.01521359261704	283.59757186890573	21/02/24 15:45:06
19	897	319.01521359261704	283.59757186890573	21/02/24 15:45:07
19	897	319.01521359261704	283.59757186890573	21/02/24 15:45:08
19	897	319.01521359261704	283.59757186890573	21/02/24 15:45:09
19	897	319.01521359261704	283.59757186890573	21/02/24 15:45:10
19	897	319.01521359261704	283.59757186890573	21/02/24 15:45:11
19	897	319.01521359261704	283.59757186890573	21/02/24 15:45:12
19	NULL	322.7688919024709	282.9508947625264	21/02/24 15:45:13
19	NULL	322.7688919024709	282.9508947625264	21/02/24 15:45:14
19	NULL	326.2665356724085	280.50725420525265	21/02/24 15:45:15
19	955	328.92321811554416	278.4499778858854	21/02/24 15:45:16
19	955	328.92321811554416	278.4499778858854	21/02/24 15:45:17
19	955	328.92321811554416	278.4499778858854	21/02/24 15:45:18
19	955	331.57961022726676	277.2385535448373	21/02/24 15:45:19
19	955	331.5796102272668	277.2385535448373	21/02/24 15:45:20
19	909	333.7969183453893	273.32229963118385	21/02/24 15:45:21
19	909	333.7969183453893	273.32229963118385	21/02/24 15:45:22
19	904	345.58406694546534	272.03626967984314	21/02/24 15:45:23
19	954	351.0914713947271	276.75392450645927	21/02/24 15:45:24
19	904	345.58406694546534	272.03626967984314	21/02/24 15:45:25
19	904	345.58406694546534	272.03626967984314	21/02/24 15:45:26
19	904	345.58406694546534	272.03626967984314	21/02/24 15:45:27
19	909	344.1372733286521	271.97307611325795	21/02/24 15:45:28
19	909	344.1372733286521	271.97307611325795	21/02/24 15:45:29
19	954	349.64467777791396	276.690730939874	21/02/24 15:45:30
19	909	344.1372733286521	271.97307611325795	21/02/24 15:45:31
19	909	344.1372733286521	271.97307611325795	21/02/24 15:45:32
19	904	345.5840669454654	272.03626967984314	21/02/24 15:45:33
19	904	345.58406694546534	272.03626967984314	21/02/24 15:45:34
19	904	345.5840669454654	272.03626967984314	21/02/24 15:45:35
19	904	345.5840669454654	272.03626967984314	21/02/24 15:45:36
19	909	344.1372733286521	271.97307611325795	21/02/24 15:45:37
19	940	347.9711572177418	278.13370891448585	21/02/24 15:45:38
19	904	345.58406694546534	272.03626967984314	21/02/24 15:45:39
19	904	345.58406694546534	272.03626967984314	21/02/24 15:45:40
19	940	347.9711572177418	278.13370891448585	21/02/24 15:45:41
19	904	345.58406694546534	272.03626967984314	21/02/24 15:45:42
19	904	345.58406694546534	272.03626967984314	21/02/24 15:45:43
19	940	347.9711572177418	278.13370891448585	21/02/24 15:45:44
19	940	347.9711572177418	278.13370891448585	21/02/24 15:45:45
19	954	351.0914713947271	276.75392450645927	21/02/24 15:45:46
19	964	349.72234002988336	284.71465847817086	21/02/24 15:45:47
19	940	347.335249757607	278.61721924352815	21/02/24 15:45:48
19	964	349.72234002988336	284.71465847817086	21/02/24 15:45:49
19	940	347.9711572177418	278.13370891448585	21/02/24 15:45:50
19	964	349.72234002988336	284.71465847817086	21/02/24 15:45:51
19	964	343.5688843107275	281.359860336823	21/02/24 15:45:52
19	954	351.0914713947272	276.75392450645927	21/02/24 15:45:53
19	940	347.9711572177418	278.13370891448585	21/02/24 15:45:54
19	904	347.2575875056375	270.5932917052313	21/02/24 15:45:55
19	904	345.5840669454654	272.03626967984314	21/02/24 15:45:56
19	904	345.58406694546534	272.03626967984314	21/02/24 15:45:57
19	940	347.9711572177418	278.13370891448585	21/02/24 15:45:58
19	904	345.58406694546534	272.03626967984314	21/02/24 15:45:59
19	904	345.58406694546534	272.03626967984314	21/02/24 15:46:00
19	904	345.58406694546534	272.03626967984314	21/02/24 15:46:01
19	904	345.5840669454654	272.03626967984314	21/02/24 15:46:02
19	954	351.0914713947272	276.75392450645927	21/02/24 15:46:03
19	904	345.58406694546534	272.03626967984314	21/02/24 15:46:04
19	940	347.9711572177418	278.13370891448585	21/02/24 15:46:05
19	904	345.58406694546534	272.03626967984314	21/02/24 15:46:06
19	904	345.58406694546534	272.03626967984314	21/02/24 15:46:07
19	909	344.1372733286521	271.97307611325795	21/02/24 15:46:08
19	904	345.58406694546534	272.03626967984314	21/02/24 15:46:09
19	904	345.5840669454654	272.03626967984314	21/02/24 15:46:10
19	904	345.58406694546534	272.03626967984314	21/02/24 15:46:11
19	904	345.58406694546534	272.03626967984314	21/02/24 15:46:12
19	940	347.9711572177418	278.13370891448585	21/02/24 15:46:13
19	954	351.0914713947271	276.75392450645927	21/02/24 15:46:14
19	964	355.482293890607	282.3613173869535	21/02/24 15:46:15
19	964	355.482293890607	282.3613173869535	21/02/24 15:46:16
19	964	355.482293890607	282.3613173869535	21/02/24 15:46:17
19	964	355.482293890607	282.3613173869535	21/02/24 15:46:18
19	964	355.482293890607	282.3613173869535	21/02/24 15:46:19
19	945	357.72180770228624	278.62087605071156	21/02/24 15:46:20
19	NULL	360.5547106147949	283.12207921272073	21/02/24 15:46:21
19	987	363.64647505929315	279.84759664761776	21/02/24 15:46:22
19	987	363.6464750592931	279.84759664761776	21/02/24 15:46:23
19	987	363.6464750592931	279.84759664761776	21/02/24 15:46:24
19	987	363.6464750592931	279.84759664761776	21/02/24 15:46:25
19	990	366.8458509465807	280.72880832203424	21/02/24 15:46:26
19	987	363.6464750592931	279.84759664761776	21/02/24 15:46:27
19	990	366.8458509465807	280.72880832203424	21/02/24 15:46:28
19	990	366.8458509465807	280.72880832203424	21/02/24 15:46:29
19	958	366.610069358505	283.9792033041277	21/02/24 15:46:30
19	NULL	368.6441963719141	285.32200544753397	21/02/24 15:46:31
19	987	363.64647505929315	279.84759664761776	21/02/24 15:46:32
19	NULL	360.5547106147949	283.12207921272073	21/02/24 15:46:33
19	945	357.72180770228624	278.62087605071156	21/02/24 15:46:34
19	990	357.82242061436585	282.16385269148645	21/02/24 15:46:35
19	964	355.482293890607	282.3613173869535	21/02/24 15:46:36
19	964	355.482293890607	282.3613173869535	21/02/24 15:46:37
19	945	354.54681611956306	276.9555468868248	21/02/24 15:46:38
19	904	356.7863299312423	273.21510555058285	21/02/24 15:46:39
19	954	351.0914713947271	276.75392450645927	21/02/24 15:46:40
19	904	347.25758750563756	270.59329170523137	21/02/24 15:46:41
19	904	347.25758750563756	270.59329170523137	21/02/24 15:46:42
19	919	341.8507959684553	269.41861351939014	21/02/24 15:46:43
19	NULL	337.73701806888556	270.34580290420837	21/02/24 15:46:44
19	NULL	337.73701806888556	270.34580290420837	21/02/24 15:46:45
19	NULL	337.73701806888556	270.34580290420837	21/02/24 15:46:46
19	950	335.24432386191205	269.68948620372345	21/02/24 15:46:47
19	909	333.79691834538926	273.32229963118385	21/02/24 15:46:48
19	909	330.2883825087985	271.703362840502	21/02/24 15:46:49
19	909	330.01588276779324	271.8143520709949	21/02/24 15:46:50
19	909	330.28838250879846	271.703362840502	21/02/24 15:46:51
19	900	327.2230053463675	269.6378469350531	21/02/24 15:46:52
19	900	325.33470491008825	269.6240183086286	21/02/24 15:46:53
19	900	325.33470491008825	269.6240183086286	21/02/24 15:46:54
19	900	325.33470491008825	269.6240183086286	21/02/24 15:46:55
19	909	326.737153683381	273.3535535783339	21/02/24 15:46:56
19	909	330.28838250879846	271.703362840502	21/02/24 15:46:57
19	909	330.67819545719686	272.0254572518176	21/02/24 15:46:58
19	909	333.40710539699086	273.0002052198683	21/02/24 15:46:59
19	909	333.79691834538926	273.32229963118385	21/02/24 15:47:00
19	909	333.79691834538926	273.32229963118385	21/02/24 15:47:01
19	NULL	337.73701806888556	270.34580290420837	21/02/24 15:47:02
19	NULL	337.73701806888556	270.34580290420837	21/02/24 15:47:03
19	919	341.8507959684553	269.41861351939014	21/02/24 15:47:04
19	919	341.8507959684553	269.41861351939014	21/02/24 15:47:05
19	904	347.25758750563756	270.59329170523137	21/02/24 15:47:06
19	954	351.0914713947271	276.75392450645927	21/02/24 15:47:07
19	954	349.64467777791396	276.6907309398741	21/02/24 15:47:08
19	964	355.482293890607	282.3613173869535	21/02/24 15:47:09
19	968	355.71807547868275	279.11092240486005	21/02/24 15:47:10
19	968	355.71807547868275	279.11092240486005	21/02/24 15:47:11
19	968	355.71807547868275	279.11092240486005	21/02/24 15:47:12
19	968	355.71807547868275	279.11092240486005	21/02/24 15:47:13
19	964	355.482293890607	282.3613173869535	21/02/24 15:47:14
19	964	355.482293890607	282.3613173869535	21/02/24 15:47:15
19	964	355.482293890607	282.3613173869535	21/02/24 15:47:16
19	964	355.482293890607	282.3613173869535	21/02/24 15:47:17
19	968	355.71807547868275	279.11092240486005	21/02/24 15:47:18
19	968	355.71807547868275	279.11092240486005	21/02/24 15:47:19
19	964	355.482293890607	282.3613173869535	21/02/24 15:47:20
19	964	355.482293890607	282.3613173869535	21/02/24 15:47:21
19	964	355.482293890607	282.3613173869535	21/02/24 15:47:22
19	968	355.71807547868275	279.11092240486005	21/02/24 15:47:23
19	968	355.71807547868275	279.11092240486005	21/02/24 15:47:24
19	964	355.482293890607	282.3613173869535	21/02/24 15:47:25
19	964	355.482293890607	282.3613173869535	21/02/24 15:47:26
19	964	355.482293890607	282.3613173869535	21/02/24 15:47:27
19	968	355.71807547868275	279.11092240486005	21/02/24 15:47:28
19	968	355.71807547868275	279.11092240486005	21/02/24 15:47:29
19	964	355.482293890607	282.3613173869535	21/02/24 15:47:30
19	968	355.71807547868275	279.11092240486005	21/02/24 15:47:31
19	964	355.482293890607	282.3613173869535	21/02/24 15:47:32
19	945	357.72180770228624	278.62087605071156	21/02/24 15:47:33
19	968	355.71807547868275	279.11092240486005	21/02/24 15:47:34
19	968	355.71807547868275	279.11092240486005	21/02/24 15:47:35
19	964	355.482293890607	282.3613173869535	21/02/24 15:47:36
19	964	355.482293890607	282.3613173869535	21/02/24 15:47:37
19	968	355.71807547868275	279.11092240486005	21/02/24 15:47:38
19	968	355.71807547868275	279.11092240486005	21/02/24 15:47:39
19	968	355.71807547868275	279.11092240486005	21/02/24 15:47:40
19	945	354.54681611956306	276.9555468868248	21/02/24 15:47:41
19	968	355.71807547868275	279.11092240486005	21/02/24 15:47:42
19	968	355.71807547868275	279.11092240486005	21/02/24 15:47:43
19	945	354.54681611956306	276.9555468868248	21/02/24 15:47:44
19	968	355.71807547868275	279.11092240486005	21/02/24 15:47:45
