floorId	partitionId	location_x	location_y	timeStamp
19	929	307.5917897278964	285.09780219467183	21/02/24 15:42:17
19	980	310.36738320623186	287.58936639951213	21/02/24 15:42:18
19	929	307.5917897278964	285.09780219467183	21/02/24 15:42:19
19	929	307.59178972789636	285.09780219467183	21/02/24 15:42:20
19	929	307.59178972789636	285.0978021946719	21/02/24 15:42:21
19	980	311.1000485048991	283.6794021053163	21/02/24 15:42:22
19	911	314.5882445185791	281.94764300047444	21/02/24 15:42:23
19	897	319.01521359261704	283.59757186890573	21/02/24 15:42:24
19	897	319.01521359261704	283.59757186890573	21/02/24 15:42:25
19	897	319.01521359261704	283.59757186890573	21/02/24 15:42:26
19	911	321.43497119517593	280.68483158670483	21/02/24 15:42:27
19	NULL	322.7688919024709	282.9508947625264	21/02/24 15:42:28
19	955	325.8767227240101	280.18515979393715	21/02/24 15:42:29
19	955	327.03491767926494	278.4361492594608	21/02/24 15:42:30
19	955	326.6451047308665	278.11405484814526	21/02/24 15:42:31
19	955	324.5428020167151	277.91909661811553	21/02/24 15:42:32
19	955	324.5428020167151	277.91909661811553	21/02/24 15:42:33
19	955	324.54280201671514	277.9190966181156	21/02/24 15:42:34
19	955	324.5428020167151	277.91909661811553	21/02/24 15:42:35
19	911	321.43497119517593	280.6848315867048	21/02/24 15:42:36
19	955	324.5428020167151	277.91909661811553	21/02/24 15:42:37
19	911	321.43497119517593	280.6848315867048	21/02/24 15:42:38
19	955	324.5428020167151	277.91909661811553	21/02/24 15:42:39
19	955	324.5428020167151	277.91909661811553	21/02/24 15:42:40
19	911	321.43497119517593	280.6848315867048	21/02/24 15:42:41
19	911	321.43497119517593	280.6848315867048	21/02/24 15:42:42
19	911	321.43497119517593	280.6848315867048	21/02/24 15:42:43
19	955	324.5428020167151	277.91909661811553	21/02/24 15:42:44
19	955	323.9884222877308	280.17133116751256	21/02/24 15:42:45
19	955	323.9884222877308	280.17133116751256	21/02/24 15:42:46
19	955	323.9884222877308	280.17133116751256	21/02/24 15:42:47
19	955	328.92321811554416	278.4499778858854	21/02/24 15:42:48
19	955	323.9884222877308	280.17133116751256	21/02/24 15:42:49
19	NULL	322.7688919024709	282.9508947625264	21/02/24 15:42:50
19	NULL	322.7688919024709	282.9508947625264	21/02/24 15:42:51
19	897	319.01521359261704	283.59757186890573	21/02/24 15:42:52
19	897	319.01521359261704	283.59757186890573	21/02/24 15:42:53
19	897	319.01521359261704	283.59757186890573	21/02/24 15:42:54
19	975	315.07586920053365	286.03778962296946	21/02/24 15:42:55
19	897	319.01521359261704	283.59757186890573	21/02/24 15:42:56
19	897	319.01521359261704	283.59757186890573	21/02/24 15:42:57
19	897	319.01521359261704	283.59757186890573	21/02/24 15:42:58
19	897	319.01521359261704	283.59757186890573	21/02/24 15:42:59
19	897	319.01521359261704	283.59757186890573	21/02/24 15:43:00
19	897	319.01521359261704	283.59757186890573	21/02/24 15:43:01
19	897	319.01521359261704	283.59757186890573	21/02/24 15:43:02
19	897	319.01521359261704	283.59757186890573	21/02/24 15:43:03
19	897	319.01521359261704	283.59757186890573	21/02/24 15:43:04
19	897	319.01521359261704	283.59757186890573	21/02/24 15:43:05
19	897	319.01521359261704	283.59757186890573	21/02/24 15:43:06
19	897	319.01521359261704	283.59757186890573	21/02/24 15:43:07
19	897	319.01521359261704	283.59757186890573	21/02/24 15:43:08
19	897	319.01521359261704	283.59757186890573	21/02/24 15:43:09
19	897	319.01521359261704	283.59757186890573	21/02/24 15:43:10
19	897	319.01521359261704	283.59757186890573	21/02/24 15:43:11
19	897	319.01521359261704	283.59757186890573	21/02/24 15:43:12
19	897	319.01521359261704	283.59757186890573	21/02/24 15:43:13
19	897	319.01521359261704	283.59757186890573	21/02/24 15:43:14
19	897	319.01521359261704	283.59757186890573	21/02/24 15:43:15
19	897	319.01521359261704	283.59757186890573	21/02/24 15:43:16
19	897	319.01521359261704	283.59757186890573	21/02/24 15:43:17
19	897	319.01521359261704	283.59757186890573	21/02/24 15:43:18
19	897	319.01521359261704	283.59757186890573	21/02/24 15:43:19
19	897	319.01521359261704	283.59757186890573	21/02/24 15:43:20
19	897	319.01521359261704	283.59757186890573	21/02/24 15:43:21
19	897	319.01521359261704	283.59757186890573	21/02/24 15:43:22
19	897	319.01521359261704	283.59757186890573	21/02/24 15:43:23
19	897	319.01521359261704	283.59757186890573	21/02/24 15:43:24
19	NULL	322.7688919024709	282.9508947625264	21/02/24 15:43:25
19	NULL	322.7688919024709	282.9508947625264	21/02/24 15:43:26
19	NULL	326.2665356724085	280.50725420525265	21/02/24 15:43:27
19	955	328.92321811554416	278.4499778858854	21/02/24 15:43:28
19	955	328.92321811554416	278.4499778858854	21/02/24 15:43:29
19	955	328.92321811554416	278.4499778858854	21/02/24 15:43:30
19	955	328.92321811554416	278.4499778858854	21/02/24 15:43:31
19	955	331.5796102272668	277.2385535448373	21/02/24 15:43:32
19	955	332.13398995625107	274.9863189954403	21/02/24 15:43:33
19	915	336.54156488011523	280.3558442180772	21/02/24 15:43:34
19	964	349.72234002988336	284.71465847817086	21/02/24 15:43:35
19	964	349.72234002988336	284.71465847817086	21/02/24 15:43:36
19	968	355.71807547868275	279.11092240486005	21/02/24 15:43:37
19	964	355.482293890607	282.3613173869535	21/02/24 15:43:38
19	964	355.482293890607	282.3613173869535	21/02/24 15:43:39
19	964	355.482293890607	282.3613173869535	21/02/24 15:43:40
19	964	355.482293890607	282.3613173869535	21/02/24 15:43:41
19	990	357.82242061436585	282.16385269148645	21/02/24 15:43:42
19	959	362.3530560401282	287.71527633822046	21/02/24 15:43:43
19	NULL	360.5547106147948	283.12207921272073	21/02/24 15:43:44
19	959	363.5183049140067	287.25368586923065	21/02/24 15:43:45
19	958	365.55243192741585	288.59648801263694	21/02/24 15:43:46
19	958	365.55243192741585	288.59648801263694	21/02/24 15:43:47
19	958	365.55243192741585	288.59648801263694	21/02/24 15:43:48
19	958	365.55243192741585	288.59648801263694	21/02/24 15:43:49
19	958	365.55243192741585	288.59648801263694	21/02/24 15:43:50
19	958	365.55243192741585	288.59648801263694	21/02/24 15:43:51
19	958	365.55243192741585	288.59648801263694	21/02/24 15:43:52
19	958	365.55243192741585	288.59648801263694	21/02/24 15:43:53
19	958	365.55243192741585	288.59648801263694	21/02/24 15:43:54
19	958	365.55243192741585	288.59648801263694	21/02/24 15:43:55
19	NULL	368.6441963719141	285.32200544753397	21/02/24 15:43:56
19	NULL	368.6441963719141	285.32200544753397	21/02/24 15:43:57
19	910	371.49991506597235	283.64243362381774	21/02/24 15:43:59
19	990	373.5702263177357	281.590961967497	21/02/24 15:44:00
19	990	373.5702263177357	281.590961967497	21/02/24 15:44:01
19	916	368.916162198344	278.6773366657135	21/02/24 15:44:02
19	NULL	364.30073696422824	274.962631965603	21/02/24 15:44:03
19	NULL	364.30073696422824	274.962631965603	21/02/24 15:44:04
19	916	368.916162198344	278.6773366657135	21/02/24 15:44:05
19	916	368.5363207667605	279.5108269673078	21/02/24 15:44:06
19	NULL	364.30073696422824	274.962631965603	21/02/24 15:44:07
19	NULL	364.30073696422824	274.962631965603	21/02/24 15:44:08
19	NULL	364.30073696422824	274.962631965603	21/02/24 15:44:09
19	916	368.5363207667605	279.5108269673078	21/02/24 15:44:10
19	NULL	364.30073696422824	274.962631965603	21/02/24 15:44:11
19	NULL	364.30073696422824	274.962631965603	21/02/24 15:44:12
19	916	369.33464251520337	277.0427669657921	21/02/24 15:44:13
19	NULL	364.30073696422824	274.962631965603	21/02/24 15:44:14
19	NULL	364.30073696422824	274.962631965603	21/02/24 15:44:15
19	NULL	364.30073696422824	274.962631965603	21/02/24 15:44:16
19	NULL	364.30073696422824	274.962631965603	21/02/24 15:44:17
19	NULL	364.30073696422824	274.962631965603	21/02/24 15:44:18
19	NULL	364.30073696422824	274.962631965603	21/02/24 15:44:19
19	916	368.5363207667605	279.5108269673078	21/02/24 15:44:20
19	NULL	364.30073696422824	274.962631965603	21/02/24 15:44:21
19	916	368.9161621983441	278.6773366657135	21/02/24 15:44:22
19	937	374.6323604046247	279.0631299285737	21/02/24 15:44:23
19	916	368.916162198344	278.6773366657135	21/02/24 15:44:24
19	916	368.5363207667605	279.5108269673078	21/02/24 15:44:25
19	990	373.5702263177357	281.590961967497	21/02/24 15:44:26
19	937	374.6323604046247	279.0631299285737	21/02/24 15:44:27
19	937	374.6323604046247	279.06312992857363	21/02/24 15:44:28
19	937	374.6323604046247	279.06312992857363	21/02/24 15:44:29
19	990	373.5702263177357	281.590961967497	21/02/24 15:44:30
19	990	373.5702263177357	281.590961967497	21/02/24 15:44:31
19	990	373.5702263177357	281.590961967497	21/02/24 15:44:32
19	990	373.5702263177357	281.5909619674969	21/02/24 15:44:33
19	905	375.09542798338026	284.54571340969284	21/02/24 15:44:34
19	905	375.1484764138781	287.03143447263193	21/02/24 15:44:35
19	905	375.1484764138781	287.03143447263193	21/02/24 15:44:36
19	905	375.1484764138781	287.03143447263193	21/02/24 15:44:37
19	905	375.1484764138781	287.03143447263193	21/02/24 15:44:38
19	905	375.1484764138781	287.03143447263193	21/02/24 15:44:39
19	905	375.1484764138781	287.03143447263193	21/02/24 15:44:40
19	905	375.1484764138781	287.03143447263193	21/02/24 15:44:41
19	905	375.1484764138781	287.03143447263193	21/02/24 15:44:42
19	905	375.1484764138781	287.03143447263193	21/02/24 15:44:43
19	905	375.1484764138781	287.03143447263193	21/02/24 15:44:44
19	905	375.1484764138781	287.03143447263193	21/02/24 15:44:45
19	905	375.1484764138781	287.03143447263193	21/02/24 15:44:46
19	905	375.1484764138781	287.03143447263193	21/02/24 15:44:47
19	905	375.1484764138781	287.03143447263193	21/02/24 15:44:48
19	905	375.1484764138781	287.03143447263193	21/02/24 15:44:49
19	905	375.1484764138781	287.03143447263193	21/02/24 15:44:50
19	905	375.1484764138781	287.03143447263193	21/02/24 15:44:51
19	905	375.1484764138781	287.03143447263193	21/02/24 15:44:52
19	905	375.1484764138781	287.03143447263193	21/02/24 15:44:53
19	905	375.1484764138781	287.03143447263193	21/02/24 15:44:54
19	905	375.1484764138781	287.03143447263193	21/02/24 15:44:55
19	905	375.1484764138781	287.03143447263193	21/02/24 15:44:56
19	905	375.1484764138781	287.03143447263193	21/02/24 15:44:57
19	905	375.1484764138781	287.03143447263193	21/02/24 15:44:58
19	990	373.5702263177357	281.5909619674969	21/02/24 15:44:59
19	990	373.5702263177357	281.5909619674969	21/02/24 15:45:00
19	910	371.49991506597235	283.64243362381774	21/02/24 15:45:01
19	905	372.94927998369945	284.2983833316336	21/02/24 15:45:02
19	905	373.0251167316169	286.59718506601365	21/02/24 15:45:03
19	905	373.0251167316169	286.59718506601365	21/02/24 15:45:04
