stationId	t_start	t_end	t_max	timeStamp
141	20/04/28 05:14:49	20/04/28 05:14:49	20/04/28 05:14:49
93	20/04/28 05:14:51	20/04/28 05:14:51	20/04/28 05:14:51
94	20/04/28 05:14:53	20/04/28 05:14:54	20/04/28 05:14:54
96	20/04/28 05:14:56	20/04/28 05:14:56	20/04/28 05:14:56
108	20/04/28 05:14:44	20/04/28 05:14:58	20/04/28 05:14:58
85	20/04/28 05:15:00	20/04/28 05:15:00	20/04/28 05:15:00
25	20/04/28 05:15:02	20/04/28 05:15:02	20/04/28 05:15:02
85	20/04/28 05:15:04	20/04/28 05:15:04	20/04/28 05:15:04
49	20/04/28 05:15:06	20/04/28 05:15:06	20/04/28 05:15:06
141	20/04/28 05:15:08	20/04/28 05:15:09	20/04/28 05:15:08
25	20/04/28 05:15:11	20/04/28 05:15:11	20/04/28 05:15:11
85	20/04/28 05:15:13	20/04/28 05:15:13	20/04/28 05:15:13
108	20/04/28 05:15:15	20/04/28 05:15:15	20/04/28 05:15:15
108	20/04/28 05:15:17	20/04/28 05:15:17	20/04/28 05:15:17
96	20/04/28 05:15:19	20/04/28 05:15:20	20/04/28 05:15:20
108	20/04/28 05:15:22	20/04/28 05:15:22	20/04/28 05:15:22
85	20/04/28 05:15:24	20/04/28 05:15:24	20/04/28 05:15:24
94	20/04/28 05:15:26	20/04/28 05:15:26	20/04/28 05:15:26
94	20/04/28 05:15:28	20/04/28 05:15:28	20/04/28 05:15:28
96	20/04/28 05:15:30	20/04/28 05:15:30	20/04/28 05:15:30
96	20/04/28 05:15:32	20/04/28 05:15:33	20/04/28 05:15:33
85	20/04/28 05:15:35	20/04/28 05:15:35	20/04/28 05:15:35
108	20/04/28 05:15:37	20/04/28 05:15:38	20/04/28 05:15:38
108	20/04/28 05:15:40	20/04/28 05:15:41	20/04/28 05:15:41
92	20/04/28 05:15:44	20/04/28 05:15:45	20/04/28 05:15:45
85	20/04/28 05:15:47	20/04/28 05:15:47	20/04/28 05:15:47
125	20/04/28 05:15:49	20/04/28 05:15:49	20/04/28 05:15:49
82	20/04/28 05:15:51	20/04/28 05:15:51	20/04/28 05:15:51
156	20/04/28 05:15:53	20/04/28 05:15:53	20/04/28 05:15:53
29	20/04/28 05:15:55	20/04/28 05:15:55	20/04/28 05:15:55
144	20/04/28 05:15:57	20/04/28 05:15:57	20/04/28 05:15:57
156	20/04/28 05:15:59	20/04/28 05:15:59	20/04/28 05:15:59
11	20/04/28 05:16:01	20/04/28 05:16:01	20/04/28 05:16:01
156	20/04/28 05:16:03	20/04/28 05:16:03	20/04/28 05:16:03
33	20/04/28 05:14:00	20/04/28 05:16:05	20/04/28 05:16:05
156	20/04/28 05:16:07	20/04/28 05:16:07	20/04/28 05:16:07
114	20/04/28 05:16:09	20/04/28 05:16:09	20/04/28 05:16:09
156	20/04/28 05:16:11	20/04/28 05:16:11	20/04/28 05:16:11
156	20/04/28 05:16:13	20/04/28 05:16:13	20/04/28 05:16:13
156	20/04/28 05:16:15	20/04/28 05:16:15	20/04/28 05:16:15
69	20/04/28 05:16:17	20/04/28 05:16:17	20/04/28 05:16:17
70	20/04/28 05:16:19	20/04/28 05:16:19	20/04/28 05:16:19
156	20/04/28 05:16:21	20/04/28 05:16:22	20/04/28 05:16:22
147	20/04/28 05:16:24	20/04/28 05:16:24	20/04/28 05:16:24
147	20/04/28 05:16:26	20/04/28 05:16:26	20/04/28 05:16:26
114	20/04/28 05:16:28	20/04/28 05:16:28	20/04/28 05:16:28
114	20/04/28 05:16:30	20/04/28 05:16:30	20/04/28 05:16:30
156	20/04/28 05:16:32	20/04/28 05:16:32	20/04/28 05:16:32
70	20/04/28 05:16:34	20/04/28 05:16:34	20/04/28 05:16:34
69	20/04/28 05:16:36	20/04/28 05:16:36	20/04/28 05:16:36
114	20/04/28 05:16:38	20/04/28 05:16:38	20/04/28 05:16:38
156	20/04/28 05:16:40	20/04/28 05:16:40	20/04/28 05:16:40
144	20/04/28 05:16:42	20/04/28 05:16:42	20/04/28 05:16:42
156	20/04/28 05:16:44	20/04/28 05:16:44	20/04/28 05:16:44
70	20/04/28 05:16:46	20/04/28 05:16:46	20/04/28 05:16:46
156	20/04/28 05:16:48	20/04/28 05:16:48	20/04/28 05:16:48
114	20/04/28 05:16:50	20/04/28 05:16:51	20/04/28 05:16:51
147	20/04/28 05:16:53	20/04/28 05:16:53	20/04/28 05:16:53
45	20/04/28 05:16:55	20/04/28 05:16:55	20/04/28 05:16:55
101	20/04/28 05:16:57	20/04/28 05:16:57	20/04/28 05:16:57
114	20/04/28 05:16:59	20/04/28 05:16:59	20/04/28 05:16:59
144	20/04/28 05:17:01	20/04/28 05:17:01	20/04/28 05:17:01
147	20/04/28 05:17:03	20/04/28 05:17:03	20/04/28 05:17:03
70	20/04/28 05:17:05	20/04/28 05:17:05	20/04/28 05:17:05
144	20/04/28 05:17:07	20/04/28 05:17:07	20/04/28 05:17:07
147	20/04/28 05:17:09	20/04/28 05:17:09	20/04/28 05:17:09
147	20/04/28 05:17:11	20/04/28 05:17:11	20/04/28 05:17:11
114	20/04/28 05:17:13	20/04/28 05:17:13	20/04/28 05:17:13
70	20/04/28 05:17:15	20/04/28 05:17:15	20/04/28 05:17:15
28	20/04/28 05:17:17	20/04/28 05:17:17	20/04/28 05:17:17
82	20/04/28 05:17:19	20/04/28 05:17:19	20/04/28 05:17:19
70	20/04/28 05:17:21	20/04/28 05:17:21	20/04/28 05:17:21
5	20/04/28 05:17:23	20/04/28 05:17:23	20/04/28 05:17:23
70	20/04/28 05:17:25	20/04/28 05:17:27	20/04/28 05:17:25
70	20/04/28 05:17:29	20/04/28 05:17:29	20/04/28 05:17:29
114	20/04/28 05:17:31	20/04/28 05:17:31	20/04/28 05:17:31
28	20/04/28 05:17:33	20/04/28 05:17:33	20/04/28 05:17:33
5	20/04/28 05:17:35	20/04/28 05:17:35	20/04/28 05:17:35
82	20/04/28 05:17:37	20/04/28 05:17:37	20/04/28 05:17:37
6	20/04/28 05:17:39	20/04/28 05:17:39	20/04/28 05:17:39
70	20/04/28 05:17:41	20/04/28 05:17:41	20/04/28 05:17:41
70	20/04/28 05:17:43	20/04/28 05:17:43	20/04/28 05:17:43
