floorId	partitionId	location_x	location_y	timeStamp
3	42	341.3335516614161	255.19514044143733	20/04/28 05:09:50
3	42	341.5608054587151	255.31403792969235	20/04/28 05:09:50
3	42	341.7325802795506	255.40390923211078	20/04/28 05:09:50
3	42	341.7325802795506	255.40390923211078	20/04/28 05:09:50
3	42	341.9875339251043	255.53729907394438	20/04/28 05:09:50
3	42	342.2530350403051	255.6762072730657	20/04/28 05:09:51
3	42	342.66002878163386	255.88914335666317	20/04/28 05:09:51
3	42	342.83748224279583	255.98198568125835	20/04/28 05:09:51
3	42	342.83748224279583	255.98198568125835	20/04/28 05:09:51
3	42	343.0991057061313	256.11886512190523	20/04/28 05:09:51
3	42	343.31774902718985	256.2332576733458	20/04/28 05:09:51
3	42	343.51519601071493	256.33656045941	20/04/28 05:09:51
3	42	343.7387124423472	256.4535025858812	20/04/28 05:09:51
3	42	344.0003019652453	256.5903642691449	20/04/28 05:09:51
3	42	344.2634581031745	256.72804559368404	20/04/28 05:09:52
3	42	344.6647949911682	256.93802205389585	20/04/28 05:09:52
3	42	344.8052687270377	257.01151686260397	20/04/28 05:09:52
3	42	344.950623174717	257.0875652232526	20/04/28 05:09:52
3	42	344.950623174717	257.0875652232526	20/04/28 05:09:52
3	42	345.19838832966883	257.21719410053	20/04/28 05:09:52
3	42	345.3868188933753	257.3157795631337	20/04/28 05:09:52
3	42	345.5912713869955	257.4227475797206	20/04/28 05:09:52
3	42	345.79878284238106	257.53131602224045	20/04/28 05:09:52
3	42	345.9350011914295	257.60258444436846	20/04/28 05:09:52
3	42	346.1039123812525	257.6909575164439	20/04/28 05:09:53
3	42	346.2612083624373	257.7732535981718	20/04/28 05:09:53
3	42	346.5214609627834	257.90941581354843	20/04/28 05:09:53
3	42	346.7019619530013	258.00385258256847	20/04/28 05:09:53
3	42	346.96631465134925	258.1421599385756	20/04/28 05:09:53
3	42	347.21470284158283	258.27211478325586	20/04/28 05:09:53
3	42	347.4691102838426	258.4052188556084	20/04/28 05:09:53
3	42	347.720714125773	258.5368561052226	20/04/28 05:09:53
3	42	347.98473114977753	258.6749878389221	20/04/28 05:09:53
3	42	348.21244174050474	258.7941243180847	20/04/28 05:09:53
3	42	348.3608817451021	258.87178701905145	20/04/28 05:09:54
3	42	348.5018117006117	258.94552051846546	20/04/28 05:09:54
3	42	348.73536398282977	259.06771332695536	20/04/28 05:09:54
3	42	348.992558670452	259.20227566524966	20/04/28 05:09:54
3	42	349.13610873410465	259.27737998566147	20/04/28 05:09:54
3	42	349.27730824312005	259.3512545134551	20/04/28 05:09:54
3	42	349.4815964255565	259.45813656365874	20/04/28 05:09:54
3	42	349.68315736087095	259.56359173855157	20/04/28 05:09:54
3	42	349.88419411878937	259.66877266774844	20/04/28 05:09:54
3	42	350.14596830177385	259.8057309637892	20/04/28 05:09:55
3	42	350.34283529555216	259.9087303035528	20/04/28 05:09:55
3	42	350.5460319204437	260.01504125900715	20/04/28 05:09:55
3	42	350.7336896537353	260.113222382514	20/04/28 05:09:55
3	42	350.92928208228363	260.21555487927526	20/04/28 05:09:55
3	42	351.1108970752503	260.31057448620743	20/04/28 05:09:55
3	42	351.25067012147827	260.38370269933205	20/04/28 05:09:55
3	42	351.4423162772289	260.48397053566	20/04/28 05:09:55
3	42	351.58446569488507	260.5583420485549	20/04/28 05:09:55
3	28	351.46922664669876	260.6246361048274	20/04/28 05:09:55
3	28	351.24867872595877	260.6708964795657	20/04/28 05:09:56
3	28	351.0424535345022	260.71415263271945	20/04/28 05:09:56
3	28	350.84963091439283	260.7545975692863	20/04/28 05:09:56
3	28	350.65003458943676	260.79646330421537	20/04/28 05:09:56
3	28	350.4755126085093	260.8330696445095	20/04/28 05:09:56
3	28	350.25179286187057	260.8799953161782	20/04/28 05:09:56
3	28	350.00234810671935	260.93231686068015	20/04/28 05:09:56
3	28	349.85078711387683	260.9641070870449	20/04/28 05:09:56
3	28	349.58383513466856	261.0201008073841	20/04/28 05:09:56
3	28	349.32592187930726	261.0741986370211	20/04/28 05:09:56
3	28	349.05625159840065	261.1307625266677	20/04/28 05:09:57
3	28	348.79530594490643	261.1854964079778	20/04/28 05:09:57
3	28	348.6050186788607	261.2254095488755	20/04/28 05:09:57
3	28	348.3277550946199	261.2835661493333	20/04/28 05:09:57
3	28	348.0577729483307	261.3401954533779	20/04/28 05:09:57
3	28	347.8781633352702	261.37786893485486	20/04/28 05:09:57
3	28	347.69814358969967	261.4156284424596	20/04/28 05:09:57
3	28	347.47306860037247	261.46283837903735	20/04/28 05:09:57
3	28	346.9655042009851	261.56930104366234	20/04/28 05:09:57
3	28	346.67962322912916	261.6292651586911	20/04/28 05:09:58
3	28	346.67962322912916	261.6292651586911	20/04/28 05:09:58
3	28	346.4405906872648	261.6794027202886	20/04/28 05:09:58
3	28	346.25663919358783	261.71798692005166	20/04/28 05:09:58
3	28	346.01831734136744	261.7679754130515	20/04/28 05:09:58
3	28	345.76354736176353	261.82141393420824	20/04/28 05:09:58
3	28	345.3415506148422	261.90992860977366	20/04/28 05:09:58
3	28	345.09150087447364	261.9623770511548	20/04/28 05:09:58
3	28	344.81202964450466	262.0209967097921	20/04/28 05:09:58
3	28	344.53664560039283	262.0787590728868	20/04/28 05:09:58
3	28	344.30304797456307	262.12775664979705	20/04/28 05:09:59
3	28	344.14844572756476	262.1601847854037	20/04/28 05:09:59
3	28	343.9355246746074	262.20484540911957	20/04/28 05:09:59
3	28	343.7036948860651	262.2534721785649	20/04/28 05:09:59
3	28	343.4712127320397	262.3022357829965	20/04/28 05:09:59
3	28	343.3006248891246	262.3380169298446	20/04/28 05:09:59
3	28	343.07506902221496	262.3853277314729	20/04/28 05:09:59
3	28	342.79247979755365	262.4446013958356	20/04/28 05:09:59
3	28	342.5540979688979	262.4946024690147	20/04/28 05:09:59
3	28	342.5540979688979	262.4946024690147	20/04/28 05:10:00
3	28	342.3461724168848	262.5382152762519	20/04/28 05:10:00
3	28	342.1778700531542	262.5735170391948	20/04/28 05:10:00
3	28	341.97135762007747	262.6168334418623	20/04/28 05:10:00
3	28	341.73533010432106	262.66634069312454	20/04/28 05:10:00
3	28	341.4529326513388	262.72557413298773	20/04/28 05:10:00
3	28	341.29408460643504	262.7588928333366	20/04/28 05:10:00
3	28	341.0275607369576	262.8147967567894	20/04/28 05:10:00
3	28	340.7445185669349	262.87416542736247	20/04/28 05:10:00
3	28	340.4567397343394	262.93452762253963	20/04/28 05:10:00
3	28	340.1803159369227	262.9925080760038	20/04/28 05:10:01
3	28	339.9139213997411	263.04838487174464	20/04/28 05:10:01
3	28	339.7202632695029	263.0890050582596	20/04/28 05:10:01
3	28	339.51607609543123	263.13183373312364	20/04/28 05:10:01
3	28	339.34253455228776	263.1682344245994	20/04/28 05:10:01
3	28	339.083610897207	263.2225441876317	20/04/28 05:10:01
3	28	338.86422979084006	263.26855982068315	20/04/28 05:10:01
3	28	338.58622895148005	263.326871061901	20/04/28 05:10:01
3	28	338.3553529135038	263.37529778022616	20/04/28 05:10:01
3	28	338.16201538794536	263.4158507192577	20/04/28 05:10:01
3	28	337.88704331586354	263.4735266703816	20/04/28 05:10:02
3	28	337.6476162723576	263.5237469795004	20/04/28 05:10:02
3	28	337.36574854871736	263.5828693075572	20/04/28 05:10:02
3	28	337.36574854871736	263.5828693075572	20/04/28 05:10:02
3	28	337.18702593030946	263.6203567401025	20/04/28 05:10:02
3	28	337.0327951586306	263.65270695800575	20/04/28 05:10:02
3	28	336.7599230954174	263.7099424280002	20/04/28 05:10:02
3	28	336.5931757019983	263.74491803275913	20/04/28 05:10:02
3	28	336.4173099942576	263.7818062224841	20/04/28 05:10:02
3	28	336.2235092355973	263.8224563256005	20/04/28 05:10:03
3	28	336.02895397146443	263.86326468777366	20/04/28 05:10:03
3	28	335.79622177013846	263.9120807401349	20/04/28 05:10:03
3	28	335.53488795894464	263.96689603831163	20/04/28 05:10:03
3	28	335.2433835500854	264.028039680684	20/04/28 05:10:03
3	28	335.0480292270357	264.06901564708943	20/04/28 05:10:03
3	28	334.8403257399927	264.1125818757477	20/04/28 05:10:03
3	28	334.6180804346692	264.1591982803531	20/04/28 05:10:03
3	28	334.38014022163736	264.2091067237573	20/04/28 05:10:03
3	28	334.2079025377229	264.24523392810914	20/04/28 05:10:03
3	28	334.0538399564659	264.2775488677294	20/04/28 05:10:04
3	28	333.89664789268227	264.31052022267176	20/04/28 05:10:04
3	28	333.7026862837903	264.3512040644513	20/04/28 05:10:04
3	28	333.42067581705044	264.41035633316335	20/04/28 05:10:04
3	28	333.1977047680407	264.4571249639823	20/04/28 05:10:04
3	28	333.005377731641	264.49746595085855	20/04/28 05:10:04
3	28	332.82754507525607	264.53476671206033	20/04/28 05:10:04
3	28	332.57127144328973	264.58852062735696	20/04/28 05:10:04
3	28	332.41359245174493	264.62159411638714	20/04/28 05:10:04
3	54	332.31433742035995	264.86023594069377	20/04/28 05:10:05
3	54	332.2859590808879	265.0252202945292	20/04/28 05:10:05
3	54	332.2456106982999	265.25979539488475	20/04/28 05:10:05
3	54	332.21028788625574	265.4651531229681	20/04/28 05:10:05
3	54	332.1735446395696	265.67876889207605	20/04/28 05:10:05
3	54	332.12763760169094	265.9456605820701	20/04/28 05:10:05
3	54	332.1013252710637	266.09863369280197	20/04/28 05:10:05
3	54	332.06099922911017	266.33307891046513	20/04/28 05:10:05
3	54	332.01451387622564	266.6033327748964	20/04/28 05:10:05
3	54	332.01451387622564	266.6033327748964	20/04/28 05:10:05
3	54	331.96995905908045	266.8623630019539	20/04/28 05:10:06
3	54	331.92770537258576	267.10801504831	20/04/28 05:10:06
3	54	331.87705235117676	267.40249866371715	20/04/28 05:10:06
3	54	331.8361870283297	267.6400791215465	20/04/28 05:10:06
3	54	331.7906635517359	267.90474088505664	20/04/28 05:10:06
3	54	331.75184434594655	268.13042574550707	20/04/28 05:10:06
3	54	331.7189395980332	268.3217254717628	20/04/28 05:10:06
3	54	331.6874389340328	268.5048622159199	20/04/28 05:10:06
3	54	331.65561125384625	268.6899001479254	20/04/28 05:10:06
3	54	331.618952098639	268.9030270308418	20/04/28 05:10:07
3	54	331.56958724398885	269.1900215766171	20/04/28 05:10:07
3	54	331.53394470212777	269.39723813147566	20/04/28 05:10:07
3	54	331.5011146921462	269.588103350653	20/04/28 05:10:07
3	54	331.46312866923427	269.8089443005287	20/04/28 05:10:07
3	54	331.429831793038	270.00252375958735	20/04/28 05:10:07
3	54	331.38052048423395	270.28920700360965	20/04/28 05:10:07
3	54	331.3381774183822	270.5353786785184	20/04/28 05:10:07
3	54	331.2912921201672	270.80795772205266	20/04/28 05:10:07
3	54	331.2524838189245	271.03357918627864	20/04/28 05:10:07
3	54	331.179208590424	271.45958248496345	20/04/28 05:10:08
3	54	331.1487813164032	271.636478816345	20/04/28 05:10:08
3	54	331.11538796080475	271.83061918178913	20/04/28 05:10:08
3	54	331.0763529106989	272.05755890548187	20/04/28 05:10:08
3	54	331.0417488722921	272.2587378688343	20/04/28 05:10:08
3	54	331.00246417049203	272.4871290031531	20/04/28 05:10:08
3	54	331.00246417049203	272.4871290031531	20/04/28 05:10:08
3	54	330.97680732572127	272.63629128800517	20/04/28 05:10:08
3	54	330.97680732572127	272.63629128800517	20/04/28 05:10:08
3	54	330.9374291890001	272.8652256288808	20/04/28 05:10:08
3	54	330.9019630330386	273.0714167215661	20/04/28 05:10:09
3	54	330.85196875421	273.3620705773397	20/04/28 05:10:09
3	54	330.82573277244364	273.51459981546606	20/04/28 05:10:09
3	54	330.78149075329986	273.7718115155377	20/04/28 05:10:09
3	54	330.74257066353414	273.99808288943314	20/04/28 05:10:09
3	54	330.69528878147577	274.27296756925057	20/04/28 05:10:09
3	54	330.6525716124919	274.5213141833795	20/04/28 05:10:09
3	54	330.62328888586694	274.6915564111009	20/04/28 05:10:09
3	54	330.5830581790895	274.92544737461395	20/04/28 05:10:09
3	28	330.54614277948576	275.1400639964286	20/04/28 05:10:10
3	28	330.4569638639084	275.10998982642485	20/04/28 05:10:10
3	28	330.4223381529753	275.3372868755801	20/04/28 05:10:10
3	28	330.6813629202753	275.25086893158795	20/04/28 05:10:10
3	28	330.652570555325	275.2297696963724	20/04/28 05:10:10
3	28	330.6585072186541	275.2044096260901	20/04/28 05:10:10
3	28	330.65964939983263	275.2028323962052	20/04/28 05:10:10
3	28	330.912381743598	275.1679810979749	20/04/28 05:10:10
3	28	330.95380815154886	275.25776337866296	20/04/28 05:10:10
3	28	331.059347110777	275.12889901382675	20/04/28 05:10:10
3	28	331.02588197527433	275.17014430394164	20/04/28 05:10:11
3	28	330.92669945842766	275.43301974919797	20/04/28 05:10:11
3	28	330.92768959305533	275.43934435776	20/04/28 05:10:11
3	28	330.9457776716621	275.4389647595362	20/04/28 05:10:11
3	28	331.1601859873501	275.6101104405992	20/04/28 05:10:11
3	28	331.21155635529016	275.8982214004931	20/04/28 05:10:11
3	28	331.03143673644377	275.78679389760384	20/04/28 05:10:11
3	28	330.8997880894186	275.79555452299434	20/04/28 05:10:11
3	28	330.7828489315984	275.72501482623994	20/04/28 05:10:11
3	28	330.8157401592533	275.6564187985737	20/04/28 05:10:12
3	28	330.7808456630237	275.8536454640798	20/04/28 05:10:12
3	28	330.63613925620484	275.87789502424226	20/04/28 05:10:12
3	28	330.6238036824784	275.92854062048684	20/04/28 05:10:12
3	28	330.5936328814704	275.98726405137023	20/04/28 05:10:12
3	28	330.56445960688364	275.91132393509247	20/04/28 05:10:12
3	28	330.8071295285052	276.0373370450473	20/04/28 05:10:12
3	28	330.9336540897749	276.10745840414006	20/04/28 05:10:12
3	28	330.93915972705884	276.3612157548064	20/04/28 05:10:12
3	28	330.9102114230813	276.3946311664099	20/04/28 05:10:12
3	28	330.9072697241088	276.39558063639026	20/04/28 05:10:13
3	28	330.85916262487905	276.335085807179	20/04/28 05:10:13
3	28	331.0494623751872	276.25504165663006	20/04/28 05:10:13
3	28	331.07066771565144	276.30892188037905	20/04/28 05:10:13
3	28	331.006178204195	276.3966197601441	20/04/28 05:10:13
3	28	331.2210911009464	276.2976025424548	20/04/28 05:10:13
3	28	331.133717705156	276.45086899775	20/04/28 05:10:13
3	28	331.220561662347	276.47928641940223	20/04/28 05:10:13
3	28	331.0336702712643	276.4291218460558	20/04/28 05:10:13
3	28	331.07930271779	276.4153427914852	20/04/28 05:10:13
3	28	331.06577370236903	276.3321058278771	20/04/28 05:10:14
3	28	331.22016030753275	276.2650353294076	20/04/28 05:10:14
3	28	331.03040426144935	276.39544043803426	20/04/28 05:10:14
3	28	331.2558840392132	276.33561849191693	20/04/28 05:10:14
3	28	331.11548591571517	276.43975386963655	20/04/28 05:10:14
3	28	330.94552622796255	276.51376932016956	20/04/28 05:10:14
3	28	331.01404794739926	276.494689112211	20/04/28 05:10:14
3	28	331.1468770969577	276.52064807512727	20/04/28 05:10:14
3	28	330.971456019435	276.2835959512657	20/04/28 05:10:14
3	28	330.9570681492137	276.2996005987115	20/04/28 05:10:15
3	28	330.9039045903117	276.18445267992627	20/04/28 05:10:15
3	28	331.0129025341055	276.0956997634281	20/04/28 05:10:15
3	28	330.9987478364632	276.05498033716077	20/04/28 05:10:15
3	28	330.74476906199084	275.93586129439694	20/04/28 05:10:15
3	28	330.6334418801245	276.1119316268132	20/04/28 05:10:15
3	28	330.70370032224236	276.1361691270688	20/04/28 05:10:15
3	28	330.69987834117256	276.1187243843194	20/04/28 05:10:15
3	28	330.8329218244665	276.1208695094852	20/04/28 05:10:15
3	28	330.870047004504	276.2794841708373	20/04/28 05:10:15
3	28	331.04922278193106	276.3219495437252	20/04/28 05:10:16
3	28	331.1911001797224	276.48045783751	20/04/28 05:10:16
3	28	331.1905881753231	276.47890152872327	20/04/28 05:10:16
3	28	331.13874160136885	276.50635376592777	20/04/28 05:10:16
3	28	331.13711288517715	276.50465636271485	20/04/28 05:10:16
3	28	331.13684778076436	276.5044235435639	20/04/28 05:10:16
3	28	331.0152968958037	276.3558208823127	20/04/28 05:10:16
3	28	331.04006676248645	276.2945431945148	20/04/28 05:10:16
3	28	331.0408846940374	276.2821276601071	20/04/28 05:10:16
3	28	331.244041764991	276.322742797433	20/04/28 05:10:16
3	28	331.0684364870533	276.1986345723049	20/04/28 05:10:17
3	28	330.8790193613763	276.4007321110888	20/04/28 05:10:17
3	28	330.8538855445513	276.4095585594661	20/04/28 05:10:17
3	28	330.79623667744266	276.3356818490574	20/04/28 05:10:17
3	28	330.5541060851019	276.3649751401903	20/04/28 05:10:17
3	28	330.60355783738703	276.4655700125907	20/04/28 05:10:17
3	28	330.57703736321963	276.2671033688899	20/04/28 05:10:17
3	28	330.3737469382867	276.067391123183	20/04/28 05:10:17
3	28	330.2064934013359	275.9116599520418	20/04/28 05:10:17
3	28	330.4211607392863	275.7775794658839	20/04/28 05:10:18
3	28	330.2237951840009	275.96804661977	20/04/28 05:10:18
3	28	330.1609201845118	276.1165325756579	20/04/28 05:10:18
3	28	330.1744697861365	275.90464809755076	20/04/28 05:10:18
3	28	329.98855024632576	275.9502985570571	20/04/28 05:10:18
3	28	330.04669126623435	276.0138618235733	20/04/28 05:10:18
3	28	330.1150628778097	275.8262026569667	20/04/28 05:10:18
3	28	330.1241552287617	275.8482994753317	20/04/28 05:10:18
3	28	330.3746269449059	275.71768619267533	20/04/28 05:10:18
3	28	330.17799098030207	275.68514940572715	20/04/28 05:10:18
3	28	330.1279030841732	275.5862262716988	20/04/28 05:10:19
3	28	330.0692693355274	275.5707190780999	20/04/28 05:10:19
3	28	330.3350238346837	275.456151376948	20/04/28 05:10:19
3	28	330.3338878290288	275.4443937357584	20/04/28 05:10:19
3	28	330.3567979396747	275.3769585092216	20/04/28 05:10:19
3	28	330.38988118954387	275.4232247045675	20/04/28 05:10:19
3	28	330.50926951591146	275.66683893588834	20/04/28 05:10:19
3	28	330.63595125431476	275.47177766100526	20/04/28 05:10:19
3	28	330.69375095217737	275.46840167992394	20/04/28 05:10:19
3	28	330.79796442955364	275.26832558821474	20/04/28 05:10:20
3	28	330.7831257475761	275.30221132512133	20/04/28 05:10:20
3	28	330.6511252681651	275.19495861529293	20/04/28 05:10:20
3	28	330.72633442715687	275.2907584335329	20/04/28 05:10:20
3	28	330.934603553036	275.1159833639154	20/04/28 05:10:20
3	28	330.93955957181794	274.953249640429	20/04/28 05:10:20
3	28	330.94320094023806	275.08022267682276	20/04/28 05:10:20
3	28	330.91607421505256	275.06803264348974	20/04/28 05:10:20
3	28	330.78884216728466	275.22368325051076	20/04/28 05:10:20
3	28	331.03329104886114	275.1219696068708	20/04/28 05:10:20
3	28	330.87943948915284	275.2296824948777	20/04/28 05:10:21
3	28	330.8097960748563	275.0202269051075	20/04/28 05:10:21
3	28	330.6043540054494	274.91924059600143	20/04/28 05:10:21
3	28	330.44970059554305	275.0515934330302	20/04/28 05:10:21
3	28	330.45398838642177	275.2069849320732	20/04/28 05:10:21
3	28	330.39212798478417	275.1775421847318	20/04/28 05:10:21
3	28	330.62247119661754	275.34687272047046	20/04/28 05:10:21
3	28	330.78691681769646	275.3930153672037	20/04/28 05:10:21
3	28	331.05014951800933	275.43236473878585	20/04/28 05:10:21
3	28	331.0976445511003	275.28439522392785	20/04/28 05:10:21
3	28	331.1753544087745	275.0834857438848	20/04/28 05:10:22
3	28	331.15965649079476	275.08098609810935	20/04/28 05:10:22
3	28	330.99415489430675	275.15206780927224	20/04/28 05:10:22
3	28	330.85095239920213	275.13967315841586	20/04/28 05:10:22
3	28	330.84553798510194	275.0786305128688	20/04/28 05:10:22
3	28	330.84553798510194	275.0786305128688	20/04/28 05:10:22
3	28	330.84553798510194	275.0786305128688	20/04/28 05:10:22
3	28	330.87909118074475	274.85002272446354	20/04/28 05:10:22
3	28	330.9638720521959	274.95912577830796	20/04/28 05:10:22
3	28	331.10837392229377	275.21189717338933	20/04/28 05:10:23
3	28	330.81464762935116	275.1890255925297	20/04/28 05:10:23
3	28	330.81464762935116	275.1890255925297	20/04/28 05:10:23
3	28	330.81464762935116	275.1890255925297	20/04/28 05:10:23
3	28	331.1004479098197	275.2667990177271	20/04/28 05:10:23
3	28	331.0742159858422	274.98819625425136	20/04/28 05:10:23
3	28	331.2691353107169	275.0204381894779	20/04/28 05:10:23
3	28	331.22358713168524	275.13636492789175	20/04/28 05:10:23
3	28	331.18023782367067	274.84573314043087	20/04/28 05:10:23
3	28	331.2899230502097	274.7404259361164	20/04/28 05:10:23
3	28	331.307816829139	274.69531605372117	20/04/28 05:10:24
3	28	331.28518470587403	274.6888316961858	20/04/28 05:10:24
3	28	331.10491687702466	274.6552134456143	20/04/28 05:10:24
3	28	331.0908792432047	274.6524019583614	20/04/28 05:10:24
3	28	331.22058570442925	274.5863589230601	20/04/28 05:10:24
3	28	331.1967513522626	274.46442346187484	20/04/28 05:10:24
3	28	331.2215801725211	274.5143066839755	20/04/28 05:10:24
3	28	331.332227629651	274.64263254382706	20/04/28 05:10:24
3	28	331.4116015122643	274.7536954896059	20/04/28 05:10:24
3	28	331.4221424109303	274.7467567074479	20/04/28 05:10:25
3	28	331.476954198978	274.7472656789931	20/04/28 05:10:25
3	28	331.7246379847763	274.8222007271503	20/04/28 05:10:25
3	28	331.86885637202084	274.8423783788752	20/04/28 05:10:25
3	28	331.82657118825784	275.0547526049898	20/04/28 05:10:25
3	28	331.7609906607918	274.85039586936574	20/04/28 05:10:25
3	28	331.94246797051915	274.96716309363103	20/04/28 05:10:25
3	28	331.91051476855415	275.1824122194637	20/04/28 05:10:25
3	28	331.9494032693344	275.1213881226792	20/04/28 05:10:25
3	28	332.1973833971315	275.0227675603679	20/04/28 05:10:25
3	28	331.9785556819505	275.2163600476869	20/04/28 05:10:26
3	28	332.1066179577287	275.29532755663695	20/04/28 05:10:26
3	28	332.1943816982593	275.08155714520376	20/04/28 05:10:26
3	28	332.0687807901788	275.1882484193723	20/04/28 05:10:26
3	28	332.14403359769426	274.938123834839	20/04/28 05:10:26
3	28	332.17607540127136	275.11587610408213	20/04/28 05:10:26
3	28	332.18491345688403	275.1184008374244	20/04/28 05:10:26
3	28	332.1827509257994	275.11855736570055	20/04/28 05:10:26
3	28	332.28372071600324	274.90451397569825	20/04/28 05:10:26
3	28	332.40595173789785	274.8816084732985	20/04/28 05:10:27
3	28	332.46200973535554	274.8123015371823	20/04/28 05:10:27
3	28	332.3962729455497	274.63079246452094	20/04/28 05:10:27
3	28	332.45977539481964	274.3434901803995	20/04/28 05:10:27
3	28	332.3162010118091	274.4007393843697	20/04/28 05:10:27
3	28	332.0994491157192	274.22455562797273	20/04/28 05:10:27
3	28	331.8910219456156	274.4026492343573	20/04/28 05:10:27
3	28	331.8489461289509	274.29722416009116	20/04/28 05:10:27
3	28	331.682465407208	274.30777085245256	20/04/28 05:10:27
3	28	331.65539937314986	274.3076527755402	20/04/28 05:10:27
3	28	331.6801528270099	274.305339186196	20/04/28 05:10:28
3	28	331.7082015244472	274.21009641787884	20/04/28 05:10:28
3	28	331.90866399417405	274.101131100149	20/04/28 05:10:28
3	28	331.8563252124828	274.06283799708905	20/04/28 05:10:28
3	28	331.90306975511396	274.071567733801	20/04/28 05:10:28
3	28	331.7753921650014	274.2179804261366	20/04/28 05:10:28
3	28	331.615604083274	274.025629667641	20/04/28 05:10:28
3	28	331.59002235186307	274.10521977273936	20/04/28 05:10:28
3	28	331.6736804254517	274.0836471219523	20/04/28 05:10:28
3	28	331.6887296891908	273.94054186932044	20/04/28 05:10:28
3	28	331.7903950238988	274.05622258229175	20/04/28 05:10:29
3	28	331.79500623267614	274.02435882620614	20/04/28 05:10:29
3	28	331.8875214468577	274.15142040180064	20/04/28 05:10:29
3	28	332.01458856829043	273.97423922867654	20/04/28 05:10:29
3	28	332.00598783925676	273.9520071615981	20/04/28 05:10:29
3	28	331.9006253355439	273.9256505158665	20/04/28 05:10:29
3	28	331.98434653947965	273.86002189417	20/04/28 05:10:29
3	28	332.02831705688016	273.7370430739018	20/04/28 05:10:29
3	28	331.813497779856	273.7255796863321	20/04/28 05:10:29
3	28	331.93344237717497	273.518381914771	20/04/28 05:10:30
3	28	331.94770878963857	273.42608039444445	20/04/28 05:10:30
3	28	331.72440691721545	273.5021674516354	20/04/28 05:10:30
3	28	331.64632550986556	273.48854468646164	20/04/28 05:10:30
3	28	331.67488192356467	273.495980683742	20/04/28 05:10:30
3	28	331.4926802906849	273.49892568830006	20/04/28 05:10:30
3	28	331.5320540013853	273.74300336970606	20/04/28 05:10:30
3	28	331.4590723968741	273.48148475493065	20/04/28 05:10:30
3	28	331.3821196116835	273.7669683400096	20/04/28 05:10:30
3	28	331.20950685361896	273.93541777869746	20/04/28 05:10:30
3	28	331.24799824156463	273.94984395168603	20/04/28 05:10:31
3	28	331.21080641559166	273.8719848401519	20/04/28 05:10:31
3	28	331.2042551739485	274.05758018675124	20/04/28 05:10:31
3	28	331.181466946864	274.1327238813617	20/04/28 05:10:31
3	28	331.2220502868038	274.27954650988863	20/04/28 05:10:31
3	28	331.2975651970738	274.23416538296993	20/04/28 05:10:31
3	28	331.27766123139736	274.2539807947822	20/04/28 05:10:31
3	28	331.2518658006615	274.06190152991275	20/04/28 05:10:31
3	28	330.95305645206247	274.08345625329	20/04/28 05:10:31
3	28	330.87060450449667	273.83719211875854	20/04/28 05:10:32
3	28	330.9112987910894	273.7606659692998	20/04/28 05:10:32
3	28	330.9685989708696	273.77433101461247	20/04/28 05:10:32
3	28	331.0183484443035	273.92400354674993	20/04/28 05:10:32
3	28	331.2162218186777	273.92967749548075	20/04/28 05:10:32
3	28	331.2058288097502	273.9348174505924	20/04/28 05:10:32
3	28	330.952474929091	273.9435059329074	20/04/28 05:10:32
3	28	331.08255782559206	273.80334959282584	20/04/28 05:10:32
3	28	330.94915289981014	273.9269690525884	20/04/28 05:10:32
3	28	331.05495899078386	274.18429913050545	20/04/28 05:10:32
3	28	331.0708483251302	274.1444531570877	20/04/28 05:10:33
3	28	331.2392395680191	273.9685733814989	20/04/28 05:10:33
3	28	331.18042641123577	273.7412943297131	20/04/28 05:10:33
3	28	331.1688040524124	273.53284940003584	20/04/28 05:10:33
3	28	331.3022361846952	273.2869304945195	20/04/28 05:10:33
3	28	331.16957120426144	273.38794302177615	20/04/28 05:10:33
3	28	330.9818874571139	273.3879176168143	20/04/28 05:10:33
3	28	330.94373922868766	273.41129843693307	20/04/28 05:10:33
3	28	331.00299793489694	273.46346747726614	20/04/28 05:10:33
3	28	331.05690239379453	273.49479692846523	20/04/28 05:10:33
3	28	330.97979465128697	273.6934196953438	20/04/28 05:10:34
3	28	330.9779259146547	273.78769369695186	20/04/28 05:10:34
3	28	331.00105560154987	273.7268689426169	20/04/28 05:10:34
3	28	330.85859723190504	273.7394253925461	20/04/28 05:10:34
3	28	330.7675697245698	273.78464579821366	20/04/28 05:10:34
3	28	330.770695269702	273.70876070803905	20/04/28 05:10:34
3	28	330.7694212558742	273.7138860276529	20/04/28 05:10:34
3	28	330.7706982632946	273.8877172640406	20/04/28 05:10:34
3	28	330.81453587996754	273.87137311321817	20/04/28 05:10:34
3	28	330.85302730101563	273.8117101193992	20/04/28 05:10:35
3	28	330.85355300253156	274.0057825475371	20/04/28 05:10:35
3	28	330.85029103005	274.01162506694084	20/04/28 05:10:35
3	28	330.85643964335753	274.02854433708444	20/04/28 05:10:35
3	28	330.88338401312905	274.0705318908127	20/04/28 05:10:35
3	28	330.7685145309099	274.0816790161149	20/04/28 05:10:35
3	28	330.8086492505655	273.9924382540246	20/04/28 05:10:35
3	28	330.9256959532975	273.9773619708261	20/04/28 05:10:35
3	28	330.89602729790033	273.7826670324601	20/04/28 05:10:35
3	28	330.86356211852194	273.6701565806992	20/04/28 05:10:35
3	28	330.8623193965016	273.66541997558215	20/04/28 05:10:36
3	28	330.86086292152	273.66013366635264	20/04/28 05:10:36
3	28	330.8629498068399	273.6629493721348	20/04/28 05:10:36
3	28	330.6656506785669	273.58800115206674	20/04/28 05:10:36
3	28	330.6656506785669	273.58800115206674	20/04/28 05:10:36
3	28	330.6656506785669	273.58800115206674	20/04/28 05:10:36
3	28	330.66363548793277	273.55026234155014	20/04/28 05:10:36
3	28	330.8796292896817	273.58210438378046	20/04/28 05:10:36
3	28	330.8897186364591	273.63467547382044	20/04/28 05:10:36
3	28	330.6599271924573	273.80015892849525	20/04/28 05:10:36
3	28	330.75109513609993	273.68487729655	20/04/28 05:10:37
3	28	330.55891807259184	273.7298680308494	20/04/28 05:10:37
3	28	330.4809158712811	273.4978574074608	20/04/28 05:10:37
3	28	330.5391425115099	273.48367385764607	20/04/28 05:10:37
3	28	330.58680443486975	273.4965254167828	20/04/28 05:10:37
3	28	330.4650603019222	273.7000987398858	20/04/28 05:10:37
3	28	330.4441789545862	273.7131061515743	20/04/28 05:10:37
3	28	330.46259433649516	273.8290824938979	20/04/28 05:10:37
3	28	330.49145932850905	273.85358412060293	20/04/28 05:10:37
3	28	330.46888351980766	273.8203817781704	20/04/28 05:10:38
3	28	330.46949706121563	273.9011514726495	20/04/28 05:10:38
3	28	330.63107748388694	273.97638429903697	20/04/28 05:10:38
3	28	330.6060231895311	273.85838281239916	20/04/28 05:10:38
3	28	330.6153241576325	273.90124613441037	20/04/28 05:10:38
3	28	330.51427041026164	273.76360317995	20/04/28 05:10:38
3	28	330.5127693000349	273.8678099692129	20/04/28 05:10:38
3	28	330.43643494879717	273.9146247370069	20/04/28 05:10:38
3	28	330.4276641899949	273.72314150017434	20/04/28 05:10:38
3	28	330.42281672673727	273.712801835373	20/04/28 05:10:38
3	28	330.45081403499165	274.0052255626204	20/04/28 05:10:39
3	28	330.44600855863985	273.8502661331555	20/04/28 05:10:39
3	28	330.2338387132493	273.94162141965415	20/04/28 05:10:39
3	28	330.2251019739287	273.94984139945655	20/04/28 05:10:39
3	28	330.133682177045	273.8628931508959	20/04/28 05:10:39
3	28	330.133682177045	273.8628931508959	20/04/28 05:10:39
3	28	330.01865917716464	273.5749325560105	20/04/28 05:10:39
3	28	329.8844741488448	273.5345063613999	20/04/28 05:10:39
3	28	329.7785599036787	273.64067615406134	20/04/28 05:10:39
3	28	329.7785599036787	273.64067615406134	20/04/28 05:10:39
3	28	330.0240419060778	273.67445267565523	20/04/28 05:10:40
3	28	330.0707050458738	273.6089736782357	20/04/28 05:10:40
3	28	330.15878183249123	273.7592151012401	20/04/28 05:10:40
3	28	330.3893566627942	273.8059703199213	20/04/28 05:10:40
3	28	330.4474196183783	273.55292307241746	20/04/28 05:10:40
3	28	330.49423268915325	273.5247523853786	20/04/28 05:10:40
3	28	330.76807749220785	273.62880928000936	20/04/28 05:10:40
3	28	330.51090090031965	273.96481127091204	20/04/28 05:10:40
3	28	330.58140471269655	273.9378008864321	20/04/28 05:10:40
3	28	330.41396812526045	273.9186181168669	20/04/28 05:10:41
3	28	330.53359642053783	274.0478186698679	20/04/28 05:10:41
3	28	330.5842187602846	273.95273308311073	20/04/28 05:10:41
3	28	330.58008191584486	274.0425816496512	20/04/28 05:10:41
3	28	330.5959585837156	273.97507112781045	20/04/28 05:10:41
3	28	330.46138454053175	274.00226077895866	20/04/28 05:10:41
3	28	330.43078097987893	274.1490686597253	20/04/28 05:10:41
3	28	330.50815093392663	274.18273569353397	20/04/28 05:10:41
3	28	330.7095096169398	274.13867534529714	20/04/28 05:10:41
3	28	330.76682724097486	274.03227975124855	20/04/28 05:10:41
3	28	330.78297386015674	273.92508318435443	20/04/28 05:10:42
3	28	331.02787936394503	273.96199264684947	20/04/28 05:10:42
3	28	331.0964890759186	273.82295384651155	20/04/28 05:10:42
3	28	331.123866109971	273.8275552628408	20/04/28 05:10:42
3	28	330.92818663839915	273.893394576459	20/04/28 05:10:42
3	28	331.0048366221109	273.9520795068539	20/04/28 05:10:42
3	28	331.0048366221109	273.9520795068539	20/04/28 05:10:42
3	28	330.9143121353347	273.9766376555073	20/04/28 05:10:42
3	28	330.8856660956678	274.11376197938955	20/04/28 05:10:42
3	28	330.8561756147034	274.07511202818375	20/04/28 05:10:43
3	28	330.85266549614835	274.1454994405754	20/04/28 05:10:43
3	28	330.85266549614835	274.1454994405754	20/04/28 05:10:43
3	28	330.85266549614835	274.1454994405754	20/04/28 05:10:43
3	28	330.89258828946686	273.89781687373534	20/04/28 05:10:43
3	28	330.9295740859981	273.6683555495136	20/04/28 05:10:43
3	28	330.9295740859981	273.6683555495136	20/04/28 05:10:43
3	28	330.9770451551811	273.37384318480815	20/04/28 05:10:43
3	28	331.0039896001679	273.2066787972069	20/04/28 05:10:43
3	28	331.0444198926634	272.9558476856789	20/04/28 05:10:43
3	28	331.0853561762513	272.7018773856788	20/04/28 05:10:44
3	28	331.11549578698146	272.5148900651865	20/04/28 05:10:44
3	28	331.1721636716219	272.16332029868335	20/04/28 05:10:44
3	28	331.1721636716219	272.16332029868335	20/04/28 05:10:44
3	28	331.21073135536136	271.9240448845243	20/04/28 05:10:44
3	28	331.24550358916133	271.7083165898223	20/04/28 05:10:44
3	28	331.2871795866643	271.44975707584223	20/04/28 05:10:44
3	28	331.33369259725043	271.16118854403845	20/04/28 05:10:44
3	28	331.36632762469384	270.95871956092907	20/04/28 05:10:44
3	28	331.4074770740884	270.70342677195066	20/04/28 05:10:44
3	28	331.43501842619116	270.53255914932123	20/04/28 05:10:45
3	28	331.47250651805734	270.2999815652511	20/04/28 05:10:45
3	28	331.5117768069945	270.0563471610425	20/04/28 05:10:45
3	28	331.54381025149615	269.85761042196714	20/04/28 05:10:45
3	28	331.58673229476767	269.59132039144004	20/04/28 05:10:45
3	28	331.6213475209946	269.37656617784467	20/04/28 05:10:45
3	28	331.6600484302485	269.1364642273981	20/04/28 05:10:45
3	28	331.68792363930936	268.9635253431793	20/04/28 05:10:45
3	28	331.71754536208164	268.77975101977626	20/04/28 05:10:45
3	28	331.75594188316336	268.54153750542156	20/04/28 05:10:46
3	28	331.79355407396315	268.308190006727	20/04/28 05:10:46
3	28	331.82392792173914	268.11974947046633	20/04/28 05:10:46
3	28	331.8529450203097	267.9397262591929	20/04/28 05:10:46
3	28	331.8856807563568	267.73663247597824	20/04/28 05:10:46
3	28	331.9305931499933	267.4579942341581	20/04/28 05:10:46
3	28	331.9672841159947	267.2303620500429	20/04/28 05:10:46
3	28	332.0034514560574	267.0059784616741	20/04/28 05:10:46
3	28	332.0347030673903	266.81209224607113	20/04/28 05:10:46
3	28	332.08191449986293	266.5191906776432	20/04/28 05:10:46
3	28	332.10703055831755	266.3633696713997	20/04/28 05:10:47
3	28	332.1453302671383	266.1257567840881	20/04/28 05:10:47
3	28	332.1791552939985	265.91590499818403	20/04/28 05:10:47
3	28	332.2123275358624	265.71010311585724	20/04/28 05:10:47
3	28	332.25129392361475	265.46835412645174	20/04/28 05:10:47
3	28	332.2868511555696	265.24775567258007	20/04/28 05:10:47
3	28	332.32302440487973	265.0233354230095	20/04/28 05:10:47
3	47	332.2539837992126	264.8235764762146	20/04/28 05:10:47
3	47	332.0552750037947	264.7985292825385	20/04/28 05:10:47
3	47	331.85405467101236	264.77316551020937	20/04/28 05:10:48
3	47	331.85405467101236	264.77316551020937	20/04/28 05:10:48
3	47	331.654473484306	264.7480083518308	20/04/28 05:10:48
3	47	331.38754123399855	264.7143616088278	20/04/28 05:10:48
3	47	331.19678172394214	264.6903164205718	20/04/28 05:10:48
3	47	330.9433943718859	264.65837700858606	20/04/28 05:10:48
3	47	330.7526460147373	264.6343332261513	20/04/28 05:10:48
3	47	330.48476197691184	264.60056651057107	20/04/28 05:10:48
3	47	330.20889967338076	264.56579413660563	20/04/28 05:10:48
3	47	329.94348834033264	264.5323391048406	20/04/28 05:10:48
3	47	329.7023586264887	264.5019447650681	20/04/28 05:10:49
3	47	329.54380160686753	264.48195869263077	20/04/28 05:10:49
3	47	329.3380597546959	264.45602498392003	20/04/28 05:10:49
3	47	329.06049118684314	264.42103753576606	20/04/28 05:10:49
3	47	328.77218828396576	264.3846970273825	20/04/28 05:10:49
3	47	328.61217011255985	264.36452677713027	20/04/28 05:10:49
3	47	328.35322809078923	264.3318872004244	20/04/28 05:10:49
3	47	328.1262040327366	264.303270875016	20/04/28 05:10:49
3	47	327.8451965533718	264.26784995293104	20/04/28 05:10:49
3	47	327.60902717035054	264.2380808616109	20/04/28 05:10:49
3	47	327.44240424631784	264.2170780839515	20/04/28 05:10:50
3	47	327.22174682445916	264.1892642714338	20/04/28 05:10:50
3	47	327.06553584103625	264.16957391626903	20/04/28 05:10:50
3	47	326.8178699072009	264.1383556876108	20/04/28 05:10:50
3	47	326.64316506965827	264.1163341867865	20/04/28 05:10:50
3	47	326.3493739580735	264.079301891076	20/04/28 05:10:50
3	47	326.11130718540977	264.04929363426874	20/04/28 05:10:50
3	47	325.8998817660924	264.022643513349	20/04/28 05:10:50
3	47	325.6756779578924	263.9943826797251	20/04/28 05:10:50
3	47	325.4910158136434	263.9711060628953	20/04/28 05:10:51
3	47	325.2479170907658	263.9404635300294	20/04/28 05:10:51
3	47	325.2479170907658	263.9404635300294	20/04/28 05:10:51
3	47	324.9743977934837	263.90598649141225	20/04/28 05:10:51
3	47	324.79233285838757	263.8830372521428	20/04/28 05:10:51
3	47	324.5160236283615	263.84820854320515	20/04/28 05:10:51
3	47	324.3269120595578	263.8243710775295	20/04/28 05:10:51
3	47	324.16702568051653	263.8042174396717	20/04/28 05:10:51
3	47	323.9221962996454	263.773356757801	20/04/28 05:10:51
3	47	323.7335956912478	263.749583698556	20/04/28 05:10:51
3	47	323.508216478679	263.7211747055071	20/04/28 05:10:52
3	47	323.2819279710804	263.6926510960484	20/04/28 05:10:52
3	47	323.1038851178215	263.67020883918275	20/04/28 05:10:52
3	47	322.824451505724	263.63498630267094	20/04/28 05:10:52
3	47	322.62116221031476	263.60936173812314	20/04/28 05:10:52
3	47	322.4503903830139	263.58783599225046	20/04/28 05:10:52
3	47	322.28067566690095	263.5664434949771	20/04/28 05:10:52
3	47	322.0256214167105	263.5342939709009	20/04/28 05:10:52
3	47	321.8075771953925	263.506809551654	20/04/28 05:10:52
3	47	321.5579952603443	263.47534981152484	20/04/28 05:10:52
3	47	321.40620599176617	263.45621681240397	20/04/28 05:10:53
3	47	321.25662583566765	263.4373622713555	20/04/28 05:10:53
3	47	321.0520482749284	263.41157532128693	20/04/28 05:10:53
3	47	320.8919644998964	263.3913968017141	20/04/28 05:10:53
3	47	320.63943832588524	263.35956594100435	20/04/28 05:10:53
3	47	320.402457740499	263.32969459783016	20/04/28 05:10:53
3	47	320.1955203274894	263.30361018897656	20/04/28 05:10:53
3	47	319.94398037402556	263.2719036411187	20/04/28 05:10:53
3	47	319.7009745154413	263.2412728137736	20/04/28 05:10:53
3	47	319.41684957938577	263.205458937057	20/04/28 05:10:54
3	47	319.21178048989077	263.1796100299124	20/04/28 05:10:54
3	47	318.9872189653275	263.1513041062309	20/04/28 05:10:54
3	47	318.7615143273877	263.1228540933958	20/04/28 05:10:54
3	47	318.58854244787125	263.10105103149476	20/04/28 05:10:54
3	47	318.30728486653527	263.06559858411924	20/04/28 05:10:54
3	47	318.1580994955657	263.0467938056369	20/04/28 05:10:54
3	47	317.9926029879264	263.02593301248055	20/04/28 05:10:54
3	47	317.8282817145278	263.0052203573046	20/04/28 05:10:54
3	47	317.6623502876697	262.9843047426901	20/04/28 05:10:54
3	47	317.4640520703347	262.95930930227803	20/04/28 05:10:55
3	47	317.17809155284766	262.92326405098373	20/04/28 05:10:55
3	47	316.97602148562333	262.8977931698419	20/04/28 05:10:55
3	47	316.7969784715781	262.8752248429608	20/04/28 05:10:55
3	47	316.5810123209329	262.84800236399946	20/04/28 05:10:55
3	47	316.3377994716052	262.81734544552324	20/04/28 05:10:55
3	47	316.14979031958285	262.7936469392056	20/04/28 05:10:55
3	47	315.89413101658397	262.76142114837506	20/04/28 05:10:55
3	47	315.6764213633389	262.7339789013496	20/04/28 05:10:55
3	47	315.38203136068773	262.69687111557084	20/04/28 05:10:55
3	47	315.2006082774486	262.6740027815665	20/04/28 05:10:56
3	47	314.9589207964834	262.64353813538867	20/04/28 05:10:56
3	47	314.9589207964834	262.64353813538867	20/04/28 05:10:56
3	47	314.7313794533567	262.61485660632684	20/04/28 05:10:56
3	47	314.5154884150224	262.5876435952534	20/04/28 05:10:56
3	47	314.321818184633	262.5632315114316	20/04/28 05:10:56
3	47	314.0978560466311	262.53500114027537	20/04/28 05:10:56
3	47	313.8626046814066	262.50534776486757	20/04/28 05:10:56
3	47	313.56884964691125	262.46832001666513	20/04/28 05:10:56
3	47	313.3656178893929	262.442702704754	20/04/28 05:10:57
3	47	313.1524442918223	262.41583222640526	20/04/28 05:10:57
3	47	312.9428352388129	262.3894110580017	20/04/28 05:10:57
3	47	312.7490283185713	262.3649817444585	20/04/28 05:10:57
3	47	312.5258777651883	262.3368536733393	20/04/28 05:10:57
3	47	312.2537032758212	262.30254614742154	20/04/28 05:10:57
3	47	311.9664444915823	262.26633724992973	20/04/28 05:10:57
3	47	311.75165970769166	262.2392636819506	20/04/28 05:10:57
3	47	311.46969653477447	262.20372229493375	20/04/28 05:10:57
3	47	311.2591691776371	262.1771853745259	20/04/28 05:10:57
3	47	311.0107817565565	262.1458762025819	20/04/28 05:10:58
3	47	310.77562113546713	262.1162342654495	20/04/28 05:10:58
3	47	310.5416048276456	262.0867365687167	20/04/28 05:10:58
3	47	310.38087572304863	262.0664767055145	20/04/28 05:10:58
3	47	310.18664323578776	262.0419937493555	20/04/28 05:10:58
3	47	310.00207106672525	262.01872847387534	20/04/28 05:10:58
3	47	309.7523376493643	261.9872496394388	20/04/28 05:10:58
3	47	309.7523376493643	261.9872496394388	20/04/28 05:10:58
3	47	309.4877997990278	261.9539047099498	20/04/28 05:10:58
3	47	309.2308476325352	261.92151595400117	20/04/28 05:10:59
3	47	308.94196251199963	261.8851020572283	20/04/28 05:10:59
3	47	308.77361211942286	261.8638815325935	20/04/28 05:10:59
3	47	308.49896188585853	261.8292619397425	20/04/28 05:10:59
3	47	308.2713248095918	261.8005683435424	20/04/28 05:10:59
3	47	307.9790897711838	261.7637321904644	20/04/28 05:10:59
3	47	307.78583727232234	261.73937276159666	20/04/28 05:10:59
3	47	307.5084527347106	261.7044085104083	20/04/28 05:10:59
3	47	307.271567920159	261.67454923912373	20/04/28 05:10:59
3	47	306.98620903629234	261.63857982359593	20/04/28 05:10:59
3	47	306.78257660179054	261.61291200645184	20/04/28 05:11:00
3	47	306.60458692885203	261.5904764529522	20/04/28 05:11:00
3	47	306.3669747275393	261.56052549474936	20/04/28 05:11:00
3	47	306.1250246934172	261.53002775381213	20/04/28 05:11:00
3	47	305.97192967565337	261.5107301653349	20/04/28 05:11:00
3	47	305.70201804325495	261.4767078719688	20/04/28 05:11:00
3	47	305.5430028168382	261.59105467606116	20/04/28 05:11:00
3	47	305.5430028168382	261.59105467606116	20/04/28 05:11:00
3	47	305.3938178014	261.74799484022236	20/04/28 05:11:00
3	47	305.2364031743578	261.9135924194217	20/04/28 05:11:00
3	47	305.0302481260452	262.13046411414126	20/04/28 05:11:01
3	47	304.874860280976	262.29392955228985	20/04/28 05:11:01
3	47	304.763816761223	262.41074549501633	20/04/28 05:11:01
3	47	304.5633293321289	262.62165494823364	20/04/28 05:11:01
3	47	304.38934955979596	262.80467878578503	20/04/28 05:11:01
3	47	304.2585557891431	262.94227166518533	20/04/28 05:11:01
3	47	304.1459514336978	263.06072958119614	20/04/28 05:11:01
3	47	303.9734783559261	263.2421684010359	20/04/28 05:11:01
3	47	303.835381179962	263.3874443418021	20/04/28 05:11:01
3	47	303.7306032820139	263.49766895421465	20/04/28 05:11:02
3	47	303.5386224901794	263.6996295659946	20/04/28 05:11:02
3	47	303.3768979011204	263.86976115381714	20/04/28 05:11:02
3	47	303.2381276645144	264.01574514322556	20/04/28 05:11:02
3	47	303.0742117242655	264.1881819961879	20/04/28 05:11:02
3	47	302.91410338382303	264.35661331724793	20/04/28 05:11:02
3	47	302.7703048609628	264.50788698047427	20/04/28 05:11:02
3	47	302.6143755971442	264.67192198217566	20/04/28 05:11:02
3	47	302.4609972246629	264.83327348845995	20/04/28 05:11:02
1	56	302.52289900637203	264.7657131000896	20/04/28 05:11:02
1	56	302.66515555858535	264.6134530589673	20/04/28 05:11:03
1	56	302.82649380881765	264.44076949372715	20/04/28 05:11:03
1	56	302.82649380881765	264.44076949372715	20/04/28 05:11:03
1	56	302.9433365236325	264.31571039250645	20/04/28 05:11:03
1	56	303.1335674996703	264.11210236332545	20/04/28 05:11:03
1	56	303.30943544912316	263.92386736958235	20/04/28 05:11:03
1	56	303.45216327783083	263.77110291177564	20/04/28 05:11:03
1	56	303.6219324719612	263.5893955381791	20/04/28 05:11:03
1	56	303.72619218984835	263.4778042709516	20/04/28 05:11:03
1	56	303.72619218984835	263.4778042709516	20/04/28 05:11:04
1	56	303.84530103498406	263.35031968499595	20/04/28 05:11:04
1	56	304.01344752574846	263.1703491233591	20/04/28 05:11:04
1	56	304.168605598145	263.00428032641446	20/04/28 05:11:04
1	56	304.33595414913935	262.825163815718	20/04/28 05:11:04
1	56	304.45292302501485	262.69996968178367	20/04/28 05:11:04
1	56	304.45292302501485	262.69996968178367	20/04/28 05:11:04
1	56	304.6403842350527	262.4993261887065	20/04/28 05:11:04
1	56	304.83454439183225	262.29151267856855	20/04/28 05:11:04
1	56	304.9691430118074	262.1474490759186	20/04/28 05:11:04
1	56	305.1398660774646	261.9647207544947	20/04/28 05:11:05
1	56	305.2769497593273	261.8179973402627	20/04/28 05:11:05
1	56	305.4003980516915	261.68586815690054	20/04/28 05:11:05
1	56	305.5541537802241	261.52130031672084	20/04/28 05:11:05
1	98	305.76532748779897	261.4592708789709	20/04/28 05:11:05
1	98	305.9064027140481	261.5220095760655	20/04/28 05:11:05
1	98	306.09204995890906	261.6045702535951	20/04/28 05:11:05
1	98	306.3258414556592	261.7085415481156	20/04/28 05:11:05
1	98	306.4847984780245	261.7792326024019	20/04/28 05:11:05
1	98	306.6818720449281	261.8668747713925	20/04/28 05:11:05
1	98	306.9422440031454	261.9826668764476	20/04/28 05:11:06
1	98	307.1185722570874	262.06108323066803	20/04/28 05:11:06
1	98	307.3022236086753	262.1427562984676	20/04/28 05:11:06
1	98	307.56598442563217	262.2600554901148	20/04/28 05:11:06
1	98	307.82592004545745	262.3756535476186	20/04/28 05:11:06
1	98	308.04092705443315	262.47127104168885	20/04/28 05:11:06
1	98	308.2738856713173	262.5748719395138	20/04/28 05:11:06
1	98	308.44368714268563	262.65038571582755	20/04/28 05:11:06
1	98	308.70871147953164	262.7682468175543	20/04/28 05:11:06
1	98	308.89929823267306	262.8530041834894	20/04/28 05:11:07
1	98	309.12692702714776	262.9542348131772	20/04/28 05:11:07
1	98	309.32429587083857	263.04200829707975	20/04/28 05:11:07
1	98	309.55769460964916	263.145804925062	20/04/28 05:11:07
1	98	309.8135624181699	263.25959395352464	20/04/28 05:11:07
1	98	310.06232172670957	263.3702217038595	20/04/28 05:11:07
1	98	310.2330527821374	263.4461488829675	20/04/28 05:11:07
1	98	310.40234603882976	263.52143664705034	20/04/28 05:11:07
1	98	310.6136718668595	263.6154170535719	20/04/28 05:11:07
1	98	310.776796483729	263.68796151228764	20/04/28 05:11:07
1	98	310.9959066563897	263.78540375724015	20/04/28 05:11:08
1	98	311.25206205881256	263.89932068389714	20/04/28 05:11:08
1	98	311.421927968092	263.974863116912	20/04/28 05:11:08
1	98	311.6375107543917	264.07073666954113	20/04/28 05:11:08
1	98	311.86000610505766	264.1696843641968	20/04/28 05:11:08
1	98	312.12518634467915	264.28761479869917	20/04/28 05:11:08
1	98	312.3820788734421	264.4018595387321	20/04/28 05:11:08
1	98	312.5607564225274	264.48132066686713	20/04/28 05:11:08
1	98	312.701690538773	264.5439966097985	20/04/28 05:11:08
1	98	312.9031227566968	264.6335771494965	20/04/28 05:11:08
1	98	313.1663392658744	264.7506342776589	20/04/28 05:11:09
1	98	313.4102929271739	264.8591248700068	20/04/28 05:11:09
1	98	313.68081625098677	264.97943147039985	20/04/28 05:11:09
1	98	313.90646993555015	265.07978373309334	20/04/28 05:11:09
1	98	314.1588102766178	265.19200403316944	20/04/28 05:11:09
1	98	314.4177385223831	265.30715409326297	20/04/28 05:11:09
1	98	314.68067082342463	265.42408482894217	20/04/28 05:11:09
1	98	314.8338553223748	265.492208737971	20/04/28 05:11:09
1	98	315.00919597176215	265.5701858866367	20/04/28 05:11:09
1	98	315.27821218730435	265.6898222488044	20/04/28 05:11:10
1	98	315.53054547896517	265.80203941388214	20/04/28 05:11:10
1	98	315.73390826536263	265.89247851219386	20/04/28 05:11:10
1	98	315.96963067373855	265.9973085179341	20/04/28 05:11:10
1	98	316.22946744768933	266.112862616895	20/04/28 05:11:10
1	98	316.3785606020825	266.17916703122086	20/04/28 05:11:10
1	98	316.5431741689348	266.25237365284386	20/04/28 05:11:10
1	98	316.8049403544242	266.3687857959087	20/04/28 05:11:10
1	98	316.96758499084507	266.44111679866353	20/04/28 05:11:10
1	56	317.1291970201464	266.5129885824115	20/04/28 05:11:10
1	56	316.9506573152078	266.33245885937254	20/04/28 05:11:11
1	56	316.8796089549258	266.2061738599081	20/04/28 05:11:11
1	56	316.7612150268282	266.41330460739414	20/04/28 05:11:11
1	56	316.8178484753012	266.49787606692854	20/04/28 05:11:11
1	56	316.81770978445985	266.3317980220943	20/04/28 05:11:11
1	56	316.71940880594104	266.15421287683483	20/04/28 05:11:11
1	56	316.71940880594104	266.15421287683483	20/04/28 05:11:11
1	56	316.9045632723368	266.3129283923373	20/04/28 05:11:11
1	56	316.67640391807015	266.3760022407304	20/04/28 05:11:11
1	56	316.6536382152268	266.31394940742086	20/04/28 05:11:12
1	56	316.60811909197554	266.50105765938525	20/04/28 05:11:12
1	56	316.5540824310199	266.3874281907181	20/04/28 05:11:12
1	56	316.82352508076906	266.279500862551	20/04/28 05:11:12
1	56	316.717754675431	266.2736286375984	20/04/28 05:11:12
1	56	316.75355095766923	266.42270602575553	20/04/28 05:11:12
1	56	317.0237235710932	266.33251025986976	20/04/28 05:11:12
1	56	316.97584551729085	266.4153392303752	20/04/28 05:11:12
1	56	316.96297936925964	266.4135618446755	20/04/28 05:11:12
1	56	316.84106706127034	266.4375285659614	20/04/28 05:11:12
1	56	316.9948540988184	266.21854892351126	20/04/28 05:11:13
1	56	317.09194802058994	266.2857584140334	20/04/28 05:11:13
1	56	317.3708887502901	266.24148016382924	20/04/28 05:11:13
1	56	317.36186186366353	266.24065613171365	20/04/28 05:11:13
1	56	317.3719397790969	266.2389024847281	20/04/28 05:11:13
1	56	317.6035193080995	266.3477358129867	20/04/28 05:11:13
1	56	317.47944738723714	266.3373850031864	20/04/28 05:11:13
1	56	317.46809244197533	266.3339266147	20/04/28 05:11:13
1	56	317.4826260700862	266.33909989499074	20/04/28 05:11:13
1	56	317.4905913278428	266.31821440843424	20/04/28 05:11:13
1	56	317.46901340468366	266.2754636324786	20/04/28 05:11:14
1	56	317.65861975577826	266.1512950291805	20/04/28 05:11:14
1	56	317.5190749908112	266.34824623127145	20/04/28 05:11:14
1	56	317.6436413918588	266.20504968782774	20/04/28 05:11:14
1	56	317.6298911722981	266.36398004617456	20/04/28 05:11:14
1	56	317.5590505710481	266.3030653561823	20/04/28 05:11:14
1	56	317.5824005647195	266.3185832404526	20/04/28 05:11:14
1	56	317.65250459454325	266.23358639536536	20/04/28 05:11:14
1	56	317.6980008200736	266.2529771727188	20/04/28 05:11:14
1	56	317.70294288839085	266.25278994130525	20/04/28 05:11:15
1	56	317.5817068854959	266.22172773804436	20/04/28 05:11:15
1	56	317.8587122027228	266.2480991062619	20/04/28 05:11:15
1	56	317.83057985979605	266.26694517333385	20/04/28 05:11:15
1	56	317.87569652735095	266.24352284296805	20/04/28 05:11:15
1	56	317.94667549704354	266.3249596280602	20/04/28 05:11:15
1	56	317.9864132341119	266.21843676136	20/04/28 05:11:15
1	56	317.98172313473816	266.1687509432044	20/04/28 05:11:15
1	56	317.76414663371565	266.26024436729494	20/04/28 05:11:15
1	56	317.8015597136072	266.3091054400425	20/04/28 05:11:15
1	56	317.882319882575	266.2605358209047	20/04/28 05:11:16
1	56	317.8640246903076	266.2608815202576	20/04/28 05:11:16
1	56	317.8804397149612	266.20386139992274	20/04/28 05:11:16
1	56	317.87377153878197	266.196506727234	20/04/28 05:11:16
1	56	317.8165002215162	266.24746114785427	20/04/28 05:11:16
1	56	318.07913370852003	266.1817165694479	20/04/28 05:11:16
1	56	318.03956748885724	266.18571180454546	20/04/28 05:11:16
1	56	317.9197673423716	266.27595858346655	20/04/28 05:11:16
1	56	317.9246705732137	266.3643876843002	20/04/28 05:11:16
1	56	317.76079363126274	266.26693588160964	20/04/28 05:11:17
1	56	317.86498604975066	266.1395384848263	20/04/28 05:11:17
1	56	317.8929541309301	266.1605121701978	20/04/28 05:11:17
1	56	318.093167480228	266.3547816958187	20/04/28 05:11:17
1	56	318.1633091245643	266.3451966851241	20/04/28 05:11:17
1	56	318.0484629320934	266.47789951965575	20/04/28 05:11:17
1	56	317.81948090477533	266.60921305447357	20/04/28 05:11:17
1	56	317.8425923478222	266.5512974900097	20/04/28 05:11:17
1	56	317.628676379987	266.5907853845531	20/04/28 05:11:17
1	56	317.8450723643002	266.47600777462395	20/04/28 05:11:17
1	56	317.9762252190394	266.5357679316897	20/04/28 05:11:18
1	56	317.96967180563104	266.5753418933749	20/04/28 05:11:18
1	56	318.1275108947899	266.6136359851634	20/04/28 05:11:18
1	56	317.88574078712037	266.70600070620253	20/04/28 05:11:18
1	56	318.1080153140404	266.6154065682616	20/04/28 05:11:18
1	56	317.82748618387814	266.63619377564567	20/04/28 05:11:18
1	56	317.67327695796956	266.6040195199035	20/04/28 05:11:18
1	56	317.6076589987073	266.51451265811	20/04/28 05:11:18
1	56	317.39280233095684	266.6609672282941	20/04/28 05:11:18
1	56	317.40432661181234	266.6096804345218	20/04/28 05:11:19
1	56	317.35854425311754	266.4878881015995	20/04/28 05:11:19
1	56	317.3805484476296	266.55720721772815	20/04/28 05:11:19
1	56	317.34382097502555	266.75141041604985	20/04/28 05:11:19
1	56	317.2778787324777	266.624145953465	20/04/28 05:11:19
1	56	317.2346122362334	266.65315036134916	20/04/28 05:11:19
1	56	317.2402483410382	266.64300891533435	20/04/28 05:11:19
1	56	317.1166331473914	266.78611526222863	20/04/28 05:11:19
1	56	317.1796180334288	266.6952542444123	20/04/28 05:11:19
1	56	317.40730712105665	266.5346577096464	20/04/28 05:11:19
1	56	317.58939219043697	266.5691501077374	20/04/28 05:11:20
1	56	317.3229743806219	266.5032453601864	20/04/28 05:11:20
1	56	317.3532261641557	266.51366069348717	20/04/28 05:11:20
1	56	317.5022876253228	266.48868346159446	20/04/28 05:11:20
1	56	317.5221228105076	266.49936364700784	20/04/28 05:11:20
1	56	317.61095375222453	266.7080116841754	20/04/28 05:11:20
1	56	317.4389765078309	266.63549351486506	20/04/28 05:11:20
1	56	317.471542933317	266.670268775465	20/04/28 05:11:20
1	56	317.48693615307866	266.68911130255344	20/04/28 05:11:20
1	56	317.6224259523011	266.7461679009874	20/04/28 05:11:21
1	56	317.65694698394117	266.8663668724099	20/04/28 05:11:21
1	56	317.62211959289243	266.938235661649	20/04/28 05:11:21
1	56	317.5524970166386	266.89848814718187	20/04/28 05:11:21
1	56	317.53352327670666	266.9813537538598	20/04/28 05:11:21
1	56	317.77509711067614	266.92855507405875	20/04/28 05:11:21
1	56	317.8352100297964	266.85395958685785	20/04/28 05:11:21
1	56	317.9991737647654	266.81953222399216	20/04/28 05:11:21
1	56	317.99181640698873	266.8398097574306	20/04/28 05:11:21
1	56	317.97823351753664	266.8656208232148	20/04/28 05:11:21
1	56	318.1586161001569	266.9255435749107	20/04/28 05:11:22
1	56	318.1586161001569	266.9255435749107	20/04/28 05:11:22
1	56	318.1586161001569	266.9255435749107	20/04/28 05:11:22
1	56	318.20195134791214	266.9343569502696	20/04/28 05:11:22
1	56	317.92444539916846	266.88135263143266	20/04/28 05:11:22
1	56	317.7600209139469	267.04971686800405	20/04/28 05:11:22
1	56	318.0279990424727	266.91647947314476	20/04/28 05:11:22
1	56	317.88592755723187	266.8671381986373	20/04/28 05:11:22
1	56	317.8321190715653	266.7838252355313	20/04/28 05:11:22
1	56	317.80208597173004	266.5702654920407	20/04/28 05:11:22
1	56	317.5717279250773	266.4666277192668	20/04/28 05:11:23
1	56	317.4659505223316	266.3618100160661	20/04/28 05:11:23
1	56	317.4626288256614	266.3631728356675	20/04/28 05:11:23
1	56	317.51130432946405	266.42456693995365	20/04/28 05:11:23
1	56	317.4543556962734	266.5561256365632	20/04/28 05:11:23
1	56	317.4683707647194	266.81961497097603	20/04/28 05:11:23
1	56	317.57421021571554	266.8140684718473	20/04/28 05:11:23
1	56	317.65190654221675	266.8846412706063	20/04/28 05:11:23
1	56	317.5041083116983	266.91806583211627	20/04/28 05:11:23
1	56	317.7639966915202	266.9202047881307	20/04/28 05:11:24
1	56	317.69078395946127	266.97682308751854	20/04/28 05:11:24
1	56	317.6940405626005	266.877467003628	20/04/28 05:11:24
1	56	317.7320974663894	266.8753004671773	20/04/28 05:11:24
1	56	317.70491751727934	266.8620195217601	20/04/28 05:11:24
1	56	317.84018176573926	266.8212769365946	20/04/28 05:11:24
1	56	317.85406150106553	266.7806367701558	20/04/28 05:11:24
1	56	317.92133937704125	266.7627091648775	20/04/28 05:11:24
1	56	318.0104519238818	266.7688164133315	20/04/28 05:11:24
1	56	318.1220627540508	266.4932664713725	20/04/28 05:11:24
1	56	318.26616323419927	266.5108682792399	20/04/28 05:11:25
1	56	318.2044811935741	266.49438308690156	20/04/28 05:11:25
1	56	318.18302728615794	266.54830740540996	20/04/28 05:11:25
1	56	318.13539235309264	266.5150077463117	20/04/28 05:11:25
1	56	318.14957146564643	266.48616292484354	20/04/28 05:11:25
1	56	318.42787731833994	266.5711304785323	20/04/28 05:11:25
1	56	318.4589902727391	266.5747708436854	20/04/28 05:11:25
1	56	318.51865349421035	266.719196496925	20/04/28 05:11:25
1	56	318.2973326986808	266.8002962448779	20/04/28 05:11:25
1	56	318.2156859046465	266.73948850963023	20/04/28 05:11:26
1	56	318.21517060184675	266.835251633855	20/04/28 05:11:26
1	56	318.1195312476963	266.6817622045447	20/04/28 05:11:26
1	56	318.2599929172089	266.7216522457879	20/04/28 05:11:26
1	56	318.2714830979767	266.8210464756807	20/04/28 05:11:26
1	56	318.2687897288035	266.82100451472854	20/04/28 05:11:26
1	56	318.2691088123763	266.8339506940952	20/04/28 05:11:26
1	56	318.3279294831909	266.88234300637095	20/04/28 05:11:26
1	56	318.4756075613814	266.98964585726736	20/04/28 05:11:26
1	56	318.4628548057111	266.9853323629603	20/04/28 05:11:26
1	56	318.24199580027636	266.78245990865116	20/04/28 05:11:27
1	56	318.24199580027636	266.78245990865116	20/04/28 05:11:27
1	56	318.3984547047508	266.4509772732481	20/04/28 05:11:27
1	56	318.3469208215489	266.3658332908469	20/04/28 05:11:27
1	56	318.2159291016309	266.4688257711651	20/04/28 05:11:27
1	56	318.2159291016309	266.4688257711651	20/04/28 05:11:27
1	56	318.0795329681129	266.45172747195085	20/04/28 05:11:27
1	56	318.0776566002952	266.44368595884157	20/04/28 05:11:27
1	56	318.0510393453435	266.5898728305165	20/04/28 05:11:27
1	56	317.9851494242753	266.6170220520165	20/04/28 05:11:27
1	56	318.24934762455035	266.627510520671	20/04/28 05:11:28
1	56	318.1254860548697	266.65535492297124	20/04/28 05:11:28
1	56	318.030954194831	266.81224497671576	20/04/28 05:11:28
1	56	318.2257876188828	267.02944595359344	20/04/28 05:11:28
1	56	318.1027164556104	266.8525631774366	20/04/28 05:11:28
1	56	318.0714228403807	266.9869285537202	20/04/28 05:11:28
1	56	318.08494779933784	266.99144645643975	20/04/28 05:11:28
1	56	318.0663697485575	266.9475756583922	20/04/28 05:11:28
1	56	317.8261874043437	266.91212657141904	20/04/28 05:11:28
1	56	317.8660368934923	266.8122727997957	20/04/28 05:11:29
1	56	317.8665799182692	266.74334856605805	20/04/28 05:11:29
1	56	317.9229411102201	266.74245572331307	20/04/28 05:11:29
1	56	317.8782623386552	266.6711214608903	20/04/28 05:11:29
1	56	317.8744483031978	266.75051083890503	20/04/28 05:11:29
1	56	318.0145367131675	266.7594022048792	20/04/28 05:11:29
1	56	318.1758379322677	266.9550837308765	20/04/28 05:11:29
1	56	317.96188555888585	266.79255405368144	20/04/28 05:11:29
1	56	317.92566586629755	266.755468820102	20/04/28 05:11:29
1	56	317.91979665110466	266.76617626100455	20/04/28 05:11:29
1	56	318.0084448857595	266.544602659376	20/04/28 05:11:30
1	56	317.98600730137343	266.6289026691896	20/04/28 05:11:30
1	56	317.94811890673896	266.7603630065723	20/04/28 05:11:30
1	56	317.87037402259335	266.7222573795518	20/04/28 05:11:30
1	56	317.71592722453556	266.72389725521685	20/04/28 05:11:30
1	56	317.49203189629094	266.7987387827504	20/04/28 05:11:30
1	56	317.2784882472213	266.6259439253525	20/04/28 05:11:30
1	56	317.46971211605126	266.57018346499774	20/04/28 05:11:30
1	56	317.4488973151252	266.40906638984364	20/04/28 05:11:30
1	56	317.5231219000381	266.3244317611203	20/04/28 05:11:30
1	56	317.54459476004064	266.37781466406784	20/04/28 05:11:31
1	56	317.3635457573753	266.4538114316935	20/04/28 05:11:31
1	56	317.3921988227241	266.5693148394683	20/04/28 05:11:31
1	56	317.3078731539652	266.30798983627426	20/04/28 05:11:31
1	56	317.5074276799537	266.2430919575093	20/04/28 05:11:31
1	56	317.3425002815796	266.4029587795419	20/04/28 05:11:31
1	56	317.44742498093626	266.2266531306279	20/04/28 05:11:31
1	56	317.49894916325036	266.24904505106946	20/04/28 05:11:31
1	56	317.52749387756614	266.19225910387775	20/04/28 05:11:31
1	56	317.33062043161414	266.1550327250665	20/04/28 05:11:31
1	56	317.34115383625806	266.208870933359	20/04/28 05:11:32
1	56	317.18494213556806	266.4471801667881	20/04/28 05:11:32
1	56	317.10021846096873	266.25202731789756	20/04/28 05:11:32
1	56	317.3307849314675	266.1720090727663	20/04/28 05:11:32
1	56	317.34513618610674	266.41718697850735	20/04/28 05:11:32
1	56	317.41707365276807	266.3621500860803	20/04/28 05:11:32
1	56	317.5512719405423	266.5192981205687	20/04/28 05:11:32
1	56	317.5954911703743	266.53779015039146	20/04/28 05:11:32
1	56	317.4334904535429	266.578078442414	20/04/28 05:11:32
1	56	317.5162334971308	266.6844671978264	20/04/28 05:11:33
1	56	317.72057708447187	266.8841270026066	20/04/28 05:11:33
1	56	317.76069833663746	267.0752274371958	20/04/28 05:11:33
1	56	317.7610180167591	267.0757903502579	20/04/28 05:11:33
1	56	317.74476655753693	267.0437332874039	20/04/28 05:11:33
1	56	317.9151281592903	266.99788348294084	20/04/28 05:11:33
1	56	317.7676543378548	267.0219934988139	20/04/28 05:11:33
1	56	317.7676543378548	267.0219934988139	20/04/28 05:11:33
1	56	317.7676543378548	267.0219934988139	20/04/28 05:11:33
1	56	317.7932334072006	267.2522445376128	20/04/28 05:11:33
1	56	317.5884209209501	267.4466945233685	20/04/28 05:11:34
1	56	317.5257684400171	267.34316867477185	20/04/28 05:11:34
1	56	317.69706844904016	267.4442079434243	20/04/28 05:11:34
1	56	317.75703935470875	267.3793581578006	20/04/28 05:11:34
1	56	317.5109534970023	267.3676218084809	20/04/28 05:11:34
1	56	317.49016662427147	267.38927248436704	20/04/28 05:11:34
1	56	317.59388191578415	267.4428440260056	20/04/28 05:11:34
1	56	317.6684886272415	267.5151005618616	20/04/28 05:11:34
1	56	317.50268625105736	267.6971341507102	20/04/28 05:11:34
1	56	317.5225700358193	267.7430040580116	20/04/28 05:11:35
1	56	317.3152317388108	267.544149166866	20/04/28 05:11:35
1	56	317.309457719736	267.56205230505213	20/04/28 05:11:35
1	56	317.3136868805486	267.39923984162147	20/04/28 05:11:35
1	56	317.5983479923615	267.46562794347784	20/04/28 05:11:35
1	56	317.6011336270038	267.46874351572325	20/04/28 05:11:35
1	56	317.5521608280948	267.521249093663	20/04/28 05:11:35
1	56	317.45916787081364	267.8015510794089	20/04/28 05:11:35
1	56	317.45035671113726	267.71114503174124	20/04/28 05:11:35
1	56	317.43186123380343	267.748033551333	20/04/28 05:11:35
1	56	317.4920734586243	267.8264021504657	20/04/28 05:11:36
1	56	317.4585274103932	267.8839451347321	20/04/28 05:11:36
1	56	317.52428359222614	267.85520761167675	20/04/28 05:11:36
1	56	317.7262795271052	267.7487854502228	20/04/28 05:11:36
1	56	317.5738920728579	267.8652481352332	20/04/28 05:11:36
1	56	317.56487503961114	267.8493597820081	20/04/28 05:11:36
1	56	317.41810040411576	267.9104515250469	20/04/28 05:11:36
1	56	317.3770910707701	267.86489497487025	20/04/28 05:11:36
1	56	317.3833566994463	267.79881188808486	20/04/28 05:11:36
1	56	317.4771119070299	267.8798050910732	20/04/28 05:11:36
1	56	317.2583219913631	267.8228430587462	20/04/28 05:11:37
1	56	317.4818078368557	267.64384188961856	20/04/28 05:11:37
1	56	317.38312280385907	267.41211044955463	20/04/28 05:11:37
1	56	317.45588234510035	267.4262335125727	20/04/28 05:11:37
1	56	317.4847908343002	267.40042356734165	20/04/28 05:11:37
1	56	317.49751595546127	267.43090058259884	20/04/28 05:11:37
1	56	317.3239379941885	267.4372643682789	20/04/28 05:11:37
1	56	317.13088274438087	267.2202740797385	20/04/28 05:11:37
1	56	317.10958860048123	267.2050972348308	20/04/28 05:11:37
1	56	317.1901669546299	267.2026702297088	20/04/28 05:11:38
1	56	317.36030007955094	267.21333561758354	20/04/28 05:11:38
1	56	317.5748889572992	267.34274278537214	20/04/28 05:11:38
1	56	317.6069038747109	267.41785190275635	20/04/28 05:11:38
1	56	317.68042209523315	267.5399413786416	20/04/28 05:11:38
1	56	317.6101124208872	267.4751922495279	20/04/28 05:11:38
1	56	317.51767199525773	267.27630978760953	20/04/28 05:11:38
1	56	317.3965976354853	267.28504963566394	20/04/28 05:11:38
1	56	317.4300176559281	267.2461441529386	20/04/28 05:11:38
1	56	317.5659933468707	267.13826988742136	20/04/28 05:11:38
1	56	317.6492134475013	267.2535370193738	20/04/28 05:11:39
1	56	317.67692863220645	267.27883467148405	20/04/28 05:11:39
1	56	317.4153873047575	267.29319817104357	20/04/28 05:11:39
1	56	317.41584501640403	267.30150461265777	20/04/28 05:11:39
1	56	317.49915243694954	267.2641446906471	20/04/28 05:11:39
1	56	317.51076612211403	267.31190154235276	20/04/28 05:11:39
1	56	317.561187840499	267.2754903082596	20/04/28 05:11:39
1	56	317.6626341207287	267.2215162034205	20/04/28 05:11:39
1	56	317.5390227549618	267.2963182471236	20/04/28 05:11:39
1	56	317.3608152639587	267.3483004980816	20/04/28 05:11:40
1	56	317.3921376077937	267.3996253222283	20/04/28 05:11:40
1	56	317.38252977914885	267.40362505795304	20/04/28 05:11:40
1	56	317.58439179905093	267.5524866228449	20/04/28 05:11:40
1	56	317.58269351083845	267.5307750058074	20/04/28 05:11:40
1	56	317.5452650480549	267.4271918854388	20/04/28 05:11:40
1	56	317.51301120021174	267.4693981174998	20/04/28 05:11:40
1	56	317.64804277457057	267.55902933977245	20/04/28 05:11:40
1	56	317.6772004930569	267.6392123119441	20/04/28 05:11:40
1	56	317.7387256026517	267.90295697072116	20/04/28 05:11:40
1	56	317.6121443718181	267.94808472725424	20/04/28 05:11:41
1	56	317.558529508274	267.9707061988444	20/04/28 05:11:41
1	56	317.43478880252144	267.7444164846921	20/04/28 05:11:41
1	56	317.6886235971987	267.59447663108085	20/04/28 05:11:41
1	56	317.9272545721651	267.6117865768284	20/04/28 05:11:41
1	56	317.8166555149346	267.75900800989785	20/04/28 05:11:41
1	56	317.7098920895462	267.4884098915551	20/04/28 05:11:41
1	56	317.7665947226625	267.3191108067223	20/04/28 05:11:41
1	56	317.75220980262486	267.2589793056904	20/04/28 05:11:41
1	56	317.59818779529206	267.0912292805179	20/04/28 05:11:41
1	56	317.5628386170549	267.21303182978494	20/04/28 05:11:42
1	56	317.57666643539284	267.1877833640944	20/04/28 05:11:42
1	56	317.4366271619094	266.9429251996972	20/04/28 05:11:42
1	56	317.45040693593535	267.02493004113694	20/04/28 05:11:42
1	56	317.5148318706831	266.94136540784893	20/04/28 05:11:42
1	56	317.49672886005527	266.8538278757575	20/04/28 05:11:42
1	56	317.4649300194317	266.81355783593824	20/04/28 05:11:42
1	56	317.3304460075074	266.57756678355423	20/04/28 05:11:42
1	56	317.17899675296553	266.61515124175673	20/04/28 05:11:42
1	56	317.08013449284755	266.6542119442787	20/04/28 05:11:43
1	56	316.91392268579585	266.58199781589866	20/04/28 05:11:43
1	56	316.6968484359417	266.4742177009881	20/04/28 05:11:43
1	56	316.81492042672977	266.3119319507847	20/04/28 05:11:43
1	56	316.81492042672977	266.3119319507847	20/04/28 05:11:43
