deviceId	device_location_x	device_location_y	rssi_measurement	timeStamp
22	353.27733584284437	275.76541045955213	-65	21/02/24 15:46:23
8	337.0569612312978	272.24137590202855	-59	21/02/24 15:46:23
24	330.2572237413254	276.8419321591195	-68	21/02/24 15:46:23
25	329.08778489613	275.87564892517275	-67	21/02/24 15:46:23
7	334.07657006354464	270.8835908324035	-60	21/02/24 15:46:23
33	361.5531569646988	270.2693072733871	-69	21/02/24 15:46:23
32	356.7839379367616	268.70688981904533	-67	21/02/24 15:46:23
30	327.70079256672074	268.3508487639297	-68	21/02/24 15:46:23
31	346.4179037622539	268.10202267794875	-52	21/02/24 15:46:23
13	342.0775229118143	267.91244197819304	-48	21/02/24 15:46:23
21	334.5994402908936	265.9434918767382	-59	21/02/24 15:46:23
14	341.6082252010515	265.6547772450898	-36	21/02/24 15:46:23
20	334.99735462161357	264.77807460530994	-57	21/02/24 15:46:23
29	324.8804385762518	264.6870431160569	-70	21/02/24 15:46:23

22	353.27733584284437	275.76541045955213	-65	21/02/24 15:46:24
8	337.0569612312978	272.24137590202855	-58	21/02/24 15:46:24
24	330.2572237413254	276.8419321591195	-68	21/02/24 15:46:24
25	329.08778489613	275.87564892517275	-68	21/02/24 15:46:24
7	334.07657006354464	270.8835908324035	-61	21/02/24 15:46:24
32	356.7839379367616	268.70688981904533	-66	21/02/24 15:46:24
30	327.70079256672074	268.3508487639297	-65	21/02/24 15:46:24
31	346.4179037622539	268.10202267794875	-55	21/02/24 15:46:24
13	342.0775229118143	267.91244197819304	-40	21/02/24 15:46:24
21	334.5994402908936	265.9434918767382	-55	21/02/24 15:46:24
14	341.6082252010515	265.6547772450898	-24	21/02/24 15:46:24
20	334.99735462161357	264.77807460530994	-55	21/02/24 15:46:24
29	324.8804385762518	264.6870431160569	-67	21/02/24 15:46:24

22	353.27733584284437	275.76541045955213	-66	21/02/24 15:46:25
8	337.0569612312978	272.24137590202855	-54	21/02/24 15:46:25
24	330.2572237413254	276.8419321591195	-65	21/02/24 15:46:25
25	329.08778489613	275.87564892517275	-66	21/02/24 15:46:25
11	327.4246457091771	282.6323525733639	-70	21/02/24 15:46:25
7	334.07657006354464	270.8835908324035	-56	21/02/24 15:46:25
32	356.7839379367616	268.70688981904533	-68	21/02/24 15:46:25
30	327.70079256672074	268.3508487639297	-66	21/02/24 15:46:25
31	346.4179037622539	268.10202267794875	-54	21/02/24 15:46:25
13	342.0775229118143	267.91244197819304	-40	21/02/24 15:46:25
21	334.5994402908936	265.9434918767382	-55	21/02/24 15:46:25
14	341.6082252010515	265.6547772450898	-45	21/02/24 15:46:25
20	334.99735462161357	264.77807460530994	-55	21/02/24 15:46:25
29	324.8804385762518	264.6870431160569	-68	21/02/24 15:46:25
23	323.42288358729223	275.8341630458992	-70	21/02/24 15:46:25

22	353.27733584284437	275.76541045955213	-65	21/02/24 15:46:26
8	337.0569612312978	272.24137590202855	-48	21/02/24 15:46:26
24	330.2572237413254	276.8419321591195	-65	21/02/24 15:46:26
25	329.08778489613	275.87564892517275	-63	21/02/24 15:46:26
11	327.4246457091771	282.6323525733639	-68	21/02/24 15:46:26
7	334.07657006354464	270.8835908324035	-55	21/02/24 15:46:26
32	356.7839379367616	268.70688981904533	-67	21/02/24 15:46:26
30	327.70079256672074	268.3508487639297	-62	21/02/24 15:46:26
31	346.4179037622539	268.10202267794875	-56	21/02/24 15:46:26
13	342.0775229118143	267.91244197819304	-47	21/02/24 15:46:26
21	334.5994402908936	265.9434918767382	-56	21/02/24 15:46:26
14	341.6082252010515	265.6547772450898	-51	21/02/24 15:46:26
20	334.99735462161357	264.77807460530994	-57	21/02/24 15:46:26
29	324.8804385762518	264.6870431160569	-67	21/02/24 15:46:26
23	323.42288358729223	275.8341630458992	-68	21/02/24 15:46:26

22	353.27733584284437	275.76541045955213	-67	21/02/24 15:46:27
8	337.0569612312978	272.24137590202855	-47	21/02/24 15:46:27
24	330.2572237413254	276.8419321591195	-64	21/02/24 15:46:27
25	329.08778489613	275.87564892517275	-65	21/02/24 15:46:27
11	327.4246457091771	282.6323525733639	-70	21/02/24 15:46:27
7	334.07657006354464	270.8835908324035	-55	21/02/24 15:46:27
32	356.7839379367616	268.70688981904533	-69	21/02/24 15:46:27
30	327.70079256672074	268.3508487639297	-63	21/02/24 15:46:27
31	346.4179037622539	268.10202267794875	-57	21/02/24 15:46:27
13	342.0775229118143	267.91244197819304	-49	21/02/24 15:46:27
21	334.5994402908936	265.9434918767382	-59	21/02/24 15:46:27
14	341.6082252010515	265.6547772450898	-56	21/02/24 15:46:27
20	334.99735462161357	264.77807460530994	-60	21/02/24 15:46:27
29	324.8804385762518	264.6870431160569	-66	21/02/24 15:46:27
23	323.42288358729223	275.8341630458992	-70	21/02/24 15:46:27

40	360.29771601412074	275.17301637315114	-68	21/02/24 15:46:28
47	353.57917457908314	286.3943403818769	-70	21/02/24 15:46:28
22	353.27733584284437	275.76541045955213	-63	21/02/24 15:46:28
45	342.3105096677226	291.9842245930836	-72	21/02/24 15:46:28
8	337.0569612312978	272.24137590202855	-51	21/02/24 15:46:28
24	330.2572237413254	276.8419321591195	-65	21/02/24 15:46:28
25	329.08778489613	275.87564892517275	-66	21/02/24 15:46:28
11	327.4246457091771	282.6323525733639	-67	21/02/24 15:46:28
7	334.07657006354464	270.8835908324035	-56	21/02/24 15:46:28
32	356.7839379367616	268.70688981904533	-67	21/02/24 15:46:28
30	327.70079256672074	268.3508487639297	-65	21/02/24 15:46:28
31	346.4179037622539	268.10202267794875	-56	21/02/24 15:46:28
13	342.0775229118143	267.91244197819304	-52	21/02/24 15:46:28
21	334.5994402908936	265.9434918767382	-59	21/02/24 15:46:28
14	341.6082252010515	265.6547772450898	-58	21/02/24 15:46:28
20	334.99735462161357	264.77807460530994	-62	21/02/24 15:46:28
29	324.8804385762518	264.6870431160569	-69	21/02/24 15:46:28
23	323.42288358729223	275.8341630458992	-71	21/02/24 15:46:28

40	360.29771601412074	275.17301637315114	-70	21/02/24 15:46:29
47	353.57917457908314	286.3943403818769	-69	21/02/24 15:46:29
22	353.27733584284437	275.76541045955213	-64	21/02/24 15:46:29
45	342.3105096677226	291.9842245930836	-69	21/02/24 15:46:29
8	337.0569612312978	272.24137590202855	-56	21/02/24 15:46:29
24	330.2572237413254	276.8419321591195	-65	21/02/24 15:46:29
25	329.08778489613	275.87564892517275	-65	21/02/24 15:46:29
11	327.4246457091771	282.6323525733639	-70	21/02/24 15:46:29
7	334.07657006354464	270.8835908324035	-61	21/02/24 15:46:29
33	361.5531569646988	270.2693072733871	-68	21/02/24 15:46:29
32	356.7839379367616	268.70688981904533	-67	21/02/24 15:46:29
30	327.70079256672074	268.3508487639297	-69	21/02/24 15:46:29
31	346.4179037622539	268.10202267794875	-56	21/02/24 15:46:29
13	342.0775229118143	267.91244197819304	-56	21/02/24 15:46:29
21	334.5994402908936	265.9434918767382	-64	21/02/24 15:46:29
14	341.6082252010515	265.6547772450898	-59	21/02/24 15:46:29
20	334.99735462161357	264.77807460530994	-62	21/02/24 15:46:29
23	323.42288358729223	275.8341630458992	-71	21/02/24 15:46:29

37	359.5903712498935	284.92420131943135	-71	21/02/24 15:46:30
40	360.29771601412074	275.17301637315114	-70	21/02/24 15:46:30
47	353.57917457908314	286.3943403818769	-66	21/02/24 15:46:30
22	353.27733584284437	275.76541045955213	-62	21/02/24 15:46:30
45	342.3105096677226	291.9842245930836	-68	21/02/24 15:46:30
46	340.76419739931424	294.4321023101609	-70	21/02/24 15:46:30
8	337.0569612312978	272.24137590202855	-58	21/02/24 15:46:30
24	330.2572237413254	276.8419321591195	-65	21/02/24 15:46:30
25	329.08778489613	275.87564892517275	-66	21/02/24 15:46:30
11	327.4246457091771	282.6323525733639	-69	21/02/24 15:46:30
7	334.07657006354464	270.8835908324035	-62	21/02/24 15:46:30
33	361.5531569646988	270.2693072733871	-70	21/02/24 15:46:30
32	356.7839379367616	268.70688981904533	-66	21/02/24 15:46:30
30	327.70079256672074	268.3508487639297	-68	21/02/24 15:46:30
31	346.4179037622539	268.10202267794875	-61	21/02/24 15:46:30
13	342.0775229118143	267.91244197819304	-59	21/02/24 15:46:30
21	334.5994402908936	265.9434918767382	-64	21/02/24 15:46:30
14	341.6082252010515	265.6547772450898	-60	21/02/24 15:46:30
20	334.99735462161357	264.77807460530994	-66	21/02/24 15:46:30
23	323.42288358729223	275.8341630458992	-71	21/02/24 15:46:30

37	359.5903712498935	284.92420131943135	-68	21/02/24 15:46:31
40	360.29771601412074	275.17301637315114	-70	21/02/24 15:46:31
47	353.57917457908314	286.3943403818769	-65	21/02/24 15:46:31
22	353.27733584284437	275.76541045955213	-62	21/02/24 15:46:31
45	342.3105096677226	291.9842245930836	-66	21/02/24 15:46:31
46	340.76419739931424	294.4321023101609	-67	21/02/24 15:46:31
8	337.0569612312978	272.24137590202855	-58	21/02/24 15:46:31
24	330.2572237413254	276.8419321591195	-64	21/02/24 15:46:31
25	329.08778489613	275.87564892517275	-66	21/02/24 15:46:31
11	327.4246457091771	282.6323525733639	-70	21/02/24 15:46:31
7	334.07657006354464	270.8835908324035	-63	21/02/24 15:46:31
33	361.5531569646988	270.2693072733871	-72	21/02/24 15:46:31
32	356.7839379367616	268.70688981904533	-69	21/02/24 15:46:31
30	327.70079256672074	268.3508487639297	-70	21/02/24 15:46:31
31	346.4179037622539	268.10202267794875	-64	21/02/24 15:46:31
13	342.0775229118143	267.91244197819304	-60	21/02/24 15:46:31
21	334.5994402908936	265.9434918767382	-68	21/02/24 15:46:31
14	341.6082252010515	265.6547772450898	-66	21/02/24 15:46:31
20	334.99735462161357	264.77807460530994	-69	21/02/24 15:46:31

37	359.5903712498935	284.92420131943135	-68	21/02/24 15:46:32
40	360.29771601412074	275.17301637315114	-70	21/02/24 15:46:32
47	353.57917457908314	286.3943403818769	-63	21/02/24 15:46:32
22	353.27733584284437	275.76541045955213	-62	21/02/24 15:46:32
45	342.3105096677226	291.9842245930836	-65	21/02/24 15:46:32
46	340.76419739931424	294.4321023101609	-65	21/02/24 15:46:32
8	337.0569612312978	272.24137590202855	-62	21/02/24 15:46:32
24	330.2572237413254	276.8419321591195	-68	21/02/24 15:46:32
25	329.08778489613	275.87564892517275	-66	21/02/24 15:46:32
16	327.98603409324727	290.8054485105832	-72	21/02/24 15:46:32
11	327.4246457091771	282.6323525733639	-68	21/02/24 15:46:32
7	334.07657006354464	270.8835908324035	-65	21/02/24 15:46:32
32	356.7839379367616	268.70688981904533	-70	21/02/24 15:46:32
30	327.70079256672074	268.3508487639297	-69	21/02/24 15:46:32
31	346.4179037622539	268.10202267794875	-66	21/02/24 15:46:32
13	342.0775229118143	267.91244197819304	-66	21/02/24 15:46:32
21	334.5994402908936	265.9434918767382	-67	21/02/24 15:46:32
14	341.6082252010515	265.6547772450898	-66	21/02/24 15:46:32
20	334.99735462161357	264.77807460530994	-69	21/02/24 15:46:32

37	359.5903712498935	284.92420131943135	-70	21/02/24 15:46:33
40	360.29771601412074	275.17301637315114	-68	21/02/24 15:46:33
47	353.57917457908314	286.3943403818769	-65	21/02/24 15:46:33
22	353.27733584284437	275.76541045955213	-62	21/02/24 15:46:33
45	342.3105096677226	291.9842245930836	-65	21/02/24 15:46:33
46	340.76419739931424	294.4321023101609	-68	21/02/24 15:46:33
8	337.0569612312978	272.24137590202855	-62	21/02/24 15:46:33
24	330.2572237413254	276.8419321591195	-67	21/02/24 15:46:33
25	329.08778489613	275.87564892517275	-66	21/02/24 15:46:33
11	327.4246457091771	282.6323525733639	-69	21/02/24 15:46:33
7	334.07657006354464	270.8835908324035	-65	21/02/24 15:46:33
33	361.5531569646988	270.2693072733871	-69	21/02/24 15:46:33
32	356.7839379367616	268.70688981904533	-66	21/02/24 15:46:33
30	327.70079256672074	268.3508487639297	-72	21/02/24 15:46:33
31	346.4179037622539	268.10202267794875	-65	21/02/24 15:46:33
13	342.0775229118143	267.91244197819304	-65	21/02/24 15:46:33
21	334.5994402908936	265.9434918767382	-69	21/02/24 15:46:33
14	341.6082252010515	265.6547772450898	-67	21/02/24 15:46:33
20	334.99735462161357	264.77807460530994	-68	21/02/24 15:46:33

27	361.7760445803703	289.2690199455797	-72	21/02/24 15:46:34
37	359.5903712498935	284.92420131943135	-68	21/02/24 15:46:34
40	360.29771601412074	275.17301637315114	-68	21/02/24 15:46:34
47	353.57917457908314	286.3943403818769	-62	21/02/24 15:46:34
22	353.27733584284437	275.76541045955213	-60	21/02/24 15:46:34
45	342.3105096677226	291.9842245930836	-65	21/02/24 15:46:34
46	340.76419739931424	294.4321023101609	-68	21/02/24 15:46:34
8	337.0569612312978	272.24137590202855	-60	21/02/24 15:46:34
24	330.2572237413254	276.8419321591195	-65	21/02/24 15:46:34
25	329.08778489613	275.87564892517275	-69	21/02/24 15:46:34
11	327.4246457091771	282.6323525733639	-69	21/02/24 15:46:34
7	334.07657006354464	270.8835908324035	-66	21/02/24 15:46:34
33	361.5531569646988	270.2693072733871	-72	21/02/24 15:46:34
32	356.7839379367616	268.70688981904533	-66	21/02/24 15:46:34
31	346.4179037622539	268.10202267794875	-62	21/02/24 15:46:34
13	342.0775229118143	267.91244197819304	-63	21/02/24 15:46:34
21	334.5994402908936	265.9434918767382	-67	21/02/24 15:46:34
14	341.6082252010515	265.6547772450898	-66	21/02/24 15:46:34
20	334.99735462161357	264.77807460530994	-67	21/02/24 15:46:34

37	359.5903712498935	284.92420131943135	-69	21/02/24 15:46:35
40	360.29771601412074	275.17301637315114	-66	21/02/24 15:46:35
47	353.57917457908314	286.3943403818769	-65	21/02/24 15:46:35
22	353.27733584284437	275.76541045955213	-61	21/02/24 15:46:35
45	342.3105096677226	291.9842245930836	-67	21/02/24 15:46:35
46	340.76419739931424	294.4321023101609	-67	21/02/24 15:46:35
8	337.0569612312978	272.24137590202855	-63	21/02/24 15:46:35
24	330.2572237413254	276.8419321591195	-65	21/02/24 15:46:35
25	329.08778489613	275.87564892517275	-67	21/02/24 15:46:35
11	327.4246457091771	282.6323525733639	-69	21/02/24 15:46:35
7	334.07657006354464	270.8835908324035	-66	21/02/24 15:46:35
33	361.5531569646988	270.2693072733871	-71	21/02/24 15:46:35
32	356.7839379367616	268.70688981904533	-69	21/02/24 15:46:35
30	327.70079256672074	268.3508487639297	-70	21/02/24 15:46:35
31	346.4179037622539	268.10202267794875	-62	21/02/24 15:46:35
13	342.0775229118143	267.91244197819304	-64	21/02/24 15:46:35
21	334.5994402908936	265.9434918767382	-68	21/02/24 15:46:35
14	341.6082252010515	265.6547772450898	-66	21/02/24 15:46:35
20	334.99735462161357	264.77807460530994	-69	21/02/24 15:46:35

37	359.5903712498935	284.92420131943135	-69	21/02/24 15:46:36
40	360.29771601412074	275.17301637315114	-68	21/02/24 15:46:36
47	353.57917457908314	286.3943403818769	-62	21/02/24 15:46:36
22	353.27733584284437	275.76541045955213	-63	21/02/24 15:46:36
45	342.3105096677226	291.9842245930836	-66	21/02/24 15:46:36
46	340.76419739931424	294.4321023101609	-68	21/02/24 15:46:36
8	337.0569612312978	272.24137590202855	-60	21/02/24 15:46:36
24	330.2572237413254	276.8419321591195	-66	21/02/24 15:46:36
25	329.08778489613	275.87564892517275	-68	21/02/24 15:46:36
11	327.4246457091771	282.6323525733639	-70	21/02/24 15:46:36
7	334.07657006354464	270.8835908324035	-65	21/02/24 15:46:36
33	361.5531569646988	270.2693072733871	-71	21/02/24 15:46:36
32	356.7839379367616	268.70688981904533	-66	21/02/24 15:46:36
30	327.70079256672074	268.3508487639297	-72	21/02/24 15:46:36
31	346.4179037622539	268.10202267794875	-65	21/02/24 15:46:36
13	342.0775229118143	267.91244197819304	-65	21/02/24 15:46:36
21	334.5994402908936	265.9434918767382	-66	21/02/24 15:46:36
14	341.6082252010515	265.6547772450898	-65	21/02/24 15:46:36
20	334.99735462161357	264.77807460530994	-70	21/02/24 15:46:36

37	359.5903712498935	284.92420131943135	-70	21/02/24 15:46:37
40	360.29771601412074	275.17301637315114	-68	21/02/24 15:46:37
47	353.57917457908314	286.3943403818769	-65	21/02/24 15:46:37
22	353.27733584284437	275.76541045955213	-60	21/02/24 15:46:37
45	342.3105096677226	291.9842245930836	-65	21/02/24 15:46:37
46	340.76419739931424	294.4321023101609	-67	21/02/24 15:46:37
8	337.0569612312978	272.24137590202855	-62	21/02/24 15:46:37
24	330.2572237413254	276.8419321591195	-65	21/02/24 15:46:37
25	329.08778489613	275.87564892517275	-68	21/02/24 15:46:37
11	327.4246457091771	282.6323525733639	-67	21/02/24 15:46:37
7	334.07657006354464	270.8835908324035	-64	21/02/24 15:46:37
33	361.5531569646988	270.2693072733871	-68	21/02/24 15:46:37
32	356.7839379367616	268.70688981904533	-66	21/02/24 15:46:37
30	327.70079256672074	268.3508487639297	-70	21/02/24 15:46:37
31	346.4179037622539	268.10202267794875	-63	21/02/24 15:46:37
13	342.0775229118143	267.91244197819304	-65	21/02/24 15:46:37
21	334.5994402908936	265.9434918767382	-69	21/02/24 15:46:37
14	341.6082252010515	265.6547772450898	-66	21/02/24 15:46:37
20	334.99735462161357	264.77807460530994	-70	21/02/24 15:46:37

37	359.5903712498935	284.92420131943135	-70	21/02/24 15:46:38
40	360.29771601412074	275.17301637315114	-70	21/02/24 15:46:38
47	353.57917457908314	286.3943403818769	-63	21/02/24 15:46:38
22	353.27733584284437	275.76541045955213	-60	21/02/24 15:46:38
45	342.3105096677226	291.9842245930836	-64	21/02/24 15:46:38
46	340.76419739931424	294.4321023101609	-69	21/02/24 15:46:38
8	337.0569612312978	272.24137590202855	-61	21/02/24 15:46:38
24	330.2572237413254	276.8419321591195	-66	21/02/24 15:46:38
25	329.08778489613	275.87564892517275	-69	21/02/24 15:46:38
11	327.4246457091771	282.6323525733639	-68	21/02/24 15:46:38
7	334.07657006354464	270.8835908324035	-67	21/02/24 15:46:38
33	361.5531569646988	270.2693072733871	-72	21/02/24 15:46:38
32	356.7839379367616	268.70688981904533	-67	21/02/24 15:46:38
30	327.70079256672074	268.3508487639297	-70	21/02/24 15:46:38
31	346.4179037622539	268.10202267794875	-63	21/02/24 15:46:38
13	342.0775229118143	267.91244197819304	-64	21/02/24 15:46:38
21	334.5994402908936	265.9434918767382	-67	21/02/24 15:46:38
14	341.6082252010515	265.6547772450898	-65	21/02/24 15:46:38
20	334.99735462161357	264.77807460530994	-69	21/02/24 15:46:38

37	359.5903712498935	284.92420131943135	-67	21/02/24 15:46:39
40	360.29771601412074	275.17301637315114	-69	21/02/24 15:46:39
47	353.57917457908314	286.3943403818769	-63	21/02/24 15:46:39
22	353.27733584284437	275.76541045955213	-63	21/02/24 15:46:39
45	342.3105096677226	291.9842245930836	-65	21/02/24 15:46:39
46	340.76419739931424	294.4321023101609	-67	21/02/24 15:46:39
8	337.0569612312978	272.24137590202855	-63	21/02/24 15:46:39
24	330.2572237413254	276.8419321591195	-65	21/02/24 15:46:39
25	329.08778489613	275.87564892517275	-67	21/02/24 15:46:39
11	327.4246457091771	282.6323525733639	-68	21/02/24 15:46:39
7	334.07657006354464	270.8835908324035	-66	21/02/24 15:46:39
33	361.5531569646988	270.2693072733871	-72	21/02/24 15:46:39
32	356.7839379367616	268.70688981904533	-68	21/02/24 15:46:39
30	327.70079256672074	268.3508487639297	-71	21/02/24 15:46:39
31	346.4179037622539	268.10202267794875	-61	21/02/24 15:46:39
13	342.0775229118143	267.91244197819304	-62	21/02/24 15:46:39
21	334.5994402908936	265.9434918767382	-68	21/02/24 15:46:39
14	341.6082252010515	265.6547772450898	-67	21/02/24 15:46:39
20	334.99735462161357	264.77807460530994	-70	21/02/24 15:46:39

37	359.5903712498935	284.92420131943135	-68	21/02/24 15:46:40
40	360.29771601412074	275.17301637315114	-69	21/02/24 15:46:40
47	353.57917457908314	286.3943403818769	-62	21/02/24 15:46:40
22	353.27733584284437	275.76541045955213	-59	21/02/24 15:46:40
45	342.3105096677226	291.9842245930836	-67	21/02/24 15:46:40
46	340.76419739931424	294.4321023101609	-69	21/02/24 15:46:40
8	337.0569612312978	272.24137590202855	-59	21/02/24 15:46:40
24	330.2572237413254	276.8419321591195	-65	21/02/24 15:46:40
25	329.08778489613	275.87564892517275	-68	21/02/24 15:46:40
11	327.4246457091771	282.6323525733639	-68	21/02/24 15:46:40
7	334.07657006354464	270.8835908324035	-66	21/02/24 15:46:40
33	361.5531569646988	270.2693072733871	-69	21/02/24 15:46:40
32	356.7839379367616	268.70688981904533	-66	21/02/24 15:46:40
30	327.70079256672074	268.3508487639297	-68	21/02/24 15:46:40
31	346.4179037622539	268.10202267794875	-60	21/02/24 15:46:40
13	342.0775229118143	267.91244197819304	-64	21/02/24 15:46:40
21	334.5994402908936	265.9434918767382	-68	21/02/24 15:46:40
14	341.6082252010515	265.6547772450898	-63	21/02/24 15:46:40
20	334.99735462161357	264.77807460530994	-67	21/02/24 15:46:40

37	359.5903712498935	284.92420131943135	-69	21/02/24 15:46:41
40	360.29771601412074	275.17301637315114	-68	21/02/24 15:46:41
47	353.57917457908314	286.3943403818769	-64	21/02/24 15:46:41
22	353.27733584284437	275.76541045955213	-60	21/02/24 15:46:41
45	342.3105096677226	291.9842245930836	-67	21/02/24 15:46:41
46	340.76419739931424	294.4321023101609	-68	21/02/24 15:46:41
8	337.0569612312978	272.24137590202855	-60	21/02/24 15:46:41
24	330.2572237413254	276.8419321591195	-65	21/02/24 15:46:41
25	329.08778489613	275.87564892517275	-66	21/02/24 15:46:41
11	327.4246457091771	282.6323525733639	-71	21/02/24 15:46:41
7	334.07657006354464	270.8835908324035	-65	21/02/24 15:46:41
33	361.5531569646988	270.2693072733871	-70	21/02/24 15:46:41
32	356.7839379367616	268.70688981904533	-66	21/02/24 15:46:41
30	327.70079256672074	268.3508487639297	-69	21/02/24 15:46:41
31	346.4179037622539	268.10202267794875	-63	21/02/24 15:46:41
13	342.0775229118143	267.91244197819304	-60	21/02/24 15:46:41
21	334.5994402908936	265.9434918767382	-66	21/02/24 15:46:41
14	341.6082252010515	265.6547772450898	-66	21/02/24 15:46:41
20	334.99735462161357	264.77807460530994	-67	21/02/24 15:46:41

37	359.5903712498935	284.92420131943135	-70	21/02/24 15:46:42
40	360.29771601412074	275.17301637315114	-70	21/02/24 15:46:42
47	353.57917457908314	286.3943403818769	-64	21/02/24 15:46:42
22	353.27733584284437	275.76541045955213	-60	21/02/24 15:46:42
45	342.3105096677226	291.9842245930836	-66	21/02/24 15:46:42
46	340.76419739931424	294.4321023101609	-69	21/02/24 15:46:42
8	337.0569612312978	272.24137590202855	-60	21/02/24 15:46:42
24	330.2572237413254	276.8419321591195	-67	21/02/24 15:46:42
25	329.08778489613	275.87564892517275	-67	21/02/24 15:46:42
11	327.4246457091771	282.6323525733639	-67	21/02/24 15:46:42
7	334.07657006354464	270.8835908324035	-65	21/02/24 15:46:42
33	361.5531569646988	270.2693072733871	-72	21/02/24 15:46:42
32	356.7839379367616	268.70688981904533	-66	21/02/24 15:46:42
30	327.70079256672074	268.3508487639297	-71	21/02/24 15:46:42
31	346.4179037622539	268.10202267794875	-62	21/02/24 15:46:42
13	342.0775229118143	267.91244197819304	-64	21/02/24 15:46:42
21	334.5994402908936	265.9434918767382	-67	21/02/24 15:46:42
14	341.6082252010515	265.6547772450898	-64	21/02/24 15:46:42
20	334.99735462161357	264.77807460530994	-70	21/02/24 15:46:42

37	359.5903712498935	284.92420131943135	-66	21/02/24 15:46:43
40	360.29771601412074	275.17301637315114	-70	21/02/24 15:46:43
47	353.57917457908314	286.3943403818769	-64	21/02/24 15:46:43
22	353.27733584284437	275.76541045955213	-62	21/02/24 15:46:43
45	342.3105096677226	291.9842245930836	-65	21/02/24 15:46:43
46	340.76419739931424	294.4321023101609	-65	21/02/24 15:46:43
8	337.0569612312978	272.24137590202855	-62	21/02/24 15:46:43
24	330.2572237413254	276.8419321591195	-64	21/02/24 15:46:43
25	329.08778489613	275.87564892517275	-68	21/02/24 15:46:43
16	327.98603409324727	290.8054485105832	-71	21/02/24 15:46:43
11	327.4246457091771	282.6323525733639	-68	21/02/24 15:46:43
7	334.07657006354464	270.8835908324035	-66	21/02/24 15:46:43
32	356.7839379367616	268.70688981904533	-70	21/02/24 15:46:43
30	327.70079256672074	268.3508487639297	-72	21/02/24 15:46:43
31	346.4179037622539	268.10202267794875	-63	21/02/24 15:46:43
13	342.0775229118143	267.91244197819304	-65	21/02/24 15:46:43
21	334.5994402908936	265.9434918767382	-67	21/02/24 15:46:43
14	341.6082252010515	265.6547772450898	-67	21/02/24 15:46:43
20	334.99735462161357	264.77807460530994	-69	21/02/24 15:46:43

37	359.5903712498935	284.92420131943135	-67	21/02/24 15:46:44
40	360.29771601412074	275.17301637315114	-67	21/02/24 15:46:44
47	353.57917457908314	286.3943403818769	-66	21/02/24 15:46:44
22	353.27733584284437	275.76541045955213	-60	21/02/24 15:46:44
45	342.3105096677226	291.9842245930836	-64	21/02/24 15:46:44
46	340.76419739931424	294.4321023101609	-67	21/02/24 15:46:44
8	337.0569612312978	272.24137590202855	-58	21/02/24 15:46:44
24	330.2572237413254	276.8419321591195	-66	21/02/24 15:46:44
25	329.08778489613	275.87564892517275	-64	21/02/24 15:46:44
11	327.4246457091771	282.6323525733639	-69	21/02/24 15:46:44
7	334.07657006354464	270.8835908324035	-62	21/02/24 15:46:44
33	361.5531569646988	270.2693072733871	-70	21/02/24 15:46:44
32	356.7839379367616	268.70688981904533	-70	21/02/24 15:46:44
30	327.70079256672074	268.3508487639297	-69	21/02/24 15:46:44
31	346.4179037622539	268.10202267794875	-62	21/02/24 15:46:44
13	342.0775229118143	267.91244197819304	-60	21/02/24 15:46:44
21	334.5994402908936	265.9434918767382	-65	21/02/24 15:46:44
14	341.6082252010515	265.6547772450898	-65	21/02/24 15:46:44
20	334.99735462161357	264.77807460530994	-67	21/02/24 15:46:44
23	323.42288358729223	275.8341630458992	-70	21/02/24 15:46:44

37	359.5903712498935	284.92420131943135	-71	21/02/24 15:46:45
40	360.29771601412074	275.17301637315114	-68	21/02/24 15:46:45
47	353.57917457908314	286.3943403818769	-67	21/02/24 15:46:45
22	353.27733584284437	275.76541045955213	-60	21/02/24 15:46:45
45	342.3105096677226	291.9842245930836	-69	21/02/24 15:46:45
46	340.76419739931424	294.4321023101609	-69	21/02/24 15:46:45
8	337.0569612312978	272.24137590202855	-56	21/02/24 15:46:45
24	330.2572237413254	276.8419321591195	-65	21/02/24 15:46:45
25	329.08778489613	275.87564892517275	-66	21/02/24 15:46:45
11	327.4246457091771	282.6323525733639	-70	21/02/24 15:46:45
7	334.07657006354464	270.8835908324035	-60	21/02/24 15:46:45
33	361.5531569646988	270.2693072733871	-70	21/02/24 15:46:45
32	356.7839379367616	268.70688981904533	-68	21/02/24 15:46:45
30	327.70079256672074	268.3508487639297	-67	21/02/24 15:46:45
31	346.4179037622539	268.10202267794875	-58	21/02/24 15:46:45
13	342.0775229118143	267.91244197819304	-58	21/02/24 15:46:45
21	334.5994402908936	265.9434918767382	-66	21/02/24 15:46:45
14	341.6082252010515	265.6547772450898	-60	21/02/24 15:46:45
20	334.99735462161357	264.77807460530994	-65	21/02/24 15:46:45
23	323.42288358729223	275.8341630458992	-72	21/02/24 15:46:45

40	360.29771601412074	275.17301637315114	-70	21/02/24 15:46:46
47	353.57917457908314	286.3943403818769	-70	21/02/24 15:46:46
22	353.27733584284437	275.76541045955213	-65	21/02/24 15:46:46
45	342.3105096677226	291.9842245930836	-68	21/02/24 15:46:46
8	337.0569612312978	272.24137590202855	-53	21/02/24 15:46:46
24	330.2572237413254	276.8419321591195	-66	21/02/24 15:46:46
25	329.08778489613	275.87564892517275	-63	21/02/24 15:46:46
11	327.4246457091771	282.6323525733639	-68	21/02/24 15:46:46
7	334.07657006354464	270.8835908324035	-59	21/02/24 15:46:46
32	356.7839379367616	268.70688981904533	-67	21/02/24 15:46:46
30	327.70079256672074	268.3508487639297	-68	21/02/24 15:46:46
31	346.4179037622539	268.10202267794875	-59	21/02/24 15:46:46
13	342.0775229118143	267.91244197819304	-53	21/02/24 15:46:46
21	334.5994402908936	265.9434918767382	-63	21/02/24 15:46:46
14	341.6082252010515	265.6547772450898	-59	21/02/24 15:46:46
20	334.99735462161357	264.77807460530994	-62	21/02/24 15:46:46
29	324.8804385762518	264.6870431160569	-70	21/02/24 15:46:46
23	323.42288358729223	275.8341630458992	-70	21/02/24 15:46:46

47	353.57917457908314	286.3943403818769	-68	21/02/24 15:46:47
22	353.27733584284437	275.76541045955213	-65	21/02/24 15:46:47
45	342.3105096677226	291.9842245930836	-68	21/02/24 15:46:47
8	337.0569612312978	272.24137590202855	-47	21/02/24 15:46:47
24	330.2572237413254	276.8419321591195	-62	21/02/24 15:46:47
25	329.08778489613	275.87564892517275	-65	21/02/24 15:46:47
11	327.4246457091771	282.6323525733639	-66	21/02/24 15:46:47
7	334.07657006354464	270.8835908324035	-55	21/02/24 15:46:47
32	356.7839379367616	268.70688981904533	-69	21/02/24 15:46:47
30	327.70079256672074	268.3508487639297	-67	21/02/24 15:46:47
31	346.4179037622539	268.10202267794875	-59	21/02/24 15:46:47
13	342.0775229118143	267.91244197819304	-56	21/02/24 15:46:47
21	334.5994402908936	265.9434918767382	-58	21/02/24 15:46:47
14	341.6082252010515	265.6547772450898	-58	21/02/24 15:46:47
20	334.99735462161357	264.77807460530994	-60	21/02/24 15:46:47
29	324.8804385762518	264.6870431160569	-69	21/02/24 15:46:47
23	323.42288358729223	275.8341630458992	-69	21/02/24 15:46:47

22	353.27733584284437	275.76541045955213	-69	21/02/24 15:46:48
45	342.3105096677226	291.9842245930836	-70	21/02/24 15:46:48
8	337.0569612312978	272.24137590202855	-35	21/02/24 15:46:48
24	330.2572237413254	276.8419321591195	-58	21/02/24 15:46:48
25	329.08778489613	275.87564892517275	-60	21/02/24 15:46:48
11	327.4246457091771	282.6323525733639	-65	21/02/24 15:46:48
7	334.07657006354464	270.8835908324035	-50	21/02/24 15:46:48
32	356.7839379367616	268.70688981904533	-69	21/02/24 15:46:48
30	327.70079256672074	268.3508487639297	-64	21/02/24 15:46:48
31	346.4179037622539	268.10202267794875	-63	21/02/24 15:46:48
13	342.0775229118143	267.91244197819304	-55	21/02/24 15:46:48
21	334.5994402908936	265.9434918767382	-57	21/02/24 15:46:48
14	341.6082252010515	265.6547772450898	-59	21/02/24 15:46:48
20	334.99735462161357	264.77807460530994	-60	21/02/24 15:46:48
29	324.8804385762518	264.6870431160569	-69	21/02/24 15:46:48
23	323.42288358729223	275.8341630458992	-68	21/02/24 15:46:48
10	321.1177375667231	282.04747788327467	-68	21/02/24 15:46:48

22	353.27733584284437	275.76541045955213	-70	21/02/24 15:46:49
8	337.0569612312978	272.24137590202855	-37	21/02/24 15:46:49
24	330.2572237413254	276.8419321591195	-57	21/02/24 15:46:49
25	329.08778489613	275.87564892517275	-57	21/02/24 15:46:49
16	327.98603409324727	290.8054485105832	-70	21/02/24 15:46:49
11	327.4246457091771	282.6323525733639	-65	21/02/24 15:46:49
7	334.07657006354464	270.8835908324035	-43	21/02/24 15:46:49
30	327.70079256672074	268.3508487639297	-61	21/02/24 15:46:49
31	346.4179037622539	268.10202267794875	-63	21/02/24 15:46:49
13	342.0775229118143	267.91244197819304	-60	21/02/24 15:46:49
21	334.5994402908936	265.9434918767382	-57	21/02/24 15:46:49
14	341.6082252010515	265.6547772450898	-59	21/02/24 15:46:49
20	334.99735462161357	264.77807460530994	-59	21/02/24 15:46:49
29	324.8804385762518	264.6870431160569	-65	21/02/24 15:46:49
23	323.42288358729223	275.8341630458992	-63	21/02/24 15:46:49
10	321.1177375667231	282.04747788327467	-68	21/02/24 15:46:49
28	319.76429243151256	284.17285383094054	-71	21/02/24 15:46:49

22	353.27733584284437	275.76541045955213	-71	21/02/24 15:46:50
8	337.0569612312978	272.24137590202855	-47	21/02/24 15:46:50
24	330.2572237413254	276.8419321591195	-54	21/02/24 15:46:50
25	329.08778489613	275.87564892517275	-55	21/02/24 15:46:50
16	327.98603409324727	290.8054485105832	-69	21/02/24 15:46:50
11	327.4246457091771	282.6323525733639	-66	21/02/24 15:46:50
7	334.07657006354464	270.8835908324035	-40	21/02/24 15:46:50
30	327.70079256672074	268.3508487639297	-58	21/02/24 15:46:50
31	346.4179037622539	268.10202267794875	-66	21/02/24 15:46:50
13	342.0775229118143	267.91244197819304	-61	21/02/24 15:46:50
21	334.5994402908936	265.9434918767382	-55	21/02/24 15:46:50
14	341.6082252010515	265.6547772450898	-61	21/02/24 15:46:50
20	334.99735462161357	264.77807460530994	-58	21/02/24 15:46:50
29	324.8804385762518	264.6870431160569	-62	21/02/24 15:46:50
23	323.42288358729223	275.8341630458992	-61	21/02/24 15:46:50
10	321.1177375667231	282.04747788327467	-66	21/02/24 15:46:50
28	319.76429243151256	284.17285383094054	-69	21/02/24 15:46:50
42	315.6556041264745	266.0029600774402	-69	21/02/24 15:46:50

8	337.0569612312978	272.24137590202855	-54	21/02/24 15:46:51
24	330.2572237413254	276.8419321591195	-51	21/02/24 15:46:51
25	329.08778489613	275.87564892517275	-52	21/02/24 15:46:51
16	327.98603409324727	290.8054485105832	-70	21/02/24 15:46:51
11	327.4246457091771	282.6323525733639	-61	21/02/24 15:46:51
7	334.07657006354464	270.8835908324035	-43	21/02/24 15:46:51
30	327.70079256672074	268.3508487639297	-55	21/02/24 15:46:51
31	346.4179037622539	268.10202267794875	-68	21/02/24 15:46:51
13	342.0775229118143	267.91244197819304	-62	21/02/24 15:46:51
21	334.5994402908936	265.9434918767382	-56	21/02/24 15:46:51
14	341.6082252010515	265.6547772450898	-62	21/02/24 15:46:51
20	334.99735462161357	264.77807460530994	-58	21/02/24 15:46:51
29	324.8804385762518	264.6870431160569	-62	21/02/24 15:46:51
23	323.42288358729223	275.8341630458992	-59	21/02/24 15:46:51
10	321.1177375667231	282.04747788327467	-66	21/02/24 15:46:51
28	319.76429243151256	284.17285383094054	-67	21/02/24 15:46:51
38	316.1636107796155	284.5723838925019	-71	21/02/24 15:46:51
42	315.6556041264745	266.0029600774402	-70	21/02/24 15:46:51

8	337.0569612312978	272.24137590202855	-53	21/02/24 15:46:52
24	330.2572237413254	276.8419321591195	-52	21/02/24 15:46:52
25	329.08778489613	275.87564892517275	-54	21/02/24 15:46:52
16	327.98603409324727	290.8054485105832	-68	21/02/24 15:46:52
11	327.4246457091771	282.6323525733639	-63	21/02/24 15:46:52
7	334.07657006354464	270.8835908324035	-40	21/02/24 15:46:52
30	327.70079256672074	268.3508487639297	-55	21/02/24 15:46:52
31	346.4179037622539	268.10202267794875	-65	21/02/24 15:46:52
13	342.0775229118143	267.91244197819304	-64	21/02/24 15:46:52
21	334.5994402908936	265.9434918767382	-58	21/02/24 15:46:52
14	341.6082252010515	265.6547772450898	-64	21/02/24 15:46:52
20	334.99735462161357	264.77807460530994	-59	21/02/24 15:46:52
29	324.8804385762518	264.6870431160569	-61	21/02/24 15:46:52
23	323.42288358729223	275.8341630458992	-61	21/02/24 15:46:52
10	321.1177375667231	282.04747788327467	-65	21/02/24 15:46:52
28	319.76429243151256	284.17285383094054	-69	21/02/24 15:46:52
42	315.6556041264745	266.0029600774402	-69	21/02/24 15:46:52

8	337.0569612312978	272.24137590202855	-53	21/02/24 15:46:53
24	330.2572237413254	276.8419321591195	-52	21/02/24 15:46:53
25	329.08778489613	275.87564892517275	-55	21/02/24 15:46:53
16	327.98603409324727	290.8054485105832	-69	21/02/24 15:46:53
11	327.4246457091771	282.6323525733639	-62	21/02/24 15:46:53
7	334.07657006354464	270.8835908324035	-39	21/02/24 15:46:53
30	327.70079256672074	268.3508487639297	-56	21/02/24 15:46:53
31	346.4179037622539	268.10202267794875	-65	21/02/24 15:46:53
13	342.0775229118143	267.91244197819304	-63	21/02/24 15:46:53
21	334.5994402908936	265.9434918767382	-53	21/02/24 15:46:53
14	341.6082252010515	265.6547772450898	-64	21/02/24 15:46:53
20	334.99735462161357	264.77807460530994	-56	21/02/24 15:46:53
29	324.8804385762518	264.6870431160569	-63	21/02/24 15:46:53
23	323.42288358729223	275.8341630458992	-62	21/02/24 15:46:53
10	321.1177375667231	282.04747788327467	-65	21/02/24 15:46:53
28	319.76429243151256	284.17285383094054	-68	21/02/24 15:46:53
42	315.6556041264745	266.0029600774402	-70	21/02/24 15:46:53

8	337.0569612312978	272.24137590202855	-55	21/02/24 15:46:54
24	330.2572237413254	276.8419321591195	-47	21/02/24 15:46:54
25	329.08778489613	275.87564892517275	-45	21/02/24 15:46:54
16	327.98603409324727	290.8054485105832	-69	21/02/24 15:46:54
11	327.4246457091771	282.6323525733639	-60	21/02/24 15:46:54
7	334.07657006354464	270.8835908324035	-48	21/02/24 15:46:54
30	327.70079256672074	268.3508487639297	-53	21/02/24 15:46:54
31	346.4179037622539	268.10202267794875	-69	21/02/24 15:46:54
13	342.0775229118143	267.91244197819304	-64	21/02/24 15:46:54
21	334.5994402908936	265.9434918767382	-59	21/02/24 15:46:54
14	341.6082252010515	265.6547772450898	-66	21/02/24 15:46:54
20	334.99735462161357	264.77807460530994	-61	21/02/24 15:46:54
29	324.8804385762518	264.6870431160569	-63	21/02/24 15:46:54
23	323.42288358729223	275.8341630458992	-57	21/02/24 15:46:54
10	321.1177375667231	282.04747788327467	-64	21/02/24 15:46:54
28	319.76429243151256	284.17285383094054	-67	21/02/24 15:46:54
38	316.1636107796155	284.5723838925019	-71	21/02/24 15:46:54
42	315.6556041264745	266.0029600774402	-66	21/02/24 15:46:54

8	337.0569612312978	272.24137590202855	-57	21/02/24 15:46:55
24	330.2572237413254	276.8419321591195	-41	21/02/24 15:46:55
25	329.08778489613	275.87564892517275	-35	21/02/24 15:46:55
16	327.98603409324727	290.8054485105832	-67	21/02/24 15:46:55
11	327.4246457091771	282.6323525733639	-57	21/02/24 15:46:55
7	334.07657006354464	270.8835908324035	-53	21/02/24 15:46:55
30	327.70079256672074	268.3508487639297	-56	21/02/24 15:46:55
31	346.4179037622539	268.10202267794875	-69	21/02/24 15:46:55
13	342.0775229118143	267.91244197819304	-64	21/02/24 15:46:55
21	334.5994402908936	265.9434918767382	-60	21/02/24 15:46:55
14	341.6082252010515	265.6547772450898	-66	21/02/24 15:46:55
20	334.99735462161357	264.77807460530994	-65	21/02/24 15:46:55
29	324.8804385762518	264.6870431160569	-63	21/02/24 15:46:55
23	323.42288358729223	275.8341630458992	-56	21/02/24 15:46:55
10	321.1177375667231	282.04747788327467	-63	21/02/24 15:46:55
28	319.76429243151256	284.17285383094054	-68	21/02/24 15:46:55
38	316.1636107796155	284.5723838925019	-67	21/02/24 15:46:55
42	315.6556041264745	266.0029600774402	-69	21/02/24 15:46:55

45	342.3105096677226	291.9842245930836	-70	21/02/24 15:46:56
8	337.0569612312978	272.24137590202855	-59	21/02/24 15:46:56
24	330.2572237413254	276.8419321591195	-32	21/02/24 15:46:56
25	329.08778489613	275.87564892517275	-33	21/02/24 15:46:56
16	327.98603409324727	290.8054485105832	-66	21/02/24 15:46:56
11	327.4246457091771	282.6323525733639	-55	21/02/24 15:46:56
17	323.82998850731616	295.6841920138939	-70	21/02/24 15:46:56
7	334.07657006354464	270.8835908324035	-57	21/02/24 15:46:56
30	327.70079256672074	268.3508487639297	-60	21/02/24 15:46:56
31	346.4179037622539	268.10202267794875	-69	21/02/24 15:46:56
13	342.0775229118143	267.91244197819304	-68	21/02/24 15:46:56
21	334.5994402908936	265.9434918767382	-64	21/02/24 15:46:56
14	341.6082252010515	265.6547772450898	-68	21/02/24 15:46:56
20	334.99735462161357	264.77807460530994	-67	21/02/24 15:46:56
29	324.8804385762518	264.6870431160569	-67	21/02/24 15:46:56
23	323.42288358729223	275.8341630458992	-55	21/02/24 15:46:56
10	321.1177375667231	282.04747788327467	-62	21/02/24 15:46:56
28	319.76429243151256	284.17285383094054	-63	21/02/24 15:46:56
38	316.1636107796155	284.5723838925019	-65	21/02/24 15:46:56
42	315.6556041264745	266.0029600774402	-69	21/02/24 15:46:56

45	342.3105096677226	291.9842245930836	-71	21/02/24 15:46:57
46	340.76419739931424	294.4321023101609	-72	21/02/24 15:46:57
8	337.0569612312978	272.24137590202855	-64	21/02/24 15:46:57
24	330.2572237413254	276.8419321591195	-44	21/02/24 15:46:57
25	329.08778489613	275.87564892517275	-47	21/02/24 15:46:57
16	327.98603409324727	290.8054485105832	-65	21/02/24 15:46:57
11	327.4246457091771	282.6323525733639	-51	21/02/24 15:46:57
17	323.82998850731616	295.6841920138939	-69	21/02/24 15:46:57
7	334.07657006354464	270.8835908324035	-61	21/02/24 15:46:57
30	327.70079256672074	268.3508487639297	-61	21/02/24 15:46:57
13	342.0775229118143	267.91244197819304	-70	21/02/24 15:46:57
21	334.5994402908936	265.9434918767382	-64	21/02/24 15:46:57
14	341.6082252010515	265.6547772450898	-68	21/02/24 15:46:57
20	334.99735462161357	264.77807460530994	-68	21/02/24 15:46:57
29	324.8804385762518	264.6870431160569	-65	21/02/24 15:46:57
23	323.42288358729223	275.8341630458992	-56	21/02/24 15:46:57
10	321.1177375667231	282.04747788327467	-59	21/02/24 15:46:57
28	319.76429243151256	284.17285383094054	-64	21/02/24 15:46:57
38	316.1636107796155	284.5723838925019	-67	21/02/24 15:46:57
42	315.6556041264745	266.0029600774402	-68	21/02/24 15:46:57

45	342.3105096677226	291.9842245930836	-69	21/02/24 15:46:58
46	340.76419739931424	294.4321023101609	-69	21/02/24 15:46:58
8	337.0569612312978	272.24137590202855	-63	21/02/24 15:46:58
24	330.2572237413254	276.8419321591195	-52	21/02/24 15:46:58
25	329.08778489613	275.87564892517275	-53	21/02/24 15:46:58
16	327.98603409324727	290.8054485105832	-63	21/02/24 15:46:58
11	327.4246457091771	282.6323525733639	-41	21/02/24 15:46:58
17	323.82998850731616	295.6841920138939	-66	21/02/24 15:46:58
7	334.07657006354464	270.8835908324035	-65	21/02/24 15:46:58
30	327.70079256672074	268.3508487639297	-65	21/02/24 15:46:58
13	342.0775229118143	267.91244197819304	-70	21/02/24 15:46:58
21	334.5994402908936	265.9434918767382	-69	21/02/24 15:46:58
20	334.99735462161357	264.77807460530994	-70	21/02/24 15:46:58
29	324.8804385762518	264.6870431160569	-70	21/02/24 15:46:58
23	323.42288358729223	275.8341630458992	-57	21/02/24 15:46:58
15	321.20664919882535	299.5482975369317	-71	21/02/24 15:46:58
10	321.1177375667231	282.04747788327467	-57	21/02/24 15:46:58
28	319.76429243151256	284.17285383094054	-58	21/02/24 15:46:58
38	316.1636107796155	284.5723838925019	-66	21/02/24 15:46:58
42	315.6556041264745	266.0029600774402	-69	21/02/24 15:46:58

45	342.3105096677226	291.9842245930836	-69	21/02/24 15:46:59
46	340.76419739931424	294.4321023101609	-70	21/02/24 15:46:59
8	337.0569612312978	272.24137590202855	-66	21/02/24 15:46:59
24	330.2572237413254	276.8419321591195	-58	21/02/24 15:46:59
25	329.08778489613	275.87564892517275	-57	21/02/24 15:46:59
16	327.98603409324727	290.8054485105832	-60	21/02/24 15:46:59
11	327.4246457091771	282.6323525733639	-29	21/02/24 15:46:59
17	323.82998850731616	295.6841920138939	-66	21/02/24 15:46:59
7	334.07657006354464	270.8835908324035	-65	21/02/24 15:46:59
30	327.70079256672074	268.3508487639297	-66	21/02/24 15:46:59
21	334.5994402908936	265.9434918767382	-69	21/02/24 15:46:59
20	334.99735462161357	264.77807460530994	-72	21/02/24 15:46:59
29	324.8804385762518	264.6870431160569	-68	21/02/24 15:46:59
23	323.42288358729223	275.8341630458992	-57	21/02/24 15:46:59
15	321.20664919882535	299.5482975369317	-70	21/02/24 15:46:59
10	321.1177375667231	282.04747788327467	-54	21/02/24 15:46:59
28	319.76429243151256	284.17285383094054	-59	21/02/24 15:46:59
38	316.1636107796155	284.5723838925019	-61	21/02/24 15:46:59
42	315.6556041264745	266.0029600774402	-69	21/02/24 15:46:59
39	309.2997043904728	289.36813114546595	-68	21/02/24 15:46:59
44	307.83683034460904	277.09769127798097	-70	21/02/24 15:46:59

45	342.3105096677226	291.9842245930836	-69	21/02/24 15:47:00
46	340.76419739931424	294.4321023101609	-67	21/02/24 15:47:00
8	337.0569612312978	272.24137590202855	-68	21/02/24 15:47:00
24	330.2572237413254	276.8419321591195	-61	21/02/24 15:47:00
25	329.08778489613	275.87564892517275	-59	21/02/24 15:47:00
16	327.98603409324727	290.8054485105832	-57	21/02/24 15:47:00
11	327.4246457091771	282.6323525733639	-42	21/02/24 15:47:00
17	323.82998850731616	295.6841920138939	-64	21/02/24 15:47:00
7	334.07657006354464	270.8835908324035	-67	21/02/24 15:47:00
30	327.70079256672074	268.3508487639297	-69	21/02/24 15:47:00
29	324.8804385762518	264.6870431160569	-71	21/02/24 15:47:00
23	323.42288358729223	275.8341630458992	-62	21/02/24 15:47:00
15	321.20664919882535	299.5482975369317	-69	21/02/24 15:47:00
10	321.1177375667231	282.04747788327467	-56	21/02/24 15:47:00
28	319.76429243151256	284.17285383094054	-57	21/02/24 15:47:00
38	316.1636107796155	284.5723838925019	-63	21/02/24 15:47:00
39	309.2997043904728	289.36813114546595	-68	21/02/24 15:47:00
44	307.83683034460904	277.09769127798097	-71	21/02/24 15:47:00

45	342.3105096677226	291.9842245930836	-68	21/02/24 15:47:01
46	340.76419739931424	294.4321023101609	-68	21/02/24 15:47:01
8	337.0569612312978	272.24137590202855	-68	21/02/24 15:47:01
24	330.2572237413254	276.8419321591195	-63	21/02/24 15:47:01
25	329.08778489613	275.87564892517275	-64	21/02/24 15:47:01
16	327.98603409324727	290.8054485105832	-52	21/02/24 15:47:01
11	327.4246457091771	282.6323525733639	-50	21/02/24 15:47:01
17	323.82998850731616	295.6841920138939	-61	21/02/24 15:47:01
7	334.07657006354464	270.8835908324035	-68	21/02/24 15:47:01
30	327.70079256672074	268.3508487639297	-68	21/02/24 15:47:01
23	323.42288358729223	275.8341630458992	-61	21/02/24 15:47:01
15	321.20664919882535	299.5482975369317	-65	21/02/24 15:47:01
10	321.1177375667231	282.04747788327467	-56	21/02/24 15:47:01
28	319.76429243151256	284.17285383094054	-57	21/02/24 15:47:01
38	316.1636107796155	284.5723838925019	-60	21/02/24 15:47:01
39	309.2997043904728	289.36813114546595	-68	21/02/24 15:47:01

45	342.3105096677226	291.9842245930836	-67	21/02/24 15:47:02
46	340.76419739931424	294.4321023101609	-67	21/02/24 15:47:02
8	337.0569612312978	272.24137590202855	-69	21/02/24 15:47:02
24	330.2572237413254	276.8419321591195	-63	21/02/24 15:47:02
25	329.08778489613	275.87564892517275	-66	21/02/24 15:47:02
16	327.98603409324727	290.8054485105832	-45	21/02/24 15:47:02
11	327.4246457091771	282.6323525733639	-54	21/02/24 15:47:02
17	323.82998850731616	295.6841920138939	-57	21/02/24 15:47:02
7	334.07657006354464	270.8835908324035	-71	21/02/24 15:47:02
23	323.42288358729223	275.8341630458992	-66	21/02/24 15:47:02
15	321.20664919882535	299.5482975369317	-65	21/02/24 15:47:02
10	321.1177375667231	282.04747788327467	-59	21/02/24 15:47:02
28	319.76429243151256	284.17285383094054	-61	21/02/24 15:47:02
38	316.1636107796155	284.5723838925019	-64	21/02/24 15:47:02
39	309.2997043904728	289.36813114546595	-69	21/02/24 15:47:02

45	342.3105096677226	291.9842245930836	-68	21/02/24 15:47:03
46	340.76419739931424	294.4321023101609	-66	21/02/24 15:47:03
24	330.2572237413254	276.8419321591195	-66	21/02/24 15:47:03
25	329.08778489613	275.87564892517275	-67	21/02/24 15:47:03
16	327.98603409324727	290.8054485105832	-38	21/02/24 15:47:03
11	327.4246457091771	282.6323525733639	-57	21/02/24 15:47:03
17	323.82998850731616	295.6841920138939	-57	21/02/24 15:47:03
23	323.42288358729223	275.8341630458992	-67	21/02/24 15:47:03
15	321.20664919882535	299.5482975369317	-64	21/02/24 15:47:03
10	321.1177375667231	282.04747788327467	-62	21/02/24 15:47:03
28	319.76429243151256	284.17285383094054	-60	21/02/24 15:47:03
38	316.1636107796155	284.5723838925019	-65	21/02/24 15:47:03
39	309.2997043904728	289.36813114546595	-70	21/02/24 15:47:03

45	342.3105096677226	291.9842245930836	-66	21/02/24 15:47:04
46	340.76419739931424	294.4321023101609	-66	21/02/24 15:47:04
24	330.2572237413254	276.8419321591195	-67	21/02/24 15:47:04
25	329.08778489613	275.87564892517275	-68	21/02/24 15:47:04
16	327.98603409324727	290.8054485105832	-35	21/02/24 15:47:04
11	327.4246457091771	282.6323525733639	-57	21/02/24 15:47:04
17	323.82998850731616	295.6841920138939	-56	21/02/24 15:47:04
23	323.42288358729223	275.8341630458992	-66	21/02/24 15:47:04
15	321.20664919882535	299.5482975369317	-62	21/02/24 15:47:04
10	321.1177375667231	282.04747788327467	-62	21/02/24 15:47:04
28	319.76429243151256	284.17285383094054	-60	21/02/24 15:47:04
38	316.1636107796155	284.5723838925019	-63	21/02/24 15:47:04
39	309.2997043904728	289.36813114546595	-69	21/02/24 15:47:04

45	342.3105096677226	291.9842245930836	-68	21/02/24 15:47:05
46	340.76419739931424	294.4321023101609	-65	21/02/24 15:47:05
24	330.2572237413254	276.8419321591195	-65	21/02/24 15:47:05
25	329.08778489613	275.87564892517275	-67	21/02/24 15:47:05
16	327.98603409324727	290.8054485105832	-33	21/02/24 15:47:05
11	327.4246457091771	282.6323525733639	-58	21/02/24 15:47:05
17	323.82998850731616	295.6841920138939	-53	21/02/24 15:47:05
23	323.42288358729223	275.8341630458992	-66	21/02/24 15:47:05
15	321.20664919882535	299.5482975369317	-61	21/02/24 15:47:05
10	321.1177375667231	282.04747788327467	-60	21/02/24 15:47:05
28	319.76429243151256	284.17285383094054	-61	21/02/24 15:47:05
38	316.1636107796155	284.5723838925019	-65	21/02/24 15:47:05
39	309.2997043904728	289.36813114546595	-68	21/02/24 15:47:05

45	342.3105096677226	291.9842245930836	-67	21/02/24 15:47:06
46	340.76419739931424	294.4321023101609	-68	21/02/24 15:47:06
24	330.2572237413254	276.8419321591195	-64	21/02/24 15:47:06
25	329.08778489613	275.87564892517275	-65	21/02/24 15:47:06
16	327.98603409324727	290.8054485105832	-34	21/02/24 15:47:06
11	327.4246457091771	282.6323525733639	-55	21/02/24 15:47:06
17	323.82998850731616	295.6841920138939	-56	21/02/24 15:47:06
23	323.42288358729223	275.8341630458992	-68	21/02/24 15:47:06
15	321.20664919882535	299.5482975369317	-63	21/02/24 15:47:06
10	321.1177375667231	282.04747788327467	-64	21/02/24 15:47:06
28	319.76429243151256	284.17285383094054	-63	21/02/24 15:47:06
38	316.1636107796155	284.5723838925019	-63	21/02/24 15:47:06
39	309.2997043904728	289.36813114546595	-67	21/02/24 15:47:06

45	342.3105096677226	291.9842245930836	-65	21/02/24 15:47:07
46	340.76419739931424	294.4321023101609	-65	21/02/24 15:47:07
8	337.0569612312978	272.24137590202855	-69	21/02/24 15:47:07
24	330.2572237413254	276.8419321591195	-66	21/02/24 15:47:07
25	329.08778489613	275.87564892517275	-65	21/02/24 15:47:07
16	327.98603409324727	290.8054485105832	-29	21/02/24 15:47:07
11	327.4246457091771	282.6323525733639	-56	21/02/24 15:47:07
17	323.82998850731616	295.6841920138939	-56	21/02/24 15:47:07
23	323.42288358729223	275.8341630458992	-68	21/02/24 15:47:07
15	321.20664919882535	299.5482975369317	-64	21/02/24 15:47:07
10	321.1177375667231	282.04747788327467	-60	21/02/24 15:47:07
28	319.76429243151256	284.17285383094054	-60	21/02/24 15:47:07
38	316.1636107796155	284.5723838925019	-63	21/02/24 15:47:07
39	309.2997043904728	289.36813114546595	-68	21/02/24 15:47:07

45	342.3105096677226	291.9842245930836	-65	21/02/24 15:47:08
46	340.76419739931424	294.4321023101609	-65	21/02/24 15:47:08
24	330.2572237413254	276.8419321591195	-64	21/02/24 15:47:08
25	329.08778489613	275.87564892517275	-68	21/02/24 15:47:08
16	327.98603409324727	290.8054485105832	-24	21/02/24 15:47:08
11	327.4246457091771	282.6323525733639	-58	21/02/24 15:47:08
17	323.82998850731616	295.6841920138939	-57	21/02/24 15:47:08
23	323.42288358729223	275.8341630458992	-65	21/02/24 15:47:08
15	321.20664919882535	299.5482975369317	-63	21/02/24 15:47:08
10	321.1177375667231	282.04747788327467	-61	21/02/24 15:47:08
28	319.76429243151256	284.17285383094054	-62	21/02/24 15:47:08
38	316.1636107796155	284.5723838925019	-66	21/02/24 15:47:08
39	309.2997043904728	289.36813114546595	-69	21/02/24 15:47:08

45	342.3105096677226	291.9842245930836	-68	21/02/24 15:47:09
46	340.76419739931424	294.4321023101609	-65	21/02/24 15:47:09
24	330.2572237413254	276.8419321591195	-67	21/02/24 15:47:09
25	329.08778489613	275.87564892517275	-67	21/02/24 15:47:09
16	327.98603409324727	290.8054485105832	-29	21/02/24 15:47:09
11	327.4246457091771	282.6323525733639	-58	21/02/24 15:47:09
17	323.82998850731616	295.6841920138939	-57	21/02/24 15:47:09
23	323.42288358729223	275.8341630458992	-66	21/02/24 15:47:09
15	321.20664919882535	299.5482975369317	-62	21/02/24 15:47:09
10	321.1177375667231	282.04747788327467	-60	21/02/24 15:47:09
28	319.76429243151256	284.17285383094054	-61	21/02/24 15:47:09
38	316.1636107796155	284.5723838925019	-66	21/02/24 15:47:09
39	309.2997043904728	289.36813114546595	-70	21/02/24 15:47:09

45	342.3105096677226	291.9842245930836	-65	21/02/24 15:47:10
46	340.76419739931424	294.4321023101609	-65	21/02/24 15:47:10
24	330.2572237413254	276.8419321591195	-64	21/02/24 15:47:10
25	329.08778489613	275.87564892517275	-67	21/02/24 15:47:10
16	327.98603409324727	290.8054485105832	-25	21/02/24 15:47:10
11	327.4246457091771	282.6323525733639	-59	21/02/24 15:47:10
17	323.82998850731616	295.6841920138939	-54	21/02/24 15:47:10
23	323.42288358729223	275.8341630458992	-65	21/02/24 15:47:10
15	321.20664919882535	299.5482975369317	-62	21/02/24 15:47:10
10	321.1177375667231	282.04747788327467	-60	21/02/24 15:47:10
28	319.76429243151256	284.17285383094054	-62	21/02/24 15:47:10
38	316.1636107796155	284.5723838925019	-67	21/02/24 15:47:10
39	309.2997043904728	289.36813114546595	-68	21/02/24 15:47:10

45	342.3105096677226	291.9842245930836	-66	21/02/24 15:47:11
46	340.76419739931424	294.4321023101609	-68	21/02/24 15:47:11
24	330.2572237413254	276.8419321591195	-64	21/02/24 15:47:11
25	329.08778489613	275.87564892517275	-67	21/02/24 15:47:11
16	327.98603409324727	290.8054485105832	-29	21/02/24 15:47:11
11	327.4246457091771	282.6323525733639	-56	21/02/24 15:47:11
17	323.82998850731616	295.6841920138939	-57	21/02/24 15:47:11
23	323.42288358729223	275.8341630458992	-67	21/02/24 15:47:11
15	321.20664919882535	299.5482975369317	-64	21/02/24 15:47:11
10	321.1177375667231	282.04747788327467	-64	21/02/24 15:47:11
28	319.76429243151256	284.17285383094054	-63	21/02/24 15:47:11
38	316.1636107796155	284.5723838925019	-63	21/02/24 15:47:11
39	309.2997043904728	289.36813114546595	-69	21/02/24 15:47:11

45	342.3105096677226	291.9842245930836	-68	21/02/24 15:47:12
46	340.76419739931424	294.4321023101609	-64	21/02/24 15:47:12
24	330.2572237413254	276.8419321591195	-66	21/02/24 15:47:12
25	329.08778489613	275.87564892517275	-67	21/02/24 15:47:12
16	327.98603409324727	290.8054485105832	-26	21/02/24 15:47:12
11	327.4246457091771	282.6323525733639	-58	21/02/24 15:47:12
17	323.82998850731616	295.6841920138939	-55	21/02/24 15:47:12
23	323.42288358729223	275.8341630458992	-67	21/02/24 15:47:12
15	321.20664919882535	299.5482975369317	-65	21/02/24 15:47:12
10	321.1177375667231	282.04747788327467	-62	21/02/24 15:47:12
28	319.76429243151256	284.17285383094054	-61	21/02/24 15:47:12
38	316.1636107796155	284.5723838925019	-64	21/02/24 15:47:12
39	309.2997043904728	289.36813114546595	-68	21/02/24 15:47:12

45	342.3105096677226	291.9842245930836	-68	21/02/24 15:47:13
46	340.76419739931424	294.4321023101609	-65	21/02/24 15:47:13
24	330.2572237413254	276.8419321591195	-68	21/02/24 15:47:13
25	329.08778489613	275.87564892517275	-67	21/02/24 15:47:13
16	327.98603409324727	290.8054485105832	-25	21/02/24 15:47:13
11	327.4246457091771	282.6323525733639	-59	21/02/24 15:47:13
17	323.82998850731616	295.6841920138939	-57	21/02/24 15:47:13
23	323.42288358729223	275.8341630458992	-68	21/02/24 15:47:13
15	321.20664919882535	299.5482975369317	-64	21/02/24 15:47:13
10	321.1177375667231	282.04747788327467	-64	21/02/24 15:47:13
28	319.76429243151256	284.17285383094054	-61	21/02/24 15:47:13
38	316.1636107796155	284.5723838925019	-65	21/02/24 15:47:13
39	309.2997043904728	289.36813114546595	-69	21/02/24 15:47:13

45	342.3105096677226	291.9842245930836	-66	21/02/24 15:47:14
46	340.76419739931424	294.4321023101609	-66	21/02/24 15:47:14
24	330.2572237413254	276.8419321591195	-67	21/02/24 15:47:14
25	329.08778489613	275.87564892517275	-66	21/02/24 15:47:14
16	327.98603409324727	290.8054485105832	-25	21/02/24 15:47:14
11	327.4246457091771	282.6323525733639	-60	21/02/24 15:47:14
17	323.82998850731616	295.6841920138939	-55	21/02/24 15:47:14
23	323.42288358729223	275.8341630458992	-65	21/02/24 15:47:14
15	321.20664919882535	299.5482975369317	-64	21/02/24 15:47:14
10	321.1177375667231	282.04747788327467	-61	21/02/24 15:47:14
28	319.76429243151256	284.17285383094054	-60	21/02/24 15:47:14
38	316.1636107796155	284.5723838925019	-64	21/02/24 15:47:14
39	309.2997043904728	289.36813114546595	-69	21/02/24 15:47:14

45	342.3105096677226	291.9842245930836	-68	21/02/24 15:47:15
46	340.76419739931424	294.4321023101609	-65	21/02/24 15:47:15
24	330.2572237413254	276.8419321591195	-67	21/02/24 15:47:15
25	329.08778489613	275.87564892517275	-68	21/02/24 15:47:15
16	327.98603409324727	290.8054485105832	-19	21/02/24 15:47:15
11	327.4246457091771	282.6323525733639	-57	21/02/24 15:47:15
17	323.82998850731616	295.6841920138939	-56	21/02/24 15:47:15
23	323.42288358729223	275.8341630458992	-67	21/02/24 15:47:15
15	321.20664919882535	299.5482975369317	-63	21/02/24 15:47:15
10	321.1177375667231	282.04747788327467	-62	21/02/24 15:47:15
28	319.76429243151256	284.17285383094054	-64	21/02/24 15:47:15
38	316.1636107796155	284.5723838925019	-64	21/02/24 15:47:15
39	309.2997043904728	289.36813114546595	-68	21/02/24 15:47:15

45	342.3105096677226	291.9842245930836	-66	21/02/24 15:47:16
46	340.76419739931424	294.4321023101609	-64	21/02/24 15:47:16
24	330.2572237413254	276.8419321591195	-67	21/02/24 15:47:16
25	329.08778489613	275.87564892517275	-68	21/02/24 15:47:16
16	327.98603409324727	290.8054485105832	-23	21/02/24 15:47:16
11	327.4246457091771	282.6323525733639	-60	21/02/24 15:47:16
17	323.82998850731616	295.6841920138939	-54	21/02/24 15:47:16
23	323.42288358729223	275.8341630458992	-69	21/02/24 15:47:16
15	321.20664919882535	299.5482975369317	-63	21/02/24 15:47:16
10	321.1177375667231	282.04747788327467	-65	21/02/24 15:47:16
28	319.76429243151256	284.17285383094054	-63	21/02/24 15:47:16
38	316.1636107796155	284.5723838925019	-67	21/02/24 15:47:16
39	309.2997043904728	289.36813114546595	-71	21/02/24 15:47:16

45	342.3105096677226	291.9842245930836	-66	21/02/24 15:47:17
46	340.76419739931424	294.4321023101609	-66	21/02/24 15:47:17
24	330.2572237413254	276.8419321591195	-67	21/02/24 15:47:17
25	329.08778489613	275.87564892517275	-67	21/02/24 15:47:17
16	327.98603409324727	290.8054485105832	-22	21/02/24 15:47:17
11	327.4246457091771	282.6323525733639	-58	21/02/24 15:47:17
17	323.82998850731616	295.6841920138939	-56	21/02/24 15:47:17
23	323.42288358729223	275.8341630458992	-65	21/02/24 15:47:17
15	321.20664919882535	299.5482975369317	-62	21/02/24 15:47:17
10	321.1177375667231	282.04747788327467	-62	21/02/24 15:47:17
28	319.76429243151256	284.17285383094054	-63	21/02/24 15:47:17
38	316.1636107796155	284.5723838925019	-66	21/02/24 15:47:17
39	309.2997043904728	289.36813114546595	-68	21/02/24 15:47:17

45	342.3105096677226	291.9842245930836	-68	21/02/24 15:47:18
46	340.76419739931424	294.4321023101609	-66	21/02/24 15:47:18
24	330.2572237413254	276.8419321591195	-68	21/02/24 15:47:18
25	329.08778489613	275.87564892517275	-67	21/02/24 15:47:18
16	327.98603409324727	290.8054485105832	-29	21/02/24 15:47:18
11	327.4246457091771	282.6323525733639	-58	21/02/24 15:47:18
17	323.82998850731616	295.6841920138939	-56	21/02/24 15:47:18
23	323.42288358729223	275.8341630458992	-68	21/02/24 15:47:18
15	321.20664919882535	299.5482975369317	-61	21/02/24 15:47:18
10	321.1177375667231	282.04747788327467	-64	21/02/24 15:47:18
28	319.76429243151256	284.17285383094054	-59	21/02/24 15:47:18
38	316.1636107796155	284.5723838925019	-65	21/02/24 15:47:18
39	309.2997043904728	289.36813114546595	-70	21/02/24 15:47:18

45	342.3105096677226	291.9842245930836	-65	21/02/24 15:47:19
46	340.76419739931424	294.4321023101609	-67	21/02/24 15:47:19
24	330.2572237413254	276.8419321591195	-66	21/02/24 15:47:19
25	329.08778489613	275.87564892517275	-67	21/02/24 15:47:19
16	327.98603409324727	290.8054485105832	-30	21/02/24 15:47:19
11	327.4246457091771	282.6323525733639	-58	21/02/24 15:47:19
17	323.82998850731616	295.6841920138939	-55	21/02/24 15:47:19
23	323.42288358729223	275.8341630458992	-67	21/02/24 15:47:19
15	321.20664919882535	299.5482975369317	-62	21/02/24 15:47:19
10	321.1177375667231	282.04747788327467	-62	21/02/24 15:47:19
28	319.76429243151256	284.17285383094054	-61	21/02/24 15:47:19
38	316.1636107796155	284.5723838925019	-62	21/02/24 15:47:19
39	309.2997043904728	289.36813114546595	-69	21/02/24 15:47:19

45	342.3105096677226	291.9842245930836	-66	21/02/24 15:47:20
46	340.76419739931424	294.4321023101609	-66	21/02/24 15:47:20
24	330.2572237413254	276.8419321591195	-66	21/02/24 15:47:20
25	329.08778489613	275.87564892517275	-68	21/02/24 15:47:20
16	327.98603409324727	290.8054485105832	-38	21/02/24 15:47:20
11	327.4246457091771	282.6323525733639	-60	21/02/24 15:47:20
17	323.82998850731616	295.6841920138939	-53	21/02/24 15:47:20
23	323.42288358729223	275.8341630458992	-67	21/02/24 15:47:20
15	321.20664919882535	299.5482975369317	-62	21/02/24 15:47:20
10	321.1177375667231	282.04747788327467	-62	21/02/24 15:47:20
28	319.76429243151256	284.17285383094054	-59	21/02/24 15:47:20
38	316.1636107796155	284.5723838925019	-62	21/02/24 15:47:20
39	309.2997043904728	289.36813114546595	-70	21/02/24 15:47:20

45	342.3105096677226	291.9842245930836	-66	21/02/24 15:47:21
46	340.76419739931424	294.4321023101609	-66	21/02/24 15:47:21
24	330.2572237413254	276.8419321591195	-65	21/02/24 15:47:21
25	329.08778489613	275.87564892517275	-66	21/02/24 15:47:21
16	327.98603409324727	290.8054485105832	-36	21/02/24 15:47:21
11	327.4246457091771	282.6323525733639	-60	21/02/24 15:47:21
17	323.82998850731616	295.6841920138939	-57	21/02/24 15:47:21
23	323.42288358729223	275.8341630458992	-68	21/02/24 15:47:21
15	321.20664919882535	299.5482975369317	-64	21/02/24 15:47:21
10	321.1177375667231	282.04747788327467	-62	21/02/24 15:47:21
28	319.76429243151256	284.17285383094054	-58	21/02/24 15:47:21
38	316.1636107796155	284.5723838925019	-64	21/02/24 15:47:21
39	309.2997043904728	289.36813114546595	-69	21/02/24 15:47:21

45	342.3105096677226	291.9842245930836	-68	21/02/24 15:47:22
46	340.76419739931424	294.4321023101609	-68	21/02/24 15:47:22
24	330.2572237413254	276.8419321591195	-68	21/02/24 15:47:22
25	329.08778489613	275.87564892517275	-68	21/02/24 15:47:22
16	327.98603409324727	290.8054485105832	-38	21/02/24 15:47:22
11	327.4246457091771	282.6323525733639	-57	21/02/24 15:47:22
17	323.82998850731616	295.6841920138939	-55	21/02/24 15:47:22
23	323.42288358729223	275.8341630458992	-67	21/02/24 15:47:22
15	321.20664919882535	299.5482975369317	-63	21/02/24 15:47:22
10	321.1177375667231	282.04747788327467	-62	21/02/24 15:47:22
28	319.76429243151256	284.17285383094054	-60	21/02/24 15:47:22
38	316.1636107796155	284.5723838925019	-64	21/02/24 15:47:22
39	309.2997043904728	289.36813114546595	-66	21/02/24 15:47:22

45	342.3105096677226	291.9842245930836	-66	21/02/24 15:47:23
46	340.76419739931424	294.4321023101609	-65	21/02/24 15:47:23
24	330.2572237413254	276.8419321591195	-66	21/02/24 15:47:23
25	329.08778489613	275.87564892517275	-68	21/02/24 15:47:23
16	327.98603409324727	290.8054485105832	-37	21/02/24 15:47:23
11	327.4246457091771	282.6323525733639	-58	21/02/24 15:47:23
17	323.82998850731616	295.6841920138939	-53	21/02/24 15:47:23
23	323.42288358729223	275.8341630458992	-69	21/02/24 15:47:23
15	321.20664919882535	299.5482975369317	-62	21/02/24 15:47:23
10	321.1177375667231	282.04747788327467	-62	21/02/24 15:47:23
28	319.76429243151256	284.17285383094054	-62	21/02/24 15:47:23
38	316.1636107796155	284.5723838925019	-66	21/02/24 15:47:23
39	309.2997043904728	289.36813114546595	-69	21/02/24 15:47:23

45	342.3105096677226	291.9842245930836	-69	21/02/24 15:47:24
46	340.76419739931424	294.4321023101609	-66	21/02/24 15:47:24
24	330.2572237413254	276.8419321591195	-68	21/02/24 15:47:24
25	329.08778489613	275.87564892517275	-68	21/02/24 15:47:24
16	327.98603409324727	290.8054485105832	-38	21/02/24 15:47:24
11	327.4246457091771	282.6323525733639	-61	21/02/24 15:47:24
17	323.82998850731616	295.6841920138939	-50	21/02/24 15:47:24
23	323.42288358729223	275.8341630458992	-67	21/02/24 15:47:24
15	321.20664919882535	299.5482975369317	-60	21/02/24 15:47:24
10	321.1177375667231	282.04747788327467	-62	21/02/24 15:47:24
28	319.76429243151256	284.17285383094054	-62	21/02/24 15:47:24
38	316.1636107796155	284.5723838925019	-65	21/02/24 15:47:24
39	309.2997043904728	289.36813114546595	-69	21/02/24 15:47:24

45	342.3105096677226	291.9842245930836	-67	21/02/24 15:47:25
46	340.76419739931424	294.4321023101609	-65	21/02/24 15:47:25
24	330.2572237413254	276.8419321591195	-67	21/02/24 15:47:25
25	329.08778489613	275.87564892517275	-69	21/02/24 15:47:25
16	327.98603409324727	290.8054485105832	-41	21/02/24 15:47:25
11	327.4246457091771	282.6323525733639	-59	21/02/24 15:47:25
17	323.82998850731616	295.6841920138939	-49	21/02/24 15:47:25
23	323.42288358729223	275.8341630458992	-66	21/02/24 15:47:25
15	321.20664919882535	299.5482975369317	-62	21/02/24 15:47:25
10	321.1177375667231	282.04747788327467	-62	21/02/24 15:47:25
28	319.76429243151256	284.17285383094054	-63	21/02/24 15:47:25
38	316.1636107796155	284.5723838925019	-65	21/02/24 15:47:25
39	309.2997043904728	289.36813114546595	-70	21/02/24 15:47:25

45	342.3105096677226	291.9842245930836	-67	21/02/24 15:47:26
46	340.76419739931424	294.4321023101609	-66	21/02/24 15:47:26
24	330.2572237413254	276.8419321591195	-66	21/02/24 15:47:26
25	329.08778489613	275.87564892517275	-66	21/02/24 15:47:26
16	327.98603409324727	290.8054485105832	-43	21/02/24 15:47:26
11	327.4246457091771	282.6323525733639	-62	21/02/24 15:47:26
17	323.82998850731616	295.6841920138939	-51	21/02/24 15:47:26
23	323.42288358729223	275.8341630458992	-70	21/02/24 15:47:26
15	321.20664919882535	299.5482975369317	-60	21/02/24 15:47:26
10	321.1177375667231	282.04747788327467	-63	21/02/24 15:47:26
28	319.76429243151256	284.17285383094054	-60	21/02/24 15:47:26
38	316.1636107796155	284.5723838925019	-62	21/02/24 15:47:26
39	309.2997043904728	289.36813114546595	-68	21/02/24 15:47:26

45	342.3105096677226	291.9842245930836	-68	21/02/24 15:47:27
46	340.76419739931424	294.4321023101609	-68	21/02/24 15:47:27
24	330.2572237413254	276.8419321591195	-67	21/02/24 15:47:27
25	329.08778489613	275.87564892517275	-68	21/02/24 15:47:27
16	327.98603409324727	290.8054485105832	-44	21/02/24 15:47:27
11	327.4246457091771	282.6323525733639	-62	21/02/24 15:47:27
17	323.82998850731616	295.6841920138939	-49	21/02/24 15:47:27
23	323.42288358729223	275.8341630458992	-69	21/02/24 15:47:27
15	321.20664919882535	299.5482975369317	-59	21/02/24 15:47:27
10	321.1177375667231	282.04747788327467	-61	21/02/24 15:47:27
28	319.76429243151256	284.17285383094054	-62	21/02/24 15:47:27
38	316.1636107796155	284.5723838925019	-63	21/02/24 15:47:27
39	309.2997043904728	289.36813114546595	-66	21/02/24 15:47:27

45	342.3105096677226	291.9842245930836	-68	21/02/24 15:47:28
46	340.76419739931424	294.4321023101609	-69	21/02/24 15:47:28
24	330.2572237413254	276.8419321591195	-65	21/02/24 15:47:28
25	329.08778489613	275.87564892517275	-67	21/02/24 15:47:28
16	327.98603409324727	290.8054485105832	-45	21/02/24 15:47:28
11	327.4246457091771	282.6323525733639	-59	21/02/24 15:47:28
17	323.82998850731616	295.6841920138939	-53	21/02/24 15:47:28
23	323.42288358729223	275.8341630458992	-65	21/02/24 15:47:28
15	321.20664919882535	299.5482975369317	-62	21/02/24 15:47:28
10	321.1177375667231	282.04747788327467	-60	21/02/24 15:47:28
28	319.76429243151256	284.17285383094054	-58	21/02/24 15:47:28
38	316.1636107796155	284.5723838925019	-62	21/02/24 15:47:28
39	309.2997043904728	289.36813114546595	-70	21/02/24 15:47:28
18	305.6388344486073	288.8275841605686	-69	21/02/24 15:47:28

45	342.3105096677226	291.9842245930836	-71	21/02/24 15:47:29
46	340.76419739931424	294.4321023101609	-67	21/02/24 15:47:29
24	330.2572237413254	276.8419321591195	-66	21/02/24 15:47:29
25	329.08778489613	275.87564892517275	-65	21/02/24 15:47:29
16	327.98603409324727	290.8054485105832	-48	21/02/24 15:47:29
11	327.4246457091771	282.6323525733639	-57	21/02/24 15:47:29
17	323.82998850731616	295.6841920138939	-55	21/02/24 15:47:29
7	334.07657006354464	270.8835908324035	-72	21/02/24 15:47:29
23	323.42288358729223	275.8341630458992	-63	21/02/24 15:47:29
15	321.20664919882535	299.5482975369317	-65	21/02/24 15:47:29
10	321.1177375667231	282.04747788327467	-57	21/02/24 15:47:29
28	319.76429243151256	284.17285383094054	-57	21/02/24 15:47:29
38	316.1636107796155	284.5723838925019	-61	21/02/24 15:47:29
39	309.2997043904728	289.36813114546595	-69	21/02/24 15:47:29
18	305.6388344486073	288.8275841605686	-71	21/02/24 15:47:29

45	342.3105096677226	291.9842245930836	-71	21/02/24 15:47:30
46	340.76419739931424	294.4321023101609	-67	21/02/24 15:47:30
8	337.0569612312978	272.24137590202855	-69	21/02/24 15:47:30
24	330.2572237413254	276.8419321591195	-64	21/02/24 15:47:30
25	329.08778489613	275.87564892517275	-65	21/02/24 15:47:30
16	327.98603409324727	290.8054485105832	-51	21/02/24 15:47:30
11	327.4246457091771	282.6323525733639	-51	21/02/24 15:47:30
17	323.82998850731616	295.6841920138939	-62	21/02/24 15:47:30
7	334.07657006354464	270.8835908324035	-71	21/02/24 15:47:30
30	327.70079256672074	268.3508487639297	-71	21/02/24 15:47:30
23	323.42288358729223	275.8341630458992	-62	21/02/24 15:47:30
15	321.20664919882535	299.5482975369317	-67	21/02/24 15:47:30
10	321.1177375667231	282.04747788327467	-54	21/02/24 15:47:30
28	319.76429243151256	284.17285383094054	-56	21/02/24 15:47:30
38	316.1636107796155	284.5723838925019	-59	21/02/24 15:47:30
39	309.2997043904728	289.36813114546595	-70	21/02/24 15:47:30
44	307.83683034460904	277.09769127798097	-70	21/02/24 15:47:30
18	305.6388344486073	288.8275841605686	-71	21/02/24 15:47:30

45	342.3105096677226	291.9842245930836	-68	21/02/24 15:47:31
46	340.76419739931424	294.4321023101609	-70	21/02/24 15:47:31
8	337.0569612312978	272.24137590202855	-69	21/02/24 15:47:31
24	330.2572237413254	276.8419321591195	-60	21/02/24 15:47:31
25	329.08778489613	275.87564892517275	-60	21/02/24 15:47:31
16	327.98603409324727	290.8054485105832	-54	21/02/24 15:47:31
11	327.4246457091771	282.6323525733639	-47	21/02/24 15:47:31
17	323.82998850731616	295.6841920138939	-63	21/02/24 15:47:31
7	334.07657006354464	270.8835908324035	-66	21/02/24 15:47:31
30	327.70079256672074	268.3508487639297	-67	21/02/24 15:47:31
23	323.42288358729223	275.8341630458992	-60	21/02/24 15:47:31
15	321.20664919882535	299.5482975369317	-69	21/02/24 15:47:31
10	321.1177375667231	282.04747788327467	-52	21/02/24 15:47:31
28	319.76429243151256	284.17285383094054	-55	21/02/24 15:47:31
38	316.1636107796155	284.5723838925019	-62	21/02/24 15:47:31
39	309.2997043904728	289.36813114546595	-66	21/02/24 15:47:31
44	307.83683034460904	277.09769127798097	-72	21/02/24 15:47:31

45	342.3105096677226	291.9842245930836	-69	21/02/24 15:47:32
46	340.76419739931424	294.4321023101609	-72	21/02/24 15:47:32
8	337.0569612312978	272.24137590202855	-67	21/02/24 15:47:32
24	330.2572237413254	276.8419321591195	-58	21/02/24 15:47:32
25	329.08778489613	275.87564892517275	-59	21/02/24 15:47:32
16	327.98603409324727	290.8054485105832	-57	21/02/24 15:47:32
11	327.4246457091771	282.6323525733639	-41	21/02/24 15:47:32
17	323.82998850731616	295.6841920138939	-65	21/02/24 15:47:32
7	334.07657006354464	270.8835908324035	-68	21/02/24 15:47:32
30	327.70079256672074	268.3508487639297	-67	21/02/24 15:47:32
21	334.5994402908936	265.9434918767382	-72	21/02/24 15:47:32
29	324.8804385762518	264.6870431160569	-70	21/02/24 15:47:32
23	323.42288358729223	275.8341630458992	-56	21/02/24 15:47:32
15	321.20664919882535	299.5482975369317	-70	21/02/24 15:47:32
10	321.1177375667231	282.04747788327467	-50	21/02/24 15:47:32
28	319.76429243151256	284.17285383094054	-55	21/02/24 15:47:32
38	316.1636107796155	284.5723838925019	-62	21/02/24 15:47:32
42	315.6556041264745	266.0029600774402	-72	21/02/24 15:47:32
39	309.2997043904728	289.36813114546595	-67	21/02/24 15:47:32
44	307.83683034460904	277.09769127798097	-71	21/02/24 15:47:32

45	342.3105096677226	291.9842245930836	-68	21/02/24 15:47:33
46	340.76419739931424	294.4321023101609	-67	21/02/24 15:47:33
8	337.0569612312978	272.24137590202855	-66	21/02/24 15:47:33
24	330.2572237413254	276.8419321591195	-55	21/02/24 15:47:33
25	329.08778489613	275.87564892517275	-57	21/02/24 15:47:33
16	327.98603409324727	290.8054485105832	-59	21/02/24 15:47:33
11	327.4246457091771	282.6323525733639	-17	21/02/24 15:47:33
17	323.82998850731616	295.6841920138939	-65	21/02/24 15:47:33
7	334.07657006354464	270.8835908324035	-64	21/02/24 15:47:33
30	327.70079256672074	268.3508487639297	-65	21/02/24 15:47:33
21	334.5994402908936	265.9434918767382	-67	21/02/24 15:47:33
20	334.99735462161357	264.77807460530994	-68	21/02/24 15:47:33
29	324.8804385762518	264.6870431160569	-68	21/02/24 15:47:33
23	323.42288358729223	275.8341630458992	-59	21/02/24 15:47:33
15	321.20664919882535	299.5482975369317	-67	21/02/24 15:47:33
10	321.1177375667231	282.04747788327467	-55	21/02/24 15:47:33
28	319.76429243151256	284.17285383094054	-59	21/02/24 15:47:33
38	316.1636107796155	284.5723838925019	-63	21/02/24 15:47:33
39	309.2997043904728	289.36813114546595	-70	21/02/24 15:47:33

45	342.3105096677226	291.9842245930836	-66	21/02/24 15:47:34
46	340.76419739931424	294.4321023101609	-66	21/02/24 15:47:34
8	337.0569612312978	272.24137590202855	-64	21/02/24 15:47:34
24	330.2572237413254	276.8419321591195	-56	21/02/24 15:47:34
25	329.08778489613	275.87564892517275	-57	21/02/24 15:47:34
16	327.98603409324727	290.8054485105832	-58	21/02/24 15:47:34
11	327.4246457091771	282.6323525733639	-43	21/02/24 15:47:34
17	323.82998850731616	295.6841920138939	-67	21/02/24 15:47:34
7	334.07657006354464	270.8835908324035	-65	21/02/24 15:47:34
30	327.70079256672074	268.3508487639297	-65	21/02/24 15:47:34
13	342.0775229118143	267.91244197819304	-68	21/02/24 15:47:34
21	334.5994402908936	265.9434918767382	-71	21/02/24 15:47:34
20	334.99735462161357	264.77807460530994	-68	21/02/24 15:47:34
29	324.8804385762518	264.6870431160569	-72	21/02/24 15:47:34
23	323.42288358729223	275.8341630458992	-62	21/02/24 15:47:34
15	321.20664919882535	299.5482975369317	-68	21/02/24 15:47:34
10	321.1177375667231	282.04747788327467	-58	21/02/24 15:47:34
28	319.76429243151256	284.17285383094054	-61	21/02/24 15:47:34
38	316.1636107796155	284.5723838925019	-65	21/02/24 15:47:34

45	342.3105096677226	291.9842245930836	-65	21/02/24 15:47:35
46	340.76419739931424	294.4321023101609	-68	21/02/24 15:47:35
8	337.0569612312978	272.24137590202855	-62	21/02/24 15:47:35
24	330.2572237413254	276.8419321591195	-55	21/02/24 15:47:35
25	329.08778489613	275.87564892517275	-59	21/02/24 15:47:35
16	327.98603409324727	290.8054485105832	-59	21/02/24 15:47:35
11	327.4246457091771	282.6323525733639	-52	21/02/24 15:47:35
17	323.82998850731616	295.6841920138939	-68	21/02/24 15:47:35
7	334.07657006354464	270.8835908324035	-65	21/02/24 15:47:35
30	327.70079256672074	268.3508487639297	-67	21/02/24 15:47:35
13	342.0775229118143	267.91244197819304	-70	21/02/24 15:47:35
21	334.5994402908936	265.9434918767382	-67	21/02/24 15:47:35
14	341.6082252010515	265.6547772450898	-71	21/02/24 15:47:35
20	334.99735462161357	264.77807460530994	-69	21/02/24 15:47:35
29	324.8804385762518	264.6870431160569	-70	21/02/24 15:47:35
23	323.42288358729223	275.8341630458992	-63	21/02/24 15:47:35
10	321.1177375667231	282.04747788327467	-61	21/02/24 15:47:35
28	319.76429243151256	284.17285383094054	-64	21/02/24 15:47:35
38	316.1636107796155	284.5723838925019	-68	21/02/24 15:47:35

45	342.3105096677226	291.9842245930836	-65	21/02/24 15:47:36
46	340.76419739931424	294.4321023101609	-66	21/02/24 15:47:36
8	337.0569612312978	272.24137590202855	-63	21/02/24 15:47:36
24	330.2572237413254	276.8419321591195	-56	21/02/24 15:47:36
25	329.08778489613	275.87564892517275	-57	21/02/24 15:47:36
16	327.98603409324727	290.8054485105832	-62	21/02/24 15:47:36
11	327.4246457091771	282.6323525733639	-58	21/02/24 15:47:36
17	323.82998850731616	295.6841920138939	-67	21/02/24 15:47:36
7	334.07657006354464	270.8835908324035	-61	21/02/24 15:47:36
30	327.70079256672074	268.3508487639297	-68	21/02/24 15:47:36
31	346.4179037622539	268.10202267794875	-69	21/02/24 15:47:36
13	342.0775229118143	267.91244197819304	-69	21/02/24 15:47:36
21	334.5994402908936	265.9434918767382	-66	21/02/24 15:47:36
14	341.6082252010515	265.6547772450898	-69	21/02/24 15:47:36
20	334.99735462161357	264.77807460530994	-69	21/02/24 15:47:36
29	324.8804385762518	264.6870431160569	-69	21/02/24 15:47:36
23	323.42288358729223	275.8341630458992	-63	21/02/24 15:47:36
10	321.1177375667231	282.04747788327467	-63	21/02/24 15:47:36
28	319.76429243151256	284.17285383094054	-66	21/02/24 15:47:36
38	316.1636107796155	284.5723838925019	-70	21/02/24 15:47:36

47	353.57917457908314	286.3943403818769	-71	21/02/24 15:47:37
22	353.27733584284437	275.76541045955213	-69	21/02/24 15:47:37
45	342.3105096677226	291.9842245930836	-64	21/02/24 15:47:37
46	340.76419739931424	294.4321023101609	-66	21/02/24 15:47:37
8	337.0569612312978	272.24137590202855	-62	21/02/24 15:47:37
24	330.2572237413254	276.8419321591195	-59	21/02/24 15:47:37
25	329.08778489613	275.87564892517275	-60	21/02/24 15:47:37
16	327.98603409324727	290.8054485105832	-65	21/02/24 15:47:37
11	327.4246457091771	282.6323525733639	-60	21/02/24 15:47:37
17	323.82998850731616	295.6841920138939	-70	21/02/24 15:47:37
7	334.07657006354464	270.8835908324035	-63	21/02/24 15:47:37
30	327.70079256672074	268.3508487639297	-67	21/02/24 15:47:37
31	346.4179037622539	268.10202267794875	-68	21/02/24 15:47:37
13	342.0775229118143	267.91244197819304	-67	21/02/24 15:47:37
21	334.5994402908936	265.9434918767382	-67	21/02/24 15:47:37
14	341.6082252010515	265.6547772450898	-70	21/02/24 15:47:37
20	334.99735462161357	264.77807460530994	-68	21/02/24 15:47:37
29	324.8804385762518	264.6870431160569	-69	21/02/24 15:47:37
23	323.42288358729223	275.8341630458992	-67	21/02/24 15:47:37
10	321.1177375667231	282.04747788327467	-68	21/02/24 15:47:37
28	319.76429243151256	284.17285383094054	-70	21/02/24 15:47:37
38	316.1636107796155	284.5723838925019	-70	21/02/24 15:47:37

47	353.57917457908314	286.3943403818769	-66	21/02/24 15:47:38
22	353.27733584284437	275.76541045955213	-69	21/02/24 15:47:38
45	342.3105096677226	291.9842245930836	-62	21/02/24 15:47:38
46	340.76419739931424	294.4321023101609	-64	21/02/24 15:47:38
8	337.0569612312978	272.24137590202855	-61	21/02/24 15:47:38
24	330.2572237413254	276.8419321591195	-60	21/02/24 15:47:38
25	329.08778489613	275.87564892517275	-60	21/02/24 15:47:38
16	327.98603409324727	290.8054485105832	-65	21/02/24 15:47:38
11	327.4246457091771	282.6323525733639	-61	21/02/24 15:47:38
7	334.07657006354464	270.8835908324035	-62	21/02/24 15:47:38
30	327.70079256672074	268.3508487639297	-67	21/02/24 15:47:38
31	346.4179037622539	268.10202267794875	-69	21/02/24 15:47:38
13	342.0775229118143	267.91244197819304	-66	21/02/24 15:47:38
21	334.5994402908936	265.9434918767382	-68	21/02/24 15:47:38
14	341.6082252010515	265.6547772450898	-68	21/02/24 15:47:38
20	334.99735462161357	264.77807460530994	-69	21/02/24 15:47:38
23	323.42288358729223	275.8341630458992	-67	21/02/24 15:47:38
10	321.1177375667231	282.04747788327467	-67	21/02/24 15:47:38
28	319.76429243151256	284.17285383094054	-69	21/02/24 15:47:38

47	353.57917457908314	286.3943403818769	-67	21/02/24 15:47:39
22	353.27733584284437	275.76541045955213	-64	21/02/24 15:47:39
45	342.3105096677226	291.9842245930836	-65	21/02/24 15:47:39
46	340.76419739931424	294.4321023101609	-67	21/02/24 15:47:39
8	337.0569612312978	272.24137590202855	-59	21/02/24 15:47:39
24	330.2572237413254	276.8419321591195	-61	21/02/24 15:47:39
25	329.08778489613	275.87564892517275	-64	21/02/24 15:47:39
16	327.98603409324727	290.8054485105832	-69	21/02/24 15:47:39
11	327.4246457091771	282.6323525733639	-65	21/02/24 15:47:39
7	334.07657006354464	270.8835908324035	-64	21/02/24 15:47:39
30	327.70079256672074	268.3508487639297	-66	21/02/24 15:47:39
31	346.4179037622539	268.10202267794875	-65	21/02/24 15:47:39
13	342.0775229118143	267.91244197819304	-63	21/02/24 15:47:39
21	334.5994402908936	265.9434918767382	-66	21/02/24 15:47:39
14	341.6082252010515	265.6547772450898	-69	21/02/24 15:47:39
20	334.99735462161357	264.77807460530994	-69	21/02/24 15:47:39
23	323.42288358729223	275.8341630458992	-70	21/02/24 15:47:39
10	321.1177375667231	282.04747788327467	-69	21/02/24 15:47:39

37	359.5903712498935	284.92420131943135	-70	21/02/24 15:47:40
40	360.29771601412074	275.17301637315114	-71	21/02/24 15:47:40
47	353.57917457908314	286.3943403818769	-67	21/02/24 15:47:40
22	353.27733584284437	275.76541045955213	-63	21/02/24 15:47:40
45	342.3105096677226	291.9842245930836	-64	21/02/24 15:47:40
46	340.76419739931424	294.4321023101609	-67	21/02/24 15:47:40
8	337.0569612312978	272.24137590202855	-61	21/02/24 15:47:40
24	330.2572237413254	276.8419321591195	-63	21/02/24 15:47:40
25	329.08778489613	275.87564892517275	-65	21/02/24 15:47:40
16	327.98603409324727	290.8054485105832	-70	21/02/24 15:47:40
11	327.4246457091771	282.6323525733639	-68	21/02/24 15:47:40
7	334.07657006354464	270.8835908324035	-65	21/02/24 15:47:40
32	356.7839379367616	268.70688981904533	-69	21/02/24 15:47:40
30	327.70079256672074	268.3508487639297	-69	21/02/24 15:47:40
31	346.4179037622539	268.10202267794875	-64	21/02/24 15:47:40
13	342.0775229118143	267.91244197819304	-62	21/02/24 15:47:40
21	334.5994402908936	265.9434918767382	-69	21/02/24 15:47:40
14	341.6082252010515	265.6547772450898	-64	21/02/24 15:47:40
20	334.99735462161357	264.77807460530994	-67	21/02/24 15:47:40
23	323.42288358729223	275.8341630458992	-70	21/02/24 15:47:40

37	359.5903712498935	284.92420131943135	-69	21/02/24 15:47:41
40	360.29771601412074	275.17301637315114	-66	21/02/24 15:47:41
47	353.57917457908314	286.3943403818769	-65	21/02/24 15:47:41
22	353.27733584284437	275.76541045955213	-62	21/02/24 15:47:41
45	342.3105096677226	291.9842245930836	-64	21/02/24 15:47:41
46	340.76419739931424	294.4321023101609	-66	21/02/24 15:47:41
8	337.0569612312978	272.24137590202855	-61	21/02/24 15:47:41
24	330.2572237413254	276.8419321591195	-65	21/02/24 15:47:41
25	329.08778489613	275.87564892517275	-66	21/02/24 15:47:41
16	327.98603409324727	290.8054485105832	-69	21/02/24 15:47:41
11	327.4246457091771	282.6323525733639	-69	21/02/24 15:47:41
7	334.07657006354464	270.8835908324035	-64	21/02/24 15:47:41
33	361.5531569646988	270.2693072733871	-69	21/02/24 15:47:41
32	356.7839379367616	268.70688981904533	-68	21/02/24 15:47:41
30	327.70079256672074	268.3508487639297	-70	21/02/24 15:47:41
31	346.4179037622539	268.10202267794875	-62	21/02/24 15:47:41
13	342.0775229118143	267.91244197819304	-65	21/02/24 15:47:41
21	334.5994402908936	265.9434918767382	-68	21/02/24 15:47:41
14	341.6082252010515	265.6547772450898	-66	21/02/24 15:47:41
20	334.99735462161357	264.77807460530994	-70	21/02/24 15:47:41

37	359.5903712498935	284.92420131943135	-67	21/02/24 15:47:42
40	360.29771601412074	275.17301637315114	-66	21/02/24 15:47:42
47	353.57917457908314	286.3943403818769	-64	21/02/24 15:47:42
22	353.27733584284437	275.76541045955213	-58	21/02/24 15:47:42
45	342.3105096677226	291.9842245930836	-68	21/02/24 15:47:42
46	340.76419739931424	294.4321023101609	-67	21/02/24 15:47:42
8	337.0569612312978	272.24137590202855	-60	21/02/24 15:47:42
24	330.2572237413254	276.8419321591195	-67	21/02/24 15:47:42
25	329.08778489613	275.87564892517275	-67	21/02/24 15:47:42
11	327.4246457091771	282.6323525733639	-70	21/02/24 15:47:42
7	334.07657006354464	270.8835908324035	-64	21/02/24 15:47:42
33	361.5531569646988	270.2693072733871	-68	21/02/24 15:47:42
32	356.7839379367616	268.70688981904533	-65	21/02/24 15:47:42
30	327.70079256672074	268.3508487639297	-69	21/02/24 15:47:42
31	346.4179037622539	268.10202267794875	-61	21/02/24 15:47:42
13	342.0775229118143	267.91244197819304	-64	21/02/24 15:47:42
21	334.5994402908936	265.9434918767382	-67	21/02/24 15:47:42
14	341.6082252010515	265.6547772450898	-67	21/02/24 15:47:42
20	334.99735462161357	264.77807460530994	-70	21/02/24 15:47:42

37	359.5903712498935	284.92420131943135	-69	21/02/24 15:47:43
40	360.29771601412074	275.17301637315114	-67	21/02/24 15:47:43
47	353.57917457908314	286.3943403818769	-62	21/02/24 15:47:43
22	353.27733584284437	275.76541045955213	-61	21/02/24 15:47:43
45	342.3105096677226	291.9842245930836	-65	21/02/24 15:47:43
46	340.76419739931424	294.4321023101609	-67	21/02/24 15:47:43
8	337.0569612312978	272.24137590202855	-62	21/02/24 15:47:43
24	330.2572237413254	276.8419321591195	-68	21/02/24 15:47:43
25	329.08778489613	275.87564892517275	-68	21/02/24 15:47:43
11	327.4246457091771	282.6323525733639	-70	21/02/24 15:47:43
7	334.07657006354464	270.8835908324035	-63	21/02/24 15:47:43
33	361.5531569646988	270.2693072733871	-68	21/02/24 15:47:43
32	356.7839379367616	268.70688981904533	-66	21/02/24 15:47:43
30	327.70079256672074	268.3508487639297	-70	21/02/24 15:47:43
31	346.4179037622539	268.10202267794875	-60	21/02/24 15:47:43
13	342.0775229118143	267.91244197819304	-63	21/02/24 15:47:43
21	334.5994402908936	265.9434918767382	-67	21/02/24 15:47:43
14	341.6082252010515	265.6547772450898	-64	21/02/24 15:47:43
20	334.99735462161357	264.77807460530994	-69	21/02/24 15:47:43

37	359.5903712498935	284.92420131943135	-66	21/02/24 15:47:44
40	360.29771601412074	275.17301637315114	-68	21/02/24 15:47:44
47	353.57917457908314	286.3943403818769	-65	21/02/24 15:47:44
22	353.27733584284437	275.76541045955213	-60	21/02/24 15:47:44
45	342.3105096677226	291.9842245930836	-66	21/02/24 15:47:44
46	340.76419739931424	294.4321023101609	-70	21/02/24 15:47:44
8	337.0569612312978	272.24137590202855	-61	21/02/24 15:47:44
24	330.2572237413254	276.8419321591195	-65	21/02/24 15:47:44
25	329.08778489613	275.87564892517275	-67	21/02/24 15:47:44
11	327.4246457091771	282.6323525733639	-68	21/02/24 15:47:44
7	334.07657006354464	270.8835908324035	-65	21/02/24 15:47:44
33	361.5531569646988	270.2693072733871	-70	21/02/24 15:47:44
32	356.7839379367616	268.70688981904533	-66	21/02/24 15:47:44
30	327.70079256672074	268.3508487639297	-72	21/02/24 15:47:44
31	346.4179037622539	268.10202267794875	-60	21/02/24 15:47:44
13	342.0775229118143	267.91244197819304	-62	21/02/24 15:47:44
21	334.5994402908936	265.9434918767382	-67	21/02/24 15:47:44
14	341.6082252010515	265.6547772450898	-65	21/02/24 15:47:44
20	334.99735462161357	264.77807460530994	-67	21/02/24 15:47:44

37	359.5903712498935	284.92420131943135	-67	21/02/24 15:47:45
40	360.29771601412074	275.17301637315114	-69	21/02/24 15:47:45
47	353.57917457908314	286.3943403818769	-65	21/02/24 15:47:45
22	353.27733584284437	275.76541045955213	-62	21/02/24 15:47:45
45	342.3105096677226	291.9842245930836	-65	21/02/24 15:47:45
46	340.76419739931424	294.4321023101609	-69	21/02/24 15:47:45
8	337.0569612312978	272.24137590202855	-59	21/02/24 15:47:45
24	330.2572237413254	276.8419321591195	-64	21/02/24 15:47:45
25	329.08778489613	275.87564892517275	-68	21/02/24 15:47:45
11	327.4246457091771	282.6323525733639	-70	21/02/24 15:47:45
7	334.07657006354464	270.8835908324035	-64	21/02/24 15:47:45
33	361.5531569646988	270.2693072733871	-72	21/02/24 15:47:45
32	356.7839379367616	268.70688981904533	-67	21/02/24 15:47:45
30	327.70079256672074	268.3508487639297	-69	21/02/24 15:47:45
31	346.4179037622539	268.10202267794875	-64	21/02/24 15:47:45
13	342.0775229118143	267.91244197819304	-62	21/02/24 15:47:45
21	334.5994402908936	265.9434918767382	-66	21/02/24 15:47:45
14	341.6082252010515	265.6547772450898	-67	21/02/24 15:47:45
20	334.99735462161357	264.77807460530994	-68	21/02/24 15:47:45

27	361.7760445803703	289.2690199455797	-72	21/02/24 15:47:46
37	359.5903712498935	284.92420131943135	-66	21/02/24 15:47:46
40	360.29771601412074	275.17301637315114	-69	21/02/24 15:47:46
47	353.57917457908314	286.3943403818769	-61	21/02/24 15:47:46
22	353.27733584284437	275.76541045955213	-60	21/02/24 15:47:46
45	342.3105096677226	291.9842245930836	-66	21/02/24 15:47:46
46	340.76419739931424	294.4321023101609	-69	21/02/24 15:47:46
8	337.0569612312978	272.24137590202855	-62	21/02/24 15:47:46
24	330.2572237413254	276.8419321591195	-68	21/02/24 15:47:46
25	329.08778489613	275.87564892517275	-69	21/02/24 15:47:46
11	327.4246457091771	282.6323525733639	-67	21/02/24 15:47:46
7	334.07657006354464	270.8835908324035	-66	21/02/24 15:47:46
33	361.5531569646988	270.2693072733871	-69	21/02/24 15:47:46
32	356.7839379367616	268.70688981904533	-69	21/02/24 15:47:46
31	346.4179037622539	268.10202267794875	-62	21/02/24 15:47:46
13	342.0775229118143	267.91244197819304	-64	21/02/24 15:47:46
21	334.5994402908936	265.9434918767382	-69	21/02/24 15:47:46
14	341.6082252010515	265.6547772450898	-68	21/02/24 15:47:46
20	334.99735462161357	264.77807460530994	-68	21/02/24 15:47:46

27	361.7760445803703	289.2690199455797	-70	21/02/24 15:47:47
37	359.5903712498935	284.92420131943135	-65	21/02/24 15:47:47
40	360.29771601412074	275.17301637315114	-67	21/02/24 15:47:47
47	353.57917457908314	286.3943403818769	-63	21/02/24 15:47:47
22	353.27733584284437	275.76541045955213	-60	21/02/24 15:47:47
45	342.3105096677226	291.9842245930836	-64	21/02/24 15:47:47
46	340.76419739931424	294.4321023101609	-65	21/02/24 15:47:47
8	337.0569612312978	272.24137590202855	-64	21/02/24 15:47:47
24	330.2572237413254	276.8419321591195	-66	21/02/24 15:47:47
25	329.08778489613	275.87564892517275	-69	21/02/24 15:47:47
11	327.4246457091771	282.6323525733639	-71	21/02/24 15:47:47
7	334.07657006354464	270.8835908324035	-69	21/02/24 15:47:47
33	361.5531569646988	270.2693072733871	-70	21/02/24 15:47:47
32	356.7839379367616	268.70688981904533	-67	21/02/24 15:47:47
31	346.4179037622539	268.10202267794875	-65	21/02/24 15:47:47
13	342.0775229118143	267.91244197819304	-64	21/02/24 15:47:47
21	334.5994402908936	265.9434918767382	-69	21/02/24 15:47:47
14	341.6082252010515	265.6547772450898	-66	21/02/24 15:47:47
20	334.99735462161357	264.77807460530994	-70	21/02/24 15:47:47

27	361.7760445803703	289.2690199455797	-69	21/02/24 15:47:48
26	365.69275229012084	288.9526077496502	-69	21/02/24 15:47:48
37	359.5903712498935	284.92420131943135	-62	21/02/24 15:47:48
40	360.29771601412074	275.17301637315114	-65	21/02/24 15:47:48
47	353.57917457908314	286.3943403818769	-57	21/02/24 15:47:48
22	353.27733584284437	275.76541045955213	-57	21/02/24 15:47:48
45	342.3105096677226	291.9842245930836	-66	21/02/24 15:47:48
46	340.76419739931424	294.4321023101609	-67	21/02/24 15:47:48
8	337.0569612312978	272.24137590202855	-64	21/02/24 15:47:48
24	330.2572237413254	276.8419321591195	-70	21/02/24 15:47:48
7	334.07657006354464	270.8835908324035	-71	21/02/24 15:47:48
33	361.5531569646988	270.2693072733871	-67	21/02/24 15:47:48
32	356.7839379367616	268.70688981904533	-64	21/02/24 15:47:48
31	346.4179037622539	268.10202267794875	-63	21/02/24 15:47:48
13	342.0775229118143	267.91244197819304	-67	21/02/24 15:47:48
14	341.6082252010515	265.6547772450898	-66	21/02/24 15:47:48

27	361.7760445803703	289.2690199455797	-65	21/02/24 15:47:49
26	365.69275229012084	288.9526077496502	-70	21/02/24 15:47:49
9	369.1884989117563	287.5678363426809	-70	21/02/24 15:47:49
37	359.5903712498935	284.92420131943135	-61	21/02/24 15:47:49
40	360.29771601412074	275.17301637315114	-64	21/02/24 15:47:49
47	353.57917457908314	286.3943403818769	-55	21/02/24 15:47:49
22	353.27733584284437	275.76541045955213	-55	21/02/24 15:47:49
45	342.3105096677226	291.9842245930836	-67	21/02/24 15:47:49
46	340.76419739931424	294.4321023101609	-69	21/02/24 15:47:49
8	337.0569612312978	272.24137590202855	-68	21/02/24 15:47:49
7	334.07657006354464	270.8835908324035	-71	21/02/24 15:47:49
33	361.5531569646988	270.2693072733871	-68	21/02/24 15:47:49
32	356.7839379367616	268.70688981904533	-67	21/02/24 15:47:49
31	346.4179037622539	268.10202267794875	-64	21/02/24 15:47:49
13	342.0775229118143	267.91244197819304	-66	21/02/24 15:47:49
14	341.6082252010515	265.6547772450898	-71	21/02/24 15:47:49

27	361.7760445803703	289.2690199455797	-62	21/02/24 15:47:50
26	365.69275229012084	288.9526077496502	-66	21/02/24 15:47:50
9	369.1884989117563	287.5678363426809	-70	21/02/24 15:47:50
37	359.5903712498935	284.92420131943135	-57	21/02/24 15:47:50
12	371.0513379138651	279.4455722502708	-71	21/02/24 15:47:50
40	360.29771601412074	275.17301637315114	-60	21/02/24 15:47:50
47	353.57917457908314	286.3943403818769	-55	21/02/24 15:47:50
22	353.27733584284437	275.76541045955213	-55	21/02/24 15:47:50
45	342.3105096677226	291.9842245930836	-65	21/02/24 15:47:50
46	340.76419739931424	294.4321023101609	-70	21/02/24 15:47:50
8	337.0569612312978	272.24137590202855	-70	21/02/24 15:47:50
33	361.5531569646988	270.2693072733871	-65	21/02/24 15:47:50
32	356.7839379367616	268.70688981904533	-66	21/02/24 15:47:50
31	346.4179037622539	268.10202267794875	-64	21/02/24 15:47:50
13	342.0775229118143	267.91244197819304	-69	21/02/24 15:47:50
14	341.6082252010515	265.6547772450898	-70	21/02/24 15:47:50

27	361.7760445803703	289.2690199455797	-64	21/02/24 15:47:51
26	365.69275229012084	288.9526077496502	-64	21/02/24 15:47:51
9	369.1884989117563	287.5678363426809	-68	21/02/24 15:47:51
37	359.5903712498935	284.92420131943135	-55	21/02/24 15:47:51
12	371.0513379138651	279.4455722502708	-69	21/02/24 15:47:51
40	360.29771601412074	275.17301637315114	-58	21/02/24 15:47:51
47	353.57917457908314	286.3943403818769	-54	21/02/24 15:47:51
22	353.27733584284437	275.76541045955213	-53	21/02/24 15:47:51
45	342.3105096677226	291.9842245930836	-69	21/02/24 15:47:51
46	340.76419739931424	294.4321023101609	-68	21/02/24 15:47:51
8	337.0569612312978	272.24137590202855	-69	21/02/24 15:47:51
33	361.5531569646988	270.2693072733871	-64	21/02/24 15:47:51
32	356.7839379367616	268.70688981904533	-65	21/02/24 15:47:51
31	346.4179037622539	268.10202267794875	-67	21/02/24 15:47:51
13	342.0775229118143	267.91244197819304	-68	21/02/24 15:47:51

27	361.7760445803703	289.2690199455797	-60	21/02/24 15:47:52
26	365.69275229012084	288.9526077496502	-62	21/02/24 15:47:52
9	369.1884989117563	287.5678363426809	-66	21/02/24 15:47:52
37	359.5903712498935	284.92420131943135	-49	21/02/24 15:47:52
34	374.2599083722957	283.9138922785015	-70	21/02/24 15:47:52
41	375.39943266704637	281.4134213737185	-71	21/02/24 15:47:52
12	371.0513379138651	279.4455722502708	-67	21/02/24 15:47:52
40	360.29771601412074	275.17301637315114	-59	21/02/24 15:47:52
47	353.57917457908314	286.3943403818769	-54	21/02/24 15:47:52
22	353.27733584284437	275.76541045955213	-56	21/02/24 15:47:52
45	342.3105096677226	291.9842245930836	-69	21/02/24 15:47:52
33	361.5531569646988	270.2693072733871	-65	21/02/24 15:47:52
32	356.7839379367616	268.70688981904533	-63	21/02/24 15:47:52
31	346.4179037622539	268.10202267794875	-69	21/02/24 15:47:52

27	361.7760445803703	289.2690199455797	-60	21/02/24 15:47:53
26	365.69275229012084	288.9526077496502	-63	21/02/24 15:47:53
36	375.5585779585396	288.8705845625357	-70	21/02/24 15:47:53
35	375.6269429107988	288.30982657685854	-69	21/02/24 15:47:53
9	369.1884989117563	287.5678363426809	-64	21/02/24 15:47:53
37	359.5903712498935	284.92420131943135	-46	21/02/24 15:47:53
34	374.2599083722957	283.9138922785015	-67	21/02/24 15:47:53
41	375.39943266704637	281.4134213737185	-70	21/02/24 15:47:53
12	371.0513379138651	279.4455722502708	-63	21/02/24 15:47:53
19	377.44631063296276	276.33039616173164	-70	21/02/24 15:47:53
40	360.29771601412074	275.17301637315114	-55	21/02/24 15:47:53
47	353.57917457908314	286.3943403818769	-57	21/02/24 15:47:53
22	353.27733584284437	275.76541045955213	-57	21/02/24 15:47:53
45	342.3105096677226	291.9842245930836	-69	21/02/24 15:47:53
33	361.5531569646988	270.2693072733871	-63	21/02/24 15:47:53
32	356.7839379367616	268.70688981904533	-66	21/02/24 15:47:53
31	346.4179037622539	268.10202267794875	-70	21/02/24 15:47:53

27	361.7760445803703	289.2690199455797	-58	21/02/24 15:47:54
26	365.69275229012084	288.9526077496502	-59	21/02/24 15:47:54
36	375.5585779585396	288.8705845625357	-67	21/02/24 15:47:54
35	375.6269429107988	288.30982657685854	-69	21/02/24 15:47:54
9	369.1884989117563	287.5678363426809	-60	21/02/24 15:47:54
37	359.5903712498935	284.92420131943135	-49	21/02/24 15:47:54
34	374.2599083722957	283.9138922785015	-64	21/02/24 15:47:54
41	375.39943266704637	281.4134213737185	-68	21/02/24 15:47:54
12	371.0513379138651	279.4455722502708	-61	21/02/24 15:47:54
19	377.44631063296276	276.33039616173164	-69	21/02/24 15:47:54
40	360.29771601412074	275.17301637315114	-54	21/02/24 15:47:54
47	353.57917457908314	286.3943403818769	-59	21/02/24 15:47:54
22	353.27733584284437	275.76541045955213	-62	21/02/24 15:47:54
33	361.5531569646988	270.2693072733871	-63	21/02/24 15:47:54
32	356.7839379367616	268.70688981904533	-67	21/02/24 15:47:54
31	346.4179037622539	268.10202267794875	-72	21/02/24 15:47:54

27	361.7760445803703	289.2690199455797	-61	21/02/24 15:47:55
26	365.69275229012084	288.9526077496502	-62	21/02/24 15:47:55
36	375.5585779585396	288.8705845625357	-68	21/02/24 15:47:55
35	375.6269429107988	288.30982657685854	-65	21/02/24 15:47:55
9	369.1884989117563	287.5678363426809	-59	21/02/24 15:47:55
37	359.5903712498935	284.92420131943135	-56	21/02/24 15:47:55
34	374.2599083722957	283.9138922785015	-64	21/02/24 15:47:55
41	375.39943266704637	281.4134213737185	-63	21/02/24 15:47:55
12	371.0513379138651	279.4455722502708	-60	21/02/24 15:47:55
19	377.44631063296276	276.33039616173164	-67	21/02/24 15:47:55
40	360.29771601412074	275.17301637315114	-53	21/02/24 15:47:55
47	353.57917457908314	286.3943403818769	-62	21/02/24 15:47:55
22	353.27733584284437	275.76541045955213	-63	21/02/24 15:47:55
33	361.5531569646988	270.2693072733871	-62	21/02/24 15:47:55
32	356.7839379367616	268.70688981904533	-67	21/02/24 15:47:55

27	361.7760445803703	289.2690199455797	-61	21/02/24 15:47:56
26	365.69275229012084	288.9526077496502	-63	21/02/24 15:47:56
36	375.5585779585396	288.8705845625357	-67	21/02/24 15:47:56
35	375.6269429107988	288.30982657685854	-69	21/02/24 15:47:56
9	369.1884989117563	287.5678363426809	-60	21/02/24 15:47:56
37	359.5903712498935	284.92420131943135	-57	21/02/24 15:47:56
34	374.2599083722957	283.9138922785015	-64	21/02/24 15:47:56
41	375.39943266704637	281.4134213737185	-64	21/02/24 15:47:56
12	371.0513379138651	279.4455722502708	-60	21/02/24 15:47:56
19	377.44631063296276	276.33039616173164	-68	21/02/24 15:47:56
40	360.29771601412074	275.17301637315114	-53	21/02/24 15:47:56
47	353.57917457908314	286.3943403818769	-62	21/02/24 15:47:56
22	353.27733584284437	275.76541045955213	-62	21/02/24 15:47:56
33	361.5531569646988	270.2693072733871	-59	21/02/24 15:47:56
32	356.7839379367616	268.70688981904533	-63	21/02/24 15:47:56
31	346.4179037622539	268.10202267794875	-70	21/02/24 15:47:56

27	361.7760445803703	289.2690199455797	-65	21/02/24 15:47:57
26	365.69275229012084	288.9526077496502	-63	21/02/24 15:47:57
36	375.5585779585396	288.8705845625357	-71	21/02/24 15:47:57
35	375.6269429107988	288.30982657685854	-68	21/02/24 15:47:57
9	369.1884989117563	287.5678363426809	-66	21/02/24 15:47:57
37	359.5903712498935	284.92420131943135	-58	21/02/24 15:47:57
34	374.2599083722957	283.9138922785015	-67	21/02/24 15:47:57
41	375.39943266704637	281.4134213737185	-66	21/02/24 15:47:57
12	371.0513379138651	279.4455722502708	-63	21/02/24 15:47:57
19	377.44631063296276	276.33039616173164	-69	21/02/24 15:47:57
40	360.29771601412074	275.17301637315114	-42	21/02/24 15:47:57
47	353.57917457908314	286.3943403818769	-66	21/02/24 15:47:57
22	353.27733584284437	275.76541045955213	-60	21/02/24 15:47:57
33	361.5531569646988	270.2693072733871	-57	21/02/24 15:47:57
32	356.7839379367616	268.70688981904533	-60	21/02/24 15:47:57
31	346.4179037622539	268.10202267794875	-69	21/02/24 15:47:57

27	361.7760445803703	289.2690199455797	-66	21/02/24 15:47:58
26	365.69275229012084	288.9526077496502	-64	21/02/24 15:47:58
35	375.6269429107988	288.30982657685854	-71	21/02/24 15:47:58
9	369.1884989117563	287.5678363426809	-68	21/02/24 15:47:58
37	359.5903712498935	284.92420131943135	-61	21/02/24 15:47:58
34	374.2599083722957	283.9138922785015	-66	21/02/24 15:47:58
41	375.39943266704637	281.4134213737185	-69	21/02/24 15:47:58
12	371.0513379138651	279.4455722502708	-65	21/02/24 15:47:58
19	377.44631063296276	276.33039616173164	-70	21/02/24 15:47:58
40	360.29771601412074	275.17301637315114	-28	21/02/24 15:47:58
47	353.57917457908314	286.3943403818769	-63	21/02/24 15:47:58
22	353.27733584284437	275.76541045955213	-56	21/02/24 15:47:58
33	361.5531569646988	270.2693072733871	-53	21/02/24 15:47:58
32	356.7839379367616	268.70688981904533	-59	21/02/24 15:47:58
31	346.4179037622539	268.10202267794875	-67	21/02/24 15:47:58
13	342.0775229118143	267.91244197819304	-71	21/02/24 15:47:58

27	361.7760445803703	289.2690199455797	-67	21/02/24 15:47:59
26	365.69275229012084	288.9526077496502	-66	21/02/24 15:47:59
36	375.5585779585396	288.8705845625357	-69	21/02/24 15:47:59
35	375.6269429107988	288.30982657685854	-69	21/02/24 15:47:59
9	369.1884989117563	287.5678363426809	-65	21/02/24 15:47:59
37	359.5903712498935	284.92420131943135	-61	21/02/24 15:47:59
34	374.2599083722957	283.9138922785015	-67	21/02/24 15:47:59
41	375.39943266704637	281.4134213737185	-68	21/02/24 15:47:59
12	371.0513379138651	279.4455722502708	-61	21/02/24 15:47:59
19	377.44631063296276	276.33039616173164	-68	21/02/24 15:47:59
40	360.29771601412074	275.17301637315114	-39	21/02/24 15:47:59
47	353.57917457908314	286.3943403818769	-65	21/02/24 15:47:59
22	353.27733584284437	275.76541045955213	-59	21/02/24 15:47:59
33	361.5531569646988	270.2693072733871	-55	21/02/24 15:47:59
32	356.7839379367616	268.70688981904533	-59	21/02/24 15:47:59
31	346.4179037622539	268.10202267794875	-70	21/02/24 15:47:59

