floorId	partitionId	location_x	location_y	timeStamp
3	42	341.67254864559294	260.24337168359904	20/04/28 05:17:35
3	42	341.922583017858	260.25256785684496	20/04/28 05:17:35
3	42	342.1057952385477	260.25930633566674	20/04/28 05:17:35
3	42	342.36404785134266	260.2688047728094	20/04/28 05:17:35
3	42	342.5152513139511	260.27436598115423	20/04/28 05:17:35
3	42	342.7141798531492	260.281682500453	20/04/28 05:17:36
3	42	342.8792246979255	260.2877527897982	20/04/28 05:17:36
3	42	343.0970832378442	260.29576554763645	20/04/28 05:17:36
3	42	343.33958014509886	260.3046844956615	20/04/28 05:17:36
3	42	343.6138469859805	260.314771930287	20/04/28 05:17:36
3	42	343.8368413101723	260.32297358040233	20/04/28 05:17:36
3	42	344.113845151586	260.33316168091164	20/04/28 05:17:36
3	42	344.26401950439083	260.3386850389723	20/04/28 05:17:36
3	42	344.4588875780666	260.34585221582637	20/04/28 05:17:36
3	42	344.6697365526454	260.3536071644016	20/04/28 05:17:36
3	42	344.964592944869	260.3644518752347	20/04/28 05:17:37
3	42	345.19282954570633	260.3728463343778	20/04/28 05:17:37
3	42	345.3736256788383	260.37949595037827	20/04/28 05:17:37
3	42	345.59430998245523	260.3876126387773	20/04/28 05:17:37
3	42	345.8230912792219	260.3960271316385	20/04/28 05:17:37
3	42	346.02918119014936	260.40360704358403	20/04/28 05:17:37
3	42	346.28136679550846	260.4128823384005	20/04/28 05:17:37
3	42	346.28136679550846	260.4128823384005	20/04/28 05:17:37
3	42	346.4747305429746	260.4199941866839	20/04/28 05:17:37
3	42	346.73506913858733	260.4295693455157	20/04/28 05:17:38
3	42	346.9873277886361	260.43884732688923	20/04/28 05:17:38
3	42	347.1637184773619	260.4453349122472	20/04/28 05:17:38
3	42	347.42156960324274	260.4548185828472	20/04/28 05:17:38
3	42	347.69028645323226	260.4647018908269	20/04/28 05:17:38
3	42	347.92872919745	260.4734717282104	20/04/28 05:17:38
3	42	348.1576111621327	260.481889923601	20/04/28 05:17:38
3	42	348.34590798941593	260.4888154124034	20/04/28 05:17:38
3	42	348.55786206631046	260.49661100623973	20/04/28 05:17:38
3	42	348.78730337321406	260.5050497740337	20/04/28 05:17:38
3	42	348.94292585445504	260.5107735122761	20/04/28 05:17:39
3	42	349.1482285551801	260.51832447091675	20/04/28 05:17:39
3	42	349.32170578489087	260.5247049003121	20/04/28 05:17:39
3	42	349.5215433835414	260.5320548544868	20/04/28 05:17:39
3	42	349.7429778158017	260.54019913234436	20/04/28 05:17:39
3	42	349.9702118941159	260.5485567190738	20/04/28 05:17:39
3	42	350.22724403709054	260.55801026778056	20/04/28 05:17:39
3	42	350.4531522800556	260.5663190907682	20/04/28 05:17:39
3	42	350.4531522800556	260.5663190907682	20/04/28 05:17:39
3	42	350.6257461426101	260.5726670302409	20/04/28 05:17:39
3	42	350.80540955010264	260.5792749850044	20/04/28 05:17:40
3	15	351.0571573267929	260.58850021495897	20/04/28 05:17:40
3	15	351.33297921538394	260.59587033906473	20/04/28 05:17:40
3	15	351.50869492082575	260.60056556670986	20/04/28 05:17:40
3	15	351.71911925130064	260.6061882293578	20/04/28 05:17:40
3	15	351.9666421087205	260.6128021866022	20/04/28 05:17:40
3	15	352.24609485439396	260.6202693293581	20/04/28 05:17:40
3	15	352.43481043120795	260.62531192126016	20/04/28 05:17:40
3	15	352.5981817077066	260.629677298458	20/04/28 05:17:40
3	15	352.85264826596386	260.63647679549825	20/04/28 05:17:41
3	15	353.14418382609153	260.64426679820747	20/04/28 05:17:41
3	15	353.3126940383862	260.64876949081116	20/04/28 05:17:41
3	15	353.57902015433433	260.65588588225194	20/04/28 05:17:41
3	15	353.7627661176662	260.6607956831405	20/04/28 05:17:41
3	15	353.974350115503	260.6664493327867	20/04/28 05:17:41
3	15	354.1987386929942	260.6724451283796	20/04/28 05:17:41
3	15	354.4396761217305	260.678883119072	20/04/28 05:17:41
3	15	354.6520875744096	260.68455887880134	20/04/28 05:17:41
3	15	354.8670940013193	260.69030397777794	20/04/28 05:17:41
3	15	355.1390416062911	260.69757057873244	20/04/28 05:17:42
3	15	355.4358066376355	260.7055003160076	20/04/28 05:17:42
3	15	355.68329756433883	260.7121134200443	20/04/28 05:17:42
3	15	355.8341263551742	260.71614365460204	20/04/28 05:17:42
3	15	356.10568119065124	260.7233997605232	20/04/28 05:17:42
3	15	356.28216643296736	260.728115550649	20/04/28 05:17:42
3	15	356.5178073374981	260.73441201507995	20/04/28 05:17:42
3	15	356.75772338244417	260.74082271379297	20/04/28 05:17:42
3	15	356.9277310912058	260.74536542038857	20/04/28 05:17:42
3	15	357.2141901407352	260.75301977573014	20/04/28 05:17:42
3	15	357.48761758155626	260.76032591877436	20/04/28 05:17:43
3	15	357.64816802246713	260.7646159215758	20/04/28 05:17:43
3	15	357.9194719690268	260.7718653235966	20/04/28 05:17:43
3	15	358.0814791969022	260.7761942526079	20/04/28 05:17:43
3	15	358.2439889948466	260.7805366105889	20/04/28 05:17:43
3	15	358.42240893580424	260.7853040970075	20/04/28 05:17:43
3	15	358.66899057546595	260.7918929043563	20/04/28 05:17:43
3	15	358.8584418150875	260.79695515360396	20/04/28 05:17:43
3	15	359.08015028354725	260.8028793350973	20/04/28 05:17:43
3	15	359.25009994806607	260.80742049071637	20/04/28 05:17:44
3	15	359.5045763312007	260.8142202502832	20/04/28 05:17:44
3	15	359.67074621980714	260.8186604080529	20/04/28 05:17:44
3	15	359.8494987191242	260.8234367806277	20/04/28 05:17:44
3	15	360.1180703619509	260.83061317387563	20/04/28 05:17:44
3	15	360.3028311403036	260.83555009122216	20/04/28 05:17:44
3	15	360.5524439104694	260.842219892172	20/04/28 05:17:44
3	15	360.7383788089141	260.84718818270227	20/04/28 05:17:44
3	15	361.0006866009228	260.8541972021492	20/04/28 05:17:44
3	15	361.16140159187586	260.8584916018251	20/04/28 05:17:44
3	15	361.36897634010626	260.864038121949	20/04/28 05:17:45
3	15	361.60135883543046	260.8702475197575	20/04/28 05:17:45
3	15	361.8169582542003	260.8760084638276	20/04/28 05:17:45
3	15	362.1158313134436	260.8839945288558	20/04/28 05:17:45
3	15	362.2704268915159	260.8881254141978	20/04/28 05:17:45
3	15	362.5501244224906	260.8955990977618	20/04/28 05:17:45
3	15	362.8372801612776	260.90327206905266	20/04/28 05:17:45
3	15	363.00516294847904	260.90775799648657	20/04/28 05:17:45
3	15	363.1613680623529	260.91193188957783	20/04/28 05:17:45
3	15	363.4218792310194	260.9188929021857	20/04/28 05:17:45
3	15	363.6415316582563	260.9247621450407	20/04/28 05:17:46
3	15	363.8691653253592	260.93084465134854	20/04/28 05:17:46
3	15	364.1151174037738	260.93741663644823	20/04/28 05:17:46
3	15	364.36224245002495	260.9440199639427	20/04/28 05:17:46
3	15	364.6129662199751	260.9507194514643	20/04/28 05:17:46
3	15	364.80510030854686	260.9558533880237	20/04/28 05:17:46
3	15	364.9581420688179	260.95994275443445	20/04/28 05:17:46
3	15	365.14413894041485	260.96491270092406	20/04/28 05:17:46
3	15	365.33694515238994	260.9700645970186	20/04/28 05:17:46
3	15	365.54944730987995	260.9757427804342	20/04/28 05:17:47
3	15	365.70354663522903	260.97986040560977	20/04/28 05:17:47
3	15	365.9581295661255	260.98666301219583	20/04/28 05:17:47
3	15	366.2303514938129	260.99393694321566	20/04/28 05:17:47
3	15	366.4897048136936	261.0008670174187	20/04/28 05:17:47
3	15	366.644541809885	261.0050043535958	20/04/28 05:17:47
3	15	366.8312902994186	261.00999438376147	20/04/28 05:17:47
3	15	367.12058656362024	261.0177245511582	20/04/28 05:17:47
3	15	367.31753462415355	261.02298711989755	20/04/28 05:17:47
3	15	367.58475045836747	261.0301272851369	20/04/28 05:17:47
3	15	367.748130847628	261.03449290583313	20/04/28 05:17:48
3	15	368.0012839195802	261.04125730574196	20/04/28 05:17:48
3	15	368.26204139717487	261.0482248998702	20/04/28 05:17:48
3	15	368.5402078036683	261.0556576708819	20/04/28 05:17:48
3	15	368.79121983086304	261.0623648608077	20/04/28 05:17:48
3	15	368.956858755218	261.0667908308983	20/04/28 05:17:48
3	15	369.130319139648	261.0714257950312	20/04/28 05:17:48
3	15	369.31531308607725	261.07636894276675	20/04/28 05:17:48
3	15	369.51375420833165	261.0816714069989	20/04/28 05:17:48
3	15	369.71985149234985	261.08717844840464	20/04/28 05:17:48
3	15	370.006944016383	261.0948497305599	20/04/28 05:17:49
3	15	370.2465358948338	261.1012517673523	20/04/28 05:17:49
3	15	370.46639919730427	261.10712664491837	20/04/28 05:17:49
3	15	370.6518081193471	261.1120808810479	20/04/28 05:17:49
3	15	370.94334818245216	261.11987100407936	20/04/28 05:17:49
3	15	371.1884631755146	261.12642062176303	20/04/28 05:17:49
3	15	371.3661300058893	261.13116798462113	20/04/28 05:17:49
3	15	371.65992969256837	261.1390184861318	20/04/28 05:17:49
3	15	371.88184442438705	261.1449481791042	20/04/28 05:17:49
3	15	372.0804697090618	261.1502555642652	20/04/28 05:17:50
3	15	372.2972289306974	261.15604749895425	20/04/28 05:17:50
3	15	372.544738666903	261.162661105592	20/04/28 05:17:50
3	15	372.7066970657966	261.166988729864	20/04/28 05:17:50
3	15	372.8655265743503	261.1712327483343	20/04/28 05:17:50
3	15	373.0209360687943	261.1753853820035	20/04/28 05:17:50
3	15	373.29073709217175	261.1825946250274	20/04/28 05:17:50
3	15	373.5191980057132	261.1886992358497	20/04/28 05:17:50
3	15	373.6944104066429	261.19338101490035	20/04/28 05:17:50
3	15	373.8565054419175	261.1977122901773	20/04/28 05:17:50
3	15	374.05423162654785	261.20299565085304	20/04/28 05:17:51
3	15	374.2914605358161	261.2093345477104	20/04/28 05:17:51
3	15	374.5766147691289	261.21695403759037	20/04/28 05:17:51
3	15	374.8211273847864	261.2234875593933	20/04/28 05:17:51
3	15	375.0532713936323	261.2296905847019	20/04/28 05:17:51
3	15	375.35035696577415	261.2376288870169	20/04/28 05:17:51
3	15	375.58911689466254	261.24400869362466	20/04/28 05:17:51
3	15	375.8033127169598	261.24973213276627	20/04/28 05:17:51
3	15	376.0725500523219	261.25692631371277	20/04/28 05:17:51
3	15	376.22479507181777	261.26099439073846	20/04/28 05:17:51
3	15	376.4927195749994	261.26815349203207	20/04/28 05:17:52
3	15	376.73820617839795	261.27471303936386	20/04/28 05:17:52
3	15	376.984363311771	261.2812905036534	20/04/28 05:17:52
3	15	377.1531537832253	261.28580068494773	20/04/28 05:17:52
3	15	377.4342561981392	261.29331190784205	20/04/28 05:17:52
3	15	377.72953467997485	261.3012019236345	20/04/28 05:17:52
3	15	377.98382113510417	261.3079966082126	20/04/28 05:17:52
3	15	378.24178466629064	261.3148895464392	20/04/28 05:17:52
3	15	378.4207182564841	261.31967075786935	20/04/28 05:17:52
3	54	378.5659215321079	261.33428094429206	20/04/28 05:17:53
3	54	378.58626801216235	261.5952917135128	20/04/28 05:17:53
3	54	378.60250850465263	261.80362963860154	20/04/28 05:17:53
3	54	378.6208503973065	262.03892495738626	20/04/28 05:17:53
3	54	378.6400443644609	262.2851509442865	20/04/28 05:17:53
3	54	378.6592760045931	262.531860211484	20/04/28 05:17:53
3	54	378.6742685525442	262.7241891284675	20/04/28 05:17:53
3	54	378.6872817357968	262.8911261594267	20/04/28 05:17:53
3	54	378.7088263652754	263.16750715003195	20/04/28 05:17:53
3	54	378.7268702527298	263.3989795684353	20/04/28 05:17:53
3	54	378.74967855651795	263.6915713533749	20/04/28 05:17:54
3	54	378.7711831110527	263.96743825054097	20/04/28 05:17:54
3	54	378.7910545949424	264.2223556260141	20/04/28 05:17:54
3	54	378.81101894046367	264.47846425844324	20/04/28 05:17:54
3	54	378.8312636605952	264.7381696207491	20/04/28 05:17:54
3	54	378.8483785496614	264.9577245682554	20/04/28 05:17:54
3	54	378.8605783957499	265.1142278653076	20/04/28 05:17:54
3	54	378.87952687303766	265.3573046343216	20/04/28 05:17:54
3	54	378.902760133115	265.6553478864252	20/04/28 05:17:54
3	54	378.902760133115	265.6553478864252	20/04/28 05:17:54
3	54	378.92369459685176	265.9239014872705	20/04/28 05:17:55
3	54	378.94022916227084	266.13601186838866	20/04/28 05:17:55
3	54	378.9653746293196	266.4585854869822	20/04/28 05:17:55
3	54	378.9793987261967	266.63849082214136	20/04/28 05:17:55
3	54	378.9793987261967	266.63849082214136	20/04/28 05:17:55
3	54	378.99891236162847	266.8888176099051	20/04/28 05:17:55
3	15	379.0053866349338	266.97187153623764	20/04/28 05:17:55
3	15	378.99313167201825	266.9372466022656	20/04/28 05:17:55
3	15	379.25674294154015	267.06695531195163	20/04/28 05:17:55
3	15	379.32496009430406	267.1536121109812	20/04/28 05:17:56
3	15	379.51231178246894	267.06874646594355	20/04/28 05:17:56
3	15	379.25082603735575	266.9278218127133	20/04/28 05:17:56
3	15	379.18546966413993	266.91451331336594	20/04/28 05:17:56
3	15	379.035547029243	266.7818881963423	20/04/28 05:17:56
3	15	378.963464856492	266.50315535506957	20/04/28 05:17:56
3	15	378.8132688463974	266.66541716702346	20/04/28 05:17:56
3	15	378.851742974111	266.61155979392845	20/04/28 05:17:56
3	15	378.8538368985356	266.6097569965046	20/04/28 05:17:56
3	15	378.8232993233468	266.61668697060605	20/04/28 05:17:56
3	15	378.8566737477621	266.42230685651685	20/04/28 05:17:57
3	15	379.0602086181076	266.22689991389865	20/04/28 05:17:57
3	15	378.8732617728852	266.0757926717841	20/04/28 05:17:57
3	15	378.8037115868553	266.00633563070147	20/04/28 05:17:57
3	15	378.9176975910093	265.96323690928375	20/04/28 05:17:57
3	15	379.0061163504459	265.9447266976523	20/04/28 05:17:57
3	15	379.1904409810686	265.9371461226653	20/04/28 05:17:57
3	15	379.18293017801483	265.8265673480197	20/04/28 05:17:57
3	15	379.4022566652964	265.7227394735722	20/04/28 05:17:57
3	15	379.4022566652964	265.7227394735722	20/04/28 05:17:58
3	15	379.3270628706021	265.88401380087663	20/04/28 05:17:58
3	15	379.2610030394853	266.09066888798094	20/04/28 05:17:58
3	15	379.24615694982623	265.862157602968	20/04/28 05:17:58
3	15	379.2902021906925	266.0247127697295	20/04/28 05:17:58
3	15	379.2902021906925	266.0247127697295	20/04/28 05:17:58
3	15	379.2345636633843	265.89527009041103	20/04/28 05:17:58
3	15	378.8933881766856	266.1918123237906	20/04/28 05:17:58
3	15	378.84078662440265	266.0613336545101	20/04/28 05:17:58
3	15	378.861400553171	266.13370746266423	20/04/28 05:17:58
3	15	378.861400553171	266.13370746266423	20/04/28 05:17:59
3	15	378.79027333799155	266.0369787852853	20/04/28 05:17:59
3	15	378.9781544957221	266.06888745309686	20/04/28 05:17:59
3	15	378.9781544957221	266.06888745309686	20/04/28 05:17:59
3	15	379.00076177354333	265.851777201072	20/04/28 05:17:59
3	15	378.80766799558523	265.82959115791243	20/04/28 05:17:59
3	15	378.9456077164936	266.051984488038	20/04/28 05:17:59
3	15	378.93289328997906	266.13559392040787	20/04/28 05:17:59
3	15	378.98125550774876	265.8880289151131	20/04/28 05:17:59
3	15	378.9806508044381	265.8833932366255	20/04/28 05:17:59
3	15	378.8600210707352	265.81051189949426	20/04/28 05:18:00
3	15	378.8501858035757	265.83043459629897	20/04/28 05:18:00
3	15	378.85977318309887	265.9686082064544	20/04/28 05:18:00
3	15	379.0819065479558	265.9501547946787	20/04/28 05:18:00
3	15	379.0790890825614	265.79085431573645	20/04/28 05:18:00
3	15	379.10578293854536	265.87341690355447	20/04/28 05:18:00
3	15	379.0152359495332	265.91489275167754	20/04/28 05:18:00
3	15	379.0263649827218	265.90308467182723	20/04/28 05:18:00
3	15	378.78143186767335	265.96884597503	20/04/28 05:18:00
3	15	378.7795769806416	266.0579564843049	20/04/28 05:18:01
3	15	378.87416832417284	266.0073610604293	20/04/28 05:18:01
3	15	379.08147414349276	266.0628311021129	20/04/28 05:18:01
3	15	378.90670214010424	265.99672616042346	20/04/28 05:18:01
3	15	378.84766534244534	265.99896832634465	20/04/28 05:18:01
3	15	379.0353054547596	265.99925960063223	20/04/28 05:18:01
3	15	379.1956247551577	266.0391431102362	20/04/28 05:18:01
3	15	379.16973550186395	266.11761519248205	20/04/28 05:18:01
3	15	379.00846257881517	265.8726887966161	20/04/28 05:18:01
3	15	379.08429791517597	265.59555402971444	20/04/28 05:18:01
3	15	379.1353120086606	265.59523621314156	20/04/28 05:18:02
3	15	379.19468281519937	265.55324765426946	20/04/28 05:18:02
3	15	379.2084548335074	265.6363737792824	20/04/28 05:18:02
3	15	379.28008416086567	265.88036141751735	20/04/28 05:18:02
3	15	379.27026977045773	265.8864023498806	20/04/28 05:18:02
3	15	379.2778402849582	265.84595590227883	20/04/28 05:18:02
3	15	379.5211009329857	265.9742504762545	20/04/28 05:18:02
3	15	379.5883067002531	265.7686815882987	20/04/28 05:18:02
3	15	379.4362418065563	265.5301639178578	20/04/28 05:18:02
3	15	379.26155073884854	265.4361560869555	20/04/28 05:18:02
3	15	379.2255617617157	265.3665979851695	20/04/28 05:18:03
3	15	379.2512465545197	265.41557133714446	20/04/28 05:18:03
3	15	379.41409116028325	265.6033606237724	20/04/28 05:18:03
3	15	379.32734985558125	265.57232483702967	20/04/28 05:18:03
3	15	379.44791005260544	265.8223368945026	20/04/28 05:18:03
3	15	379.37849114502274	265.96150311484797	20/04/28 05:18:03
3	15	379.2178089881074	265.9442135015703	20/04/28 05:18:03
3	15	379.1486247226033	265.9957545926701	20/04/28 05:18:03
3	15	379.4354465584435	266.06993261512633	20/04/28 05:18:03
3	15	379.3302434517999	266.34591896436154	20/04/28 05:18:04
3	15	379.4483004009452	266.5382984734216	20/04/28 05:18:04
3	15	379.3079524351467	266.57813154668776	20/04/28 05:18:04
3	15	379.2919828262081	266.46167339600873	20/04/28 05:18:04
3	15	379.2870415733044	266.46143386559476	20/04/28 05:18:04
3	15	379.3446064074098	266.4494466566088	20/04/28 05:18:04
3	15	379.35748333821	266.58170501102455	20/04/28 05:18:04
3	15	379.5260327274768	266.45912146547363	20/04/28 05:18:04
3	15	379.6578901187221	266.6997700824355	20/04/28 05:18:04
3	15	379.5924251986073	266.5472422771723	20/04/28 05:18:04
3	15	379.46704779664833	266.3483781571427	20/04/28 05:18:05
3	15	379.59001403586785	266.1535535645443	20/04/28 05:18:05
3	15	379.4707015250371	266.0316591328227	20/04/28 05:18:05
3	15	379.6591594093512	266.13776743640256	20/04/28 05:18:05
3	15	379.6666902322949	266.14178610196467	20/04/28 05:18:05
3	15	379.5547458861306	265.866233454413	20/04/28 05:18:05
3	15	379.72997072519433	265.65857289666894	20/04/28 05:18:05
3	15	380.0112844380016	265.5599274621083	20/04/28 05:18:05
3	15	379.75217962266595	265.5491786303462	20/04/28 05:18:05
3	15	379.7390876342506	265.842051661996	20/04/28 05:18:05
3	15	379.7306876760285	265.8266196914114	20/04/28 05:18:06
3	15	379.53688651691317	265.80866640819596	20/04/28 05:18:06
3	15	379.52519789181787	265.88206730524877	20/04/28 05:18:06
3	15	379.38479241755783	265.9146220529592	20/04/28 05:18:06
3	15	379.5484001900383	265.76231393282615	20/04/28 05:18:06
3	15	379.5802218863193	265.7658373912501	20/04/28 05:18:06
3	15	379.4863015967464	266.01412811981055	20/04/28 05:18:06
3	15	379.69918794291385	266.0577309256783	20/04/28 05:18:06
3	15	379.8007628479642	266.11883184393486	20/04/28 05:18:06
3	15	379.9096390629152	266.17291501776054	20/04/28 05:18:07
3	15	380.0079673587412	266.09591904275413	20/04/28 05:18:07
3	15	379.97673832984935	266.2195579223428	20/04/28 05:18:07
3	15	379.96415023549866	266.2341500126873	20/04/28 05:18:07
3	15	379.9440648989985	266.27290985355944	20/04/28 05:18:07
3	15	380.129479680081	266.3644340095212	20/04/28 05:18:07
3	15	380.1828637385969	266.40968077549974	20/04/28 05:18:07
3	15	380.3234685886129	266.2423715538489	20/04/28 05:18:07
3	15	380.3730024329761	266.3770878095912	20/04/28 05:18:07
3	15	380.636355232189	266.24688988200216	20/04/28 05:18:07
3	15	380.63902681141803	266.2415550786648	20/04/28 05:18:08
3	15	380.6298342554711	266.3971756721214	20/04/28 05:18:08
3	15	380.67187482420826	266.3989883903966	20/04/28 05:18:08
3	15	380.70708231212956	266.38573435862105	20/04/28 05:18:08
3	15	380.6815440496943	266.3114487562034	20/04/28 05:18:08
3	15	380.5304919098633	266.3500728271321	20/04/28 05:18:08
3	15	380.41383033283006	266.3785362531953	20/04/28 05:18:08
3	15	380.3259744886074	266.50627834361444	20/04/28 05:18:08
3	15	380.36707352660056	266.5586290872265	20/04/28 05:18:08
3	15	380.21132557357174	266.4231789215786	20/04/28 05:18:09
3	15	380.15221393476475	266.47227342676746	20/04/28 05:18:09
3	15	379.9807281332551	266.6770094502871	20/04/28 05:18:09
3	15	379.91502391614404	266.7158802603149	20/04/28 05:18:09
3	15	379.9424350992987	266.7329848284384	20/04/28 05:18:09
3	15	379.9030731785548	266.9331774960277	20/04/28 05:18:09
3	15	379.68065093837686	266.7568023885662	20/04/28 05:18:09
3	15	379.55781861155543	266.74886336430757	20/04/28 05:18:09
3	15	379.55781861155543	266.74886336430757	20/04/28 05:18:09
3	15	379.6098159920737	266.89938006731853	20/04/28 05:18:09
3	15	379.6853425894779	266.9757705964103	20/04/28 05:18:10
3	15	379.87094986607843	267.20449971870505	20/04/28 05:18:10
3	15	379.8691394098905	267.20657273947916	20/04/28 05:18:10
3	15	379.58850186110726	267.23720129579846	20/04/28 05:18:10
3	15	379.52855478449703	267.13131109490456	20/04/28 05:18:10
3	15	379.5346785294056	267.08997212789825	20/04/28 05:18:10
3	15	379.55316863077235	267.064273039065	20/04/28 05:18:10
3	15	379.6752336433445	266.8681472726493	20/04/28 05:18:10
3	15	379.6904104028758	266.7984755833878	20/04/28 05:18:10
3	15	379.78305261919326	266.9372323600357	20/04/28 05:18:10
3	15	379.75803933206686	267.0093238277885	20/04/28 05:18:11
3	15	379.87256444983484	267.04697567483754	20/04/28 05:18:11
3	15	379.855383516847	267.0214463798982	20/04/28 05:18:11
3	15	379.86650785435177	267.02460218212644	20/04/28 05:18:11
3	15	379.88736071089573	266.8871780526462	20/04/28 05:18:11
3	15	379.9259886315558	266.8593421841045	20/04/28 05:18:11
3	15	380.10110652586127	266.91075682275437	20/04/28 05:18:11
3	15	379.9175122584477	267.0600136594095	20/04/28 05:18:11
3	15	379.9617239723846	266.80556617688245	20/04/28 05:18:11
3	15	380.00703427778734	266.7894741954287	20/04/28 05:18:11
3	15	379.96577883994513	266.8029677798472	20/04/28 05:18:12
3	15	379.9614893667441	266.8948686116546	20/04/28 05:18:12
3	15	379.8979660337387	266.84560307016505	20/04/28 05:18:12
3	15	379.7643250318379	266.600816141721	20/04/28 05:18:12
3	15	379.7506797492615	266.5769322699885	20/04/28 05:18:12
3	15	379.51593028838516	266.6252631563238	20/04/28 05:18:12
3	15	379.5170558497931	266.7823116280353	20/04/28 05:18:12
3	15	379.74241604965493	266.724314799128	20/04/28 05:18:12
3	15	379.7648689077925	266.82266147006806	20/04/28 05:18:12
3	15	379.77750223803406	266.8327297429126	20/04/28 05:18:13
3	15	379.7414649762609	266.6214977142037	20/04/28 05:18:13
3	15	379.90820147629086	266.42023841984394	20/04/28 05:18:13
3	15	379.89508889710794	266.4228591841527	20/04/28 05:18:13
3	15	379.91838344463116	266.4476224715055	20/04/28 05:18:13
3	15	379.920515597517	266.50448967572805	20/04/28 05:18:13
3	15	379.6698677321584	266.59954338405953	20/04/28 05:18:13
3	15	379.47594604931356	266.62776829939554	20/04/28 05:18:13
3	15	379.42878756483924	266.5895210225638	20/04/28 05:18:13
3	15	379.59222505138314	266.3699596657342	20/04/28 05:18:13
3	15	379.5326101292003	266.58492172331216	20/04/28 05:18:14
3	15	379.33521345138666	266.77703234989525	20/04/28 05:18:14
3	15	379.16574881534024	266.70239877593826	20/04/28 05:18:14
3	15	379.41966156063614	266.5571111106147	20/04/28 05:18:14
3	15	379.41966156063614	266.5571111106147	20/04/28 05:18:14
3	15	379.41966156063614	266.5571111106147	20/04/28 05:18:14
3	15	379.38223996165357	266.30797171842033	20/04/28 05:18:14
3	15	379.3428314750327	266.04560435115206	20/04/28 05:18:14
3	15	379.31977816297393	265.8921237861697	20/04/28 05:18:14
3	15	379.2867484983374	265.6722242950827	20/04/28 05:18:14
3	15	379.2621499657452	265.5084562139342	20/04/28 05:18:15
3	15	379.22400268664825	265.254485507538	20/04/28 05:18:15
3	15	379.1814828684292	264.97140402637956	20/04/28 05:18:15
3	15	379.1498788513777	264.7609959782687	20/04/28 05:18:15
3	15	379.11213339172286	264.5097004395377	20/04/28 05:18:15
3	15	379.0809773311136	264.3022747224547	20/04/28 05:18:15
3	15	379.04573706310066	264.0676578382962	20/04/28 05:18:15
3	15	379.004425956779	263.79262352122583	20/04/28 05:18:15
3	15	378.9695833377908	263.5606540396111	20/04/28 05:18:15
3	15	378.93440024093246	263.32641778020127	20/04/28 05:18:16
3	15	378.89036739858994	263.0332631348609	20/04/28 05:18:16
3	15	378.8615710664486	262.8415476314571	20/04/28 05:18:16
3	15	378.83687678035284	262.67714205831624	20/04/28 05:18:16
3	15	378.83687678035284	262.67714205831624	20/04/28 05:18:16
3	15	378.80344736980516	262.4545812043789	20/04/28 05:18:16
3	15	378.7638393061445	262.1908851257854	20/04/28 05:18:16
3	15	378.72759467409526	261.9495815512569	20/04/28 05:18:16
3	15	378.70110301624453	261.7732097308486	20/04/28 05:18:16
3	15	378.6642344619951	261.5277523092916	20/04/28 05:18:16
3	15	378.6408433684959	261.3720229183624	20/04/28 05:18:17
3	15	378.60675142975	261.14505119270643	20/04/28 05:18:17
3	15	378.56895049634477	260.89338632992667	20/04/28 05:18:17
3	47	378.43558701728483	260.86975947541185	20/04/28 05:18:17
3	47	378.1979463033603	260.8736486542432	20/04/28 05:18:17
3	47	377.99197601808396	260.8770195213819	20/04/28 05:18:17
3	47	377.8068892767214	260.8800486127551	20/04/28 05:18:17
3	47	377.6533053074187	260.88256213626875	20/04/28 05:18:17
3	47	377.41019039497183	260.88654090470226	20/04/28 05:18:17
3	47	377.2299258462295	260.88949107706725	20/04/28 05:18:17
3	47	376.94044248331613	260.8942287019821	20/04/28 05:18:18
3	47	376.64168405238644	260.89911812074405	20/04/28 05:18:18
3	47	376.4794278341352	260.90177357249246	20/04/28 05:18:18
3	47	376.22783494585605	260.905891089727	20/04/28 05:18:18
3	47	375.98824458151716	260.90981217613427	20/04/28 05:18:18
3	47	375.719788836597	260.914205667397	20/04/28 05:18:18
3	47	375.4610546774058	260.91844005719605	20/04/28 05:18:18
3	47	375.17839263730934	260.9230660457509	20/04/28 05:18:18
3	47	374.9409736068485	260.9269515965565	20/04/28 05:18:18
3	47	374.72602772093614	260.930469356521	20/04/28 05:18:19
3	47	374.54142134577376	260.9334905863202	20/04/28 05:18:19
3	47	374.2919959234851	260.9375726312541	20/04/28 05:18:19
3	47	374.0633252532968	260.94131500820276	20/04/28 05:18:19
3	47	373.89633395407196	260.9440479533082	20/04/28 05:18:19
3	47	373.62616212938	260.948469529578	20/04/28 05:18:19
3	47	373.4515996161497	260.95132638360775	20/04/28 05:18:19
3	47	373.2584491190862	260.95448744474095	20/04/28 05:18:19
3	47	372.9670292524376	260.9592567620759	20/04/28 05:18:19
3	47	372.78693262349	260.9622041863002	20/04/28 05:18:19
3	47	372.5916088002177	260.96540081564115	20/04/28 05:18:20
3	47	372.3390321566702	260.9695344328112	20/04/28 05:18:20
3	47	372.1544140245896	260.9725558550217	20/04/28 05:18:20
3	47	371.88852454552574	260.9769073473076	20/04/28 05:18:20
3	47	371.70142024027626	260.97996945771456	20/04/28 05:18:20
3	47	371.49283612861916	260.98338310219583	20/04/28 05:18:20
3	47	371.49283612861916	260.98338310219583	20/04/28 05:18:20
3	47	371.32072576036205	260.9861998249275	20/04/28 05:18:20
3	47	371.1234212085237	260.989428870463	20/04/28 05:18:20
3	47	370.93278270087217	260.9925488208964	20/04/28 05:18:20
3	47	370.6791745846746	260.99669931893476	20/04/28 05:18:21
3	47	370.48310542187653	260.9999081463484	20/04/28 05:18:21
3	47	370.241875968294	261.00385605775165	20/04/28 05:18:21
3	47	370.08805503376254	261.0063734593893	20/04/28 05:18:21
3	47	369.93566476480464	261.0088674470497	20/04/28 05:18:21
3	47	369.78549805250697	261.01132504444115	20/04/28 05:18:21
3	47	369.578552057422	261.01471187984504	20/04/28 05:18:21
3	47	369.42544489546077	261.01721760002823	20/04/28 05:18:21
3	47	369.14721694058585	261.02177102126035	20/04/28 05:18:21
3	47	368.90777847479256	261.0256896217274	20/04/28 05:18:22
3	47	368.65822007386845	261.0297738429622	20/04/28 05:18:22
3	47	368.4252299209357	261.03358691167307	20/04/28 05:18:22
3	47	368.264796985594	261.03621252395004	20/04/28 05:18:22
3	47	368.0398007420785	261.0398947659908	20/04/28 05:18:22
3	47	367.7752866447129	261.044223749064	20/04/28 05:18:22
3	47	367.50223508642773	261.04869245445883	20/04/28 05:18:22
3	47	367.33729007497953	261.0513919104412	20/04/28 05:18:22
3	47	367.1137207964189	261.05505079906834	20/04/28 05:18:22
3	47	366.95262137678543	261.0576873188895	20/04/28 05:18:22
3	47	366.76845432774843	261.06070135876814	20/04/28 05:18:23
3	47	366.5965014346192	261.0635155042944	20/04/28 05:18:23
3	47	366.31299587283655	261.0681552977509	20/04/28 05:18:23
3	47	366.05728185187127	261.0723402605916	20/04/28 05:18:23
3	47	365.8668028404772	261.0754576007422	20/04/28 05:18:23
3	47	365.69305478118554	261.078301125587	20/04/28 05:18:23
3	47	365.46941979976623	261.0819610894936	20/04/28 05:18:23
3	47	365.24705433289944	261.0856002767872	20/04/28 05:18:23
3	47	365.0640836477521	261.08859473722157	20/04/28 05:18:23
3	47	364.83979176494614	261.0922654518405	20/04/28 05:18:23
3	47	364.66679056540255	261.09509675373295	20/04/28 05:18:24
3	47	364.421943364909	261.09910387243474	20/04/28 05:18:24
3	47	364.24164762156045	261.1020545553242	20/04/28 05:18:24
3	47	364.07736349323534	261.1047431954299	20/04/28 05:18:24
3	47	363.82980633793903	261.10879466469214	20/04/28 05:18:24
3	47	363.6499649168017	261.11173791223814	20/04/28 05:18:24
3	47	363.6499649168017	261.11173791223814	20/04/28 05:18:24
3	47	363.2383963886793	261.118473557746	20/04/28 05:18:24
3	47	363.2383963886793	261.118473557746	20/04/28 05:18:24
3	47	363.0367546522543	261.1217735847484	20/04/28 05:18:25
3	47	362.803343129461	261.1255935495114	20/04/28 05:18:25
3	47	362.5378799925871	261.12993806436907	20/04/28 05:18:25
3	47	362.38214687106114	261.132486760464	20/04/28 05:18:25
3	47	362.12366495639765	261.1367170220812	20/04/28 05:18:25
3	47	361.875705221462	261.14077507987867	20/04/28 05:18:25
3	47	361.6468228398116	261.14452092165334	20/04/28 05:18:25
3	47	361.4048872043198	261.1484803902838	20/04/28 05:18:25
3	47	361.22268626737934	261.151462253178	20/04/28 05:18:25
3	47	360.9460014277316	261.15599042010507	20/04/28 05:18:25
3	47	360.75687496360587	261.15908562474647	20/04/28 05:18:26
3	47	360.52566047630313	261.1628696332805	20/04/28 05:18:26
3	47	360.3443322961883	261.16583721281677	20/04/28 05:18:26
3	47	360.0744498688267	261.1702540528696	20/04/28 05:18:26
3	47	359.7825958795675	261.1750304749655	20/04/28 05:18:26
3	47	359.5293827072955	261.1791745094332	20/04/28 05:18:26
3	47	359.3509879741375	261.18209408078263	20/04/28 05:18:26
3	47	359.14046185170446	261.1855395078111	20/04/28 05:18:26
3	47	358.9464868595281	261.188714062461	20/04/28 05:18:26
3	47	358.6533631288642	261.19351126488243	20/04/28 05:18:26
3	47	358.4650570242346	261.1965930436898	20/04/28 05:18:27
3	47	358.30081488391363	261.19928099662854	20/04/28 05:18:27
3	47	358.0909465411524	261.20271565857075	20/04/28 05:18:27
3	47	357.86258815702274	261.2064529247103	20/04/28 05:18:27
3	47	357.58091540350756	261.21106272280525	20/04/28 05:18:27
3	47	357.32126903315054	261.21531204166376	20/04/28 05:18:27
3	47	357.0639235218694	261.219523705138	20/04/28 05:18:27
3	47	356.8568287825242	261.2229129748597	20/04/28 05:18:27
3	47	356.6016311232189	261.2270894870322	20/04/28 05:18:27
3	47	356.41519164594513	261.23014071700186	20/04/28 05:18:28
3	47	356.20362889391333	261.23360310929615	20/04/28 05:18:28
3	47	355.9879145757386	261.2371334452643	20/04/28 05:18:28
3	47	355.7202986312441	261.2415131925268	20/04/28 05:18:28
3	47	355.5622446554879	261.2440998712426	20/04/28 05:18:28
3	47	355.35308214927846	261.2475229816097	20/04/28 05:18:28
3	47	355.0591936515215	261.25233270005134	20/04/28 05:18:28
3	47	354.8762278276579	261.2553270809269	20/04/28 05:18:28
3	47	354.6471597188371	261.2590759622741	20/04/28 05:18:28
3	47	354.4650014064163	261.2620571275842	20/04/28 05:18:28
3	47	354.2057910611291	261.2662993105465	20/04/28 05:18:29
3	47	353.9202872743427	261.2709718065406	20/04/28 05:18:29
3	47	353.67098232134293	261.275051879899	20/04/28 05:18:29
3	47	353.4620369943	261.2784714359567	20/04/28 05:18:29
3	47	353.2051580161302	261.2826754642464	20/04/28 05:18:29
3	47	353.0012784810472	261.2860121145993	20/04/28 05:18:29
3	47	352.7110650788342	261.29076168718655	20/04/28 05:18:29
3	47	352.5408893944136	261.2935467472822	20/04/28 05:18:29
3	47	352.3188846188347	261.2971800315768	20/04/28 05:18:29
3	47	352.10523776109176	261.30067653191463	20/04/28 05:18:29
3	47	351.83489927130313	261.30510083579094	20/04/28 05:18:30
3	47	351.55123190003604	261.309743277388	20/04/28 05:18:30
3	47	351.39198474087544	261.312349483497	20/04/28 05:18:30
3	47	351.14558026468904	261.3163820882511	20/04/28 05:18:30
3	47	350.9797661205994	261.31909576827877	20/04/28 05:18:30
3	47	350.7688415957559	261.3225477154788	20/04/28 05:18:30
3	47	350.5244316782649	261.3265476776973	20/04/28 05:18:30
3	47	350.2521409029772	261.3310039322748	20/04/28 05:18:30
3	47	350.0157346054045	261.3348729089032	20/04/28 05:18:30
3	47	350.0157346054045	261.3348729089032	20/04/28 05:18:31
3	47	349.8379939123407	261.33778177636754	20/04/28 05:18:31
3	47	349.57144573049214	261.34214404884716	20/04/28 05:18:31
3	47	349.36085744613183	261.3455904932049	20/04/28 05:18:31
3	47	349.1936324633892	261.3483272627265	20/04/28 05:18:31
3	47	348.9711510290484	261.35196834791986	20/04/28 05:18:31
3	47	348.68446635839643	261.35666017001535	20/04/28 05:18:31
3	47	348.50365616594297	261.3596192722726	20/04/28 05:18:31
3	47	348.20880325570045	261.3644447740898	20/04/28 05:18:31
3	47	347.9695209131607	261.368360819476	20/04/28 05:18:31
3	47	347.71133140622806	261.37258629560864	20/04/28 05:18:32
3	47	347.5168871953464	261.3757685293949	20/04/28 05:18:32
3	47	347.3093385364584	261.3791652278701	20/04/28 05:18:32
3	47	347.1494159211132	261.3817824883554	20/04/28 05:18:32
3	47	346.99669446980994	261.38428189607765	20/04/28 05:18:32
3	47	346.7118004823064	261.38894441222266	20/04/28 05:18:32
3	47	346.4356667805035	261.3934635593416	20/04/28 05:18:32
3	47	346.2684562408243	261.39620009249103	20/04/28 05:18:32
3	47	346.0648135702005	261.39953286636916	20/04/28 05:18:32
3	47	345.8024183924455	261.4038271716417	20/04/28 05:18:32
3	47	345.6303271095985	261.4066435820255	20/04/28 05:18:33
3	47	345.3794286592087	261.410749734233	20/04/28 05:18:33
3	47	345.2278182404408	261.4132309590263	20/04/28 05:18:33
3	47	344.9417634565709	261.41791247252485	20/04/28 05:18:33
3	47	344.78538300712455	261.4204717626548	20/04/28 05:18:33
3	47	344.5655549297381	261.4240694235564	20/04/28 05:18:33
3	47	344.28462959608873	261.42866698953225	20/04/28 05:18:33
3	47	344.07542663326785	261.43209076200384	20/04/28 05:18:33
3	47	343.88692735256586	261.4351757022909	20/04/28 05:18:33
3	47	343.73263825435185	261.43770076579864	20/04/28 05:18:33
3	47	343.4546438716411	261.442250364437	20/04/28 05:18:34
3	47	343.20158959232435	261.44639179849537	20/04/28 05:18:34
3	47	342.97612552752133	261.4500816968027	20/04/28 05:18:34
3	47	342.7674704180956	261.45349650321884	20/04/28 05:18:34
3	47	342.4835905530679	261.4581424224449	20/04/28 05:18:34
3	47	342.3129990145717	261.46093428832245	20/04/28 05:18:34
3	47	342.13788347410116	261.46380019308174	20/04/28 05:18:34
3	47	341.9129397245091	261.4674815760178	20/04/28 05:18:34
3	47	341.7188158882521	261.47065856661914	20/04/28 05:18:34
3	47	341.5321778818508	261.47371304567554	20/04/28 05:18:35
3	47	341.33843685312553	261.4768837713279	20/04/28 05:18:35
3	47	341.06934086759986	261.4812877406361	20/04/28 05:18:35
3	47	340.8937945426469	261.48416069552525	20/04/28 05:18:35
3	47	340.6828061432455	261.48761368808306	20/04/28 05:18:35
3	47	340.3978037726569	261.49227797800324	20/04/28 05:18:35
3	47	340.11044538245704	261.4969808260537	20/04/28 05:18:35
3	47	339.8686018561264	261.50093878724465	20/04/28 05:18:35
3	47	339.65069757229026	261.50450496373844	20/04/28 05:18:35
3	47	339.49420781387806	261.50706604279634	20/04/28 05:18:35
3	47	339.32363134037195	261.5098576621234	20/04/28 05:18:36
3	47	339.16431475368597	261.5124650044689	20/04/28 05:18:36
3	47	338.8898858408119	261.51695625136443	20/04/28 05:18:36
3	47	338.6904160037132	261.52022073351117	20/04/28 05:18:36
3	47	338.5301122287492	261.5228442319761	20/04/28 05:18:36
3	47	338.2518312880419	261.52739852036336	20/04/28 05:18:36
3	47	338.0102997646413	261.53135137537885	20/04/28 05:18:36
3	47	337.7298586206527	261.53594101720677	20/04/28 05:18:36
3	47	337.5462237733591	261.5389463471816	20/04/28 05:18:36
3	47	337.33116522845205	261.54246595089995	20/04/28 05:18:36
3	47	337.15863892542757	261.5452894807341	20/04/28 05:18:37
3	47	336.92302777498696	261.54914544414873	20/04/28 05:18:37
3	47	336.7065574231114	261.55268815320824	20/04/28 05:18:37
3	47	336.4998873412563	261.5560704730732	20/04/28 05:18:37
3	47	336.3393877261784	261.55869717661693	20/04/28 05:18:37
3	47	336.1797933829516	261.5613090646686	20/04/28 05:18:37
3	47	335.9003668838229	261.56588210102836	20/04/28 05:18:37
3	47	335.7163498159679	261.5688936863459	20/04/28 05:18:37
3	47	335.51980711288337	261.57211026362205	20/04/28 05:18:37
3	47	335.2958056185212	261.5757762258037	20/04/28 05:18:38
3	47	335.0818254295408	261.5792781813717	20/04/28 05:18:38
3	47	334.8526761884046	261.5830283905136	20/04/28 05:18:38
3	47	334.58152007394773	261.58746607546635	20/04/28 05:18:38
3	47	334.287007509072	261.5922860072616	20/04/28 05:18:38
3	47	334.1034752044814	261.5952896590437	20/04/28 05:18:38
3	47	333.9205625807684	261.5982831692566	20/04/28 05:18:38
3	47	333.72657194012896	261.601457980006	20/04/28 05:18:38
3	47	333.52586938449116	261.60474263656965	20/04/28 05:18:38
3	47	333.2358679910651	261.6094887394649	20/04/28 05:18:38
3	47	332.9477220614044	261.61420447622345	20/04/28 05:18:39
3	47	332.65514523883184	261.61899272806005	20/04/28 05:18:39
3	47	332.45736007427035	261.6222296392041	20/04/28 05:18:39
3	47	332.24422126718184	261.6257178248899	20/04/28 05:18:39
3	47	332.0575697157534	261.62877252562134	20/04/28 05:18:39
3	47	331.78861703333826	261.6331741496605	20/04/28 05:18:39
3	47	331.53114618860917	261.637387864316	20/04/28 05:18:39
3	47	331.2917205255824	261.64130625525564	20/04/28 05:18:39
3	47	331.08802589757795	261.64463987945754	20/04/28 05:18:39
3	47	330.838711558718	261.648720106423	20/04/28 05:18:39
3	47	330.625777118417	261.65220494748417	20/04/28 05:18:40
3	47	330.4098184968503	261.6557392816712	20/04/28 05:18:40
3	47	330.1881104590179	261.6593677096171	20/04/28 05:18:40
3	47	329.9976061739779	261.6624854633909	20/04/28 05:18:40
3	47	329.830903347632	261.66521368740877	20/04/28 05:18:40
3	47	329.5928956740706	261.66910887182576	20/04/28 05:18:40
3	47	329.40228355661833	261.6722283903626	20/04/28 05:18:40
3	47	329.2366255361218	261.6749395153038	20/04/28 05:18:40
3	47	328.9596349370163	261.679472686227	20/04/28 05:18:40
3	47	328.6630726723594	261.68432616298537	20/04/28 05:18:41
3	47	328.4230977848521	261.6882535424194	20/04/28 05:18:41
3	47	328.2596734352627	261.69092811156395	20/04/28 05:18:41
3	47	328.03805742097734	261.6945550334715	20/04/28 05:18:41
3	47	327.78238160576973	261.69873937104467	20/04/28 05:18:41
3	47	327.53191821724056	261.70283840311964	20/04/28 05:18:41
3	47	327.53191821724056	261.70283840311964	20/04/28 05:18:41
3	47	327.3129507375731	261.70642197965674	20/04/28 05:18:41
3	47	327.041988793262	261.71085648686096	20/04/28 05:18:41
3	47	326.8717417824792	261.71364271426916	20/04/28 05:18:41
3	47	326.59221792872455	261.7182173439146	20/04/28 05:18:42
3	47	326.3659493888804	261.72192040809426	20/04/28 05:18:42
3	47	326.188144014279	261.7248303341233	20/04/28 05:18:42
3	47	325.92977972080274	261.72905867077645	20/04/28 05:18:42
3	47	325.6932129235411	261.73293027410955	20/04/28 05:18:42
3	47	325.5272769696384	261.73564594765145	20/04/28 05:18:42
3	47	325.31175595837027	261.7391731199987	20/04/28 05:18:42
3	47	325.0379942288656	261.7436534479091	20/04/28 05:18:42
3	47	324.8587585232976	261.74658678243924	20/04/28 05:18:42
3	47	324.59109454863307	261.75096731575354	20/04/28 05:18:42
3	47	324.3510543322983	261.75489576434563	20/04/28 05:18:43
3	47	324.1504899462909	261.75817815965365	20/04/28 05:18:43
3	47	324.1504899462909	261.75817815965365	20/04/28 05:18:43
3	47	323.8720357415888	261.7627352836437	20/04/28 05:18:43
3	47	323.69195089227077	261.765682515085	20/04/28 05:18:43
3	47	323.4574456893672	261.7695203787908	20/04/28 05:18:43
3	47	323.3038275285544	261.77203446187565	20/04/28 05:18:43
3	47	323.0089512538699	261.77686034607046	20/04/28 05:18:43
3	47	322.71696616133806	261.78163891377545	20/04/28 05:18:43
3	47	322.52980925815933	261.7847018849893	20/04/28 05:18:44
3	47	322.336082087385	261.7878723838453	20/04/28 05:18:44
3	47	322.12534125229394	261.79132132481675	20/04/28 05:18:44
3	47	321.86525275784237	261.7955778793869	20/04/28 05:18:44
3	47	321.5803648402543	261.8002402961929	20/04/28 05:18:44
3	47	321.28119346444885	261.80513647312534	20/04/28 05:18:44
3	47	321.048103479592	261.8089511756649	20/04/28 05:18:44
3	47	320.8874059595035	261.81158111808116	20/04/28 05:18:44
3	47	320.6498698199659	261.8154685854697	20/04/28 05:18:44
3	47	320.49884743991964	261.8179401865428	20/04/28 05:18:44
3	47	320.2645680448237	261.8217743547246	20/04/28 05:18:45
3	47	320.08902468192633	261.8246472611374	20/04/28 05:18:45
3	47	319.8836110256058	261.8280090186016	20/04/28 05:18:45
3	47	319.64325280093504	261.8319426716525	20/04/28 05:18:45
3	47	319.37765718613804	261.8362893546165	20/04/28 05:18:45
3	47	319.1115028590676	261.84064518135017	20/04/28 05:18:45
3	47	318.8633085954716	261.84470707739524	20/04/28 05:18:45
3	47	318.62091099146124	261.8486741065071	20/04/28 05:18:45
3	47	318.4295087308911	261.85180655636293	20/04/28 05:18:45
3	47	318.15688379292044	261.85626827977785	20/04/28 05:18:45
3	47	317.9064174856772	261.8603673596199	20/04/28 05:18:46
3	47	317.64361033656877	261.86466840713047	20/04/28 05:18:46
3	47	317.492093838077	261.8671480948439	20/04/28 05:18:46
3	47	317.3026834822353	261.8702479455985	20/04/28 05:18:46
3	47	317.13192183806177	261.8730425953905	20/04/28 05:18:46
3	47	316.9759845299352	261.87559463316114	20/04/28 05:18:46
3	47	316.7978720786714	261.87850958474337	20/04/28 05:18:46
3	47	316.57098436955084	261.8822227821195	20/04/28 05:18:46
3	47	316.57098436955084	261.8822227821195	20/04/28 05:18:46
3	47	316.3945980152438	261.88510948475556	20/04/28 05:18:47
3	47	316.1615795252324	261.88892301722524	20/04/28 05:18:47
3	47	315.93168690666647	261.8926853923286	20/04/28 05:18:47
3	47	315.70915680190245	261.89632727405206	20/04/28 05:18:47
3	47	315.4466789179294	261.90062293287747	20/04/28 05:18:47
3	47	315.2157477911861	261.9044023039911	20/04/28 05:18:47
3	47	315.01400655259016	261.9077039594255	20/04/28 05:18:47
3	47	314.7450829812074	261.91210510703945	20/04/28 05:18:47
3	47	314.53067744144647	261.91561402381046	20/04/28 05:18:47
3	47	314.24167093526665	261.92034384458657	20/04/28 05:18:47
3	47	313.9502949595348	261.92511244361185	20/04/28 05:18:48
3	47	313.6724967493183	261.9296588317317	20/04/28 05:18:48
3	47	313.4063851905891	261.9340139585275	20/04/28 05:18:48
3	47	313.24697271621136	261.9366228701511	20/04/28 05:18:48
3	47	312.9522853143467	261.94144566329237	20/04/28 05:18:48
3	47	312.780274118773	261.9442607629844	20/04/28 05:18:48
3	47	312.51065920977516	261.948673224887	20/04/28 05:18:48
3	47	312.342462277445	261.95142590113477	20/04/28 05:18:48
3	47	312.149195736198	261.9545888614231	20/04/28 05:18:48
3	47	311.96650018313875	261.9575788191025	20/04/28 05:18:48
3	47	311.7418713660574	261.96125504791814	20/04/28 05:18:49
