floorId	partitionId	location_x	location_y	timeStamp
1	98	305.14384176673207	266.22087392439636	20/04/28 05:16:03
1	98	303.28594423312194	264.61216223098285	20/04/28 05:16:04
3	47	302.3157990937455	265.96754816044853	20/04/28 05:16:05
3	47	303.28594423312194	264.61216223098285	20/04/28 05:16:06
3	47	303.2859442331219	264.61216223098285	20/04/28 05:16:07
3	NULL	309.29436722642214	263.9851754886793	20/04/28 05:16:08
1	81	313.37765885306834	261.0920988121665	20/04/28 05:16:09
1	81	313.2523840549326	264.4074609667819	20/04/28 05:16:10
1	81	315.0919378015828	261.7557595783303	20/04/28 05:16:11
3	54	318.718225726321	262.2630310087092	20/04/28 05:16:12
3	18	321.1448815173929	265.43065665280113	20/04/28 05:16:13
3	54	324.01518066743233	262.76750572012435	20/04/28 05:16:14
3	54	324.0151806674323	262.76750572012435	20/04/28 05:16:15
3	54	324.6837666112415	261.38954335341236	20/04/28 05:16:16
3	54	327.3540763805351	261.1072377077433	20/04/28 05:16:17
3	54	327.3540763805351	261.1072377077433	20/04/28 05:16:18
3	54	334.4407240787428	261.4032786809491	20/04/28 05:16:19
3	54	334.4407240787428	261.4032786809491	20/04/28 05:16:20
3	54	334.4407240787428	261.4032786809491	20/04/28 05:16:21
3	54	334.4407240787428	261.4032786809491	20/04/28 05:16:22
3	99	338.72849302958224	257.33962041953436	20/04/28 05:16:23
3	99	339.59375125487367	258.8166372045796	20/04/28 05:16:24
3	42	346.3242319400108	259.3686329834299	20/04/28 05:16:25
3	54	347.6038246023418	261.16234003976894	20/04/28 05:16:26
3	54	350.37914153837863	260.97432627346046	20/04/28 05:16:27
3	54	350.37914153837863	260.97432627346046	20/04/28 05:16:28
3	54	350.37914153837863	260.97432627346046	20/04/28 05:16:29
3	42	351.2362894892158	259.98472696547645	20/04/28 05:16:30
3	54	354.3948115151741	261.6556623953523	20/04/28 05:16:31
3	54	358.23287936641947	263.0061707425011	20/04/28 05:16:32
3	54	359.56855835216805	263.2279362811352	20/04/28 05:16:33
3	34	362.2167196060361	259.70189758364177	20/04/28 05:16:34
3	34	362.2167196060361	259.70189758364177	20/04/28 05:16:35
3	34	361.2642468288334	255.55936173685845	20/04/28 05:16:36
3	17	361.9057312824121	254.45903554354518	20/04/28 05:16:37
3	17	361.9057312824121	254.45903554354518	20/04/28 05:16:38
3	17	363.0633788732786	253.76883669815368	20/04/28 05:16:39
3	30	365.53445097535786	248.80973562593917	20/04/28 05:16:40
3	6	370.63064515039724	245.89555531802912	20/04/28 05:16:41
3	6	370.63064515039724	245.89555531802912	20/04/28 05:16:42
3	6	371.6459156222339	242.1946659303275	20/04/28 05:16:43
3	6	370.63064515039724	245.89555531802912	20/04/28 05:16:44
3	6	374.6648195618352	245.76470510583655	20/04/28 05:16:45
3	6	370.63064515039724	245.89555531802912	20/04/28 05:16:46
3	6	371.6459156222339	242.1946659303275	20/04/28 05:16:47
3	6	371.6459156222339	242.1946659303275	20/04/28 05:16:48
3	6	370.63064515039724	245.89555531802912	20/04/28 05:16:49
3	6	370.63064515039724	245.89555531802912	20/04/28 05:16:50
3	6	370.63064515039724	245.89555531802912	20/04/28 05:16:51
3	6	370.63064515039724	245.89555531802912	20/04/28 05:16:52
3	6	370.63064515039724	245.89555531802912	20/04/28 05:16:53
3	6	369.2791426283047	248.13858758030082	20/04/28 05:16:54
3	6	370.63064515039724	245.89555531802912	20/04/28 05:16:55
3	23	366.2602386887035	244.5685484047918	20/04/28 05:16:56
3	6	370.63064515039724	245.89555531802912	20/04/28 05:16:57
3	6	370.63064515039724	245.89555531802912	20/04/28 05:16:58
3	23	366.2602386887035	244.5685484047918	20/04/28 05:16:59
3	6	366.88595349745043	246.56670336366747	20/04/28 05:17:00
3	57	369.7344725292147	250.04406424506647	20/04/28 05:17:01
3	57	367.74878116626024	253.5829077561766	20/04/28 05:17:02
3	17	363.0633788732786	253.76883669815368	20/04/28 05:17:03
3	17	363.0633788732786	253.76883669815365	20/04/28 05:17:04
3	34	361.2642468288334	255.55936173685845	20/04/28 05:17:05
3	34	361.2642468288334	255.55936173685845	20/04/28 05:17:06
3	34	362.2167196060361	259.70189758364177	20/04/28 05:17:07
3	54	359.5685583521681	263.2279362811352	20/04/28 05:17:08
3	54	359.56855835216805	263.2279362811352	20/04/28 05:17:09
3	34	358.6160855749653	259.08540043435187	20/04/28 05:17:10
3	54	354.3948115151741	261.6556623953523	20/04/28 05:17:11
3	42	352.0898782617341	257.6816897320676	20/04/28 05:17:12
3	54	350.37914153837863	260.97432627346046	20/04/28 05:17:13
3	54	350.37914153837863	260.97432627346046	20/04/28 05:17:14
3	54	347.6038246023418	261.16234003976894	20/04/28 05:17:15
3	54	345.98250818917177	261.859258749847	20/04/28 05:17:16
3	99	339.59375125487367	258.8166372045796	20/04/28 05:17:17
3	99	339.59375125487367	258.8166372045796	20/04/28 05:17:18
3	NULL	337.70753542622793	260.45953294809686	20/04/28 05:17:19
3	54	334.4407240787428	261.4032786809491	20/04/28 05:17:20
3	54	334.4407240787428	261.4032786809491	20/04/28 05:17:21
3	54	334.4407240787428	261.4032786809491	20/04/28 05:17:22
3	54	327.3540763805351	261.1072377077433	20/04/28 05:17:23
3	54	327.3540763805351	261.1072377077433	20/04/28 05:17:24
3	54	324.6837666112415	261.38954335341236	20/04/28 05:17:25
3	54	324.6837666112415	261.38954335341236	20/04/28 05:17:26
3	54	324.01518066743233	262.76750572012435	20/04/28 05:17:27
3	54	321.27015631552865	262.1152944981856	20/04/28 05:17:28
3	54	315.0919378015828	261.7557595783303	20/04/28 05:17:29
1	81	312.6019130172586	265.6450929868838	20/04/28 05:17:30
3	51	312.6019130172586	265.6450929868838	20/04/28 05:17:31
3	NULL	309.29436722642214	263.9851754886794	20/04/28 05:17:32
3	47	305.42047124180004	265.2616066172563	20/04/28 05:17:33
3	47	305.42047124180004	265.2616066172563	20/04/28 05:17:34
3	47	302.8570592601016	265.6207358146814	20/04/28 05:17:35
3	47	302.8570592601016	265.6207358146814	20/04/28 05:17:36
1	98	303.28594423312194	264.61216223098285	20/04/28 05:17:37
1	98	303.28594423312194	264.61216223098285	20/04/28 05:17:38
1	56	307.159840217744	263.3357311024059	20/04/28 05:17:39
1	56	307.159840217744	263.3357311024059	20/04/28 05:17:40
1	56	310.54516511258606	264.60686664592737	20/04/28 05:17:41
1	81	314.50318194109644	265.02915212402996	20/04/28 05:17:42
1	81	314.50318194109644	265.02915212402996	20/04/28 05:17:43
1	81	317.4633882763735	263.93806291016494	20/04/28 05:17:44
1	72	321.1077911072469	264.3050039939337	20/04/28 05:17:45
1	72	322.34915620924	265.0152899264337	20/04/28 05:17:46
1	72	322.34915620924	265.0152899264337	20/04/28 05:17:47
1	72	322.34915620924	265.0152899264337	20/04/28 05:17:48
1	37	325.93617404217133	264.20930050997885	20/04/28 05:17:49
1	37	326.6418503961265	263.9569908021342	20/04/28 05:17:50
1	37	328.6595361715347	265.54010938954724	20/04/28 05:17:51
1	56	333.50170633168455	266.97796434330365	20/04/28 05:17:52
1	56	333.50170633168455	266.9779643433037	20/04/28 05:17:53
3	26	337.2720802919978	268.9776784695725	20/04/28 05:17:54
1	83	337.2720802919978	268.9776784695725	20/04/28 05:17:55
1	NULL	344.77216199423657	268.7257539392073	20/04/28 05:17:56
1	NULL	344.77216199423657	268.7257539392073	20/04/28 05:17:57
1	NULL	344.77216199423657	268.7257539392073	20/04/28 05:17:58
1	NULL	344.7721619942365	268.7257539392073	20/04/28 05:17:59
3	54	349.2732493252067	263.17227144197165	20/04/28 05:18:00
1	56	354.69152875933173	267.5245000157351	20/04/28 05:18:01
1	45	354.92432902796776	273.612071983729	20/04/28 05:18:02
1	10	356.9884669306864	271.1056044765582	20/04/28 05:18:03
1	45	354.79530148656744	274.7767083531221	20/04/28 05:18:04
1	45	354.92432902796776	273.612071983729	20/04/28 05:18:05
1	45	354.79530148656744	274.7767083531221	20/04/28 05:18:06
1	45	354.92432902796776	273.612071983729	20/04/28 05:18:07
1	45	354.92432902796776	273.612071983729	20/04/28 05:18:08
1	45	354.92432902796776	273.612071983729	20/04/28 05:18:09
1	45	354.79530148656744	274.7767083531221	20/04/28 05:18:10
1	78	355.31882396769544	270.0122199638177	20/04/28 05:18:11
1	45	354.92432902796776	273.612071983729	20/04/28 05:18:12
1	78	349.76066031627084	270.83254952132285	20/04/28 05:18:13
3	62	350.59854891528283	266.7667040052482	20/04/28 05:18:14
1	56	346.99665348868166	266.75627288844595	20/04/28 05:18:15
1	56	347.1015550400778	267.75524459266785	20/04/28 05:18:16
1	NULL	344.77216199423657	268.7257539392073	20/04/28 05:18:17
1	NULL	344.77216199423657	268.7257539392073	20/04/28 05:18:18
1	83	340.9578832578555	269.4583269118801	20/04/28 05:18:19
3	26	337.2720802919978	268.9776784695725	20/04/28 05:18:20
3	28	333.50170633168455	266.9779643433037	20/04/28 05:18:21
1	56	333.50170633168455	266.9779643433037	20/04/28 05:18:22
1	56	332.3533251581634	266.3650631324579	20/04/28 05:18:23
1	56	332.3533251581634	266.3650631324579	20/04/28 05:18:24
1	37	325.93617404217133	264.20930050997885	20/04/28 05:18:25
1	37	325.93617404217133	264.20930050997885	20/04/28 05:18:26
1	37	323.6597216964546	264.1572674834102	20/04/28 05:18:27
1	72	322.34915620924	265.0152899264337	20/04/28 05:18:28
1	72	322.34915620924	265.0152899264337	20/04/28 05:18:29
1	56	319.89662212153377	266.1573209564685	20/04/28 05:18:30
1	81	316.8584991431141	264.5437756453438	20/04/28 05:18:31
1	81	314.50318194109644	265.02915212402996	20/04/28 05:18:32
1	81	311.6591172126105	263.4112042347413	20/04/28 05:18:33
1	56	307.159840217744	263.3357311024059	20/04/28 05:18:34
1	56	307.159840217744	263.3357311024059	20/04/28 05:18:35
1	98	303.28594423312194	264.61216223098285	20/04/28 05:18:36
1	98	303.4235469930243	265.77780366757264	20/04/28 05:18:37
1	98	303.28594423312194	264.61216223098285	20/04/28 05:18:38
3	47	302.8570592601016	265.6207358146814	20/04/28 05:18:39
3	47	305.42047124180004	265.2616066172563	20/04/28 05:18:40
3	47	305.42047124180004	265.2616066172563	20/04/28 05:18:41
3	20	308.1866193271433	264.1749199815553	20/04/28 05:18:42
1	56	309.29436722642214	263.9851754886794	20/04/28 05:18:43
1	81	312.6019130172586	265.6450929868838	20/04/28 05:18:44
1	81	314.966663003447	265.07112173294576	20/04/28 05:18:45
3	18	319.8343160301783	266.2886790958246	20/04/28 05:18:46
3	54	321.27015631552865	262.1152944981856	20/04/28 05:18:47
3	18	323.5974156050991	264.28862562276623	20/04/28 05:18:48
