floorId	partitionId	location_x	location_y	timeStamp
1	93	333.5569014105355	299.4196149908338	20/04/28 05:14:41
1	93	333.5569014105355	299.4196149908338	20/04/28 05:14:41
1	93	333.41518539566374	299.5980633247179	20/04/28 05:14:41
1	93	333.3979109229033	299.61977090536607	20/04/28 05:14:41
1	93	333.3796387542423	299.8876945976522	20/04/28 05:14:41
1	93	333.3796387542423	299.8876945976522	20/04/28 05:14:41
1	93	333.39822808444933	299.8785691089277	20/04/28 05:14:41
1	93	333.4394431662571	299.95237792807495	20/04/28 05:14:41
1	93	333.31907255816685	299.7172691941288	20/04/28 05:14:42
1	93	333.26956287623045	299.5979165980529	20/04/28 05:14:42
1	93	333.12622610906686	299.78425786374925	20/04/28 05:14:42
1	93	333.20968437874507	299.9216362683261	20/04/28 05:14:42
1	93	333.1852384580625	299.93319724686546	20/04/28 05:14:42
1	93	333.21331547325485	299.91588522157366	20/04/28 05:14:42
1	93	333.34517818299236	299.9399038544236	20/04/28 05:14:42
1	93	333.4492442901424	299.7870354571684	20/04/28 05:14:42
1	93	333.361140303439	299.6692828642287	20/04/28 05:14:42
1	93	333.5946187858477	299.56423668728047	20/04/28 05:14:42
1	93	333.5225938219529	299.3548061208811	20/04/28 05:14:43
1	93	333.7407276167693	299.26935520831313	20/04/28 05:14:43
1	93	333.64601414241946	299.5518684729236	20/04/28 05:14:43
1	93	333.50036821337636	299.4897200645673	20/04/28 05:14:43
1	93	333.67619018711645	299.39447586730853	20/04/28 05:14:43
1	93	333.59330881945	299.27840302425767	20/04/28 05:14:43
1	93	333.64244709759663	299.3177905237222	20/04/28 05:14:43
1	93	333.64922388900396	299.1906666489818	20/04/28 05:14:43
1	93	333.65361715483976	299.182783634911	20/04/28 05:14:43
1	93	333.42106908249224	299.1459237854857	20/04/28 05:14:44
1	93	333.3984678462851	299.14276364495885	20/04/28 05:14:44
1	93	333.4340269663012	299.2057715603558	20/04/28 05:14:44
1	93	333.3584841244215	299.16181665600976	20/04/28 05:14:44
1	93	333.25846194874947	298.98591014122655	20/04/28 05:14:44
1	93	333.3455073299179	299.16123577213983	20/04/28 05:14:44
1	93	333.50287847232676	299.12014065069997	20/04/28 05:14:44
1	93	333.607043846983	299.24883021019764	20/04/28 05:14:44
1	93	333.5729343455257	299.3203767603755	20/04/28 05:14:44
1	93	333.6196594232312	299.2551325592053	20/04/28 05:14:44
1	93	333.79992269926635	299.0491658937514	20/04/28 05:14:45
1	93	333.5654241169529	299.0840790200741	20/04/28 05:14:45
1	93	333.5560028900244	299.09621265607024	20/04/28 05:14:45
1	93	333.50307177601474	298.84187946349465	20/04/28 05:14:45
1	93	333.5133782580422	298.9447948861964	20/04/28 05:14:45
1	93	333.6779195525985	298.82887987158483	20/04/28 05:14:45
1	93	333.6538622779957	298.9851513312942	20/04/28 05:14:45
1	93	333.5578796696431	299.11071986912873	20/04/28 05:14:45
1	93	333.55346103484027	299.1070992374808	20/04/28 05:14:45
1	93	333.5108739034045	298.971012577365	20/04/28 05:14:46
1	93	333.5088166545413	298.96937273702474	20/04/28 05:14:46
1	93	333.59210877184285	298.9054260568196	20/04/28 05:14:46
1	93	333.4524919566952	299.1036273902623	20/04/28 05:14:46
1	93	333.7379570031571	299.07744443721043	20/04/28 05:14:46
1	93	333.73506351607114	299.07431356204614	20/04/28 05:14:46
1	93	333.7800814308312	299.0684672565044	20/04/28 05:14:46
1	93	333.8936226682996	298.998292294784	20/04/28 05:14:46
1	93	333.8005124670698	298.9770685979628	20/04/28 05:14:46
1	93	333.80720538598956	299.11138021674	20/04/28 05:14:46
1	93	333.75598134577825	298.87157981171003	20/04/28 05:14:47
1	93	333.80506174173405	298.87470066888267	20/04/28 05:14:47
1	93	333.7380824244981	298.90661256480485	20/04/28 05:14:47
1	93	333.7108613740507	298.87561438963394	20/04/28 05:14:47
1	93	333.7127419243773	298.89033853867096	20/04/28 05:14:47
1	93	333.71365545195414	298.9488887701677	20/04/28 05:14:47
1	93	333.63959961156746	298.8732384402928	20/04/28 05:14:47
1	93	333.6497675481537	298.9330530699185	20/04/28 05:14:47
1	93	333.6653322152733	299.12260699088654	20/04/28 05:14:47
1	93	333.54656058028803	299.10163039568414	20/04/28 05:14:47
1	93	333.6107961783472	299.06014928066384	20/04/28 05:14:48
1	93	333.410361515082	299.143434427321	20/04/28 05:14:48
1	93	333.39205738930497	299.3306001646999	20/04/28 05:14:48
1	93	333.5831337506227	299.4926305996812	20/04/28 05:14:48
1	93	333.6068222409641	299.4970779615637	20/04/28 05:14:48
1	93	333.57955634604343	299.449572999003	20/04/28 05:14:48
1	93	333.4751224194717	299.53358393411156	20/04/28 05:14:48
1	93	333.209065011225	299.51446534493914	20/04/28 05:14:48
1	93	333.209065011225	299.51446534493914	20/04/28 05:14:48
1	93	333.209065011225	299.51446534493914	20/04/28 05:14:49
1	93	333.1139668110412	299.47672300602005	20/04/28 05:14:49
1	93	332.81671923160775	299.4793773784941	20/04/28 05:14:49
1	93	332.713413667413	299.64585310622823	20/04/28 05:14:49
1	93	332.58938092274116	299.49692964574996	20/04/28 05:14:49
1	93	332.8730901812821	299.5578559726594	20/04/28 05:14:49
1	93	332.7971980403972	299.58360279293146	20/04/28 05:14:49
1	93	332.5663161377095	299.56889434558684	20/04/28 05:14:49
1	93	332.5331618725094	299.5979647082265	20/04/28 05:14:49
1	93	332.5072182692248	299.6168483782248	20/04/28 05:14:49
1	93	332.51833987765485	299.6117465320849	20/04/28 05:14:50
1	93	332.5187418582173	299.6091078597766	20/04/28 05:14:50
1	93	332.4719736850491	299.6589837252774	20/04/28 05:14:50
1	93	332.19799959883983	299.5816604739954	20/04/28 05:14:50
1	93	331.96847275219983	299.3885659048552	20/04/28 05:14:50
1	93	331.88323991723706	299.2712634402491	20/04/28 05:14:50
1	93	331.72458547775585	299.3775390421147	20/04/28 05:14:50
1	93	331.7140118805103	299.3112969479883	20/04/28 05:14:50
1	93	331.77516548651425	299.05386084254815	20/04/28 05:14:50
1	93	331.6555627181511	299.2425390625701	20/04/28 05:14:51
1	93	331.74667168945257	299.1984740889149	20/04/28 05:14:51
1	93	331.905132987989	299.33939629806014	20/04/28 05:14:51
1	93	331.90533906010864	299.3382943697404	20/04/28 05:14:51
1	93	331.89776277043796	299.13683158808743	20/04/28 05:14:51
1	93	331.91550020952855	299.3853787409334	20/04/28 05:14:51
1	93	331.95932313169106	299.38735482612924	20/04/28 05:14:51
1	93	332.2012330103527	299.2121170227379	20/04/28 05:14:51
1	93	332.4451860007683	299.28838118912176	20/04/28 05:14:51
1	93	332.5725764986325	299.2787268719191	20/04/28 05:14:51
1	93	332.51159930317965	299.31659710376357	20/04/28 05:14:52
1	93	332.37151422214407	299.47894332607314	20/04/28 05:14:52
1	93	332.60564763622483	299.476867612874	20/04/28 05:14:52
1	93	332.8724278461738	299.5740053262813	20/04/28 05:14:52
1	93	332.8718828784675	299.6317123404772	20/04/28 05:14:52
1	93	332.8346231481745	299.5113911248973	20/04/28 05:14:52
1	93	332.9675609341641	299.5655509139929	20/04/28 05:14:52
1	93	332.9763203391353	299.5039403206631	20/04/28 05:14:52
1	93	333.1959735461233	299.4227636222608	20/04/28 05:14:52
1	93	333.24863200230095	299.43460305038144	20/04/28 05:14:52
1	93	333.07085880559106	299.48188268683015	20/04/28 05:14:53
1	93	333.1466247660832	299.5475490785182	20/04/28 05:14:53
1	93	333.13834848901854	299.7750741649528	20/04/28 05:14:53
1	93	333.131556796985	299.7228536877137	20/04/28 05:14:53
1	93	333.10228630865464	299.6804747712543	20/04/28 05:14:53
1	93	333.03501385842253	299.7940781158909	20/04/28 05:14:53
1	93	333.0509373794135	299.832573074163	20/04/28 05:14:53
1	93	332.97197105425926	299.76103953275646	20/04/28 05:14:53
1	93	333.0471202070114	299.6478924841131	20/04/28 05:14:53
1	93	333.0287898949384	299.67916621192995	20/04/28 05:14:54
1	93	333.02641974478036	299.63329570634426	20/04/28 05:14:54
1	93	332.97070668188024	299.7380198698455	20/04/28 05:14:54
1	93	333.1027718236705	299.48506703805884	20/04/28 05:14:54
1	93	333.0113562724274	299.42447410737117	20/04/28 05:14:54
1	93	333.0709203457539	299.3700221019596	20/04/28 05:14:54
1	93	333.16922548617066	299.45830417929045	20/04/28 05:14:54
1	93	333.2642081237123	299.49321706797605	20/04/28 05:14:54
1	93	332.9993799333813	299.5681650478248	20/04/28 05:14:54
1	93	332.9996075098362	299.632955418349	20/04/28 05:14:54
1	93	332.98577164961756	299.63290588300544	20/04/28 05:14:55
1	93	332.99200431829985	299.6208674405317	20/04/28 05:14:55
1	93	333.02157968377657	299.89547687755385	20/04/28 05:14:55
1	93	333.1573450561381	299.97021471980673	20/04/28 05:14:55
1	93	333.42406871739644	299.94128318667464	20/04/28 05:14:55
1	93	333.44516031852066	299.8773838659892	20/04/28 05:14:55
1	93	333.6391648254063	299.72112238161253	20/04/28 05:14:55
1	93	333.67517517711224	299.77606402306105	20/04/28 05:14:55
1	93	333.508875877608	299.78668885675467	20/04/28 05:14:55
1	93	333.44883844413664	299.8395021727625	20/04/28 05:14:55
1	93	333.38435836971775	299.5824865573982	20/04/28 05:14:56
1	93	333.38742855958975	299.53870680465633	20/04/28 05:14:56
1	93	333.13181115721187	299.40029414547655	20/04/28 05:14:56
1	93	333.119207907603	299.3797994993912	20/04/28 05:14:56
1	93	333.21028242371875	299.42022903713377	20/04/28 05:14:56
1	93	333.17967409024556	299.195766708365	20/04/28 05:14:56
1	93	333.4189845060461	299.36531237223204	20/04/28 05:14:56
1	93	333.3568341612347	299.5114563531227	20/04/28 05:14:56
1	93	333.385754324255	299.49749942826605	20/04/28 05:14:56
1	93	333.45760563788286	299.48335750601296	20/04/28 05:14:57
1	93	333.3576027395213	299.5460444594896	20/04/28 05:14:57
1	93	333.25717185387083	299.50384698809285	20/04/28 05:14:57
1	93	333.3098003550741	299.79694628511237	20/04/28 05:14:57
1	93	333.32831568460267	299.7890686676746	20/04/28 05:14:57
1	93	333.3080050817225	299.7952249050708	20/04/28 05:14:57
1	93	333.58134264129296	299.7953091500688	20/04/28 05:14:57
1	93	333.6573394826816	299.9307160269466	20/04/28 05:14:57
1	93	333.56828480467937	299.7842683696269	20/04/28 05:14:57
1	93	333.5818668007684	299.78201083270017	20/04/28 05:14:57
1	93	333.5970612491606	299.91509601201443	20/04/28 05:14:58
1	93	333.41805731667995	299.76071614392976	20/04/28 05:14:58
1	93	333.50520288903556	299.63735797305293	20/04/28 05:14:58
1	93	333.4608115731779	299.6403340313545	20/04/28 05:14:58
1	93	333.66338765305676	299.77597804469343	20/04/28 05:14:58
1	93	333.6649407835719	299.77235136667406	20/04/28 05:14:58
1	93	333.6263070477355	299.9409118475617	20/04/28 05:14:58
1	93	333.65899944123794	299.9333970097322	20/04/28 05:14:58
1	93	333.80727720738565	299.9601371314179	20/04/28 05:14:58
1	93	334.0101225407873	299.845296548124	20/04/28 05:14:59
1	93	333.8249493727225	299.8654561045974	20/04/28 05:14:59
1	93	333.57240843865753	299.8975064808419	20/04/28 05:14:59
1	93	333.37613648851817	299.7519970034587	20/04/28 05:14:59
1	93	333.42377129351013	299.6330886050375	20/04/28 05:14:59
1	93	333.50342316188267	299.89539295581625	20/04/28 05:14:59
1	93	333.63517657196803	299.9808383553542	20/04/28 05:14:59
1	93	333.57150482451783	299.9050470213843	20/04/28 05:14:59
1	93	333.6862927652651	299.93366223391706	20/04/28 05:14:59
1	93	333.8247679826596	299.7335723473269	20/04/28 05:14:59
1	93	333.83855377471997	299.5748632185587	20/04/28 05:15:00
1	93	333.78161593023657	299.3823262890483	20/04/28 05:15:00
1	93	333.510631110099	299.4579363385393	20/04/28 05:15:00
1	93	333.50992640473027	299.4699390308275	20/04/28 05:15:00
1	93	333.4078697097929	299.2851592933073	20/04/28 05:15:00
1	93	333.3240749107186	299.47940334712933	20/04/28 05:15:00
1	93	333.3416325460246	299.52861758417873	20/04/28 05:15:00
1	93	333.20973998996413	299.4466340395963	20/04/28 05:15:00
1	93	333.2894840454724	299.39264420280705	20/04/28 05:15:00
1	93	333.3573509266413	299.53884868232507	20/04/28 05:15:00
1	93	333.34724799732146	299.54985730971055	20/04/28 05:15:01
1	93	333.337783458308	299.5578828024533	20/04/28 05:15:01
1	93	333.43442232006623	299.4100775682128	20/04/28 05:15:01
1	93	333.6492964106227	299.5163932267109	20/04/28 05:15:01
1	93	333.67044055239995	299.546457375696	20/04/28 05:15:01
1	93	333.59641373466997	299.71499850368764	20/04/28 05:15:01
1	93	333.68460895077294	299.84382381651784	20/04/28 05:15:01
1	93	333.56472003433703	299.6382214897792	20/04/28 05:15:01
1	93	333.41631916857034	299.61089075298645	20/04/28 05:15:01
1	93	333.49512761895886	299.5928666935204	20/04/28 05:15:02
1	93	333.65271025363484	299.54723975205127	20/04/28 05:15:02
1	93	333.65271025363484	299.54723975205127	20/04/28 05:15:02
1	93	333.65271025363484	299.54723975205127	20/04/28 05:15:02
1	93	333.59573458088977	299.6180871528697	20/04/28 05:15:02
1	93	333.6964299613886	299.5016765888305	20/04/28 05:15:02
1	93	333.67005377807334	299.3177269581876	20/04/28 05:15:02
1	93	333.47642238925494	299.3782755314862	20/04/28 05:15:02
1	93	333.45024445663483	299.42409261321984	20/04/28 05:15:02
1	93	333.34234925013254	299.6932416772489	20/04/28 05:15:02
1	93	333.4558291863011	299.93200312557184	20/04/28 05:15:03
1	93	333.454592720092	299.91942189444336	20/04/28 05:15:03
1	93	333.23263468517143	299.7809874360705	20/04/28 05:15:03
1	93	333.5287308773467	299.8128804324855	20/04/28 05:15:03
1	93	333.55875022264496	299.7768013037851	20/04/28 05:15:03
1	93	333.7274842300841	299.642339592544	20/04/28 05:15:03
1	93	333.93382957675476	299.643883717518	20/04/28 05:15:03
1	93	333.9928952252491	299.39708723171725	20/04/28 05:15:03
1	93	333.88016217098914	299.66134291192606	20/04/28 05:15:03
1	93	333.8768266281216	299.6205779907912	20/04/28 05:15:03
1	93	333.8479693525505	299.61881078628863	20/04/28 05:15:04
1	93	333.73055919260145	299.65290774360227	20/04/28 05:15:04
1	93	333.8176117173191	299.418407793306	20/04/28 05:15:04
1	93	333.7521008665403	299.3992554347968	20/04/28 05:15:04
1	93	333.94634063711334	299.28439956608577	20/04/28 05:15:04
1	93	333.9222543670459	299.2566193952148	20/04/28 05:15:04
1	93	334.0638008795205	299.0448773574771	20/04/28 05:15:04
1	93	333.9594309843075	299.09996170978997	20/04/28 05:15:04
1	93	333.9639404012348	298.81755692449747	20/04/28 05:15:04
1	93	333.87474772405363	298.9467666233258	20/04/28 05:15:05
1	93	333.907414050547	298.9916910566741	20/04/28 05:15:05
1	93	333.7139751198545	298.8913816096538	20/04/28 05:15:05
1	93	333.71077680649677	298.7237287780306	20/04/28 05:15:05
1	93	333.73695132750123	298.88837326646336	20/04/28 05:15:05
1	93	333.81413061049807	298.72649135481856	20/04/28 05:15:05
1	93	333.8092998375839	298.7305447302082	20/04/28 05:15:05
1	93	333.83608256748533	298.7727483327911	20/04/28 05:15:05
1	93	333.77325089178066	298.9108998625544	20/04/28 05:15:05
1	93	333.8310539922349	298.8735721629119	20/04/28 05:15:05
1	93	333.7696583179339	298.91332622751213	20/04/28 05:15:06
1	93	333.6588771199258	298.8133385738265	20/04/28 05:15:06
1	93	333.66372612370986	298.72325305136854	20/04/28 05:15:06
1	93	333.5568473012403	298.6204013628218	20/04/28 05:15:06
1	93	333.6585556515179	298.8195834812563	20/04/28 05:15:06
1	93	333.70700355430245	299.06959177159433	20/04/28 05:15:06
1	93	333.7155122514316	299.0017595314134	20/04/28 05:15:06
1	93	333.6207033524793	299.02817194909085	20/04/28 05:15:06
1	93	333.6043539274534	299.27626185392677	20/04/28 05:15:06
1	93	333.7013815938963	299.2799081152099	20/04/28 05:15:07
1	93	333.98026572015596	299.27081164127986	20/04/28 05:15:07
1	93	334.0087955140976	299.28050578111333	20/04/28 05:15:07
1	93	334.31776666414913	299.51963851232966	20/04/28 05:15:07
1	93	334.28154017007796	299.51912005167895	20/04/28 05:15:07
1	93	334.28154017007796	299.51912005167895	20/04/28 05:15:07
1	93	334.2126362403484	299.5215083255042	20/04/28 05:15:07
1	93	334.1954436390518	299.7970944049365	20/04/28 05:15:07
1	93	334.1954436390518	299.7970944049365	20/04/28 05:15:07
1	93	334.1954436390518	299.7970944049365	20/04/28 05:15:07
1	93	334.362616474196	299.7917314727469	20/04/28 05:15:08
1	93	334.4362075096114	299.71886218352046	20/04/28 05:15:08
1	93	334.4362075096114	299.71886218352046	20/04/28 05:15:08
1	93	334.54328237013806	299.5755937307514	20/04/28 05:15:08
1	93	334.43430742306685	299.7954728013897	20/04/28 05:15:08
1	93	334.55070841379285	299.57807598234297	20/04/28 05:15:08
1	93	334.65795450678866	299.44112259957075	20/04/28 05:15:08
1	93	334.7400766324187	299.5344835429191	20/04/28 05:15:08
1	93	334.7400766324187	299.5344835429191	20/04/28 05:15:08
1	93	334.6525833047113	299.49012888800075	20/04/28 05:15:08
1	93	334.5743477614769	299.50697634940116	20/04/28 05:15:09
1	93	334.59811242354635	299.4786597749866	20/04/28 05:15:09
1	93	334.5950327374579	299.4818993529937	20/04/28 05:15:09
1	93	334.46410914320995	299.6064679724624	20/04/28 05:15:09
1	93	334.62878935913506	299.36202843387855	20/04/28 05:15:09
1	93	334.62878935913506	299.36202843387855	20/04/28 05:15:09
1	93	334.8396623053946	299.193886013246	20/04/28 05:15:09
1	93	334.8393924515795	299.19392775171815	20/04/28 05:15:09
1	93	334.69521020695123	299.12996109567695	20/04/28 05:15:09
1	93	334.5179958777907	299.10706320308043	20/04/28 05:15:10
1	93	334.49085986517923	299.136768077524	20/04/28 05:15:10
1	93	334.66387857962957	299.2222093096352	20/04/28 05:15:10
1	93	334.57034946212144	298.98231307637496	20/04/28 05:15:10
1	93	334.5687635488094	298.9837664258982	20/04/28 05:15:10
1	93	334.44127721702637	299.24119916903254	20/04/28 05:15:10
1	93	334.3934515795633	298.98116191546853	20/04/28 05:15:10
1	93	334.392557329737	298.9665667657946	20/04/28 05:15:10
1	93	334.392557329737	298.9665667657946	20/04/28 05:15:10
1	93	334.4293533756913	299.10632809084046	20/04/28 05:15:10
1	93	334.6223861635822	298.95290320849796	20/04/28 05:15:11
1	93	334.4813410834725	299.04220614565645	20/04/28 05:15:11
1	93	334.3503920395594	299.03663759890827	20/04/28 05:15:11
1	93	334.3503920395594	299.03663759890827	20/04/28 05:15:11
1	93	334.1677681094162	298.80081317793866	20/04/28 05:15:11
1	93	334.30841543193213	298.750356414545	20/04/28 05:15:11
1	93	334.0901485383521	298.9345513033967	20/04/28 05:15:11
1	93	333.9733678953354	299.00571201728343	20/04/28 05:15:11
1	93	333.691098039596	299.05195572056687	20/04/28 05:15:11
1	93	333.6704354166987	299.0644594446526	20/04/28 05:15:11
1	93	333.41325459977463	298.9908602289154	20/04/28 05:15:12
1	93	333.5205022793817	299.0574204794504	20/04/28 05:15:12
1	93	333.4194194450653	299.23199313326376	20/04/28 05:15:12
1	93	333.22532111214304	299.1308322156615	20/04/28 05:15:12
1	93	333.0145987857249	299.1295363018955	20/04/28 05:15:12
1	93	332.99644261154225	299.07297072201163	20/04/28 05:15:12
1	93	333.16825630674265	298.953099905701	20/04/28 05:15:12
1	93	333.1222279800865	298.9005369833917	20/04/28 05:15:12
1	93	333.2240294238801	299.11161513937753	20/04/28 05:15:12
1	93	333.3664947275722	299.1519350794905	20/04/28 05:15:13
1	93	333.3739130578534	299.1452055400869	20/04/28 05:15:13
1	93	333.26899540546174	299.28844088018127	20/04/28 05:15:13
1	93	333.29628267624315	299.42892096905564	20/04/28 05:15:13
1	93	333.08117421356934	299.23637009296095	20/04/28 05:15:13
1	93	333.16713077546746	299.2346810366139	20/04/28 05:15:13
1	93	333.30144575221203	299.37182856219266	20/04/28 05:15:13
1	93	333.22836162857135	299.3687482236711	20/04/28 05:15:13
1	93	333.21150899628935	299.2221552655462	20/04/28 05:15:13
1	93	333.1907093948113	299.2256397481295	20/04/28 05:15:13
1	93	333.15105018961094	299.29562213416676	20/04/28 05:15:14
1	93	333.15105018961094	299.29562213416676	20/04/28 05:15:14
1	93	333.15105018961094	299.29562213416676	20/04/28 05:15:14
1	93	333.2208611455983	299.3930228128512	20/04/28 05:15:14
1	93	333.49776732594825	299.43598094928257	20/04/28 05:15:14
1	93	333.2033907526055	299.32829936960303	20/04/28 05:15:14
1	93	333.20928653242294	299.3234625493386	20/04/28 05:15:14
1	93	333.20928653242294	299.3234625493386	20/04/28 05:15:14
1	93	333.2341798507822	299.47970057841184	20/04/28 05:15:14
1	93	333.13169079963586	299.49968244291216	20/04/28 05:15:15
1	93	332.928576047371	299.57626295952014	20/04/28 05:15:15
1	93	333.0964785821952	299.65510780105075	20/04/28 05:15:15
1	93	332.96426874962475	299.91945877292665	20/04/28 05:15:15
1	93	332.97521551731415	299.8911856414465	20/04/28 05:15:15
1	93	332.7788254920546	299.96912898639664	20/04/28 05:15:15
1	93	332.9036040080954	299.832768933084	20/04/28 05:15:15
1	93	332.8079288811443	299.8711759437931	20/04/28 05:15:15
1	93	332.8637577717383	299.7560697752344	20/04/28 05:15:15
1	93	332.87129301147274	299.5016641256481	20/04/28 05:15:15
1	93	333.11676923587754	299.4533010136594	20/04/28 05:15:16
1	93	333.35983809309806	299.5135370303534	20/04/28 05:15:16
1	93	333.25939964766746	299.6740085329998	20/04/28 05:15:16
1	93	333.5014346185449	299.5165049356517	20/04/28 05:15:16
1	93	333.6960531249547	299.30334259509647	20/04/28 05:15:16
1	93	333.6960531249547	299.30334259509647	20/04/28 05:15:16
1	93	333.68811336767976	299.34842644098194	20/04/28 05:15:16
1	93	333.8267529909725	299.592587584315	20/04/28 05:15:16
1	93	333.7140244766044	299.6300541474288	20/04/28 05:15:16
1	93	333.7140244766044	299.6300541474288	20/04/28 05:15:16
1	93	333.7981016964744	299.37695892757785	20/04/28 05:15:17
1	93	333.7981016964744	299.37695892757785	20/04/28 05:15:17
1	93	333.56089549908353	299.1405431255849	20/04/28 05:15:17
1	93	333.5891828092756	299.11455404439414	20/04/28 05:15:17
1	93	333.63053357260304	299.31720490712115	20/04/28 05:15:17
1	93	333.85079746990493	299.18041548392364	20/04/28 05:15:17
1	93	333.99117349095405	299.19177981153143	20/04/28 05:15:17
1	93	333.99117349095405	299.19177981153143	20/04/28 05:15:17
1	93	334.05803238196233	299.0264001726603	20/04/28 05:15:17
1	93	333.91083878237663	298.9169491424927	20/04/28 05:15:18
1	93	333.9707750545814	298.7926143193265	20/04/28 05:15:18
1	93	333.9391243568181	298.7852876766931	20/04/28 05:15:18
1	93	333.9032792616219	298.8075790248057	20/04/28 05:15:18
1	93	334.1837565393049	298.9051558454454	20/04/28 05:15:18
1	93	334.182386173467	298.85339077192054	20/04/28 05:15:18
1	93	334.1805985926142	298.9904043365301	20/04/28 05:15:18
1	93	334.13080150082646	299.18861765310834	20/04/28 05:15:18
1	93	334.1771861038419	299.09779539751435	20/04/28 05:15:18
1	93	334.2932159462859	299.02492566883177	20/04/28 05:15:18
1	93	334.4153873718208	298.91586013374706	20/04/28 05:15:19
1	93	334.64817619522876	298.9889104132091	20/04/28 05:15:19
1	93	334.7478497773642	299.0014867773726	20/04/28 05:15:19
1	93	334.6374289369614	299.0347231938009	20/04/28 05:15:19
1	93	334.4951271467103	299.1843436222527	20/04/28 05:15:19
1	93	334.2966242531855	299.0895080809101	20/04/28 05:15:19
1	93	334.2907770866731	299.0629745643315	20/04/28 05:15:19
1	93	334.3040741703541	299.2309092835001	20/04/28 05:15:19
1	93	334.3040741703541	299.2309092835001	20/04/28 05:15:19
1	93	334.3040741703541	299.2309092835001	20/04/28 05:15:19
1	93	334.28508632393704	299.09234423051174	20/04/28 05:15:20
1	93	334.01239937349726	299.0883688147509	20/04/28 05:15:20
1	93	333.9856890320732	299.1697509526538	20/04/28 05:15:20
1	93	333.7367657652195	299.20889979738234	20/04/28 05:15:20
1	93	333.82246652914927	299.16837383188033	20/04/28 05:15:20
1	93	333.70047944563714	299.21006301360404	20/04/28 05:15:20
1	93	333.8918276420232	299.2467676768195	20/04/28 05:15:20
1	93	333.9541424530752	299.28710479394243	20/04/28 05:15:20
1	93	333.74981743568117	299.35863131326994	20/04/28 05:15:20
1	93	333.78212515855745	299.2176145210741	20/04/28 05:15:21
1	93	333.8069753765806	299.22907825842873	20/04/28 05:15:21
1	93	333.702728743452	299.238506174419	20/04/28 05:15:21
1	93	333.6660239164089	299.2369640317568	20/04/28 05:15:21
1	93	333.7033088624579	299.239446841159	20/04/28 05:15:21
1	93	333.736045011935	299.3885827821263	20/04/28 05:15:21
1	93	333.8164915041465	299.2163850588826	20/04/28 05:15:21
1	93	333.92854280254335	298.98997143570506	20/04/28 05:15:21
1	93	333.83996992535145	298.8905983767569	20/04/28 05:15:21
1	93	333.62345504213454	298.8316536638314	20/04/28 05:15:21
1	93	333.5278994341217	298.89100786532504	20/04/28 05:15:22
1	93	333.5884376513693	298.7126744565241	20/04/28 05:15:22
1	93	333.6606257650767	298.6327041151361	20/04/28 05:15:22
1	93	333.67204007973584	298.61326046379145	20/04/28 05:15:22
1	93	333.75051777781204	298.7597775697837	20/04/28 05:15:22
1	93	333.63426032140364	298.81930858182943	20/04/28 05:15:22
1	93	333.67478937063044	298.93702082703504	20/04/28 05:15:22
1	93	333.67693768666174	298.9466142507743	20/04/28 05:15:22
1	93	333.674795311888	298.9488638762998	20/04/28 05:15:22
1	93	333.73827797462934	298.9682445630309	20/04/28 05:15:22
1	93	333.8968617691683	298.9480333782963	20/04/28 05:15:23
1	93	333.9054550173837	298.9564869655568	20/04/28 05:15:23
1	93	333.82466177763393	299.00448731486995	20/04/28 05:15:23
1	93	333.8741214901344	299.01571881715006	20/04/28 05:15:23
1	93	333.8862092509283	299.07661259863494	20/04/28 05:15:23
1	93	333.9162780819507	299.07247671773524	20/04/28 05:15:23
1	93	333.846667280269	299.1009621962948	20/04/28 05:15:23
1	93	333.79370624912934	299.27014870694273	20/04/28 05:15:23
1	93	333.8213392727604	299.1890242794286	20/04/28 05:15:23
1	93	333.79578920072214	299.3929264123376	20/04/28 05:15:24
1	93	333.8321463182795	299.61490423850955	20/04/28 05:15:24
1	93	333.88136296534003	299.58226949490137	20/04/28 05:15:24
1	93	333.7828949831816	299.50996034661335	20/04/28 05:15:24
1	93	333.87778074908425	299.5714244538655	20/04/28 05:15:24
1	93	334.14521269185	299.63883704156416	20/04/28 05:15:24
1	93	334.02697289306616	299.6962938067065	20/04/28 05:15:24
1	93	334.01946613115575	299.7715025119982	20/04/28 05:15:24
1	93	333.9972330162221	299.96223974575497	20/04/28 05:15:24
1	93	334.11721883623494	299.8961534359791	20/04/28 05:15:24
1	93	334.15525007011945	299.91876032888456	20/04/28 05:15:25
1	93	334.0364316073194	299.93460233153	20/04/28 05:15:25
1	93	334.0458141368158	299.892337665932	20/04/28 05:15:25
1	93	334.2120755290923	299.8710924779852	20/04/28 05:15:25
1	93	334.24512951863693	299.8962132161208	20/04/28 05:15:25
1	93	334.3422038819672	299.8921206500768	20/04/28 05:15:25
1	93	334.3282694624305	299.59603102410506	20/04/28 05:15:25
1	93	334.1734462771871	299.3738059779279	20/04/28 05:15:25
1	93	334.1702658822586	299.37464235963597	20/04/28 05:15:25
1	93	334.3250260048731	299.17344111644087	20/04/28 05:15:25
1	93	334.39590455670333	299.2049602094007	20/04/28 05:15:26
1	93	334.49101459091037	299.170289737361	20/04/28 05:15:26
1	93	334.4634717155365	299.2156309311299	20/04/28 05:15:26
1	93	334.4158191597464	299.1619998677019	20/04/28 05:15:26
1	93	334.4733718269455	299.1865445735082	20/04/28 05:15:26
1	93	334.3774231852693	299.32426591030867	20/04/28 05:15:26
1	93	334.35278318778194	299.5943121565924	20/04/28 05:15:26
1	93	334.4580796791346	299.7531617691993	20/04/28 05:15:26
1	93	334.5045328006047	299.92756487865086	20/04/28 05:15:26
1	93	334.5764599091161	299.93684344494807	20/04/28 05:15:27
1	93	334.6897812564092	299.9419149573993	20/04/28 05:15:27
1	93	334.60211665710057	299.8797061780836	20/04/28 05:15:27
1	93	334.53752874271413	299.7903821740446	20/04/28 05:15:27
1	93	334.55405333709484	299.93543101778084	20/04/28 05:15:27
1	93	334.301375662497	299.97713102941555	20/04/28 05:15:27
1	93	334.0842438464988	299.96752344476437	20/04/28 05:15:27
1	93	333.87349917024704	299.8810626905246	20/04/28 05:15:27
1	93	333.8472175651254	299.78186372864235	20/04/28 05:15:27
1	93	333.59159674521476	299.73227529548745	20/04/28 05:15:27
1	93	333.6401967905888	299.50877996796567	20/04/28 05:15:28
1	93	333.7493830614451	299.43882466980796	20/04/28 05:15:28
1	93	333.74694599104805	299.44488584039846	20/04/28 05:15:28
1	93	334.02194647276946	299.54841406142384	20/04/28 05:15:28
1	93	333.8916740754724	299.722453896851	20/04/28 05:15:28
1	93	334.0331349085625	299.8900008841962	20/04/28 05:15:28
1	93	333.91035903971897	299.8456471670643	20/04/28 05:15:28
1	93	333.749666408337	299.78537667805176	20/04/28 05:15:28
1	93	333.94278289742243	299.950043668264	20/04/28 05:15:28
1	93	333.9590473669973	299.9727831272831	20/04/28 05:15:28
1	93	333.7975050715392	299.95095051960067	20/04/28 05:15:29
1	93	333.7576229858445	299.9753560587796	20/04/28 05:15:29
1	93	333.93605918698574	299.89559278723834	20/04/28 05:15:29
1	93	334.080278827424	299.9121920586437	20/04/28 05:15:29
1	93	334.08024829765407	299.74261494543504	20/04/28 05:15:29
1	93	334.13575542900725	299.6300437896848	20/04/28 05:15:29
1	93	334.1348048433405	299.453425366102	20/04/28 05:15:29
1	93	334.0422548752335	299.52955075508237	20/04/28 05:15:29
1	93	334.1544874401027	299.3270939009616	20/04/28 05:15:29
1	93	334.18845085837097	299.34869036840587	20/04/28 05:15:29
1	93	333.99257434460407	299.5511709896577	20/04/28 05:15:30
1	93	333.9586215329024	299.5996108594749	20/04/28 05:15:30
1	93	334.1590342896379	299.7235826708839	20/04/28 05:15:30
1	93	333.9740625416286	299.81888956602137	20/04/28 05:15:30
1	93	333.9868223893799	299.8482479296405	20/04/28 05:15:30
1	93	333.8867908354106	299.726607287368	20/04/28 05:15:30
1	93	333.99039985075143	299.76098546633455	20/04/28 05:15:30
1	93	334.04774343995575	299.9436597438692	20/04/28 05:15:30
1	93	334.1264564092839	299.86164301814284	20/04/28 05:15:30
1	93	334.21858429675564	299.9501026155234	20/04/28 05:15:31
1	93	334.0595217019779	299.9725365342066	20/04/28 05:15:31
1	93	334.0337257357048	299.9591315878871	20/04/28 05:15:31
1	93	334.0322697171877	299.96601140675983	20/04/28 05:15:31
1	93	334.0348684001336	299.96047311992055	20/04/28 05:15:31
1	93	334.1988175808343	299.8830139354756	20/04/28 05:15:31
1	93	334.11030035825905	299.9793063645137	20/04/28 05:15:31
1	93	334.106578992563	299.98006941859654	20/04/28 05:15:31
1	93	333.8107133512764	299.95291761364956	20/04/28 05:15:31
1	93	333.9176554617887	299.97644596080596	20/04/28 05:15:31
1	93	333.6440278364616	299.89188367525753	20/04/28 05:15:32
1	93	333.4293543743975	299.7258420417258	20/04/28 05:15:32
1	93	333.52684364063504	299.80287436962055	20/04/28 05:15:32
1	93	333.53936545382743	299.7921918137001	20/04/28 05:15:32
1	93	333.5994536606566	299.7931427264946	20/04/28 05:15:32
1	93	333.44753848184297	299.9286191765853	20/04/28 05:15:32
1	93	333.3474469284923	299.8326705962519	20/04/28 05:15:32
1	93	333.4911202825775	299.76201807927333	20/04/28 05:15:32
1	93	333.4308032299286	299.60334720335976	20/04/28 05:15:32
1	93	333.6329266698677	299.77751637744404	20/04/28 05:15:33
1	93	333.48893940607275	299.72778146518414	20/04/28 05:15:33
1	93	333.262371449721	299.5697478927447	20/04/28 05:15:33
1	93	333.28044210145043	299.5485923219955	20/04/28 05:15:33
1	93	333.0492511950113	299.6092035115721	20/04/28 05:15:33
1	93	332.8725433895419	299.6535372491649	20/04/28 05:15:33
1	93	333.07527176114604	299.84749605726	20/04/28 05:15:33
1	93	332.90798730824844	299.87557767759904	20/04/28 05:15:33
1	93	332.7244581884452	299.85517017569686	20/04/28 05:15:33
1	93	332.7418684822469	299.77030314246224	20/04/28 05:15:33
1	93	332.7210634652309	299.65989742799377	20/04/28 05:15:34
1	93	332.65383366548747	299.9333914462434	20/04/28 05:15:34
1	93	332.6008463071661	299.9211511082675	20/04/28 05:15:34
1	93	332.59241661289843	299.91547512107525	20/04/28 05:15:34
1	93	332.5656970157703	299.67317270895956	20/04/28 05:15:34
1	93	332.4670449974243	299.65314050284275	20/04/28 05:15:34
1	93	332.4959699926245	299.64494535828754	20/04/28 05:15:34
1	93	332.64229275205236	299.56718302088893	20/04/28 05:15:34
1	93	332.56939344385813	299.7226726057763	20/04/28 05:15:34
1	93	332.59147548205436	299.7479274034516	20/04/28 05:15:34
1	93	332.7985778327306	299.78694313935205	20/04/28 05:15:35
1	93	332.7985778327306	299.78694313935205	20/04/28 05:15:35
1	93	332.7985778327306	299.78694313935205	20/04/28 05:15:35
1	93	332.99288635119285	299.97791059653264	20/04/28 05:15:35
1	93	333.03331990239417	299.90662164430427	20/04/28 05:15:35
1	93	332.9283396525456	299.62830295965875	20/04/28 05:15:35
1	93	332.91649704729986	299.6298950420487	20/04/28 05:15:35
1	93	332.96421488887904	299.6312190791498	20/04/28 05:15:35
1	93	333.1969142594067	299.71688296918325	20/04/28 05:15:35
1	93	333.3059548096561	299.57095494338034	20/04/28 05:15:36
1	93	333.4683853620492	299.7772669144041	20/04/28 05:15:36
1	93	333.6554389271176	299.6741322424865	20/04/28 05:15:36
1	93	333.82324007129114	299.6843134821122	20/04/28 05:15:36
1	93	333.627790519895	299.51333118949475	20/04/28 05:15:36
1	93	333.63598272885224	299.5003375256407	20/04/28 05:15:36
1	93	333.62986204876165	299.6798191271699	20/04/28 05:15:36
1	93	333.3972123302873	299.74950961909394	20/04/28 05:15:36
1	93	333.4515778773008	299.83706992652645	20/04/28 05:15:36
1	93	333.57487756559453	299.658159615657	20/04/28 05:15:36
1	93	333.5563621175903	299.6425925381102	20/04/28 05:15:37
1	93	333.5361002173919	299.668358209252	20/04/28 05:15:37
1	93	333.506221160098	299.7161460531723	20/04/28 05:15:37
1	93	333.3913584785514	299.7354917615706	20/04/28 05:15:37
1	93	333.58493169999997	299.77218612704786	20/04/28 05:15:37
1	93	333.7575335215597	299.7361298883019	20/04/28 05:15:37
1	93	333.65377630057907	299.8211575281448	20/04/28 05:15:37
1	93	333.62165448449497	299.90031054025854	20/04/28 05:15:37
1	93	333.85019597555	299.97054485635016	20/04/28 05:15:37
1	93	333.959979975911	299.9697679406836	20/04/28 05:15:37
1	93	333.92069923189587	299.90557504100076	20/04/28 05:15:38
1	93	333.77975808245384	299.92289203848094	20/04/28 05:15:38
1	93	333.64030729139563	299.9879850460163	20/04/28 05:15:38
1	93	333.5567503992	299.7874120921623	20/04/28 05:15:38
1	93	333.56003073086333	299.75165041657607	20/04/28 05:15:38
1	93	333.40410869117204	299.5522432757643	20/04/28 05:15:38
1	93	333.2413385814383	299.49528559297204	20/04/28 05:15:38
1	93	333.05185876253336	299.4058625488702	20/04/28 05:15:38
1	93	332.92482866005304	299.4981762300655	20/04/28 05:15:38
1	93	333.13510280317576	299.54596768701674	20/04/28 05:15:39
1	93	333.20408183752835	299.6650724777709	20/04/28 05:15:39
1	93	333.39910288102095	299.5325876652491	20/04/28 05:15:39
1	93	333.6374002753955	299.5864696510641	20/04/28 05:15:39
1	93	333.6221961143048	299.5630094556345	20/04/28 05:15:39
1	93	333.44009114001966	299.4522323502309	20/04/28 05:15:39
1	93	333.16491948934794	299.4564424261946	20/04/28 05:15:39
1	93	333.14601496562193	299.43736719535787	20/04/28 05:15:39
1	93	333.1386971087069	299.4302642861858	20/04/28 05:15:39
1	93	333.401679861525	299.50861393982177	20/04/28 05:15:39
1	93	333.35238573802593	299.33290383897537	20/04/28 05:15:40
1	93	333.39029171463386	299.47785055674495	20/04/28 05:15:40
1	93	333.39145520967736	299.4771503442303	20/04/28 05:15:40
1	93	333.41232517731595	299.34525255727175	20/04/28 05:15:40
1	93	333.4757875736677	299.33101325641877	20/04/28 05:15:40
1	93	333.42297091986575	299.0746497002644	20/04/28 05:15:40
1	93	333.5355934037643	298.92487521445975	20/04/28 05:15:40
1	93	333.3906381948989	298.7304013814802	20/04/28 05:15:40
1	93	333.3610320594616	298.7193689157491	20/04/28 05:15:40
1	93	333.56471577078605	298.74443795778535	20/04/28 05:15:40
1	93	333.45309549631304	298.65812524949297	20/04/28 05:15:41
1	93	333.6094734456233	298.70651247297104	20/04/28 05:15:41
1	93	333.54970668043603	298.68703346401077	20/04/28 05:15:41
1	93	333.5019573083004	298.6568132706995	20/04/28 05:15:41
1	93	333.6273080294956	298.89449669438824	20/04/28 05:15:41
1	93	333.80184209804435	299.11008907230473	20/04/28 05:15:41
1	93	333.7499468095144	299.35386870461724	20/04/28 05:15:41
1	93	333.7019959881434	299.45548063648585	20/04/28 05:15:41
1	93	333.7418213026646	299.21345093723255	20/04/28 05:15:41
1	93	333.68229558508403	299.38503689196614	20/04/28 05:15:42
1	93	333.75387652305864	299.2771257710462	20/04/28 05:15:42
1	93	333.78507647218487	299.0538147583305	20/04/28 05:15:42
1	93	333.77376288245506	299.0353729292008	20/04/28 05:15:42
1	93	333.76478408376323	299.0561326457422	20/04/28 05:15:42
1	93	333.7564704128336	299.05267491066866	20/04/28 05:15:42
1	93	333.74596330546103	298.99045903407284	20/04/28 05:15:42
1	93	333.59566590717134	299.1465357928276	20/04/28 05:15:42
1	93	333.4513568439094	299.07254717376327	20/04/28 05:15:42
1	93	333.3954616430314	298.8101328039451	20/04/28 05:15:42
1	93	333.11995590460725	298.82893589873214	20/04/28 05:15:43
1	93	333.1203943245199	298.82813715769583	20/04/28 05:15:43
1	93	333.1412943686115	298.8398314750706	20/04/28 05:15:43
1	93	333.3906307648094	298.86562664414527	20/04/28 05:15:43
1	93	333.37864050848316	298.8209714796739	20/04/28 05:15:43
1	93	333.18389218578676	298.8343370654288	20/04/28 05:15:43
1	93	333.2233952692811	298.909735248369	20/04/28 05:15:43
1	93	333.2067941138899	298.9203140761998	20/04/28 05:15:43
1	93	333.17080270905245	298.8823667703435	20/04/28 05:15:43
1	93	333.24541314391297	298.74179771908854	20/04/28 05:15:43
1	93	333.1575667433522	298.5459507388312	20/04/28 05:15:44
1	93	333.2546511306136	298.50757178297016	20/04/28 05:15:44
1	93	333.2361306789707	298.51211535720813	20/04/28 05:15:44
1	93	333.18383375562354	298.3686295354407	20/04/28 05:15:44
1	93	333.1931110759208	298.37475025198705	20/04/28 05:15:44
1	93	333.3457803545382	298.5806667452431	20/04/28 05:15:44
1	93	333.5094468732372	298.63273674988415	20/04/28 05:15:44
1	93	333.4494240203287	298.5741740047405	20/04/28 05:15:44
1	93	333.2168096630292	298.7443881027514	20/04/28 05:15:44
1	93	333.2342688944729	298.65115336199136	20/04/28 05:15:45
1	93	333.4819886204736	298.6353741923489	20/04/28 05:15:45
1	93	333.407022540615	298.79214019344784	20/04/28 05:15:45
1	93	333.6604393295623	298.90114875498045	20/04/28 05:15:45
1	93	333.55551398518384	298.76904714198736	20/04/28 05:15:45
1	93	333.3084901239007	298.77239155112505	20/04/28 05:15:45
1	93	333.2353277931709	298.79902695330367	20/04/28 05:15:45
1	93	333.3135307288912	298.7808180827955	20/04/28 05:15:45
1	93	333.31358924426627	298.78091536069866	20/04/28 05:15:45
1	93	333.269559017584	298.9873251010062	20/04/28 05:15:45
1	93	333.0080305502897	298.90022967477154	20/04/28 05:15:46
1	93	333.07623064098397	298.9963542399104	20/04/28 05:15:46
1	93	333.13191889607816	298.82544483308504	20/04/28 05:15:46
1	93	333.13041480082273	298.8042884978495	20/04/28 05:15:46
1	93	333.1775685196748	298.83181814144615	20/04/28 05:15:46
1	93	333.0094779566768	298.79982308650153	20/04/28 05:15:46
1	93	333.12128237081583	298.7870897228438	20/04/28 05:15:46
1	93	332.9285383786298	298.96059337459616	20/04/28 05:15:46
1	93	332.96906245661864	298.98972397321546	20/04/28 05:15:46
1	93	332.9853358479802	298.8368897638783	20/04/28 05:15:46
1	93	333.0933550210597	298.96919126376974	20/04/28 05:15:47
1	93	332.94779000532924	298.83557658210265	20/04/28 05:15:47
1	93	333.00810871479905	298.9043769749804	20/04/28 05:15:47
1	93	333.0018501776519	298.7945223271799	20/04/28 05:15:47
1	93	332.9157647428079	299.01786219794576	20/04/28 05:15:47
1	93	333.0046566610997	299.09418670558443	20/04/28 05:15:47
1	93	333.03605169313266	299.0955019615566	20/04/28 05:15:47
1	93	333.0330360760918	299.08495503115114	20/04/28 05:15:47
1	93	333.00028564055674	299.0571287674586	20/04/28 05:15:47
1	93	333.08307354444105	299.26185137718284	20/04/28 05:15:48
1	93	332.960385729141	299.4357414752436	20/04/28 05:15:48
1	93	332.99716382013946	299.2923793585994	20/04/28 05:15:48
1	93	333.02806979440004	299.2909186495986	20/04/28 05:15:48
1	93	333.2174893184995	299.18996214936124	20/04/28 05:15:48
1	93	333.02152775166036	299.18507164931134	20/04/28 05:15:48
1	93	332.7707048122148	299.15896100114895	20/04/28 05:15:48
1	93	332.71181409208515	299.1604420831042	20/04/28 05:15:48
1	93	332.50003840686946	299.0733707138294	20/04/28 05:15:48
1	93	332.50003840686946	299.0733707138294	20/04/28 05:15:48
1	93	332.50003840686946	299.0733707138294	20/04/28 05:15:49
1	93	332.48046984461456	299.0260911419696	20/04/28 05:15:49
1	93	332.56202960069356	298.897881198061	20/04/28 05:15:49
1	93	332.7272050420304	298.8980218132949	20/04/28 05:15:49
1	93	332.82546074123627	299.09864847240607	20/04/28 05:15:49
1	93	332.86959432185205	298.9631631222956	20/04/28 05:15:49
1	93	332.7620326220995	298.91722251062663	20/04/28 05:15:49
1	93	332.73644644058345	298.9168487710529	20/04/28 05:15:49
1	93	332.6717771963737	298.9846869530052	20/04/28 05:15:49
1	93	332.6671075393724	298.8901979845891	20/04/28 05:15:50
1	93	332.6961353853685	298.96200290113137	20/04/28 05:15:50
1	93	332.4877593450938	298.94350723972633	20/04/28 05:15:50
1	93	332.5156565924455	298.949706774487	20/04/28 05:15:50
1	93	332.5156565924455	298.949706774487	20/04/28 05:15:50
1	93	332.4657395284364	298.8756736042171	20/04/28 05:15:50
1	93	332.43629922996735	298.8851632575898	20/04/28 05:15:50
1	93	332.3366526729708	298.9931410329752	20/04/28 05:15:50
1	93	332.5539463848543	299.1163573195813	20/04/28 05:15:50
1	93	332.6007058005789	298.9848606064824	20/04/28 05:15:50
1	93	332.2130183310885	298.96661928226285	20/04/28 05:15:51
1	93	332.2583340001967	298.84125624591667	20/04/28 05:15:51
1	93	332.2583340001967	298.84125624591667	20/04/28 05:15:51
1	93	332.2594291664335	298.831367255141	20/04/28 05:15:51
1	93	332.381720527308	298.6399934379341	20/04/28 05:15:51
1	93	332.55644454838006	298.4883354575856	20/04/28 05:15:51
1	93	332.4957069355443	298.483250179239	20/04/28 05:15:51
1	93	332.4877188692272	298.42217803072094	20/04/28 05:15:51
1	93	332.7193389739439	298.32501013713056	20/04/28 05:15:51
1	93	332.7193389739439	298.32501013713056	20/04/28 05:15:51
1	93	332.6564378149048	298.3372516614348	20/04/28 05:15:52
1	93	332.5739545819096	298.27619334697516	20/04/28 05:15:52
1	93	332.5739545819096	298.27619334697516	20/04/28 05:15:52
1	93	332.3987883285124	298.2703917301449	20/04/28 05:15:52
1	93	332.1923247116477	298.4339241124209	20/04/28 05:15:52
1	93	332.0590842150819	298.4441687614845	20/04/28 05:15:52
1	93	332.01917675424573	298.5950116106483	20/04/28 05:15:52
1	93	332.0278148550758	298.89085427443524	20/04/28 05:15:52
1	93	332.0982628533998	298.9716817582719	20/04/28 05:15:52
1	93	331.8169137451236	298.9901945650339	20/04/28 05:15:53
1	93	331.82007073399177	298.8708270950544	20/04/28 05:15:53
1	93	331.9716495426201	298.9780380352299	20/04/28 05:15:53
1	93	331.8138410041928	299.08774183659295	20/04/28 05:15:53
1	93	331.742550160707	299.22617253049106	20/04/28 05:15:53
1	93	331.7364884560361	299.21777436242473	20/04/28 05:15:53
1	93	331.73969969607975	299.1200757348671	20/04/28 05:15:53
1	93	331.74444198699723	299.01774821473384	20/04/28 05:15:53
1	93	331.74444198699723	299.01774821473384	20/04/28 05:15:53
1	93	331.83092781086737	299.01042889251755	20/04/28 05:15:53
1	93	331.54466245704054	299.20797775336644	20/04/28 05:15:54
1	93	331.54065950608305	299.20264886334803	20/04/28 05:15:54
1	93	331.54065950608305	299.20264886334803	20/04/28 05:15:54
1	93	331.5615366890511	299.2256541031483	20/04/28 05:15:54
1	93	331.749699986025	299.2283437669534	20/04/28 05:15:54
1	93	331.749699986025	299.2283437669534	20/04/28 05:15:54
1	93	331.6554701461709	299.3332395561039	20/04/28 05:15:54
1	93	331.61346446066676	299.29523438955107	20/04/28 05:15:54
1	93	331.64920816520146	299.2950602616193	20/04/28 05:15:54
1	93	331.75588393962215	299.45185722152155	20/04/28 05:15:54
1	93	331.841592279319	299.24926055744135	20/04/28 05:15:55
1	93	331.81051103078283	299.14134813489034	20/04/28 05:15:55
1	93	331.9633683635383	299.2463469526484	20/04/28 05:15:55
1	93	331.9431475557881	299.26560346621824	20/04/28 05:15:55
1	93	331.94620288240543	299.25506756937193	20/04/28 05:15:55
1	93	331.73273933321974	299.2520260863458	20/04/28 05:15:55
1	93	331.6866154414702	299.42422545475534	20/04/28 05:15:55
1	93	331.7920420995233	299.201434982873	20/04/28 05:15:55
1	93	331.59275287437924	299.33933703166167	20/04/28 05:15:55
1	93	331.74643895072893	299.54957897375914	20/04/28 05:15:56
1	93	331.7305715839376	299.67087983754107	20/04/28 05:15:56
1	93	331.7577760849358	299.611359988157	20/04/28 05:15:56
1	93	331.83000953105466	299.61230697321116	20/04/28 05:15:56
1	93	331.832754925957	299.6128236227548	20/04/28 05:15:56
1	93	331.69335650036595	299.5021635540701	20/04/28 05:15:56
1	93	331.5536126690131	299.4825594679758	20/04/28 05:15:56
1	93	331.51315564695386	299.5814127997311	20/04/28 05:15:56
1	93	331.4041933091264	299.549631539262	20/04/28 05:15:56
1	93	331.5393356035215	299.6443656269206	20/04/28 05:15:56
1	93	331.47526455535615	299.48267144841543	20/04/28 05:15:57
1	93	331.67873436147767	299.30914070015234	20/04/28 05:15:57
1	93	331.56487439511517	299.4816571713727	20/04/28 05:15:57
1	93	331.58808376552287	299.4579572060916	20/04/28 05:15:57
1	93	331.7295767489292	299.6173266063218	20/04/28 05:15:57
1	93	331.74129610710537	299.61893728537945	20/04/28 05:15:57
1	93	331.74129610710537	299.61893728537945	20/04/28 05:15:57
1	93	331.74129610710537	299.61893728537945	20/04/28 05:15:57
