stationId	t_start	t_end	t_max	timeStamp
45	20/04/28 05:17:35	20/04/28 05:17:35	20/04/28 05:17:35
75	20/04/28 05:17:37	20/04/28 05:17:37	20/04/28 05:17:37
70	20/04/28 05:17:39	20/04/28 05:17:39	20/04/28 05:17:39
33	20/04/28 05:17:41	20/04/28 05:17:42	20/04/28 05:17:41
63	20/04/28 05:17:44	20/04/28 05:17:44	20/04/28 05:17:44
75	20/04/28 05:17:46	20/04/28 05:17:46	20/04/28 05:17:46
63	20/04/28 05:09:54	20/04/28 05:09:54	20/04/28 05:17:48
70	20/04/28 05:17:50	20/04/28 05:17:51	20/04/28 05:17:50
75	20/04/28 05:17:53	20/04/28 05:17:53	20/04/28 05:17:53
63	20/04/28 05:17:55	20/04/28 05:17:55	20/04/28 05:17:55
75	20/04/28 05:17:57	20/04/28 05:17:57	20/04/28 05:17:57
75	20/04/28 05:17:59	20/04/28 05:17:59	20/04/28 05:17:59
75	20/04/28 05:18:01	20/04/28 05:18:02	20/04/28 05:18:02
61	20/04/28 05:18:04	20/04/28 05:18:05	20/04/28 05:18:05
155	20/04/28 05:18:07	20/04/28 05:18:07	20/04/28 05:18:07
13	20/04/28 05:18:09	20/04/28 05:18:09	20/04/28 05:18:09
53	20/04/28 05:18:11	20/04/28 05:18:11	20/04/28 05:18:11
89	20/04/28 05:17:06	20/04/28 05:18:15	20/04/28 05:18:15
135	20/04/28 05:10:30	20/04/28 05:10:30	20/04/28 05:18:17
14	20/04/28 05:18:19	20/04/28 05:18:19	20/04/28 05:18:19
5	20/04/28 05:18:21	20/04/28 05:18:21	20/04/28 05:18:21
6	20/04/28 05:18:23	20/04/28 05:18:23	20/04/28 05:18:23
78	20/04/28 05:18:25	20/04/28 05:18:25	20/04/28 05:18:25
24	20/04/28 05:18:27	20/04/28 05:18:27	20/04/28 05:18:27
98	20/04/28 05:18:29	20/04/28 05:18:29	20/04/28 05:18:29
6	20/04/28 05:18:31	20/04/28 05:18:31	20/04/28 05:18:31
23	20/04/28 05:18:33	20/04/28 05:18:33	20/04/28 05:18:33
66	20/04/28 05:18:35	20/04/28 05:18:35	20/04/28 05:18:35
68	20/04/28 05:18:37	20/04/28 05:18:38	20/04/28 05:09:50
118	20/04/28 05:18:40	20/04/28 05:18:41	20/04/28 05:18:41
66	20/04/28 05:18:43	20/04/28 05:18:43	20/04/28 05:18:43
91	20/04/28 05:18:45	20/04/28 05:18:46	20/04/28 05:18:45
