stationId	t_start	t_end	t_max	timeStamp
18	20/04/28 05:14:44	20/04/28 05:14:44	20/04/28 05:14:44
29	20/04/28 05:14:46	20/04/28 05:14:46	20/04/28 05:14:46
61	20/04/28 05:14:48	20/04/28 05:14:48	20/04/28 05:14:48
134	20/04/28 05:14:50	20/04/28 05:14:50	20/04/28 05:14:50
111	20/04/28 05:11:32	20/04/28 05:14:52	20/04/28 05:14:52
152	20/04/28 05:14:54	20/04/28 05:14:54	20/04/28 05:14:54
30	20/04/28 05:14:56	20/04/28 05:14:56	20/04/28 05:14:56
44	20/04/28 05:14:58	20/04/28 05:14:58	20/04/28 05:14:58
128	20/04/28 05:15:00	20/04/28 05:15:00	20/04/28 05:15:00
101	20/04/28 05:15:02	20/04/28 05:15:02	20/04/28 05:15:02
33	20/04/28 05:15:04	20/04/28 05:15:04	20/04/28 05:15:04
151	20/04/28 05:15:06	20/04/28 05:15:06	20/04/28 05:15:06
10	20/04/28 05:15:08	20/04/28 05:15:08	20/04/28 05:15:08
41	20/04/28 05:15:10	20/04/28 05:15:10	20/04/28 05:15:10
39	20/04/28 05:15:12	20/04/28 05:15:12	20/04/28 05:15:12
147	20/04/28 05:15:14	20/04/28 05:15:14	20/04/28 05:15:14
6	20/04/28 05:15:16	20/04/28 05:15:16	20/04/28 05:15:16
25	20/04/28 05:15:18	20/04/28 05:15:18	20/04/28 05:15:18
41	20/04/28 05:15:20	20/04/28 05:15:20	20/04/28 05:15:20
41	20/04/28 05:15:22	20/04/28 05:15:22	20/04/28 05:15:22
113	20/04/28 05:15:24	20/04/28 05:15:24	20/04/28 05:15:24
68	20/04/28 05:15:26	20/04/28 05:15:26	20/04/28 05:15:26
117	20/04/28 05:15:28	20/04/28 05:15:28	20/04/28 05:15:28
97	20/04/28 05:15:30	20/04/28 05:15:30	20/04/28 05:15:30
147	20/04/28 05:15:32	20/04/28 05:15:32	20/04/28 05:15:32
42	20/04/28 05:15:34	20/04/28 05:15:34	20/04/28 05:15:34
10	20/04/28 05:15:36	20/04/28 05:15:36	20/04/28 05:15:36
86	20/04/28 05:15:38	20/04/28 05:15:38	20/04/28 05:15:38
1	20/04/28 05:14:45	20/04/28 05:15:40	20/04/28 05:15:40
78	20/04/28 05:15:42	20/04/28 05:15:42	20/04/28 05:15:42
90	20/04/28 05:15:44	20/04/28 05:15:44	20/04/28 05:15:44
109	20/04/28 05:15:46	20/04/28 05:15:46	20/04/28 05:15:46
29	20/04/28 05:15:48	20/04/28 05:15:49	20/04/28 05:15:49
95	20/04/28 05:15:51	20/04/28 05:15:51	20/04/28 05:15:51
134	20/04/28 05:15:53	20/04/28 05:15:53	20/04/28 05:15:53
101	20/04/28 05:15:55	20/04/28 05:15:55	20/04/28 05:15:55
64	20/04/28 05:15:57	20/04/28 05:15:57	20/04/28 05:15:57
70	20/04/28 05:15:59	20/04/28 05:15:59	20/04/28 05:15:59
142	20/04/28 05:16:01	20/04/28 05:16:01	20/04/28 05:16:01
78	20/04/28 05:16:03	20/04/28 05:16:03	20/04/28 05:16:03
108	20/04/28 05:16:05	20/04/28 05:16:05	20/04/28 05:16:05
11	20/04/28 05:16:07	20/04/28 05:16:07	20/04/28 05:16:07
89	20/04/28 05:16:09	20/04/28 05:16:09	20/04/28 05:16:09
106	20/04/28 05:16:11	20/04/28 05:16:13	20/04/28 05:16:11
106	20/04/28 05:16:15	20/04/28 05:16:15	20/04/28 05:16:15
57	20/04/28 05:16:17	20/04/28 05:16:17	20/04/28 05:16:17
89	20/04/28 05:16:19	20/04/28 05:17:31	20/04/28 05:17:31
89	20/04/28 05:16:21	20/04/28 05:16:21	20/04/28 05:16:21
14	20/04/28 05:16:23	20/04/28 05:16:23	20/04/28 05:16:23
150	20/04/28 05:16:25	20/04/28 05:16:25	20/04/28 05:16:25
158	20/04/28 05:16:27	20/04/28 05:16:27	20/04/28 05:16:27
90	20/04/28 05:16:29	20/04/28 05:16:29	20/04/28 05:16:29
158	20/04/28 05:11:53	20/04/28 05:16:31	20/04/28 05:16:31
158	20/04/28 05:16:33	20/04/28 05:16:34	20/04/28 05:16:34
107	20/04/28 05:16:36	20/04/28 05:16:36	20/04/28 05:16:36
107	20/04/28 05:16:38	20/04/28 05:16:38	20/04/28 05:16:38
89	20/04/28 05:16:40	20/04/28 05:16:40	20/04/28 05:16:40
90	20/04/28 05:16:42	20/04/28 05:16:42	20/04/28 05:16:42
106	20/04/28 05:16:44	20/04/28 05:16:44	20/04/28 05:16:44
106	20/04/28 05:16:46	20/04/28 05:16:46	20/04/28 05:16:46
89	20/04/28 05:16:48	20/04/28 05:16:48	20/04/28 05:16:48
90	20/04/28 05:16:50	20/04/28 05:16:50	20/04/28 05:16:50
114	20/04/28 05:16:52	20/04/28 05:16:52	20/04/28 05:16:52
61	20/04/28 05:16:54	20/04/28 05:16:54	20/04/28 05:16:54
18	20/04/28 05:16:56	20/04/28 05:16:56	20/04/28 05:16:56
75	20/04/28 05:16:58	20/04/28 05:16:58	20/04/28 05:16:58
61	20/04/28 05:17:00	20/04/28 05:17:01	20/04/28 05:17:00
114	20/04/28 05:17:03	20/04/28 05:17:03	20/04/28 05:17:03
156	20/04/28 05:17:05	20/04/28 05:17:05	20/04/28 05:17:05
54	20/04/28 05:17:07	20/04/28 05:17:07	20/04/28 05:17:07
44	20/04/28 05:17:09	20/04/28 05:17:09	20/04/28 05:17:09
24	20/04/28 05:17:11	20/04/28 05:17:11	20/04/28 05:17:11
45	20/04/28 05:17:13	20/04/28 05:17:13	20/04/28 05:17:13
64	20/04/28 05:17:15	20/04/28 05:17:15	20/04/28 05:17:15
134	20/04/28 05:17:17	20/04/28 05:17:17	20/04/28 05:17:17
5	20/04/28 05:17:19	20/04/28 05:17:19	20/04/28 05:17:19
1	20/04/28 05:17:21	20/04/28 05:17:21	20/04/28 05:17:21
86	20/04/28 05:17:23	20/04/28 05:17:23	20/04/28 05:17:23
95	20/04/28 05:17:25	20/04/28 05:17:25	20/04/28 05:17:25
16	20/04/28 05:17:27	20/04/28 05:17:27	20/04/28 05:17:27
19	20/04/28 05:17:29	20/04/28 05:17:29	20/04/28 05:17:29
117	20/04/28 05:17:31	20/04/28 05:17:31	20/04/28 05:17:31
74	20/04/28 05:17:33	20/04/28 05:17:33	20/04/28 05:17:33
117	20/04/28 05:17:35	20/04/28 05:17:36	20/04/28 05:17:36
118	20/04/28 05:17:38	20/04/28 05:17:38	20/04/28 05:17:38
118	20/04/28 05:17:40	20/04/28 05:17:40	20/04/28 05:17:40
118	20/04/28 05:17:42	20/04/28 05:17:43	20/04/28 05:17:42
118	20/04/28 05:17:45	20/04/28 05:17:47	20/04/28 05:17:47
91	20/04/28 05:12:03	20/04/28 05:12:03	20/04/28 05:12:03
68	20/04/28 05:17:51	20/04/28 05:17:51	20/04/28 05:17:51
68	20/04/28 05:17:53	20/04/28 05:17:53	20/04/28 05:17:53
117	20/04/28 05:17:55	20/04/28 05:17:55	20/04/28 05:17:55
103	20/04/28 05:17:57	20/04/28 05:17:57	20/04/28 05:17:57
67	20/04/28 05:17:59	20/04/28 05:17:59	20/04/28 05:17:59
65	20/04/28 05:18:01	20/04/28 05:18:01	20/04/28 05:18:01
19	20/04/28 05:18:03	20/04/28 05:18:03	20/04/28 05:18:03
98	20/04/28 05:18:05	20/04/28 05:18:05	20/04/28 05:18:05
119	20/04/28 05:18:07	20/04/28 05:18:07	20/04/28 05:18:07
143	20/04/28 05:18:09	20/04/28 05:18:09	20/04/28 05:18:09
78	20/04/28 05:18:11	20/04/28 05:18:13	20/04/28 05:18:13
92	20/04/28 05:18:15	20/04/28 05:18:15	20/04/28 05:18:15
21	20/04/28 05:18:17	20/04/28 05:18:17	20/04/28 05:18:17
78	20/04/28 05:18:19	20/04/28 05:18:19	20/04/28 05:18:19
92	20/04/28 05:18:21	20/04/28 05:18:22	20/04/28 05:18:22
78	20/04/28 05:18:24	20/04/28 05:18:24	20/04/28 05:18:24
92	20/04/28 05:18:26	20/04/28 05:18:26	20/04/28 05:18:26
78	20/04/28 05:18:28	20/04/28 05:18:28	20/04/28 05:18:28
78	20/04/28 05:18:30	20/04/28 05:18:30	20/04/28 05:18:30
76	20/04/28 05:18:32	20/04/28 05:18:32	20/04/28 05:18:32
92	20/04/28 05:18:34	20/04/28 05:18:34	20/04/28 05:18:34
62	20/04/28 05:18:36	20/04/28 05:18:36	20/04/28 05:18:36
40	20/04/28 05:18:38	20/04/28 05:18:38	20/04/28 05:18:38
158	20/04/28 05:18:40	20/04/28 05:18:40	20/04/28 05:18:40
21	20/04/28 05:18:42	20/04/28 05:18:42	20/04/28 05:18:42
76	20/04/28 05:18:44	20/04/28 05:18:44	20/04/28 05:18:44
95	20/04/28 05:18:46	20/04/28 05:18:46	20/04/28 05:18:46
