floorId	partitionId	location_x	location_y	timeStamp
3	14	325.5332902450836	270.80102617748867	20/04/28 05:08:49
3	18	323.08282049270593	267.37542903932564	20/04/28 05:08:50
3	14	325.7144978820088	266.8660387296905	20/04/28 05:08:51
3	NULL	328.7589326730361	266.5344039090584	20/04/28 05:08:52
3	28	332.6477860802388	265.03642994070896	20/04/28 05:08:53
3	28	332.6477860802388	265.03642994070896	20/04/28 05:08:54
3	28	332.6477860802388	265.03642994070896	20/04/28 05:08:55
3	54	334.4407240787428	261.4032786809491	20/04/28 05:08:56
3	54	339.3775199660886	260.697329100326	20/04/28 05:08:57
3	54	345.98250818917177	261.859258749847	20/04/28 05:08:58
3	54	345.98250818917177	261.859258749847	20/04/28 05:08:59
3	54	349.17477120857285	262.4807721885283	20/04/28 05:09:00
3	54	350.37914153837863	260.97432627346046	20/04/28 05:09:01
3	54	350.89456573837674	262.47535273189357	20/04/28 05:09:02
3	43	354.1724379731224	265.54072270130285	20/04/28 05:09:03
3	54	354.93110780732565	263.85962413987545	20/04/28 05:09:04
3	8	357.87501606482897	266.0533751351783	20/04/28 05:09:05
3	8	357.8750160648289	266.0533751351783	20/04/28 05:09:06
3	8	357.8750160648289	266.0533751351783	20/04/28 05:09:07
3	8	357.87501606482897	266.0533751351783	20/04/28 05:09:08
3	8	357.87501606482897	266.0533751351783	20/04/28 05:09:09
3	8	357.8750160648289	266.0533751351783	20/04/28 05:09:10
3	8	357.8750160648289	266.0533751351783	20/04/28 05:09:11
3	8	357.8750160648289	266.0533751351783	20/04/28 05:09:12
3	8	357.87501606482897	266.0533751351783	20/04/28 05:09:13
3	8	357.8750160648289	266.0533751351783	20/04/28 05:09:14
3	8	357.8750160648289	266.0533751351783	20/04/28 05:09:15
3	8	357.8750160648289	266.0533751351783	20/04/28 05:09:16
3	8	357.8750160648289	266.0533751351783	20/04/28 05:09:17
3	8	357.8750160648289	266.0533751351783	20/04/28 05:09:18
3	8	357.8750160648289	266.0533751351783	20/04/28 05:09:19
3	8	357.8750160648289	266.0533751351783	20/04/28 05:09:20
3	8	360.0833814688194	266.8125651781161	20/04/28 05:09:21
3	8	360.0833814688194	266.8125651781161	20/04/28 05:09:22
3	8	360.0833814688194	266.8125651781161	20/04/28 05:09:23
3	8	360.0833814688194	266.8125651781161	20/04/28 05:09:24
3	8	360.0833814688194	266.8125651781161	20/04/28 05:09:25
3	8	360.0833814688194	266.8125651781161	20/04/28 05:09:26
3	8	360.0833814688194	266.8125651781161	20/04/28 05:09:27
3	8	360.0833814688194	266.8125651781161	20/04/28 05:09:28
3	8	357.8750160648289	266.0533751351783	20/04/28 05:09:29
3	8	357.87501606482897	266.0533751351783	20/04/28 05:09:30
3	54	354.93110780732565	263.85962413987545	20/04/28 05:09:31
3	54	354.93110780732565	263.85962413987545	20/04/28 05:09:32
3	54	350.89456573837674	262.47535273189357	20/04/28 05:09:33
3	54	350.89456573837674	262.47535273189357	20/04/28 05:09:34
3	54	349.17477120857285	262.4807721885283	20/04/28 05:09:35
3	54	345.98250818917177	261.859258749847	20/04/28 05:09:36
3	42	343.19179870246967	259.9647561276533	20/04/28 05:09:37
3	99	339.59375125487367	258.8166372045796	20/04/28 05:09:38
3	NULL	337.70753542622793	260.45953294809686	20/04/28 05:09:39
3	54	334.4407240787428	261.4032786809491	20/04/28 05:09:40
3	54	334.4407240787428	261.4032786809491	20/04/28 05:09:41
3	54	334.4407240787428	261.4032786809491	20/04/28 05:09:42
3	25	331.1647001544473	259.0572050353964	20/04/28 05:09:43
3	25	331.1647001544473	259.0572050353964	20/04/28 05:09:44
3	25	331.1647001544473	259.0572050353964	20/04/28 05:09:45
3	25	331.1647001544473	259.0572050353964	20/04/28 05:09:46
3	54	334.4407240787428	261.4032786809491	20/04/28 05:09:47
3	25	331.1647001544473	259.0572050353964	20/04/28 05:09:48
3	25	331.1647001544473	259.0572050353964	20/04/28 05:09:49
3	54	334.4407240787428	261.4032786809491	20/04/28 05:09:50
3	25	331.1647001544473	259.0572050353964	20/04/28 05:09:51
3	25	331.1647001544473	259.0572050353964	20/04/28 05:09:52
3	25	331.1647001544473	259.0572050353964	20/04/28 05:09:53
3	25	331.1647001544473	259.0572050353964	20/04/28 05:09:54
3	25	331.1647001544473	259.0572050353964	20/04/28 05:09:55
3	25	331.1647001544473	259.0572050353964	20/04/28 05:09:56
3	25	331.1647001544473	259.0572050353964	20/04/28 05:09:57
3	25	331.1647001544473	259.0572050353964	20/04/28 05:09:58
3	25	331.1647001544473	259.0572050353964	20/04/28 05:09:59
3	25	331.1647001544473	259.0572050353964	20/04/28 05:10:00
3	54	327.3540763805351	261.1072377077433	20/04/28 05:10:01
3	25	327.25467987903363	260.11294318823207	20/04/28 05:10:02
3	25	331.1647001544473	259.0572050353964	20/04/28 05:10:03
3	25	331.1647001544473	259.0572050353964	20/04/28 05:10:04
3	25	331.1647001544473	259.0572050353964	20/04/28 05:10:05
3	25	331.1647001544473	259.0572050353964	20/04/28 05:10:06
3	25	331.1647001544473	259.0572050353964	20/04/28 05:10:07
3	25	330.99787587585735	256.71297684363395	20/04/28 05:10:08
3	25	331.1647001544473	259.0572050353964	20/04/28 05:10:09
3	25	331.1647001544473	259.0572050353964	20/04/28 05:10:10
3	25	331.1647001544473	259.0572050353964	20/04/28 05:10:11
3	25	331.1647001544473	259.0572050353964	20/04/28 05:10:12
3	25	331.1647001544473	259.0572050353964	20/04/28 05:10:13
3	25	331.1647001544473	259.0572050353964	20/04/28 05:10:14
3	25	331.1647001544473	259.0572050353964	20/04/28 05:10:15
3	25	331.1647001544473	259.0572050353964	20/04/28 05:10:16
3	25	331.1647001544473	259.0572050353964	20/04/28 05:10:17
3	25	331.1647001544473	259.0572050353964	20/04/28 05:10:18
3	25	331.1647001544473	259.0572050353964	20/04/28 05:10:19
3	25	331.1647001544473	259.0572050353964	20/04/28 05:10:20
3	54	334.4407240787428	261.4032786809491	20/04/28 05:10:21
3	54	334.4407240787428	261.4032786809491	20/04/28 05:10:22
3	54	334.4407240787428	261.4032786809491	20/04/28 05:10:23
3	54	334.4407240787428	261.4032786809491	20/04/28 05:10:24
3	NULL	337.70753542622793	260.4595329480968	20/04/28 05:10:25
3	42	340.39847756944295	257.5774165717636	20/04/28 05:10:26
3	42	342.32654047717824	258.48773934260805	20/04/28 05:10:27
3	54	345.98250818917177	261.859258749847	20/04/28 05:10:28
3	54	350.37914153837863	260.97432627346046	20/04/28 05:10:29
3	54	350.37914153837863	260.97432627346046	20/04/28 05:10:30
3	54	350.37914153837863	260.97432627346046	20/04/28 05:10:31
3	42	351.2362894892158	259.98472696547645	20/04/28 05:10:32
3	54	354.93110780732565	263.85962413987545	20/04/28 05:10:33
3	8	357.87501606482897	266.0533751351783	20/04/28 05:10:34
3	54	360.0352469025501	262.00891114944136	20/04/28 05:10:35
3	46	361.6170319482885	264.17422801455785	20/04/28 05:10:36
3	34	362.2167196060361	259.70189758364177	20/04/28 05:10:37
3	54	365.2339908031949	263.4272252913235	20/04/28 05:10:38
3	54	372.48785670166836	262.3595943162643	20/04/28 05:10:39
3	54	372.48785670166836	262.3595943162643	20/04/28 05:10:40
3	54	372.48785670166836	262.3595943162643	20/04/28 05:10:41
3	54	372.48785670166836	262.3595943162643	20/04/28 05:10:42
3	54	376.18269094789457	263.03655301878126	20/04/28 05:10:43
3	15	379.8755906118027	262.6421307240284	20/04/28 05:10:44
3	15	380.97239583354167	266.94453563659977	20/04/28 05:10:45
3	15	380.97239583354167	266.94453563659977	20/04/28 05:10:46
1	33	381.6109766893215	266.73786054806715	20/04/28 05:10:47
1	33	381.6109766893215	266.73786054806715	20/04/28 05:10:48
1	69	376.18075636557654	261.96517202151136	20/04/28 05:10:49
3	54	376.18075636557654	261.96517202151136	20/04/28 05:10:50
1	69	372.48785670166836	262.3595943162643	20/04/28 05:10:51
1	69	372.48785670166836	262.3595943162643	20/04/28 05:10:52
1	69	368.9169651830857	261.65782172430613	20/04/28 05:10:53
1	69	365.6578696297699	259.3576200548633	20/04/28 05:10:54
3	57	365.6578696297699	259.3576200548633	20/04/28 05:10:55
3	54	358.87237025214637	261.21107622709695	20/04/28 05:10:56
3	54	357.6965830742679	260.8022089979779	20/04/28 05:10:57
1	64	358.87237025214637	261.21107622709695	20/04/28 05:10:58
1	64	356.02694011127693	259.70882448523747	20/04/28 05:10:59
1	41	352.7251685521831	260.56227788261185	20/04/28 05:11:00
1	41	352.7251685521831	260.56227788261185	20/04/28 05:11:01
1	41	349.6149730760457	260.6816456755546	20/04/28 05:11:02
1	22	346.48253983850464	261.2777688197779	20/04/28 05:11:03
1	22	343.1917987024697	259.9647561276533	20/04/28 05:11:04
1	NULL	341.7564158159603	259.49985762417106	20/04/28 05:11:05
1	NULL	341.75641581596034	259.4998576241711	20/04/28 05:11:06
1	69	340.1854692097293	258.18142547541174	20/04/28 05:11:07
1	69	338.1583683683643	258.3517387010974	20/04/28 05:11:08
1	5	334.954212400308	260.21600824778375	20/04/28 05:11:09
3	54	333.7145018941879	260.9894407549504	20/04/28 05:11:10
1	5	330.74693509211414	260.5783249380383	20/04/28 05:11:11
1	37	329.2127636639186	262.68039063695386	20/04/28 05:11:12
1	37	329.2127636639186	262.68039063695386	20/04/28 05:11:13
1	37	326.6418503961265	263.9569908021342	20/04/28 05:11:14
1	37	326.6418503961265	263.9569908021342	20/04/28 05:11:15
1	37	325.93617404217133	264.20930050997885	20/04/28 05:11:16
1	37	326.6418503961265	263.9569908021342	20/04/28 05:11:17
1	37	329.2127636639186	262.68039063695386	20/04/28 05:11:18
1	37	325.93617404217133	264.20930050997885	20/04/28 05:11:19
1	37	325.93617404217133	264.20930050997885	20/04/28 05:11:20
1	37	325.93617404217133	264.20930050997885	20/04/28 05:11:21
1	37	325.93617404217133	264.20930050997885	20/04/28 05:11:22
1	37	325.93617404217133	264.20930050997885	20/04/28 05:11:23
1	37	325.93617404217133	264.20930050997885	20/04/28 05:11:24
1	37	325.93617404217133	264.20930050997885	20/04/28 05:11:25
1	37	323.6597216964546	264.1572674834102	20/04/28 05:11:26
1	37	324.68376661124154	261.38954335341236	20/04/28 05:11:27
1	37	325.93617404217133	264.20930050997885	20/04/28 05:11:28
1	37	325.93617404217133	264.20930050997885	20/04/28 05:11:29
1	37	325.93617404217133	264.20930050997885	20/04/28 05:11:30
1	37	325.93617404217133	264.20930050997885	20/04/28 05:11:31
1	37	325.93617404217133	264.20930050997885	20/04/28 05:11:32
1	37	329.2127636639186	262.68039063695386	20/04/28 05:11:33
1	5	333.1227839393323	261.62465248411826	20/04/28 05:11:34
1	48	368.6811785896385	287.5092477365071	20/04/28 05:11:35
1	69	338.1583683683643	258.3517387010974	20/04/28 05:11:36
1	69	340.1854692097293	258.18142547541174	20/04/28 05:11:37
1	69	340.1854692097293	258.18142547541174	20/04/28 05:11:38
1	69	340.1854692097293	258.18142547541174	20/04/28 05:11:39
1	53	340.94846657231966	262.0157612490854	20/04/28 05:11:40
1	53	335.8162476965281	262.9697080249273	20/04/28 05:11:41
1	53	337.3504191247236	260.8676423260117	20/04/28 05:11:42
1	53	337.94213707957925	260.2324305968438	20/04/28 05:11:43
3	54	335.8162476965281	262.9697080249273	20/04/28 05:11:44
1	69	338.1583683683643	258.3517387010974	20/04/28 05:11:45
1	53	337.94213707957925	260.2324305968438	20/04/28 05:11:46
1	53	336.62419694016876	260.453804400013	20/04/28 05:11:47
1	69	338.1583683683643	258.3517387010974	20/04/28 05:11:48
1	69	340.1854692097293	258.18142547541174	20/04/28 05:11:49
1	69	338.1583683683643	258.3517387010974	20/04/28 05:11:50
1	69	338.1583683683643	258.3517387010974	20/04/28 05:11:51
1	53	337.94213707957925	260.2324305968438	20/04/28 05:11:52
1	69	338.1583683683643	258.3517387010974	20/04/28 05:11:53
1	69	340.1854692097293	258.18142547541174	20/04/28 05:11:54
1	69	340.1854692097293	258.18142547541174	20/04/28 05:11:55
1	NULL	341.75641581596034	259.4998576241711	20/04/28 05:11:56
1	69	340.1854692097293	258.18142547541174	20/04/28 05:11:57
1	69	340.1854692097293	258.18142547541174	20/04/28 05:11:58
1	69	340.1854692097293	258.18142547541174	20/04/28 05:11:59
1	69	340.1854692097293	258.18142547541174	20/04/28 05:12:00
1	69	340.1854692097293	258.18142547541174	20/04/28 05:12:01
1	69	338.1583683683643	258.3517387010974	20/04/28 05:12:02
1	69	335.24867332238347	258.8873750560348	20/04/28 05:12:03
3	54	333.1227839393323	261.62465248411826	20/04/28 05:12:04
1	37	329.2127636639186	262.68039063695386	20/04/28 05:12:05
1	37	326.9602189569582	261.441576379981	20/04/28 05:12:06
1	37	325.93617404217133	264.20930050997885	20/04/28 05:12:07
1	37	325.93617404217133	264.20930050997885	20/04/28 05:12:08
1	37	326.6418503961265	263.9569908021342	20/04/28 05:12:09
1	37	326.03557054367275	265.2035950294901	20/04/28 05:12:10
1	37	325.93617404217133	264.20930050997885	20/04/28 05:12:11
1	37	325.93617404217133	264.20930050997885	20/04/28 05:12:12
1	37	325.93617404217133	264.2093005099789	20/04/28 05:12:13
1	37	326.6418503961265	263.9569908021342	20/04/28 05:12:14
1	37	325.93617404217133	264.20930050997885	20/04/28 05:12:15
1	37	328.6595361715347	265.5401093895471	20/04/28 05:12:16
1	37	326.6418503961265	263.9569908021342	20/04/28 05:12:17
1	56	328.05325631908096	266.7867136169031	20/04/28 05:12:18
1	37	325.93617404217133	264.20930050997885	20/04/28 05:12:19
1	37	325.93617404217133	264.20930050997885	20/04/28 05:12:20
1	37	326.6418503961265	263.9569908021342	20/04/28 05:12:21
1	37	325.93617404217133	264.20930050997885	20/04/28 05:12:22
1	37	325.93617404217133	264.2093005099789	20/04/28 05:12:23
1	37	326.03557054367275	265.20359502949015	20/04/28 05:12:24
1	37	325.93617404217133	264.2093005099789	20/04/28 05:12:25
1	37	326.6418503961265	263.9569908021342	20/04/28 05:12:27
1	37	326.6418503961265	263.9569908021342	20/04/28 05:12:28
1	37	325.93617404217133	264.2093005099789	20/04/28 05:12:29
1	37	326.6418503961265	263.9569908021342	20/04/28 05:12:30
1	37	325.93617404217133	264.20930050997885	20/04/28 05:12:31
1	37	326.6418503961265	263.9569908021342	20/04/28 05:12:32
1	37	325.93617404217133	264.20930050997885	20/04/28 05:12:33
1	37	325.93617404217133	264.20930050997885	20/04/28 05:12:34
1	37	325.93617404217133	264.20930050997885	20/04/28 05:12:35
1	37	325.93617404217133	264.20930050997885	20/04/28 05:12:36
1	37	325.93617404217133	264.20930050997885	20/04/28 05:12:37
1	37	325.93617404217133	264.20930050997885	20/04/28 05:12:38
1	37	325.93617404217133	264.20930050997885	20/04/28 05:12:39
1	37	328.6595361715347	265.5401093895471	20/04/28 05:12:40
1	37	326.6418503961265	263.9569908021342	20/04/28 05:12:41
1	37	329.2127636639186	262.68039063695386	20/04/28 05:12:42
1	37	325.93617404217133	264.20930050997885	20/04/28 05:12:43
1	5	330.2362428812537	263.7876500255337	20/04/28 05:12:44
