stationId	t_start	t_end	t_max	timeStamp
7	20/04/28 05:17:17	20/04/28 05:17:18	20/04/28 05:17:17
11	20/04/28 05:17:20	20/04/28 05:17:21	20/04/28 05:17:21
120	20/04/28 05:17:23	20/04/28 05:17:23	20/04/28 05:17:23
7	20/04/28 05:17:25	20/04/28 05:17:27	20/04/28 05:17:26
7	20/04/28 05:17:29	20/04/28 05:17:29	20/04/28 05:17:29
7	20/04/28 05:17:31	20/04/28 05:17:31	20/04/28 05:17:31
7	20/04/28 05:17:33	20/04/28 05:17:33	20/04/28 05:17:33
104	20/04/28 05:17:35	20/04/28 05:17:35	20/04/28 05:17:35
119	20/04/28 05:17:37	20/04/28 05:17:37	20/04/28 05:17:37
119	20/04/28 05:17:39	20/04/28 05:17:39	20/04/28 05:17:39
98	20/04/28 05:17:41	20/04/28 05:17:41	20/04/28 05:17:41
11	20/04/28 05:17:43	20/04/28 05:17:43	20/04/28 05:17:43
119	20/04/28 05:17:45	20/04/28 05:17:45	20/04/28 05:17:45
28	20/04/28 05:17:47	20/04/28 05:17:57	20/04/28 05:17:54
98	20/04/28 05:17:59	20/04/28 05:17:59	20/04/28 05:17:59
28	20/04/28 05:18:01	20/04/28 05:18:01	20/04/28 05:18:01
5	20/04/28 05:18:03	20/04/28 05:18:03	20/04/28 05:18:03
5	20/04/28 05:18:05	20/04/28 05:18:08	20/04/28 05:18:05
28	20/04/28 05:18:10	20/04/28 05:18:10	20/04/28 05:18:10
28	20/04/28 05:18:12	20/04/28 05:18:12	20/04/28 05:18:12
125	20/04/28 05:18:14	20/04/28 05:18:14	20/04/28 05:18:14
125	20/04/28 05:18:16	20/04/28 05:18:16	20/04/28 05:18:16
16	20/04/28 05:18:18	20/04/28 05:18:18	20/04/28 05:18:18
6	20/04/28 05:18:20	20/04/28 05:18:20	20/04/28 05:18:20
24	20/04/28 05:18:22	20/04/28 05:18:22	20/04/28 05:18:22
76	20/04/28 05:18:24	20/04/28 05:18:24	20/04/28 05:18:24
26	20/04/28 05:18:26	20/04/28 05:18:26	20/04/28 05:18:26
95	20/04/28 05:18:28	20/04/28 05:18:28	20/04/28 05:18:28
109	20/04/28 05:18:30	20/04/28 05:18:30	20/04/28 05:18:30
108	20/04/28 05:18:32	20/04/28 05:18:32	20/04/28 05:18:32
23	20/04/28 05:18:34	20/04/28 05:18:34	20/04/28 05:18:34
143	20/04/28 05:18:36	20/04/28 05:18:36	20/04/28 05:18:36
98	20/04/28 05:18:38	20/04/28 05:18:38	20/04/28 05:18:38
152	20/04/28 05:18:40	20/04/28 05:18:40	20/04/28 05:18:40
155	20/04/28 05:18:42	20/04/28 05:18:42	20/04/28 05:18:42
45	20/04/28 05:18:44	20/04/28 05:18:44	20/04/28 05:18:44
18	20/04/28 05:18:46	20/04/28 05:18:46	20/04/28 05:18:46
