deviceId	device_location_x	device_location_y	rssi_measurement	timeStamp
29	320.5330980902674	267.4733196241473	-69	20/04/28 05:17:35
34	316.80900278428817	265.3424618266475	-66	20/04/28 05:17:35
43	313.4671464842146	268.9294490602057	-64	20/04/28 05:17:35
35	313.2333965547867	260.8155454852367	-66	20/04/28 05:17:35
44	311.77572225053126	270.19236989843984	-60	20/04/28 05:17:35
56	310.04732599078807	282.36438688043404	-69	20/04/28 05:17:35
30	307.1854012017509	269.4709739512082	-53	20/04/28 05:17:35
53	304.93495229875685	264.07560539233975	-55	20/04/28 05:17:35
57	303.940263077792	271.56550684295615	-46	20/04/28 05:17:35
54	303.31117179968845	265.11604242964125	-52	20/04/28 05:17:35
55	301.899959538668	286.4262247068775	-69	20/04/28 05:17:35
126	314.8575896712662	269.055357886953	-67	20/04/28 05:17:35
79	309.7147528257229	267.0643755884616	-61	20/04/28 05:17:35
111	304.8912884149194	277.58086367406713	-64	20/04/28 05:17:35
107	302.0245168806276	268.14176318073686	-54	20/04/28 05:17:35
106	301.61170860092045	264.6448388709675	-56	20/04/28 05:17:35

29	320.5330980902674	267.4733196241473	-69	20/04/28 05:17:36
34	316.80900278428817	265.3424618266475	-67	20/04/28 05:17:36
43	313.4671464842146	268.9294490602057	-62	20/04/28 05:17:36
35	313.2333965547867	260.8155454852367	-66	20/04/28 05:17:36
44	311.77572225053126	270.19236989843984	-61	20/04/28 05:17:36
56	310.04732599078807	282.36438688043404	-71	20/04/28 05:17:36
30	307.1854012017509	269.4709739512082	-55	20/04/28 05:17:36
53	304.93495229875685	264.07560539233975	-51	20/04/28 05:17:36
57	303.940263077792	271.56550684295615	-52	20/04/28 05:17:36
54	303.31117179968845	265.11604242964125	-40	20/04/28 05:17:36
55	301.899959538668	286.4262247068775	-69	20/04/28 05:17:36
135	317.1848271786955	255.39637536280108	-71	20/04/28 05:17:36
126	314.8575896712662	269.055357886953	-64	20/04/28 05:17:36
79	309.7147528257229	267.0643755884616	-59	20/04/28 05:17:36
111	304.8912884149194	277.58086367406713	-66	20/04/28 05:17:36
107	302.0245168806276	268.14176318073686	-53	20/04/28 05:17:36
106	301.61170860092045	264.6448388709675	-54	20/04/28 05:17:36

75	322.1608472159793	266.050255836679	-72	20/04/28 05:17:37
135	317.1848271786955	255.39637536280108	-69	20/04/28 05:17:37
126	314.8575896712662	269.055357886953	-66	20/04/28 05:17:37
79	309.7147528257229	267.0643755884616	-57	20/04/28 05:17:37
111	304.8912884149194	277.58086367406713	-65	20/04/28 05:17:37
155	304.0989508064405	245.41764255927396	-71	20/04/28 05:17:37
107	302.0245168806276	268.14176318073686	-46	20/04/28 05:17:37
106	301.61170860092045	264.6448388709675	-33	20/04/28 05:17:37
29	320.5330980902674	267.4733196241473	-72	20/04/28 05:17:37
34	316.80900278428817	265.3424618266475	-67	20/04/28 05:17:37
43	313.4671464842146	268.9294490602057	-67	20/04/28 05:17:37
35	313.2333965547867	260.8155454852367	-65	20/04/28 05:17:37
44	311.77572225053126	270.19236989843984	-65	20/04/28 05:17:37
56	310.04732599078807	282.36438688043404	-68	20/04/28 05:17:37
30	307.1854012017509	269.4709739512082	-60	20/04/28 05:17:37
53	304.93495229875685	264.07560539233975	-56	20/04/28 05:17:37
57	303.940263077792	271.56550684295615	-58	20/04/28 05:17:37
54	303.31117179968845	265.11604242964125	-53	20/04/28 05:17:37

75	322.1608472159793	266.050255836679	-70	20/04/28 05:17:38
135	317.1848271786955	255.39637536280108	-69	20/04/28 05:17:38
126	314.8575896712662	269.055357886953	-66	20/04/28 05:17:38
79	309.7147528257229	267.0643755884616	-56	20/04/28 05:17:38
111	304.8912884149194	277.58086367406713	-67	20/04/28 05:17:38
155	304.0989508064405	245.41764255927396	-67	20/04/28 05:17:38
107	302.0245168806276	268.14176318073686	-54	20/04/28 05:17:38
106	301.61170860092045	264.6448388709675	-44	20/04/28 05:17:38
33	322.3477654900458	265.65618141861074	-69	20/04/28 05:17:38
29	320.5330980902674	267.4733196241473	-68	20/04/28 05:17:38
34	316.80900278428817	265.3424618266475	-66	20/04/28 05:17:38
43	313.4671464842146	268.9294490602057	-63	20/04/28 05:17:38
35	313.2333965547867	260.8155454852367	-64	20/04/28 05:17:38
44	311.77572225053126	270.19236989843984	-65	20/04/28 05:17:38
30	307.1854012017509	269.4709739512082	-61	20/04/28 05:17:38
53	304.93495229875685	264.07560539233975	-55	20/04/28 05:17:38
57	303.940263077792	271.56550684295615	-62	20/04/28 05:17:38
54	303.31117179968845	265.11604242964125	-55	20/04/28 05:17:38

71	324.46479455191115	264.8992522950768	-71	20/04/28 05:17:39
70	322.62281971022736	271.1767789862211	-69	20/04/28 05:17:39
75	322.1608472159793	266.050255836679	-69	20/04/28 05:17:39
135	317.1848271786955	255.39637536280108	-64	20/04/28 05:17:39
126	314.8575896712662	269.055357886953	-65	20/04/28 05:17:39
79	309.7147528257229	267.0643755884616	-56	20/04/28 05:17:39
111	304.8912884149194	277.58086367406713	-69	20/04/28 05:17:39
155	304.0989508064405	245.41764255927396	-68	20/04/28 05:17:39
107	302.0245168806276	268.14176318073686	-56	20/04/28 05:17:39
106	301.61170860092045	264.6448388709675	-54	20/04/28 05:17:39
33	322.3477654900458	265.65618141861074	-70	20/04/28 05:17:39
29	320.5330980902674	267.4733196241473	-67	20/04/28 05:17:39
34	316.80900278428817	265.3424618266475	-64	20/04/28 05:17:39
18	324.1666050474069	261.916368736543	-71	20/04/28 05:17:39
43	313.4671464842146	268.9294490602057	-64	20/04/28 05:17:39
35	313.2333965547867	260.8155454852367	-61	20/04/28 05:17:39
44	311.77572225053126	270.19236989843984	-62	20/04/28 05:17:39
30	307.1854012017509	269.4709739512082	-61	20/04/28 05:17:39
53	304.93495229875685	264.07560539233975	-54	20/04/28 05:17:39
57	303.940263077792	271.56550684295615	-64	20/04/28 05:17:39
54	303.31117179968845	265.11604242964125	-55	20/04/28 05:17:39
61	303.241284053526	243.1807340163452	-71	20/04/28 05:17:39

83	325.4199002344065	257.35300902861724	-69	20/04/28 05:17:40
71	324.46479455191115	264.8992522950768	-70	20/04/28 05:17:40
70	322.62281971022736	271.1767789862211	-70	20/04/28 05:17:40
75	322.1608472159793	266.050255836679	-69	20/04/28 05:17:40
135	317.1848271786955	255.39637536280108	-62	20/04/28 05:17:40
126	314.8575896712662	269.055357886953	-64	20/04/28 05:17:40
79	309.7147528257229	267.0643755884616	-56	20/04/28 05:17:40
111	304.8912884149194	277.58086367406713	-70	20/04/28 05:17:40
155	304.0989508064405	245.41764255927396	-69	20/04/28 05:17:40
107	302.0245168806276	268.14176318073686	-61	20/04/28 05:17:40
106	301.61170860092045	264.6448388709675	-57	20/04/28 05:17:40
63	323.45919914688744	271.57769148892913	-69	20/04/28 05:17:40
33	322.3477654900458	265.65618141861074	-69	20/04/28 05:17:40
29	320.5330980902674	267.4733196241473	-67	20/04/28 05:17:40
34	316.80900278428817	265.3424618266475	-64	20/04/28 05:17:40
18	324.1666050474069	261.916368736543	-69	20/04/28 05:17:40
43	313.4671464842146	268.9294490602057	-62	20/04/28 05:17:40
35	313.2333965547867	260.8155454852367	-60	20/04/28 05:17:40
44	311.77572225053126	270.19236989843984	-65	20/04/28 05:17:40
30	307.1854012017509	269.4709739512082	-59	20/04/28 05:17:40
53	304.93495229875685	264.07560539233975	-54	20/04/28 05:17:40
57	303.940263077792	271.56550684295615	-64	20/04/28 05:17:40
54	303.31117179968845	265.11604242964125	-56	20/04/28 05:17:40
61	303.241284053526	243.1807340163452	-68	20/04/28 05:17:40

83	325.4199002344065	257.35300902861724	-68	20/04/28 05:17:41
71	324.46479455191115	264.8992522950768	-66	20/04/28 05:17:41
108	323.68730985455	275.0488537525885	-71	20/04/28 05:17:41
70	322.62281971022736	271.1767789862211	-68	20/04/28 05:17:41
75	322.1608472159793	266.050255836679	-67	20/04/28 05:17:41
135	317.1848271786955	255.39637536280108	-60	20/04/28 05:17:41
126	314.8575896712662	269.055357886953	-60	20/04/28 05:17:41
79	309.7147528257229	267.0643755884616	-53	20/04/28 05:17:41
111	304.8912884149194	277.58086367406713	-70	20/04/28 05:17:41
155	304.0989508064405	245.41764255927396	-69	20/04/28 05:17:41
107	302.0245168806276	268.14176318073686	-63	20/04/28 05:17:41
106	301.61170860092045	264.6448388709675	-61	20/04/28 05:17:41
64	323.60882653631825	273.1877209673472	-72	20/04/28 05:17:41
63	323.45919914688744	271.57769148892913	-68	20/04/28 05:17:41
33	322.3477654900458	265.65618141861074	-68	20/04/28 05:17:41
45	321.6699483719267	275.59536969055205	-72	20/04/28 05:17:41
29	320.5330980902674	267.4733196241473	-67	20/04/28 05:17:41
34	316.80900278428817	265.3424618266475	-63	20/04/28 05:17:41
18	324.1666050474069	261.916368736543	-67	20/04/28 05:17:41
43	313.4671464842146	268.9294490602057	-60	20/04/28 05:17:41
35	313.2333965547867	260.8155454852367	-56	20/04/28 05:17:41
44	311.77572225053126	270.19236989843984	-61	20/04/28 05:17:41
30	307.1854012017509	269.4709739512082	-62	20/04/28 05:17:41
53	304.93495229875685	264.07560539233975	-58	20/04/28 05:17:41
57	303.940263077792	271.56550684295615	-63	20/04/28 05:17:41
54	303.31117179968845	265.11604242964125	-60	20/04/28 05:17:41
61	303.241284053526	243.1807340163452	-72	20/04/28 05:17:41

134	326.73505871831867	248.9397488255115	-70	20/04/28 05:17:42
83	325.4199002344065	257.35300902861724	-68	20/04/28 05:17:42
71	324.46479455191115	264.8992522950768	-66	20/04/28 05:17:42
108	323.68730985455	275.0488537525885	-68	20/04/28 05:17:42
70	322.62281971022736	271.1767789862211	-65	20/04/28 05:17:42
75	322.1608472159793	266.050255836679	-65	20/04/28 05:17:42
135	317.1848271786955	255.39637536280108	-59	20/04/28 05:17:42
126	314.8575896712662	269.055357886953	-59	20/04/28 05:17:42
79	309.7147528257229	267.0643755884616	-56	20/04/28 05:17:42
111	304.8912884149194	277.58086367406713	-70	20/04/28 05:17:42
155	304.0989508064405	245.41764255927396	-68	20/04/28 05:17:42
107	302.0245168806276	268.14176318073686	-65	20/04/28 05:17:42
106	301.61170860092045	264.6448388709675	-61	20/04/28 05:17:42
64	323.60882653631825	273.1877209673472	-67	20/04/28 05:17:42
63	323.45919914688744	271.57769148892913	-67	20/04/28 05:17:42
33	322.3477654900458	265.65618141861074	-63	20/04/28 05:17:42
45	321.6699483719267	275.59536969055205	-69	20/04/28 05:17:42
29	320.5330980902674	267.4733196241473	-63	20/04/28 05:17:42
34	316.80900278428817	265.3424618266475	-58	20/04/28 05:17:42
18	324.1666050474069	261.916368736543	-64	20/04/28 05:17:42
43	313.4671464842146	268.9294490602057	-60	20/04/28 05:17:42
35	313.2333965547867	260.8155454852367	-54	20/04/28 05:17:42
44	311.77572225053126	270.19236989843984	-62	20/04/28 05:17:42
30	307.1854012017509	269.4709739512082	-62	20/04/28 05:17:42
53	304.93495229875685	264.07560539233975	-61	20/04/28 05:17:42
57	303.940263077792	271.56550684295615	-64	20/04/28 05:17:42
54	303.31117179968845	265.11604242964125	-60	20/04/28 05:17:42

114	332.1775343552876	261.06945179953584	-71	20/04/28 05:17:43
85	330.5178518781359	269.6486080573157	-70	20/04/28 05:17:43
134	326.73505871831867	248.9397488255115	-67	20/04/28 05:17:43
83	325.4199002344065	257.35300902861724	-66	20/04/28 05:17:43
71	324.46479455191115	264.8992522950768	-62	20/04/28 05:17:43
108	323.68730985455	275.0488537525885	-70	20/04/28 05:17:43
70	322.62281971022736	271.1767789862211	-64	20/04/28 05:17:43
75	322.1608472159793	266.050255836679	-61	20/04/28 05:17:43
135	317.1848271786955	255.39637536280108	-57	20/04/28 05:17:43
126	314.8575896712662	269.055357886953	-60	20/04/28 05:17:43
79	309.7147528257229	267.0643755884616	-58	20/04/28 05:17:43
111	304.8912884149194	277.58086367406713	-69	20/04/28 05:17:43
155	304.0989508064405	245.41764255927396	-71	20/04/28 05:17:43
107	302.0245168806276	268.14176318073686	-63	20/04/28 05:17:43
106	301.61170860092045	264.6448388709675	-66	20/04/28 05:17:43
64	323.60882653631825	273.1877209673472	-67	20/04/28 05:17:43
63	323.45919914688744	271.57769148892913	-67	20/04/28 05:17:43
33	322.3477654900458	265.65618141861074	-61	20/04/28 05:17:43
45	321.6699483719267	275.59536969055205	-68	20/04/28 05:17:43
29	320.5330980902674	267.4733196241473	-63	20/04/28 05:17:43
34	316.80900278428817	265.3424618266475	-59	20/04/28 05:17:43
1	331.2941515890613	265.05535137478284	-70	20/04/28 05:17:43
18	324.1666050474069	261.916368736543	-63	20/04/28 05:17:43
43	313.4671464842146	268.9294490602057	-60	20/04/28 05:17:43
35	313.2333965547867	260.8155454852367	-53	20/04/28 05:17:43
44	311.77572225053126	270.19236989843984	-61	20/04/28 05:17:43
30	307.1854012017509	269.4709739512082	-65	20/04/28 05:17:43
53	304.93495229875685	264.07560539233975	-60	20/04/28 05:17:43
57	303.940263077792	271.56550684295615	-65	20/04/28 05:17:43
54	303.31117179968845	265.11604242964125	-63	20/04/28 05:17:43

86	335.24797200729284	264.39122996527533	-69	20/04/28 05:17:44
114	332.1775343552876	261.06945179953584	-68	20/04/28 05:17:44
85	330.5178518781359	269.6486080573157	-69	20/04/28 05:17:44
109	328.7910721793815	274.5472420294259	-71	20/04/28 05:17:44
134	326.73505871831867	248.9397488255115	-68	20/04/28 05:17:44
83	325.4199002344065	257.35300902861724	-60	20/04/28 05:17:44
71	324.46479455191115	264.8992522950768	-62	20/04/28 05:17:44
108	323.68730985455	275.0488537525885	-68	20/04/28 05:17:44
70	322.62281971022736	271.1767789862211	-62	20/04/28 05:17:44
75	322.1608472159793	266.050255836679	-58	20/04/28 05:17:44
135	317.1848271786955	255.39637536280108	-54	20/04/28 05:17:44
126	314.8575896712662	269.055357886953	-57	20/04/28 05:17:44
79	309.7147528257229	267.0643755884616	-61	20/04/28 05:17:44
111	304.8912884149194	277.58086367406713	-69	20/04/28 05:17:44
155	304.0989508064405	245.41764255927396	-72	20/04/28 05:17:44
107	302.0245168806276	268.14176318073686	-68	20/04/28 05:17:44
106	301.61170860092045	264.6448388709675	-67	20/04/28 05:17:44
64	323.60882653631825	273.1877209673472	-69	20/04/28 05:17:44
63	323.45919914688744	271.57769148892913	-66	20/04/28 05:17:44
33	322.3477654900458	265.65618141861074	-61	20/04/28 05:17:44
45	321.6699483719267	275.59536969055205	-67	20/04/28 05:17:44
29	320.5330980902674	267.4733196241473	-62	20/04/28 05:17:44
34	316.80900278428817	265.3424618266475	-58	20/04/28 05:17:44
1	331.2941515890613	265.05535137478284	-68	20/04/28 05:17:44
18	324.1666050474069	261.916368736543	-62	20/04/28 05:17:44
43	313.4671464842146	268.9294490602057	-63	20/04/28 05:17:44
35	313.2333965547867	260.8155454852367	-55	20/04/28 05:17:44
44	311.77572225053126	270.19236989843984	-63	20/04/28 05:17:44
30	307.1854012017509	269.4709739512082	-66	20/04/28 05:17:44
53	304.93495229875685	264.07560539233975	-66	20/04/28 05:17:44
57	303.940263077792	271.56550684295615	-68	20/04/28 05:17:44
54	303.31117179968845	265.11604242964125	-65	20/04/28 05:17:44

156	335.8966658736479	258.7491542780361	-70	20/04/28 05:17:45
86	335.24797200729284	264.39122996527533	-70	20/04/28 05:17:45
114	332.1775343552876	261.06945179953584	-66	20/04/28 05:17:45
85	330.5178518781359	269.6486080573157	-68	20/04/28 05:17:45
109	328.7910721793815	274.5472420294259	-67	20/04/28 05:17:45
157	335.396193037878	251.71646970274875	-69	20/04/28 05:17:45
133	331.2690965617225	248.09017660618488	-69	20/04/28 05:17:45
134	326.73505871831867	248.9397488255115	-67	20/04/28 05:17:45
83	325.4199002344065	257.35300902861724	-60	20/04/28 05:17:45
71	324.46479455191115	264.8992522950768	-57	20/04/28 05:17:45
108	323.68730985455	275.0488537525885	-68	20/04/28 05:17:45
70	322.62281971022736	271.1767789862211	-62	20/04/28 05:17:45
75	322.1608472159793	266.050255836679	-54	20/04/28 05:17:45
90	328.405777521876	244.72219299900524	-68	20/04/28 05:17:45
135	317.1848271786955	255.39637536280108	-54	20/04/28 05:17:45
126	314.8575896712662	269.055357886953	-61	20/04/28 05:17:45
79	309.7147528257229	267.0643755884616	-63	20/04/28 05:17:45
107	302.0245168806276	268.14176318073686	-68	20/04/28 05:17:45
106	301.61170860092045	264.6448388709675	-70	20/04/28 05:17:45
13	333.96299539869955	271.4873116898529	-69	20/04/28 05:17:45
64	323.60882653631825	273.1877209673472	-64	20/04/28 05:17:45
63	323.45919914688744	271.57769148892913	-66	20/04/28 05:17:45
33	322.3477654900458	265.65618141861074	-58	20/04/28 05:17:45
45	321.6699483719267	275.59536969055205	-69	20/04/28 05:17:45
29	320.5330980902674	267.4733196241473	-61	20/04/28 05:17:45
34	316.80900278428817	265.3424618266475	-55	20/04/28 05:17:45
1	331.2941515890613	265.05535137478284	-67	20/04/28 05:17:45
18	324.1666050474069	261.916368736543	-59	20/04/28 05:17:45
43	313.4671464842146	268.9294490602057	-63	20/04/28 05:17:45
35	313.2333965547867	260.8155454852367	-56	20/04/28 05:17:45
44	311.77572225053126	270.19236989843984	-64	20/04/28 05:17:45
30	307.1854012017509	269.4709739512082	-68	20/04/28 05:17:45
53	304.93495229875685	264.07560539233975	-66	20/04/28 05:17:45
57	303.940263077792	271.56550684295615	-69	20/04/28 05:17:45
54	303.31117179968845	265.11604242964125	-68	20/04/28 05:17:45

156	335.8966658736479	258.7491542780361	-68	20/04/28 05:17:46
86	335.24797200729284	264.39122996527533	-66	20/04/28 05:17:46
114	332.1775343552876	261.06945179953584	-66	20/04/28 05:17:46
85	330.5178518781359	269.6486080573157	-65	20/04/28 05:17:46
109	328.7910721793815	274.5472420294259	-67	20/04/28 05:17:46
158	338.3108448173557	255.03149237958806	-72	20/04/28 05:17:46
157	335.396193037878	251.71646970274875	-69	20/04/28 05:17:46
133	331.2690965617225	248.09017660618488	-69	20/04/28 05:17:46
152	334.08191155991284	247.00466577900684	-70	20/04/28 05:17:46
134	326.73505871831867	248.9397488255115	-67	20/04/28 05:17:46
83	325.4199002344065	257.35300902861724	-58	20/04/28 05:17:46
71	324.46479455191115	264.8992522950768	-56	20/04/28 05:17:46
108	323.68730985455	275.0488537525885	-66	20/04/28 05:17:46
70	322.62281971022736	271.1767789862211	-62	20/04/28 05:17:46
75	322.1608472159793	266.050255836679	-55	20/04/28 05:17:46
150	332.6115694023814	246.65317709036643	-71	20/04/28 05:17:46
90	328.405777521876	244.72219299900524	-69	20/04/28 05:17:46
89	326.76603994330793	242.54306062064484	-72	20/04/28 05:17:46
135	317.1848271786955	255.39637536280108	-57	20/04/28 05:17:46
126	314.8575896712662	269.055357886953	-61	20/04/28 05:17:46
79	309.7147528257229	267.0643755884616	-62	20/04/28 05:17:46
107	302.0245168806276	268.14176318073686	-71	20/04/28 05:17:46
106	301.61170860092045	264.6448388709675	-68	20/04/28 05:17:46
14	331.85523186666165	276.03236358281293	-69	20/04/28 05:17:46
13	333.96299539869955	271.4873116898529	-71	20/04/28 05:17:46
64	323.60882653631825	273.1877209673472	-64	20/04/28 05:17:46
63	323.45919914688744	271.57769148892913	-65	20/04/28 05:17:46
33	322.3477654900458	265.65618141861074	-56	20/04/28 05:17:46
45	321.6699483719267	275.59536969055205	-68	20/04/28 05:17:46
29	320.5330980902674	267.4733196241473	-60	20/04/28 05:17:46
34	316.80900278428817	265.3424618266475	-57	20/04/28 05:17:46
1	331.2941515890613	265.05535137478284	-64	20/04/28 05:17:46
18	324.1666050474069	261.916368736543	-57	20/04/28 05:17:46
62	337.6718197382148	256.8435190905324	-68	20/04/28 05:17:46
43	313.4671464842146	268.9294490602057	-63	20/04/28 05:17:46
35	313.2333965547867	260.8155454852367	-60	20/04/28 05:17:46
44	311.77572225053126	270.19236989843984	-64	20/04/28 05:17:46
30	307.1854012017509	269.4709739512082	-68	20/04/28 05:17:46
53	304.93495229875685	264.07560539233975	-69	20/04/28 05:17:46
57	303.940263077792	271.56550684295615	-70	20/04/28 05:17:46
54	303.31117179968845	265.11604242964125	-69	20/04/28 05:17:46

156	335.8966658736479	258.7491542780361	-66	20/04/28 05:17:47
86	335.24797200729284	264.39122996527533	-66	20/04/28 05:17:47
114	332.1775343552876	261.06945179953584	-61	20/04/28 05:17:47
85	330.5178518781359	269.6486080573157	-65	20/04/28 05:17:47
109	328.7910721793815	274.5472420294259	-68	20/04/28 05:17:47
158	338.3108448173557	255.03149237958806	-69	20/04/28 05:17:47
157	335.396193037878	251.71646970274875	-68	20/04/28 05:17:47
133	331.2690965617225	248.09017660618488	-68	20/04/28 05:17:47
152	334.08191155991284	247.00466577900684	-69	20/04/28 05:17:47
134	326.73505871831867	248.9397488255115	-65	20/04/28 05:17:47
83	325.4199002344065	257.35300902861724	-52	20/04/28 05:17:47
71	324.46479455191115	264.8992522950768	-52	20/04/28 05:17:47
108	323.68730985455	275.0488537525885	-66	20/04/28 05:17:47
70	322.62281971022736	271.1767789862211	-60	20/04/28 05:17:47
75	322.1608472159793	266.050255836679	-52	20/04/28 05:17:47
150	332.6115694023814	246.65317709036643	-71	20/04/28 05:17:47
90	328.405777521876	244.72219299900524	-68	20/04/28 05:17:47
89	326.76603994330793	242.54306062064484	-70	20/04/28 05:17:47
135	317.1848271786955	255.39637536280108	-56	20/04/28 05:17:47
126	314.8575896712662	269.055357886953	-64	20/04/28 05:17:47
79	309.7147528257229	267.0643755884616	-65	20/04/28 05:17:47
14	331.85523186666165	276.03236358281293	-69	20/04/28 05:17:47
13	333.96299539869955	271.4873116898529	-69	20/04/28 05:17:47
64	323.60882653631825	273.1877209673472	-63	20/04/28 05:17:47
63	323.45919914688744	271.57769148892913	-65	20/04/28 05:17:47
33	322.3477654900458	265.65618141861074	-55	20/04/28 05:17:47
45	321.6699483719267	275.59536969055205	-67	20/04/28 05:17:47
29	320.5330980902674	267.4733196241473	-59	20/04/28 05:17:47
34	316.80900278428817	265.3424618266475	-59	20/04/28 05:17:47
1	331.2941515890613	265.05535137478284	-63	20/04/28 05:17:47
18	324.1666050474069	261.916368736543	-53	20/04/28 05:17:47
28	340.90661949323004	259.4625427347237	-69	20/04/28 05:17:47
62	337.6718197382148	256.8435190905324	-70	20/04/28 05:17:47
43	313.4671464842146	268.9294490602057	-63	20/04/28 05:17:47
35	313.2333965547867	260.8155454852367	-62	20/04/28 05:17:47
44	311.77572225053126	270.19236989843984	-66	20/04/28 05:17:47
30	307.1854012017509	269.4709739512082	-68	20/04/28 05:17:47
53	304.93495229875685	264.07560539233975	-70	20/04/28 05:17:47
54	303.31117179968845	265.11604242964125	-71	20/04/28 05:17:47

98	341.977968397743	258.238214600979	-70	20/04/28 05:17:48
156	335.8966658736479	258.7491542780361	-65	20/04/28 05:17:48
86	335.24797200729284	264.39122996527533	-63	20/04/28 05:17:48
114	332.1775343552876	261.06945179953584	-58	20/04/28 05:17:48
85	330.5178518781359	269.6486080573157	-61	20/04/28 05:17:48
109	328.7910721793815	274.5472420294259	-66	20/04/28 05:17:48
158	338.3108448173557	255.03149237958806	-67	20/04/28 05:17:48
157	335.396193037878	251.71646970274875	-68	20/04/28 05:17:48
133	331.2690965617225	248.09017660618488	-67	20/04/28 05:17:48
152	334.08191155991284	247.00466577900684	-69	20/04/28 05:17:48
134	326.73505871831867	248.9397488255115	-65	20/04/28 05:17:48
83	325.4199002344065	257.35300902861724	-51	20/04/28 05:17:48
71	324.46479455191115	264.8992522950768	-50	20/04/28 05:17:48
108	323.68730985455	275.0488537525885	-68	20/04/28 05:17:48
70	322.62281971022736	271.1767789862211	-62	20/04/28 05:17:48
75	322.1608472159793	266.050255836679	-51	20/04/28 05:17:48
150	332.6115694023814	246.65317709036643	-66	20/04/28 05:17:48
90	328.405777521876	244.72219299900524	-67	20/04/28 05:17:48
89	326.76603994330793	242.54306062064484	-68	20/04/28 05:17:48
135	317.1848271786955	255.39637536280108	-61	20/04/28 05:17:48
126	314.8575896712662	269.055357886953	-65	20/04/28 05:17:48
79	309.7147528257229	267.0643755884616	-66	20/04/28 05:17:48
12	334.4323002319722	277.35984509404943	-70	20/04/28 05:17:48
14	331.85523186666165	276.03236358281293	-71	20/04/28 05:17:48
13	333.96299539869955	271.4873116898529	-66	20/04/28 05:17:48
64	323.60882653631825	273.1877209673472	-64	20/04/28 05:17:48
63	323.45919914688744	271.57769148892913	-64	20/04/28 05:17:48
33	322.3477654900458	265.65618141861074	-58	20/04/28 05:17:48
45	321.6699483719267	275.59536969055205	-68	20/04/28 05:17:48
29	320.5330980902674	267.4733196241473	-61	20/04/28 05:17:48
34	316.80900278428817	265.3424618266475	-61	20/04/28 05:17:48
1	331.2941515890613	265.05535137478284	-63	20/04/28 05:17:48
18	324.1666050474069	261.916368736543	-54	20/04/28 05:17:48
28	340.90661949323004	259.4625427347237	-68	20/04/28 05:17:48
62	337.6718197382148	256.8435190905324	-65	20/04/28 05:17:48
43	313.4671464842146	268.9294490602057	-66	20/04/28 05:17:48
35	313.2333965547867	260.8155454852367	-63	20/04/28 05:17:48
44	311.77572225053126	270.19236989843984	-66	20/04/28 05:17:48
30	307.1854012017509	269.4709739512082	-70	20/04/28 05:17:48

98	341.977968397743	258.238214600979	-68	20/04/28 05:17:49
156	335.8966658736479	258.7491542780361	-60	20/04/28 05:17:49
86	335.24797200729284	264.39122996527533	-62	20/04/28 05:17:49
114	332.1775343552876	261.06945179953584	-57	20/04/28 05:17:49
85	330.5178518781359	269.6486080573157	-63	20/04/28 05:17:49
109	328.7910721793815	274.5472420294259	-66	20/04/28 05:17:49
158	338.3108448173557	255.03149237958806	-66	20/04/28 05:17:49
157	335.396193037878	251.71646970274875	-64	20/04/28 05:17:49
133	331.2690965617225	248.09017660618488	-64	20/04/28 05:17:49
152	334.08191155991284	247.00466577900684	-66	20/04/28 05:17:49
134	326.73505871831867	248.9397488255115	-65	20/04/28 05:17:49
83	325.4199002344065	257.35300902861724	-47	20/04/28 05:17:49
71	324.46479455191115	264.8992522950768	-51	20/04/28 05:17:49
108	323.68730985455	275.0488537525885	-67	20/04/28 05:17:49
70	322.62281971022736	271.1767789862211	-64	20/04/28 05:17:49
75	322.1608472159793	266.050255836679	-56	20/04/28 05:17:49
150	332.6115694023814	246.65317709036643	-67	20/04/28 05:17:49
151	336.76660815068067	245.52780753634903	-71	20/04/28 05:17:49
90	328.405777521876	244.72219299900524	-69	20/04/28 05:17:49
89	326.76603994330793	242.54306062064484	-71	20/04/28 05:17:49
135	317.1848271786955	255.39637536280108	-61	20/04/28 05:17:49
126	314.8575896712662	269.055357886953	-67	20/04/28 05:17:49
79	309.7147528257229	267.0643755884616	-70	20/04/28 05:17:49
12	334.4323002319722	277.35984509404943	-69	20/04/28 05:17:49
14	331.85523186666165	276.03236358281293	-67	20/04/28 05:17:49
13	333.96299539869955	271.4873116898529	-64	20/04/28 05:17:49
39	342.6052734700009	271.0544937535892	-72	20/04/28 05:17:49
64	323.60882653631825	273.1877209673472	-67	20/04/28 05:17:49
63	323.45919914688744	271.57769148892913	-64	20/04/28 05:17:49
33	322.3477654900458	265.65618141861074	-60	20/04/28 05:17:49
45	321.6699483719267	275.59536969055205	-69	20/04/28 05:17:49
29	320.5330980902674	267.4733196241473	-62	20/04/28 05:17:49
34	316.80900278428817	265.3424618266475	-62	20/04/28 05:17:49
1	331.2941515890613	265.05535137478284	-59	20/04/28 05:17:49
18	324.1666050474069	261.916368736543	-54	20/04/28 05:17:49
28	340.90661949323004	259.4625427347237	-69	20/04/28 05:17:49
62	337.6718197382148	256.8435190905324	-64	20/04/28 05:17:49
43	313.4671464842146	268.9294490602057	-69	20/04/28 05:17:49
35	313.2333965547867	260.8155454852367	-64	20/04/28 05:17:49
44	311.77572225053126	270.19236989843984	-70	20/04/28 05:17:49

78	341.08011710942526	275.7852809597197	-71	20/04/28 05:17:50
98	341.977968397743	258.238214600979	-67	20/04/28 05:17:50
156	335.8966658736479	258.7491542780361	-59	20/04/28 05:17:50
86	335.24797200729284	264.39122996527533	-56	20/04/28 05:17:50
130	332.4026755333243	280.33571324748607	-72	20/04/28 05:17:50
114	332.1775343552876	261.06945179953584	-50	20/04/28 05:17:50
85	330.5178518781359	269.6486080573157	-58	20/04/28 05:17:50
109	328.7910721793815	274.5472420294259	-64	20/04/28 05:17:50
158	338.3108448173557	255.03149237958806	-64	20/04/28 05:17:50
157	335.396193037878	251.71646970274875	-63	20/04/28 05:17:50
133	331.2690965617225	248.09017660618488	-64	20/04/28 05:17:50
152	334.08191155991284	247.00466577900684	-67	20/04/28 05:17:50
134	326.73505871831867	248.9397488255115	-62	20/04/28 05:17:50
83	325.4199002344065	257.35300902861724	-50	20/04/28 05:17:50
71	324.46479455191115	264.8992522950768	-55	20/04/28 05:17:50
108	323.68730985455	275.0488537525885	-66	20/04/28 05:17:50
70	322.62281971022736	271.1767789862211	-62	20/04/28 05:17:50
75	322.1608472159793	266.050255836679	-59	20/04/28 05:17:50
150	332.6115694023814	246.65317709036643	-65	20/04/28 05:17:50
151	336.76660815068067	245.52780753634903	-69	20/04/28 05:17:50
90	328.405777521876	244.72219299900524	-67	20/04/28 05:17:50
89	326.76603994330793	242.54306062064484	-70	20/04/28 05:17:50
135	317.1848271786955	255.39637536280108	-66	20/04/28 05:17:50
126	314.8575896712662	269.055357886953	-68	20/04/28 05:17:50
79	309.7147528257229	267.0643755884616	-72	20/04/28 05:17:50
12	334.4323002319722	277.35984509404943	-69	20/04/28 05:17:50
14	331.85523186666165	276.03236358281293	-68	20/04/28 05:17:50
13	333.96299539869955	271.4873116898529	-65	20/04/28 05:17:50
39	342.6052734700009	271.0544937535892	-70	20/04/28 05:17:50
64	323.60882653631825	273.1877209673472	-65	20/04/28 05:17:50
63	323.45919914688744	271.57769148892913	-66	20/04/28 05:17:50
33	322.3477654900458	265.65618141861074	-61	20/04/28 05:17:50
45	321.6699483719267	275.59536969055205	-70	20/04/28 05:17:50
29	320.5330980902674	267.4733196241473	-64	20/04/28 05:17:50
34	316.80900278428817	265.3424618266475	-66	20/04/28 05:17:50
1	331.2941515890613	265.05535137478284	-56	20/04/28 05:17:50
11	346.6908082164361	262.1935110472572	-71	20/04/28 05:17:50
18	324.1666050474069	261.916368736543	-58	20/04/28 05:17:50
28	340.90661949323004	259.4625427347237	-67	20/04/28 05:17:50
62	337.6718197382148	256.8435190905324	-62	20/04/28 05:17:50
43	313.4671464842146	268.9294490602057	-71	20/04/28 05:17:50
35	313.2333965547867	260.8155454852367	-69	20/04/28 05:17:50
44	311.77572225053126	270.19236989843984	-72	20/04/28 05:17:50

78	341.08011710942526	275.7852809597197	-70	20/04/28 05:17:51
76	343.4588316464865	274.9484820317409	-71	20/04/28 05:17:51
125	349.2787479533362	265.1460506013049	-69	20/04/28 05:17:51
98	341.977968397743	258.238214600979	-64	20/04/28 05:17:51
99	350.3039192058533	257.67417330205365	-69	20/04/28 05:17:51
156	335.8966658736479	258.7491542780361	-52	20/04/28 05:17:51
86	335.24797200729284	264.39122996527533	-55	20/04/28 05:17:51
130	332.4026755333243	280.33571324748607	-72	20/04/28 05:17:51
114	332.1775343552876	261.06945179953584	-35	20/04/28 05:17:51
85	330.5178518781359	269.6486080573157	-61	20/04/28 05:17:51
109	328.7910721793815	274.5472420294259	-68	20/04/28 05:17:51
158	338.3108448173557	255.03149237958806	-60	20/04/28 05:17:51
157	335.396193037878	251.71646970274875	-63	20/04/28 05:17:51
133	331.2690965617225	248.09017660618488	-65	20/04/28 05:17:51
143	343.9099929858854	248.05813694827182	-69	20/04/28 05:17:51
152	334.08191155991284	247.00466577900684	-67	20/04/28 05:17:51
134	326.73505871831867	248.9397488255115	-64	20/04/28 05:17:51
83	325.4199002344065	257.35300902861724	-57	20/04/28 05:17:51
71	324.46479455191115	264.8992522950768	-58	20/04/28 05:17:51
108	323.68730985455	275.0488537525885	-67	20/04/28 05:17:51
70	322.62281971022736	271.1767789862211	-63	20/04/28 05:17:51
75	322.1608472159793	266.050255836679	-62	20/04/28 05:17:51
150	332.6115694023814	246.65317709036643	-67	20/04/28 05:17:51
151	336.76660815068067	245.52780753634903	-68	20/04/28 05:17:51
90	328.405777521876	244.72219299900524	-67	20/04/28 05:17:51
89	326.76603994330793	242.54306062064484	-69	20/04/28 05:17:51
135	317.1848271786955	255.39637536280108	-68	20/04/28 05:17:51
126	314.8575896712662	269.055357886953	-68	20/04/28 05:17:51
12	334.4323002319722	277.35984509404943	-67	20/04/28 05:17:51
14	331.85523186666165	276.03236358281293	-68	20/04/28 05:17:51
24	345.02040429627266	272.92925701677564	-71	20/04/28 05:17:51
13	333.96299539869955	271.4873116898529	-65	20/04/28 05:17:51
39	342.6052734700009	271.0544937535892	-70	20/04/28 05:17:51
64	323.60882653631825	273.1877209673472	-68	20/04/28 05:17:51
63	323.45919914688744	271.57769148892913	-65	20/04/28 05:17:51
33	322.3477654900458	265.65618141861074	-63	20/04/28 05:17:51
45	321.6699483719267	275.59536969055205	-70	20/04/28 05:17:51
29	320.5330980902674	267.4733196241473	-64	20/04/28 05:17:51
34	316.80900278428817	265.3424618266475	-68	20/04/28 05:17:51
1	331.2941515890613	265.05535137478284	-56	20/04/28 05:17:51
11	346.6908082164361	262.1935110472572	-66	20/04/28 05:17:51
18	324.1666050474069	261.916368736543	-58	20/04/28 05:17:51
28	340.90661949323004	259.4625427347237	-64	20/04/28 05:17:51
62	337.6718197382148	256.8435190905324	-60	20/04/28 05:17:51
43	313.4671464842146	268.9294490602057	-69	20/04/28 05:17:51
35	313.2333965547867	260.8155454852367	-68	20/04/28 05:17:51

78	341.08011710942526	275.7852809597197	-67	20/04/28 05:17:52
76	343.4588316464865	274.9484820317409	-70	20/04/28 05:17:52
125	349.2787479533362	265.1460506013049	-66	20/04/28 05:17:52
97	351.55475745594623	260.1027549170228	-69	20/04/28 05:17:52
98	341.977968397743	258.238214600979	-61	20/04/28 05:17:52
99	350.3039192058533	257.67417330205365	-69	20/04/28 05:17:52
156	335.8966658736479	258.7491542780361	-47	20/04/28 05:17:52
86	335.24797200729284	264.39122996527533	-48	20/04/28 05:17:52
130	332.4026755333243	280.33571324748607	-70	20/04/28 05:17:52
114	332.1775343552876	261.06945179953584	-35	20/04/28 05:17:52
85	330.5178518781359	269.6486080573157	-60	20/04/28 05:17:52
109	328.7910721793815	274.5472420294259	-65	20/04/28 05:17:52
158	338.3108448173557	255.03149237958806	-59	20/04/28 05:17:52
157	335.396193037878	251.71646970274875	-59	20/04/28 05:17:52
133	331.2690965617225	248.09017660618488	-65	20/04/28 05:17:52
143	343.9099929858854	248.05813694827182	-67	20/04/28 05:17:52
152	334.08191155991284	247.00466577900684	-66	20/04/28 05:17:52
134	326.73505871831867	248.9397488255115	-64	20/04/28 05:17:52
83	325.4199002344065	257.35300902861724	-61	20/04/28 05:17:52
71	324.46479455191115	264.8992522950768	-63	20/04/28 05:17:52
108	323.68730985455	275.0488537525885	-68	20/04/28 05:17:52
70	322.62281971022736	271.1767789862211	-68	20/04/28 05:17:52
75	322.1608472159793	266.050255836679	-65	20/04/28 05:17:52
150	332.6115694023814	246.65317709036643	-66	20/04/28 05:17:52
151	336.76660815068067	245.52780753634903	-66	20/04/28 05:17:52
90	328.405777521876	244.72219299900524	-69	20/04/28 05:17:52
89	326.76603994330793	242.54306062064484	-69	20/04/28 05:17:52
135	317.1848271786955	255.39637536280108	-69	20/04/28 05:17:52
12	334.4323002319722	277.35984509404943	-71	20/04/28 05:17:52
14	331.85523186666165	276.03236358281293	-68	20/04/28 05:17:52
24	345.02040429627266	272.92925701677564	-67	20/04/28 05:17:52
13	333.96299539869955	271.4873116898529	-64	20/04/28 05:17:52
39	342.6052734700009	271.0544937535892	-67	20/04/28 05:17:52
64	323.60882653631825	273.1877209673472	-68	20/04/28 05:17:52
63	323.45919914688744	271.57769148892913	-68	20/04/28 05:17:52
33	322.3477654900458	265.65618141861074	-65	20/04/28 05:17:52
45	321.6699483719267	275.59536969055205	-69	20/04/28 05:17:52
29	320.5330980902674	267.4733196241473	-68	20/04/28 05:17:52
34	316.80900278428817	265.3424618266475	-70	20/04/28 05:17:52
1	331.2941515890613	265.05535137478284	-57	20/04/28 05:17:52
11	346.6908082164361	262.1935110472572	-65	20/04/28 05:17:52
23	351.8501918058477	262.17725267735295	-70	20/04/28 05:17:52
18	324.1666050474069	261.916368736543	-61	20/04/28 05:17:52
28	340.90661949323004	259.4625427347237	-61	20/04/28 05:17:52
62	337.6718197382148	256.8435190905324	-60	20/04/28 05:17:52

131	354.41095812340274	255.26814097712636	-70	20/04/28 05:17:53
78	341.08011710942526	275.7852809597197	-69	20/04/28 05:17:53
76	343.4588316464865	274.9484820317409	-69	20/04/28 05:17:53
96	350.6667069866645	272.97680873708674	-70	20/04/28 05:17:53
125	349.2787479533362	265.1460506013049	-66	20/04/28 05:17:53
97	351.55475745594623	260.1027549170228	-67	20/04/28 05:17:53
98	341.977968397743	258.238214600979	-55	20/04/28 05:17:53
99	350.3039192058533	257.67417330205365	-69	20/04/28 05:17:53
156	335.8966658736479	258.7491542780361	-41	20/04/28 05:17:53
86	335.24797200729284	264.39122996527533	-48	20/04/28 05:17:53
130	332.4026755333243	280.33571324748607	-70	20/04/28 05:17:53
114	332.1775343552876	261.06945179953584	-45	20/04/28 05:17:53
85	330.5178518781359	269.6486080573157	-60	20/04/28 05:17:53
109	328.7910721793815	274.5472420294259	-68	20/04/28 05:17:53
158	338.3108448173557	255.03149237958806	-58	20/04/28 05:17:53
157	335.396193037878	251.71646970274875	-60	20/04/28 05:17:53
133	331.2690965617225	248.09017660618488	-65	20/04/28 05:17:53
143	343.9099929858854	248.05813694827182	-66	20/04/28 05:17:53
152	334.08191155991284	247.00466577900684	-68	20/04/28 05:17:53
134	326.73505871831867	248.9397488255115	-69	20/04/28 05:17:53
83	325.4199002344065	257.35300902861724	-63	20/04/28 05:17:53
71	324.46479455191115	264.8992522950768	-65	20/04/28 05:17:53
108	323.68730985455	275.0488537525885	-69	20/04/28 05:17:53
70	322.62281971022736	271.1767789862211	-66	20/04/28 05:17:53
75	322.1608472159793	266.050255836679	-66	20/04/28 05:17:53
150	332.6115694023814	246.65317709036643	-65	20/04/28 05:17:53
151	336.76660815068067	245.52780753634903	-67	20/04/28 05:17:53
90	328.405777521876	244.72219299900524	-69	20/04/28 05:17:53
135	317.1848271786955	255.39637536280108	-69	20/04/28 05:17:53
40	342.77887309746234	278.6456568754367	-70	20/04/28 05:17:53
12	334.4323002319722	277.35984509404943	-70	20/04/28 05:17:53
14	331.85523186666165	276.03236358281293	-69	20/04/28 05:17:53
24	345.02040429627266	272.92925701677564	-69	20/04/28 05:17:53
13	333.96299539869955	271.4873116898529	-62	20/04/28 05:17:53
39	342.6052734700009	271.0544937535892	-66	20/04/28 05:17:53
64	323.60882653631825	273.1877209673472	-70	20/04/28 05:17:53
63	323.45919914688744	271.57769148892913	-68	20/04/28 05:17:53
33	322.3477654900458	265.65618141861074	-67	20/04/28 05:17:53
29	320.5330980902674	267.4733196241473	-68	20/04/28 05:17:53
34	316.80900278428817	265.3424618266475	-70	20/04/28 05:17:53
1	331.2941515890613	265.05535137478284	-57	20/04/28 05:17:53
11	346.6908082164361	262.1935110472572	-65	20/04/28 05:17:53
23	351.8501918058477	262.17725267735295	-69	20/04/28 05:17:53
18	324.1666050474069	261.916368736543	-62	20/04/28 05:17:53
28	340.90661949323004	259.4625427347237	-58	20/04/28 05:17:53
62	337.6718197382148	256.8435190905324	-55	20/04/28 05:17:53

100	356.8591206948205	265.4574062155744	-70	20/04/28 05:17:54
101	356.3794452712103	266.0187112870292	-71	20/04/28 05:17:54
131	354.41095812340274	255.26814097712636	-68	20/04/28 05:17:54
78	341.08011710942526	275.7852809597197	-67	20/04/28 05:17:54
76	343.4588316464865	274.9484820317409	-66	20/04/28 05:17:54
96	350.6667069866645	272.97680873708674	-70	20/04/28 05:17:54
125	349.2787479533362	265.1460506013049	-63	20/04/28 05:17:54
97	351.55475745594623	260.1027549170228	-66	20/04/28 05:17:54
98	341.977968397743	258.238214600979	-52	20/04/28 05:17:54
99	350.3039192058533	257.67417330205365	-66	20/04/28 05:17:54
156	335.8966658736479	258.7491542780361	-43	20/04/28 05:17:54
86	335.24797200729284	264.39122996527533	-51	20/04/28 05:17:54
114	332.1775343552876	261.06945179953584	-54	20/04/28 05:17:54
85	330.5178518781359	269.6486080573157	-64	20/04/28 05:17:54
109	328.7910721793815	274.5472420294259	-69	20/04/28 05:17:54
158	338.3108448173557	255.03149237958806	-55	20/04/28 05:17:54
157	335.396193037878	251.71646970274875	-60	20/04/28 05:17:54
133	331.2690965617225	248.09017660618488	-66	20/04/28 05:17:54
143	343.9099929858854	248.05813694827182	-67	20/04/28 05:17:54
152	334.08191155991284	247.00466577900684	-67	20/04/28 05:17:54
134	326.73505871831867	248.9397488255115	-68	20/04/28 05:17:54
83	325.4199002344065	257.35300902861724	-65	20/04/28 05:17:54
71	324.46479455191115	264.8992522950768	-64	20/04/28 05:17:54
108	323.68730985455	275.0488537525885	-70	20/04/28 05:17:54
70	322.62281971022736	271.1767789862211	-71	20/04/28 05:17:54
75	322.1608472159793	266.050255836679	-67	20/04/28 05:17:54
150	332.6115694023814	246.65317709036643	-66	20/04/28 05:17:54
151	336.76660815068067	245.52780753634903	-68	20/04/28 05:17:54
90	328.405777521876	244.72219299900524	-69	20/04/28 05:17:54
40	342.77887309746234	278.6456568754367	-70	20/04/28 05:17:54
12	334.4323002319722	277.35984509404943	-70	20/04/28 05:17:54
14	331.85523186666165	276.03236358281293	-67	20/04/28 05:17:54
24	345.02040429627266	272.92925701677564	-68	20/04/28 05:17:54
13	333.96299539869955	271.4873116898529	-64	20/04/28 05:17:54
39	342.6052734700009	271.0544937535892	-63	20/04/28 05:17:54
64	323.60882653631825	273.1877209673472	-70	20/04/28 05:17:54
63	323.45919914688744	271.57769148892913	-68	20/04/28 05:17:54
33	322.3477654900458	265.65618141861074	-69	20/04/28 05:17:54
29	320.5330980902674	267.4733196241473	-70	20/04/28 05:17:54
1	331.2941515890613	265.05535137478284	-60	20/04/28 05:17:54
11	346.6908082164361	262.1935110472572	-61	20/04/28 05:17:54
23	351.8501918058477	262.17725267735295	-67	20/04/28 05:17:54
18	324.1666050474069	261.916368736543	-66	20/04/28 05:17:54
28	340.90661949323004	259.4625427347237	-56	20/04/28 05:17:54
32	354.77055639475554	259.4068260534597	-69	20/04/28 05:17:54
62	337.6718197382148	256.8435190905324	-56	20/04/28 05:17:54

100	356.8591206948205	265.4574062155744	-69	20/04/28 05:17:55
101	356.3794452712103	266.0187112870292	-68	20/04/28 05:17:55
131	354.41095812340274	255.26814097712636	-67	20/04/28 05:17:55
95	348.53915319452636	278.34229986583506	-71	20/04/28 05:17:55
78	341.08011710942526	275.7852809597197	-65	20/04/28 05:17:55
76	343.4588316464865	274.9484820317409	-68	20/04/28 05:17:55
96	350.6667069866645	272.97680873708674	-68	20/04/28 05:17:55
125	349.2787479533362	265.1460506013049	-63	20/04/28 05:17:55
97	351.55475745594623	260.1027549170228	-66	20/04/28 05:17:55
98	341.977968397743	258.238214600979	-48	20/04/28 05:17:55
99	350.3039192058533	257.67417330205365	-64	20/04/28 05:17:55
156	335.8966658736479	258.7491542780361	-49	20/04/28 05:17:55
86	335.24797200729284	264.39122996527533	-54	20/04/28 05:17:55
114	332.1775343552876	261.06945179953584	-59	20/04/28 05:17:55
85	330.5178518781359	269.6486080573157	-65	20/04/28 05:17:55
109	328.7910721793815	274.5472420294259	-67	20/04/28 05:17:55
158	338.3108448173557	255.03149237958806	-55	20/04/28 05:17:55
142	357.52906389684784	254.25640036258147	-68	20/04/28 05:17:55
157	335.396193037878	251.71646970274875	-62	20/04/28 05:17:55
133	331.2690965617225	248.09017660618488	-68	20/04/28 05:17:55
143	343.9099929858854	248.05813694827182	-66	20/04/28 05:17:55
152	334.08191155991284	247.00466577900684	-66	20/04/28 05:17:55
134	326.73505871831867	248.9397488255115	-70	20/04/28 05:17:55
83	325.4199002344065	257.35300902861724	-65	20/04/28 05:17:55
71	324.46479455191115	264.8992522950768	-68	20/04/28 05:17:55
70	322.62281971022736	271.1767789862211	-69	20/04/28 05:17:55
75	322.1608472159793	266.050255836679	-67	20/04/28 05:17:55
150	332.6115694023814	246.65317709036643	-69	20/04/28 05:17:55
151	336.76660815068067	245.52780753634903	-69	20/04/28 05:17:55
90	328.405777521876	244.72219299900524	-69	20/04/28 05:17:55
40	342.77887309746234	278.6456568754367	-69	20/04/28 05:17:55
12	334.4323002319722	277.35984509404943	-70	20/04/28 05:17:55
26	350.2796243624635	276.47071784526617	-71	20/04/28 05:17:55
14	331.85523186666165	276.03236358281293	-68	20/04/28 05:17:55
24	345.02040429627266	272.92925701677564	-64	20/04/28 05:17:55
13	333.96299539869955	271.4873116898529	-64	20/04/28 05:17:55
39	342.6052734700009	271.0544937535892	-65	20/04/28 05:17:55
63	323.45919914688744	271.57769148892913	-71	20/04/28 05:17:55
33	322.3477654900458	265.65618141861074	-71	20/04/28 05:17:55
1	331.2941515890613	265.05535137478284	-62	20/04/28 05:17:55
11	346.6908082164361	262.1935110472572	-61	20/04/28 05:17:55
23	351.8501918058477	262.17725267735295	-65	20/04/28 05:17:55
18	324.1666050474069	261.916368736543	-67	20/04/28 05:17:55
28	340.90661949323004	259.4625427347237	-52	20/04/28 05:17:55
32	354.77055639475554	259.4068260534597	-68	20/04/28 05:17:55
62	337.6718197382148	256.8435190905324	-56	20/04/28 05:17:55

68	360.38648222845603	266.6840079029314	-71	20/04/28 05:17:56
100	356.8591206948205	265.4574062155744	-69	20/04/28 05:17:56
101	356.3794452712103	266.0187112870292	-69	20/04/28 05:17:56
131	354.41095812340274	255.26814097712636	-67	20/04/28 05:17:56
95	348.53915319452636	278.34229986583506	-69	20/04/28 05:17:56
78	341.08011710942526	275.7852809597197	-67	20/04/28 05:17:56
76	343.4588316464865	274.9484820317409	-65	20/04/28 05:17:56
96	350.6667069866645	272.97680873708674	-68	20/04/28 05:17:56
125	349.2787479533362	265.1460506013049	-60	20/04/28 05:17:56
97	351.55475745594623	260.1027549170228	-62	20/04/28 05:17:56
98	341.977968397743	258.238214600979	-46	20/04/28 05:17:56
99	350.3039192058533	257.67417330205365	-62	20/04/28 05:17:56
156	335.8966658736479	258.7491542780361	-55	20/04/28 05:17:56
86	335.24797200729284	264.39122996527533	-57	20/04/28 05:17:56
114	332.1775343552876	261.06945179953584	-59	20/04/28 05:17:56
85	330.5178518781359	269.6486080573157	-64	20/04/28 05:17:56
109	328.7910721793815	274.5472420294259	-69	20/04/28 05:17:56
158	338.3108448173557	255.03149237958806	-55	20/04/28 05:17:56
142	357.52906389684784	254.25640036258147	-67	20/04/28 05:17:56
157	335.396193037878	251.71646970274875	-65	20/04/28 05:17:56
133	331.2690965617225	248.09017660618488	-67	20/04/28 05:17:56
143	343.9099929858854	248.05813694827182	-66	20/04/28 05:17:56
152	334.08191155991284	247.00466577900684	-69	20/04/28 05:17:56
134	326.73505871831867	248.9397488255115	-69	20/04/28 05:17:56
83	325.4199002344065	257.35300902861724	-67	20/04/28 05:17:56
71	324.46479455191115	264.8992522950768	-70	20/04/28 05:17:56
75	322.1608472159793	266.050255836679	-71	20/04/28 05:17:56
150	332.6115694023814	246.65317709036643	-67	20/04/28 05:17:56
151	336.76660815068067	245.52780753634903	-69	20/04/28 05:17:56
40	342.77887309746234	278.6456568754367	-68	20/04/28 05:17:56
12	334.4323002319722	277.35984509404943	-68	20/04/28 05:17:56
26	350.2796243624635	276.47071784526617	-68	20/04/28 05:17:56
14	331.85523186666165	276.03236358281293	-69	20/04/28 05:17:56
24	345.02040429627266	272.92925701677564	-66	20/04/28 05:17:56
13	333.96299539869955	271.4873116898529	-65	20/04/28 05:17:56
39	342.6052734700009	271.0544937535892	-62	20/04/28 05:17:56
1	331.2941515890613	265.05535137478284	-64	20/04/28 05:17:56
11	346.6908082164361	262.1935110472572	-57	20/04/28 05:17:56
23	351.8501918058477	262.17725267735295	-63	20/04/28 05:17:56
18	324.1666050474069	261.916368736543	-67	20/04/28 05:17:56
28	340.90661949323004	259.4625427347237	-51	20/04/28 05:17:56
32	354.77055639475554	259.4068260534597	-66	20/04/28 05:17:56
62	337.6718197382148	256.8435190905324	-60	20/04/28 05:17:56

91	361.46007213322764	257.54239472489974	-68	20/04/28 05:17:57
68	360.38648222845603	266.6840079029314	-70	20/04/28 05:17:57
100	356.8591206948205	265.4574062155744	-64	20/04/28 05:17:57
101	356.3794452712103	266.0187112870292	-65	20/04/28 05:17:57
131	354.41095812340274	255.26814097712636	-65	20/04/28 05:17:57
95	348.53915319452636	278.34229986583506	-70	20/04/28 05:17:57
94	354.2731910395625	277.47130781253173	-71	20/04/28 05:17:57
78	341.08011710942526	275.7852809597197	-68	20/04/28 05:17:57
76	343.4588316464865	274.9484820317409	-66	20/04/28 05:17:57
96	350.6667069866645	272.97680873708674	-65	20/04/28 05:17:57
125	349.2787479533362	265.1460506013049	-56	20/04/28 05:17:57
97	351.55475745594623	260.1027549170228	-60	20/04/28 05:17:57
98	341.977968397743	258.238214600979	-46	20/04/28 05:17:57
99	350.3039192058533	257.67417330205365	-59	20/04/28 05:17:57
156	335.8966658736479	258.7491542780361	-60	20/04/28 05:17:57
86	335.24797200729284	264.39122996527533	-62	20/04/28 05:17:57
114	332.1775343552876	261.06945179953584	-63	20/04/28 05:17:57
85	330.5178518781359	269.6486080573157	-68	20/04/28 05:17:57
158	338.3108448173557	255.03149237958806	-60	20/04/28 05:17:57
142	357.52906389684784	254.25640036258147	-67	20/04/28 05:17:57
157	335.396193037878	251.71646970274875	-65	20/04/28 05:17:57
74	359.45351725758405	250.95542178264168	-71	20/04/28 05:17:57
133	331.2690965617225	248.09017660618488	-67	20/04/28 05:17:57
143	343.9099929858854	248.05813694827182	-64	20/04/28 05:17:57
152	334.08191155991284	247.00466577900684	-67	20/04/28 05:17:57
83	325.4199002344065	257.35300902861724	-68	20/04/28 05:17:57
71	324.46479455191115	264.8992522950768	-68	20/04/28 05:17:57
150	332.6115694023814	246.65317709036643	-68	20/04/28 05:17:57
151	336.76660815068067	245.52780753634903	-67	20/04/28 05:17:57
40	342.77887309746234	278.6456568754367	-68	20/04/28 05:17:57
12	334.4323002319722	277.35984509404943	-69	20/04/28 05:17:57
26	350.2796243624635	276.47071784526617	-68	20/04/28 05:17:57
14	331.85523186666165	276.03236358281293	-70	20/04/28 05:17:57
25	355.84494920093715	274.3775360828231	-71	20/04/28 05:17:57
5	358.26133089630156	273.48187113127705	-72	20/04/28 05:17:57
24	345.02040429627266	272.92925701677564	-65	20/04/28 05:17:57
13	333.96299539869955	271.4873116898529	-67	20/04/28 05:17:57
39	342.6052734700009	271.0544937535892	-61	20/04/28 05:17:57
1	331.2941515890613	265.05535137478284	-68	20/04/28 05:17:57
11	346.6908082164361	262.1935110472572	-53	20/04/28 05:17:57
23	351.8501918058477	262.17725267735295	-62	20/04/28 05:17:57
28	340.90661949323004	259.4625427347237	-53	20/04/28 05:17:57
32	354.77055639475554	259.4068260534597	-62	20/04/28 05:17:57
62	337.6718197382148	256.8435190905324	-61	20/04/28 05:17:57

105	363.0045414831817	268.2962814158425	-71	20/04/28 05:17:58
91	361.46007213322764	257.54239472489974	-66	20/04/28 05:17:58
68	360.38648222845603	266.6840079029314	-66	20/04/28 05:17:58
100	356.8591206948205	265.4574062155744	-64	20/04/28 05:17:58
101	356.3794452712103	266.0187112870292	-65	20/04/28 05:17:58
131	354.41095812340274	255.26814097712636	-61	20/04/28 05:17:58
95	348.53915319452636	278.34229986583506	-67	20/04/28 05:17:58
94	354.2731910395625	277.47130781253173	-68	20/04/28 05:17:58
78	341.08011710942526	275.7852809597197	-66	20/04/28 05:17:58
76	343.4588316464865	274.9484820317409	-65	20/04/28 05:17:58
96	350.6667069866645	272.97680873708674	-64	20/04/28 05:17:58
125	349.2787479533362	265.1460506013049	-55	20/04/28 05:17:58
97	351.55475745594623	260.1027549170228	-56	20/04/28 05:17:58
98	341.977968397743	258.238214600979	-50	20/04/28 05:17:58
99	350.3039192058533	257.67417330205365	-53	20/04/28 05:17:58
156	335.8966658736479	258.7491542780361	-62	20/04/28 05:17:58
86	335.24797200729284	264.39122996527533	-63	20/04/28 05:17:58
114	332.1775343552876	261.06945179953584	-67	20/04/28 05:17:58
85	330.5178518781359	269.6486080573157	-68	20/04/28 05:17:58
158	338.3108448173557	255.03149237958806	-59	20/04/28 05:17:58
118	364.8036044564246	254.87929012309422	-69	20/04/28 05:17:58
142	357.52906389684784	254.25640036258147	-66	20/04/28 05:17:58
157	335.396193037878	251.71646970274875	-65	20/04/28 05:17:58
74	359.45351725758405	250.95542178264168	-67	20/04/28 05:17:58
133	331.2690965617225	248.09017660618488	-70	20/04/28 05:17:58
143	343.9099929858854	248.05813694827182	-65	20/04/28 05:17:58
152	334.08191155991284	247.00466577900684	-68	20/04/28 05:17:58
150	332.6115694023814	246.65317709036643	-72	20/04/28 05:17:58
151	336.76660815068067	245.52780753634903	-67	20/04/28 05:17:58
40	342.77887309746234	278.6456568754367	-68	20/04/28 05:17:58
26	350.2796243624635	276.47071784526617	-70	20/04/28 05:17:58
25	355.84494920093715	274.3775360828231	-69	20/04/28 05:17:58
5	358.26133089630156	273.48187113127705	-68	20/04/28 05:17:58
24	345.02040429627266	272.92925701677564	-65	20/04/28 05:17:58
13	333.96299539869955	271.4873116898529	-66	20/04/28 05:17:58
39	342.6052734700009	271.0544937535892	-63	20/04/28 05:17:58
1	331.2941515890613	265.05535137478284	-66	20/04/28 05:17:58
11	346.6908082164361	262.1935110472572	-55	20/04/28 05:17:58
23	351.8501918058477	262.17725267735295	-59	20/04/28 05:17:58
28	340.90661949323004	259.4625427347237	-58	20/04/28 05:17:58
32	354.77055639475554	259.4068260534597	-64	20/04/28 05:17:58
62	337.6718197382148	256.8435190905324	-60	20/04/28 05:17:58

105	363.0045414831817	268.2962814158425	-66	20/04/28 05:17:59
91	361.46007213322764	257.54239472489974	-65	20/04/28 05:17:59
68	360.38648222845603	266.6840079029314	-65	20/04/28 05:17:59
100	356.8591206948205	265.4574062155744	-61	20/04/28 05:17:59
101	356.3794452712103	266.0187112870292	-62	20/04/28 05:17:59
131	354.41095812340274	255.26814097712636	-57	20/04/28 05:17:59
95	348.53915319452636	278.34229986583506	-68	20/04/28 05:17:59
94	354.2731910395625	277.47130781253173	-68	20/04/28 05:17:59
78	341.08011710942526	275.7852809597197	-69	20/04/28 05:17:59
76	343.4588316464865	274.9484820317409	-68	20/04/28 05:17:59
96	350.6667069866645	272.97680873708674	-64	20/04/28 05:17:59
125	349.2787479533362	265.1460506013049	-52	20/04/28 05:17:59
97	351.55475745594623	260.1027549170228	-48	20/04/28 05:17:59
98	341.977968397743	258.238214600979	-58	20/04/28 05:17:59
99	350.3039192058533	257.67417330205365	-50	20/04/28 05:17:59
156	335.8966658736479	258.7491542780361	-66	20/04/28 05:17:59
86	335.24797200729284	264.39122996527533	-67	20/04/28 05:17:59
114	332.1775343552876	261.06945179953584	-66	20/04/28 05:17:59
85	330.5178518781359	269.6486080573157	-70	20/04/28 05:17:59
158	338.3108448173557	255.03149237958806	-65	20/04/28 05:17:59
118	364.8036044564246	254.87929012309422	-69	20/04/28 05:17:59
142	357.52906389684784	254.25640036258147	-64	20/04/28 05:17:59
157	335.396193037878	251.71646970274875	-67	20/04/28 05:17:59
74	359.45351725758405	250.95542178264168	-68	20/04/28 05:17:59
87	362.92646003018365	248.88482524646707	-69	20/04/28 05:17:59
143	343.9099929858854	248.05813694827182	-65	20/04/28 05:17:59
152	334.08191155991284	247.00466577900684	-72	20/04/28 05:17:59
151	336.76660815068067	245.52780753634903	-71	20/04/28 05:17:59
40	342.77887309746234	278.6456568754367	-70	20/04/28 05:17:59
26	350.2796243624635	276.47071784526617	-66	20/04/28 05:17:59
25	355.84494920093715	274.3775360828231	-69	20/04/28 05:17:59
5	358.26133089630156	273.48187113127705	-68	20/04/28 05:17:59
24	345.02040429627266	272.92925701677564	-65	20/04/28 05:17:59
13	333.96299539869955	271.4873116898529	-68	20/04/28 05:17:59
39	342.6052734700009	271.0544937535892	-65	20/04/28 05:17:59
1	331.2941515890613	265.05535137478284	-71	20/04/28 05:17:59
11	346.6908082164361	262.1935110472572	-54	20/04/28 05:17:59
23	351.8501918058477	262.17725267735295	-55	20/04/28 05:17:59
28	340.90661949323004	259.4625427347237	-60	20/04/28 05:17:59
32	354.77055639475554	259.4068260534597	-59	20/04/28 05:17:59
62	337.6718197382148	256.8435190905324	-64	20/04/28 05:17:59

105	363.0045414831817	268.2962814158425	-66	20/04/28 05:18:00
91	361.46007213322764	257.54239472489974	-63	20/04/28 05:18:00
68	360.38648222845603	266.6840079029314	-66	20/04/28 05:18:00
100	356.8591206948205	265.4574062155744	-58	20/04/28 05:18:00
101	356.3794452712103	266.0187112870292	-60	20/04/28 05:18:00
131	354.41095812340274	255.26814097712636	-55	20/04/28 05:18:00
95	348.53915319452636	278.34229986583506	-70	20/04/28 05:18:00
94	354.2731910395625	277.47130781253173	-70	20/04/28 05:18:00
78	341.08011710942526	275.7852809597197	-68	20/04/28 05:18:00
76	343.4588316464865	274.9484820317409	-69	20/04/28 05:18:00
96	350.6667069866645	272.97680873708674	-65	20/04/28 05:18:00
125	349.2787479533362	265.1460506013049	-50	20/04/28 05:18:00
97	351.55475745594623	260.1027549170228	-37	20/04/28 05:18:00
98	341.977968397743	258.238214600979	-58	20/04/28 05:18:00
99	350.3039192058533	257.67417330205365	-47	20/04/28 05:18:00
156	335.8966658736479	258.7491542780361	-65	20/04/28 05:18:00
86	335.24797200729284	264.39122996527533	-67	20/04/28 05:18:00
114	332.1775343552876	261.06945179953584	-71	20/04/28 05:18:00
158	338.3108448173557	255.03149237958806	-66	20/04/28 05:18:00
118	364.8036044564246	254.87929012309422	-69	20/04/28 05:18:00
142	357.52906389684784	254.25640036258147	-62	20/04/28 05:18:00
157	335.396193037878	251.71646970274875	-70	20/04/28 05:18:00
74	359.45351725758405	250.95542178264168	-66	20/04/28 05:18:00
87	362.92646003018365	248.88482524646707	-70	20/04/28 05:18:00
143	343.9099929858854	248.05813694827182	-66	20/04/28 05:18:00
6	358.15601601340325	277.90744516598124	-69	20/04/28 05:18:00
40	342.77887309746234	278.6456568754367	-69	20/04/28 05:18:00
26	350.2796243624635	276.47071784526617	-67	20/04/28 05:18:00
25	355.84494920093715	274.3775360828231	-67	20/04/28 05:18:00
5	358.26133089630156	273.48187113127705	-66	20/04/28 05:18:00
24	345.02040429627266	272.92925701677564	-67	20/04/28 05:18:00
13	333.96299539869955	271.4873116898529	-71	20/04/28 05:18:00
39	342.6052734700009	271.0544937535892	-66	20/04/28 05:18:00
1	331.2941515890613	265.05535137478284	-70	20/04/28 05:18:00
11	346.6908082164361	262.1935110472572	-57	20/04/28 05:18:00
23	351.8501918058477	262.17725267735295	-53	20/04/28 05:18:00
28	340.90661949323004	259.4625427347237	-60	20/04/28 05:18:00
32	354.77055639475554	259.4068260534597	-55	20/04/28 05:18:00
62	337.6718197382148	256.8435190905324	-67	20/04/28 05:18:00

105	363.0045414831817	268.2962814158425	-63	20/04/28 05:18:01
104	371.2373587931753	264.44299973322825	-69	20/04/28 05:18:01
91	361.46007213322764	257.54239472489974	-59	20/04/28 05:18:01
68	360.38648222845603	266.6840079029314	-61	20/04/28 05:18:01
147	359.21049737218925	279.2511053175695	-70	20/04/28 05:18:01
100	356.8591206948205	265.4574062155744	-54	20/04/28 05:18:01
101	356.3794452712103	266.0187112870292	-57	20/04/28 05:18:01
131	354.41095812340274	255.26814097712636	-54	20/04/28 05:18:01
95	348.53915319452636	278.34229986583506	-70	20/04/28 05:18:01
94	354.2731910395625	277.47130781253173	-69	20/04/28 05:18:01
78	341.08011710942526	275.7852809597197	-69	20/04/28 05:18:01
76	343.4588316464865	274.9484820317409	-70	20/04/28 05:18:01
96	350.6667069866645	272.97680873708674	-63	20/04/28 05:18:01
125	349.2787479533362	265.1460506013049	-53	20/04/28 05:18:01
97	351.55475745594623	260.1027549170228	-32	20/04/28 05:18:01
98	341.977968397743	258.238214600979	-62	20/04/28 05:18:01
99	350.3039192058533	257.67417330205365	-47	20/04/28 05:18:01
156	335.8966658736479	258.7491542780361	-67	20/04/28 05:18:01
86	335.24797200729284	264.39122996527533	-70	20/04/28 05:18:01
158	338.3108448173557	255.03149237958806	-66	20/04/28 05:18:01
118	364.8036044564246	254.87929012309422	-67	20/04/28 05:18:01
142	357.52906389684784	254.25640036258147	-60	20/04/28 05:18:01
157	335.396193037878	251.71646970274875	-71	20/04/28 05:18:01
74	359.45351725758405	250.95542178264168	-62	20/04/28 05:18:01
87	362.92646003018365	248.88482524646707	-69	20/04/28 05:18:01
143	343.9099929858854	248.05813694827182	-68	20/04/28 05:18:01
6	358.15601601340325	277.90744516598124	-68	20/04/28 05:18:01
10	353.77692302010746	279.81585692000124	-69	20/04/28 05:18:01
26	350.2796243624635	276.47071784526617	-70	20/04/28 05:18:01
25	355.84494920093715	274.3775360828231	-68	20/04/28 05:18:01
5	358.26133089630156	273.48187113127705	-68	20/04/28 05:18:01
24	345.02040429627266	272.92925701677564	-67	20/04/28 05:18:01
39	342.6052734700009	271.0544937535892	-68	20/04/28 05:18:01
7	370.7099322996573	265.651175316596	-69	20/04/28 05:18:01
11	346.6908082164361	262.1935110472572	-57	20/04/28 05:18:01
23	351.8501918058477	262.17725267735295	-53	20/04/28 05:18:01
28	340.90661949323004	259.4625427347237	-64	20/04/28 05:18:01
32	354.77055639475554	259.4068260534597	-54	20/04/28 05:18:01
62	337.6718197382148	256.8435190905324	-68	20/04/28 05:18:01

103	364.7576175947844	276.47675691223276	-71	20/04/28 05:18:02
105	363.0045414831817	268.2962814158425	-62	20/04/28 05:18:02
104	371.2373587931753	264.44299973322825	-68	20/04/28 05:18:02
91	361.46007213322764	257.54239472489974	-58	20/04/28 05:18:02
68	360.38648222845603	266.6840079029314	-60	20/04/28 05:18:02
147	359.21049737218925	279.2511053175695	-68	20/04/28 05:18:02
100	356.8591206948205	265.4574062155744	-53	20/04/28 05:18:02
101	356.3794452712103	266.0187112870292	-55	20/04/28 05:18:02
131	354.41095812340274	255.26814097712636	-52	20/04/28 05:18:02
95	348.53915319452636	278.34229986583506	-69	20/04/28 05:18:02
94	354.2731910395625	277.47130781253173	-68	20/04/28 05:18:02
76	343.4588316464865	274.9484820317409	-68	20/04/28 05:18:02
96	350.6667069866645	272.97680873708674	-63	20/04/28 05:18:02
125	349.2787479533362	265.1460506013049	-56	20/04/28 05:18:02
97	351.55475745594623	260.1027549170228	-46	20/04/28 05:18:02
98	341.977968397743	258.238214600979	-63	20/04/28 05:18:02
99	350.3039192058533	257.67417330205365	-53	20/04/28 05:18:02
156	335.8966658736479	258.7491542780361	-68	20/04/28 05:18:02
86	335.24797200729284	264.39122996527533	-69	20/04/28 05:18:02
158	338.3108448173557	255.03149237958806	-69	20/04/28 05:18:02
118	364.8036044564246	254.87929012309422	-64	20/04/28 05:18:02
142	357.52906389684784	254.25640036258147	-57	20/04/28 05:18:02
74	359.45351725758405	250.95542178264168	-61	20/04/28 05:18:02
87	362.92646003018365	248.88482524646707	-68	20/04/28 05:18:02
143	343.9099929858854	248.05813694827182	-69	20/04/28 05:18:02
6	358.15601601340325	277.90744516598124	-68	20/04/28 05:18:02
10	353.77692302010746	279.81585692000124	-69	20/04/28 05:18:02
26	350.2796243624635	276.47071784526617	-67	20/04/28 05:18:02
41	365.5178707729033	276.19363395322546	-71	20/04/28 05:18:02
25	355.84494920093715	274.3775360828231	-65	20/04/28 05:18:02
5	358.26133089630156	273.48187113127705	-65	20/04/28 05:18:02
24	345.02040429627266	272.92925701677564	-68	20/04/28 05:18:02
39	342.6052734700009	271.0544937535892	-69	20/04/28 05:18:02
7	370.7099322996573	265.651175316596	-70	20/04/28 05:18:02
11	346.6908082164361	262.1935110472572	-61	20/04/28 05:18:02
23	351.8501918058477	262.17725267735295	-54	20/04/28 05:18:02
28	340.90661949323004	259.4625427347237	-68	20/04/28 05:18:02
32	354.77055639475554	259.4068260534597	-55	20/04/28 05:18:02
62	337.6718197382148	256.8435190905324	-69	20/04/28 05:18:02

103	364.7576175947844	276.47675691223276	-70	20/04/28 05:18:03
105	363.0045414831817	268.2962814158425	-63	20/04/28 05:18:03
104	371.2373587931753	264.44299973322825	-68	20/04/28 05:18:03
119	375.51627901217256	256.9846078989686	-69	20/04/28 05:18:03
91	361.46007213322764	257.54239472489974	-52	20/04/28 05:18:03
68	360.38648222845603	266.6840079029314	-59	20/04/28 05:18:03
147	359.21049737218925	279.2511053175695	-70	20/04/28 05:18:03
100	356.8591206948205	265.4574062155744	-53	20/04/28 05:18:03
101	356.3794452712103	266.0187112870292	-55	20/04/28 05:18:03
131	354.41095812340274	255.26814097712636	-54	20/04/28 05:18:03
95	348.53915319452636	278.34229986583506	-72	20/04/28 05:18:03
94	354.2731910395625	277.47130781253173	-69	20/04/28 05:18:03
76	343.4588316464865	274.9484820317409	-69	20/04/28 05:18:03
96	350.6667069866645	272.97680873708674	-65	20/04/28 05:18:03
125	349.2787479533362	265.1460506013049	-61	20/04/28 05:18:03
97	351.55475745594623	260.1027549170228	-53	20/04/28 05:18:03
98	341.977968397743	258.238214600979	-65	20/04/28 05:18:03
99	350.3039192058533	257.67417330205365	-57	20/04/28 05:18:03
158	338.3108448173557	255.03149237958806	-71	20/04/28 05:18:03
118	364.8036044564246	254.87929012309422	-60	20/04/28 05:18:03
142	357.52906389684784	254.25640036258147	-58	20/04/28 05:18:03
74	359.45351725758405	250.95542178264168	-60	20/04/28 05:18:03
87	362.92646003018365	248.88482524646707	-65	20/04/28 05:18:03
143	343.9099929858854	248.05813694827182	-70	20/04/28 05:18:03
6	358.15601601340325	277.90744516598124	-69	20/04/28 05:18:03
10	353.77692302010746	279.81585692000124	-70	20/04/28 05:18:03
26	350.2796243624635	276.47071784526617	-70	20/04/28 05:18:03
41	365.5178707729033	276.19363395322546	-71	20/04/28 05:18:03
25	355.84494920093715	274.3775360828231	-66	20/04/28 05:18:03
5	358.26133089630156	273.48187113127705	-67	20/04/28 05:18:03
24	345.02040429627266	272.92925701677564	-69	20/04/28 05:18:03
39	342.6052734700009	271.0544937535892	-68	20/04/28 05:18:03
7	370.7099322996573	265.651175316596	-68	20/04/28 05:18:03
11	346.6908082164361	262.1935110472572	-65	20/04/28 05:18:03
23	351.8501918058477	262.17725267735295	-58	20/04/28 05:18:03
28	340.90661949323004	259.4625427347237	-69	20/04/28 05:18:03
32	354.77055639475554	259.4068260534597	-55	20/04/28 05:18:03
62	337.6718197382148	256.8435190905324	-72	20/04/28 05:18:03

103	364.7576175947844	276.47675691223276	-70	20/04/28 05:18:04
105	363.0045414831817	268.2962814158425	-61	20/04/28 05:18:04
104	371.2373587931753	264.44299973322825	-67	20/04/28 05:18:04
119	375.51627901217256	256.9846078989686	-68	20/04/28 05:18:04
91	361.46007213322764	257.54239472489974	-51	20/04/28 05:18:04
68	360.38648222845603	266.6840079029314	-57	20/04/28 05:18:04
147	359.21049737218925	279.2511053175695	-70	20/04/28 05:18:04
100	356.8591206948205	265.4574062155744	-51	20/04/28 05:18:04
101	356.3794452712103	266.0187112870292	-54	20/04/28 05:18:04
131	354.41095812340274	255.26814097712636	-56	20/04/28 05:18:04
94	354.2731910395625	277.47130781253173	-70	20/04/28 05:18:04
96	350.6667069866645	272.97680873708674	-66	20/04/28 05:18:04
125	349.2787479533362	265.1460506013049	-60	20/04/28 05:18:04
97	351.55475745594623	260.1027549170228	-57	20/04/28 05:18:04
98	341.977968397743	258.238214600979	-69	20/04/28 05:18:04
99	350.3039192058533	257.67417330205365	-59	20/04/28 05:18:04
118	364.8036044564246	254.87929012309422	-57	20/04/28 05:18:04
142	357.52906389684784	254.25640036258147	-55	20/04/28 05:18:04
120	376.0376794152651	252.86584598617912	-70	20/04/28 05:18:04
74	359.45351725758405	250.95542178264168	-59	20/04/28 05:18:04
87	362.92646003018365	248.88482524646707	-66	20/04/28 05:18:04
143	343.9099929858854	248.05813694827182	-70	20/04/28 05:18:04
6	358.15601601340325	277.90744516598124	-70	20/04/28 05:18:04
26	350.2796243624635	276.47071784526617	-69	20/04/28 05:18:04
41	365.5178707729033	276.19363395322546	-67	20/04/28 05:18:04
25	355.84494920093715	274.3775360828231	-67	20/04/28 05:18:04
5	358.26133089630156	273.48187113127705	-67	20/04/28 05:18:04
24	345.02040429627266	272.92925701677564	-70	20/04/28 05:18:04
39	342.6052734700009	271.0544937535892	-69	20/04/28 05:18:04
7	370.7099322996573	265.651175316596	-67	20/04/28 05:18:04
11	346.6908082164361	262.1935110472572	-65	20/04/28 05:18:04
23	351.8501918058477	262.17725267735295	-61	20/04/28 05:18:04
28	340.90661949323004	259.4625427347237	-70	20/04/28 05:18:04
32	354.77055639475554	259.4068260534597	-55	20/04/28 05:18:04

103	364.7576175947844	276.47675691223276	-69	20/04/28 05:18:05
105	363.0045414831817	268.2962814158425	-60	20/04/28 05:18:05
104	371.2373587931753	264.44299973322825	-63	20/04/28 05:18:05
119	375.51627901217256	256.9846078989686	-66	20/04/28 05:18:05
91	361.46007213322764	257.54239472489974	-46	20/04/28 05:18:05
68	360.38648222845603	266.6840079029314	-53	20/04/28 05:18:05
147	359.21049737218925	279.2511053175695	-70	20/04/28 05:18:05
100	356.8591206948205	265.4574062155744	-56	20/04/28 05:18:05
101	356.3794452712103	266.0187112870292	-56	20/04/28 05:18:05
131	354.41095812340274	255.26814097712636	-61	20/04/28 05:18:05
94	354.2731910395625	277.47130781253173	-69	20/04/28 05:18:05
96	350.6667069866645	272.97680873708674	-68	20/04/28 05:18:05
125	349.2787479533362	265.1460506013049	-66	20/04/28 05:18:05
97	351.55475745594623	260.1027549170228	-60	20/04/28 05:18:05
98	341.977968397743	258.238214600979	-70	20/04/28 05:18:05
99	350.3039192058533	257.67417330205365	-64	20/04/28 05:18:05
118	364.8036044564246	254.87929012309422	-57	20/04/28 05:18:05
142	357.52906389684784	254.25640036258147	-58	20/04/28 05:18:05
120	376.0376794152651	252.86584598617912	-70	20/04/28 05:18:05
74	359.45351725758405	250.95542178264168	-59	20/04/28 05:18:05
87	362.92646003018365	248.88482524646707	-62	20/04/28 05:18:05
67	368.8732884394654	242.66509150825624	-69	20/04/28 05:18:05
65	366.98096759646126	242.15572845965204	-71	20/04/28 05:18:05
6	358.15601601340325	277.90744516598124	-69	20/04/28 05:18:05
26	350.2796243624635	276.47071784526617	-70	20/04/28 05:18:05
41	365.5178707729033	276.19363395322546	-67	20/04/28 05:18:05
25	355.84494920093715	274.3775360828231	-68	20/04/28 05:18:05
5	358.26133089630156	273.48187113127705	-65	20/04/28 05:18:05
7	370.7099322996573	265.651175316596	-65	20/04/28 05:18:05
11	346.6908082164361	262.1935110472572	-67	20/04/28 05:18:05
23	351.8501918058477	262.17725267735295	-63	20/04/28 05:18:05
32	354.77055639475554	259.4068260534597	-57	20/04/28 05:18:05

103	364.7576175947844	276.47675691223276	-69	20/04/28 05:18:06
72	378.8066946773893	269.89182263668283	-70	20/04/28 05:18:06
105	363.0045414831817	268.2962814158425	-58	20/04/28 05:18:06
104	371.2373587931753	264.44299973322825	-61	20/04/28 05:18:06
119	375.51627901217256	256.9846078989686	-65	20/04/28 05:18:06
91	361.46007213322764	257.54239472489974	-47	20/04/28 05:18:06
68	360.38648222845603	266.6840079029314	-57	20/04/28 05:18:06
147	359.21049737218925	279.2511053175695	-72	20/04/28 05:18:06
100	356.8591206948205	265.4574062155744	-60	20/04/28 05:18:06
101	356.3794452712103	266.0187112870292	-58	20/04/28 05:18:06
131	354.41095812340274	255.26814097712636	-62	20/04/28 05:18:06
94	354.2731910395625	277.47130781253173	-71	20/04/28 05:18:06
96	350.6667069866645	272.97680873708674	-71	20/04/28 05:18:06
125	349.2787479533362	265.1460506013049	-66	20/04/28 05:18:06
97	351.55475745594623	260.1027549170228	-64	20/04/28 05:18:06
99	350.3039192058533	257.67417330205365	-65	20/04/28 05:18:06
118	364.8036044564246	254.87929012309422	-54	20/04/28 05:18:06
142	357.52906389684784	254.25640036258147	-59	20/04/28 05:18:06
120	376.0376794152651	252.86584598617912	-65	20/04/28 05:18:06
74	359.45351725758405	250.95542178264168	-62	20/04/28 05:18:06
87	362.92646003018365	248.88482524646707	-65	20/04/28 05:18:06
67	368.8732884394654	242.66509150825624	-68	20/04/28 05:18:06
65	366.98096759646126	242.15572845965204	-69	20/04/28 05:18:06
80	362.22796742473275	240.36595094823747	-72	20/04/28 05:18:06
6	358.15601601340325	277.90744516598124	-72	20/04/28 05:18:06
41	365.5178707729033	276.19363395322546	-69	20/04/28 05:18:06
25	355.84494920093715	274.3775360828231	-67	20/04/28 05:18:06
5	358.26133089630156	273.48187113127705	-69	20/04/28 05:18:06
7	370.7099322996573	265.651175316596	-62	20/04/28 05:18:06
11	346.6908082164361	262.1935110472572	-68	20/04/28 05:18:06
23	351.8501918058477	262.17725267735295	-62	20/04/28 05:18:06
32	354.77055639475554	259.4068260534597	-62	20/04/28 05:18:06

103	364.7576175947844	276.47675691223276	-68	20/04/28 05:18:07
72	378.8066946773893	269.89182263668283	-72	20/04/28 05:18:07
105	363.0045414831817	268.2962814158425	-60	20/04/28 05:18:07
104	371.2373587931753	264.44299973322825	-61	20/04/28 05:18:07
119	375.51627901217256	256.9846078989686	-62	20/04/28 05:18:07
91	361.46007213322764	257.54239472489974	-41	20/04/28 05:18:07
68	360.38648222845603	266.6840079029314	-62	20/04/28 05:18:07
100	356.8591206948205	265.4574062155744	-62	20/04/28 05:18:07
101	356.3794452712103	266.0187112870292	-60	20/04/28 05:18:07
131	354.41095812340274	255.26814097712636	-63	20/04/28 05:18:07
96	350.6667069866645	272.97680873708674	-72	20/04/28 05:18:07
125	349.2787479533362	265.1460506013049	-69	20/04/28 05:18:07
97	351.55475745594623	260.1027549170228	-64	20/04/28 05:18:07
99	350.3039192058533	257.67417330205365	-64	20/04/28 05:18:07
118	364.8036044564246	254.87929012309422	-47	20/04/28 05:18:07
142	357.52906389684784	254.25640036258147	-58	20/04/28 05:18:07
120	376.0376794152651	252.86584598617912	-64	20/04/28 05:18:07
74	359.45351725758405	250.95542178264168	-59	20/04/28 05:18:07
87	362.92646003018365	248.88482524646707	-60	20/04/28 05:18:07
67	368.8732884394654	242.66509150825624	-70	20/04/28 05:18:07
65	366.98096759646126	242.15572845965204	-70	20/04/28 05:18:07
80	362.22796742473275	240.36595094823747	-68	20/04/28 05:18:07
81	359.0207237321107	240.28252224879924	-71	20/04/28 05:18:07
41	365.5178707729033	276.19363395322546	-72	20/04/28 05:18:07
25	355.84494920093715	274.3775360828231	-69	20/04/28 05:18:07
5	358.26133089630156	273.48187113127705	-67	20/04/28 05:18:07
7	370.7099322996573	265.651175316596	-63	20/04/28 05:18:07
11	346.6908082164361	262.1935110472572	-68	20/04/28 05:18:07
23	351.8501918058477	262.17725267735295	-66	20/04/28 05:18:07
32	354.77055639475554	259.4068260534597	-63	20/04/28 05:18:07

105	363.0045414831817	268.2962814158425	-64	20/04/28 05:18:08
104	371.2373587931753	264.44299973322825	-62	20/04/28 05:18:08
119	375.51627901217256	256.9846078989686	-62	20/04/28 05:18:08
91	361.46007213322764	257.54239472489974	-46	20/04/28 05:18:08
68	360.38648222845603	266.6840079029314	-63	20/04/28 05:18:08
100	356.8591206948205	265.4574062155744	-65	20/04/28 05:18:08
101	356.3794452712103	266.0187112870292	-65	20/04/28 05:18:08
131	354.41095812340274	255.26814097712636	-61	20/04/28 05:18:08
125	349.2787479533362	265.1460506013049	-67	20/04/28 05:18:08
97	351.55475745594623	260.1027549170228	-65	20/04/28 05:18:08
99	350.3039192058533	257.67417330205365	-64	20/04/28 05:18:08
118	364.8036044564246	254.87929012309422	-34	20/04/28 05:18:08
142	357.52906389684784	254.25640036258147	-58	20/04/28 05:18:08
120	376.0376794152651	252.86584598617912	-64	20/04/28 05:18:08
74	359.45351725758405	250.95542178264168	-58	20/04/28 05:18:08
87	362.92646003018365	248.88482524646707	-57	20/04/28 05:18:08
67	368.8732884394654	242.66509150825624	-66	20/04/28 05:18:08
65	366.98096759646126	242.15572845965204	-66	20/04/28 05:18:08
80	362.22796742473275	240.36595094823747	-67	20/04/28 05:18:08
81	359.0207237321107	240.28252224879924	-70	20/04/28 05:18:08
5	358.26133089630156	273.48187113127705	-70	20/04/28 05:18:08
7	370.7099322996573	265.651175316596	-65	20/04/28 05:18:08
11	346.6908082164361	262.1935110472572	-71	20/04/28 05:18:08
23	351.8501918058477	262.17725267735295	-66	20/04/28 05:18:08
32	354.77055639475554	259.4068260534597	-64	20/04/28 05:18:08

105	363.0045414831817	268.2962814158425	-66	20/04/28 05:18:09
104	371.2373587931753	264.44299973322825	-65	20/04/28 05:18:09
119	375.51627901217256	256.9846078989686	-60	20/04/28 05:18:09
91	361.46007213322764	257.54239472489974	-54	20/04/28 05:18:09
68	360.38648222845603	266.6840079029314	-66	20/04/28 05:18:09
100	356.8591206948205	265.4574062155744	-66	20/04/28 05:18:09
101	356.3794452712103	266.0187112870292	-68	20/04/28 05:18:09
131	354.41095812340274	255.26814097712636	-64	20/04/28 05:18:09
125	349.2787479533362	265.1460506013049	-71	20/04/28 05:18:09
97	351.55475745594623	260.1027549170228	-67	20/04/28 05:18:09
99	350.3039192058533	257.67417330205365	-65	20/04/28 05:18:09
118	364.8036044564246	254.87929012309422	-30	20/04/28 05:18:09
142	357.52906389684784	254.25640036258147	-58	20/04/28 05:18:09
120	376.0376794152651	252.86584598617912	-63	20/04/28 05:18:09
74	359.45351725758405	250.95542178264168	-57	20/04/28 05:18:09
87	362.92646003018365	248.88482524646707	-53	20/04/28 05:18:09
67	368.8732884394654	242.66509150825624	-64	20/04/28 05:18:09
65	366.98096759646126	242.15572845965204	-66	20/04/28 05:18:09
66	379.0834908307751	241.76317782307424	-69	20/04/28 05:18:09
80	362.22796742473275	240.36595094823747	-65	20/04/28 05:18:09
81	359.0207237321107	240.28252224879924	-66	20/04/28 05:18:09
7	370.7099322996573	265.651175316596	-66	20/04/28 05:18:09
16	382.31605778489967	263.2597328489696	-69	20/04/28 05:18:09
23	351.8501918058477	262.17725267735295	-67	20/04/28 05:18:09
32	354.77055639475554	259.4068260534597	-64	20/04/28 05:18:09

105	363.0045414831817	268.2962814158425	-69	20/04/28 05:18:10
104	371.2373587931753	264.44299973322825	-63	20/04/28 05:18:10
119	375.51627901217256	256.9846078989686	-62	20/04/28 05:18:10
91	361.46007213322764	257.54239472489974	-58	20/04/28 05:18:10
68	360.38648222845603	266.6840079029314	-67	20/04/28 05:18:10
100	356.8591206948205	265.4574062155744	-69	20/04/28 05:18:10
101	356.3794452712103	266.0187112870292	-68	20/04/28 05:18:10
131	354.41095812340274	255.26814097712636	-64	20/04/28 05:18:10
97	351.55475745594623	260.1027549170228	-69	20/04/28 05:18:10
99	350.3039192058533	257.67417330205365	-68	20/04/28 05:18:10
118	364.8036044564246	254.87929012309422	-48	20/04/28 05:18:10
142	357.52906389684784	254.25640036258147	-60	20/04/28 05:18:10
120	376.0376794152651	252.86584598617912	-62	20/04/28 05:18:10
74	359.45351725758405	250.95542178264168	-59	20/04/28 05:18:10
87	362.92646003018365	248.88482524646707	-53	20/04/28 05:18:10
67	368.8732884394654	242.66509150825624	-61	20/04/28 05:18:10
65	366.98096759646126	242.15572845965204	-63	20/04/28 05:18:10
66	379.0834908307751	241.76317782307424	-66	20/04/28 05:18:10
80	362.22796742473275	240.36595094823747	-65	20/04/28 05:18:10
81	359.0207237321107	240.28252224879924	-65	20/04/28 05:18:10
7	370.7099322996573	265.651175316596	-66	20/04/28 05:18:10
16	382.31605778489967	263.2597328489696	-70	20/04/28 05:18:10
23	351.8501918058477	262.17725267735295	-67	20/04/28 05:18:10
32	354.77055639475554	259.4068260534597	-68	20/04/28 05:18:10

105	363.0045414831817	268.2962814158425	-71	20/04/28 05:18:11
104	371.2373587931753	264.44299973322825	-68	20/04/28 05:18:11
119	375.51627901217256	256.9846078989686	-60	20/04/28 05:18:11
91	361.46007213322764	257.54239472489974	-62	20/04/28 05:18:11
68	360.38648222845603	266.6840079029314	-68	20/04/28 05:18:11
100	356.8591206948205	265.4574062155744	-71	20/04/28 05:18:11
101	356.3794452712103	266.0187112870292	-69	20/04/28 05:18:11
131	354.41095812340274	255.26814097712636	-67	20/04/28 05:18:11
97	351.55475745594623	260.1027549170228	-71	20/04/28 05:18:11
99	350.3039192058533	257.67417330205365	-70	20/04/28 05:18:11
118	364.8036044564246	254.87929012309422	-52	20/04/28 05:18:11
142	357.52906389684784	254.25640036258147	-64	20/04/28 05:18:11
120	376.0376794152651	252.86584598617912	-62	20/04/28 05:18:11
74	359.45351725758405	250.95542178264168	-59	20/04/28 05:18:11
87	362.92646003018365	248.88482524646707	-51	20/04/28 05:18:11
67	368.8732884394654	242.66509150825624	-57	20/04/28 05:18:11
65	366.98096759646126	242.15572845965204	-58	20/04/28 05:18:11
66	379.0834908307751	241.76317782307424	-67	20/04/28 05:18:11
80	362.22796742473275	240.36595094823747	-63	20/04/28 05:18:11
81	359.0207237321107	240.28252224879924	-67	20/04/28 05:18:11
7	370.7099322996573	265.651175316596	-68	20/04/28 05:18:11
32	354.77055639475554	259.4068260534597	-68	20/04/28 05:18:11

104	371.2373587931753	264.44299973322825	-67	20/04/28 05:18:12
119	375.51627901217256	256.9846078989686	-60	20/04/28 05:18:12
91	361.46007213322764	257.54239472489974	-63	20/04/28 05:18:12
68	360.38648222845603	266.6840079029314	-69	20/04/28 05:18:12
131	354.41095812340274	255.26814097712636	-68	20/04/28 05:18:12
118	364.8036044564246	254.87929012309422	-57	20/04/28 05:18:12
142	357.52906389684784	254.25640036258147	-63	20/04/28 05:18:12
120	376.0376794152651	252.86584598617912	-59	20/04/28 05:18:12
74	359.45351725758405	250.95542178264168	-62	20/04/28 05:18:12
87	362.92646003018365	248.88482524646707	-57	20/04/28 05:18:12
67	368.8732884394654	242.66509150825624	-53	20/04/28 05:18:12
65	366.98096759646126	242.15572845965204	-57	20/04/28 05:18:12
66	379.0834908307751	241.76317782307424	-64	20/04/28 05:18:12
80	362.22796742473275	240.36595094823747	-62	20/04/28 05:18:12
81	359.0207237321107	240.28252224879924	-65	20/04/28 05:18:12
7	370.7099322996573	265.651175316596	-67	20/04/28 05:18:12
32	354.77055639475554	259.4068260534597	-69	20/04/28 05:18:12

104	371.2373587931753	264.44299973322825	-68	20/04/28 05:18:13
119	375.51627901217256	256.9846078989686	-64	20/04/28 05:18:13
91	361.46007213322764	257.54239472489974	-65	20/04/28 05:18:13
131	354.41095812340274	255.26814097712636	-69	20/04/28 05:18:13
118	364.8036044564246	254.87929012309422	-62	20/04/28 05:18:13
142	357.52906389684784	254.25640036258147	-68	20/04/28 05:18:13
120	376.0376794152651	252.86584598617912	-58	20/04/28 05:18:13
74	359.45351725758405	250.95542178264168	-64	20/04/28 05:18:13
87	362.92646003018365	248.88482524646707	-59	20/04/28 05:18:13
67	368.8732884394654	242.66509150825624	-53	20/04/28 05:18:13
65	366.98096759646126	242.15572845965204	-57	20/04/28 05:18:13
66	379.0834908307751	241.76317782307424	-60	20/04/28 05:18:13
80	362.22796742473275	240.36595094823747	-62	20/04/28 05:18:13
81	359.0207237321107	240.28252224879924	-67	20/04/28 05:18:13
7	370.7099322996573	265.651175316596	-71	20/04/28 05:18:13

104	371.2373587931753	264.44299973322825	-71	20/04/28 05:18:14
119	375.51627901217256	256.9846078989686	-62	20/04/28 05:18:14
91	361.46007213322764	257.54239472489974	-66	20/04/28 05:18:14
118	364.8036044564246	254.87929012309422	-64	20/04/28 05:18:14
142	357.52906389684784	254.25640036258147	-69	20/04/28 05:18:14
120	376.0376794152651	252.86584598617912	-58	20/04/28 05:18:14
74	359.45351725758405	250.95542178264168	-65	20/04/28 05:18:14
87	362.92646003018365	248.88482524646707	-61	20/04/28 05:18:14
67	368.8732884394654	242.66509150825624	-52	20/04/28 05:18:14
65	366.98096759646126	242.15572845965204	-59	20/04/28 05:18:14
66	379.0834908307751	241.76317782307424	-57	20/04/28 05:18:14
80	362.22796742473275	240.36595094823747	-63	20/04/28 05:18:14
81	359.0207237321107	240.28252224879924	-68	20/04/28 05:18:14

119	375.51627901217256	256.9846078989686	-63	20/04/28 05:18:15
91	361.46007213322764	257.54239472489974	-70	20/04/28 05:18:15
118	364.8036044564246	254.87929012309422	-67	20/04/28 05:18:15
142	357.52906389684784	254.25640036258147	-69	20/04/28 05:18:15
120	376.0376794152651	252.86584598617912	-59	20/04/28 05:18:15
74	359.45351725758405	250.95542178264168	-67	20/04/28 05:18:15
87	362.92646003018365	248.88482524646707	-65	20/04/28 05:18:15
67	368.8732884394654	242.66509150825624	-53	20/04/28 05:18:15
65	366.98096759646126	242.15572845965204	-60	20/04/28 05:18:15
66	379.0834908307751	241.76317782307424	-55	20/04/28 05:18:15
80	362.22796742473275	240.36595094823747	-65	20/04/28 05:18:15
81	359.0207237321107	240.28252224879924	-67	20/04/28 05:18:15

119	375.51627901217256	256.9846078989686	-64	20/04/28 05:18:16
118	364.8036044564246	254.87929012309422	-68	20/04/28 05:18:16
120	376.0376794152651	252.86584598617912	-61	20/04/28 05:18:16
74	359.45351725758405	250.95542178264168	-68	20/04/28 05:18:16
87	362.92646003018365	248.88482524646707	-67	20/04/28 05:18:16
67	368.8732884394654	242.66509150825624	-59	20/04/28 05:18:16
65	366.98096759646126	242.15572845965204	-62	20/04/28 05:18:16
66	379.0834908307751	241.76317782307424	-48	20/04/28 05:18:16
80	362.22796742473275	240.36595094823747	-66	20/04/28 05:18:16
81	359.0207237321107	240.28252224879924	-67	20/04/28 05:18:16

119	375.51627901217256	256.9846078989686	-65	20/04/28 05:18:17
118	364.8036044564246	254.87929012309422	-68	20/04/28 05:18:17
120	376.0376794152651	252.86584598617912	-61	20/04/28 05:18:17
87	362.92646003018365	248.88482524646707	-67	20/04/28 05:18:17
67	368.8732884394654	242.66509150825624	-58	20/04/28 05:18:17
65	366.98096759646126	242.15572845965204	-62	20/04/28 05:18:17
66	379.0834908307751	241.76317782307424	-35	20/04/28 05:18:17
80	362.22796742473275	240.36595094823747	-69	20/04/28 05:18:17
81	359.0207237321107	240.28252224879924	-71	20/04/28 05:18:17

119	375.51627901217256	256.9846078989686	-68	20/04/28 05:18:18
120	376.0376794152651	252.86584598617912	-65	20/04/28 05:18:18
87	362.92646003018365	248.88482524646707	-68	20/04/28 05:18:18
67	368.8732884394654	242.66509150825624	-63	20/04/28 05:18:18
65	366.98096759646126	242.15572845965204	-65	20/04/28 05:18:18
66	379.0834908307751	241.76317782307424	-30	20/04/28 05:18:18
80	362.22796742473275	240.36595094823747	-69	20/04/28 05:18:18

119	375.51627901217256	256.9846078989686	-70	20/04/28 05:18:19
120	376.0376794152651	252.86584598617912	-63	20/04/28 05:18:19
87	362.92646003018365	248.88482524646707	-71	20/04/28 05:18:19
67	368.8732884394654	242.66509150825624	-64	20/04/28 05:18:19
65	366.98096759646126	242.15572845965204	-66	20/04/28 05:18:19
66	379.0834908307751	241.76317782307424	-33	20/04/28 05:18:19
80	362.22796742473275	240.36595094823747	-70	20/04/28 05:18:19

119	375.51627901217256	256.9846078989686	-69	20/04/28 05:18:20
120	376.0376794152651	252.86584598617912	-62	20/04/28 05:18:20
87	362.92646003018365	248.88482524646707	-71	20/04/28 05:18:20
67	368.8732884394654	242.66509150825624	-62	20/04/28 05:18:20
65	366.98096759646126	242.15572845965204	-65	20/04/28 05:18:20
66	379.0834908307751	241.76317782307424	-35	20/04/28 05:18:20
80	362.22796742473275	240.36595094823747	-68	20/04/28 05:18:20

119	375.51627901217256	256.9846078989686	-70	20/04/28 05:18:21
120	376.0376794152651	252.86584598617912	-64	20/04/28 05:18:21
87	362.92646003018365	248.88482524646707	-68	20/04/28 05:18:21
67	368.8732884394654	242.66509150825624	-61	20/04/28 05:18:21
65	366.98096759646126	242.15572845965204	-66	20/04/28 05:18:21
66	379.0834908307751	241.76317782307424	-31	20/04/28 05:18:21
80	362.22796742473275	240.36595094823747	-67	20/04/28 05:18:21

119	375.51627901217256	256.9846078989686	-68	20/04/28 05:18:22
118	364.8036044564246	254.87929012309422	-71	20/04/28 05:18:22
120	376.0376794152651	252.86584598617912	-65	20/04/28 05:18:22
87	362.92646003018365	248.88482524646707	-69	20/04/28 05:18:22
67	368.8732884394654	242.66509150825624	-61	20/04/28 05:18:22
65	366.98096759646126	242.15572845965204	-63	20/04/28 05:18:22
66	379.0834908307751	241.76317782307424	-24	20/04/28 05:18:22
80	362.22796742473275	240.36595094823747	-68	20/04/28 05:18:22

119	375.51627901217256	256.9846078989686	-68	20/04/28 05:18:23
118	364.8036044564246	254.87929012309422	-71	20/04/28 05:18:23
120	376.0376794152651	252.86584598617912	-66	20/04/28 05:18:23
87	362.92646003018365	248.88482524646707	-70	20/04/28 05:18:23
67	368.8732884394654	242.66509150825624	-64	20/04/28 05:18:23
65	366.98096759646126	242.15572845965204	-63	20/04/28 05:18:23
66	379.0834908307751	241.76317782307424	-28	20/04/28 05:18:23
80	362.22796742473275	240.36595094823747	-70	20/04/28 05:18:23
81	359.0207237321107	240.28252224879924	-71	20/04/28 05:18:23

119	375.51627901217256	256.9846078989686	-68	20/04/28 05:18:24
118	364.8036044564246	254.87929012309422	-70	20/04/28 05:18:24
120	376.0376794152651	252.86584598617912	-63	20/04/28 05:18:24
87	362.92646003018365	248.88482524646707	-70	20/04/28 05:18:24
67	368.8732884394654	242.66509150825624	-62	20/04/28 05:18:24
65	366.98096759646126	242.15572845965204	-63	20/04/28 05:18:24
66	379.0834908307751	241.76317782307424	-26	20/04/28 05:18:24
80	362.22796742473275	240.36595094823747	-68	20/04/28 05:18:24
81	359.0207237321107	240.28252224879924	-72	20/04/28 05:18:24

119	375.51627901217256	256.9846078989686	-68	20/04/28 05:18:25
118	364.8036044564246	254.87929012309422	-69	20/04/28 05:18:25
120	376.0376794152651	252.86584598617912	-62	20/04/28 05:18:25
87	362.92646003018365	248.88482524646707	-68	20/04/28 05:18:25
67	368.8732884394654	242.66509150825624	-61	20/04/28 05:18:25
65	366.98096759646126	242.15572845965204	-64	20/04/28 05:18:25
66	379.0834908307751	241.76317782307424	-27	20/04/28 05:18:25
80	362.22796742473275	240.36595094823747	-66	20/04/28 05:18:25
81	359.0207237321107	240.28252224879924	-69	20/04/28 05:18:25

119	375.51627901217256	256.9846078989686	-66	20/04/28 05:18:26
118	364.8036044564246	254.87929012309422	-68	20/04/28 05:18:26
120	376.0376794152651	252.86584598617912	-62	20/04/28 05:18:26
87	362.92646003018365	248.88482524646707	-70	20/04/28 05:18:26
67	368.8732884394654	242.66509150825624	-60	20/04/28 05:18:26
65	366.98096759646126	242.15572845965204	-65	20/04/28 05:18:26
66	379.0834908307751	241.76317782307424	-32	20/04/28 05:18:26
80	362.22796742473275	240.36595094823747	-69	20/04/28 05:18:26
81	359.0207237321107	240.28252224879924	-69	20/04/28 05:18:26

119	375.51627901217256	256.9846078989686	-68	20/04/28 05:18:27
118	364.8036044564246	254.87929012309422	-71	20/04/28 05:18:27
120	376.0376794152651	252.86584598617912	-64	20/04/28 05:18:27
87	362.92646003018365	248.88482524646707	-67	20/04/28 05:18:27
67	368.8732884394654	242.66509150825624	-61	20/04/28 05:18:27
65	366.98096759646126	242.15572845965204	-63	20/04/28 05:18:27
66	379.0834908307751	241.76317782307424	-34	20/04/28 05:18:27
80	362.22796742473275	240.36595094823747	-68	20/04/28 05:18:27
81	359.0207237321107	240.28252224879924	-71	20/04/28 05:18:27

119	375.51627901217256	256.9846078989686	-66	20/04/28 05:18:28
118	364.8036044564246	254.87929012309422	-70	20/04/28 05:18:28
120	376.0376794152651	252.86584598617912	-65	20/04/28 05:18:28
87	362.92646003018365	248.88482524646707	-69	20/04/28 05:18:28
67	368.8732884394654	242.66509150825624	-60	20/04/28 05:18:28
65	366.98096759646126	242.15572845965204	-64	20/04/28 05:18:28
66	379.0834908307751	241.76317782307424	-35	20/04/28 05:18:28
80	362.22796742473275	240.36595094823747	-69	20/04/28 05:18:28
81	359.0207237321107	240.28252224879924	-69	20/04/28 05:18:28

119	375.51627901217256	256.9846078989686	-70	20/04/28 05:18:29
118	364.8036044564246	254.87929012309422	-69	20/04/28 05:18:29
120	376.0376794152651	252.86584598617912	-64	20/04/28 05:18:29
87	362.92646003018365	248.88482524646707	-70	20/04/28 05:18:29
67	368.8732884394654	242.66509150825624	-61	20/04/28 05:18:29
65	366.98096759646126	242.15572845965204	-63	20/04/28 05:18:29
66	379.0834908307751	241.76317782307424	-33	20/04/28 05:18:29
80	362.22796742473275	240.36595094823747	-67	20/04/28 05:18:29
81	359.0207237321107	240.28252224879924	-71	20/04/28 05:18:29

119	375.51627901217256	256.9846078989686	-70	20/04/28 05:18:30
118	364.8036044564246	254.87929012309422	-69	20/04/28 05:18:30
120	376.0376794152651	252.86584598617912	-63	20/04/28 05:18:30
87	362.92646003018365	248.88482524646707	-68	20/04/28 05:18:30
67	368.8732884394654	242.66509150825624	-63	20/04/28 05:18:30
65	366.98096759646126	242.15572845965204	-63	20/04/28 05:18:30
66	379.0834908307751	241.76317782307424	-22	20/04/28 05:18:30
80	362.22796742473275	240.36595094823747	-68	20/04/28 05:18:30
81	359.0207237321107	240.28252224879924	-72	20/04/28 05:18:30

119	375.51627901217256	256.9846078989686	-66	20/04/28 05:18:31
118	364.8036044564246	254.87929012309422	-71	20/04/28 05:18:31
120	376.0376794152651	252.86584598617912	-65	20/04/28 05:18:31
87	362.92646003018365	248.88482524646707	-68	20/04/28 05:18:31
67	368.8732884394654	242.66509150825624	-59	20/04/28 05:18:31
65	366.98096759646126	242.15572845965204	-62	20/04/28 05:18:31
66	379.0834908307751	241.76317782307424	-31	20/04/28 05:18:31
80	362.22796742473275	240.36595094823747	-68	20/04/28 05:18:31
81	359.0207237321107	240.28252224879924	-71	20/04/28 05:18:31

119	375.51627901217256	256.9846078989686	-68	20/04/28 05:18:32
118	364.8036044564246	254.87929012309422	-70	20/04/28 05:18:32
120	376.0376794152651	252.86584598617912	-64	20/04/28 05:18:32
87	362.92646003018365	248.88482524646707	-70	20/04/28 05:18:32
67	368.8732884394654	242.66509150825624	-60	20/04/28 05:18:32
65	366.98096759646126	242.15572845965204	-63	20/04/28 05:18:32
66	379.0834908307751	241.76317782307424	-23	20/04/28 05:18:32
80	362.22796742473275	240.36595094823747	-66	20/04/28 05:18:32
81	359.0207237321107	240.28252224879924	-71	20/04/28 05:18:32

119	375.51627901217256	256.9846078989686	-69	20/04/28 05:18:33
118	364.8036044564246	254.87929012309422	-70	20/04/28 05:18:33
120	376.0376794152651	252.86584598617912	-62	20/04/28 05:18:33
87	362.92646003018365	248.88482524646707	-67	20/04/28 05:18:33
67	368.8732884394654	242.66509150825624	-61	20/04/28 05:18:33
65	366.98096759646126	242.15572845965204	-62	20/04/28 05:18:33
66	379.0834908307751	241.76317782307424	-32	20/04/28 05:18:33
80	362.22796742473275	240.36595094823747	-66	20/04/28 05:18:33
81	359.0207237321107	240.28252224879924	-68	20/04/28 05:18:33

119	375.51627901217256	256.9846078989686	-68	20/04/28 05:18:34
118	364.8036044564246	254.87929012309422	-67	20/04/28 05:18:34
120	376.0376794152651	252.86584598617912	-64	20/04/28 05:18:34
87	362.92646003018365	248.88482524646707	-67	20/04/28 05:18:34
67	368.8732884394654	242.66509150825624	-59	20/04/28 05:18:34
65	366.98096759646126	242.15572845965204	-64	20/04/28 05:18:34
66	379.0834908307751	241.76317782307424	-37	20/04/28 05:18:34
80	362.22796742473275	240.36595094823747	-67	20/04/28 05:18:34
81	359.0207237321107	240.28252224879924	-71	20/04/28 05:18:34

119	375.51627901217256	256.9846078989686	-69	20/04/28 05:18:35
118	364.8036044564246	254.87929012309422	-72	20/04/28 05:18:35
120	376.0376794152651	252.86584598617912	-64	20/04/28 05:18:35
87	362.92646003018365	248.88482524646707	-67	20/04/28 05:18:35
67	368.8732884394654	242.66509150825624	-61	20/04/28 05:18:35
65	366.98096759646126	242.15572845965204	-64	20/04/28 05:18:35
66	379.0834908307751	241.76317782307424	-26	20/04/28 05:18:35
80	362.22796742473275	240.36595094823747	-67	20/04/28 05:18:35
81	359.0207237321107	240.28252224879924	-69	20/04/28 05:18:35

119	375.51627901217256	256.9846078989686	-67	20/04/28 05:18:36
118	364.8036044564246	254.87929012309422	-72	20/04/28 05:18:36
120	376.0376794152651	252.86584598617912	-63	20/04/28 05:18:36
87	362.92646003018365	248.88482524646707	-70	20/04/28 05:18:36
67	368.8732884394654	242.66509150825624	-61	20/04/28 05:18:36
65	366.98096759646126	242.15572845965204	-66	20/04/28 05:18:36
66	379.0834908307751	241.76317782307424	-21	20/04/28 05:18:36
80	362.22796742473275	240.36595094823747	-68	20/04/28 05:18:36

119	375.51627901217256	256.9846078989686	-68	20/04/28 05:18:37
118	364.8036044564246	254.87929012309422	-71	20/04/28 05:18:37
120	376.0376794152651	252.86584598617912	-62	20/04/28 05:18:37
87	362.92646003018365	248.88482524646707	-68	20/04/28 05:18:37
67	368.8732884394654	242.66509150825624	-62	20/04/28 05:18:37
65	366.98096759646126	242.15572845965204	-63	20/04/28 05:18:37
66	379.0834908307751	241.76317782307424	-21	20/04/28 05:18:37
80	362.22796742473275	240.36595094823747	-71	20/04/28 05:18:37

119	375.51627901217256	256.9846078989686	-67	20/04/28 05:18:38
120	376.0376794152651	252.86584598617912	-63	20/04/28 05:18:38
87	362.92646003018365	248.88482524646707	-69	20/04/28 05:18:38
67	368.8732884394654	242.66509150825624	-64	20/04/28 05:18:38
65	366.98096759646126	242.15572845965204	-65	20/04/28 05:18:38
66	379.0834908307751	241.76317782307424	-30	20/04/28 05:18:38
80	362.22796742473275	240.36595094823747	-70	20/04/28 05:18:38

119	375.51627901217256	256.9846078989686	-69	20/04/28 05:18:39
120	376.0376794152651	252.86584598617912	-64	20/04/28 05:18:39
87	362.92646003018365	248.88482524646707	-71	20/04/28 05:18:39
67	368.8732884394654	242.66509150825624	-64	20/04/28 05:18:39
65	366.98096759646126	242.15572845965204	-66	20/04/28 05:18:39
66	379.0834908307751	241.76317782307424	-32	20/04/28 05:18:39
80	362.22796742473275	240.36595094823747	-69	20/04/28 05:18:39

119	375.51627901217256	256.9846078989686	-69	20/04/28 05:18:40
120	376.0376794152651	252.86584598617912	-63	20/04/28 05:18:40
87	362.92646003018365	248.88482524646707	-70	20/04/28 05:18:40
67	368.8732884394654	242.66509150825624	-62	20/04/28 05:18:40
65	366.98096759646126	242.15572845965204	-66	20/04/28 05:18:40
66	379.0834908307751	241.76317782307424	-28	20/04/28 05:18:40
80	362.22796742473275	240.36595094823747	-68	20/04/28 05:18:40

119	375.51627901217256	256.9846078989686	-69	20/04/28 05:18:41
118	364.8036044564246	254.87929012309422	-69	20/04/28 05:18:41
120	376.0376794152651	252.86584598617912	-63	20/04/28 05:18:41
87	362.92646003018365	248.88482524646707	-69	20/04/28 05:18:41
67	368.8732884394654	242.66509150825624	-63	20/04/28 05:18:41
65	366.98096759646126	242.15572845965204	-64	20/04/28 05:18:41
66	379.0834908307751	241.76317782307424	-29	20/04/28 05:18:41
80	362.22796742473275	240.36595094823747	-69	20/04/28 05:18:41
81	359.0207237321107	240.28252224879924	-69	20/04/28 05:18:41

119	375.51627901217256	256.9846078989686	-68	20/04/28 05:18:42
118	364.8036044564246	254.87929012309422	-71	20/04/28 05:18:42
120	376.0376794152651	252.86584598617912	-64	20/04/28 05:18:42
87	362.92646003018365	248.88482524646707	-67	20/04/28 05:18:42
67	368.8732884394654	242.66509150825624	-63	20/04/28 05:18:42
65	366.98096759646126	242.15572845965204	-64	20/04/28 05:18:42
66	379.0834908307751	241.76317782307424	-24	20/04/28 05:18:42
80	362.22796742473275	240.36595094823747	-67	20/04/28 05:18:42
81	359.0207237321107	240.28252224879924	-70	20/04/28 05:18:42

119	375.51627901217256	256.9846078989686	-67	20/04/28 05:18:43
118	364.8036044564246	254.87929012309422	-71	20/04/28 05:18:43
120	376.0376794152651	252.86584598617912	-62	20/04/28 05:18:43
87	362.92646003018365	248.88482524646707	-67	20/04/28 05:18:43
67	368.8732884394654	242.66509150825624	-59	20/04/28 05:18:43
65	366.98096759646126	242.15572845965204	-61	20/04/28 05:18:43
66	379.0834908307751	241.76317782307424	-27	20/04/28 05:18:43
80	362.22796742473275	240.36595094823747	-68	20/04/28 05:18:43
81	359.0207237321107	240.28252224879924	-72	20/04/28 05:18:43

119	375.51627901217256	256.9846078989686	-69	20/04/28 05:18:44
118	364.8036044564246	254.87929012309422	-70	20/04/28 05:18:44
120	376.0376794152651	252.86584598617912	-62	20/04/28 05:18:44
87	362.92646003018365	248.88482524646707	-70	20/04/28 05:18:44
67	368.8732884394654	242.66509150825624	-60	20/04/28 05:18:44
65	366.98096759646126	242.15572845965204	-65	20/04/28 05:18:44
66	379.0834908307751	241.76317782307424	-17	20/04/28 05:18:44
80	362.22796742473275	240.36595094823747	-69	20/04/28 05:18:44
81	359.0207237321107	240.28252224879924	-70	20/04/28 05:18:44

119	375.51627901217256	256.9846078989686	-69	20/04/28 05:18:45
118	364.8036044564246	254.87929012309422	-71	20/04/28 05:18:45
120	376.0376794152651	252.86584598617912	-62	20/04/28 05:18:45
87	362.92646003018365	248.88482524646707	-66	20/04/28 05:18:45
67	368.8732884394654	242.66509150825624	-60	20/04/28 05:18:45
65	366.98096759646126	242.15572845965204	-61	20/04/28 05:18:45
66	379.0834908307751	241.76317782307424	-36	20/04/28 05:18:45
80	362.22796742473275	240.36595094823747	-69	20/04/28 05:18:45
81	359.0207237321107	240.28252224879924	-71	20/04/28 05:18:45

119	375.51627901217256	256.9846078989686	-65	20/04/28 05:18:46
118	364.8036044564246	254.87929012309422	-68	20/04/28 05:18:46
120	376.0376794152651	252.86584598617912	-64	20/04/28 05:18:46
87	362.92646003018365	248.88482524646707	-68	20/04/28 05:18:46
67	368.8732884394654	242.66509150825624	-61	20/04/28 05:18:46
65	366.98096759646126	242.15572845965204	-63	20/04/28 05:18:46
66	379.0834908307751	241.76317782307424	-39	20/04/28 05:18:46
80	362.22796742473275	240.36595094823747	-67	20/04/28 05:18:46
81	359.0207237321107	240.28252224879924	-67	20/04/28 05:18:46

119	375.51627901217256	256.9846078989686	-67	20/04/28 05:18:47
118	364.8036044564246	254.87929012309422	-68	20/04/28 05:18:47
120	376.0376794152651	252.86584598617912	-64	20/04/28 05:18:47
87	362.92646003018365	248.88482524646707	-68	20/04/28 05:18:47
67	368.8732884394654	242.66509150825624	-58	20/04/28 05:18:47
65	366.98096759646126	242.15572845965204	-61	20/04/28 05:18:47
66	379.0834908307751	241.76317782307424	-37	20/04/28 05:18:47
80	362.22796742473275	240.36595094823747	-66	20/04/28 05:18:47
81	359.0207237321107	240.28252224879924	-69	20/04/28 05:18:47

119	375.51627901217256	256.9846078989686	-64	20/04/28 05:18:48
118	364.8036044564246	254.87929012309422	-70	20/04/28 05:18:48
120	376.0376794152651	252.86584598617912	-62	20/04/28 05:18:48
74	359.45351725758405	250.95542178264168	-69	20/04/28 05:18:48
87	362.92646003018365	248.88482524646707	-65	20/04/28 05:18:48
67	368.8732884394654	242.66509150825624	-55	20/04/28 05:18:48
65	366.98096759646126	242.15572845965204	-62	20/04/28 05:18:48
66	379.0834908307751	241.76317782307424	-45	20/04/28 05:18:48
80	362.22796742473275	240.36595094823747	-66	20/04/28 05:18:48
81	359.0207237321107	240.28252224879924	-68	20/04/28 05:18:48

