floorId	partitionId	location_x	location_y	timeStamp
1	NULL	344.77216199423657	268.7257539392073	20/04/28 05:10:48
1	83	337.2720802919978	268.9776784695725	20/04/28 05:10:49
1	83	337.2720802919978	268.9776784695725	20/04/28 05:10:50
1	56	333.50170633168455	266.97796434330365	20/04/28 05:10:51
1	56	333.50170633168455	266.97796434330365	20/04/28 05:10:52
1	56	332.3533251581634	266.3650631324579	20/04/28 05:10:53
1	56	329.20163749260223	267.39961482774885	20/04/28 05:10:54
1	37	326.8323259201915	265.52502720042946	20/04/28 05:10:55
1	72	322.34915620924	265.0152899264337	20/04/28 05:10:56
1	72	322.34915620924	265.0152899264337	20/04/28 05:10:57
1	56	319.89662212153377	266.1573209564685	20/04/28 05:10:58
1	56	319.89662212153377	266.1573209564685	20/04/28 05:11:00
1	81	316.8584991431141	264.5437756453438	20/04/28 05:11:01
1	81	314.50318194109644	265.02915212402996	20/04/28 05:11:02
1	81	313.2523840549325	264.4074609667819	20/04/28 05:11:03
1	56	307.159840217744	263.3357311024059	20/04/28 05:11:04
1	56	307.159840217744	263.3357311024059	20/04/28 05:11:05
1	98	305.14384176673207	266.22087392439636	20/04/28 05:11:06
1	98	303.28594423312194	264.61216223098285	20/04/28 05:11:07
1	98	303.28594423312194	264.61216223098285	20/04/28 05:11:08
3	47	302.8570592601016	265.6207358146814	20/04/28 05:11:09
3	47	305.42047124180004	265.2616066172563	20/04/28 05:11:10
3	47	305.42047124180004	265.2616066172563	20/04/28 05:11:11
3	20	308.1866193271433	264.1749199815553	20/04/28 05:11:12
1	81	312.6019130172586	265.6450929868838	20/04/28 05:11:13
1	81	315.0919378015828	261.7557595783303	20/04/28 05:11:14
3	36	363.00329934539394	292.95546907223854	20/04/28 05:11:15
3	54	318.718225726321	262.2630310087092	20/04/28 05:11:16
3	54	321.27015631552865	262.1152944981856	20/04/28 05:11:17
3	54	324.01518066743233	262.76750572012435	20/04/28 05:11:18
3	18	323.5974156050991	264.28862562276623	20/04/28 05:11:19
3	54	324.6837666112415	261.38954335341236	20/04/28 05:11:20
3	54	327.3540763805351	261.1072377077433	20/04/28 05:11:21
3	54	334.4407240787428	261.4032786809491	20/04/28 05:11:22
3	54	334.4407240787428	261.4032786809491	20/04/28 05:11:23
3	54	334.4407240787428	261.4032786809491	20/04/28 05:11:24
3	54	334.4407240787428	261.4032786809491	20/04/28 05:11:25
3	NULL	337.70753542622793	260.45953294809686	20/04/28 05:11:26
3	99	339.59375125487367	258.8166372045796	20/04/28 05:11:27
3	42	343.19179870246967	259.9647561276533	20/04/28 05:11:28
3	11	323.2129457422618	285.38261755407694	20/04/28 05:11:29
3	54	350.3791415383785	260.97432627346046	20/04/28 05:11:30
3	54	350.37914153837863	260.97432627346046	20/04/28 05:11:31
3	54	350.37914153837863	260.97432627346046	20/04/28 05:11:32
3	54	352.9059324522066	261.07811147821695	20/04/28 05:11:33
3	54	354.93110780732565	263.85962413987545	20/04/28 05:11:34
3	54	358.23287936641947	263.00617074250107	20/04/28 05:11:35
3	54	359.56855835216805	263.2279362811352	20/04/28 05:11:36
3	54	359.5685583521681	263.2279362811352	20/04/28 05:11:37
3	54	365.2339908031949	263.4272252913235	20/04/28 05:11:38
3	57	365.8336784609425	258.9548948604074	20/04/28 05:11:39
3	46	368.3172775253381	266.1301521552222	20/04/28 05:11:40
3	54	372.48785670166836	262.3595943162643	20/04/28 05:11:41
3	54	372.48785670166836	262.3595943162643	20/04/28 05:11:42
3	54	372.48785670166836	262.3595943162643	20/04/28 05:11:43
3	54	376.18269094789457	263.03655301878126	20/04/28 05:11:44
3	15	379.8755906118027	262.6421307240284	20/04/28 05:11:45
3	15	380.97239583354167	266.94453563659977	20/04/28 05:11:46
1	33	381.6109766893215	266.73786054806715	20/04/28 05:11:47
1	33	380.6150632356726	267.4744509522458	20/04/28 05:11:48
1	86	378.091951274268	265.65817665109427	20/04/28 05:11:49
1	69	376.18075636557654	261.96517202151136	20/04/28 05:11:50
1	69	372.48785670166836	262.3595943162643	20/04/28 05:11:51
1	69	372.48785670166836	262.3595943162643	20/04/28 05:11:52
1	69	372.48785670166836	262.3595943162643	20/04/28 05:11:53
1	69	367.80245440868674	262.5455232582413	20/04/28 05:11:54
3	57	365.6578696297699	259.35762005486333	20/04/28 05:11:55
3	34	363.08940602427793	260.2393220879455	20/04/28 05:11:56
3	54	358.87237025214637	261.21107622709695	20/04/28 05:11:57
3	54	358.87237025214637	261.21107622709695	20/04/28 05:11:58
1	64	356.02694011127693	259.70882448523747	20/04/28 05:11:59
1	69	354.7166040324837	258.6134930311314	20/04/28 05:12:00
1	41	352.7251685521831	260.56227788261185	20/04/28 05:12:01
1	41	352.7251685521831	260.56227788261185	20/04/28 05:12:02
1	41	351.1038521390131	261.25919659269	20/04/28 05:12:03
1	41	351.1038521390131	261.25919659268993	20/04/28 05:12:04
1	41	349.2732493252067	263.17227144197165	20/04/28 05:12:05
1	41	351.1038521390131	261.25919659268993	20/04/28 05:12:06
1	41	349.2732493252067	263.17227144197165	20/04/28 05:12:07
1	41	349.2732493252067	263.17227144197165	20/04/28 05:12:08
1	41	349.2732493252067	263.17227144197165	20/04/28 05:12:09
1	41	349.2732493252067	263.17227144197165	20/04/28 05:12:10
1	41	349.2732493252067	263.17227144197165	20/04/28 05:12:11
1	41	349.2732493252067	263.17227144197165	20/04/28 05:12:12
1	41	349.2732493252067	263.17227144197165	20/04/28 05:12:13
1	41	349.2732493252067	263.17227144197165	20/04/28 05:12:14
1	41	349.2732493252067	263.17227144197165	20/04/28 05:12:15
1	41	349.2732493252067	263.17227144197165	20/04/28 05:12:16
1	41	349.2732493252067	263.17227144197165	20/04/28 05:12:17
1	41	349.2732493252067	263.17227144197165	20/04/28 05:12:18
1	41	349.2732493252067	263.17227144197165	20/04/28 05:12:19
1	41	349.2732493252067	263.17227144197165	20/04/28 05:12:20
1	41	349.2732493252067	263.17227144197165	20/04/28 05:12:21
1	41	349.2732493252067	263.17227144197165	20/04/28 05:12:22
1	41	349.2732493252067	263.17227144197165	20/04/28 05:12:23
1	41	349.2732493252067	263.17227144197165	20/04/28 05:12:24
1	41	351.1038521390131	261.25919659268993	20/04/28 05:12:25
1	41	352.7251685521831	260.56227788261185	20/04/28 05:12:26
1	41	352.7251685521831	260.56227788261185	20/04/28 05:12:27
1	41	350.03191915941005	261.4911728805443	20/04/28 05:12:28
1	22	346.48253983850464	261.2777688197779	20/04/28 05:12:29
1	22	346.48253983850464	261.2777688197779	20/04/28 05:12:30
1	22	343.1917987024697	259.9647561276533	20/04/28 05:12:31
1	NULL	341.7564158159603	259.49985762417106	20/04/28 05:12:32
1	22	343.40090039322234	264.23684917852336	20/04/28 05:12:33
1	22	343.40090039322234	264.23684917852336	20/04/28 05:12:34
1	22	344.2059440019796	264.86177026625217	20/04/28 05:12:35
1	NULL	346.19160987992444	266.1313518007171	20/04/28 05:12:36
1	22	347.0487578307616	265.14175249273313	20/04/28 05:12:37
1	22	343.40090039322234	264.23684917852336	20/04/28 05:12:38
1	22	343.40090039322234	264.23684917852336	20/04/28 05:12:39
1	22	343.40090039322234	264.23684917852336	20/04/28 05:12:40
1	22	343.40090039322234	264.23684917852336	20/04/28 05:12:41
1	22	343.40090039322234	264.23684917852336	20/04/28 05:12:42
1	22	343.40090039322234	264.23684917852336	20/04/28 05:12:43
1	22	343.40090039322234	264.23684917852336	20/04/28 05:12:44
1	22	343.40090039322234	264.23684917852336	20/04/28 05:12:45
1	22	343.40090039322234	264.23684917852336	20/04/28 05:12:46
1	22	343.40090039322234	264.23684917852336	20/04/28 05:12:47
1	22	343.40090039322234	264.23684917852336	20/04/28 05:12:48
1	22	343.40090039322234	264.23684917852336	20/04/28 05:12:49
1	22	343.40090039322234	264.23684917852336	20/04/28 05:12:50
1	22	343.40090039322234	264.23684917852336	20/04/28 05:12:51
1	22	343.40090039322234	264.23684917852336	20/04/28 05:12:52
1	22	343.40090039322234	264.23684917852336	20/04/28 05:12:53
1	22	343.40090039322234	264.23684917852336	20/04/28 05:12:54
1	22	343.40090039322234	264.23684917852336	20/04/28 05:12:55
1	22	343.40090039322234	264.23684917852336	20/04/28 05:12:56
1	22	345.6253918876675	262.2673681277619	20/04/28 05:12:57
1	NULL	346.19160987992444	266.1313518007171	20/04/28 05:12:58
1	NULL	346.19160987992444	266.1313518007171	20/04/28 05:12:59
1	22	343.40090039322234	264.23684917852336	20/04/28 05:13:00
1	NULL	344.77216199423657	268.7257539392073	20/04/28 05:13:01
1	22	343.40090039322234	264.23684917852336	20/04/28 05:13:02
1	22	343.40090039322234	264.23684917852336	20/04/28 05:13:03
1	22	343.1917987024697	259.9647561276533	20/04/28 05:13:04
1	22	343.1917987024697	259.9647561276533	20/04/28 05:13:05
1	22	343.1917987024697	259.9647561276533	20/04/28 05:13:06
1	22	343.1917987024697	259.9647561276533	20/04/28 05:13:07
1	41	349.6149730760457	260.6816456755546	20/04/28 05:13:08
1	41	351.1038521390131	261.25919659268993	20/04/28 05:13:09
1	41	352.7251685521831	260.56227788261185	20/04/28 05:13:10
1	41	352.7251685521831	260.56227788261185	20/04/28 05:13:11
1	41	352.7251685521831	260.56227788261185	20/04/28 05:13:12
1	69	353.6772354413353	258.9507399026464	20/04/28 05:13:13
1	41	352.7251685521831	260.56227788261185	20/04/28 05:13:14
1	41	352.7251685521831	260.56227788261185	20/04/28 05:13:15
1	41	352.7251685521831	260.56227788261185	20/04/28 05:13:16
1	41	352.7251685521831	260.56227788261185	20/04/28 05:13:17
1	41	352.7251685521831	260.56227788261185	20/04/28 05:13:18
1	41	351.1038521390131	261.25919659269	20/04/28 05:13:19
1	41	352.7251685521831	260.56227788261185	20/04/28 05:13:20
1	41	351.1038521390131	261.25919659269	20/04/28 05:13:21
1	41	352.7251685521831	260.56227788261185	20/04/28 05:13:22
1	41	352.7251685521831	260.56227788261185	20/04/28 05:13:23
1	41	352.7251685521831	260.56227788261185	20/04/28 05:13:24
1	41	352.7251685521831	260.56227788261185	20/04/28 05:13:25
1	41	352.7251685521831	260.56227788261185	20/04/28 05:13:26
1	41	352.7251685521831	260.56227788261185	20/04/28 05:13:27
1	41	352.7251685521831	260.56227788261185	20/04/28 05:13:28
1	41	352.3082224688189	259.75275067762215	20/04/28 05:13:29
1	41	351.1038521390131	261.25919659269	20/04/28 05:13:30
1	41	352.7251685521831	260.56227788261185	20/04/28 05:13:31
1	41	352.7251685521831	260.56227788261185	20/04/28 05:13:32
1	41	352.7251685521831	260.56227788261185	20/04/28 05:13:33
1	41	352.7251685521831	260.56227788261185	20/04/28 05:13:34
1	41	352.7251685521831	260.56227788261185	20/04/28 05:13:35
1	64	356.02694011127693	259.70882448523747	20/04/28 05:13:36
1	64	356.02694011127693	259.70882448523747	20/04/28 05:13:37
3	34	360.3447443281359	257.2761703004846	20/04/28 05:13:38
3	54	358.87237025214637	261.21107622709695	20/04/28 05:13:39
1	69	367.80245440868674	262.5455232582413	20/04/28 05:13:40
1	69	367.80245440868674	262.5455232582413	20/04/28 05:13:41
1	69	372.48785670166836	262.3595943162643	20/04/28 05:13:42
1	69	372.48785670166836	262.3595943162643	20/04/28 05:13:43
1	69	372.48785670166836	262.3595943162643	20/04/28 05:13:44
1	74	374.7544496259108	264.4513026329313	20/04/28 05:13:45
1	33	381.6109766893215	266.73786054806715	20/04/28 05:13:46
1	33	381.6109766893215	266.73786054806715	20/04/28 05:13:47
1	33	381.6109766893215	266.73786054806715	20/04/28 05:13:48
3	15	380.97239583354167	266.94453563659977	20/04/28 05:13:49
3	15	379.8755906118027	262.6421307240284	20/04/28 05:13:50
3	54	376.18269094789457	263.03655301878126	20/04/28 05:13:51
3	54	372.48785670166836	262.3595943162643	20/04/28 05:13:52
3	54	372.48785670166836	262.3595943162643	20/04/28 05:13:53
3	54	372.48785670166836	262.3595943162643	20/04/28 05:13:54
3	54	368.9169651830857	261.65782172430613	20/04/28 05:13:55
3	54	365.2339908031949	263.4272252913235	20/04/28 05:13:56
3	34	362.2167196060361	259.70189758364177	20/04/28 05:13:57
3	34	362.2167196060361	259.70189758364177	20/04/28 05:13:58
3	54	359.56855835216805	263.2279362811352	20/04/28 05:13:59
3	54	358.23287936641947	263.0061707425011	20/04/28 05:14:00
3	54	354.93110780732565	263.85962413987545	20/04/28 05:14:01
3	54	354.234919707304	261.84276408583725	20/04/28 05:14:02
3	54	350.37914153837863	260.97432627346046	20/04/28 05:14:03
3	54	350.37914153837863	260.97432627346046	20/04/28 05:14:04
3	54	350.37914153837863	260.97432627346046	20/04/28 05:14:05
3	54	345.98250818917177	261.859258749847	20/04/28 05:14:06
3	42	343.19179870246967	259.9647561276533	20/04/28 05:14:07
3	NULL	337.70753542622793	260.4595329480968	20/04/28 05:14:08
3	NULL	337.70753542622793	260.45953294809686	20/04/28 05:14:09
3	54	334.4407240787428	261.4032786809491	20/04/28 05:14:10
3	54	334.4407240787428	261.4032786809491	20/04/28 05:14:11
3	54	334.4407240787428	261.4032786809491	20/04/28 05:14:12
3	54	330.63010030483053	263.453311353296	20/04/28 05:14:13
3	54	327.3540763805351	261.10723770774325	20/04/28 05:14:14
3	54	327.3540763805351	261.10723770774325	20/04/28 05:14:15
3	54	324.0151806674323	262.76750572012435	20/04/28 05:14:16
3	54	324.01518066743233	262.76750572012435	20/04/28 05:14:17
3	18	323.5974156050991	264.28862562276623	20/04/28 05:14:18
3	18	321.1448815173929	265.43065665280113	20/04/28 05:14:19
3	NULL	315.74240883925677	260.5181275582284	20/04/28 05:14:20
1	81	315.74240883925677	260.5181275582284	20/04/28 05:14:21
3	51	312.6019130172586	265.6450929868838	20/04/28 05:14:22
3	NULL	309.29436722642214	263.9851754886794	20/04/28 05:14:23
3	47	305.42047124180004	265.2616066172563	20/04/28 05:14:24
1	98	305.42047124180004	265.2616066172563	20/04/28 05:14:25
3	47	303.28594423312194	264.61216223098285	20/04/28 05:14:26
3	47	302.3157990937455	265.96754816044853	20/04/28 05:14:27
1	98	303.28594423312194	264.61216223098285	20/04/28 05:14:28
1	98	303.28594423312194	264.61216223098285	20/04/28 05:14:29
1	56	307.159840217744	263.3357311024059	20/04/28 05:14:30
1	56	307.159840217744	263.3357311024059	20/04/28 05:14:31
1	81	311.6591172126105	263.4112042347413	20/04/28 05:14:32
1	81	314.50318194109644	265.02915212402996	20/04/28 05:14:33
1	81	314.50318194109644	265.02915212402996	20/04/28 05:14:34
1	56	319.89662212153377	266.1573209564685	20/04/28 05:14:35
1	56	319.89662212153377	266.1573209564685	20/04/28 05:14:36
1	56	319.89662212153377	266.1573209564685	20/04/28 05:14:37
1	72	322.34915620924	265.0152899264337	20/04/28 05:14:38
1	72	322.34915620924	265.0152899264337	20/04/28 05:14:39
1	56	325.7003720753315	267.4297414274409	20/04/28 05:14:40
1	NULL	331.9249996219656	268.7304237073172	20/04/28 05:14:41
1	NULL	331.9249996219656	268.73042370731713	20/04/28 05:14:42
1	56	333.50170633168455	266.97796434330365	20/04/28 05:14:43
1	NULL	331.9249996219656	268.73042370731713	20/04/28 05:14:44
1	29	332.3707929514742	270.8583422158162	20/04/28 05:14:45
1	29	333.41684249911117	274.9598401222384	20/04/28 05:14:46
1	29	333.41684249911117	274.9598401222384	20/04/28 05:14:47
1	29	332.11202638116566	272.3894277766605	20/04/28 05:14:48
1	29	333.41684249911117	274.9598401222384	20/04/28 05:14:49
1	29	333.41684249911117	274.9598401222384	20/04/28 05:14:50
1	29	332.11202638116566	272.3894277766605	20/04/28 05:14:51
1	29	332.11202638116566	272.3894277766605	20/04/28 05:14:52
1	29	332.11202638116566	272.3894277766605	20/04/28 05:14:53
1	29	332.11202638116566	272.3894277766605	20/04/28 05:14:54
1	29	333.41684249911117	274.9598401222384	20/04/28 05:14:55
1	29	333.41684249911117	274.9598401222384	20/04/28 05:14:56
1	29	333.41684249911117	274.9598401222384	20/04/28 05:14:57
1	29	333.41684249911117	274.9598401222384	20/04/28 05:14:58
1	29	333.41684249911117	274.9598401222384	20/04/28 05:14:59
1	29	333.41684249911117	274.9598401222384	20/04/28 05:15:00
1	29	333.41684249911117	274.9598401222384	20/04/28 05:15:01
1	29	333.41684249911117	274.9598401222384	20/04/28 05:15:02
1	29	333.41684249911117	274.9598401222384	20/04/28 05:15:03
1	29	333.41684249911117	274.9598401222384	20/04/28 05:15:04
1	29	333.41684249911117	274.9598401222384	20/04/28 05:15:05
1	29	333.41684249911117	274.9598401222384	20/04/28 05:15:06
1	29	333.41684249911117	274.9598401222384	20/04/28 05:15:07
1	29	333.41684249911117	274.9598401222384	20/04/28 05:15:08
1	29	333.41684249911117	274.9598401222384	20/04/28 05:15:09
1	29	333.41684249911117	274.9598401222384	20/04/28 05:15:10
1	29	333.41684249911117	274.9598401222384	20/04/28 05:15:11
1	29	333.41684249911117	274.9598401222384	20/04/28 05:15:12
1	29	333.41684249911117	274.9598401222384	20/04/28 05:15:13
1	29	333.41684249911117	274.9598401222384	20/04/28 05:15:14
1	29	333.41684249911117	274.9598401222384	20/04/28 05:15:15
