stationId	t_start	t_end	t_max	timeStamp
24	20/04/28 05:15:42	20/04/28 05:15:42	20/04/28 05:15:42
114	20/04/28 05:15:44	20/04/28 05:15:44	20/04/28 05:15:44
24	20/04/28 05:15:46	20/04/28 05:15:46	20/04/28 05:15:46
84	20/04/28 05:15:48	20/04/28 05:15:48	20/04/28 05:15:48
48	20/04/28 05:11:16	20/04/28 05:15:50	20/04/28 05:15:17
84	20/04/28 05:15:52	20/04/28 05:15:52	20/04/28 05:15:52
79	20/04/28 05:15:54	20/04/28 05:15:54	20/04/28 05:15:54
79	20/04/28 05:15:56	20/04/28 05:15:56	20/04/28 05:15:56
84	20/04/28 05:15:58	20/04/28 05:15:58	20/04/28 05:15:58
30	20/04/28 05:16:00	20/04/28 05:16:00	20/04/28 05:16:00
76	20/04/28 05:16:02	20/04/28 05:16:02	20/04/28 05:16:02
30	20/04/28 05:16:04	20/04/28 05:16:04	20/04/28 05:16:04
76	20/04/28 05:16:06	20/04/28 05:16:06	20/04/28 05:16:06
30	20/04/28 05:16:08	20/04/28 05:16:08	20/04/28 05:16:08
114	20/04/28 05:16:10	20/04/28 05:16:10	20/04/28 05:16:10
51	20/04/28 05:13:49	20/04/28 05:16:12	20/04/28 05:16:12
30	20/04/28 05:16:14	20/04/28 05:16:14	20/04/28 05:16:14
51	20/04/28 05:16:16	20/04/28 05:16:17	20/04/28 05:16:17
84	20/04/28 05:16:19	20/04/28 05:16:20	20/04/28 05:16:20
114	20/04/28 05:16:22	20/04/28 05:16:22	20/04/28 05:16:22
40	20/04/28 05:16:24	20/04/28 05:16:24	20/04/28 05:16:24
86	20/04/28 05:16:26	20/04/28 05:16:27	20/04/28 05:16:27
86	20/04/28 05:16:29	20/04/28 05:16:29	20/04/28 05:16:29
57	20/04/28 05:16:31	20/04/28 05:16:32	20/04/28 05:16:32
114	20/04/28 05:16:34	20/04/28 05:16:34	20/04/28 05:16:34
84	20/04/28 05:16:36	20/04/28 05:16:36	20/04/28 05:16:36
111	20/04/28 05:16:38	20/04/28 05:16:38	20/04/28 05:16:38
84	20/04/28 05:16:40	20/04/28 05:16:40	20/04/28 05:16:40
86	20/04/28 05:16:42	20/04/28 05:16:42	20/04/28 05:16:42
78	20/04/28 05:16:44	20/04/28 05:16:44	20/04/28 05:16:44
86	20/04/28 05:16:46	20/04/28 05:16:46	20/04/28 05:16:46
111	20/04/28 05:16:48	20/04/28 05:16:48	20/04/28 05:16:48
57	20/04/28 05:16:50	20/04/28 05:16:51	20/04/28 05:16:51
111	20/04/28 05:16:53	20/04/28 05:16:53	20/04/28 05:16:53
114	20/04/28 05:16:55	20/04/28 05:16:56	20/04/28 05:16:56
57	20/04/28 05:16:58	20/04/28 05:16:59	20/04/28 05:16:59
40	20/04/28 05:17:01	20/04/28 05:17:01	20/04/28 05:17:01
57	20/04/28 05:17:03	20/04/28 05:17:03	20/04/28 05:17:03
114	20/04/28 05:17:05	20/04/28 05:17:05	20/04/28 05:17:05
40	20/04/28 05:17:07	20/04/28 05:17:07	20/04/28 05:17:07
39	20/04/28 05:17:09	20/04/28 05:17:09	20/04/28 05:17:09
39	20/04/28 05:17:11	20/04/28 05:17:11	20/04/28 05:17:11
40	20/04/28 05:17:13	20/04/28 05:17:13	20/04/28 05:17:13
84	20/04/28 05:17:15	20/04/28 05:17:15	20/04/28 05:17:15
111	20/04/28 05:17:17	20/04/28 05:17:18	20/04/28 05:17:18
114	20/04/28 05:17:20	20/04/28 05:17:20	20/04/28 05:17:20
39	20/04/28 05:17:22	20/04/28 05:17:22	20/04/28 05:17:22
84	20/04/28 05:17:24	20/04/28 05:17:24	20/04/28 05:17:24
84	20/04/28 05:17:26	20/04/28 05:17:26	20/04/28 05:17:26
79	20/04/28 05:17:28	20/04/28 05:17:28	20/04/28 05:17:28
24	20/04/28 05:17:30	20/04/28 05:17:30	20/04/28 05:17:30
79	20/04/28 05:17:32	20/04/28 05:17:32	20/04/28 05:17:32
