floorId	partitionId	location_x	location_y	timeStamp
1	97	339.8257321582518	287.4174197942517	20/04/28 05:09:33
1	97	339.8366100595984	287.28010264745546	20/04/28 05:09:33
1	97	339.8366100595984	287.28010264745546	20/04/28 05:09:33
1	97	339.7137443594616	287.3342998854961	20/04/28 05:09:33
1	97	339.4547875691732	287.2493538851005	20/04/28 05:09:33
1	97	339.54968224064964	287.1066871048818	20/04/28 05:09:33
1	97	339.56955382425684	287.1421852559568	20/04/28 05:09:33
1	97	339.51538824798496	287.1040131929894	20/04/28 05:09:34
1	97	339.28338948512567	286.91795180574695	20/04/28 05:09:34
1	97	339.28338948512567	286.91795180574695	20/04/28 05:09:34
1	97	339.17660164224725	287.0301804791887	20/04/28 05:09:34
1	97	339.2400918122885	286.9166154267228	20/04/28 05:09:34
1	97	339.08548793406237	287.1342618316856	20/04/28 05:09:34
1	97	339.1842733014842	286.88219569463797	20/04/28 05:09:34
1	97	339.13715631348504	286.8503804300321	20/04/28 05:09:34
1	97	339.3269844430553	286.9900387069697	20/04/28 05:09:34
1	97	339.4217822090258	287.03012025267725	20/04/28 05:09:34
1	97	339.49208347455897	287.047428701404	20/04/28 05:09:35
1	97	339.47331005768655	287.0933308286839	20/04/28 05:09:35
1	97	339.533129959038	286.9174605358148	20/04/28 05:09:35
1	97	339.5902271049096	286.9214096907985	20/04/28 05:09:35
1	97	339.48145304421206	286.87108342043877	20/04/28 05:09:35
1	97	339.48145304421206	286.87108342043877	20/04/28 05:09:35
1	97	339.5790835384856	286.7716290811206	20/04/28 05:09:35
1	97	339.7194188759364	286.83719747243606	20/04/28 05:09:35
1	97	339.5129666890502	286.6368058749799	20/04/28 05:09:35
1	97	339.60000352696045	286.605809976586	20/04/28 05:09:36
1	97	339.4235876554324	286.6714912722739	20/04/28 05:09:36
1	97	339.3026941607892	286.59545214952317	20/04/28 05:09:36
1	97	339.3238920814074	286.6402153312445	20/04/28 05:09:36
1	97	339.55246034450374	286.7261255687916	20/04/28 05:09:36
1	97	339.55246034450374	286.7261255687916	20/04/28 05:09:36
1	97	339.5492425427765	286.67991220182984	20/04/28 05:09:36
1	97	339.5492425427765	286.67991220182984	20/04/28 05:09:36
1	97	339.28008548035706	286.58645505864877	20/04/28 05:09:36
1	97	339.28008548035706	286.58645505864877	20/04/28 05:09:36
1	97	339.28649499750406	286.6880570015559	20/04/28 05:09:37
1	97	339.00531234538676	286.6892203054345	20/04/28 05:09:37
1	97	338.7390191122952	286.5782560037108	20/04/28 05:09:37
1	97	338.750751931343	286.5945566284161	20/04/28 05:09:37
1	97	338.7474375879861	286.5848429762476	20/04/28 05:09:37
1	97	338.7474375879861	286.5848429762476	20/04/28 05:09:37
1	97	338.6421235658911	286.34122604024765	20/04/28 05:09:37
1	97	338.5782436502229	286.1808708753949	20/04/28 05:09:37
1	97	338.60278976025967	286.21651588511514	20/04/28 05:09:37
1	97	338.62248058136896	286.27829201101054	20/04/28 05:09:38
1	97	338.58734844704446	286.15028356331544	20/04/28 05:09:38
1	97	338.55529213538466	286.1257716693816	20/04/28 05:09:38
1	97	338.55529213538466	286.1257716693816	20/04/28 05:09:38
1	97	338.65921796859465	286.2645258262807	20/04/28 05:09:38
1	97	338.69926930226035	286.52590901158237	20/04/28 05:09:38
1	97	338.7658373966464	286.4986814299896	20/04/28 05:09:38
1	97	338.76663591272205	286.3242225532522	20/04/28 05:09:38
1	97	338.80021699703923	286.56238405364115	20/04/28 05:09:38
1	97	338.6953200314192	286.6186876794938	20/04/28 05:09:38
1	97	338.4885863289295	286.67000302382564	20/04/28 05:09:39
1	97	338.48923331209016	286.6705837934406	20/04/28 05:09:39
1	97	338.37671178702874	286.76950490857956	20/04/28 05:09:39
1	97	338.41929556522336	286.63360023421006	20/04/28 05:09:39
1	97	338.39477307137935	286.7084611546162	20/04/28 05:09:39
1	97	338.20494695521955	286.80004364720327	20/04/28 05:09:39
1	97	338.1665020464637	286.77239818574327	20/04/28 05:09:39
1	97	338.1795050193485	286.4426000895385	20/04/28 05:09:39
1	97	338.1795050193485	286.4426000895385	20/04/28 05:09:39
1	97	338.2732274808746	286.3355163527843	20/04/28 05:09:39
1	97	338.48118074320575	286.3344310264812	20/04/28 05:09:40
1	97	338.54310052891987	286.558173272618	20/04/28 05:09:40
1	97	338.76362016535097	286.66943860432394	20/04/28 05:09:40
1	97	338.75201055792417	286.6628540402773	20/04/28 05:09:40
1	97	338.7655253386013	286.42845867366896	20/04/28 05:09:40
1	97	338.70346606579994	286.27243696645894	20/04/28 05:09:40
1	97	338.5335697364389	286.1556427001114	20/04/28 05:09:40
1	97	338.5650498129718	286.07605227973795	20/04/28 05:09:40
1	97	338.5885612917528	286.2348888543994	20/04/28 05:09:40
1	97	338.4150585914462	286.3847224953556	20/04/28 05:09:41
1	97	338.16876569966956	286.2865322717212	20/04/28 05:09:41
1	97	337.98463177727604	286.3543610517161	20/04/28 05:09:41
1	97	337.9901561217209	286.1547887228018	20/04/28 05:09:41
1	97	337.74054190220977	286.2774448946157	20/04/28 05:09:41
1	97	337.70033039702594	286.34794121996333	20/04/28 05:09:41
1	97	337.7610625570395	286.34333896852866	20/04/28 05:09:41
1	97	337.84668826025114	286.35823649296907	20/04/28 05:09:41
1	97	337.6479595951349	286.47550081562935	20/04/28 05:09:41
1	97	337.76714558154526	286.5215747129107	20/04/28 05:09:42
1	97	337.7786705100966	286.5012348137976	20/04/28 05:09:42
1	97	337.6515760303171	286.2554096124197	20/04/28 05:09:42
1	97	337.7406200070671	286.21869304179165	20/04/28 05:09:42
1	97	337.7077886199141	286.2042755877314	20/04/28 05:09:42
1	97	337.8491277126671	286.15756696295904	20/04/28 05:09:42
1	97	337.7574974354912	286.0306058620769	20/04/28 05:09:42
1	97	337.7560890747464	286.0761948332622	20/04/28 05:09:42
1	97	337.7979183395761	285.9465375408299	20/04/28 05:09:42
1	97	337.665890031315	285.745690164552	20/04/28 05:09:42
1	97	337.4834387956711	285.51991483400366	20/04/28 05:09:43
1	97	337.5374947400997	285.5617349718316	20/04/28 05:09:43
1	97	337.57585137137187	285.5434760688209	20/04/28 05:09:43
1	97	337.50846405162224	285.2964434010567	20/04/28 05:09:43
1	97	337.45612896321285	285.4145052287588	20/04/28 05:09:43
1	97	337.4207962822996	285.4502381487399	20/04/28 05:09:43
1	97	337.691096394492	285.5564529886087	20/04/28 05:09:43
1	97	337.79044779087195	285.5077338918986	20/04/28 05:09:43
1	97	337.78605595897324	285.51406912460897	20/04/28 05:09:43
1	97	337.58105584719567	285.3728822184357	20/04/28 05:09:43
1	97	337.8130534097844	285.38216752206694	20/04/28 05:09:44
1	97	337.96763120900584	285.17552797662614	20/04/28 05:09:44
1	97	337.9657116623317	285.16977868575304	20/04/28 05:09:44
1	97	338.0827847046817	285.2165861414453	20/04/28 05:09:44
1	97	338.26119663202724	285.22470569323497	20/04/28 05:09:44
1	97	338.3002870297316	285.28628694180406	20/04/28 05:09:44
1	97	338.4297205945	285.42706165507036	20/04/28 05:09:44
1	97	338.40223298443215	285.2541615850084	20/04/28 05:09:44
1	97	338.5595785746241	285.29462861855666	20/04/28 05:09:44
1	97	338.484438126991	285.3929774728854	20/04/28 05:09:45
1	97	338.6837663432334	285.55164801037046	20/04/28 05:09:45
1	97	338.68059413020427	285.5466880212544	20/04/28 05:09:45
1	97	338.7086142241447	285.5475577445875	20/04/28 05:09:45
1	97	338.71310495654143	285.80365312177446	20/04/28 05:09:45
1	97	338.83740951596116	285.7415856607198	20/04/28 05:09:45
1	97	338.87329875044077	285.55019016214294	20/04/28 05:09:45
1	97	339.1507942933645	285.5306647650105	20/04/28 05:09:45
1	97	339.1246864552791	285.69750885635426	20/04/28 05:09:45
1	97	339.17633335389564	285.785856519899	20/04/28 05:09:45
1	97	339.1302691937989	285.7372004678759	20/04/28 05:09:46
1	97	338.9207306320047	285.91269834868467	20/04/28 05:09:46
1	97	338.9963264492479	285.72840209296714	20/04/28 05:09:46
1	97	338.8322895976175	285.49590292859483	20/04/28 05:09:46
1	97	338.87069963807824	285.6375350052428	20/04/28 05:09:46
1	97	338.5889017959396	285.623655982975	20/04/28 05:09:46
1	97	338.5771601671541	285.6884988279086	20/04/28 05:09:46
1	97	338.63080324259477	285.8122622883541	20/04/28 05:09:46
1	97	338.6420423809162	285.8076949783935	20/04/28 05:09:46
1	97	338.74931357835317	285.5899870638388	20/04/28 05:09:47
1	97	338.8095354359206	285.5981288036373	20/04/28 05:09:47
1	97	338.85087562417925	285.4900478876972	20/04/28 05:09:47
1	97	338.7270633232795	285.6414888678155	20/04/28 05:09:47
1	97	338.92279647683273	285.50246910341286	20/04/28 05:09:47
1	97	338.8883767211137	285.4939332909018	20/04/28 05:09:47
1	97	338.72241746066715	285.34773042716006	20/04/28 05:09:47
1	97	338.7571559504184	285.29316791060273	20/04/28 05:09:47
1	97	338.7584126590629	285.5132964359916	20/04/28 05:09:47
1	97	338.5860425467034	285.371103600673	20/04/28 05:09:47
1	97	338.53328862319086	285.3870087554167	20/04/28 05:09:48
1	97	338.6885514157873	285.5128595035961	20/04/28 05:09:48
1	97	338.6049028635701	285.50511617272525	20/04/28 05:09:48
1	97	338.58361926178844	285.66130296869966	20/04/28 05:09:48
1	97	338.6665177972368	285.4950944934903	20/04/28 05:09:48
1	97	338.79750936209825	285.33549148722733	20/04/28 05:09:48
1	97	338.8143169752881	285.32181493136295	20/04/28 05:09:48
1	97	338.8683640836121	285.11250883477965	20/04/28 05:09:48
1	97	338.94420233135617	285.2447740027056	20/04/28 05:09:48
1	97	338.9930661317172	285.32866541802275	20/04/28 05:09:48
1	97	339.030793621825	285.40784452924885	20/04/28 05:09:49
1	97	338.7465945753957	285.392133634075	20/04/28 05:09:49
1	97	338.69664767323275	285.40008749779054	20/04/28 05:09:49
1	97	338.5264023508483	285.4165983564351	20/04/28 05:09:49
1	97	338.5769675090064	285.6173682215551	20/04/28 05:09:49
1	97	338.5496275366962	285.6518902301287	20/04/28 05:09:49
1	97	338.3362463842133	285.5211097488333	20/04/28 05:09:49
1	97	338.43152962946084	285.5071180770565	20/04/28 05:09:49
1	97	338.5017039805759	285.4310302921857	20/04/28 05:09:49
1	97	338.5025706622621	285.45653775790436	20/04/28 05:09:50
1	97	338.46545809567215	285.40383959293746	20/04/28 05:09:50
1	97	338.53502689021866	285.3133720600862	20/04/28 05:09:50
1	97	338.4060238552719	285.33134017485986	20/04/28 05:09:50
1	97	338.25036980532195	285.3935719873636	20/04/28 05:09:50
1	97	338.23763393900794	285.37235402928246	20/04/28 05:09:50
1	97	338.3125235479558	285.6084914973867	20/04/28 05:09:50
1	97	338.23921287896616	285.71056826674265	20/04/28 05:09:50
1	97	338.28970721924696	285.8179785073414	20/04/28 05:09:50
1	97	338.3016044496951	285.93283414912054	20/04/28 05:09:50
1	97	338.41770094549094	286.15759660125	20/04/28 05:09:51
1	97	338.43220353768606	286.2208474676763	20/04/28 05:09:51
1	97	338.3666875741861	286.2320494397175	20/04/28 05:09:51
1	97	338.44152299474115	286.1668511688383	20/04/28 05:09:51
1	97	338.2109097070269	286.3380943521192	20/04/28 05:09:51
1	97	338.2515309764444	286.44132773139927	20/04/28 05:09:51
1	97	338.1846829653845	286.5819875515785	20/04/28 05:09:51
1	97	338.29783702765695	286.73330742796907	20/04/28 05:09:51
1	97	338.39148640373907	286.6737216500173	20/04/28 05:09:51
1	97	338.3307891571942	286.9157450497928	20/04/28 05:09:52
1	97	338.34066394935354	286.8640656550291	20/04/28 05:09:52
1	97	338.4448459208344	287.02909749581124	20/04/28 05:09:52
1	97	338.3468552070078	287.19806024908326	20/04/28 05:09:52
1	97	338.5816802374571	287.27508147510775	20/04/28 05:09:52
1	97	338.5467515618256	287.24724437207254	20/04/28 05:09:52
1	97	338.67963338659496	287.2398197568424	20/04/28 05:09:52
1	97	338.76931726364495	287.32804423528637	20/04/28 05:09:52
1	97	338.8034189071811	287.5127127775629	20/04/28 05:09:52
1	97	338.99321189379657	287.29146248127	20/04/28 05:09:52
1	97	338.9289765353934	287.3077161991906	20/04/28 05:09:53
1	97	339.10172863531886	287.32062172584494	20/04/28 05:09:53
1	97	339.0425672366043	287.0395736498655	20/04/28 05:09:53
1	97	338.7555624773108	286.97164073503353	20/04/28 05:09:53
1	97	338.7662922611333	287.1567646444304	20/04/28 05:09:53
1	97	338.6726863011732	286.9764923363167	20/04/28 05:09:53
1	97	338.67228255100105	286.96202284672546	20/04/28 05:09:53
1	97	338.5719550379834	286.8440027755625	20/04/28 05:09:53
1	97	338.7505899263966	286.86585055049045	20/04/28 05:09:53
1	97	338.6958101013472	286.9183077539477	20/04/28 05:09:53
1	97	338.7737487657125	286.9812182238929	20/04/28 05:09:54
1	97	338.75747976964965	287.0658034006906	20/04/28 05:09:54
1	97	338.4936173215356	287.2060032594603	20/04/28 05:09:54
1	97	338.59509941421356	287.26409834444314	20/04/28 05:09:54
1	97	338.33564161102294	287.3579089794178	20/04/28 05:09:54
1	97	338.34659623555956	287.5029884724051	20/04/28 05:09:54
1	97	338.5056239679304	287.64471192008955	20/04/28 05:09:54
1	97	338.61411186422225	287.5315684448982	20/04/28 05:09:54
1	97	338.67926501853543	287.4755645359232	20/04/28 05:09:54
1	97	338.8107480616166	287.4872638802809	20/04/28 05:09:55
1	97	338.7573887029564	287.32448681126345	20/04/28 05:09:55
1	97	338.74979274429546	287.3110238870455	20/04/28 05:09:55
1	97	338.7877529130442	287.3119016162307	20/04/28 05:09:55
1	97	338.73167862236505	287.36300058367084	20/04/28 05:09:55
1	97	338.7351345730547	287.3365040774027	20/04/28 05:09:55
1	97	338.64084001292775	287.40970568754057	20/04/28 05:09:55
1	97	338.7615487899263	287.1888797808265	20/04/28 05:09:55
1	97	338.9652215242003	287.26980419026137	20/04/28 05:09:55
1	97	338.9840535884908	287.2964703348377	20/04/28 05:09:55
1	97	338.96123568432125	287.0776022092191	20/04/28 05:09:56
1	97	338.97182539677806	286.8553547094765	20/04/28 05:09:56
1	97	339.1140950300623	286.78610168256023	20/04/28 05:09:56
1	97	339.12950916355993	286.70915212751123	20/04/28 05:09:56
1	97	339.1571659068623	286.70331853489284	20/04/28 05:09:56
1	97	339.0353278129378	286.6986370510749	20/04/28 05:09:56
1	97	339.15757900465803	286.9713383428226	20/04/28 05:09:56
1	97	339.2097194791976	286.73165524154456	20/04/28 05:09:56
1	97	339.1988472250735	286.73665032188126	20/04/28 05:09:56
1	97	339.26826534490516	286.73515286046927	20/04/28 05:09:56
1	97	339.26483853557147	286.73685541049133	20/04/28 05:09:57
1	97	339.5154917700764	286.8249809852177	20/04/28 05:09:57
1	97	339.4655307533862	286.76048435250755	20/04/28 05:09:57
1	97	339.2909601387752	286.92309344839447	20/04/28 05:09:57
1	97	339.480747048899	287.1183143371038	20/04/28 05:09:57
1	97	339.49995248076857	286.8551122794217	20/04/28 05:09:57
1	97	339.4064446319113	286.79216382729635	20/04/28 05:09:57
1	97	339.5106208170067	286.5702884930263	20/04/28 05:09:57
1	97	339.4622119575848	286.72980088798397	20/04/28 05:09:57
1	97	339.4920403299869	287.01027368516304	20/04/28 05:09:58
1	97	339.5293257882895	287.1722964542209	20/04/28 05:09:58
1	97	339.7477708055352	287.13975869328965	20/04/28 05:09:58
1	97	339.5305171171696	287.2017925561787	20/04/28 05:09:58
1	97	339.35912953287806	287.29124043884315	20/04/28 05:09:58
1	97	339.48713678484	287.4790038325716	20/04/28 05:09:58
1	97	339.67025189182596	287.71020625395664	20/04/28 05:09:58
1	97	339.903212837549	287.59533851666947	20/04/28 05:09:58
1	97	339.98828664255035	287.4982092768252	20/04/28 05:09:58
1	97	340.0222730153259	287.3716834878189	20/04/28 05:09:58
1	97	340.0222730153259	287.3716834878189	20/04/28 05:09:59
1	97	340.0547444007494	287.15583007820413	20/04/28 05:09:59
1	97	340.18825530681715	286.8988514268566	20/04/28 05:09:59
1	97	340.344046137438	287.0343069238511	20/04/28 05:09:59
1	97	340.22224647002116	286.95794295164836	20/04/28 05:09:59
1	97	340.26433743654775	286.67593509963825	20/04/28 05:09:59
1	97	340.3062216600607	286.77056301041006	20/04/28 05:09:59
1	97	340.1677182180625	286.6333968029354	20/04/28 05:09:59
1	97	340.1836515692717	286.7156755883024	20/04/28 05:09:59
1	97	339.95379212861974	286.64180215216396	20/04/28 05:10:00
1	97	339.8299045004718	286.5365684871895	20/04/28 05:10:00
1	97	339.80837676197876	286.5909643099884	20/04/28 05:10:00
1	97	339.6504657618792	286.5130955492154	20/04/28 05:10:00
1	97	339.49694451187725	286.67486906442093	20/04/28 05:10:00
1	97	339.47121131139363	286.7625939201383	20/04/28 05:10:00
1	97	339.392526975366	286.71863207472586	20/04/28 05:10:00
1	97	339.376619106084	286.7337921544049	20/04/28 05:10:00
1	97	339.2434791623587	286.53911676429425	20/04/28 05:10:00
1	97	339.15770166675685	286.49698661196004	20/04/28 05:10:00
1	97	339.4274527816089	286.4067093687847	20/04/28 05:10:01
1	97	339.47394010998613	286.4237593278449	20/04/28 05:10:01
1	97	339.7241130616137	286.5791843621675	20/04/28 05:10:01
1	97	339.6816440759315	286.38972455323704	20/04/28 05:10:01
1	97	339.6582493372718	286.3174323047112	20/04/28 05:10:01
1	97	339.7468690004597	286.44623627228276	20/04/28 05:10:01
1	97	339.5730478774628	286.5365723956092	20/04/28 05:10:01
1	97	339.5891824246976	286.58922266925214	20/04/28 05:10:01
1	97	339.6252018740214	286.4582668219655	20/04/28 05:10:01
1	97	339.7082048303848	286.4339421924893	20/04/28 05:10:01
1	97	339.6295975851492	286.53366866144955	20/04/28 05:10:02
1	97	339.59337856269656	286.5226497587883	20/04/28 05:10:02
1	97	339.60584404532585	286.55075857356377	20/04/28 05:10:02
1	97	339.60584404532585	286.55075857356377	20/04/28 05:10:02
1	97	339.63799333750234	286.4457298810189	20/04/28 05:10:02
1	97	339.81895915048847	286.2421430116601	20/04/28 05:10:02
1	97	340.0381231800577	286.14560256801406	20/04/28 05:10:02
1	97	340.2401468498304	285.958244735185	20/04/28 05:10:02
1	97	340.1150677960932	286.01761612174835	20/04/28 05:10:02
1	97	340.0679443415904	285.76033910477025	20/04/28 05:10:03
1	97	340.0668459631773	285.75373421107815	20/04/28 05:10:03
1	97	340.06281679042627	285.9432215884276	20/04/28 05:10:03
1	97	340.1349470408818	286.08118279212545	20/04/28 05:10:03
1	97	340.1143695165821	286.0825949359045	20/04/28 05:10:03
1	97	340.1871897386008	286.098747195085	20/04/28 05:10:03
1	97	340.1490689575346	286.242999036269	20/04/28 05:10:03
1	97	340.3729560113771	286.42607103978196	20/04/28 05:10:03
1	97	340.3729560113771	286.42607103978196	20/04/28 05:10:03
1	97	340.1977099758515	286.38820242302916	20/04/28 05:10:03
1	97	340.1977099758515	286.38820242302916	20/04/28 05:10:04
1	97	340.1939069283041	286.3984180537291	20/04/28 05:10:04
1	97	340.15064224185943	286.56927224241923	20/04/28 05:10:04
1	97	340.19434128510744	286.73605525234797	20/04/28 05:10:04
1	97	340.19434128510744	286.73605525234797	20/04/28 05:10:04
1	97	340.1424039864904	286.95060989004963	20/04/28 05:10:04
1	97	340.3264175931159	286.8480821537683	20/04/28 05:10:04
1	97	340.4358155396298	286.88970736011754	20/04/28 05:10:04
1	97	340.41261952391477	287.1229944602509	20/04/28 05:10:04
1	97	340.45012272203974	286.83098074978346	20/04/28 05:10:05
1	97	340.4647110386729	286.95959584025604	20/04/28 05:10:05
1	97	340.53113239142215	286.7674467182082	20/04/28 05:10:05
1	97	340.5673608221925	286.5910993827271	20/04/28 05:10:05
1	97	340.7096416446992	286.68861861156745	20/04/28 05:10:05
1	97	340.68147326417835	286.8050793341289	20/04/28 05:10:05
1	97	340.7907975175397	286.61041809543747	20/04/28 05:10:05
1	97	340.8335990187132	286.5682375087536	20/04/28 05:10:05
1	97	340.75754713097797	286.6339090398793	20/04/28 05:10:05
1	97	340.7307345740269	286.38909842463437	20/04/28 05:10:05
1	97	340.7232490872747	286.54285871978954	20/04/28 05:10:06
1	97	340.70456330282144	286.55048071746023	20/04/28 05:10:06
1	97	340.7064781953789	286.5187322484172	20/04/28 05:10:06
1	97	340.6596186057152	286.5209249487661	20/04/28 05:10:06
1	97	340.62020136778153	286.5058983071032	20/04/28 05:10:06
1	97	340.6979486436394	286.3682833563326	20/04/28 05:10:06
1	97	340.8330959176907	286.3066242540516	20/04/28 05:10:06
1	97	340.8621678564073	286.109113593063	20/04/28 05:10:06
1	97	340.9508648036188	286.2362991383277	20/04/28 05:10:06
1	97	340.91752060161986	286.18177544934605	20/04/28 05:10:07
1	97	340.8435331700468	286.38582511210484	20/04/28 05:10:07
1	97	340.8959425748714	286.68093163211176	20/04/28 05:10:07
1	97	340.7672895329893	286.681966779401	20/04/28 05:10:07
1	97	340.58320641932403	286.5959932315652	20/04/28 05:10:07
1	97	340.6310271104889	286.60237802285286	20/04/28 05:10:07
1	97	340.5839080865663	286.5838829798519	20/04/28 05:10:07
1	97	340.658682702289	286.42929008772853	20/04/28 05:10:07
1	97	340.66179728875545	286.4278443677439	20/04/28 05:10:07
1	97	340.6513986049647	286.56600591644695	20/04/28 05:10:07
1	97	340.3626947031005	286.514454378684	20/04/28 05:10:08
1	97	340.5016164323561	286.36771531744716	20/04/28 05:10:08
1	97	340.25030370663126	286.42531095063714	20/04/28 05:10:08
1	97	340.06179375286797	286.65648023320716	20/04/28 05:10:08
1	97	339.91616263782635	286.71239009719835	20/04/28 05:10:08
1	97	340.0432453746579	286.5704783028304	20/04/28 05:10:08
1	97	340.1718682887097	286.5826172528681	20/04/28 05:10:08
1	97	339.94413149257485	286.4088475830656	20/04/28 05:10:08
1	97	340.0084080098686	286.6072810985333	20/04/28 05:10:08
1	97	340.00925092533856	286.59923899985284	20/04/28 05:10:08
1	97	340.1827569579223	286.53322809680026	20/04/28 05:10:09
1	97	340.27592549276903	286.52174529702546	20/04/28 05:10:09
1	97	340.16977013447905	286.638360172028	20/04/28 05:10:09
1	97	340.09841878105755	286.5088025319944	20/04/28 05:10:09
1	97	340.0397702557763	286.54883318992995	20/04/28 05:10:09
1	97	339.9528925146634	286.43940715247726	20/04/28 05:10:09
1	97	340.0106842963787	286.3862531170115	20/04/28 05:10:09
1	97	339.8967143447494	286.59194764567707	20/04/28 05:10:09
1	97	339.9320107704073	286.8300273942108	20/04/28 05:10:09
1	97	340.10157521298794	286.9735677768871	20/04/28 05:10:10
1	97	340.0201474975678	287.0211389356791	20/04/28 05:10:10
1	97	339.8382075693388	286.9293070390068	20/04/28 05:10:10
1	97	339.9605307477289	286.891377882863	20/04/28 05:10:10
1	97	340.0276323275224	286.92197676234633	20/04/28 05:10:10
1	97	340.0276323275224	286.92197676234633	20/04/28 05:10:10
1	97	340.0276323275224	286.92197676234633	20/04/28 05:10:10
1	97	340.13389724719224	286.93007708327247	20/04/28 05:10:10
1	97	340.18618174239185	286.91357593873494	20/04/28 05:10:10
1	97	340.23101741513574	286.9035179789635	20/04/28 05:10:10
1	97	340.26360807490227	286.95576300184865	20/04/28 05:10:11
1	97	340.17642597235374	287.10042741139193	20/04/28 05:10:11
1	97	340.0407829003889	287.3233163839779	20/04/28 05:10:11
1	97	339.8819889125093	287.2874762495742	20/04/28 05:10:11
1	97	339.77752827267557	287.29986757764755	20/04/28 05:10:11
1	97	339.86423991436897	287.4755191424996	20/04/28 05:10:11
1	97	339.93100152619417	287.5210574463661	20/04/28 05:10:11
1	97	339.9112827646297	287.50637800130636	20/04/28 05:10:11
1	97	339.8749333341831	287.4438741412535	20/04/28 05:10:11
1	97	339.8350564769297	287.5402803506612	20/04/28 05:10:12
1	97	339.61562822361753	287.5262515109265	20/04/28 05:10:12
1	97	339.4247467488977	287.3965011159399	20/04/28 05:10:12
1	97	339.68585575846714	287.4731819839514	20/04/28 05:10:12
1	97	339.56725073347116	287.60594665091924	20/04/28 05:10:12
1	97	339.71385348946967	287.81212256600605	20/04/28 05:10:12
1	97	339.6400466434538	287.7950290158108	20/04/28 05:10:12
1	97	339.82232492314415	287.97691154154296	20/04/28 05:10:12
1	97	339.76873272794313	288.0259579996595	20/04/28 05:10:12
1	97	339.8934318470626	288.26211897199124	20/04/28 05:10:12
1	97	340.0822544660283	288.0450620105312	20/04/28 05:10:13
1	97	340.075797185945	288.01025779420155	20/04/28 05:10:13
1	97	339.93224812324735	287.85869434020543	20/04/28 05:10:13
1	97	339.96940240938557	287.82238567838647	20/04/28 05:10:13
1	97	339.9268810891891	287.83976991798033	20/04/28 05:10:13
1	97	340.12156131275617	287.81554865476227	20/04/28 05:10:13
1	97	340.2225451112872	288.09073510321844	20/04/28 05:10:13
1	97	340.17896048787554	288.04383782339335	20/04/28 05:10:13
1	97	340.02213544239294	287.95708144467204	20/04/28 05:10:13
1	97	340.29095825001093	287.87307937668857	20/04/28 05:10:14
1	97	340.2344218115329	287.8757280506289	20/04/28 05:10:14
1	97	340.1925111849825	287.9091593900162	20/04/28 05:10:14
1	97	340.18302640515446	287.8919416247429	20/04/28 05:10:14
1	97	340.1385026788519	288.1417916749882	20/04/28 05:10:14
1	97	340.2523915387727	288.1933650317833	20/04/28 05:10:14
1	97	340.2215554584208	287.9635387511221	20/04/28 05:10:14
1	97	340.0456826664101	287.82319355692675	20/04/28 05:10:14
1	97	340.0333638600983	287.95164604424997	20/04/28 05:10:14
1	97	339.8451463714268	288.13572575460444	20/04/28 05:10:14
1	97	339.6792253735051	288.1058470696391	20/04/28 05:10:15
1	97	339.7751017549823	287.91671882020415	20/04/28 05:10:15
1	97	339.6910112499117	288.18459568595733	20/04/28 05:10:15
1	97	339.58845979382284	288.17147785829746	20/04/28 05:10:15
1	97	339.6218024762581	288.20863889676014	20/04/28 05:10:15
1	97	339.88370741134054	288.0748562506827	20/04/28 05:10:15
1	97	339.7785973293383	288.01536101139345	20/04/28 05:10:15
1	97	339.83235397026306	288.0810388837595	20/04/28 05:10:15
1	97	339.68245183977	288.2710957075167	20/04/28 05:10:15
1	97	339.70441609273126	288.0647456801618	20/04/28 05:10:16
1	97	339.74300866026806	288.04369776147234	20/04/28 05:10:16
1	97	339.77866208109066	288.06418747898346	20/04/28 05:10:16
1	97	339.7619534011577	288.02866337624084	20/04/28 05:10:16
1	97	339.82567529329	288.2740844742373	20/04/28 05:10:16
1	97	339.82487526352065	287.983104810701	20/04/28 05:10:16
1	97	339.8964540226522	288.23044485108926	20/04/28 05:10:16
1	97	340.0084894659061	288.04404809668927	20/04/28 05:10:16
1	97	340.08246830601547	287.8418460785699	20/04/28 05:10:16
1	97	340.08024059950253	288.0162994231579	20/04/28 05:10:16
1	97	340.28050061383	288.0140869396604	20/04/28 05:10:17
1	97	340.2671361101665	287.9524654136636	20/04/28 05:10:17
1	97	340.0016706404662	287.9062092003218	20/04/28 05:10:17
1	97	340.0434423005062	287.99351696931905	20/04/28 05:10:17
1	97	340.0477551155727	287.9832706306469	20/04/28 05:10:17
1	97	340.0477414023975	287.98334483903153	20/04/28 05:10:17
1	97	339.85946765631724	288.1113638009759	20/04/28 05:10:17
1	97	339.82147412650323	288.2930093823401	20/04/28 05:10:17
1	97	339.6476900090576	288.38052819825606	20/04/28 05:10:17
1	97	339.71448317690545	288.1324097424747	20/04/28 05:10:17
1	97	339.78837479275427	288.1494309131188	20/04/28 05:10:18
1	97	339.585891588286	288.2069633746009	20/04/28 05:10:18
1	97	339.58104335028224	288.1971991441498	20/04/28 05:10:18
1	97	339.4810360721873	288.27646569379095	20/04/28 05:10:18
1	97	339.4351121349392	288.27793394119686	20/04/28 05:10:18
1	97	339.43818662390703	288.2793594445507	20/04/28 05:10:18
1	97	339.33039414936036	288.21970654524574	20/04/28 05:10:18
1	97	339.26107967957046	288.0859696520621	20/04/28 05:10:18
1	97	339.26107967957046	288.0859696520621	20/04/28 05:10:18
1	97	339.26107967957046	288.0859696520621	20/04/28 05:10:19
1	97	339.0280904809408	288.1574811426743	20/04/28 05:10:19
1	97	339.0792350478922	288.0774977695406	20/04/28 05:10:19
1	97	339.06300850625144	288.1021076311295	20/04/28 05:10:19
1	97	339.3536235255541	288.1289740094396	20/04/28 05:10:19
1	97	339.6085794095529	288.04586816661	20/04/28 05:10:19
1	97	339.5786315309374	288.0430249387188	20/04/28 05:10:19
1	97	339.65043604434015	287.9350335473573	20/04/28 05:10:19
1	97	339.6450120283009	287.90778626379944	20/04/28 05:10:19
1	97	339.5476846382121	287.7575831942571	20/04/28 05:10:19
1	97	339.2725391273473	287.7890621226564	20/04/28 05:10:20
1	97	339.4331265719043	287.788189762206	20/04/28 05:10:20
1	97	339.3392946424608	287.93649846063204	20/04/28 05:10:20
1	97	339.0968857011037	287.8018788923909	20/04/28 05:10:20
1	97	339.29795793083196	287.72050805023764	20/04/28 05:10:20
1	97	339.22612919538506	287.63680452476314	20/04/28 05:10:20
1	97	339.0516623175299	287.47501878945474	20/04/28 05:10:20
1	97	339.07786408927575	287.39005725114276	20/04/28 05:10:20
1	97	338.8861671841797	287.4145643007987	20/04/28 05:10:20
1	97	338.7496454283515	287.41726880106114	20/04/28 05:10:21
1	97	338.7507786651008	287.30235755600415	20/04/28 05:10:21
1	97	338.8700458468686	287.2920474837213	20/04/28 05:10:21
1	97	338.68499193428084	287.32886014687244	20/04/28 05:10:21
1	97	338.65127379327186	287.3364353972088	20/04/28 05:10:21
1	97	338.82156441607697	287.3651188483424	20/04/28 05:10:21
1	97	338.7805518824801	287.13476892963206	20/04/28 05:10:21
1	97	338.4810301075755	287.1254333543746	20/04/28 05:10:21
1	97	338.39821534210245	287.28088840246625	20/04/28 05:10:21
1	97	338.5420834483753	287.18536823204926	20/04/28 05:10:21
1	97	338.3016904859089	287.1148170916379	20/04/28 05:10:22
1	97	338.2876240904936	287.12930298373647	20/04/28 05:10:22
1	97	338.34108153298456	287.11369753180713	20/04/28 05:10:22
1	97	338.2981598445771	287.2724923519283	20/04/28 05:10:22
1	97	338.28283411785816	287.2864586964643	20/04/28 05:10:22
1	97	338.32854612368044	287.26442575870976	20/04/28 05:10:22
1	97	338.3937521288786	287.3639440961051	20/04/28 05:10:22
1	97	338.3600185004192	287.6227980959541	20/04/28 05:10:22
1	97	338.44995074816165	287.43065994651886	20/04/28 05:10:22
1	97	338.44310631327716	287.3811419385244	20/04/28 05:10:22
1	97	338.4283153427653	287.2326159839261	20/04/28 05:10:23
1	97	338.30572209866756	287.1473235768404	20/04/28 05:10:23
1	97	338.23565637826636	286.9798199007959	20/04/28 05:10:23
1	97	338.1869060434279	287.1745028717767	20/04/28 05:10:23
1	97	338.01679419357595	287.1377708388149	20/04/28 05:10:23
1	97	337.95855578251206	287.30870392181123	20/04/28 05:10:23
1	97	337.89567975677573	287.27378923647404	20/04/28 05:10:23
1	97	337.83527217576585	287.0124234529586	20/04/28 05:10:23
1	97	338.0497169153109	287.02014436360975	20/04/28 05:10:23
1	97	338.0290685414522	286.8845767098661	20/04/28 05:10:24
1	97	338.0277675014363	286.73217063266986	20/04/28 05:10:24
1	97	338.0893060999449	286.8335246865221	20/04/28 05:10:24
1	97	337.98187830915373	286.7710233385358	20/04/28 05:10:24
1	97	337.87743095984644	286.63831112299806	20/04/28 05:10:24
1	97	337.9266197003863	286.5554720438914	20/04/28 05:10:24
1	97	337.94661838551696	286.4971013469083	20/04/28 05:10:24
1	97	338.07023145196337	286.52567984704825	20/04/28 05:10:24
1	97	337.9727357722983	286.295686533167	20/04/28 05:10:24
1	97	338.20929489776125	286.3894043594835	20/04/28 05:10:24
1	97	338.21597932921566	286.38171632919074	20/04/28 05:10:25
1	97	338.2559113177206	286.34073926349515	20/04/28 05:10:25
1	97	338.25559016347523	286.46690632641617	20/04/28 05:10:25
1	97	338.09222438232604	286.5886091265911	20/04/28 05:10:25
1	97	337.97646569620326	286.57287640250024	20/04/28 05:10:25
1	97	338.1286706073431	286.40979835115866	20/04/28 05:10:25
1	97	338.2191165246872	286.5851529141999	20/04/28 05:10:25
1	97	338.1970205026585	286.48608884281697	20/04/28 05:10:25
1	97	338.2507876061724	286.4281658989565	20/04/28 05:10:25
1	97	338.2374845881249	286.43849440244816	20/04/28 05:10:26
1	97	338.2499808913062	286.4197085696019	20/04/28 05:10:26
1	97	338.25905442271556	286.43141049657396	20/04/28 05:10:26
1	97	338.15883606508504	286.640497341081	20/04/28 05:10:26
1	97	338.13866208694606	286.46802339262314	20/04/28 05:10:26
1	97	338.1650922055456	286.38661602448235	20/04/28 05:10:26
1	97	338.08379244266115	286.39564192475126	20/04/28 05:10:26
1	97	338.14279168478674	286.4877167652873	20/04/28 05:10:26
1	97	337.9539829826454	286.6062622480429	20/04/28 05:10:26
1	97	337.8105278725597	286.776027101301	20/04/28 05:10:26
1	97	337.9204709716661	287.01372764185174	20/04/28 05:10:27
1	97	337.91897513289183	286.9687205861057	20/04/28 05:10:27
1	97	338.0589955786531	287.0153761865232	20/04/28 05:10:27
1	97	338.0238066286336	286.9763508830683	20/04/28 05:10:27
1	97	338.0157867380533	287.086415660295	20/04/28 05:10:27
1	97	337.9484854149438	286.9081996091263	20/04/28 05:10:27
1	97	338.13117270138207	287.1443502989962	20/04/28 05:10:27
1	97	338.1079009081506	287.37139918069164	20/04/28 05:10:27
1	97	338.0789454494884	287.5087086818052	20/04/28 05:10:27
1	97	338.19473482939804	287.3229972725316	20/04/28 05:10:27
1	97	338.12461560534405	287.3337000955398	20/04/28 05:10:28
1	97	338.03489782641066	287.34964314306774	20/04/28 05:10:28
1	97	337.88736827412333	287.2433948002985	20/04/28 05:10:28
1	97	337.63377309308225	287.30583512116465	20/04/28 05:10:28
1	97	337.7776153875368	287.0596047562043	20/04/28 05:10:28
1	97	337.6630872148028	286.9015909435581	20/04/28 05:10:28
1	97	337.3875027152023	286.99084764150354	20/04/28 05:10:28
1	97	337.3307635697702	286.8928406325864	20/04/28 05:10:28
1	97	337.2428629761367	286.6123855158545	20/04/28 05:10:28
1	97	337.2733187501576	286.55022250332956	20/04/28 05:10:29
1	97	337.30623323065646	286.25978006707174	20/04/28 05:10:29
1	97	337.23974197394904	286.2360855175169	20/04/28 05:10:29
1	97	337.060931356139	286.1233275208993	20/04/28 05:10:29
1	97	336.95141927035104	286.3332851525326	20/04/28 05:10:29
1	97	337.10775798487794	286.3711945121966	20/04/28 05:10:29
1	97	337.23217813989	286.5777362271147	20/04/28 05:10:29
1	97	337.1172731333939	286.73260190716655	20/04/28 05:10:29
1	97	337.17903088664264	286.8669698379673	20/04/28 05:10:29
1	97	337.27019217913676	287.0386337194253	20/04/28 05:10:29
1	97	337.2292814078425	287.06526454189674	20/04/28 05:10:30
1	97	337.3479029130233	287.0493402768253	20/04/28 05:10:30
1	97	337.3599506578068	287.0462861762068	20/04/28 05:10:30
1	97	337.17946169881384	287.06658780304736	20/04/28 05:10:30
1	97	337.131840036926	286.99764939751094	20/04/28 05:10:30
1	97	337.1502687198367	286.96459805950536	20/04/28 05:10:30
1	97	337.180704169737	286.7247604195883	20/04/28 05:10:30
1	97	337.42540633163304	286.5869241554883	20/04/28 05:10:30
1	97	337.33681183388495	286.76408443633983	20/04/28 05:10:30
1	97	337.2234913236636	286.6418995970735	20/04/28 05:10:30
1	97	337.2941410271862	286.50241286314264	20/04/28 05:10:31
1	97	337.073933813561	286.44799179336417	20/04/28 05:10:31
1	97	336.79519299668823	286.3598563266713	20/04/28 05:10:31
1	97	337.0510609326251	286.2363717323455	20/04/28 05:10:31
1	97	337.2397114908226	286.3598260571914	20/04/28 05:10:31
1	97	337.3904107826278	286.26409543154125	20/04/28 05:10:31
1	97	337.3904107826278	286.26409543154125	20/04/28 05:10:31
1	97	337.3904107826278	286.26409543154125	20/04/28 05:10:31
1	97	337.62973996125527	286.26452721396674	20/04/28 05:10:31
1	97	337.90273789239626	286.2650197394061	20/04/28 05:10:32
1	97	338.1111997231569	286.2653958329331	20/04/28 05:10:32
1	97	338.32129357313875	286.265774870845	20/04/28 05:10:32
1	97	338.5475289445533	286.2661830302594	20/04/28 05:10:32
1	97	338.8461033453015	286.26672169913246	20/04/28 05:10:32
1	97	338.9984492902011	286.2669965519606	20/04/28 05:10:32
1	97	339.2487377991604	286.2674481065102	20/04/28 05:10:32
1	97	339.2487377991604	286.2674481065102	20/04/28 05:10:32
1	97	339.48784273215006	286.267879484366	20/04/28 05:10:32
1	97	339.73031448216744	286.26831693641816	20/04/28 05:10:32
1	97	339.96765810652494	286.26874513663336	20/04/28 05:10:33
1	97	340.14029278386727	286.26905659309733	20/04/28 05:10:33
1	97	340.4307764584603	286.26958066519876	20/04/28 05:10:33
1	97	340.6361368865783	286.2699511633731	20/04/28 05:10:33
1	97	340.8218729019486	286.27028625643476	20/04/28 05:10:33
1	97	340.99774651236453	286.270603556375	20/04/28 05:10:33
1	97	341.15824790223553	286.27089312273637	20/04/28 05:10:33
1	9	341.24329666666665	286.0801072249763	20/04/28 05:10:33
1	9	341.24329666666665	285.860197933502	20/04/28 05:10:33
1	9	341.24329666666665	285.599146771596	20/04/28 05:10:34
1	9	341.24329666666665	285.3814830188054	20/04/28 05:10:34
1	9	341.24329666666665	285.20829761147326	20/04/28 05:10:34
1	9	341.24329666666665	285.0266268454126	20/04/28 05:10:34
1	9	341.24329666666665	284.8142375732226	20/04/28 05:10:34
1	9	341.24329666666665	284.5377246933562	20/04/28 05:10:34
1	9	341.24329666666665	284.3868440150027	20/04/28 05:10:34
1	9	341.24329666666665	284.1210531930331	20/04/28 05:10:34
1	9	341.24329666666665	283.9590851253454	20/04/28 05:10:34
1	9	341.24329666666665	283.7283835309227	20/04/28 05:10:34
1	83	341.2403319301134	283.44820089003264	20/04/28 05:10:35
1	83	341.0371246844575	283.47279894900413	20/04/28 05:10:35
1	83	340.7974635169741	283.5018097232603	20/04/28 05:10:35
1	83	340.6012729163565	283.5255584235002	20/04/28 05:10:35
1	83	340.4490748271334	283.54398186879604	20/04/28 05:10:35
1	83	340.2580541446014	283.5671047549832	20/04/28 05:10:35
1	83	340.0981369791615	283.58646258768914	20/04/28 05:10:35
1	83	339.8466067371408	283.61691010301456	20/04/28 05:10:35
1	83	339.6413668904712	283.64175420655715	20/04/28 05:10:35
1	83	339.34887578750937	283.6771599981965	20/04/28 05:10:35
1	83	339.107097748224	283.7064270179288	20/04/28 05:10:36
1	83	338.9323416371237	283.7275810920003	20/04/28 05:10:36
1	83	338.75458440344335	283.7490984493296	20/04/28 05:10:36
1	83	338.58593612529376	283.7695131755761	20/04/28 05:10:36
1	83	338.3076956653109	283.8031939393738	20/04/28 05:10:36
1	83	338.11011026941395	283.82711147835965	20/04/28 05:10:36
1	83	337.8890351217712	283.8538724312051	20/04/28 05:10:36
1	83	337.5986038423385	283.88902888301175	20/04/28 05:10:36
1	83	337.3970320753596	283.91342896872294	20/04/28 05:10:36
1	83	337.18943909873616	283.9385579165839	20/04/28 05:10:37
1	83	336.94946266288173	283.9676068538	20/04/28 05:10:37
1	83	336.67318733545056	284.0010497400248	20/04/28 05:10:37
1	83	336.4448835882946	284.02868570850535	20/04/28 05:10:37
1	83	336.16838245113036	284.0621559288004	20/04/28 05:10:37
1	83	336.16838245113036	284.0621559288004	20/04/28 05:10:37
1	83	335.9575434523602	284.087677804797	20/04/28 05:10:37
1	83	335.72768992178266	284.1155013732023	20/04/28 05:10:37
1	83	335.5745481527919	284.1340390501068	20/04/28 05:10:37
1	83	335.40675687484253	284.15435003723024	20/04/28 05:10:37
1	83	335.1339906688137	284.18736814738514	20/04/28 05:10:38
1	83	334.884498041416	284.21756901124644	20/04/28 05:10:38
1	9	334.821769350356	284.22516226431634	20/04/28 05:10:38
1	9	334.90183167100304	284.2312943383653	20/04/28 05:10:38
1	9	334.90183167100304	284.2312943383653	20/04/28 05:10:38
1	9	334.9431336911982	284.21919474771727	20/04/28 05:10:38
1	9	334.9615834914487	284.5033286761685	20/04/28 05:10:38
1	9	334.8774532759945	284.2238893239893	20/04/28 05:10:38
1	9	335.0800375307209	284.0582275762851	20/04/28 05:10:38
1	9	335.1008920169057	284.29347445136546	20/04/28 05:10:38
1	9	335.00794522375867	284.2443356450612	20/04/28 05:10:39
1	9	335.18244913063376	284.25850569585805	20/04/28 05:10:39
1	9	335.1759905529438	284.30057128863405	20/04/28 05:10:39
1	9	335.20876152318596	284.31527185372266	20/04/28 05:10:39
1	9	335.2020236531917	284.39511804605695	20/04/28 05:10:39
1	9	334.9541097850139	284.2371335087658	20/04/28 05:10:39
1	9	334.9086938973399	284.4937761967495	20/04/28 05:10:39
1	9	335.1873289425706	284.4696640770342	20/04/28 05:10:39
1	9	335.14332220708854	284.5002801356988	20/04/28 05:10:39
1	9	335.16339652712213	284.54936685084033	20/04/28 05:10:39
1	9	335.0274612389274	284.3176906470138	20/04/28 05:10:40
1	9	335.2240304752335	284.49468042784986	20/04/28 05:10:40
1	9	335.26800473717043	284.78001397395127	20/04/28 05:10:40
1	9	335.2587173712851	284.5587998696665	20/04/28 05:10:40
1	9	335.3012117393595	284.5359369137604	20/04/28 05:10:40
1	9	335.330514316342	284.6115067498156	20/04/28 05:10:40
1	9	335.49912896057725	284.6364352059777	20/04/28 05:10:40
1	9	335.6792595670104	284.596693364947	20/04/28 05:10:40
1	9	335.9367969551104	284.6306441533545	20/04/28 05:10:40
1	9	335.9704280128991	284.55199381632536	20/04/28 05:10:41
1	9	335.79067686831706	284.78495705741716	20/04/28 05:10:41
1	9	335.51555798262433	284.835865385803	20/04/28 05:10:41
1	9	335.5202187229984	284.8469550547488	20/04/28 05:10:41
1	9	335.5175361720642	284.85080904516064	20/04/28 05:10:41
1	9	335.60330359375195	284.69024319136486	20/04/28 05:10:41
1	9	335.6572286056566	284.7293509702275	20/04/28 05:10:41
1	9	335.6572286056566	284.7293509702275	20/04/28 05:10:41
1	9	335.557265025146	284.4565821055448	20/04/28 05:10:41
1	9	335.7621124324356	284.42228322285143	20/04/28 05:10:41
1	9	335.7621124324356	284.42228322285143	20/04/28 05:10:42
1	9	335.6803866565505	284.31707542553227	20/04/28 05:10:42
1	9	335.6353092177844	284.20179786992463	20/04/28 05:10:42
1	9	335.7531207409157	284.20629244322447	20/04/28 05:10:42
1	9	335.9324448382046	284.06321659745385	20/04/28 05:10:42
1	9	335.7578288376047	284.12155009337255	20/04/28 05:10:42
1	9	335.6864812584323	284.0824411473349	20/04/28 05:10:42
1	9	335.7830453733266	284.0289378582642	20/04/28 05:10:42
1	9	335.71634444028996	283.9582719052372	20/04/28 05:10:42
1	9	335.84354169638067	284.1323633720769	20/04/28 05:10:43
1	9	335.78634799271066	284.2674573777496	20/04/28 05:10:43
1	9	335.84292443989045	284.25742034480015	20/04/28 05:10:43
1	9	335.78088766246503	284.34544620980853	20/04/28 05:10:43
1	9	335.7335060391709	284.4429856690128	20/04/28 05:10:43
1	9	335.64140231737736	284.68237386361864	20/04/28 05:10:43
1	9	335.6314271155735	284.67712555044557	20/04/28 05:10:43
1	9	335.44561728959013	284.61051804952507	20/04/28 05:10:43
1	9	335.41761718077464	284.60166845099235	20/04/28 05:10:43
1	9	335.4762394711077	284.6297587761492	20/04/28 05:10:43
1	9	335.4762394711077	284.6297587761492	20/04/28 05:10:44
1	9	335.4762394711077	284.6297587761492	20/04/28 05:10:44
1	9	335.7482449398689	284.6182382672808	20/04/28 05:10:44
1	9	335.94127428629616	284.6100627099749	20/04/28 05:10:44
1	9	336.12279982572954	284.6023743844556	20/04/28 05:10:44
1	9	336.28741230714036	284.595402393927	20/04/28 05:10:44
1	9	336.51637629981013	284.5857048620351	20/04/28 05:10:44
1	9	336.8114716009534	284.573206407319	20/04/28 05:10:44
1	9	337.02541884629386	284.56414489414965	20/04/28 05:10:44
1	9	337.201726597	284.55667756264774	20/04/28 05:10:45
1	9	337.39790134937033	284.5483687849429	20/04/28 05:10:45
1	9	337.549339242259	284.5419547904156	20/04/28 05:10:45
1	9	337.549339242259	284.5419547904156	20/04/28 05:10:45
1	9	338.0317955742785	284.5215208540064	20/04/28 05:10:45
1	9	338.2779768170586	284.5110941033841	20/04/28 05:10:45
1	9	338.4519309349719	284.50372645755243	20/04/28 05:10:45
1	9	338.72967263764406	284.49196299645985	20/04/28 05:10:45
1	9	338.8925526717056	284.4850643819378	20/04/28 05:10:45
1	9	339.0912750479161	284.47664770227357	20/04/28 05:10:45
1	9	339.30165766752845	284.4677371651214	20/04/28 05:10:46
1	9	339.522663775767	284.458376681152	20/04/28 05:10:46
1	9	339.77852381134005	284.4475399953225	20/04/28 05:10:46
1	9	339.96283547381825	284.43973366645787	20/04/28 05:10:46
1	9	340.12509552765135	284.43286131055385	20/04/28 05:10:46
1	9	340.32761947166074	284.4242836194374	20/04/28 05:10:46
1	9	340.60022681777883	284.4127376186793	20/04/28 05:10:46
1	9	340.77948518082223	284.40514531705907	20/04/28 05:10:46
1	9	341.04879300408925	284.3937390641613	20/04/28 05:10:46
1	9	341.24329666666665	284.2918151067196	20/04/28 05:10:46
1	9	341.24329666666665	284.02403281951223	20/04/28 05:10:47
1	83	341.2621757356885	283.745231041923	20/04/28 05:10:47
1	83	341.28528149767385	283.53984619542246	20/04/28 05:10:47
1	83	341.3093213654326	283.3261581745444	20/04/28 05:10:47
1	83	341.3093213654326	283.3261581745444	20/04/28 05:10:47
1	83	341.33292051294245	283.1163876726265	20/04/28 05:10:47
1	83	341.35308053485403	282.9371872200124	20/04/28 05:10:47
1	83	341.379847836914	282.69925530379527	20/04/28 05:10:47
1	83	341.397787069028	282.5397952333412	20/04/28 05:10:47
1	83	341.4266504561412	282.28323142317583	20/04/28 05:10:48
1	83	341.4592879138062	281.9931202709467	20/04/28 05:10:48
1	83	341.48398012461934	281.77363363679694	20/04/28 05:10:48
1	83	341.5120218625766	281.5243733851928	20/04/28 05:10:48
1	83	341.531277503526	281.3532118860322	20/04/28 05:10:48
1	83	341.5556851289632	281.13625490330855	20/04/28 05:10:48
1	83	341.5831943975017	280.89172772001507	20/04/28 05:10:48
1	83	341.60156054251195	280.72847286280097	20/04/28 05:10:48
1	83	341.629857502257	280.47694396981933	20/04/28 05:10:48
1	83	341.654822928517	280.25502875042577	20/04/28 05:10:48
1	83	341.6843903637033	279.9922067261608	20/04/28 05:10:49
1	83	341.71608638136024	279.71046394159964	20/04/28 05:10:49
1	83	341.74575312819695	279.44675914583917	20/04/28 05:10:49
1	83	341.7735673991188	279.19952082634825	20/04/28 05:10:49
1	83	341.79271673931714	279.02930422411197	20/04/28 05:10:49
1	83	341.8248809860187	278.7433993976103	20/04/28 05:10:49
1	83	341.85166705784053	278.5053006388254	20/04/28 05:10:49
1	83	341.88069479147174	278.2472759686198	20/04/28 05:10:49
1	83	341.9041743529124	278.0385684555133	20/04/28 05:10:49
1	83	341.92878983403057	277.8197638640782	20/04/28 05:10:50
1	83	341.95998849479673	277.5424420360183	20/04/28 05:10:50
1	83	341.98187581741956	277.3478877772121	20/04/28 05:10:50
1	83	342.0072032828911	277.1227544268629	20/04/28 05:10:50
1	83	342.03494290864086	276.8761796209676	20/04/28 05:10:50
1	83	342.065358422327	276.6058191103021	20/04/28 05:10:50
1	83	342.0870748379496	276.41278402701727	20/04/28 05:10:50
1	83	342.1114619323215	276.1960095429144	20/04/28 05:10:50
1	83	342.1371771249856	275.96742972367247	20/04/28 05:10:50
1	83	342.1619425942667	275.74729190220415	20/04/28 05:10:50
1	83	342.1928586092456	275.47248248475705	20/04/28 05:10:51
1	83	342.2190664900118	275.23952320941714	20/04/28 05:10:51
1	83	342.2385099046524	275.0666926083771	20/04/28 05:10:51
1	83	342.2598214181566	274.8772566602125	20/04/28 05:10:51
1	83	342.27700217538717	274.72453859842335	20/04/28 05:10:51
1	83	342.2954740245513	274.5603441473783	20/04/28 05:10:51
1	83	342.31529654371514	274.38414372350536	20/04/28 05:10:51
1	83	342.33511999781825	274.20793498904885	20/04/28 05:10:51
1	83	342.35751427759396	274.00887443795557	20/04/28 05:10:51
1	83	342.3762662414296	273.8421900751366	20/04/28 05:10:52
1	83	342.3965506816359	273.66188368053395	20/04/28 05:10:52
1	83	342.4260352642377	273.3997981247466	20/04/28 05:10:52
1	83	342.4430947834505	273.2481577357772	20/04/28 05:10:52
1	83	342.46240137953095	273.0765433014661	20/04/28 05:10:52
1	83	342.48466528252493	272.87864165676694	20/04/28 05:10:52
1	83	342.50841071562735	272.6675708365999	20/04/28 05:10:52
1	83	342.5414361791797	272.374010738187	20/04/28 05:10:52
1	83	342.5710884627747	272.11043450476	20/04/28 05:10:52
1	83	342.6030726750755	271.8261299863451	20/04/28 05:10:52
1	83	342.6355683565213	271.53727906898916	20/04/28 05:10:53
1	83	342.6610618321798	271.31067007041037	20/04/28 05:10:53
1	83	342.6810356144983	271.13312508322815	20/04/28 05:10:53
1	83	342.5712920154741	271.07760206070924	20/04/28 05:10:53
1	83	342.50412218933434	271.0613189059756	20/04/28 05:10:53
1	83	342.52619751864137	271.1809130266273	20/04/28 05:10:53
1	83	342.59209841918965	271.10096337524743	20/04/28 05:10:53
1	83	342.58110216272325	271.11510747901764	20/04/28 05:10:53
1	83	342.72555297861004	271.1982969562832	20/04/28 05:10:53
1	83	343.0033015406006	271.1856505014769	20/04/28 05:10:53
1	83	343.2322986893563	271.0539340458749	20/04/28 05:10:54
1	83	343.16972839990706	270.8545555251218	20/04/28 05:10:54
1	83	343.31795944152503	270.6340546599326	20/04/28 05:10:54
1	83	343.3224677637512	270.63326715082405	20/04/28 05:10:54
1	83	343.5388332461165	270.54879296249777	20/04/28 05:10:54
1	83	343.7266751282215	270.7597277933674	20/04/28 05:10:54
1	83	343.85595782377237	270.54286268416723	20/04/28 05:10:54
1	83	344.0304343076234	270.40312696460626	20/04/28 05:10:54
1	83	343.994855678545	270.280374181328	20/04/28 05:10:54
1	83	344.05724533639693	270.12106848197743	20/04/28 05:10:55
1	83	344.0505912381243	270.19138540028575	20/04/28 05:10:55
1	83	344.0783128257115	270.16866401062924	20/04/28 05:10:55
1	83	344.2190506262799	270.1057179799285	20/04/28 05:10:55
1	83	344.18441150294615	270.1272856257725	20/04/28 05:10:55
1	83	344.22283040973804	270.0575143949821	20/04/28 05:10:55
1	83	344.1701420106069	270.07599825755443	20/04/28 05:10:55
1	83	344.0909062720513	270.3199377329471	20/04/28 05:10:55
1	83	344.0162002588779	270.22439717160523	20/04/28 05:10:55
1	83	344.1872295260101	270.1319763573017	20/04/28 05:10:55
1	83	343.9473542363251	270.0375111220322	20/04/28 05:10:56
1	83	344.0396673160096	270.00730744784005	20/04/28 05:10:56
1	83	344.2503998815757	269.930479227856	20/04/28 05:10:56
1	83	344.23054752771077	269.89428975370987	20/04/28 05:10:56
1	83	343.99524234003786	269.9376134533983	20/04/28 05:10:56
1	83	344.03510799439346	269.9717781483632	20/04/28 05:10:56
1	83	343.934753100909	269.94584374472214	20/04/28 05:10:56
1	83	343.98089400539374	269.8958028424967	20/04/28 05:10:56
1	83	344.04651210328456	269.9721158687107	20/04/28 05:10:56
1	83	344.1856112469982	270.13025512121	20/04/28 05:10:57
1	83	344.1887286371347	270.1292307508722	20/04/28 05:10:57
1	83	344.04417273323014	270.2504733709548	20/04/28 05:10:57
1	83	344.11751720319745	270.0694550561069	20/04/28 05:10:57
1	83	344.01989727680586	270.1920701236545	20/04/28 05:10:57
1	83	344.0553998633216	270.19697460729725	20/04/28 05:10:57
1	83	344.1079884194703	269.9320671947994	20/04/28 05:10:57
1	83	343.98748545045714	269.85886465513136	20/04/28 05:10:57
1	83	343.9484868338837	269.83996177466884	20/04/28 05:10:57
1	83	343.73540597316963	269.7923786327171	20/04/28 05:10:57
1	83	343.7367518051908	269.7780760191065	20/04/28 05:10:58
1	83	343.611454103414	269.8049583184628	20/04/28 05:10:58
1	83	343.5808335163684	270.0354333705643	20/04/28 05:10:58
1	83	343.4525111013909	269.9644150290763	20/04/28 05:10:58
1	83	343.4929111654659	270.11732451898644	20/04/28 05:10:58
1	83	343.64040957664986	270.08426862434214	20/04/28 05:10:58
1	83	343.7129234286699	270.0112318998031	20/04/28 05:10:58
1	83	343.82473198406234	269.8937765020467	20/04/28 05:10:58
1	83	343.9146316592757	269.97180690301747	20/04/28 05:10:58
1	83	343.8244006684876	270.10974532436484	20/04/28 05:10:59
1	83	343.8777075442036	270.15465314995237	20/04/28 05:10:59
1	83	343.70635842005555	270.2446349701256	20/04/28 05:10:59
1	83	343.78062933867113	270.1113499886686	20/04/28 05:10:59
1	83	343.67644955929114	270.03317920113244	20/04/28 05:10:59
1	83	343.6286627262026	270.0583976834493	20/04/28 05:10:59
1	83	343.75559550284936	270.3204593905097	20/04/28 05:10:59
1	83	343.61720282466615	270.1863800526525	20/04/28 05:10:59
1	83	343.51228932513857	270.3519706164968	20/04/28 05:10:59
1	83	343.30640606044096	270.23876486384665	20/04/28 05:10:59
1	83	343.2913307230153	270.27844101360813	20/04/28 05:11:00
1	83	343.31314240520055	270.1751348027628	20/04/28 05:11:00
1	83	343.33399697184615	270.08353187110544	20/04/28 05:11:00
1	83	343.3654545201002	270.08198542562127	20/04/28 05:11:00
1	83	343.4339851896673	269.85481716183426	20/04/28 05:11:00
1	83	343.33318811539647	269.78338917349714	20/04/28 05:11:00
1	83	343.25240141445244	269.60322259292144	20/04/28 05:11:00
1	83	343.2528739477949	269.5631737144097	20/04/28 05:11:00
1	83	343.35062006938057	269.461526506445	20/04/28 05:11:00
1	83	343.34530317021444	269.47737082205873	20/04/28 05:11:00
1	83	343.26664042820875	269.20064003146103	20/04/28 05:11:01
1	83	343.306196663916	268.9165311429083	20/04/28 05:11:01
1	83	343.45124555510705	269.169645892852	20/04/28 05:11:01
1	83	343.4332385023974	269.12456560274273	20/04/28 05:11:01
1	83	343.37064564331644	269.12797645272286	20/04/28 05:11:01
1	83	343.348911206699	268.8507267587391	20/04/28 05:11:01
1	83	343.3015706113916	268.8084691135001	20/04/28 05:11:01
1	83	343.323335635016	268.7514021965327	20/04/28 05:11:01
1	83	343.2612360837349	268.71328620600906	20/04/28 05:11:01
1	83	343.08606809681874	268.7303845823946	20/04/28 05:11:02
1	83	342.9988114754439	268.7511932511162	20/04/28 05:11:02
1	83	343.090640096409	268.7021263654297	20/04/28 05:11:02
1	83	343.0447967686683	268.7022443250589	20/04/28 05:11:02
1	83	343.2456226476321	268.8076876524273	20/04/28 05:11:02
1	83	343.26504752715994	268.76542774836474	20/04/28 05:11:02
1	83	343.0474413311035	268.78203116605636	20/04/28 05:11:02
1	83	343.07527066220655	268.7889229605501	20/04/28 05:11:02
1	83	343.0662846913576	268.8334312481014	20/04/28 05:11:02
1	83	342.9500324731051	268.8909981543759	20/04/28 05:11:02
1	83	342.9501894192474	268.93092421778204	20/04/28 05:11:03
1	83	342.9626958914435	269.03585769095923	20/04/28 05:11:03
1	83	342.9932073779691	269.1435172721791	20/04/28 05:11:03
1	83	342.9574673687151	269.14468027052504	20/04/28 05:11:03
1	83	342.9537907386166	269.10316217657225	20/04/28 05:11:03
1	83	342.95363442452623	269.1030303447702	20/04/28 05:11:03
1	83	342.95106137396135	268.8221887360468	20/04/28 05:11:03
1	83	342.67131819749454	268.788567641606	20/04/28 05:11:03
1	83	342.5872977769383	269.0742331313	20/04/28 05:11:03
1	83	342.5479402642544	269.1022112111626	20/04/28 05:11:04
1	83	342.3890377887241	269.0731032680655	20/04/28 05:11:04
1	83	342.2423235191309	269.25283826061934	20/04/28 05:11:04
1	83	342.3309883192351	269.50447060984027	20/04/28 05:11:04
1	83	342.24715977019247	269.5751188071655	20/04/28 05:11:04
1	83	342.067706378048	269.60668857879205	20/04/28 05:11:04
1	83	342.11858902892396	269.62169580023453	20/04/28 05:11:04
1	83	342.0532020499064	269.86750345807616	20/04/28 05:11:04
1	83	342.03327743148367	269.912970661779	20/04/28 05:11:04
1	83	342.1817608805725	269.9524388117606	20/04/28 05:11:04
1	83	342.44923689366186	269.92097295129435	20/04/28 05:11:05
1	83	342.68049350602223	270.021038802593	20/04/28 05:11:05
1	83	342.5744316540698	270.1781049569409	20/04/28 05:11:05
1	83	342.53784850472766	270.11214930761327	20/04/28 05:11:05
1	83	342.5618540758083	270.22833916271	20/04/28 05:11:05
1	83	342.62785037959827	270.0085915842671	20/04/28 05:11:05
1	83	342.57772696471386	270.24912830269477	20/04/28 05:11:05
1	83	342.82169477131777	270.10882685808883	20/04/28 05:11:05
1	83	342.83168868816813	270.27025145903895	20/04/28 05:11:05
1	83	342.99320055279674	270.339650078854	20/04/28 05:11:06
1	83	342.9802034491119	270.34075840859106	20/04/28 05:11:06
1	83	342.89800132794477	270.38782997309227	20/04/28 05:11:06
1	83	342.8076754132215	270.3841408043366	20/04/28 05:11:06
1	83	342.72928276454047	270.26605394104615	20/04/28 05:11:06
1	83	342.67581329022676	270.3448481580197	20/04/28 05:11:06
1	83	342.67621463971346	270.34269137725516	20/04/28 05:11:06
1	83	342.9011656305719	270.42893190118775	20/04/28 05:11:06
1	83	342.97580003503913	270.41747387867133	20/04/28 05:11:06
1	83	342.97565271469654	270.4185108632944	20/04/28 05:11:06
1	83	342.95376992029964	270.43370599521484	20/04/28 05:11:07
1	83	342.7503099835394	270.2931255883032	20/04/28 05:11:07
1	83	342.56228250320396	270.1321777702103	20/04/28 05:11:07
1	83	342.39354482216805	269.916838061105	20/04/28 05:11:07
1	83	342.31698228676913	269.72252222761136	20/04/28 05:11:07
1	83	342.2975742265847	269.7235200930579	20/04/28 05:11:07
1	83	342.5789264469618	269.70444999595145	20/04/28 05:11:07
1	83	342.47911051765885	269.67719882725993	20/04/28 05:11:07
1	83	342.5149413359998	269.8768231605162	20/04/28 05:11:07
1	83	342.5592560400831	269.89498388548856	20/04/28 05:11:07
1	83	342.70487696717	269.9791965202223	20/04/28 05:11:08
1	83	342.7716567662417	270.0351692775117	20/04/28 05:11:08
1	83	342.78249741205104	270.0553837337757	20/04/28 05:11:08
1	83	342.7620939215188	269.82881529870855	20/04/28 05:11:08
1	83	342.7656190752877	269.8302606572909	20/04/28 05:11:08
1	83	342.7795513797394	269.8397793933686	20/04/28 05:11:08
1	83	342.9182377806372	269.6680380776983	20/04/28 05:11:08
1	83	343.0250593410927	269.4834694605714	20/04/28 05:11:08
1	83	342.8937970000187	269.54494853419214	20/04/28 05:11:08
1	83	342.9075551077536	269.70785020084617	20/04/28 05:11:09
1	83	342.89824720145646	269.7259809262591	20/04/28 05:11:09
1	83	343.02909153367676	269.74758277448376	20/04/28 05:11:09
1	83	343.0342131337574	269.74994470914487	20/04/28 05:11:09
1	83	343.11361488292795	269.68721977074716	20/04/28 05:11:09
1	83	343.1314396082604	269.76183304801464	20/04/28 05:11:09
1	83	343.1371444038207	269.7507716890118	20/04/28 05:11:09
1	83	342.8838357135028	269.6777628846843	20/04/28 05:11:09
1	83	342.82821286579053	269.58618981416976	20/04/28 05:11:09
1	83	342.8171999665513	269.5892069074246	20/04/28 05:11:09
1	83	342.9160596202607	269.7311559808645	20/04/28 05:11:10
1	83	342.94581622622934	269.6599351192012	20/04/28 05:11:10
1	83	342.9960157744501	269.6324226898764	20/04/28 05:11:10
1	83	343.25407064073244	269.633753157319	20/04/28 05:11:10
1	83	343.30813538192444	269.44263161751553	20/04/28 05:11:10
1	83	343.4941927474763	269.64552135776336	20/04/28 05:11:10
1	83	343.4225840258658	269.7998828753361	20/04/28 05:11:10
1	83	343.3659735282365	269.67198663464734	20/04/28 05:11:10
1	83	343.3277240878877	269.55929174037897	20/04/28 05:11:10
1	83	343.38287845135426	269.8245748838974	20/04/28 05:11:10
1	83	343.443263097624	269.75258590851956	20/04/28 05:11:11
1	83	343.30445458702997	269.8769158691477	20/04/28 05:11:11
1	83	343.3949796756651	269.82818828158656	20/04/28 05:11:11
1	83	343.1407761579965	269.8589525951209	20/04/28 05:11:11
1	83	343.0342961785204	269.91642705628266	20/04/28 05:11:11
1	83	342.98747473536673	269.8100410295978	20/04/28 05:11:11
1	83	342.9181412463759	269.9963274143939	20/04/28 05:11:11
1	83	342.9151665318837	269.7262342462096	20/04/28 05:11:11
1	83	343.03324935571135	269.546298013403	20/04/28 05:11:11
1	83	343.0485862391955	269.37424824270704	20/04/28 05:11:12
1	83	343.05783979875804	269.0940422358674	20/04/28 05:11:12
1	83	343.25123746422935	269.1849275993929	20/04/28 05:11:12
1	83	343.15700336505523	269.39267057278926	20/04/28 05:11:12
1	83	343.05771830051003	269.4110907853069	20/04/28 05:11:12
1	83	343.0579762229792	269.40937122214837	20/04/28 05:11:12
1	83	343.0054587297786	269.60217689748686	20/04/28 05:11:12
1	83	343.1134119184625	269.78636922666664	20/04/28 05:11:12
1	83	343.10649312871004	269.76227716108923	20/04/28 05:11:12
1	83	343.0865787924154	269.69268904238976	20/04/28 05:11:12
1	83	343.0461787959721	269.77653316811313	20/04/28 05:11:13
1	83	343.239731259656	269.7500369723944	20/04/28 05:11:13
1	83	343.2464229382885	269.75237476036403	20/04/28 05:11:13
1	83	343.1613050981375	269.65050882716355	20/04/28 05:11:13
1	83	343.11027518807373	269.7200773806959	20/04/28 05:11:13
1	83	343.2453507868291	269.7875125237979	20/04/28 05:11:13
1	83	343.1715740347417	269.82942583046236	20/04/28 05:11:13
1	83	343.0956240304835	269.5947240859653	20/04/28 05:11:13
1	83	343.279701909637	269.50051457754984	20/04/28 05:11:13
1	83	343.05583347261944	269.53913009469755	20/04/28 05:11:13
1	83	343.02131436230985	269.52956945323024	20/04/28 05:11:14
1	83	342.96922974267085	269.51589158718264	20/04/28 05:11:14
1	83	342.7982873307262	269.32095632212616	20/04/28 05:11:14
1	83	343.07033032554256	269.3483691077214	20/04/28 05:11:14
1	83	343.0409810757359	269.5139321865746	20/04/28 05:11:14
1	83	343.15096532048506	269.5015078672832	20/04/28 05:11:14
1	83	343.29049631037304	269.571393873747	20/04/28 05:11:14
1	83	343.12833574010267	269.50208764899065	20/04/28 05:11:14
1	83	343.2066239344035	269.32412031353215	20/04/28 05:11:14
1	83	343.2670688028491	269.3315170505316	20/04/28 05:11:15
1	83	343.56182326682386	269.3135589738402	20/04/28 05:11:15
1	83	343.4245350460972	269.54288171451685	20/04/28 05:11:15
1	83	343.44911569106677	269.57222854320105	20/04/28 05:11:15
1	83	343.4179350067912	269.6429250334753	20/04/28 05:11:15
1	83	343.4179300063207	269.6490345859986	20/04/28 05:11:15
1	83	343.3294442173014	269.83257272742753	20/04/28 05:11:15
1	83	343.294547403672	269.98134386562805	20/04/28 05:11:15
1	83	343.1437223596669	269.81403637583423	20/04/28 05:11:15
1	83	343.2589958536191	269.8642830108877	20/04/28 05:11:15
1	83	343.277077952412	269.8671786390089	20/04/28 05:11:16
1	83	343.281766401085	269.8686737746825	20/04/28 05:11:16
1	83	343.3744032559376	269.679279412439	20/04/28 05:11:16
1	83	343.4466239285722	269.6738496861157	20/04/28 05:11:16
1	83	343.428920903194	269.69213305921915	20/04/28 05:11:16
1	83	343.38016599922236	269.7623118904884	20/04/28 05:11:16
1	83	343.13998404989434	269.74663338090136	20/04/28 05:11:16
1	83	343.15866778660325	269.75881123301076	20/04/28 05:11:16
1	83	343.13585396991687	269.77810955006663	20/04/28 05:11:16
1	83	343.2293007024156	269.6586618406854	20/04/28 05:11:17
1	83	343.22694524083033	269.6589380557923	20/04/28 05:11:17
1	83	343.25880290970474	269.6297618073163	20/04/28 05:11:17
1	83	343.3442264315972	269.64877421112885	20/04/28 05:11:17
1	83	343.3441891743352	269.68484692970395	20/04/28 05:11:17
1	83	343.33949829034657	269.6996701835777	20/04/28 05:11:17
1	83	343.16550488482875	269.79712946577365	20/04/28 05:11:17
1	83	342.9602876707734	269.79456695072474	20/04/28 05:11:17
1	83	342.88530247010283	269.8381858692687	20/04/28 05:11:17
1	83	342.7595704196797	269.9934001101749	20/04/28 05:11:17
1	83	342.8220592551894	270.0097384033781	20/04/28 05:11:18
1	83	342.81006641364155	269.95391028019156	20/04/28 05:11:18
1	83	342.7847806326564	269.97653672107816	20/04/28 05:11:18
1	83	342.94054013990274	270.0899808939426	20/04/28 05:11:18
1	83	342.88018453029554	270.379173236326	20/04/28 05:11:18
1	83	342.87271338045895	270.5319148177263	20/04/28 05:11:18
1	83	342.95669124360484	270.3152979879626	20/04/28 05:11:18
1	83	342.7303256176661	270.20495821870855	20/04/28 05:11:18
1	83	342.675455062323	270.1840461039463	20/04/28 05:11:18
1	83	342.7343987267889	270.00901939305567	20/04/28 05:11:19
1	83	342.85539676043106	270.15520366136127	20/04/28 05:11:19
1	83	342.7561421196215	270.0467207491677	20/04/28 05:11:19
1	83	342.8411256769101	269.80104370257936	20/04/28 05:11:19
1	83	342.8816948187837	270.03963248791223	20/04/28 05:11:19
1	83	342.996122516529	269.97371708366614	20/04/28 05:11:19
1	83	343.0116711838544	269.94689877484274	20/04/28 05:11:19
1	83	343.02856344841956	269.7931199496018	20/04/28 05:11:19
1	83	342.97369573271385	269.9226322400167	20/04/28 05:11:19
1	83	343.06818949787566	270.1027427750689	20/04/28 05:11:19
1	83	343.1823709357732	269.98662305059656	20/04/28 05:11:20
1	83	343.2386728080727	269.97317434649705	20/04/28 05:11:20
1	83	343.13852141971444	269.958186053635	20/04/28 05:11:20
1	83	343.1736343318465	270.00942695830275	20/04/28 05:11:20
1	83	343.3513514463234	269.80990548269466	20/04/28 05:11:20
1	83	343.17211170955113	269.9321471217043	20/04/28 05:11:20
1	83	343.1951297139966	269.6352471304857	20/04/28 05:11:20
1	83	343.38088461264687	269.7240810875499	20/04/28 05:11:20
1	83	343.42383581268024	269.60015655008783	20/04/28 05:11:20
1	83	343.65744269281925	269.76780013854415	20/04/28 05:11:21
1	83	343.82999991489254	269.9121784391467	20/04/28 05:11:21
1	83	343.6399069153498	269.99359559114424	20/04/28 05:11:21
1	83	343.54747831538464	270.03475426237884	20/04/28 05:11:21
1	83	343.5012916091321	270.0077719404395	20/04/28 05:11:21
1	83	343.5699855681187	270.02338676965945	20/04/28 05:11:21
1	83	343.64509965619544	269.7809216401573	20/04/28 05:11:21
1	83	343.62079009151086	269.79613467063456	20/04/28 05:11:21
1	83	343.65370776198574	269.838529744882	20/04/28 05:11:21
1	83	343.7292507697448	269.8592667624062	20/04/28 05:11:21
1	83	343.5931885686357	269.761086366061	20/04/28 05:11:22
1	83	343.62233757780285	269.7515996653009	20/04/28 05:11:22
1	83	343.41539633101104	269.75061534461696	20/04/28 05:11:22
1	83	343.3926607016537	269.8698632656849	20/04/28 05:11:22
1	83	343.6768153650031	269.9357966705237	20/04/28 05:11:22
1	83	343.67912370463716	269.9370248987018	20/04/28 05:11:22
1	83	343.54968498597714	269.8012634516283	20/04/28 05:11:22
1	83	343.49386836142025	269.7622863536011	20/04/28 05:11:22
1	83	343.59200471160443	269.75770746481703	20/04/28 05:11:22
1	83	343.5640385164618	269.7606950985194	20/04/28 05:11:22
1	83	343.5527900866145	269.75726162634294	20/04/28 05:11:23
1	83	343.3364119843012	269.789546623687	20/04/28 05:11:23
1	83	343.35488643263346	270.08212720871757	20/04/28 05:11:23
1	83	343.35488643263346	270.08212720871757	20/04/28 05:11:23
1	83	343.35488643263346	270.08212720871757	20/04/28 05:11:23
1	83	343.35639160423636	270.0835903539675	20/04/28 05:11:23
1	83	343.2932895690723	270.1100413568349	20/04/28 05:11:23
1	83	343.1373038671438	270.1914019371129	20/04/28 05:11:23
1	83	343.30211677985113	270.3583692253435	20/04/28 05:11:23
1	83	343.08926281578186	270.2824539156924	20/04/28 05:11:24
1	83	343.1509863138485	270.0489399378099	20/04/28 05:11:24
1	83	343.1462977542882	270.04532457794653	20/04/28 05:11:24
1	83	343.2582938053295	270.142332201005	20/04/28 05:11:24
1	83	343.26398124641753	270.07561478831565	20/04/28 05:11:24
1	83	343.18410175440755	270.246827438184	20/04/28 05:11:24
1	83	343.1409421654836	270.2262463420683	20/04/28 05:11:24
1	83	343.20088069161085	270.15704528999	20/04/28 05:11:24
1	83	343.3052394035589	269.9068992797272	20/04/28 05:11:24
1	83	343.1622282562369	269.7818507885115	20/04/28 05:11:24
1	83	343.1030456086638	269.809074482516	20/04/28 05:11:25
1	83	343.0876146515809	269.8035704837975	20/04/28 05:11:25
1	83	342.8511289361763	269.66356491793755	20/04/28 05:11:25
1	83	342.80391959300647	269.4162158344519	20/04/28 05:11:25
1	83	342.67314822464954	269.3257047629195	20/04/28 05:11:25
1	83	342.5162011463243	269.10974136693676	20/04/28 05:11:25
1	83	342.40588062768313	269.276641730595	20/04/28 05:11:25
1	83	342.3048620903167	269.3309590622451	20/04/28 05:11:25
1	83	342.2966109483295	269.33513329883226	20/04/28 05:11:25
1	83	342.31894650152026	269.27461516499534	20/04/28 05:11:26
1	83	342.2712936169885	269.24571094336005	20/04/28 05:11:26
1	83	342.3198567867951	269.2744060140374	20/04/28 05:11:26
1	83	342.3154125511636	269.27050853779843	20/04/28 05:11:26
1	83	342.45206192569583	269.3982407305696	20/04/28 05:11:26
1	83	342.6022834328351	269.4881974765236	20/04/28 05:11:26
1	83	342.6428756393299	269.57154857991793	20/04/28 05:11:26
1	83	342.73058257247567	269.4654065772485	20/04/28 05:11:26
1	83	342.7219562050843	269.4994276829422	20/04/28 05:11:26
1	83	342.9287060779595	269.4684099516662	20/04/28 05:11:26
1	83	342.79650876006895	269.26640679700785	20/04/28 05:11:27
1	83	343.01099887039396	269.08277373644336	20/04/28 05:11:27
1	83	342.88990908061277	269.10164986112505	20/04/28 05:11:27
1	83	343.1339067146304	269.2622149879915	20/04/28 05:11:27
1	83	343.1333164532534	269.32214033172437	20/04/28 05:11:27
1	83	343.0056932525962	269.0694807218613	20/04/28 05:11:27
1	83	343.05226918479616	268.8959613935122	20/04/28 05:11:27
1	83	343.0886822460969	268.9016470817798	20/04/28 05:11:27
1	83	342.8985054237701	268.70716344720904	20/04/28 05:11:27
1	83	342.74647839461727	268.9483122617111	20/04/28 05:11:27
1	83	342.50759954417043	268.95554963107423	20/04/28 05:11:28
1	83	342.5247297665344	269.0499549509982	20/04/28 05:11:28
1	83	342.4859426509922	269.07220002245265	20/04/28 05:11:28
1	83	342.431777796559	268.85508086225235	20/04/28 05:11:28
1	83	342.44704364035664	268.8618538958836	20/04/28 05:11:28
1	83	342.47460560023745	268.8126225318701	20/04/28 05:11:28
1	83	342.5336495350425	268.8758771139167	20/04/28 05:11:28
1	83	342.2903790626457	268.9655508485275	20/04/28 05:11:28
1	83	342.4299581354701	268.8563544616602	20/04/28 05:11:28
1	83	342.45734854783325	268.89336263520346	20/04/28 05:11:29
1	83	342.45571120985227	268.83852920244294	20/04/28 05:11:29
1	83	342.51524721094165	268.77123926013945	20/04/28 05:11:29
1	83	342.6830378127745	268.7787822077988	20/04/28 05:11:29
1	83	342.752544791456	268.6860404423606	20/04/28 05:11:29
1	83	342.752544791456	268.6860404423606	20/04/28 05:11:29
1	83	342.72349122679714	268.93226195842374	20/04/28 05:11:29
1	83	342.73114370841995	268.9352852943291	20/04/28 05:11:29
1	83	342.82618164909604	268.819650853403	20/04/28 05:11:29
1	83	343.137548645144	268.9240588268263	20/04/28 05:11:29
1	83	343.1488948222005	268.89119160510415	20/04/28 05:11:30
1	83	343.036266070962	268.98054886440053	20/04/28 05:11:30
1	83	343.04353534919613	268.9169690388208	20/04/28 05:11:30
1	83	343.0729027363063	268.95522782503457	20/04/28 05:11:30
1	83	343.15158906221683	268.92998778971076	20/04/28 05:11:30
1	83	342.8616196155592	268.95788134777166	20/04/28 05:11:30
1	83	342.70903914780627	268.769466431202	20/04/28 05:11:30
1	83	342.86400653397067	268.97136379118314	20/04/28 05:11:30
1	83	342.84040162389357	269.238731431751	20/04/28 05:11:30
1	83	342.81381819620873	269.3464672533551	20/04/28 05:11:31
1	83	342.94575208997276	269.45573941237865	20/04/28 05:11:31
1	83	342.92054577350524	269.187797296299	20/04/28 05:11:31
1	83	342.977791243996	269.2493131644063	20/04/28 05:11:31
1	83	342.97898021023997	269.24281735657144	20/04/28 05:11:31
1	83	342.97898021023997	269.24281735657144	20/04/28 05:11:31
1	83	342.9840783675342	269.19013254018137	20/04/28 05:11:31
1	83	342.9520216221697	269.1802261203145	20/04/28 05:11:31
1	83	343.14726402186665	269.3548571932164	20/04/28 05:11:31
1	83	342.9464802741471	269.4770288790119	20/04/28 05:11:31
1	83	342.8875224617549	269.3913499575636	20/04/28 05:11:32
1	83	342.83014279982115	269.27956127660326	20/04/28 05:11:32
1	83	342.83014279982115	269.27956127660326	20/04/28 05:11:32
1	83	342.90395263809825	269.33557794933836	20/04/28 05:11:32
1	83	343.1523598025859	269.2452983568179	20/04/28 05:11:32
1	83	343.1523598025859	269.2452983568179	20/04/28 05:11:32
1	83	343.0123740856835	269.45521406566127	20/04/28 05:11:32
1	83	343.108692518881	269.6690643322263	20/04/28 05:11:32
1	83	343.0192692084594	269.67736407480805	20/04/28 05:11:32
1	83	343.24250712101673	269.74371113217796	20/04/28 05:11:32
1	83	342.98912825015833	269.68365524533965	20/04/28 05:11:33
1	83	343.2129063102485	269.52764862445196	20/04/28 05:11:33
1	83	343.2129063102485	269.52764862445196	20/04/28 05:11:33
1	83	343.2112214377227	269.4897488969621	20/04/28 05:11:33
1	83	343.18925001813267	269.4454110781501	20/04/28 05:11:33
1	83	343.2285630639509	269.42799649037283	20/04/28 05:11:33
1	83	343.2248930922098	269.4299066672494	20/04/28 05:11:33
1	83	343.01713797784464	269.51831578082454	20/04/28 05:11:33
1	83	343.01713797784464	269.51831578082454	20/04/28 05:11:33
1	83	343.03780626488174	269.23390868332046	20/04/28 05:11:34
1	83	342.93192785613894	269.1107614083477	20/04/28 05:11:34
1	83	343.00170927487676	268.992089052881	20/04/28 05:11:34
1	83	343.11272291781813	268.8236675776071	20/04/28 05:11:34
1	83	342.93187378084025	268.8614839690155	20/04/28 05:11:34
1	83	342.90878935752363	269.05053912183365	20/04/28 05:11:34
1	83	342.90878935752363	269.05053912183365	20/04/28 05:11:34
1	83	343.1141137797507	268.84593058724926	20/04/28 05:11:34
1	83	343.17001908359885	268.86120498094925	20/04/28 05:11:34
1	83	343.1314502399364	269.0675702976727	20/04/28 05:11:34
1	83	343.0681650602224	269.26525005343757	20/04/28 05:11:35
1	83	342.8873021759595	269.34060413303825	20/04/28 05:11:35
1	83	343.12344288353177	269.38845809205304	20/04/28 05:11:35
1	83	343.10580602744164	269.340813150482	20/04/28 05:11:35
1	83	343.10086393987905	269.05038983493074	20/04/28 05:11:35
1	83	342.96299580526414	269.2901807973597	20/04/28 05:11:35
1	83	342.80976516200485	269.2640978369785	20/04/28 05:11:35
1	83	342.85926468895246	269.52409373027683	20/04/28 05:11:35
1	83	342.9422514399111	269.5285235989867	20/04/28 05:11:35
1	83	342.96334644093025	269.64316972854357	20/04/28 05:11:36
1	83	343.030021245484	269.6982192431163	20/04/28 05:11:36
1	83	343.25717129374453	269.6039050234015	20/04/28 05:11:36
1	83	343.26530565026485	269.6351334730891	20/04/28 05:11:36
1	83	343.239168435413	269.63264114252	20/04/28 05:11:36
1	83	343.1955442014313	269.5624040617183	20/04/28 05:11:36
1	83	343.1878580701716	269.4708499051056	20/04/28 05:11:36
1	83	343.06451413518454	269.574318554048	20/04/28 05:11:36
1	83	342.997697669225	269.7695544691191	20/04/28 05:11:36
1	83	342.98383271996886	269.56882242729523	20/04/28 05:11:36
1	83	342.92838137278295	269.61781645230116	20/04/28 05:11:37
1	83	342.82739982165185	269.4986158384335	20/04/28 05:11:37
1	83	342.96245111964527	269.38003967202144	20/04/28 05:11:37
1	83	343.19949592322723	269.34413098575453	20/04/28 05:11:37
1	83	343.11097816062056	269.29337439078597	20/04/28 05:11:37
1	83	343.10912102311073	269.32421803404816	20/04/28 05:11:37
1	83	343.2486932044406	269.1418242737359	20/04/28 05:11:37
1	83	343.3122520698498	269.08113278326925	20/04/28 05:11:37
1	83	343.26847114010485	268.863502764379	20/04/28 05:11:37
1	83	343.55776033997387	268.7927605201347	20/04/28 05:11:38
1	83	343.6485984058667	268.91336195879467	20/04/28 05:11:38
1	83	343.5609563670934	269.1862944008167	20/04/28 05:11:38
1	83	343.6159309881614	269.20013884727683	20/04/28 05:11:38
1	83	343.6359726683277	269.364552012059	20/04/28 05:11:38
1	83	343.67685811084937	269.19835976878704	20/04/28 05:11:38
1	83	343.5135938351032	269.08263882578217	20/04/28 05:11:38
1	83	343.4937992161998	269.1378400564407	20/04/28 05:11:38
1	83	343.5174516324003	269.09914165836744	20/04/28 05:11:38
1	83	343.51428983931874	269.15189895459594	20/04/28 05:11:38
1	83	343.3135741142196	268.93244493672853	20/04/28 05:11:39
1	83	343.4070197206326	268.9780326468363	20/04/28 05:11:39
1	83	343.34613073495393	268.96406442076676	20/04/28 05:11:39
1	83	343.2541082415614	269.2448708002857	20/04/28 05:11:39
1	83	343.3929081431693	269.40614322244306	20/04/28 05:11:39
1	83	343.4336852002266	269.2660014625543	20/04/28 05:11:39
1	83	343.50286334542506	269.53102124694374	20/04/28 05:11:39
1	83	343.46798670678737	269.4791774756071	20/04/28 05:11:39
1	83	343.34775881121294	269.4167799983279	20/04/28 05:11:39
1	83	343.3666086066193	269.469031908144	20/04/28 05:11:39
1	83	343.2911218043308	269.64397529002366	20/04/28 05:11:40
1	83	343.2025568306144	269.69611791981015	20/04/28 05:11:40
1	83	343.21453690845465	269.56575541104837	20/04/28 05:11:40
1	83	343.21450983975905	269.565867115084	20/04/28 05:11:40
1	83	343.1459469441798	269.7737210147438	20/04/28 05:11:40
1	83	342.91668659394827	269.6155187679732	20/04/28 05:11:40
1	83	342.89297375184003	269.79658865654636	20/04/28 05:11:40
1	83	343.01094249080734	269.68305780273005	20/04/28 05:11:40
1	83	343.00537454161156	269.84909408571485	20/04/28 05:11:40
1	83	342.8275767259599	269.86600714845173	20/04/28 05:11:41
1	83	342.7757174023772	269.97642842201503	20/04/28 05:11:41
1	83	342.5595918838546	270.1568081943932	20/04/28 05:11:41
1	83	342.34071560903874	270.2587368374467	20/04/28 05:11:41
1	83	342.1619832717428	270.2679897203156	20/04/28 05:11:41
1	83	342.16524988438306	270.2615810832364	20/04/28 05:11:41
1	83	342.3515252021259	270.056355339595	20/04/28 05:11:41
1	83	342.1363034754134	269.8790476713849	20/04/28 05:11:41
1	83	342.1626035633812	269.89989577875036	20/04/28 05:11:41
1	83	342.0151054264415	269.96961638668654	20/04/28 05:11:41
1	83	341.986603414954	269.9047773739838	20/04/28 05:11:42
1	83	341.9108035792699	269.9753553885946	20/04/28 05:11:42
1	83	341.9108035792699	269.9753553885946	20/04/28 05:11:42
