floorId	partitionId	location_x	location_y	timeStamp
1	97	339.3316958212385	293.16830878479925	20/04/28 05:13:52
1	97	339.5135726499866	293.3240447089583	20/04/28 05:13:52
1	97	339.41093364362024	293.19710873128383	20/04/28 05:13:52
1	97	339.55160743950495	293.302707268701	20/04/28 05:13:52
1	97	339.8098690732991	293.2412353356106	20/04/28 05:13:52
1	97	339.81498729520615	293.22997612925286	20/04/28 05:13:52
1	97	339.75338500723177	293.1208232973361	20/04/28 05:13:52
1	97	339.71909323679967	293.1509042708379	20/04/28 05:13:52
1	97	339.8585879796303	293.1633964524157	20/04/28 05:13:53
1	97	339.85968275430463	293.13518286907964	20/04/28 05:13:53
1	97	340.1066341965169	293.0733300998301	20/04/28 05:13:53
1	97	339.98826480553544	292.9717399044841	20/04/28 05:13:53
1	97	339.8953224369418	292.95995955287333	20/04/28 05:13:53
1	97	339.7377756938421	292.9715289193241	20/04/28 05:13:53
1	97	339.8179761489422	292.9430026311669	20/04/28 05:13:53
1	97	339.8781904704485	293.1074363835657	20/04/28 05:13:53
1	97	339.9939579612707	292.91376425818584	20/04/28 05:13:53
1	97	339.9745151381643	292.9410444614137	20/04/28 05:13:53
1	97	340.0200721699391	292.9022610496807	20/04/28 05:13:54
1	97	339.8180209642045	292.9666427492243	20/04/28 05:13:54
1	97	339.8577895861121	293.0243829911462	20/04/28 05:13:54
1	97	339.815565023649	293.0142426747805	20/04/28 05:13:54
1	97	339.91680331918764	293.07405510135044	20/04/28 05:13:54
1	97	339.8021340749238	293.08635560102624	20/04/28 05:13:54
1	97	339.79103205079036	293.0629028971336	20/04/28 05:13:54
1	97	339.77545213155287	293.000114787982	20/04/28 05:13:54
1	97	339.7530091435088	292.98387821012875	20/04/28 05:13:54
1	97	339.7614206647987	292.7774697649318	20/04/28 05:13:55
1	97	339.8390101896856	292.8192700505367	20/04/28 05:13:55
1	97	339.8062357108847	292.84354644066485	20/04/28 05:13:55
1	97	339.8912343094935	292.84156689764336	20/04/28 05:13:55
1	97	339.95869148380086	292.92147724103336	20/04/28 05:13:55
1	97	339.94377799397796	292.90424088801416	20/04/28 05:13:55
1	97	339.94475085150196	292.8390084923589	20/04/28 05:13:55
1	97	340.1176323064211	292.8759713553726	20/04/28 05:13:55
1	97	340.1180127459959	292.76894939764486	20/04/28 05:13:55
1	97	340.14357544040246	292.76434954661227	20/04/28 05:13:55
1	97	340.1154946924326	292.6869675969427	20/04/28 05:13:56
1	97	340.3088167644243	292.76344461659266	20/04/28 05:13:56
1	97	340.273127762416	292.80383394443425	20/04/28 05:13:56
1	97	340.1964560983065	292.56765354743936	20/04/28 05:13:56
1	97	340.2164162094061	292.61327981448215	20/04/28 05:13:56
1	97	340.13007747346177	292.4771251928181	20/04/28 05:13:56
1	97	339.8914086237967	292.5574169388078	20/04/28 05:13:56
1	97	339.95701457437235	292.54329480894296	20/04/28 05:13:56
1	97	339.9132246179389	292.5163523407288	20/04/28 05:13:56
1	97	339.9593578123393	292.51014986960547	20/04/28 05:13:57
1	97	339.9029566577626	292.35735920682527	20/04/28 05:13:57
1	97	339.8230316904453	292.60146891372364	20/04/28 05:13:57
1	97	339.91053441613906	292.60175627591224	20/04/28 05:13:57
1	97	339.6545026620798	292.716251983324	20/04/28 05:13:57
1	97	339.6309630746864	292.7081774195688	20/04/28 05:13:57
1	97	339.6709368079995	292.7550424825219	20/04/28 05:13:57
1	97	339.8332968849933	292.96820369309756	20/04/28 05:13:57
1	97	339.9039680945688	293.1365425708752	20/04/28 05:13:57
1	97	340.07987162140137	293.3492023955593	20/04/28 05:13:57
1	97	340.29002749668877	293.20205419749107	20/04/28 05:13:58
1	97	340.23899814637224	293.0902728735306	20/04/28 05:13:58
1	97	340.4372823490632	292.9921805691602	20/04/28 05:13:58
1	97	340.58921484286293	293.1823623222724	20/04/28 05:13:58
1	97	340.43801642666295	293.29493893492753	20/04/28 05:13:58
1	97	340.4183926484658	293.3278094448611	20/04/28 05:13:58
1	97	340.4030671382063	293.2866422891753	20/04/28 05:13:58
1	97	340.32497500147497	293.425172335181	20/04/28 05:13:58
1	97	340.1112610419514	293.4674226552113	20/04/28 05:13:58
1	97	340.09255315493846	293.42158531387514	20/04/28 05:13:58
1	97	340.12704637684965	293.32686633431194	20/04/28 05:13:59
1	97	340.25691350635356	293.3590636422428	20/04/28 05:13:59
1	97	340.0712703565892	293.23833648927	20/04/28 05:13:59
1	97	340.2783777817223	293.1264073046535	20/04/28 05:13:59
1	97	340.29068295661904	293.1387764041176	20/04/28 05:13:59
1	97	340.43531142825566	292.89177283369577	20/04/28 05:13:59
1	97	340.4403369556036	292.96757839015146	20/04/28 05:13:59
1	97	340.4191368904096	292.9902552545685	20/04/28 05:13:59
1	97	340.4335905080474	293.1232631489086	20/04/28 05:13:59
1	97	340.591413909076	293.33312924286764	20/04/28 05:14:00
1	97	340.5772307900393	293.36139710278917	20/04/28 05:14:00
1	97	340.55150769037004	293.1222681318306	20/04/28 05:14:00
1	97	340.7312101880449	293.0267154981178	20/04/28 05:14:00
1	97	340.57937539444373	292.8788169462824	20/04/28 05:14:00
1	97	340.7872100775661	293.0353957918412	20/04/28 05:14:00
1	97	340.7124998271166	292.9497562661897	20/04/28 05:14:00
1	97	340.6235883081635	292.85815946581687	20/04/28 05:14:00
1	97	340.4448751450517	293.0689925069774	20/04/28 05:14:00
1	97	340.4628110029603	293.0629145898763	20/04/28 05:14:00
1	97	340.254440896287	293.21476054039647	20/04/28 05:14:01
1	97	340.5068391428538	293.21964060855	20/04/28 05:14:01
1	97	340.44589985452325	293.35386210314397	20/04/28 05:14:01
1	97	340.515791552468	293.4022177523879	20/04/28 05:14:01
1	97	340.564884380754	293.42538261952956	20/04/28 05:14:01
1	97	340.62599918388383	293.36008939903127	20/04/28 05:14:01
1	97	340.70733612278735	293.20896368416595	20/04/28 05:14:01
1	97	340.77232143209693	293.324394814865	20/04/28 05:14:01
1	97	340.78217013522135	293.3959984370057	20/04/28 05:14:01
1	97	340.8050776146033	293.4552892729064	20/04/28 05:14:01
1	97	340.78714376824894	293.38408922011405	20/04/28 05:14:02
1	97	340.8318724343972	293.1137295000268	20/04/28 05:14:02
1	97	340.983585860907	293.1551880809426	20/04/28 05:14:02
1	97	340.9014096450533	293.3953976579753	20/04/28 05:14:02
1	97	340.98436114366626	293.4403439689419	20/04/28 05:14:02
1	97	340.8380983279972	293.3547879371822	20/04/28 05:14:02
1	97	340.68450067771363	293.29192459256467	20/04/28 05:14:02
1	97	340.7152172967896	293.0992740326992	20/04/28 05:14:02
1	97	340.6425933633859	293.28916329510844	20/04/28 05:14:02
1	97	340.60503002728836	293.36945706292386	20/04/28 05:14:03
1	97	340.74258217817317	293.35915660820507	20/04/28 05:14:03
1	97	340.7089973066307	293.16452921523523	20/04/28 05:14:03
1	97	340.6778301759095	293.0474862621848	20/04/28 05:14:03
1	97	340.6986293701252	293.1212400698588	20/04/28 05:14:03
1	97	340.7048844063654	293.15966720535005	20/04/28 05:14:03
1	97	340.60238831773376	293.0354242777992	20/04/28 05:14:03
1	97	340.5892667189273	292.83436012981247	20/04/28 05:14:03
1	97	340.6325624061736	292.71467017828434	20/04/28 05:14:03
1	97	340.5325284713435	292.7220816807231	20/04/28 05:14:03
1	97	340.4594177268895	292.8461104033145	20/04/28 05:14:04
1	97	340.44871405628425	292.86099054174133	20/04/28 05:14:04
1	97	340.3032919744431	292.79860842873455	20/04/28 05:14:04
1	97	340.27864820051417	292.79289210869825	20/04/28 05:14:04
1	97	340.4034141928537	292.84035671061685	20/04/28 05:14:04
1	97	340.5456860617277	292.8600952197472	20/04/28 05:14:04
1	97	340.297900637748	292.7140199936616	20/04/28 05:14:04
1	97	340.27755794218575	292.64217902693906	20/04/28 05:14:04
1	97	340.2788779031658	292.48568529599197	20/04/28 05:14:04
1	97	340.23684366241724	292.2462562157132	20/04/28 05:14:04
1	97	340.212045435174	292.0080837057938	20/04/28 05:14:05
1	97	340.22220826693814	291.99931586803046	20/04/28 05:14:05
1	97	340.2373343321066	292.1477307969587	20/04/28 05:14:05
1	97	340.233028878653	292.1596560504057	20/04/28 05:14:05
1	97	340.04487086292255	292.340368177455	20/04/28 05:14:05
1	97	340.01588998323075	292.36998001449064	20/04/28 05:14:05
1	97	340.0483841795765	292.33452241824745	20/04/28 05:14:05
1	97	339.9780354612106	292.1822806992723	20/04/28 05:14:05
1	97	340.04422278612896	292.16150989431867	20/04/28 05:14:05
1	97	340.00398883005465	292.04070056124783	20/04/28 05:14:06
1	97	340.1653775379097	292.09628903497406	20/04/28 05:14:06
1	97	339.94926580773347	291.8999720848434	20/04/28 05:14:06
1	97	339.9421080310716	292.18061896897586	20/04/28 05:14:06
1	97	339.92434295409697	292.2055970029492	20/04/28 05:14:06
1	97	339.8598012946113	292.19344106232126	20/04/28 05:14:06
1	97	339.9664280699912	292.269381526706	20/04/28 05:14:06
1	97	339.868732596437	292.22632681320124	20/04/28 05:14:06
1	97	339.8818883231698	292.26270620256486	20/04/28 05:14:06
1	97	339.59218610596827	292.21129877088975	20/04/28 05:14:06
1	97	339.55113550008184	292.2491728632498	20/04/28 05:14:07
1	97	339.3118515526947	292.34356498088886	20/04/28 05:14:07
1	97	339.3305101312027	292.5048024103544	20/04/28 05:14:07
1	97	339.3274395060242	292.5035369349927	20/04/28 05:14:07
1	97	339.2896614134738	292.47315519108093	20/04/28 05:14:07
1	97	339.19034774907306	292.35348885169606	20/04/28 05:14:07
1	97	339.21500191625773	292.4859565234562	20/04/28 05:14:07
1	97	339.0676323970939	292.2370908040368	20/04/28 05:14:07
1	97	339.08660008719306	292.2106537320661	20/04/28 05:14:07
1	97	339.2247347374603	292.0157074522529	20/04/28 05:14:08
1	97	339.4209280215131	291.8047415336304	20/04/28 05:14:08
1	97	339.54950738447513	291.8971643223805	20/04/28 05:14:08
1	97	339.46243074260957	291.78937015098387	20/04/28 05:14:08
1	97	339.4002181072153	291.6391741627937	20/04/28 05:14:08
1	97	339.36672925787286	291.68978536317024	20/04/28 05:14:08
1	97	339.3605730729579	291.6824428767939	20/04/28 05:14:08
1	97	339.2205729361125	291.53245300418234	20/04/28 05:14:08
1	97	339.01691921215576	291.7449323949214	20/04/28 05:14:08
1	97	338.92307942792354	291.75523614121335	20/04/28 05:14:08
1	97	338.864383516205	291.6473569483572	20/04/28 05:14:09
1	97	339.0943709655718	291.55268244415566	20/04/28 05:14:09
1	97	338.9330995542713	291.5374539040076	20/04/28 05:14:09
1	97	339.197344437416	291.54593480021487	20/04/28 05:14:09
1	97	339.2063543702938	291.5846003545343	20/04/28 05:14:09
1	97	339.2012810416475	291.6924576859738	20/04/28 05:14:09
1	97	339.03343874095185	291.75508411318816	20/04/28 05:14:09
1	97	338.9984698278694	291.86641223497276	20/04/28 05:14:09
1	97	339.0301835074188	292.0241402094754	20/04/28 05:14:09
1	97	339.0823438679576	291.7455063556235	20/04/28 05:14:09
1	97	339.0119138046305	291.8608048058033	20/04/28 05:14:10
1	97	339.2548363275149	291.87488201900635	20/04/28 05:14:10
1	97	339.24235062919286	291.7683316080806	20/04/28 05:14:10
1	97	339.11286458438315	291.651202635734	20/04/28 05:14:10
1	97	339.11286458438315	291.651202635734	20/04/28 05:14:10
1	97	339.11286458438315	291.651202635734	20/04/28 05:14:10
1	97	339.06816181804504	291.55946696061403	20/04/28 05:14:10
1	97	339.30765789915114	291.6233685233085	20/04/28 05:14:10
1	97	339.2719947002044	291.87901578733516	20/04/28 05:14:10
1	97	339.26938923368414	291.8755239112678	20/04/28 05:14:11
1	97	339.28713430663095	291.88802968832306	20/04/28 05:14:11
1	97	339.292586785942	291.8687064216621	20/04/28 05:14:11
1	97	339.2433844017512	291.86520539974055	20/04/28 05:14:11
1	97	339.2169252516265	291.8188405458147	20/04/28 05:14:11
1	97	339.3614198208475	291.6972807205903	20/04/28 05:14:11
1	97	339.606116714165	291.56044749465224	20/04/28 05:14:11
1	97	339.86049079725854	291.59511105139734	20/04/28 05:14:11
1	97	339.71152548830133	291.47558370213665	20/04/28 05:14:11
1	97	339.54264957751315	291.53523978625634	20/04/28 05:14:11
1	97	339.54045827983094	291.5621311800996	20/04/28 05:14:12
1	97	339.70384879934164	291.6489118604681	20/04/28 05:14:12
1	97	339.5543380036144	291.55860642168795	20/04/28 05:14:12
1	97	339.5572378678575	291.8238233601126	20/04/28 05:14:12
1	97	339.60243556314066	291.74674727304273	20/04/28 05:14:12
1	97	339.69849649892075	291.7987937607286	20/04/28 05:14:12
1	97	339.6001059307437	291.61083316227206	20/04/28 05:14:12
1	97	339.5924109699582	291.6257441096063	20/04/28 05:14:12
1	97	339.47970330255464	291.43102781930827	20/04/28 05:14:12
1	97	339.4564504141244	291.44535481890944	20/04/28 05:14:13
1	97	339.4662919251424	291.4483013184776	20/04/28 05:14:13
1	97	339.4723811699498	291.3424153913306	20/04/28 05:14:13
1	97	339.41680620274195	291.32963713046905	20/04/28 05:14:13
1	97	339.56934587772344	291.40631159819014	20/04/28 05:14:13
1	97	339.5802822258061	291.42844583921163	20/04/28 05:14:13
1	97	339.6886420383597	291.4979857491512	20/04/28 05:14:13
1	97	339.8598577808408	291.70027593215707	20/04/28 05:14:13
1	97	339.99649706678656	291.4975373643999	20/04/28 05:14:13
1	97	340.2390121615683	291.4144372939548	20/04/28 05:14:13
1	97	340.2153782312017	291.2887283194108	20/04/28 05:14:14
1	97	340.22140259388976	291.41802773606213	20/04/28 05:14:14
1	97	340.34296679850854	291.5387855649541	20/04/28 05:14:14
1	97	340.3289779450008	291.5518011797325	20/04/28 05:14:14
1	97	340.3655641064768	291.33012234140887	20/04/28 05:14:14
1	97	340.355074579742	291.04757733109284	20/04/28 05:14:14
1	97	340.283248177052	291.2015539789518	20/04/28 05:14:14
1	97	340.20163198241755	291.1070267101734	20/04/28 05:14:14
1	97	340.1349662818452	290.9490388287159	20/04/28 05:14:14
1	97	340.11997121526514	291.00248211949713	20/04/28 05:14:14
1	97	339.98479424741106	290.94296820895073	20/04/28 05:14:15
1	97	339.9797971805274	290.9246622538077	20/04/28 05:14:15
1	97	339.90015564926915	291.1992008045478	20/04/28 05:14:15
1	97	340.0098419517132	291.20489561219114	20/04/28 05:14:15
1	97	339.8747891109946	291.0432299720749	20/04/28 05:14:15
1	97	339.7956564069918	291.2622757759732	20/04/28 05:14:15
1	97	339.68810618846663	291.38575530327216	20/04/28 05:14:15
1	97	339.65337257644927	291.45692500598375	20/04/28 05:14:15
1	97	339.6210097829769	291.5122600028514	20/04/28 05:14:15
1	97	339.8348959979393	291.46844635035393	20/04/28 05:14:16
1	97	339.8381429800319	291.47714753615446	20/04/28 05:14:16
1	97	339.9912831555133	291.6101671484972	20/04/28 05:14:16
1	97	340.13088611744683	291.53073461892404	20/04/28 05:14:16
1	97	339.9736077719326	291.48920453874143	20/04/28 05:14:16
1	97	340.20106343149496	291.677289547373	20/04/28 05:14:16
1	97	340.33520960683904	291.9389263814157	20/04/28 05:14:16
1	97	340.3295273161391	291.65646119786567	20/04/28 05:14:16
1	97	340.14812601845466	291.4515397234176	20/04/28 05:14:16
1	97	340.25268297835646	291.5097240335239	20/04/28 05:14:16
1	97	340.1466496842411	291.54784648711245	20/04/28 05:14:17
1	97	340.13884854021626	291.57912662800913	20/04/28 05:14:17
1	97	340.1377718963375	291.4649237896447	20/04/28 05:14:17
1	97	339.9995784131158	291.41467876571585	20/04/28 05:14:17
1	97	340.2019693165131	291.27448857388606	20/04/28 05:14:17
1	97	340.2713512981221	291.1263842708824	20/04/28 05:14:17
1	97	340.26339823368164	291.157416173236	20/04/28 05:14:17
1	97	340.1966769919572	291.32994766221464	20/04/28 05:14:17
1	97	340.1482598113293	291.3748511419894	20/04/28 05:14:17
1	97	339.9954493508516	291.2661649978375	20/04/28 05:14:17
1	97	339.9751593455809	291.41257857124316	20/04/28 05:14:18
1	97	339.98021003058955	291.59380433987485	20/04/28 05:14:18
1	97	340.21290740862094	291.7241482912617	20/04/28 05:14:18
1	97	340.1103327440727	291.83618174112945	20/04/28 05:14:18
1	97	340.0595889609007	291.92998249196626	20/04/28 05:14:18
1	97	340.0816863424379	291.9175609351005	20/04/28 05:14:18
1	97	340.18550086977797	292.0229399771779	20/04/28 05:14:18
1	97	340.1481693608298	292.01607561420474	20/04/28 05:14:18
1	97	340.14509403949677	292.00421671788143	20/04/28 05:14:18
1	97	339.8972533672239	292.0235357013304	20/04/28 05:14:19
1	97	340.1493996444057	291.9024410470299	20/04/28 05:14:19
1	97	340.00893631171834	291.7587494474179	20/04/28 05:14:19
1	97	340.0155054232749	291.752508087651	20/04/28 05:14:19
1	97	340.14563190804336	291.7276458366231	20/04/28 05:14:19
1	97	340.39345830318115	291.8701411840704	20/04/28 05:14:19
1	97	340.1875350386964	292.04758293795885	20/04/28 05:14:19
1	97	340.2619880624777	292.0052527367315	20/04/28 05:14:19
1	97	340.2999561223042	291.9306588774416	20/04/28 05:14:19
1	97	340.4043527619978	291.8604437308241	20/04/28 05:14:19
1	97	340.3963007176562	291.86811548572064	20/04/28 05:14:20
1	97	340.14900319485605	291.9892386601954	20/04/28 05:14:20
1	97	340.18027006460125	292.01122193405513	20/04/28 05:14:20
1	97	340.30904604847774	292.2571796365484	20/04/28 05:14:20
1	97	340.3110772296779	292.42996401784325	20/04/28 05:14:20
1	97	340.4888732015432	292.2287317371695	20/04/28 05:14:20
1	97	340.6802786674601	292.30939175781737	20/04/28 05:14:20
1	97	340.7014760010906	292.3950951185959	20/04/28 05:14:20
1	97	340.438773918665	292.41093889058027	20/04/28 05:14:20
1	97	340.56061282342745	292.49126668859265	20/04/28 05:14:21
1	97	340.2739456006543	292.41080836608256	20/04/28 05:14:21
1	97	340.2925901862183	292.3998608786627	20/04/28 05:14:21
1	97	340.38730913156024	292.33250358171006	20/04/28 05:14:21
1	97	340.41779228038536	292.31871627466074	20/04/28 05:14:21
1	97	340.3537853042623	292.09126526940196	20/04/28 05:14:21
1	97	340.3547928593123	292.0910211441866	20/04/28 05:14:21
1	97	340.342919371278	292.0857690498014	20/04/28 05:14:21
1	97	340.5639871861221	292.06100420783827	20/04/28 05:14:21
1	97	340.3387810206346	292.1879657802078	20/04/28 05:14:21
1	97	340.3368238836455	292.18786047606716	20/04/28 05:14:22
1	97	340.2891820524503	292.0052448878928	20/04/28 05:14:22
1	97	340.2404943451017	292.0068495011558	20/04/28 05:14:22
1	97	340.18954728032054	291.9830139174286	20/04/28 05:14:22
1	97	340.27396047398514	292.01829271256344	20/04/28 05:14:22
1	97	340.2776979485228	291.9747330746008	20/04/28 05:14:22
1	97	340.24992465272663	292.1351441276505	20/04/28 05:14:22
1	97	340.11245124026357	292.1551522623343	20/04/28 05:14:22
1	97	340.19953872474866	292.3641241466061	20/04/28 05:14:22
1	97	340.1261100599616	292.21121031723794	20/04/28 05:14:22
1	97	340.1063444050321	292.26945255278565	20/04/28 05:14:23
1	97	340.0885368457675	292.1861280932642	20/04/28 05:14:23
1	97	340.3608707221558	292.1894551481321	20/04/28 05:14:23
1	97	340.3550474277187	292.3481827047391	20/04/28 05:14:23
1	97	340.4966687122822	292.5317799725127	20/04/28 05:14:23
1	97	340.81028304103086	292.45073155814356	20/04/28 05:14:23
1	97	340.77442564608737	292.4656946740914	20/04/28 05:14:23
1	97	340.73842922191005	292.26407283865944	20/04/28 05:14:23
1	97	340.75130414530463	292.28312922919474	20/04/28 05:14:23
1	97	340.75130414530463	292.28312922919474	20/04/28 05:14:24
1	97	340.5813968312156	292.5167978633232	20/04/28 05:14:24
1	97	340.66782485564556	292.4668812123823	20/04/28 05:14:24
1	97	340.77882267588853	292.2916703573017	20/04/28 05:14:24
1	97	340.59200528282287	292.19353981025677	20/04/28 05:14:24
1	97	340.59200528282287	292.19353981025677	20/04/28 05:14:24
1	97	340.52752595663725	292.2065107427833	20/04/28 05:14:24
1	97	340.52752595663725	292.2065107427833	20/04/28 05:14:24
1	97	340.35914383010373	291.98380185593373	20/04/28 05:14:24
1	97	340.4103131645115	292.02392075261827	20/04/28 05:14:24
1	97	340.31292665244735	292.2415877651813	20/04/28 05:14:25
1	97	340.4719277277451	292.1233648560324	20/04/28 05:14:25
1	97	340.29458104175586	292.12497971521987	20/04/28 05:14:25
1	97	340.12058124940467	292.11564480405264	20/04/28 05:14:25
1	97	340.04538254955673	292.1360591506103	20/04/28 05:14:25
1	97	340.2094823030866	291.95394144956435	20/04/28 05:14:25
1	97	340.1746585199647	291.94897914623135	20/04/28 05:14:25
1	97	339.9379563907713	292.0916324224633	20/04/28 05:14:25
1	97	339.71252232027877	292.1314660900386	20/04/28 05:14:25
1	97	339.86954889148484	292.16489893337194	20/04/28 05:14:26
1	97	339.7918196019915	292.1208141371446	20/04/28 05:14:26
1	97	339.72631576048184	292.19601921330724	20/04/28 05:14:26
1	97	339.75706486695543	292.3099020157178	20/04/28 05:14:26
1	97	339.8516195301105	292.035010111502	20/04/28 05:14:26
1	97	339.89414142373107	292.04460907755873	20/04/28 05:14:26
1	97	339.82558458588045	291.8289613421448	20/04/28 05:14:26
1	97	339.7288536390445	291.92334307957367	20/04/28 05:14:26
1	97	339.6655109572219	291.99589978357056	20/04/28 05:14:26
1	97	339.65413036719485	291.709614184748	20/04/28 05:14:26
1	97	339.7861158388781	291.8693679728495	20/04/28 05:14:27
1	97	339.7927006672581	291.88079326557903	20/04/28 05:14:27
1	97	339.69137642397965	291.89264260328656	20/04/28 05:14:27
1	97	339.69786779142834	291.8328653103239	20/04/28 05:14:27
1	97	339.6252436634025	291.7713623250641	20/04/28 05:14:27
1	97	339.6252436634025	291.7713623250641	20/04/28 05:14:27
1	97	339.6174728720142	291.7791108541701	20/04/28 05:14:27
1	97	339.6218393577272	291.77936203938316	20/04/28 05:14:27
1	97	339.81873508166234	291.80944356060695	20/04/28 05:14:27
1	97	339.82342425082913	291.7824690732987	20/04/28 05:14:27
1	97	340.0354416543759	291.84657590976354	20/04/28 05:14:28
1	97	340.1344445120386	291.8463727922406	20/04/28 05:14:28
1	97	340.0152203568118	291.92232421040643	20/04/28 05:14:28
1	97	339.7315527991668	291.83296515224305	20/04/28 05:14:28
1	97	339.6171024302108	291.62137738658714	20/04/28 05:14:28
1	97	339.7168188916717	291.7859691750048	20/04/28 05:14:28
1	97	339.6666730474044	291.80743909231654	20/04/28 05:14:28
1	97	339.7402930043392	291.7677767698029	20/04/28 05:14:28
1	97	339.88516995121154	291.5294887210346	20/04/28 05:14:28
1	97	339.7694825943161	291.48003288498074	20/04/28 05:14:28
1	97	339.9297095261271	291.264683533811	20/04/28 05:14:29
1	97	340.02019285015655	291.01427103520984	20/04/28 05:14:29
1	97	340.1180734715576	291.2401894003983	20/04/28 05:14:29
1	97	340.24827981355645	291.29697287376024	20/04/28 05:14:29
1	97	340.408500320139	291.21095163845314	20/04/28 05:14:29
1	97	340.4970829034126	291.30357288525636	20/04/28 05:14:29
1	97	340.4913022074401	291.2318875124143	20/04/28 05:14:29
1	97	340.50356621487845	291.227573746207	20/04/28 05:14:29
1	97	340.5478628848573	291.0347367149165	20/04/28 05:14:29
1	97	340.46086013127876	290.9315069269315	20/04/28 05:14:30
1	97	340.54989425872833	291.0079321736235	20/04/28 05:14:30
1	97	340.5353114153213	291.0392743059268	20/04/28 05:14:30
1	97	340.61396603032057	291.0591057153697	20/04/28 05:14:30
1	97	340.4222576768057	291.18660556410623	20/04/28 05:14:30
1	97	340.46801302857364	290.91580494185587	20/04/28 05:14:30
1	97	340.5638538287331	290.81257240003487	20/04/28 05:14:30
1	97	340.4668028557423	290.72303524313696	20/04/28 05:14:30
1	97	340.49103867413413	290.6288311273669	20/04/28 05:14:30
1	97	340.4762931357739	290.56640845816344	20/04/28 05:14:30
1	97	340.6056436790423	290.5047387497757	20/04/28 05:14:31
1	97	340.62312233857676	290.42834994121665	20/04/28 05:14:31
1	97	340.8344941748969	290.27119482461865	20/04/28 05:14:31
1	97	340.84782243519356	290.31546075146144	20/04/28 05:14:31
1	97	340.7501597912714	290.2531996729715	20/04/28 05:14:31
1	97	340.7949356999038	290.3748813759728	20/04/28 05:14:31
1	97	340.785532064904	290.38087877603385	20/04/28 05:14:31
1	97	340.58390874888266	290.359859144793	20/04/28 05:14:31
1	97	340.64464548619463	290.433109127028	20/04/28 05:14:31
1	97	340.5904149961616	290.3887685112573	20/04/28 05:14:31
1	97	340.70197278013427	290.54888430995373	20/04/28 05:14:32
1	97	340.76561327590906	290.3395788181649	20/04/28 05:14:32
1	97	340.8714588178685	290.3434676740616	20/04/28 05:14:32
1	97	340.9308802142251	290.6102807975747	20/04/28 05:14:32
1	97	340.9279114021768	290.61672037512204	20/04/28 05:14:32
1	97	340.78765929517067	290.71037545450815	20/04/28 05:14:32
1	97	340.81269992984284	290.72265487097917	20/04/28 05:14:32
1	97	340.6545750574199	290.49675498440297	20/04/28 05:14:32
1	97	340.46980328140376	290.35106458705735	20/04/28 05:14:32
1	97	340.6202116419874	290.21722561064234	20/04/28 05:14:33
1	97	340.77852120594474	290.0542008565665	20/04/28 05:14:33
1	97	340.7938592168859	290.1415396789448	20/04/28 05:14:33
1	97	340.7106641398406	290.12859300075127	20/04/28 05:14:33
1	97	340.71252673270334	290.2211487301433	20/04/28 05:14:33
1	97	340.7970200557342	290.2494421902032	20/04/28 05:14:33
1	97	340.6914717370788	290.4139473017623	20/04/28 05:14:33
1	97	340.56338079832335	290.2723279405715	20/04/28 05:14:33
1	97	340.5865046925619	290.2455130916386	20/04/28 05:14:33
1	97	340.370204874742	290.2393714041263	20/04/28 05:14:33
1	97	340.0946324493958	290.2120532492542	20/04/28 05:14:34
1	97	339.85762091330196	290.3904078590865	20/04/28 05:14:34
1	97	339.81480546310996	290.32211218826137	20/04/28 05:14:34
1	97	339.99290168260706	290.36381007470266	20/04/28 05:14:34
1	97	339.7610126146993	290.5094489524063	20/04/28 05:14:34
1	97	339.7798178134933	290.49609948086373	20/04/28 05:14:34
1	97	339.7994855694569	290.3901509223913	20/04/28 05:14:34
1	97	339.942671497275	290.30359292917836	20/04/28 05:14:34
1	97	340.113822687041	290.3099845856881	20/04/28 05:14:34
1	97	340.0773341856441	290.36279585923705	20/04/28 05:14:34
1	97	340.10849038924584	290.659966212375	20/04/28 05:14:35
1	97	339.87237744665265	290.52551121506883	20/04/28 05:14:35
1	97	340.0740190107143	290.6794018934255	20/04/28 05:14:35
1	97	340.0507306722074	290.91281723721846	20/04/28 05:14:35
1	97	340.11205937872705	290.8358602021689	20/04/28 05:14:35
1	97	339.98513722572295	290.83161175260585	20/04/28 05:14:35
1	97	339.98422721752723	290.8320167111123	20/04/28 05:14:35
1	97	340.043523051559	290.6974750890405	20/04/28 05:14:35
1	97	339.89747961409887	290.8688265736975	20/04/28 05:14:35
1	97	339.7647216188615	290.9270102320767	20/04/28 05:14:35
1	97	339.71524422302804	290.8627569405383	20/04/28 05:14:36
1	97	339.75374013794647	290.833052168386	20/04/28 05:14:36
1	97	339.67196973707354	290.96828609855527	20/04/28 05:14:36
1	97	339.6306432220831	290.86750346801267	20/04/28 05:14:36
1	97	339.7907250601393	290.6853333350692	20/04/28 05:14:36
1	97	339.7974569800949	290.7305388468656	20/04/28 05:14:36
1	97	339.8961246542036	290.6971208642934	20/04/28 05:14:36
1	97	339.95488466473336	290.6747786716457	20/04/28 05:14:36
1	97	340.028425723904	290.6930445565513	20/04/28 05:14:36
1	97	340.1337080184654	290.65125681554116	20/04/28 05:14:37
1	97	340.12103037436924	290.64079794015925	20/04/28 05:14:37
1	97	340.14234703714794	290.87032522116164	20/04/28 05:14:37
1	97	340.29523816087544	290.9914840440777	20/04/28 05:14:37
1	97	340.2509866415245	291.2463891074039	20/04/28 05:14:37
1	97	340.2530285741761	291.2751375374948	20/04/28 05:14:37
1	97	340.34030367920997	291.22283367839196	20/04/28 05:14:37
1	97	340.1965188745609	291.00117723545856	20/04/28 05:14:37
1	97	340.36686303670996	290.7572030677055	20/04/28 05:14:37
1	97	340.223942298142	290.6209538597543	20/04/28 05:14:37
1	97	340.25461653750216	290.4674304115749	20/04/28 05:14:38
1	97	340.40507182708524	290.5983716109112	20/04/28 05:14:38
1	97	340.5576490359337	290.34845198905725	20/04/28 05:14:38
1	97	340.5089649229197	290.3313690238186	20/04/28 05:14:38
1	97	340.5369997488305	290.5246117554796	20/04/28 05:14:38
1	97	340.56315703937804	290.60570967881495	20/04/28 05:14:38
1	97	340.34848347076803	290.79230551580395	20/04/28 05:14:38
1	97	340.254959151855	290.597413267305	20/04/28 05:14:38
1	97	340.359025798268	290.6195138692113	20/04/28 05:14:38
1	97	340.3575230169071	290.61613895989666	20/04/28 05:14:38
1	97	340.41821018816944	290.70993320365943	20/04/28 05:14:39
1	97	340.5557002283163	290.773493572777	20/04/28 05:14:39
1	97	340.6206958211643	290.7741261157381	20/04/28 05:14:39
1	97	340.8447716555174	290.6378752325974	20/04/28 05:14:39
1	97	340.95404061775196	290.72915546923184	20/04/28 05:14:39
1	97	340.95404061775196	290.72915546923184	20/04/28 05:14:39
1	97	340.95404061775196	290.72915546923184	20/04/28 05:14:39
1	97	340.9871713733474	290.6704561705593	20/04/28 05:14:39
1	97	340.88559571877437	290.4359196734274	20/04/28 05:14:39
1	97	340.87006869588316	290.4645285319814	20/04/28 05:14:40
1	97	340.8768363136768	290.4352254476762	20/04/28 05:14:40
1	97	340.7543172628473	290.2072775552619	20/04/28 05:14:40
1	97	340.66196535483544	290.2580689296495	20/04/28 05:14:40
1	97	340.7049599586455	290.2739095149926	20/04/28 05:14:40
1	97	340.63791730160506	290.55251253017923	20/04/28 05:14:40
1	97	340.41084750675907	290.61542665806377	20/04/28 05:14:40
1	97	340.4013992011106	290.6250798352277	20/04/28 05:14:40
1	97	340.4828271840023	290.43556143641945	20/04/28 05:14:40
1	97	340.59711915551145	290.4925289256383	20/04/28 05:14:40
1	97	340.57052814860833	290.4932206068383	20/04/28 05:14:41
1	97	340.4981796515983	290.6388719844022	20/04/28 05:14:41
1	97	340.5202451627091	290.6227638631572	20/04/28 05:14:41
1	97	340.56616039168233	290.61776796253235	20/04/28 05:14:41
1	97	340.412978171026	290.66576018430305	20/04/28 05:14:41
1	97	340.3056932351375	290.6231958171288	20/04/28 05:14:41
1	97	340.17916777875325	290.5359666860522	20/04/28 05:14:41
1	97	340.2314238428931	290.2726895899299	20/04/28 05:14:41
1	97	340.15246772096447	290.4791299151864	20/04/28 05:14:41
1	97	340.15246772096447	290.4791299151864	20/04/28 05:14:41
1	97	340.15246772096447	290.4791299151864	20/04/28 05:14:42
1	97	340.14087992378154	290.4638962978504	20/04/28 05:14:42
1	97	340.25600409773324	290.51397825862864	20/04/28 05:14:42
1	97	340.0853352206343	290.6900641327437	20/04/28 05:14:42
1	97	340.0305986308758	290.7279189530565	20/04/28 05:14:42
1	97	339.9418707965059	290.4714405003378	20/04/28 05:14:42
1	97	340.003270704166	290.273121136711	20/04/28 05:14:42
1	97	340.10094496134633	290.2658370900262	20/04/28 05:14:42
1	97	340.0462449378642	290.0011318588373	20/04/28 05:14:42
1	97	339.9536706386297	289.9613943645996	20/04/28 05:14:43
1	97	340.1004613191072	289.87853617045005	20/04/28 05:14:43
1	97	340.19590424148464	289.68870474238093	20/04/28 05:14:43
1	97	340.2329755673258	289.80252551828	20/04/28 05:14:43
1	97	340.06122190219327	289.76300675399176	20/04/28 05:14:43
1	97	340.05839244881275	289.7548772592441	20/04/28 05:14:43
1	97	340.25166095628697	289.97509769971236	20/04/28 05:14:43
1	97	340.20091265367165	290.10980793451483	20/04/28 05:14:43
1	97	340.21103362086154	290.0461855963842	20/04/28 05:14:43
1	97	340.165777381363	290.15328097807975	20/04/28 05:14:43
1	97	340.2014102843915	290.2495543575233	20/04/28 05:14:44
1	97	340.2653065732891	290.4148302042387	20/04/28 05:14:44
1	97	340.1089029376999	290.3112894070982	20/04/28 05:14:44
1	97	340.07476450445984	290.4123680736561	20/04/28 05:14:44
1	97	339.86290604743954	290.5789542158729	20/04/28 05:14:44
1	97	339.60346534168576	290.5730107220607	20/04/28 05:14:44
1	97	339.57051904201916	290.29572292626676	20/04/28 05:14:44
1	97	339.4510514093128	290.2905046855309	20/04/28 05:14:44
1	97	339.4543042732485	290.29909825081484	20/04/28 05:14:44
1	97	339.44348611677157	290.28090973034955	20/04/28 05:14:44
1	97	339.4874718979647	290.52761321924544	20/04/28 05:14:45
1	97	339.4520066951713	290.5466920923852	20/04/28 05:14:45
1	97	339.3935290243999	290.8059018877509	20/04/28 05:14:45
1	97	339.6089423154256	290.80868436110745	20/04/28 05:14:45
1	97	339.6300542870148	290.8704329656237	20/04/28 05:14:45
1	97	339.65007903939613	290.90164914593555	20/04/28 05:14:45
1	97	339.3948479191498	290.8916414179494	20/04/28 05:14:45
1	97	339.3399945452318	291.1153908050958	20/04/28 05:14:45
1	97	339.07449726827696	291.2424084887857	20/04/28 05:14:45
1	97	339.1528572491831	291.1146769838894	20/04/28 05:14:46
1	97	339.1475719237295	291.08746980662363	20/04/28 05:14:46
1	97	339.04753512084164	290.9869598102421	20/04/28 05:14:46
1	97	338.9142358387592	290.89634409648295	20/04/28 05:14:46
1	97	338.64034722848794	290.87654668397306	20/04/28 05:14:46
1	97	338.39410638700025	290.7488436322772	20/04/28 05:14:46
1	97	338.4373834434483	290.5769455751162	20/04/28 05:14:46
1	97	338.54656691831303	290.74056925443506	20/04/28 05:14:46
1	97	338.33980132220535	290.59958948223607	20/04/28 05:14:46
1	97	338.2234385411223	290.4254737042723	20/04/28 05:14:46
1	97	338.1827709913017	290.5025805117365	20/04/28 05:14:47
1	97	338.02172357942334	290.64954174820815	20/04/28 05:14:47
1	97	337.91705193092497	290.5012649485936	20/04/28 05:14:47
1	97	337.7577715911475	290.7135075366353	20/04/28 05:14:47
1	97	337.8584676038745	290.49229801913896	20/04/28 05:14:47
1	97	337.68743473876333	290.3480631454983	20/04/28 05:14:47
1	97	337.668285461089	290.2897993383947	20/04/28 05:14:47
1	97	337.52255920306044	290.3031771704981	20/04/28 05:14:47
1	97	337.62187659487176	290.15974207495873	20/04/28 05:14:47
1	97	337.59127185519276	290.261495823845	20/04/28 05:14:47
1	97	337.4580014869866	290.4080037641056	20/04/28 05:14:48
1	97	337.51518387602755	290.45053570679175	20/04/28 05:14:48
1	97	337.5093943793909	290.44780046767016	20/04/28 05:14:48
1	97	337.4900731849829	290.3098827188045	20/04/28 05:14:48
1	97	337.6647909907578	290.2761293617078	20/04/28 05:14:48
1	97	337.7471143847526	290.55599219024015	20/04/28 05:14:48
1	97	337.59625744278026	290.5258888576418	20/04/28 05:14:48
1	97	337.84063697792055	290.6617874808145	20/04/28 05:14:48
1	97	337.71776543957475	290.8819479212319	20/04/28 05:14:48
1	97	337.9146430516798	290.68788351339566	20/04/28 05:14:49
1	97	337.88241076551594	290.9075355091571	20/04/28 05:14:49
1	97	337.97116036927713	291.0929437831794	20/04/28 05:14:49
1	97	337.9078345302645	291.02545563638864	20/04/28 05:14:49
1	97	338.06177669914234	290.79884469493936	20/04/28 05:14:49
1	97	338.0620886129625	290.83261539907244	20/04/28 05:14:49
1	97	337.9552362979595	290.8587112134796	20/04/28 05:14:49
1	97	337.8779029675844	290.6914072724371	20/04/28 05:14:49
1	97	337.9104067763927	290.87201201306084	20/04/28 05:14:49
1	97	338.0622209989241	291.09753351807115	20/04/28 05:14:49
1	97	338.2806154697263	291.1520619361813	20/04/28 05:14:50
1	97	338.3710788747995	291.38854417456554	20/04/28 05:14:50
1	97	338.37039487912614	291.3900969565762	20/04/28 05:14:50
1	97	338.2133951555708	291.2258636461048	20/04/28 05:14:50
1	97	338.03966105509915	291.3865526779643	20/04/28 05:14:50
1	97	337.78499071429707	291.5357666923323	20/04/28 05:14:50
1	97	337.62549677619455	291.64790252224583	20/04/28 05:14:50
1	97	337.4720800302728	291.4620698048886	20/04/28 05:14:50
1	97	337.4599383270771	291.39105697519875	20/04/28 05:14:50
1	97	337.4559430732644	291.4432234528749	20/04/28 05:14:51
1	97	337.4430332499091	291.62293891659385	20/04/28 05:14:51
1	97	337.64843485130575	291.62801529824713	20/04/28 05:14:51
1	97	337.67695004114773	291.58803598738234	20/04/28 05:14:51
1	97	337.6838292831771	291.6696480101504	20/04/28 05:14:51
1	97	337.6963174547312	291.81847450121984	20/04/28 05:14:51
1	97	337.59983408236127	291.76773992296387	20/04/28 05:14:51
1	97	337.33233777423493	291.7217098527597	20/04/28 05:14:51
1	97	337.4991520688378	291.6288952424277	20/04/28 05:14:51
1	97	337.49146184653426	291.6835684831636	20/04/28 05:14:51
1	97	337.45126558595706	291.67636404098033	20/04/28 05:14:52
1	97	337.4587129591694	291.53370853049086	20/04/28 05:14:52
1	97	337.54805802852644	291.29360028380376	20/04/28 05:14:52
1	97	337.68344745027366	291.4186779948987	20/04/28 05:14:52
1	97	337.6705907036184	291.4884093279657	20/04/28 05:14:52
1	97	337.78448027883854	291.43943124771056	20/04/28 05:14:52
1	97	337.7711144304655	291.2822745797767	20/04/28 05:14:52
1	97	337.85822117166026	291.45682578720283	20/04/28 05:14:52
1	97	337.74307289484506	291.37079755478084	20/04/28 05:14:52
1	97	337.69512501698495	291.3815834564102	20/04/28 05:14:52
1	97	337.5940553557953	291.4782398943793	20/04/28 05:14:53
1	97	337.54958764386714	291.6298558348757	20/04/28 05:14:53
1	97	337.717251126329	291.73141161715137	20/04/28 05:14:53
1	97	337.6930764529018	291.71966749563006	20/04/28 05:14:53
1	97	337.68597286251133	291.6732215653387	20/04/28 05:14:53
1	97	337.93808387034716	291.8054913102191	20/04/28 05:14:53
1	97	337.9054150539248	292.09267962495113	20/04/28 05:14:53
1	97	337.91966583972555	292.0321110935243	20/04/28 05:14:53
1	97	337.8668077327633	292.25869298755174	20/04/28 05:14:53
1	97	337.80363881809023	292.1822335830808	20/04/28 05:14:54
1	97	338.05361766611105	292.03730172645703	20/04/28 05:14:54
1	97	338.00923198782743	292.00581084097445	20/04/28 05:14:54
1	97	337.845055947624	291.86401707376234	20/04/28 05:14:54
1	97	337.80038583215907	291.85721210344514	20/04/28 05:14:54
1	97	337.7984931677679	291.72050688264875	20/04/28 05:14:54
1	97	337.6797270454744	291.7716354210574	20/04/28 05:14:54
1	97	337.6672206894418	291.7712460599101	20/04/28 05:14:54
1	97	337.68819174813916	291.76193798595966	20/04/28 05:14:54
1	97	337.6844890910655	291.8623575760676	20/04/28 05:14:54
1	97	337.7092436609681	292.1511948184221	20/04/28 05:14:55
1	97	337.67737992374845	291.97880088556883	20/04/28 05:14:55
1	97	337.4355990187009	292.116830958291	20/04/28 05:14:55
1	97	337.5078417090467	292.2247342734081	20/04/28 05:14:55
1	97	337.4891650172858	292.2397686825821	20/04/28 05:14:55
1	97	337.43929533335637	292.5289615307305	20/04/28 05:14:55
1	97	337.50214524530026	292.58550416669885	20/04/28 05:14:55
1	97	337.52619832401194	292.87094058710875	20/04/28 05:14:55
1	97	337.48018734534065	292.9209447069606	20/04/28 05:14:55
1	97	337.4605810833597	292.9345420755473	20/04/28 05:14:55
1	97	337.75070617687624	292.9153924867921	20/04/28 05:14:56
1	97	337.95995438295097	292.9120140166711	20/04/28 05:14:56
1	97	337.89980127170963	292.93212494070684	20/04/28 05:14:56
1	97	337.8873845529671	292.68576573873617	20/04/28 05:14:56
1	97	337.8503312045549	292.81714542556824	20/04/28 05:14:56
1	97	337.8571449494962	292.73328611212884	20/04/28 05:14:56
1	97	338.03679966924545	292.6973382142418	20/04/28 05:14:56
1	97	338.249993466381	292.7273359866516	20/04/28 05:14:56
1	97	338.18318269114064	292.82058377257397	20/04/28 05:14:56
1	97	338.0407203029513	292.7025371217809	20/04/28 05:14:57
1	97	338.03317531980105	292.71144701171437	20/04/28 05:14:57
1	97	338.1021897287994	292.54855504699816	20/04/28 05:14:57
1	97	337.8942781137614	292.40099405836554	20/04/28 05:14:57
1	97	337.7993161157359	292.389196233181	20/04/28 05:14:57
1	97	337.8669425874623	292.60761370278834	20/04/28 05:14:57
1	97	337.87248127857424	292.5074907190382	20/04/28 05:14:57
1	97	337.82715716275754	292.27902478844555	20/04/28 05:14:57
1	97	337.88278279468483	292.2158671607032	20/04/28 05:14:57
1	97	337.8658768323988	292.15447387937036	20/04/28 05:14:57
1	97	337.879449951503	292.2436685916433	20/04/28 05:14:58
1	97	337.90452764582676	292.30546989002806	20/04/28 05:14:58
1	97	337.9674808833787	292.24312827794364	20/04/28 05:14:58
1	97	337.94147034548325	292.2438576047592	20/04/28 05:14:58
1	97	337.9560477790237	292.3834016245978	20/04/28 05:14:58
1	97	337.7563508817464	292.35639185456404	20/04/28 05:14:58
1	97	337.75754042787395	292.3560706044601	20/04/28 05:14:58
1	97	337.983250068412	292.2329698189356	20/04/28 05:14:58
1	97	337.85357843434264	292.2835394106939	20/04/28 05:14:58
1	97	337.7296286962716	292.2115268439067	20/04/28 05:14:58
1	97	337.7862887645554	292.18688179023235	20/04/28 05:14:59
1	97	337.6772244675806	292.0269467057229	20/04/28 05:14:59
1	97	337.8810149117759	292.18351896954573	20/04/28 05:14:59
1	97	338.15689545157716	292.2478890762754	20/04/28 05:14:59
1	97	338.1776596557963	292.29795580385263	20/04/28 05:14:59
1	97	338.1609946355285	292.50832703414784	20/04/28 05:14:59
1	97	338.13565269208857	292.6887849897975	20/04/28 05:14:59
1	97	338.14449149935126	292.6823376548424	20/04/28 05:14:59
1	97	338.21233146246635	292.6110688169705	20/04/28 05:14:59
1	97	337.95751707529047	292.738923046962	20/04/28 05:15:00
1	97	337.85957275089936	292.68154676380874	20/04/28 05:15:00
1	97	338.1197674059546	292.6078630409427	20/04/28 05:15:00
1	97	338.1152582208314	292.6028787780026	20/04/28 05:15:00
1	97	338.1708002507562	292.3642674497216	20/04/28 05:15:00
1	97	338.03171104731285	292.35710023429607	20/04/28 05:15:00
1	97	338.1073806730323	292.2237347129362	20/04/28 05:15:00
1	97	338.11824946640706	292.21985741836306	20/04/28 05:15:00
1	97	338.2126033650863	292.4893602320594	20/04/28 05:15:00
1	97	338.4310801215767	292.5910622129935	20/04/28 05:15:00
1	97	338.37618750218894	292.5646177902342	20/04/28 05:15:01
1	97	338.25722990348316	292.68561767172764	20/04/28 05:15:01
1	97	338.25289019865164	292.64695095609073	20/04/28 05:15:01
1	97	338.34631346805526	292.75380882395007	20/04/28 05:15:01
1	97	338.3375489909147	292.78192890017374	20/04/28 05:15:01
1	97	338.2271243059935	292.5423184822857	20/04/28 05:15:01
1	97	338.21091257160145	292.3504007853593	20/04/28 05:15:01
1	97	338.1901679695328	292.3311455648936	20/04/28 05:15:01
1	97	337.9675285144452	292.2276156045029	20/04/28 05:15:01
1	97	337.9835989146141	292.30100568277584	20/04/28 05:15:02
1	97	337.9851745660032	292.26798042293575	20/04/28 05:15:02
1	97	337.98867085453503	292.202100405555	20/04/28 05:15:02
1	97	337.99502088222556	292.15807802474916	20/04/28 05:15:02
1	97	337.91805049226554	292.32007881275075	20/04/28 05:15:02
1	97	337.91805049226554	292.32007881275075	20/04/28 05:15:02
1	97	337.92840392110224	292.4782242020545	20/04/28 05:15:02
1	97	337.98189048270274	292.3890290246451	20/04/28 05:15:02
1	97	337.91192454735034	292.49374303112216	20/04/28 05:15:02
1	97	337.91192454735034	292.49374303112216	20/04/28 05:15:02
1	97	337.93696226488214	292.6076565116078	20/04/28 05:15:03
1	97	337.9784449499025	292.62432478805533	20/04/28 05:15:03
1	97	338.10780073832524	292.8556372585799	20/04/28 05:15:03
1	97	337.9076341057393	292.6872481145283	20/04/28 05:15:03
1	97	337.87569194738995	292.6832021699804	20/04/28 05:15:03
1	97	337.8658372757419	292.53187680697465	20/04/28 05:15:03
1	97	337.6251393251953	292.39629583754487	20/04/28 05:15:03
1	97	337.68843105885406	292.4082138537223	20/04/28 05:15:03
1	97	337.62337246182193	292.6148972533346	20/04/28 05:15:03
1	97	337.77907096339754	292.5984750257144	20/04/28 05:15:03
1	97	337.76164936001436	292.5937432460842	20/04/28 05:15:04
1	97	337.92031244216287	292.5077383375686	20/04/28 05:15:04
1	97	337.92031244216287	292.5077383375686	20/04/28 05:15:04
1	97	337.679120945709	292.38007882121616	20/04/28 05:15:04
1	97	337.660935807349	292.33402363318726	20/04/28 05:15:04
1	97	337.6817881462629	292.2949988118735	20/04/28 05:15:04
1	97	337.58862059618497	292.2490470739601	20/04/28 05:15:04
1	97	337.5377371173572	292.16674505389193	20/04/28 05:15:04
1	97	337.32640110691375	292.02584432588844	20/04/28 05:15:04
1	97	337.1768522151281	291.79911234132913	20/04/28 05:15:05
1	97	337.1509735631502	291.76433415545625	20/04/28 05:15:05
1	97	337.3636712460386	291.6311405356718	20/04/28 05:15:05
1	97	337.167789112196	291.6960068854109	20/04/28 05:15:05
1	97	337.1057404881194	291.7292034682864	20/04/28 05:15:05
1	97	337.1743374019293	291.7997497750532	20/04/28 05:15:05
1	97	337.2113994374944	291.8483483130103	20/04/28 05:15:05
1	97	337.2113994374944	291.8483483130103	20/04/28 05:15:05
1	97	337.2113994374944	291.8483483130103	20/04/28 05:15:05
1	97	337.2045533685291	291.737733569122	20/04/28 05:15:05
1	97	337.24303993699124	291.7958688682436	20/04/28 05:15:06
1	97	337.0623972865926	291.8452287284429	20/04/28 05:15:06
1	97	337.28032380493573	291.90195646281114	20/04/28 05:15:06
1	97	337.37440739788616	292.0011975871357	20/04/28 05:15:06
1	97	337.25623150301675	291.91421257076723	20/04/28 05:15:06
1	97	337.27652476468836	291.86626442556366	20/04/28 05:15:06
1	97	337.3506649017573	291.9367289601517	20/04/28 05:15:06
1	97	337.3506649017573	291.9367289601517	20/04/28 05:15:06
1	97	337.5102050292866	291.8053509868011	20/04/28 05:15:06
1	97	337.5109529759686	291.8109133150646	20/04/28 05:15:07
1	97	337.5109529759686	291.8109133150646	20/04/28 05:15:07
1	97	337.361289360724	291.83718438117467	20/04/28 05:15:07
1	97	337.3809248627681	292.09732452922935	20/04/28 05:15:07
1	97	337.5053961100107	292.3688091381789	20/04/28 05:15:07
1	97	337.45387815211825	292.36889455453263	20/04/28 05:15:07
1	97	337.2376344057415	292.23529363781245	20/04/28 05:15:07
1	97	337.40529573969246	292.0442228445212	20/04/28 05:15:07
1	97	337.53035157778686	291.83673532354743	20/04/28 05:15:07
1	97	337.39966511091876	291.88714239499643	20/04/28 05:15:07
1	97	337.13209103751853	291.9173686342597	20/04/28 05:15:08
1	97	337.09705938352784	291.891752571026	20/04/28 05:15:08
1	97	337.1429691383492	291.90484725414063	20/04/28 05:15:08
1	97	337.0942012048087	291.9534622755227	20/04/28 05:15:08
1	97	337.06666141958846	291.93881207970026	20/04/28 05:15:08
1	97	337.1604979744409	292.1076497063009	20/04/28 05:15:08
1	97	337.1255352137503	292.1180652018789	20/04/28 05:15:08
1	97	337.1930426058446	292.0510697093837	20/04/28 05:15:08
1	97	337.0465973057023	292.19201873784095	20/04/28 05:15:08
1	97	337.0130859567511	292.10337317997227	20/04/28 05:15:08
1	97	337.0446483048773	291.9910850416823	20/04/28 05:15:09
1	97	337.32182514918634	291.92633352037006	20/04/28 05:15:09
1	97	337.3366284990469	291.7580781629766	20/04/28 05:15:09
1	97	337.1597591352241	291.8993880243032	20/04/28 05:15:09
1	97	337.20683539993666	292.0288370396863	20/04/28 05:15:09
1	97	337.3315146355957	291.90256566510214	20/04/28 05:15:09
1	97	337.20462990331197	291.8308574027531	20/04/28 05:15:09
1	97	337.1721686344764	291.8637604486097	20/04/28 05:15:09
1	97	337.11335212874553	291.892426170439	20/04/28 05:15:09
1	97	337.2403208182858	291.91041808062863	20/04/28 05:15:10
1	97	337.3489553322523	291.7854974020196	20/04/28 05:15:10
1	97	337.4998511021684	291.7404202925932	20/04/28 05:15:10
1	97	337.4998511021684	291.7404202925932	20/04/28 05:15:10
1	97	337.59773227186787	291.51921604602506	20/04/28 05:15:10
1	97	337.3037857145266	291.60912432457536	20/04/28 05:15:10
1	97	337.34422653092855	291.352189522555	20/04/28 05:15:10
1	97	337.34422653092855	291.352189522555	20/04/28 05:15:10
1	97	337.3224697422641	291.1114305424331	20/04/28 05:15:10
1	97	337.17730575897383	291.14486807295134	20/04/28 05:15:10
1	97	337.306703705556	291.18885698553754	20/04/28 05:15:11
1	97	337.15609424182435	291.2005124712668	20/04/28 05:15:11
1	97	337.2475315029447	291.1024319091109	20/04/28 05:15:11
1	97	337.3660225033506	291.22092497882875	20/04/28 05:15:11
1	97	337.3440016137216	291.2131706207499	20/04/28 05:15:11
1	97	337.18875899211156	291.2148501601397	20/04/28 05:15:11
1	97	337.262314655642	291.5397118596063	20/04/28 05:15:11
1	97	337.5149149590611	291.64447320619837	20/04/28 05:15:11
1	97	337.5149149590611	291.64447320619837	20/04/28 05:15:11
1	97	337.67225025063556	291.51517968115894	20/04/28 05:15:11
1	97	337.4919311472332	291.4637769688384	20/04/28 05:15:12
1	97	337.4919311472332	291.4637769688384	20/04/28 05:15:12
1	97	337.80146789547445	291.31126728634985	20/04/28 05:15:12
1	97	337.7573351889795	291.3278925641404	20/04/28 05:15:12
1	97	337.65364942051747	291.4086542538534	20/04/28 05:15:12
1	97	337.72814106228066	291.6004303296533	20/04/28 05:15:12
1	97	337.72814106228066	291.6004303296533	20/04/28 05:15:12
1	97	337.6253875912284	291.8953566017269	20/04/28 05:15:12
1	97	337.6128534993205	291.90521040756613	20/04/28 05:15:12
1	97	337.6128534993205	291.90521040756613	20/04/28 05:15:13
1	97	337.4038750715449	292.0545358710307	20/04/28 05:15:13
1	97	337.6302179153701	291.9154897836506	20/04/28 05:15:13
1	97	337.70562112470947	291.9098457444873	20/04/28 05:15:13
1	97	337.8276705580213	291.8516568743877	20/04/28 05:15:13
1	97	337.7757633039601	291.68843630337386	20/04/28 05:15:13
1	97	337.7855914018686	291.6992939790342	20/04/28 05:15:13
1	97	338.0208014079147	291.6062401191297	20/04/28 05:15:13
1	97	338.02115967549264	291.64447189247824	20/04/28 05:15:13
1	97	337.8330824157474	291.7551108589594	20/04/28 05:15:13
1	97	337.8330824157474	291.7551108589594	20/04/28 05:15:14
1	97	337.8178502850842	291.76573303797795	20/04/28 05:15:14
1	97	337.78801952460674	291.5495288786455	20/04/28 05:15:14
1	97	337.65974728244123	291.56995714931924	20/04/28 05:15:14
1	97	337.8725179282181	291.5458305588084	20/04/28 05:15:14
1	97	337.9008101939612	291.49374984850516	20/04/28 05:15:14
1	97	337.9008101939612	291.49374984850516	20/04/28 05:15:14
1	97	337.8003884772165	291.58658315796646	20/04/28 05:15:14
1	97	337.7693467337173	291.61583588691695	20/04/28 05:15:14
1	97	337.63591834011254	291.5784672982349	20/04/28 05:15:15
1	97	337.65980364094196	291.6453366432555	20/04/28 05:15:15
1	97	337.65980364094196	291.6453366432555	20/04/28 05:15:15
1	97	337.74401812314056	291.4252454942554	20/04/28 05:15:15
1	97	337.75537816731753	291.4064891659543	20/04/28 05:15:15
1	97	338.0161095196496	291.19632374849607	20/04/28 05:15:15
1	97	338.0161095196496	291.19632374849607	20/04/28 05:15:15
1	97	338.0203957316424	291.2673786197353	20/04/28 05:15:15
1	97	338.25718114860723	291.21259110535624	20/04/28 05:15:15
1	97	338.16598828659113	291.0373503607539	20/04/28 05:15:15
1	97	338.16598828659113	291.0373503607539	20/04/28 05:15:16
1	97	338.22646351383725	290.90471261317134	20/04/28 05:15:16
1	97	338.1535329406308	290.91233066890123	20/04/28 05:15:16
1	97	338.1444129731857	290.8591802108808	20/04/28 05:15:16
1	97	338.063315266188	291.02105331532516	20/04/28 05:15:16
1	97	338.063315266188	291.02105331532516	20/04/28 05:15:16
1	97	337.7260322853854	290.914649563286	20/04/28 05:15:16
1	97	337.60120986934413	290.87930516502524	20/04/28 05:15:16
1	97	337.599157520117	290.75798077298793	20/04/28 05:15:16
1	97	337.3862264164292	290.6814855305004	20/04/28 05:15:16
1	97	337.19075240051467	290.5311164434717	20/04/28 05:15:17
1	97	337.2882457909445	290.30315070163243	20/04/28 05:15:17
1	97	337.22021684211666	290.29990945420394	20/04/28 05:15:17
1	97	337.22021684211666	290.29990945420394	20/04/28 05:15:17
1	97	337.0552897366984	290.37843544545103	20/04/28 05:15:17
1	97	337.3313822196976	290.409364481926	20/04/28 05:15:17
1	97	337.3247988925063	290.388372665832	20/04/28 05:15:17
1	97	337.3247988925063	290.388372665832	20/04/28 05:15:17
1	97	337.70893697993756	290.1591011675739	20/04/28 05:15:17
1	97	337.7698965856221	290.0592247915916	20/04/28 05:15:18
1	97	337.94683725458225	289.827818356289	20/04/28 05:15:18
1	97	337.89675188969426	289.7440884713622	20/04/28 05:15:18
1	97	337.89755511182386	289.7447536461877	20/04/28 05:15:18
1	97	337.99655582242104	290.0137183481806	20/04/28 05:15:18
1	97	337.96469969150246	290.10827841381655	20/04/28 05:15:18
1	97	338.02030184020197	290.1871013284085	20/04/28 05:15:18
1	97	337.9342520428857	290.4032750141681	20/04/28 05:15:18
1	97	338.0599541874224	290.2025976862089	20/04/28 05:15:18
1	97	338.1217510151993	290.2266904615419	20/04/28 05:15:18
1	97	338.13121248138776	290.2388084969693	20/04/28 05:15:19
1	97	338.1579559455565	290.2791220300329	20/04/28 05:15:19
1	97	338.2918469182312	290.4540189407554	20/04/28 05:15:19
1	97	338.26364714144216	290.5112857242901	20/04/28 05:15:19
1	97	338.40684932578944	290.7440531019092	20/04/28 05:15:19
1	97	338.3243119805106	290.8755718703486	20/04/28 05:15:19
1	97	338.3904617767194	290.83456150792296	20/04/28 05:15:19
1	97	338.2978775773152	290.89487926378473	20/04/28 05:15:19
1	97	338.2263427272355	291.02050642698447	20/04/28 05:15:19
1	97	338.1740147856711	290.96891672837717	20/04/28 05:15:20
1	97	338.1932313093671	290.9209364046899	20/04/28 05:15:20
1	97	338.0849617873895	290.85266246556847	20/04/28 05:15:20
1	97	338.1239554306732	290.9671340669802	20/04/28 05:15:20
1	97	338.06689245619464	290.7484636531553	20/04/28 05:15:20
1	97	337.9608130384233	290.8011134561712	20/04/28 05:15:20
1	97	337.971060095398	290.78769838904816	20/04/28 05:15:20
1	97	337.9493741260828	290.8032776857319	20/04/28 05:15:20
1	97	337.89321623534397	290.95171034966756	20/04/28 05:15:20
1	97	337.70162011849885	290.82654569492865	20/04/28 05:15:20
1	97	337.45207074486257	290.93918459458064	20/04/28 05:15:21
1	97	337.46318444335316	290.9923279228138	20/04/28 05:15:21
1	97	337.26094832622425	290.9466308775586	20/04/28 05:15:21
1	97	337.16920401807306	290.76107902995324	20/04/28 05:15:21
1	97	337.0598485212161	291.032244495391	20/04/28 05:15:21
1	97	337.1839571184595	291.25485642558306	20/04/28 05:15:21
1	97	337.1881226721944	291.02657139567646	20/04/28 05:15:21
1	97	337.09055689543885	291.1085668638692	20/04/28 05:15:21
1	97	337.17771844661274	291.30961815225027	20/04/28 05:15:21
1	97	337.0909347865085	291.0484364023858	20/04/28 05:15:22
1	97	337.00461091882056	291.03514755989573	20/04/28 05:15:22
1	97	337.0293183128362	291.0496047642829	20/04/28 05:15:22
1	97	336.9324251708635	290.83897026401564	20/04/28 05:15:22
1	97	336.989280745067	290.7672091118417	20/04/28 05:15:22
1	97	337.17841270430415	290.86651461364465	20/04/28 05:15:22
1	97	337.11248148886193	290.6578689085203	20/04/28 05:15:22
1	97	337.18094078193604	290.6122287976505	20/04/28 05:15:22
1	97	337.2933582448626	290.638822929527	20/04/28 05:15:22
1	97	337.26341495799363	290.6720385118074	20/04/28 05:15:22
1	97	337.1679227627439	290.77302199072585	20/04/28 05:15:23
1	97	337.2600918282797	290.7144362679896	20/04/28 05:15:23
1	97	337.23462213757625	290.70841057622516	20/04/28 05:15:23
1	97	337.2352196070629	290.7083728827858	20/04/28 05:15:23
1	97	337.2549446673934	290.714362595928	20/04/28 05:15:23
1	97	337.3682409784692	290.8936522587728	20/04/28 05:15:23
1	97	337.1362399785617	290.96919820672156	20/04/28 05:15:23
1	97	337.00059522356565	290.9684244581033	20/04/28 05:15:23
1	97	337.18352491684936	290.7766180943364	20/04/28 05:15:23
1	97	337.19005169674796	290.69642352290015	20/04/28 05:15:23
1	97	337.1981197461911	290.7054711387483	20/04/28 05:15:24
1	97	337.1969183661342	290.9995784200105	20/04/28 05:15:24
1	97	337.06902724745385	291.26550012728967	20/04/28 05:15:24
1	97	337.20592983789004	291.46993028761284	20/04/28 05:15:24
1	97	337.4309929703975	291.33356025131707	20/04/28 05:15:24
1	97	337.5839378801213	291.24799058602224	20/04/28 05:15:24
1	97	337.6331612356451	291.25876857888835	20/04/28 05:15:24
1	97	337.4511654609112	291.45567523805744	20/04/28 05:15:24
1	97	337.4578301990612	291.45700160497165	20/04/28 05:15:24
1	97	337.5705548973055	291.2679510905477	20/04/28 05:15:25
1	97	337.56860770392944	291.2690368915948	20/04/28 05:15:25
1	97	337.52779121161194	291.41343735020996	20/04/28 05:15:25
1	97	337.52137810264367	291.3420418275029	20/04/28 05:15:25
1	97	337.4396210841333	291.29691688338136	20/04/28 05:15:25
1	97	337.55950343630985	291.3092022667395	20/04/28 05:15:25
1	97	337.4128042796267	291.40206338295025	20/04/28 05:15:25
1	97	337.47398180618796	291.29337305522955	20/04/28 05:15:25
1	97	337.458412617333	291.5252162098431	20/04/28 05:15:25
1	97	337.4212292533756	291.49121973144264	20/04/28 05:15:25
1	97	337.3857437563841	291.23170054786385	20/04/28 05:15:26
1	97	337.3433315078012	291.1734656039918	20/04/28 05:15:26
1	97	337.3998681148316	291.3018861202569	20/04/28 05:15:26
1	97	337.33390377348024	291.04728089353324	20/04/28 05:15:26
1	97	337.33892180501255	291.07533657751276	20/04/28 05:15:26
1	97	337.3270417873774	291.14778050134873	20/04/28 05:15:26
1	97	337.2863441738001	291.16555292132176	20/04/28 05:15:26
1	97	337.0824323995868	291.1776063373692	20/04/28 05:15:26
1	97	337.0824323995868	291.1776063373692	20/04/28 05:15:26
1	97	337.0824323995868	291.1776063373692	20/04/28 05:15:26
1	97	337.05626196261557	291.1609070860097	20/04/28 05:15:27
1	97	337.0627341611242	291.2388464533672	20/04/28 05:15:27
1	97	337.0806004779524	291.2349876065461	20/04/28 05:15:27
1	97	337.0378033527807	291.0995393754285	20/04/28 05:15:27
1	97	337.28512087223675	291.2122225609177	20/04/28 05:15:27
1	97	337.2815235428213	291.1915189757593	20/04/28 05:15:27
1	97	337.0266347749701	291.1933215675865	20/04/28 05:15:27
1	97	336.8288783517764	291.2426685954344	20/04/28 05:15:27
1	97	336.9638390781266	291.2158600732013	20/04/28 05:15:27
1	97	336.7805454324494	291.3312627192509	20/04/28 05:15:28
1	97	336.76844906923947	291.3451542841725	20/04/28 05:15:28
1	97	336.99447354978946	291.2822695106648	20/04/28 05:15:28
1	97	336.8091853958408	291.3666028220778	20/04/28 05:15:28
1	97	336.7776618291099	291.24940627551956	20/04/28 05:15:28
1	97	336.76180554223845	291.23152036555143	20/04/28 05:15:28
1	97	336.8611009225187	291.4249255906155	20/04/28 05:15:28
1	97	336.86839719006133	291.41424549289206	20/04/28 05:15:28
1	97	336.8322969034059	291.536350546663	20/04/28 05:15:28
1	97	336.8442089675619	291.3995614547272	20/04/28 05:15:28
1	97	336.774802862621	291.24356039967626	20/04/28 05:15:29
1	97	336.75853283887596	291.2354319141944	20/04/28 05:15:29
1	97	336.7095769069754	291.1825184241618	20/04/28 05:15:29
1	97	336.6561076276726	291.1657398308444	20/04/28 05:15:29
1	97	336.7759292036454	291.1953943452197	20/04/28 05:15:29
1	97	336.771467138116	291.21151514987537	20/04/28 05:15:29
1	97	336.6804068179152	291.27562423540263	20/04/28 05:15:29
1	97	336.9675720601463	291.236158063984	20/04/28 05:15:29
1	97	337.00732122542405	291.0259641803827	20/04/28 05:15:29
1	97	337.08745546562415	291.1303044652755	20/04/28 05:15:29
1	97	337.2302777005247	290.9937584925573	20/04/28 05:15:30
1	97	337.26927815989734	291.08390084315425	20/04/28 05:15:30
1	97	337.422249488078	291.2962517351422	20/04/28 05:15:30
1	97	337.5659807307203	291.2599052560372	20/04/28 05:15:30
1	97	337.8206367187886	291.3517246600074	20/04/28 05:15:30
1	97	337.9408834544697	291.287367684814	20/04/28 05:15:30
1	97	337.7704227582757	291.13530588986157	20/04/28 05:15:30
1	97	337.75628103289654	291.1922039675644	20/04/28 05:15:30
1	97	337.5705716338903	291.22085364116873	20/04/28 05:15:30
1	97	337.43737034123063	291.09570299713585	20/04/28 05:15:31
1	97	337.37431626777163	290.94991810914104	20/04/28 05:15:31
1	97	337.4071404807755	290.91721689014634	20/04/28 05:15:31
1	97	337.43742200368837	290.84987511586394	20/04/28 05:15:31
1	97	337.6670154921453	290.893147903717	20/04/28 05:15:31
1	97	337.6988826468262	290.89534211280704	20/04/28 05:15:31
1	97	337.93993103737586	290.76202625771396	20/04/28 05:15:31
1	97	337.801090262648	290.73512466623094	20/04/28 05:15:31
1	97	337.8456858894428	290.74392071232944	20/04/28 05:15:31
1	97	337.79448312591984	290.6807483899085	20/04/28 05:15:31
1	97	337.79017129334983	290.85154445796263	20/04/28 05:15:32
1	97	337.57383919823883	290.83363023764116	20/04/28 05:15:32
1	97	337.50026696739235	291.08939825075765	20/04/28 05:15:32
1	97	337.5049175665355	291.0830489014328	20/04/28 05:15:32
1	97	337.4993212370123	291.09966847044564	20/04/28 05:15:32
1	97	337.48278418974155	291.10148161578064	20/04/28 05:15:32
1	97	337.1923057068083	291.108750002198	20/04/28 05:15:32
1	97	337.1814138786506	290.97941202362574	20/04/28 05:15:32
1	97	337.0159299009882	291.08925928731276	20/04/28 05:15:32
1	97	337.16952710632285	290.91471206333284	20/04/28 05:15:33
1	97	337.2413144950241	290.7627445973049	20/04/28 05:15:33
1	97	337.12567593769745	290.724787887595	20/04/28 05:15:33
1	97	337.0398692080882	290.7992575519422	20/04/28 05:15:33
1	97	337.2517171095461	290.6555970664965	20/04/28 05:15:33
1	97	337.2103919252694	290.8546686941524	20/04/28 05:15:33
1	97	337.42786369161115	290.65948015275706	20/04/28 05:15:33
1	97	337.43645543082005	290.6585548844294	20/04/28 05:15:33
1	97	337.49192696179716	290.7487386058084	20/04/28 05:15:33
1	97	337.50324551575767	290.7589146980854	20/04/28 05:15:33
1	97	337.3827877526758	290.8501040629179	20/04/28 05:15:34
1	97	337.2347931365175	290.7954430952959	20/04/28 05:15:34
1	97	337.0303639251956	290.7381271730804	20/04/28 05:15:34
1	97	336.92388180703364	290.51472986681705	20/04/28 05:15:34
1	97	336.74962358382817	290.50575266879133	20/04/28 05:15:34
1	97	336.6883492883329	290.54936672681043	20/04/28 05:15:34
1	97	336.7566698563464	290.7297815731398	20/04/28 05:15:34
1	97	336.6764132529178	290.7842428244663	20/04/28 05:15:34
1	97	336.97122547471076	290.79867390261523	20/04/28 05:15:34
1	97	337.256985915353	290.7108652173001	20/04/28 05:15:34
1	97	337.195433651018	290.77107751771103	20/04/28 05:15:35
1	97	337.32736643407975	290.9042158727321	20/04/28 05:15:35
1	97	337.3587873934442	290.9198231736518	20/04/28 05:15:35
1	97	337.2332355225738	290.96218034138434	20/04/28 05:15:35
1	97	337.0284535030604	290.86566363543363	20/04/28 05:15:35
1	97	336.99039093221074	290.7922818331358	20/04/28 05:15:35
1	97	337.02985635082365	291.00877693213147	20/04/28 05:15:35
1	97	336.93698445166507	290.98143061803813	20/04/28 05:15:35
1	97	336.7462794950286	291.03600810242466	20/04/28 05:15:35
1	97	336.60755116718764	290.97787658969975	20/04/28 05:15:36
1	97	336.3768668622721	290.95237031572526	20/04/28 05:15:36
1	97	336.66623672545626	290.938939681248	20/04/28 05:15:36
1	97	336.69200352703444	290.8744880579103	20/04/28 05:15:36
1	97	336.95220259667553	290.8931860781152	20/04/28 05:15:36
1	97	336.95319928515505	290.9080490126851	20/04/28 05:15:36
1	97	336.97902561256933	291.0513322963264	20/04/28 05:15:36
1	97	337.0324068188455	291.08059585106986	20/04/28 05:15:36
1	97	336.7787216530618	291.03992995959277	20/04/28 05:15:36
1	97	336.88628467636846	290.865583433604	20/04/28 05:15:36
1	97	336.919177088264	290.8958334732085	20/04/28 05:15:37
1	97	336.64157659497096	290.87154933339997	20/04/28 05:15:37
1	97	336.4708783164623	290.78242429920437	20/04/28 05:15:37
1	97	336.43747563075374	290.7996140894623	20/04/28 05:15:37
1	97	336.344051381764	290.8413750361929	20/04/28 05:15:37
1	97	336.2855085361262	290.73013055550524	20/04/28 05:15:37
1	97	336.2819304654292	290.5557265646361	20/04/28 05:15:37
1	97	336.02599300949083	290.5990898152268	20/04/28 05:15:37
1	97	336.23545178514127	290.6525409981057	20/04/28 05:15:37
1	97	336.0715626793212	290.4556424355697	20/04/28 05:15:37
1	97	336.03673675652806	290.46946092544175	20/04/28 05:15:38
1	97	336.1859320828396	290.60632543917393	20/04/28 05:15:38
1	97	336.1023499712831	290.891475609595	20/04/28 05:15:38
1	97	336.35493312824747	290.75285878599544	20/04/28 05:15:38
1	97	336.3992286485233	290.46779529407786	20/04/28 05:15:38
1	97	336.40704788783256	290.33541225026346	20/04/28 05:15:38
1	97	336.4748093427258	290.2957830790332	20/04/28 05:15:38
1	97	336.48415503510364	290.2775396516649	20/04/28 05:15:38
1	97	336.287119695107	290.5008330321447	20/04/28 05:15:38
1	97	336.12801368542677	290.60032944116074	20/04/28 05:15:39
1	97	336.23781543766506	290.6599093886424	20/04/28 05:15:39
1	97	336.2313065151429	290.8580052446172	20/04/28 05:15:39
1	97	336.4911335380736	290.9259267954534	20/04/28 05:15:39
1	97	336.4054428501101	290.8510607739565	20/04/28 05:15:39
1	97	336.4054428501101	290.8510607739565	20/04/28 05:15:39
1	97	336.4054428501101	290.8510607739565	20/04/28 05:15:39
1	97	336.39051651678557	290.92398448458886	20/04/28 05:15:39
1	97	336.4627995312646	290.67367473880114	20/04/28 05:15:39
1	97	336.3148803629708	290.7169435009121	20/04/28 05:15:39
1	97	336.0531381927284	290.5906271719274	20/04/28 05:15:40
1	97	336.27477391851613	290.47458208325605	20/04/28 05:15:40
1	97	336.25271836645345	290.47329973130735	20/04/28 05:15:40
1	97	335.99103139334903	290.37798343327626	20/04/28 05:15:40
1	97	336.0827110879281	290.34923032905414	20/04/28 05:15:40
1	97	336.2734753090291	290.4852529908297	20/04/28 05:15:40
1	97	336.46860370877357	290.42776121195914	20/04/28 05:15:40
1	97	336.43915088146906	290.72162236579567	20/04/28 05:15:40
1	97	336.5263502388068	290.89168426395855	20/04/28 05:15:40
1	97	336.54999046551285	290.9131632807909	20/04/28 05:15:40
1	97	336.55637145635154	290.91643746983266	20/04/28 05:15:41
1	97	336.56246094559066	290.937287197154	20/04/28 05:15:41
1	97	336.8107080127753	291.0563879556597	20/04/28 05:15:41
1	97	336.5184756745797	291.1102878477553	20/04/28 05:15:41
1	97	336.40342017027524	290.94094284967645	20/04/28 05:15:41
1	97	336.65274507325887	291.06860381991356	20/04/28 05:15:41
1	97	336.7564408478877	291.0867572370823	20/04/28 05:15:41
1	97	336.8992802581405	290.8486489792066	20/04/28 05:15:41
1	97	336.8981000926811	290.86620924234063	20/04/28 05:15:41
1	97	337.12863720786777	290.80118747623067	20/04/28 05:15:42
1	97	337.12863720786777	290.80118747623067	20/04/28 05:15:42
1	97	337.39763279208285	290.7470804091879	20/04/28 05:15:42
1	97	337.14192332060475	290.59059417562605	20/04/28 05:15:42
1	97	337.14192332060475	290.59059417562605	20/04/28 05:15:42
1	97	337.2785203789664	290.5439734487158	20/04/28 05:15:42
1	97	337.2238350741947	290.5495515825459	20/04/28 05:15:42
1	97	337.2238350741947	290.5495515825459	20/04/28 05:15:42
1	97	337.33175417745184	290.45034846458964	20/04/28 05:15:42
1	97	337.1923909312736	290.53404246738864	20/04/28 05:15:42
1	97	337.00998020226734	290.73239732851	20/04/28 05:15:43
1	97	337.25084133902016	290.6593867084395	20/04/28 05:15:43
1	97	337.2301683520748	290.7481938220834	20/04/28 05:15:43
1	97	337.28858914542127	290.7534479126556	20/04/28 05:15:43
1	97	337.1055892556409	290.9550271917578	20/04/28 05:15:43
1	97	337.167871491202	290.98002293097574	20/04/28 05:15:43
1	97	337.31007453456533	291.05654805526603	20/04/28 05:15:43
1	97	337.4458918073727	291.083256329861	20/04/28 05:15:43
1	97	337.2180226397459	291.21952443973754	20/04/28 05:15:43
1	97	337.26630696369796	291.0975126959562	20/04/28 05:15:43
1	97	337.0736660227573	290.93712759863644	20/04/28 05:15:44
1	97	336.9350518254702	290.9135205269604	20/04/28 05:15:44
1	97	337.0732743056226	290.93203001923433	20/04/28 05:15:44
1	97	337.18623415821787	291.2048678826331	20/04/28 05:15:44
1	97	337.2016457541664	290.98331487082925	20/04/28 05:15:44
1	97	337.3881961778055	291.04279143369394	20/04/28 05:15:44
1	97	337.52787003195215	291.2185039097931	20/04/28 05:15:44
1	97	337.5881946453494	291.25824632360485	20/04/28 05:15:44
1	97	337.60445754529667	291.2291830966028	20/04/28 05:15:44
1	97	337.480955123273	291.2597730578177	20/04/28 05:15:45
1	97	337.1892490449735	291.22807034000215	20/04/28 05:15:45
1	97	337.2489625076767	291.04829584004005	20/04/28 05:15:45
1	97	337.32436451948183	291.25692043429405	20/04/28 05:15:45
1	97	337.32436451948183	291.25692043429405	20/04/28 05:15:45
1	97	337.28754464619294	291.2384416733831	20/04/28 05:15:45
1	97	337.28754464619294	291.2384416733831	20/04/28 05:15:45
1	97	337.2235149478804	291.30619193927555	20/04/28 05:15:45
1	97	337.45735653046734	291.1391412614321	20/04/28 05:15:45
1	97	337.557542818678	291.0146591771688	20/04/28 05:15:45
1	97	337.5541783585058	291.0298371083773	20/04/28 05:15:46
1	97	337.47957985612817	290.87645404347904	20/04/28 05:15:46
1	97	337.71926495281275	290.9218541653523	20/04/28 05:15:46
1	97	337.66602278760695	290.94549332664906	20/04/28 05:15:46
1	97	337.59716399228034	291.1339765609466	20/04/28 05:15:46
1	97	337.5069274683225	291.1277328111159	20/04/28 05:15:46
1	97	337.47316695774794	290.9958404492845	20/04/28 05:15:46
1	97	337.504999408998	290.781249334799	20/04/28 05:15:46
1	97	337.504999408998	290.781249334799	20/04/28 05:15:46
1	97	337.46473480082295	290.8375179273791	20/04/28 05:15:46
1	97	337.5205303500738	290.80195088881754	20/04/28 05:15:47
1	97	337.2965553817906	290.9782792532312	20/04/28 05:15:47
1	97	337.1731095814691	290.99497627910574	20/04/28 05:15:47
1	97	337.0612869133815	290.8819579393149	20/04/28 05:15:47
1	97	337.0361577542351	290.86625751134244	20/04/28 05:15:47
1	97	337.0092611432071	290.8875461371682	20/04/28 05:15:47
1	97	337.10895661928953	291.15454088590957	20/04/28 05:15:47
1	97	337.3544042159074	291.03296433178605	20/04/28 05:15:47
1	97	337.2031286333019	291.13008749469174	20/04/28 05:15:47
1	97	337.2339761403455	291.15130072996124	20/04/28 05:15:48
1	97	337.30956707300203	291.3088618677289	20/04/28 05:15:48
1	97	337.2094681384148	291.3117293125738	20/04/28 05:15:48
1	97	337.1723859245719	291.3068291328878	20/04/28 05:15:48
1	97	337.07692801291824	291.1232387280549	20/04/28 05:15:48
1	97	336.96161084524	291.0915815316286	20/04/28 05:15:48
1	97	336.82523591780466	290.9093024743791	20/04/28 05:15:48
1	97	337.0137524526555	290.8110067850548	20/04/28 05:15:48
1	97	336.86476194185553	290.99538187555106	20/04/28 05:15:48
1	97	337.0015068207947	290.9635951068993	20/04/28 05:15:48
1	97	337.11240580975954	290.8755278402612	20/04/28 05:15:49
1	97	337.12078043210613	290.7819267776006	20/04/28 05:15:49
1	97	337.24623101019444	290.82780925549906	20/04/28 05:15:49
1	97	337.5225396709228	290.8201899714954	20/04/28 05:15:49
1	97	337.3293185855625	290.7611528319307	20/04/28 05:15:49
1	97	337.326822311843	290.7274627179501	20/04/28 05:15:49
1	97	337.2420406239306	290.6193281671346	20/04/28 05:15:49
1	97	337.239947851983	290.6495007802642	20/04/28 05:15:49
1	97	337.0747332568408	290.5979636999237	20/04/28 05:15:49
1	97	337.061274809995	290.6528594388603	20/04/28 05:15:49
1	97	337.2698600381855	290.6758810729982	20/04/28 05:15:50
1	97	337.1986799324722	290.71797313245503	20/04/28 05:15:50
1	97	337.22593301684645	290.825841477825	20/04/28 05:15:50
1	97	337.2001377315142	291.01179294828864	20/04/28 05:15:50
1	97	337.2799076035803	291.11005877568414	20/04/28 05:15:50
1	97	337.1723575972828	291.19086908939215	20/04/28 05:15:50
1	97	337.3395509117041	291.1834959862288	20/04/28 05:15:50
1	97	337.3382962253819	291.1634918255652	20/04/28 05:15:50
1	97	337.1925845487582	291.09221846150484	20/04/28 05:15:50
1	97	337.238085161202	291.1418501590951	20/04/28 05:15:51
1	97	337.16692569668106	291.0565636845724	20/04/28 05:15:51
1	97	337.3092374533031	291.0549171844134	20/04/28 05:15:51
1	97	337.5432686297653	291.13975029881766	20/04/28 05:15:51
1	97	337.7085755847794	291.2544186105106	20/04/28 05:15:51
1	97	337.91262926158635	291.22087805783383	20/04/28 05:15:51
1	97	337.9721273779948	291.26179257398076	20/04/28 05:15:51
1	97	338.00149001246876	291.2910928153699	20/04/28 05:15:51
1	97	337.9539750903621	291.3470149511245	20/04/28 05:15:51
1	97	338.02615231337154	291.24524566567646	20/04/28 05:15:51
1	97	337.7702371051366	291.26205221767754	20/04/28 05:15:52
1	97	337.8962152595563	290.99975199631706	20/04/28 05:15:52
1	97	337.9242648951993	291.140746595905	20/04/28 05:15:52
1	97	337.9538437636713	291.151598479149	20/04/28 05:15:52
1	97	337.9549436895697	291.21713674708593	20/04/28 05:15:52
1	97	338.03828179772535	291.0734091946252	20/04/28 05:15:52
1	97	338.217720958011	291.2196936335715	20/04/28 05:15:52
1	97	338.0815100170976	291.0449711987465	20/04/28 05:15:52
1	97	338.0669984628882	291.0310432742043	20/04/28 05:15:52
1	97	337.9742567040875	291.1419643802648	20/04/28 05:15:52
1	97	337.86999094522037	291.267398931024	20/04/28 05:15:53
1	97	337.8678639327565	291.2748566512195	20/04/28 05:15:53
1	97	337.79970289487585	291.4097471220857	20/04/28 05:15:53
1	97	337.8320155980949	291.17223911169106	20/04/28 05:15:53
1	97	337.9789842399641	291.34562176443364	20/04/28 05:15:53
1	97	338.12448017414425	291.3242332792914	20/04/28 05:15:53
1	97	338.0968015632515	291.3111255702061	20/04/28 05:15:53
1	97	337.83657534982575	291.3972916865229	20/04/28 05:15:53
1	97	337.8983807324381	291.6681736875354	20/04/28 05:15:53
1	97	338.06397095333256	291.57519897380456	20/04/28 05:15:54
1	97	338.2082389175559	291.79755891907917	20/04/28 05:15:54
1	97	338.2158862966829	291.62467006009206	20/04/28 05:15:54
1	97	338.0624292608647	291.4777525771254	20/04/28 05:15:54
1	97	338.24873187933423	291.5711925755978	20/04/28 05:15:54
1	97	338.4740105660931	291.75287812924506	20/04/28 05:15:54
1	97	338.5771479562711	291.77719197408925	20/04/28 05:15:54
1	97	338.370613117936	291.7418670595073	20/04/28 05:15:54
1	97	338.24118931517825	291.6594632773244	20/04/28 05:15:54
1	97	338.4131711439068	291.6897974747744	20/04/28 05:15:54
1	97	338.2354471254904	291.67698173551946	20/04/28 05:15:55
1	97	338.2077196444706	291.521915918352	20/04/28 05:15:55
1	97	338.2113688258081	291.78694189072075	20/04/28 05:15:55
1	97	338.2198472061228	291.54294841416487	20/04/28 05:15:55
1	97	338.42412581596227	291.70451960483706	20/04/28 05:15:55
1	97	338.46312373989525	291.5168966296954	20/04/28 05:15:55
1	97	338.39409197931064	291.3810636273285	20/04/28 05:15:55
1	97	338.38050434957006	291.38026028177734	20/04/28 05:15:55
1	97	338.43192485107375	291.4124768693894	20/04/28 05:15:55
1	97	338.27298656725844	291.5084936269391	20/04/28 05:15:55
1	97	338.3817155611651	291.65973627453405	20/04/28 05:15:56
1	97	338.2141408927664	291.4687779474275	20/04/28 05:15:56
1	97	338.21013907939266	291.4508636035644	20/04/28 05:15:56
1	97	338.4561733938067	291.46245083956035	20/04/28 05:15:56
1	97	338.6695438077644	291.3842238419129	20/04/28 05:15:56
1	97	338.86439026339525	291.23221474631845	20/04/28 05:15:56
1	97	338.76197565785776	291.3645335754324	20/04/28 05:15:56
1	97	338.8052490651581	291.38979033257203	20/04/28 05:15:56
1	97	338.58669102679266	291.4493647822639	20/04/28 05:15:56
1	97	338.3897843215469	291.23096797543377	20/04/28 05:15:57
1	97	338.60315062540803	291.3977974618935	20/04/28 05:15:57
1	97	338.6717010655347	291.28166824289303	20/04/28 05:15:57
1	97	338.6118904349423	291.3314974515384	20/04/28 05:15:57
1	97	338.40931548354473	291.3003787600341	20/04/28 05:15:57
1	97	338.59224953958176	291.15753323757406	20/04/28 05:15:57
1	97	338.627136963389	291.3861524117534	20/04/28 05:15:57
1	97	338.642559690506	291.3565951559729	20/04/28 05:15:57
1	97	338.8063661822703	291.30411146307847	20/04/28 05:15:57
1	97	338.865912886077	291.3378961362874	20/04/28 05:15:57
1	97	338.9264485183198	291.34157740532083	20/04/28 05:15:58
1	97	338.8416158533672	291.5405209269682	20/04/28 05:15:58
1	97	338.872862897804	291.5170724942762	20/04/28 05:15:58
1	97	338.87898207929163	291.43074300594617	20/04/28 05:15:58
1	97	338.88421254008193	291.43165754449416	20/04/28 05:15:58
1	97	338.89292608170985	291.43648646206555	20/04/28 05:15:58
1	97	339.04112048954033	291.6024853697302	20/04/28 05:15:58
1	97	338.967555850376	291.6357352800073	20/04/28 05:15:58
1	97	338.80703719855427	291.68421878105784	20/04/28 05:15:58
1	97	338.721219963821	291.6014321671706	20/04/28 05:15:58
1	97	338.6816987893454	291.84737412960186	20/04/28 05:15:59
1	97	338.8702224965111	291.7283238309749	20/04/28 05:15:59
1	97	338.77832472999705	291.45958164808826	20/04/28 05:15:59
1	97	338.8902608208354	291.4793552607047	20/04/28 05:15:59
1	97	339.13229102302654	291.58650114245324	20/04/28 05:15:59
1	97	339.1261720487311	291.5911542252565	20/04/28 05:15:59
1	97	339.3563572375147	291.54905456502473	20/04/28 05:15:59
1	97	339.3585065611753	291.55297190761814	20/04/28 05:15:59
1	97	339.1726085707957	291.43080493503004	20/04/28 05:15:59
1	97	339.0912973797086	291.4676484277526	20/04/28 05:16:00
1	97	339.0370540844972	291.4126477756001	20/04/28 05:16:00
1	97	338.9557949603658	291.19612411471525	20/04/28 05:16:00
1	97	338.93623384208485	291.20482189788385	20/04/28 05:16:00
1	97	338.92376516088996	291.4631366958727	20/04/28 05:16:00
1	97	339.17000666653036	291.4035721135299	20/04/28 05:16:00
1	97	339.1348825652813	291.3052337492667	20/04/28 05:16:00
1	97	339.03541923041786	291.3177091772275	20/04/28 05:16:00
1	97	338.84541840196647	291.2578251374829	20/04/28 05:16:00
1	97	338.85576507817	291.23811855380865	20/04/28 05:16:00
1	97	338.914058606171	291.34646976308187	20/04/28 05:16:01
1	97	339.0949274318511	291.57639712007597	20/04/28 05:16:01
1	97	339.1526770297331	291.61956924976937	20/04/28 05:16:01
1	97	339.0408177329292	291.3989413280851	20/04/28 05:16:01
1	97	339.0398580423493	291.3988091184005	20/04/28 05:16:01
1	97	338.7737135672741	291.40430344440455	20/04/28 05:16:01
1	97	338.9894866979904	291.4012032425219	20/04/28 05:16:01
1	97	339.20158076820616	291.5033822730483	20/04/28 05:16:01
1	97	338.94064219806734	291.4703280722016	20/04/28 05:16:01
1	97	338.90448995843815	291.7344866234553	20/04/28 05:16:01
1	97	338.917947974279	291.8296647089514	20/04/28 05:16:02
1	97	339.1509615025869	291.9025468489751	20/04/28 05:16:02
1	97	339.4372043308926	291.96114870608545	20/04/28 05:16:02
1	97	339.26034196555617	292.16592936814874	20/04/28 05:16:02
1	97	339.15791826453386	292.1268469976654	20/04/28 05:16:02
1	97	338.9580068213145	292.0759319053733	20/04/28 05:16:02
1	97	339.1589831181303	291.89741030902366	20/04/28 05:16:02
1	97	339.34060450329156	291.9235048198768	20/04/28 05:16:02
1	97	339.32377902998405	291.8343577846806	20/04/28 05:16:02
1	97	339.251722362686	291.9940590874622	20/04/28 05:16:03
1	97	339.456183507049	291.99380145152026	20/04/28 05:16:03
1	97	339.49534079195394	291.9844477959178	20/04/28 05:16:03
1	97	339.55452145558587	291.9870207739627	20/04/28 05:16:03
1	97	339.6772555610801	292.01554384026593	20/04/28 05:16:03
1	97	339.7422224622722	292.1225263447271	20/04/28 05:16:03
1	97	339.7042098973016	292.174023319142	20/04/28 05:16:03
1	97	339.7426416000465	292.21058456444945	20/04/28 05:16:03
1	97	339.98851743822166	292.13637305449765	20/04/28 05:16:03
1	97	339.92202641197235	292.0236686570238	20/04/28 05:16:03
1	97	339.6372495583419	292.01120941728925	20/04/28 05:16:04
1	97	339.80785399995386	292.04511730338606	20/04/28 05:16:04
1	97	339.9305102810749	292.1567164073519	20/04/28 05:16:04
1	97	340.0974750838793	292.26162418562853	20/04/28 05:16:04
1	97	340.1842799352915	292.33850837570697	20/04/28 05:16:04
1	97	340.1528500280745	292.3576595895272	20/04/28 05:16:04
1	97	340.3202634897779	292.1624974092909	20/04/28 05:16:04
1	97	340.35183976902135	292.12699514050576	20/04/28 05:16:04
1	97	340.0693963545972	292.13166585177976	20/04/28 05:16:04
1	97	340.11929742986865	292.1497807109497	20/04/28 05:16:04
1	97	340.0349564299827	292.13702624429146	20/04/28 05:16:05
1	97	340.0269569254446	292.18457893983907	20/04/28 05:16:05
1	97	339.9797427003523	292.132208303144	20/04/28 05:16:05
1	97	339.9762105124221	292.29744762911713	20/04/28 05:16:05
1	97	340.02611292320375	292.43899800995246	20/04/28 05:16:05
1	97	340.1074313260701	292.41363719976647	20/04/28 05:16:05
1	97	340.14259075036534	292.4404577089299	20/04/28 05:16:05
1	97	340.00379431448204	292.5839356364181	20/04/28 05:16:05
1	97	339.86900419979486	292.60807339346553	20/04/28 05:16:05
1	97	339.90329696769106	292.51791737059654	20/04/28 05:16:06
1	97	339.83362047567095	292.4656355992382	20/04/28 05:16:06
1	97	339.8440867633317	292.3866075943163	20/04/28 05:16:06
1	97	339.71768125508066	292.43994612714954	20/04/28 05:16:06
1	97	339.5877455125371	292.4481631099263	20/04/28 05:16:06
1	97	339.5923357573741	292.4572107977354	20/04/28 05:16:06
1	97	339.7735932575907	292.35382091250295	20/04/28 05:16:06
1	97	339.9914999601848	292.2173128907156	20/04/28 05:16:06
1	97	339.8230019576371	292.1439131665669	20/04/28 05:16:06
1	97	339.8266250836034	292.29746464228515	20/04/28 05:16:06
1	97	339.82660706735186	292.2880831440281	20/04/28 05:16:07
1	97	340.00591424198524	292.23496193167534	20/04/28 05:16:07
1	97	339.95138562261656	292.2109754143466	20/04/28 05:16:07
1	97	339.79515225002	292.13974012423205	20/04/28 05:16:07
1	97	339.7974057651423	292.14478689047917	20/04/28 05:16:07
1	97	339.8147940282146	292.34496528069667	20/04/28 05:16:07
1	97	339.8431423146683	292.24411288397016	20/04/28 05:16:07
1	97	339.844541536286	292.21098676833634	20/04/28 05:16:07
1	97	339.93614099920904	292.06398546128133	20/04/28 05:16:07
1	97	340.0112185409407	291.978690565536	20/04/28 05:16:07
1	97	340.0136680795721	291.9883799916922	20/04/28 05:16:08
1	97	340.01233980323286	292.02212660888165	20/04/28 05:16:08
1	97	339.870772146254	292.22492780119154	20/04/28 05:16:08
1	97	339.8724968844964	292.23277654056875	20/04/28 05:16:08
1	97	339.87253814365573	292.2193418976242	20/04/28 05:16:08
1	97	339.59293121602343	292.1741411978208	20/04/28 05:16:08
1	97	339.51322607235244	292.24543351314605	20/04/28 05:16:08
1	97	339.67359389402236	292.0309162947539	20/04/28 05:16:08
1	97	339.77720939421147	291.782262142846	20/04/28 05:16:08
1	97	339.8813254490895	291.940871975076	20/04/28 05:16:09
1	97	339.9130062049591	292.157002167017	20/04/28 05:16:09
1	97	340.072427671359	292.2030816709765	20/04/28 05:16:09
1	97	339.9940482478312	292.48593977734424	20/04/28 05:16:09
1	97	339.7761374823205	292.32505005989515	20/04/28 05:16:09
1	97	339.75747282598644	292.560797567992	20/04/28 05:16:09
1	97	339.86170476097755	292.42366663568606	20/04/28 05:16:09
1	97	339.82616163195235	292.4508274039253	20/04/28 05:16:09
1	97	340.009140586754	292.41366004396394	20/04/28 05:16:09
1	97	339.9558924862504	292.3916014214559	20/04/28 05:16:09
1	97	340.0780084451268	292.19879649467725	20/04/28 05:16:10
1	97	340.20776293084253	291.9981000124293	20/04/28 05:16:10
1	97	340.2499617463848	291.97610273192834	20/04/28 05:16:10
1	97	340.2499617463848	291.97610273192834	20/04/28 05:16:10
