deviceId	device_location_x	device_location_y	rssi_measurement	timeStamp
111	349.3574161788773	282.0413831973989	-69	21/02/24 15:47:21
118	357.09356967635637	275.4844405310735	-70	21/02/24 15:47:21
108	354.5433741308232	271.8469578377465	-65	21/02/24 15:47:21
107	352.24436078636603	271.4962331820773	-63	21/02/24 15:47:21
106	352.82196230706245	270.7390515122939	-65	21/02/24 15:47:21
113	350.4034533178371	267.72630832367133	-62	21/02/24 15:47:21
95	348.2574783689184	265.4034322422755	-57	21/02/24 15:47:21
99	360.0550977801786	265.17619063766165	-69	21/02/24 15:47:21
100	345.6304273143794	285.66832195343085	-69	21/02/24 15:47:21
101	344.8940587728134	285.507681768186	-72	21/02/24 15:47:21
104	344.29972171429097	278.87653419291075	-63	21/02/24 15:47:21
103	341.9121052518552	264.28883990856684	-44	21/02/24 15:47:21
98	334.9124542906195	280.9377639416658	-67	21/02/24 15:47:21
105	330.89379071296145	276.9107744382362	-65	21/02/24 15:47:21

111	349.3574161788773	282.0413831973989	-70	21/02/24 15:47:22
118	357.09356967635637	275.4844405310735	-69	21/02/24 15:47:22
108	354.5433741308232	271.8469578377465	-65	21/02/24 15:47:22
107	352.24436078636603	271.4962331820773	-63	21/02/24 15:47:22
106	352.82196230706245	270.7390515122939	-66	21/02/24 15:47:22
113	350.4034533178371	267.72630832367133	-61	21/02/24 15:47:22
95	348.2574783689184	265.4034322422755	-58	21/02/24 15:47:22
99	360.0550977801786	265.17619063766165	-72	21/02/24 15:47:22
100	345.6304273143794	285.66832195343085	-71	21/02/24 15:47:22
101	344.8940587728134	285.507681768186	-71	21/02/24 15:47:22
104	344.29972171429097	278.87653419291075	-64	21/02/24 15:47:22
103	341.9121052518552	264.28883990856684	-45	21/02/24 15:47:22
98	334.9124542906195	280.9377639416658	-66	21/02/24 15:47:22
105	330.89379071296145	276.9107744382362	-65	21/02/24 15:47:22

111	349.3574161788773	282.0413831973989	-68	21/02/24 15:47:23
118	357.09356967635637	275.4844405310735	-71	21/02/24 15:47:23
108	354.5433741308232	271.8469578377465	-67	21/02/24 15:47:23
107	352.24436078636603	271.4962331820773	-63	21/02/24 15:47:23
106	352.82196230706245	270.7390515122939	-67	21/02/24 15:47:23
113	350.4034533178371	267.72630832367133	-61	21/02/24 15:47:23
95	348.2574783689184	265.4034322422755	-60	21/02/24 15:47:23
99	360.0550977801786	265.17619063766165	-72	21/02/24 15:47:23
100	345.6304273143794	285.66832195343085	-70	21/02/24 15:47:23
101	344.8940587728134	285.507681768186	-70	21/02/24 15:47:23
104	344.29972171429097	278.87653419291075	-66	21/02/24 15:47:23
103	341.9121052518552	264.28883990856684	-47	21/02/24 15:47:23
98	334.9124542906195	280.9377639416658	-68	21/02/24 15:47:23
105	330.89379071296145	276.9107744382362	-64	21/02/24 15:47:23

111	349.3574161788773	282.0413831973989	-70	21/02/24 15:47:24
118	357.09356967635637	275.4844405310735	-70	21/02/24 15:47:24
108	354.5433741308232	271.8469578377465	-69	21/02/24 15:47:24
107	352.24436078636603	271.4962331820773	-63	21/02/24 15:47:24
106	352.82196230706245	270.7390515122939	-66	21/02/24 15:47:24
113	350.4034533178371	267.72630832367133	-62	21/02/24 15:47:24
95	348.2574783689184	265.4034322422755	-56	21/02/24 15:47:24
99	360.0550977801786	265.17619063766165	-72	21/02/24 15:47:24
101	344.8940587728134	285.507681768186	-72	21/02/24 15:47:24
104	344.29972171429097	278.87653419291075	-66	21/02/24 15:47:24
103	341.9121052518552	264.28883990856684	-43	21/02/24 15:47:24
98	334.9124542906195	280.9377639416658	-69	21/02/24 15:47:24
105	330.89379071296145	276.9107744382362	-65	21/02/24 15:47:24

111	349.3574161788773	282.0413831973989	-69	21/02/24 15:47:25
118	357.09356967635637	275.4844405310735	-69	21/02/24 15:47:25
108	354.5433741308232	271.8469578377465	-68	21/02/24 15:47:25
107	352.24436078636603	271.4962331820773	-65	21/02/24 15:47:25
106	352.82196230706245	270.7390515122939	-63	21/02/24 15:47:25
113	350.4034533178371	267.72630832367133	-60	21/02/24 15:47:25
95	348.2574783689184	265.4034322422755	-58	21/02/24 15:47:25
99	360.0550977801786	265.17619063766165	-72	21/02/24 15:47:25
101	344.8940587728134	285.507681768186	-70	21/02/24 15:47:25
104	344.29972171429097	278.87653419291075	-66	21/02/24 15:47:25
103	341.9121052518552	264.28883990856684	-41	21/02/24 15:47:25
98	334.9124542906195	280.9377639416658	-69	21/02/24 15:47:25
105	330.89379071296145	276.9107744382362	-68	21/02/24 15:47:25

111	349.3574161788773	282.0413831973989	-68	21/02/24 15:47:26
118	357.09356967635637	275.4844405310735	-68	21/02/24 15:47:26
108	354.5433741308232	271.8469578377465	-66	21/02/24 15:47:26
107	352.24436078636603	271.4962331820773	-63	21/02/24 15:47:26
106	352.82196230706245	270.7390515122939	-65	21/02/24 15:47:26
113	350.4034533178371	267.72630832367133	-61	21/02/24 15:47:26
95	348.2574783689184	265.4034322422755	-57	21/02/24 15:47:26
99	360.0550977801786	265.17619063766165	-70	21/02/24 15:47:26
104	344.29972171429097	278.87653419291075	-67	21/02/24 15:47:26
103	341.9121052518552	264.28883990856684	-37	21/02/24 15:47:26
98	334.9124542906195	280.9377639416658	-70	21/02/24 15:47:26
105	330.89379071296145	276.9107744382362	-66	21/02/24 15:47:26

111	349.3574161788773	282.0413831973989	-69	21/02/24 15:47:27
118	357.09356967635637	275.4844405310735	-69	21/02/24 15:47:27
108	354.5433741308232	271.8469578377465	-67	21/02/24 15:47:27
107	352.24436078636603	271.4962331820773	-67	21/02/24 15:47:27
106	352.82196230706245	270.7390515122939	-63	21/02/24 15:47:27
113	350.4034533178371	267.72630832367133	-63	21/02/24 15:47:27
95	348.2574783689184	265.4034322422755	-58	21/02/24 15:47:27
99	360.0550977801786	265.17619063766165	-70	21/02/24 15:47:27
101	344.8940587728134	285.507681768186	-71	21/02/24 15:47:27
104	344.29972171429097	278.87653419291075	-65	21/02/24 15:47:27
103	341.9121052518552	264.28883990856684	-41	21/02/24 15:47:27
98	334.9124542906195	280.9377639416658	-69	21/02/24 15:47:27
105	330.89379071296145	276.9107744382362	-66	21/02/24 15:47:27

111	349.3574161788773	282.0413831973989	-71	21/02/24 15:47:28
118	357.09356967635637	275.4844405310735	-71	21/02/24 15:47:28
108	354.5433741308232	271.8469578377465	-66	21/02/24 15:47:28
107	352.24436078636603	271.4962331820773	-65	21/02/24 15:47:28
106	352.82196230706245	270.7390515122939	-65	21/02/24 15:47:28
113	350.4034533178371	267.72630832367133	-62	21/02/24 15:47:28
95	348.2574783689184	265.4034322422755	-57	21/02/24 15:47:28
101	344.8940587728134	285.507681768186	-71	21/02/24 15:47:28
104	344.29972171429097	278.87653419291075	-66	21/02/24 15:47:28
103	341.9121052518552	264.28883990856684	-46	21/02/24 15:47:28
98	334.9124542906195	280.9377639416658	-67	21/02/24 15:47:28
105	330.89379071296145	276.9107744382362	-68	21/02/24 15:47:28

111	349.3574161788773	282.0413831973989	-69	21/02/24 15:47:29
118	357.09356967635637	275.4844405310735	-71	21/02/24 15:47:29
108	354.5433741308232	271.8469578377465	-66	21/02/24 15:47:29
107	352.24436078636603	271.4962331820773	-66	21/02/24 15:47:29
106	352.82196230706245	270.7390515122939	-66	21/02/24 15:47:29
113	350.4034533178371	267.72630832367133	-61	21/02/24 15:47:29
95	348.2574783689184	265.4034322422755	-58	21/02/24 15:47:29
99	360.0550977801786	265.17619063766165	-69	21/02/24 15:47:29
100	345.6304273143794	285.66832195343085	-70	21/02/24 15:47:29
101	344.8940587728134	285.507681768186	-70	21/02/24 15:47:29
104	344.29972171429097	278.87653419291075	-64	21/02/24 15:47:29
103	341.9121052518552	264.28883990856684	-47	21/02/24 15:47:29
98	334.9124542906195	280.9377639416658	-67	21/02/24 15:47:29
105	330.89379071296145	276.9107744382362	-64	21/02/24 15:47:29

111	349.3574161788773	282.0413831973989	-70	21/02/24 15:47:30
118	357.09356967635637	275.4844405310735	-71	21/02/24 15:47:30
108	354.5433741308232	271.8469578377465	-69	21/02/24 15:47:30
107	352.24436078636603	271.4962331820773	-65	21/02/24 15:47:30
106	352.82196230706245	270.7390515122939	-66	21/02/24 15:47:30
113	350.4034533178371	267.72630832367133	-60	21/02/24 15:47:30
95	348.2574783689184	265.4034322422755	-57	21/02/24 15:47:30
99	360.0550977801786	265.17619063766165	-71	21/02/24 15:47:30
100	345.6304273143794	285.66832195343085	-69	21/02/24 15:47:30
101	344.8940587728134	285.507681768186	-69	21/02/24 15:47:30
104	344.29972171429097	278.87653419291075	-65	21/02/24 15:47:30
103	341.9121052518552	264.28883990856684	-43	21/02/24 15:47:30
98	334.9124542906195	280.9377639416658	-66	21/02/24 15:47:30
105	330.89379071296145	276.9107744382362	-67	21/02/24 15:47:30

111	349.3574161788773	282.0413831973989	-70	21/02/24 15:47:31
118	357.09356967635637	275.4844405310735	-68	21/02/24 15:47:31
108	354.5433741308232	271.8469578377465	-67	21/02/24 15:47:31
107	352.24436078636603	271.4962331820773	-64	21/02/24 15:47:31
106	352.82196230706245	270.7390515122939	-65	21/02/24 15:47:31
113	350.4034533178371	267.72630832367133	-63	21/02/24 15:47:31
95	348.2574783689184	265.4034322422755	-59	21/02/24 15:47:31
99	360.0550977801786	265.17619063766165	-72	21/02/24 15:47:31
100	345.6304273143794	285.66832195343085	-69	21/02/24 15:47:31
101	344.8940587728134	285.507681768186	-70	21/02/24 15:47:31
104	344.29972171429097	278.87653419291075	-62	21/02/24 15:47:31
103	341.9121052518552	264.28883990856684	-46	21/02/24 15:47:31
98	334.9124542906195	280.9377639416658	-67	21/02/24 15:47:31
105	330.89379071296145	276.9107744382362	-65	21/02/24 15:47:31

111	349.3574161788773	282.0413831973989	-69	21/02/24 15:47:32
118	357.09356967635637	275.4844405310735	-70	21/02/24 15:47:32
108	354.5433741308232	271.8469578377465	-66	21/02/24 15:47:32
107	352.24436078636603	271.4962331820773	-64	21/02/24 15:47:32
106	352.82196230706245	270.7390515122939	-65	21/02/24 15:47:32
113	350.4034533178371	267.72630832367133	-63	21/02/24 15:47:32
95	348.2574783689184	265.4034322422755	-57	21/02/24 15:47:32
99	360.0550977801786	265.17619063766165	-70	21/02/24 15:47:32
100	345.6304273143794	285.66832195343085	-72	21/02/24 15:47:32
101	344.8940587728134	285.507681768186	-71	21/02/24 15:47:32
104	344.29972171429097	278.87653419291075	-65	21/02/24 15:47:32
103	341.9121052518552	264.28883990856684	-45	21/02/24 15:47:32
98	334.9124542906195	280.9377639416658	-68	21/02/24 15:47:32
105	330.89379071296145	276.9107744382362	-65	21/02/24 15:47:32

111	349.3574161788773	282.0413831973989	-71	21/02/24 15:47:33
118	357.09356967635637	275.4844405310735	-71	21/02/24 15:47:33
108	354.5433741308232	271.8469578377465	-68	21/02/24 15:47:33
107	352.24436078636603	271.4962331820773	-64	21/02/24 15:47:33
106	352.82196230706245	270.7390515122939	-64	21/02/24 15:47:33
113	350.4034533178371	267.72630832367133	-60	21/02/24 15:47:33
95	348.2574783689184	265.4034322422755	-59	21/02/24 15:47:33
99	360.0550977801786	265.17619063766165	-70	21/02/24 15:47:33
100	345.6304273143794	285.66832195343085	-72	21/02/24 15:47:33
101	344.8940587728134	285.507681768186	-68	21/02/24 15:47:33
104	344.29972171429097	278.87653419291075	-64	21/02/24 15:47:33
103	341.9121052518552	264.28883990856684	-45	21/02/24 15:47:33
98	334.9124542906195	280.9377639416658	-66	21/02/24 15:47:33
105	330.89379071296145	276.9107744382362	-64	21/02/24 15:47:33

111	349.3574161788773	282.0413831973989	-68	21/02/24 15:47:34
118	357.09356967635637	275.4844405310735	-70	21/02/24 15:47:34
108	354.5433741308232	271.8469578377465	-67	21/02/24 15:47:34
107	352.24436078636603	271.4962331820773	-66	21/02/24 15:47:34
106	352.82196230706245	270.7390515122939	-65	21/02/24 15:47:34
113	350.4034533178371	267.72630832367133	-60	21/02/24 15:47:34
95	348.2574783689184	265.4034322422755	-59	21/02/24 15:47:34
99	360.0550977801786	265.17619063766165	-70	21/02/24 15:47:34
100	345.6304273143794	285.66832195343085	-70	21/02/24 15:47:34
101	344.8940587728134	285.507681768186	-70	21/02/24 15:47:34
104	344.29972171429097	278.87653419291075	-65	21/02/24 15:47:34
103	341.9121052518552	264.28883990856684	-47	21/02/24 15:47:34
98	334.9124542906195	280.9377639416658	-67	21/02/24 15:47:34
105	330.89379071296145	276.9107744382362	-64	21/02/24 15:47:34

111	349.3574161788773	282.0413831973989	-69	21/02/24 15:47:35
118	357.09356967635637	275.4844405310735	-71	21/02/24 15:47:35
108	354.5433741308232	271.8469578377465	-68	21/02/24 15:47:35
107	352.24436078636603	271.4962331820773	-65	21/02/24 15:47:35
106	352.82196230706245	270.7390515122939	-64	21/02/24 15:47:35
113	350.4034533178371	267.72630832367133	-60	21/02/24 15:47:35
95	348.2574783689184	265.4034322422755	-61	21/02/24 15:47:35
100	345.6304273143794	285.66832195343085	-72	21/02/24 15:47:35
101	344.8940587728134	285.507681768186	-69	21/02/24 15:47:35
104	344.29972171429097	278.87653419291075	-65	21/02/24 15:47:35
103	341.9121052518552	264.28883990856684	-46	21/02/24 15:47:35
98	334.9124542906195	280.9377639416658	-65	21/02/24 15:47:35
105	330.89379071296145	276.9107744382362	-64	21/02/24 15:47:35

111	349.3574161788773	282.0413831973989	-71	21/02/24 15:47:36
118	357.09356967635637	275.4844405310735	-68	21/02/24 15:47:36
108	354.5433741308232	271.8469578377465	-68	21/02/24 15:47:36
107	352.24436078636603	271.4962331820773	-63	21/02/24 15:47:36
106	352.82196230706245	270.7390515122939	-65	21/02/24 15:47:36
113	350.4034533178371	267.72630832367133	-60	21/02/24 15:47:36
95	348.2574783689184	265.4034322422755	-57	21/02/24 15:47:36
99	360.0550977801786	265.17619063766165	-70	21/02/24 15:47:36
100	345.6304273143794	285.66832195343085	-71	21/02/24 15:47:36
101	344.8940587728134	285.507681768186	-71	21/02/24 15:47:36
104	344.29972171429097	278.87653419291075	-66	21/02/24 15:47:36
103	341.9121052518552	264.28883990856684	-45	21/02/24 15:47:36
98	334.9124542906195	280.9377639416658	-68	21/02/24 15:47:36
105	330.89379071296145	276.9107744382362	-67	21/02/24 15:47:36

111	349.3574161788773	282.0413831973989	-68	21/02/24 15:47:37
118	357.09356967635637	275.4844405310735	-72	21/02/24 15:47:37
108	354.5433741308232	271.8469578377465	-68	21/02/24 15:47:37
107	352.24436078636603	271.4962331820773	-65	21/02/24 15:47:37
106	352.82196230706245	270.7390515122939	-64	21/02/24 15:47:37
113	350.4034533178371	267.72630832367133	-60	21/02/24 15:47:37
95	348.2574783689184	265.4034322422755	-60	21/02/24 15:47:37
99	360.0550977801786	265.17619063766165	-70	21/02/24 15:47:37
101	344.8940587728134	285.507681768186	-72	21/02/24 15:47:37
104	344.29972171429097	278.87653419291075	-64	21/02/24 15:47:37
103	341.9121052518552	264.28883990856684	-42	21/02/24 15:47:37
98	334.9124542906195	280.9377639416658	-66	21/02/24 15:47:37
105	330.89379071296145	276.9107744382362	-65	21/02/24 15:47:37

111	349.3574161788773	282.0413831973989	-69	21/02/24 15:47:38
118	357.09356967635637	275.4844405310735	-69	21/02/24 15:47:38
108	354.5433741308232	271.8469578377465	-65	21/02/24 15:47:38
107	352.24436078636603	271.4962331820773	-62	21/02/24 15:47:38
106	352.82196230706245	270.7390515122939	-63	21/02/24 15:47:38
113	350.4034533178371	267.72630832367133	-61	21/02/24 15:47:38
95	348.2574783689184	265.4034322422755	-56	21/02/24 15:47:38
99	360.0550977801786	265.17619063766165	-69	21/02/24 15:47:38
101	344.8940587728134	285.507681768186	-70	21/02/24 15:47:38
104	344.29972171429097	278.87653419291075	-64	21/02/24 15:47:38
103	341.9121052518552	264.28883990856684	-41	21/02/24 15:47:38
98	334.9124542906195	280.9377639416658	-68	21/02/24 15:47:38
105	330.89379071296145	276.9107744382362	-66	21/02/24 15:47:38

111	349.3574161788773	282.0413831973989	-70	21/02/24 15:47:39
118	357.09356967635637	275.4844405310735	-71	21/02/24 15:47:39
108	354.5433741308232	271.8469578377465	-66	21/02/24 15:47:39
107	352.24436078636603	271.4962331820773	-63	21/02/24 15:47:39
106	352.82196230706245	270.7390515122939	-65	21/02/24 15:47:39
113	350.4034533178371	267.72630832367133	-61	21/02/24 15:47:39
95	348.2574783689184	265.4034322422755	-58	21/02/24 15:47:39
99	360.0550977801786	265.17619063766165	-71	21/02/24 15:47:39
104	344.29972171429097	278.87653419291075	-65	21/02/24 15:47:39
103	341.9121052518552	264.28883990856684	-37	21/02/24 15:47:39
98	334.9124542906195	280.9377639416658	-69	21/02/24 15:47:39
105	330.89379071296145	276.9107744382362	-69	21/02/24 15:47:39

111	349.3574161788773	282.0413831973989	-68	21/02/24 15:47:40
118	357.09356967635637	275.4844405310735	-69	21/02/24 15:47:40
108	354.5433741308232	271.8469578377465	-67	21/02/24 15:47:40
107	352.24436078636603	271.4962331820773	-64	21/02/24 15:47:40
106	352.82196230706245	270.7390515122939	-63	21/02/24 15:47:40
113	350.4034533178371	267.72630832367133	-62	21/02/24 15:47:40
95	348.2574783689184	265.4034322422755	-56	21/02/24 15:47:40
99	360.0550977801786	265.17619063766165	-68	21/02/24 15:47:40
104	344.29972171429097	278.87653419291075	-66	21/02/24 15:47:40
103	341.9121052518552	264.28883990856684	-37	21/02/24 15:47:40
98	334.9124542906195	280.9377639416658	-69	21/02/24 15:47:40
105	330.89379071296145	276.9107744382362	-66	21/02/24 15:47:40

111	349.3574161788773	282.0413831973989	-68	21/02/24 15:47:41
118	357.09356967635637	275.4844405310735	-72	21/02/24 15:47:41
108	354.5433741308232	271.8469578377465	-68	21/02/24 15:47:41
107	352.24436078636603	271.4962331820773	-64	21/02/24 15:47:41
106	352.82196230706245	270.7390515122939	-64	21/02/24 15:47:41
113	350.4034533178371	267.72630832367133	-63	21/02/24 15:47:41
95	348.2574783689184	265.4034322422755	-55	21/02/24 15:47:41
99	360.0550977801786	265.17619063766165	-69	21/02/24 15:47:41
104	344.29972171429097	278.87653419291075	-68	21/02/24 15:47:41
103	341.9121052518552	264.28883990856684	-31	21/02/24 15:47:41
98	334.9124542906195	280.9377639416658	-69	21/02/24 15:47:41
105	330.89379071296145	276.9107744382362	-67	21/02/24 15:47:41

111	349.3574161788773	282.0413831973989	-69	21/02/24 15:47:42
118	357.09356967635637	275.4844405310735	-70	21/02/24 15:47:42
108	354.5433741308232	271.8469578377465	-69	21/02/24 15:47:42
107	352.24436078636603	271.4962331820773	-64	21/02/24 15:47:42
106	352.82196230706245	270.7390515122939	-67	21/02/24 15:47:42
113	350.4034533178371	267.72630832367133	-60	21/02/24 15:47:42
95	348.2574783689184	265.4034322422755	-59	21/02/24 15:47:42
99	360.0550977801786	265.17619063766165	-69	21/02/24 15:47:42
104	344.29972171429097	278.87653419291075	-66	21/02/24 15:47:42
103	341.9121052518552	264.28883990856684	-28	21/02/24 15:47:42
98	334.9124542906195	280.9377639416658	-67	21/02/24 15:47:42
105	330.89379071296145	276.9107744382362	-68	21/02/24 15:47:42

111	349.3574161788773	282.0413831973989	-72	21/02/24 15:47:43
118	357.09356967635637	275.4844405310735	-70	21/02/24 15:47:43
108	354.5433741308232	271.8469578377465	-66	21/02/24 15:47:43
107	352.24436078636603	271.4962331820773	-65	21/02/24 15:47:43
106	352.82196230706245	270.7390515122939	-65	21/02/24 15:47:43
113	350.4034533178371	267.72630832367133	-61	21/02/24 15:47:43
95	348.2574783689184	265.4034322422755	-59	21/02/24 15:47:43
99	360.0550977801786	265.17619063766165	-70	21/02/24 15:47:43
104	344.29972171429097	278.87653419291075	-65	21/02/24 15:47:43
103	341.9121052518552	264.28883990856684	-38	21/02/24 15:47:43
98	334.9124542906195	280.9377639416658	-69	21/02/24 15:47:43
105	330.89379071296145	276.9107744382362	-66	21/02/24 15:47:43

111	349.3574161788773	282.0413831973989	-70	21/02/24 15:47:44
118	357.09356967635637	275.4844405310735	-72	21/02/24 15:47:44
108	354.5433741308232	271.8469578377465	-69	21/02/24 15:47:44
107	352.24436078636603	271.4962331820773	-66	21/02/24 15:47:44
106	352.82196230706245	270.7390515122939	-64	21/02/24 15:47:44
113	350.4034533178371	267.72630832367133	-61	21/02/24 15:47:44
95	348.2574783689184	265.4034322422755	-59	21/02/24 15:47:44
99	360.0550977801786	265.17619063766165	-69	21/02/24 15:47:44
104	344.29972171429097	278.87653419291075	-67	21/02/24 15:47:44
103	341.9121052518552	264.28883990856684	-36	21/02/24 15:47:44
98	334.9124542906195	280.9377639416658	-68	21/02/24 15:47:44
105	330.89379071296145	276.9107744382362	-68	21/02/24 15:47:44

111	349.3574161788773	282.0413831973989	-71	21/02/24 15:47:45
118	357.09356967635637	275.4844405310735	-70	21/02/24 15:47:45
108	354.5433741308232	271.8469578377465	-69	21/02/24 15:47:45
107	352.24436078636603	271.4962331820773	-67	21/02/24 15:47:45
106	352.82196230706245	270.7390515122939	-66	21/02/24 15:47:45
113	350.4034533178371	267.72630832367133	-64	21/02/24 15:47:45
95	348.2574783689184	265.4034322422755	-60	21/02/24 15:47:45
99	360.0550977801786	265.17619063766165	-70	21/02/24 15:47:45
104	344.29972171429097	278.87653419291075	-67	21/02/24 15:47:45
103	341.9121052518552	264.28883990856684	-40	21/02/24 15:47:45
98	334.9124542906195	280.9377639416658	-67	21/02/24 15:47:45
105	330.89379071296145	276.9107744382362	-67	21/02/24 15:47:45

111	349.3574161788773	282.0413831973989	-71	21/02/24 15:47:46
118	357.09356967635637	275.4844405310735	-70	21/02/24 15:47:46
108	354.5433741308232	271.8469578377465	-67	21/02/24 15:47:46
107	352.24436078636603	271.4962331820773	-67	21/02/24 15:47:46
106	352.82196230706245	270.7390515122939	-65	21/02/24 15:47:46
113	350.4034533178371	267.72630832367133	-63	21/02/24 15:47:46
95	348.2574783689184	265.4034322422755	-56	21/02/24 15:47:46
99	360.0550977801786	265.17619063766165	-69	21/02/24 15:47:46
104	344.29972171429097	278.87653419291075	-68	21/02/24 15:47:46
103	341.9121052518552	264.28883990856684	-37	21/02/24 15:47:46
98	334.9124542906195	280.9377639416658	-69	21/02/24 15:47:46
105	330.89379071296145	276.9107744382362	-69	21/02/24 15:47:46

111	349.3574161788773	282.0413831973989	-68	21/02/24 15:47:47
118	357.09356967635637	275.4844405310735	-71	21/02/24 15:47:47
108	354.5433741308232	271.8469578377465	-69	21/02/24 15:47:47
107	352.24436078636603	271.4962331820773	-63	21/02/24 15:47:47
106	352.82196230706245	270.7390515122939	-66	21/02/24 15:47:47
113	350.4034533178371	267.72630832367133	-61	21/02/24 15:47:47
95	348.2574783689184	265.4034322422755	-56	21/02/24 15:47:47
99	360.0550977801786	265.17619063766165	-68	21/02/24 15:47:47
104	344.29972171429097	278.87653419291075	-65	21/02/24 15:47:47
103	341.9121052518552	264.28883990856684	-37	21/02/24 15:47:47
98	334.9124542906195	280.9377639416658	-67	21/02/24 15:47:47
105	330.89379071296145	276.9107744382362	-67	21/02/24 15:47:47

111	349.3574161788773	282.0413831973989	-71	21/02/24 15:47:48
118	357.09356967635637	275.4844405310735	-71	21/02/24 15:47:48
108	354.5433741308232	271.8469578377465	-67	21/02/24 15:47:48
107	352.24436078636603	271.4962331820773	-67	21/02/24 15:47:48
106	352.82196230706245	270.7390515122939	-65	21/02/24 15:47:48
113	350.4034533178371	267.72630832367133	-60	21/02/24 15:47:48
95	348.2574783689184	265.4034322422755	-60	21/02/24 15:47:48
99	360.0550977801786	265.17619063766165	-69	21/02/24 15:47:48
104	344.29972171429097	278.87653419291075	-67	21/02/24 15:47:48
103	341.9121052518552	264.28883990856684	-38	21/02/24 15:47:48
98	334.9124542906195	280.9377639416658	-68	21/02/24 15:47:48
105	330.89379071296145	276.9107744382362	-67	21/02/24 15:47:48

111	349.3574161788773	282.0413831973989	-71	21/02/24 15:47:49
118	357.09356967635637	275.4844405310735	-71	21/02/24 15:47:49
108	354.5433741308232	271.8469578377465	-68	21/02/24 15:47:49
107	352.24436078636603	271.4962331820773	-66	21/02/24 15:47:49
106	352.82196230706245	270.7390515122939	-67	21/02/24 15:47:49
113	350.4034533178371	267.72630832367133	-60	21/02/24 15:47:49
95	348.2574783689184	265.4034322422755	-57	21/02/24 15:47:49
99	360.0550977801786	265.17619063766165	-71	21/02/24 15:47:49
104	344.29972171429097	278.87653419291075	-67	21/02/24 15:47:49
103	341.9121052518552	264.28883990856684	-36	21/02/24 15:47:49
98	334.9124542906195	280.9377639416658	-69	21/02/24 15:47:49
105	330.89379071296145	276.9107744382362	-67	21/02/24 15:47:49

111	349.3574161788773	282.0413831973989	-68	21/02/24 15:47:50
118	357.09356967635637	275.4844405310735	-70	21/02/24 15:47:50
108	354.5433741308232	271.8469578377465	-66	21/02/24 15:47:50
107	352.24436078636603	271.4962331820773	-64	21/02/24 15:47:50
106	352.82196230706245	270.7390515122939	-64	21/02/24 15:47:50
113	350.4034533178371	267.72630832367133	-61	21/02/24 15:47:50
95	348.2574783689184	265.4034322422755	-58	21/02/24 15:47:50
99	360.0550977801786	265.17619063766165	-69	21/02/24 15:47:50
104	344.29972171429097	278.87653419291075	-64	21/02/24 15:47:50
103	341.9121052518552	264.28883990856684	-38	21/02/24 15:47:50
98	334.9124542906195	280.9377639416658	-67	21/02/24 15:47:50
105	330.89379071296145	276.9107744382362	-66	21/02/24 15:47:50

111	349.3574161788773	282.0413831973989	-71	21/02/24 15:47:51
118	357.09356967635637	275.4844405310735	-70	21/02/24 15:47:51
108	354.5433741308232	271.8469578377465	-67	21/02/24 15:47:51
107	352.24436078636603	271.4962331820773	-65	21/02/24 15:47:51
106	352.82196230706245	270.7390515122939	-66	21/02/24 15:47:51
113	350.4034533178371	267.72630832367133	-60	21/02/24 15:47:51
95	348.2574783689184	265.4034322422755	-59	21/02/24 15:47:51
99	360.0550977801786	265.17619063766165	-69	21/02/24 15:47:51
104	344.29972171429097	278.87653419291075	-67	21/02/24 15:47:51
103	341.9121052518552	264.28883990856684	-37	21/02/24 15:47:51
98	334.9124542906195	280.9377639416658	-69	21/02/24 15:47:51
105	330.89379071296145	276.9107744382362	-66	21/02/24 15:47:51

111	349.3574161788773	282.0413831973989	-69	21/02/24 15:47:52
118	357.09356967635637	275.4844405310735	-72	21/02/24 15:47:52
108	354.5433741308232	271.8469578377465	-69	21/02/24 15:47:52
107	352.24436078636603	271.4962331820773	-63	21/02/24 15:47:52
106	352.82196230706245	270.7390515122939	-64	21/02/24 15:47:52
113	350.4034533178371	267.72630832367133	-59	21/02/24 15:47:52
95	348.2574783689184	265.4034322422755	-56	21/02/24 15:47:52
99	360.0550977801786	265.17619063766165	-69	21/02/24 15:47:52
104	344.29972171429097	278.87653419291075	-66	21/02/24 15:47:52
103	341.9121052518552	264.28883990856684	-36	21/02/24 15:47:52
98	334.9124542906195	280.9377639416658	-69	21/02/24 15:47:52
105	330.89379071296145	276.9107744382362	-68	21/02/24 15:47:52

111	349.3574161788773	282.0413831973989	-67	21/02/24 15:47:53
118	357.09356967635637	275.4844405310735	-70	21/02/24 15:47:53
108	354.5433741308232	271.8469578377465	-68	21/02/24 15:47:53
107	352.24436078636603	271.4962331820773	-63	21/02/24 15:47:53
106	352.82196230706245	270.7390515122939	-65	21/02/24 15:47:53
113	350.4034533178371	267.72630832367133	-62	21/02/24 15:47:53
95	348.2574783689184	265.4034322422755	-58	21/02/24 15:47:53
99	360.0550977801786	265.17619063766165	-71	21/02/24 15:47:53
101	344.8940587728134	285.507681768186	-70	21/02/24 15:47:53
104	344.29972171429097	278.87653419291075	-66	21/02/24 15:47:53
103	341.9121052518552	264.28883990856684	-39	21/02/24 15:47:53
98	334.9124542906195	280.9377639416658	-69	21/02/24 15:47:53
105	330.89379071296145	276.9107744382362	-67	21/02/24 15:47:53

111	349.3574161788773	282.0413831973989	-70	21/02/24 15:47:54
118	357.09356967635637	275.4844405310735	-68	21/02/24 15:47:54
108	354.5433741308232	271.8469578377465	-68	21/02/24 15:47:54
107	352.24436078636603	271.4962331820773	-64	21/02/24 15:47:54
106	352.82196230706245	270.7390515122939	-64	21/02/24 15:47:54
113	350.4034533178371	267.72630832367133	-61	21/02/24 15:47:54
95	348.2574783689184	265.4034322422755	-58	21/02/24 15:47:54
99	360.0550977801786	265.17619063766165	-70	21/02/24 15:47:54
100	345.6304273143794	285.66832195343085	-70	21/02/24 15:47:54
101	344.8940587728134	285.507681768186	-70	21/02/24 15:47:54
104	344.29972171429097	278.87653419291075	-66	21/02/24 15:47:54
103	341.9121052518552	264.28883990856684	-43	21/02/24 15:47:54
98	334.9124542906195	280.9377639416658	-69	21/02/24 15:47:54
105	330.89379071296145	276.9107744382362	-64	21/02/24 15:47:54

111	349.3574161788773	282.0413831973989	-71	21/02/24 15:47:55
118	357.09356967635637	275.4844405310735	-70	21/02/24 15:47:55
108	354.5433741308232	271.8469578377465	-65	21/02/24 15:47:55
107	352.24436078636603	271.4962331820773	-67	21/02/24 15:47:55
106	352.82196230706245	270.7390515122939	-66	21/02/24 15:47:55
113	350.4034533178371	267.72630832367133	-61	21/02/24 15:47:55
95	348.2574783689184	265.4034322422755	-58	21/02/24 15:47:55
99	360.0550977801786	265.17619063766165	-72	21/02/24 15:47:55
104	344.29972171429097	278.87653419291075	-67	21/02/24 15:47:55
103	341.9121052518552	264.28883990856684	-42	21/02/24 15:47:55
98	334.9124542906195	280.9377639416658	-70	21/02/24 15:47:55
105	330.89379071296145	276.9107744382362	-65	21/02/24 15:47:55

111	349.3574161788773	282.0413831973989	-71	21/02/24 15:47:56
118	357.09356967635637	275.4844405310735	-70	21/02/24 15:47:56
108	354.5433741308232	271.8469578377465	-68	21/02/24 15:47:56
107	352.24436078636603	271.4962331820773	-65	21/02/24 15:47:56
106	352.82196230706245	270.7390515122939	-67	21/02/24 15:47:56
113	350.4034533178371	267.72630832367133	-64	21/02/24 15:47:56
95	348.2574783689184	265.4034322422755	-59	21/02/24 15:47:56
99	360.0550977801786	265.17619063766165	-69	21/02/24 15:47:56
104	344.29972171429097	278.87653419291075	-65	21/02/24 15:47:56
103	341.9121052518552	264.28883990856684	-36	21/02/24 15:47:56
98	334.9124542906195	280.9377639416658	-69	21/02/24 15:47:56
105	330.89379071296145	276.9107744382362	-69	21/02/24 15:47:56

111	349.3574161788773	282.0413831973989	-69	21/02/24 15:47:57
118	357.09356967635637	275.4844405310735	-69	21/02/24 15:47:57
108	354.5433741308232	271.8469578377465	-69	21/02/24 15:47:57
107	352.24436078636603	271.4962331820773	-66	21/02/24 15:47:57
106	352.82196230706245	270.7390515122939	-65	21/02/24 15:47:57
113	350.4034533178371	267.72630832367133	-62	21/02/24 15:47:57
95	348.2574783689184	265.4034322422755	-58	21/02/24 15:47:57
99	360.0550977801786	265.17619063766165	-72	21/02/24 15:47:57
104	344.29972171429097	278.87653419291075	-67	21/02/24 15:47:57
103	341.9121052518552	264.28883990856684	-38	21/02/24 15:47:57
98	334.9124542906195	280.9377639416658	-67	21/02/24 15:47:57
105	330.89379071296145	276.9107744382362	-65	21/02/24 15:47:57

111	349.3574161788773	282.0413831973989	-70	21/02/24 15:47:58
108	354.5433741308232	271.8469578377465	-68	21/02/24 15:47:58
107	352.24436078636603	271.4962331820773	-66	21/02/24 15:47:58
106	352.82196230706245	270.7390515122939	-66	21/02/24 15:47:58
113	350.4034533178371	267.72630832367133	-64	21/02/24 15:47:58
95	348.2574783689184	265.4034322422755	-59	21/02/24 15:47:58
104	344.29972171429097	278.87653419291075	-65	21/02/24 15:47:58
103	341.9121052518552	264.28883990856684	-47	21/02/24 15:47:58
98	334.9124542906195	280.9377639416658	-68	21/02/24 15:47:58
105	330.89379071296145	276.9107744382362	-65	21/02/24 15:47:58

111	349.3574161788773	282.0413831973989	-69	21/02/24 15:47:59
118	357.09356967635637	275.4844405310735	-69	21/02/24 15:47:59
108	354.5433741308232	271.8469578377465	-69	21/02/24 15:47:59
107	352.24436078636603	271.4962331820773	-64	21/02/24 15:47:59
106	352.82196230706245	270.7390515122939	-65	21/02/24 15:47:59
113	350.4034533178371	267.72630832367133	-63	21/02/24 15:47:59
95	348.2574783689184	265.4034322422755	-58	21/02/24 15:47:59
104	344.29972171429097	278.87653419291075	-65	21/02/24 15:47:59
103	341.9121052518552	264.28883990856684	-46	21/02/24 15:47:59
98	334.9124542906195	280.9377639416658	-68	21/02/24 15:47:59
105	330.89379071296145	276.9107744382362	-65	21/02/24 15:47:59

