floorId	partitionId	location_x	location_y	timeStamp
1	97	336.53585426801055	287.8812247794712	20/04/28 05:08:49
1	97	339.4344475351989	287.82523322481603	20/04/28 05:08:50
1	97	336.53585426801055	287.8812247794712	20/04/28 05:08:51
1	97	337.5607221213916	286.380934101518	20/04/28 05:08:52
1	97	337.5607221213916	286.380934101518	20/04/28 05:08:53
1	97	337.5607221213916	286.380934101518	20/04/28 05:08:54
1	NULL	338.7950920964135	285.0161233311299	20/04/28 05:08:55
1	97	337.5607221213916	286.380934101518	20/04/28 05:08:56
1	97	337.5607221213916	286.380934101518	20/04/28 05:08:57
1	97	337.5607221213916	286.380934101518	20/04/28 05:08:58
1	NULL	338.7950920964135	285.0161233311299	20/04/28 05:08:59
1	97	337.5607221213916	286.380934101518	20/04/28 05:09:00
1	NULL	338.7950920964135	285.0161233311299	20/04/28 05:09:01
1	97	338.28945308132575	285.65004698738454	20/04/28 05:09:02
1	NULL	338.7950920964135	285.0161233311299	20/04/28 05:09:03
1	97	337.5607221213916	286.380934101518	20/04/28 05:09:04
1	97	338.28945308132575	285.65004698738454	20/04/28 05:09:05
1	NULL	338.7950920964135	285.0161233311299	20/04/28 05:09:06
1	83	341.89063738411534	284.94233083548517	20/04/28 05:09:07
1	9	339.74889046835307	281.85967503514354	20/04/28 05:09:08
1	9	339.74889046835307	281.85967503514354	20/04/28 05:09:09
1	9	338.38423916717994	283.3768680817603	20/04/28 05:09:10
1	9	338.38423916717994	283.3768680817603	20/04/28 05:09:11
1	9	336.13905206149525	282.923128952197	20/04/28 05:09:12
1	NULL	338.7950920964135	285.0161233311299	20/04/28 05:09:13
1	9	339.74889046835307	281.85967503514354	20/04/28 05:09:14
1	9	340.5552095102039	281.0461193124156	20/04/28 05:09:15
1	9	340.5552095102039	281.0461193124156	20/04/28 05:09:16
1	83	341.3536088153646	278.57546762722654	20/04/28 05:09:17
1	7	339.13766985621356	279.10032233866974	20/04/28 05:09:18
1	7	339.13766985621356	279.10032233866974	20/04/28 05:09:19
1	7	339.13766985621356	279.10032233866974	20/04/28 05:09:20
1	7	339.13766985621356	279.10032233866974	20/04/28 05:09:21
1	7	339.13766985621356	279.10032233866974	20/04/28 05:09:22
1	7	339.13766985621356	279.10032233866974	20/04/28 05:09:23
1	7	339.13766985621356	279.10032233866974	20/04/28 05:09:24
1	7	339.13766985621356	279.10032233866974	20/04/28 05:09:25
1	7	339.13766985621356	279.10032233866974	20/04/28 05:09:26
1	7	339.13766985621356	279.10032233866974	20/04/28 05:09:27
1	7	339.13766985621356	279.10032233866974	20/04/28 05:09:28
1	7	339.13766985621356	279.10032233866974	20/04/28 05:09:29
1	83	341.3536088153646	278.57546762722654	20/04/28 05:09:30
1	83	342.14651366105164	278.29653465123357	20/04/28 05:09:31
1	7	339.13766985621356	279.10032233866974	20/04/28 05:09:32
1	7	339.13766985621356	279.10032233866974	20/04/28 05:09:33
1	83	341.3536088153646	278.57546762722654	20/04/28 05:09:34
1	83	341.3536088153646	278.57546762722654	20/04/28 05:09:35
1	83	341.3536088153646	278.57546762722654	20/04/28 05:09:36
1	7	339.13766985621356	279.10032233866974	20/04/28 05:09:37
1	7	339.13766985621356	279.10032233866974	20/04/28 05:09:38
1	7	339.13766985621356	279.10032233866974	20/04/28 05:09:39
1	7	339.13766985621356	279.10032233866974	20/04/28 05:09:40
1	83	341.3536088153646	278.57546762722654	20/04/28 05:09:41
1	7	339.13766985621356	279.10032233866974	20/04/28 05:09:42
1	83	341.3536088153646	278.57546762722654	20/04/28 05:09:43
1	83	341.3536088153646	278.57546762722654	20/04/28 05:09:44
1	83	341.3536088153646	278.57546762722654	20/04/28 05:09:45
1	83	341.3536088153646	278.57546762722654	20/04/28 05:09:46
1	7	339.13766985621356	279.10032233866974	20/04/28 05:09:47
1	7	339.13766985621356	279.10032233866974	20/04/28 05:09:48
1	7	339.13766985621356	279.10032233866974	20/04/28 05:09:49
1	7	338.7178259227379	277.2741737862663	20/04/28 05:09:50
1	7	339.13766985621356	279.10032233866974	20/04/28 05:09:51
1	83	341.3536088153646	278.57546762722654	20/04/28 05:09:52
1	7	339.13766985621356	279.10032233866974	20/04/28 05:09:53
1	7	339.13766985621356	279.10032233866974	20/04/28 05:09:54
1	7	339.13766985621356	279.10032233866974	20/04/28 05:09:55
1	7	339.13766985621356	279.10032233866974	20/04/28 05:09:56
1	7	339.13766985621356	279.10032233866974	20/04/28 05:09:57
1	7	339.13766985621356	279.10032233866974	20/04/28 05:09:58
1	7	339.13766985621356	279.10032233866974	20/04/28 05:09:59
1	7	339.13766985621356	279.10032233866974	20/04/28 05:10:00
1	7	339.13766985621356	279.10032233866974	20/04/28 05:10:01
1	7	339.13766985621356	279.10032233866974	20/04/28 05:10:02
1	7	339.13766985621356	279.10032233866974	20/04/28 05:10:03
1	83	341.3536088153646	278.57546762722654	20/04/28 05:10:04
1	9	340.5552095102039	281.0461193124156	20/04/28 05:10:05
1	7	339.13766985621356	279.10032233866974	20/04/28 05:10:06
1	7	339.13766985621356	279.10032233866974	20/04/28 05:10:07
1	9	340.5552095102039	281.0461193124156	20/04/28 05:10:08
1	7	339.13766985621356	279.10032233866974	20/04/28 05:10:09
1	7	339.13766985621356	279.10032233866974	20/04/28 05:10:10
1	7	339.13766985621356	279.10032233866974	20/04/28 05:10:11
1	7	339.13766985621356	279.10032233866974	20/04/28 05:10:12
1	83	342.14651366105164	278.29653465123357	20/04/28 05:10:13
1	83	342.84443575605496	281.7858825394988	20/04/28 05:10:14
1	83	342.84443575605496	281.7858825394988	20/04/28 05:10:15
1	83	341.89063738411534	284.94233083548517	20/04/28 05:10:16
1	83	343.7249323535638	286.86436756668354	20/04/28 05:10:17
1	83	343.7249323535639	286.8643675666835	20/04/28 05:10:18
1	83	343.5240734539748	289.5423380190999	20/04/28 05:10:19
1	82	346.3137418079907	290.4507924877208	20/04/28 05:10:20
1	82	346.3137418079907	290.4507924877208	20/04/28 05:10:21
1	82	346.31374180799065	290.4507924877207	20/04/28 05:10:22
1	82	348.7244436375591	289.13403057454707	20/04/28 05:10:23
1	82	348.4214998630867	287.94298050940233	20/04/28 05:10:24
1	82	348.7244436375591	289.13403057454707	20/04/28 05:10:25
1	82	348.7244436375591	289.13403057454707	20/04/28 05:10:26
1	82	348.4214998630867	287.94298050940233	20/04/28 05:10:27
1	82	348.7244436375591	289.13403057454707	20/04/28 05:10:28
1	82	348.7244436375591	289.13403057454707	20/04/28 05:10:29
1	82	348.7244436375591	289.13403057454707	20/04/28 05:10:30
1	82	348.7244436375591	289.13403057454707	20/04/28 05:10:31
1	82	348.4214998630867	287.94298050940233	20/04/28 05:10:32
1	82	348.7244436375591	289.13403057454707	20/04/28 05:10:33
1	82	346.51460070757975	287.7728220353044	20/04/28 05:10:34
1	82	348.7244436375591	289.13403057454707	20/04/28 05:10:35
1	82	346.51460070757975	287.7728220353044	20/04/28 05:10:36
1	82	346.31374180799065	290.4507924877207	20/04/28 05:10:37
1	82	348.7244436375591	289.13403057454707	20/04/28 05:10:38
1	82	346.3137418079907	290.4507924877208	20/04/28 05:10:39
1	82	346.3137418079907	290.4507924877208	20/04/28 05:10:40
1	82	348.7244436375591	289.13403057454707	20/04/28 05:10:41
1	82	348.472876999285	291.26365117910296	20/04/28 05:10:42
1	82	346.3137418079907	290.4507924877208	20/04/28 05:10:43
1	82	346.3137418079907	290.4507924877208	20/04/28 05:10:44
1	82	348.472876999285	291.26365117910296	20/04/28 05:10:45
