floorId	partitionId	location_x	location_y	timeStamp
3	17	361.92551715099427	250.89875027387427	20/04/28 05:17:35
3	17	362.03665989359604	251.16845545277198	20/04/28 05:17:35
3	17	361.80418092865546	251.2040037227205	20/04/28 05:17:35
3	17	361.82493563612326	251.14822996111008	20/04/28 05:17:35
3	17	361.7997380214101	251.23534954586518	20/04/28 05:17:35
3	17	361.831408683002	251.28444922919	20/04/28 05:17:36
3	17	361.95131986360104	251.47659727354127	20/04/28 05:17:36
3	17	361.98239427294175	251.2608771784292	20/04/28 05:17:36
3	17	361.97787945173593	251.25501023611986	20/04/28 05:17:36
3	17	361.82189350586674	251.31423283061824	20/04/28 05:17:36
3	17	361.58754957843263	251.3514555291974	20/04/28 05:17:36
3	17	361.5572944112298	251.3296772761768	20/04/28 05:17:36
3	17	361.4567395314207	251.1333190778891	20/04/28 05:17:36
3	17	361.42153182826485	250.89983000844754	20/04/28 05:17:36
3	17	361.44938126494617	250.84179221528834	20/04/28 05:17:36
3	17	361.47485244674573	250.637825286258	20/04/28 05:17:37
3	17	361.48805485934105	250.50656534530597	20/04/28 05:17:37
3	17	361.5261814900274	250.67349153978438	20/04/28 05:17:37
3	17	361.574481206955	250.5336081256786	20/04/28 05:17:37
3	17	361.7469684605128	250.59318692364292	20/04/28 05:17:37
3	17	361.73283051583263	250.40538505261605	20/04/28 05:17:37
3	17	361.67244515562896	250.3069341089865	20/04/28 05:17:37
3	17	361.68415643634916	250.29686031797675	20/04/28 05:17:37
3	17	361.7806233310682	250.16671645880706	20/04/28 05:17:37
3	17	361.7541292565915	250.2014655924019	20/04/28 05:17:38
3	17	361.7229028497697	250.06532477170796	20/04/28 05:17:38
3	17	361.7055199854822	250.05363309630727	20/04/28 05:17:38
3	17	361.7046916658207	250.0514688472267	20/04/28 05:17:38
3	17	361.7015100471472	250.0567662056443	20/04/28 05:17:38
3	17	361.8445678094177	250.0400174011185	20/04/28 05:17:38
3	17	361.814936729586	250.05662971118196	20/04/28 05:17:38
3	17	361.8955937145593	250.06824662792897	20/04/28 05:17:38
3	17	361.79315922331847	250.22078107684186	20/04/28 05:17:38
3	17	362.00041858796897	250.07741837929234	20/04/28 05:17:38
3	17	361.84978311942655	250.05041865770067	20/04/28 05:17:39
3	17	362.01276987658855	250.0973013711989	20/04/28 05:17:39
3	17	361.8341744027633	250.15347350239762	20/04/28 05:17:39
3	17	361.84157669978475	250.1401021645137	20/04/28 05:17:39
3	17	361.8689058447044	250.1005362066252	20/04/28 05:17:39
3	17	361.6259596066841	250.17202164765936	20/04/28 05:17:39
3	17	361.6851444061075	250.17482518769626	20/04/28 05:17:39
3	17	361.526687009137	250.33552899809897	20/04/28 05:17:39
3	17	361.660948992668	250.30074809564408	20/04/28 05:17:39
3	17	361.77964375383806	250.16996382507995	20/04/28 05:17:39
3	17	361.7774702327006	249.9443179537157	20/04/28 05:17:40
3	17	361.59119923441705	250.03034980089572	20/04/28 05:17:40
3	17	361.71552933744914	249.93916037538875	20/04/28 05:17:40
3	17	361.7363290676613	250.22662417663466	20/04/28 05:17:40
3	17	361.8333867618575	250.05432300638873	20/04/28 05:17:40
3	17	362.0244342113072	250.08627099605627	20/04/28 05:17:40
3	17	362.20464915582806	250.00695850824016	20/04/28 05:17:40
3	17	362.204070935319	250.00780493219864	20/04/28 05:17:40
3	17	362.30031359505784	250.1667616391627	20/04/28 05:17:40
3	17	362.33269885626805	249.92896937361613	20/04/28 05:17:40
3	17	362.4678985484918	250.11840670864993	20/04/28 05:17:41
3	17	362.4575401703461	250.18679209745352	20/04/28 05:17:41
3	17	362.4509679297083	250.24073352853532	20/04/28 05:17:41
3	17	362.4671969858426	250.22754967610973	20/04/28 05:17:41
3	17	362.4735891565623	250.01408010524207	20/04/28 05:17:41
3	17	362.32021929957574	250.14100366911606	20/04/28 05:17:41
3	17	362.54922216252606	250.17230656996412	20/04/28 05:17:41
3	17	362.7071819400036	250.4154446323082	20/04/28 05:17:41
3	17	362.5130819732415	250.5299857972768	20/04/28 05:17:41
3	17	362.55805715843246	250.56453066605843	20/04/28 05:17:42
3	17	362.65592915080197	250.82514301790383	20/04/28 05:17:42
3	17	362.6075669162541	250.81615510490113	20/04/28 05:17:42
3	17	362.8475118489462	250.81535816396143	20/04/28 05:17:42
3	17	362.8104899593774	250.85576721124085	20/04/28 05:17:42
3	17	362.75319999522276	251.07335635463693	20/04/28 05:17:42
3	17	362.75534153284093	251.00365174346447	20/04/28 05:17:42
3	17	362.73148790108405	250.7535725313976	20/04/28 05:17:42
3	17	362.5632485395017	250.82824289137346	20/04/28 05:17:42
3	17	362.55330368368976	250.8122682189201	20/04/28 05:17:42
3	17	362.58783029136936	250.8325862495404	20/04/28 05:17:43
3	17	362.59005309247533	250.83056499746237	20/04/28 05:17:43
3	17	362.65913636499965	250.80976941163442	20/04/28 05:17:43
3	17	362.65912234833854	250.51642320260564	20/04/28 05:17:43
3	17	362.57169383274277	250.317171041431	20/04/28 05:17:43
3	17	362.56678553231654	250.2729610993036	20/04/28 05:17:43
3	17	362.368253281129	250.17802798833367	20/04/28 05:17:43
3	17	362.1540841451657	250.01650609469058	20/04/28 05:17:43
3	17	362.0740576353385	250.24654735388503	20/04/28 05:17:43
3	17	362.0597823086215	250.29843414706127	20/04/28 05:17:44
3	17	361.8527800105944	250.25768578538447	20/04/28 05:17:44
3	17	361.92012197386344	250.15290341696132	20/04/28 05:17:44
3	17	361.9822633419998	250.12502014902162	20/04/28 05:17:44
3	17	362.1447085731409	250.11067357034116	20/04/28 05:17:44
3	17	362.1404781851861	250.05543848641264	20/04/28 05:17:44
3	17	362.1343556181119	250.07940732001813	20/04/28 05:17:44
3	17	362.19830539836016	250.0840222061831	20/04/28 05:17:44
3	17	362.13323688753053	250.14436182492935	20/04/28 05:17:44
3	17	361.9467587531099	250.28750447831808	20/04/28 05:17:44
3	17	362.00885917085617	250.24537522547715	20/04/28 05:17:45
3	17	361.88368513003627	250.19787320754074	20/04/28 05:17:45
3	17	361.6586485353434	250.23667164276125	20/04/28 05:17:45
3	17	361.87837474851625	250.1888154874255	20/04/28 05:17:45
3	17	361.6555621410991	250.13130212430448	20/04/28 05:17:45
3	17	361.6434419751823	250.1248373947359	20/04/28 05:17:45
3	17	361.83516788582295	250.11845721089873	20/04/28 05:17:45
3	17	361.7119111518295	250.19883254813743	20/04/28 05:17:45
3	17	361.6529734815733	250.24067802800423	20/04/28 05:17:45
3	17	361.75326124726314	250.34341251295436	20/04/28 05:17:45
3	17	361.4649259004003	250.32898999084216	20/04/28 05:17:46
3	17	361.5719629906706	250.3896057073157	20/04/28 05:17:46
3	17	361.56623227251896	250.55010717011663	20/04/28 05:17:46
3	17	361.45617320467557	250.81602367010427	20/04/28 05:17:46
3	17	361.2322490617407	250.78965875534496	20/04/28 05:17:46
3	17	361.2988705477147	250.79439405286664	20/04/28 05:17:46
3	17	361.16507697911743	250.6461267667253	20/04/28 05:17:46
3	17	361.25372368451633	250.40913919846128	20/04/28 05:17:46
3	17	361.2680991353317	250.42620394722204	20/04/28 05:17:46
3	17	361.2680991353317	250.42620394722204	20/04/28 05:17:47
3	17	361.2680991353317	250.42620394722204	20/04/28 05:17:47
3	17	361.3322580438804	250.4245211528389	20/04/28 05:17:47
3	17	361.332312760105	250.35295885774343	20/04/28 05:17:47
3	17	361.2648421386208	250.32499462696612	20/04/28 05:17:47
3	17	361.1468523914748	250.58803449833187	20/04/28 05:17:47
3	17	361.1983032815827	250.51608374008262	20/04/28 05:17:47
3	17	361.0853908981769	250.7020016115694	20/04/28 05:17:47
3	17	361.1140217072622	250.6461765295669	20/04/28 05:17:47
3	17	361.32970392661184	250.62502655981172	20/04/28 05:17:47
3	17	361.49353060586606	250.37385410137978	20/04/28 05:17:48
3	17	361.3538589766986	250.31829101388564	20/04/28 05:17:48
3	17	361.49702158035274	250.2940152509151	20/04/28 05:17:48
3	17	361.34893813820213	250.45187413895374	20/04/28 05:17:48
3	17	361.3788893435237	250.43638409174957	20/04/28 05:17:48
3	17	361.3659125360186	250.48730247628055	20/04/28 05:17:48
3	17	361.361361339862	250.41138466297863	20/04/28 05:17:48
3	17	361.63591712187053	250.3862197760529	20/04/28 05:17:48
3	17	361.67254085404386	250.43828071673107	20/04/28 05:17:48
3	17	361.6514835105578	250.40314874680988	20/04/28 05:17:48
3	17	361.6866347070888	250.47014098341222	20/04/28 05:17:49
3	17	361.5630179777614	250.63352796200766	20/04/28 05:17:49
3	17	361.58309302154345	250.7183679140343	20/04/28 05:17:49
3	17	361.5140266923049	250.67658999667142	20/04/28 05:17:49
3	17	361.5186290039291	250.8291150733495	20/04/28 05:17:49
3	17	361.6668874998243	250.67094276968308	20/04/28 05:17:49
3	17	361.5596267965571	250.75138144401598	20/04/28 05:17:49
3	17	361.68072406967593	250.69122172182543	20/04/28 05:17:49
3	17	361.6868959495819	250.7186401529606	20/04/28 05:17:49
3	17	361.4508395908545	250.7637486098329	20/04/28 05:17:50
3	17	361.4703030804873	250.8153946173325	20/04/28 05:17:50
3	17	361.6583814965287	250.81384753288032	20/04/28 05:17:50
3	17	361.50150230563537	250.7787376498841	20/04/28 05:17:50
3	17	361.35122688100415	250.53631471683832	20/04/28 05:17:50
3	17	361.1806531239566	250.5138530048007	20/04/28 05:17:50
3	17	361.27072476522784	250.4950620668812	20/04/28 05:17:50
3	17	361.3239938911375	250.45253304480804	20/04/28 05:17:50
3	17	361.07811117829885	250.58455103694223	20/04/28 05:17:50
3	17	360.99213403900376	250.59753161799964	20/04/28 05:17:50
3	17	361.2401829618278	250.650577036869	20/04/28 05:17:51
3	17	361.2324274746228	250.78642733967652	20/04/28 05:17:51
3	17	361.2232898145057	250.78847482060792	20/04/28 05:17:51
3	17	361.1823884764528	251.04126366676695	20/04/28 05:17:51
3	17	361.1904808807739	250.9792274522719	20/04/28 05:17:51
3	17	361.36753143089396	251.16166778145362	20/04/28 05:17:51
3	17	361.3031788283785	251.2345033104861	20/04/28 05:17:51
3	17	361.4243500716208	251.25366325770787	20/04/28 05:17:51
3	17	361.47950735109475	251.34870705021527	20/04/28 05:17:51
3	17	361.48389851476713	251.3518139634904	20/04/28 05:17:51
3	17	361.5757654375782	251.40599900944926	20/04/28 05:17:52
3	17	361.5221937530302	251.35363354649562	20/04/28 05:17:52
3	17	361.51641988020344	251.459924655322	20/04/28 05:17:52
3	17	361.44482267519754	251.26508449703326	20/04/28 05:17:52
3	17	361.5182193330091	251.1838309976324	20/04/28 05:17:52
3	17	361.4703871182882	251.17704268848195	20/04/28 05:17:52
3	17	361.46915434202623	251.35530563903538	20/04/28 05:17:52
3	17	361.4211733823188	251.43878804746902	20/04/28 05:17:52
3	17	361.3696888979519	251.66502878769487	20/04/28 05:17:52
3	17	361.2321129150575	251.65758889620898	20/04/28 05:17:53
3	17	361.20336891231943	251.40464554501705	20/04/28 05:17:53
3	17	361.08122214638024	251.44687904476936	20/04/28 05:17:53
3	17	361.1495910674583	251.21506481496814	20/04/28 05:17:53
3	17	361.04919569987186	250.97941931074627	20/04/28 05:17:53
3	17	361.27739077692104	250.93062957019524	20/04/28 05:17:53
3	17	361.3807260424149	250.72380331165266	20/04/28 05:17:53
3	17	361.3598680945438	250.61549702323012	20/04/28 05:17:53
3	17	361.49925300471847	250.54587904459606	20/04/28 05:17:53
3	17	361.6712405249556	250.69995051287262	20/04/28 05:17:53
3	17	361.86700559906853	250.66463126898694	20/04/28 05:17:54
3	17	361.77082797792514	250.62780265493626	20/04/28 05:17:54
3	17	361.75863670417806	250.58366332081482	20/04/28 05:17:54
3	17	361.63623554306855	250.61058431521354	20/04/28 05:17:54
3	17	361.71934886434883	250.87724443096516	20/04/28 05:17:54
3	17	361.5362287434467	251.10106493086542	20/04/28 05:17:54
3	17	361.43521914006965	251.17363376878774	20/04/28 05:17:54
3	17	361.4234911375103	250.97262707738105	20/04/28 05:17:54
3	17	361.390823709738	251.1371391035593	20/04/28 05:17:54
3	17	361.4015840345377	251.09143614311577	20/04/28 05:17:54
3	17	361.1418246505092	251.00753509059396	20/04/28 05:17:55
3	17	361.23610928826025	251.01252475481073	20/04/28 05:17:55
3	17	361.21019401118724	251.02179418713445	20/04/28 05:17:55
3	17	361.1949815623077	250.95878147163552	20/04/28 05:17:55
3	17	361.1949815623077	250.95878147163552	20/04/28 05:17:55
3	17	361.2204663778077	250.96904676676107	20/04/28 05:17:55
3	17	361.0056175665457	250.83149633206204	20/04/28 05:17:55
3	17	360.9884777648876	250.88519719844118	20/04/28 05:17:55
3	17	360.99349010559894	250.64361720859029	20/04/28 05:17:55
3	17	360.98126158053276	250.6838943642643	20/04/28 05:17:56
3	17	360.8872612915249	250.68096682568836	20/04/28 05:17:56
3	17	360.88684790307184	250.59005093202924	20/04/28 05:17:56
3	17	360.88684790307184	250.59005093202924	20/04/28 05:17:56
3	17	361.0275676646927	250.70921938669102	20/04/28 05:17:56
3	17	361.02734036573236	250.70151738328016	20/04/28 05:17:56
3	17	361.0617678646975	250.57686052627827	20/04/28 05:17:56
3	17	361.2887329085982	250.63245775031245	20/04/28 05:17:56
3	17	361.2245115014842	250.5212937306309	20/04/28 05:17:56
3	17	361.2019354412232	250.7756015113405	20/04/28 05:17:56
3	17	361.1186971554059	250.7869211666262	20/04/28 05:17:57
3	17	361.0258083651669	250.88536682025824	20/04/28 05:17:57
3	17	361.178529615733	251.01218942832668	20/04/28 05:17:57
3	17	361.30689246418564	250.94376881217258	20/04/28 05:17:57
3	17	361.2736540722116	251.07805170834067	20/04/28 05:17:57
3	17	361.26623135065995	250.91568772933886	20/04/28 05:17:57
3	17	361.36301476840123	250.73311399397687	20/04/28 05:17:57
3	17	361.31636226457806	250.49525591109045	20/04/28 05:17:57
3	17	361.25921699144936	250.3366588566655	20/04/28 05:17:57
3	17	361.1415773577068	250.3176232304598	20/04/28 05:17:58
3	17	361.0037788020277	250.19814796093928	20/04/28 05:17:58
3	17	361.13609687686886	250.01539341264106	20/04/28 05:17:58
3	17	361.15391677765194	250.0351894332578	20/04/28 05:17:58
3	17	361.1240079679938	250.05042474102453	20/04/28 05:17:58
3	17	360.9447164032885	250.05266135167682	20/04/28 05:17:58
3	17	360.9369622709715	250.0646586346357	20/04/28 05:17:58
3	17	361.1835628590242	250.1208400642861	20/04/28 05:17:58
3	17	360.98151230808685	250.1429780850336	20/04/28 05:17:58
3	17	361.03991996824016	250.08802193574354	20/04/28 05:17:58
3	17	360.98708306968706	250.0518992162125	20/04/28 05:17:59
3	17	361.0322232104855	250.05338682269684	20/04/28 05:17:59
3	17	361.0511625143533	250.10240077595157	20/04/28 05:17:59
3	17	360.8158743412712	249.93790656279552	20/04/28 05:17:59
3	17	360.9483688217687	250.02115529629572	20/04/28 05:17:59
3	17	360.7594283625582	250.12419656684574	20/04/28 05:17:59
3	17	360.97454237212327	250.20348036153703	20/04/28 05:17:59
3	17	360.8886745520251	249.92764971812514	20/04/28 05:17:59
3	17	360.8096521988802	250.0697829976156	20/04/28 05:17:59
3	17	360.9559783680137	249.94467262619418	20/04/28 05:17:59
3	17	360.7407163051107	250.06857616715396	20/04/28 05:18:00
3	17	360.77503388393336	250.06305419171207	20/04/28 05:18:00
3	17	360.7537805123574	250.06696289626916	20/04/28 05:18:00
3	17	360.57348501900236	250.19331810767764	20/04/28 05:18:00
3	17	360.60502552799755	250.01690439228148	20/04/28 05:18:00
3	17	360.55521000994185	250.0713166046156	20/04/28 05:18:00
3	17	360.67931044547964	250.23407467315954	20/04/28 05:18:00
3	17	360.67931044547964	250.23407467315954	20/04/28 05:18:00
3	17	360.52327060468417	250.41742093454693	20/04/28 05:18:00
3	17	360.5170945322981	250.39072760487642	20/04/28 05:18:01
3	17	360.2764700730044	250.56000685692828	20/04/28 05:18:01
3	17	360.17939071631827	250.61011735770782	20/04/28 05:18:01
3	17	360.292299192308	250.83782881090136	20/04/28 05:18:01
3	17	360.182685618168	250.90003782063584	20/04/28 05:18:01
3	17	360.19142719146686	250.96824125199902	20/04/28 05:18:01
3	17	359.99865587650925	250.8649383685021	20/04/28 05:18:01
3	17	360.1398342536978	250.99215428353418	20/04/28 05:18:01
3	17	359.99134021253116	251.16461252524041	20/04/28 05:18:01
3	17	360.08386636454463	251.11079103233462	20/04/28 05:18:01
3	17	360.0966027755492	251.11957161371978	20/04/28 05:18:02
3	17	360.0964691808518	251.12460541364175	20/04/28 05:18:02
3	17	360.30182607880505	251.1932352338563	20/04/28 05:18:02
3	17	360.2912792087591	251.21857249139777	20/04/28 05:18:02
3	17	360.2007521675203	251.20917103915588	20/04/28 05:18:02
3	17	360.3008955410461	250.98183842824045	20/04/28 05:18:02
3	17	360.5799919458195	250.8765446015795	20/04/28 05:18:02
3	17	360.39919255759105	250.82507228094659	20/04/28 05:18:02
3	17	360.4519184994245	251.10689422317694	20/04/28 05:18:02
3	17	360.3664076893601	250.91480380969907	20/04/28 05:18:02
3	17	360.47282569974436	251.09614133325536	20/04/28 05:18:03
3	17	360.4497756836911	251.3228446188945	20/04/28 05:18:03
3	17	360.2091984964529	251.43248329405964	20/04/28 05:18:03
3	17	360.14231339304655	251.45341659920084	20/04/28 05:18:03
3	17	360.070891463987	251.60946864988287	20/04/28 05:18:03
3	17	360.32645289489574	251.7566900532565	20/04/28 05:18:03
3	17	360.22061721755756	251.60472710224073	20/04/28 05:18:03
3	17	360.3849273698214	251.67604933340724	20/04/28 05:18:03
3	17	360.4993458837779	251.80539404275657	20/04/28 05:18:03
3	17	360.5603229419542	251.62248224180152	20/04/28 05:18:04
3	17	360.578840315029	251.70022475337743	20/04/28 05:18:04
3	17	360.42273260545596	251.68203130466313	20/04/28 05:18:04
3	17	360.4703389032097	251.80679844110077	20/04/28 05:18:04
3	17	360.3573781739281	251.84956875609177	20/04/28 05:18:04
3	17	360.6257080623838	251.75507886501555	20/04/28 05:18:04
3	17	360.65536742726795	251.66268565846505	20/04/28 05:18:04
3	17	360.675853306274	251.65172766879178	20/04/28 05:18:04
3	17	360.39077833951734	251.54301555135058	20/04/28 05:18:04
3	17	360.39077833951734	251.54301555135058	20/04/28 05:18:04
3	17	360.4874215677061	251.59091540854047	20/04/28 05:18:05
3	17	360.62524258454425	251.34721755372422	20/04/28 05:18:05
3	17	360.8965826225596	251.37001749536654	20/04/28 05:18:05
3	17	360.90756741998587	251.37989853971925	20/04/28 05:18:05
3	17	360.90158406152744	251.37771203108355	20/04/28 05:18:05
3	17	361.02252870552815	251.4666804877264	20/04/28 05:18:05
3	17	361.0080775609883	251.7651824109462	20/04/28 05:18:05
3	17	360.7500960226516	251.90230480339721	20/04/28 05:18:05
3	17	360.71891825720536	251.86785214351903	20/04/28 05:18:05
3	17	360.7432809090789	251.87704053816043	20/04/28 05:18:05
3	17	360.7693414773028	251.781099337632	20/04/28 05:18:06
3	17	360.64823169817396	251.98536554144692	20/04/28 05:18:06
3	17	360.5422909493822	251.97656533345946	20/04/28 05:18:06
3	17	360.69963572696435	251.83960639280545	20/04/28 05:18:06
3	17	360.9550057298013	251.97745521685405	20/04/28 05:18:06
3	17	360.81530928375025	252.06130624309563	20/04/28 05:18:06
3	17	360.7052553558153	252.318935972205	20/04/28 05:18:06
3	17	360.5549226271814	252.50433175304653	20/04/28 05:18:06
3	17	360.4114199327517	252.56609412081372	20/04/28 05:18:06
3	17	360.2736359986787	252.80303187540198	20/04/28 05:18:07
3	17	360.3223622985413	253.01594316777104	20/04/28 05:18:07
3	17	360.4413678042442	253.11675438806984	20/04/28 05:18:07
3	17	360.41250891368526	253.1651709412186	20/04/28 05:18:07
3	17	360.36599283077686	253.25362451075566	20/04/28 05:18:07
3	17	360.59668249206334	253.1590599262786	20/04/28 05:18:07
3	17	360.59668249206334	253.1590599262786	20/04/28 05:18:07
3	17	360.50235529479255	253.20435023139441	20/04/28 05:18:07
3	17	360.32303952336963	252.97906627869304	20/04/28 05:18:07
3	17	360.32303952336963	252.97906627869304	20/04/28 05:18:07
3	17	360.33072318976645	253.03022721669538	20/04/28 05:18:08
3	17	360.40188371391554	253.16145492543498	20/04/28 05:18:08
3	17	360.46699188955813	253.33741263879844	20/04/28 05:18:08
3	17	360.4410597764549	253.39622409664187	20/04/28 05:18:08
3	17	360.4410597764549	253.39622409664187	20/04/28 05:18:08
3	17	360.6453937953655	253.33976869495794	20/04/28 05:18:08
3	17	360.7576766578397	253.13199849952693	20/04/28 05:18:08
3	17	360.7576766578397	253.13199849952693	20/04/28 05:18:08
3	17	360.90674060996423	253.08669768841875	20/04/28 05:18:08
3	17	360.80661245401456	252.88327886441337	20/04/28 05:18:08
3	17	360.9086156533407	252.71792297569561	20/04/28 05:18:09
3	17	360.92041131621903	252.69588936779218	20/04/28 05:18:09
3	17	360.92041131621903	252.69588936779218	20/04/28 05:18:09
3	17	360.831100864647	253.07058922741896	20/04/28 05:18:09
3	17	360.9596684257091	252.910064813774	20/04/28 05:18:09
3	17	360.9832767243747	252.91010504249786	20/04/28 05:18:09
3	17	360.87768946235855	252.9420831756084	20/04/28 05:18:09
3	17	360.7499489130931	253.0626910499702	20/04/28 05:18:09
3	17	360.97393469393376	252.94404870915525	20/04/28 05:18:09
3	17	360.8917797325333	253.03648986556365	20/04/28 05:18:10
3	17	360.89845628816335	253.1069601640857	20/04/28 05:18:10
3	17	361.0931433760862	253.22652105989033	20/04/28 05:18:10
3	17	361.09933806670307	253.20674140260516	20/04/28 05:18:10
3	17	361.16195446640074	253.23302789044396	20/04/28 05:18:10
3	17	361.12170546829003	253.2456593591484	20/04/28 05:18:10
3	17	361.1124438865415	253.27229800617133	20/04/28 05:18:10
3	17	361.1616894080865	253.23991107247045	20/04/28 05:18:10
3	17	361.0293492031199	253.40574431831072	20/04/28 05:18:10
3	17	360.92907890428876	253.39444592653976	20/04/28 05:18:10
3	17	361.09128063879916	253.50536481997548	20/04/28 05:18:11
3	17	361.1612662657189	253.60722178189545	20/04/28 05:18:11
3	17	361.146113494203	253.63024310101608	20/04/28 05:18:11
3	17	361.1543951391642	253.63460975482369	20/04/28 05:18:11
3	17	361.14865254747343	253.6196975139064	20/04/28 05:18:11
3	17	361.1586979032094	253.71137461267404	20/04/28 05:18:11
3	17	361.19861145601413	253.65929799791127	20/04/28 05:18:11
3	17	361.1655666530381	253.55407014609375	20/04/28 05:18:11
3	17	361.3091906796171	253.40525230759226	20/04/28 05:18:11
3	17	361.2825884129664	253.39194522346085	20/04/28 05:18:11
3	17	361.3172676809697	253.42510025217757	20/04/28 05:18:12
3	17	361.132674195187	253.33268462676682	20/04/28 05:18:12
3	17	361.2764423801102	253.27215161588683	20/04/28 05:18:12
3	17	361.2969588655172	253.40900481583435	20/04/28 05:18:12
3	17	361.498395697123	253.51869989941906	20/04/28 05:18:12
3	17	361.29438050189503	253.65811599379734	20/04/28 05:18:12
3	17	361.3614439093237	253.71542549460796	20/04/28 05:18:12
3	17	361.5690443681999	253.76102828300588	20/04/28 05:18:12
3	17	361.45536623601515	253.68260471563397	20/04/28 05:18:12
3	17	361.45536623601515	253.68260471563397	20/04/28 05:18:13
3	17	361.45547941683986	253.68412097197756	20/04/28 05:18:13
3	17	361.4864420460582	253.59941621703484	20/04/28 05:18:13
3	17	361.39994398740305	253.56288481525505	20/04/28 05:18:13
3	17	361.4352924890977	253.5398757845902	20/04/28 05:18:13
3	17	361.2935460880819	253.35248860736561	20/04/28 05:18:13
3	17	361.2971733485579	253.3606426413444	20/04/28 05:18:13
3	17	361.42636877860195	253.1408213416913	20/04/28 05:18:13
3	17	361.41635309409276	253.1901105580366	20/04/28 05:18:13
3	17	361.42350850447457	253.1776745248809	20/04/28 05:18:13
3	17	361.4944977373193	253.31983635917854	20/04/28 05:18:14
3	17	361.4944977373193	253.31983635917854	20/04/28 05:18:14
3	17	361.48656716636555	253.3462424786519	20/04/28 05:18:14
3	17	361.51146277753617	253.10603079198611	20/04/28 05:18:14
3	17	361.49538837953503	253.18462383173517	20/04/28 05:18:14
3	17	361.42400920445465	253.17734168893222	20/04/28 05:18:14
3	17	361.42400920445465	253.17734168893222	20/04/28 05:18:14
3	17	361.44503457256457	253.1721501572933	20/04/28 05:18:14
3	17	361.3262236658059	253.0814308177931	20/04/28 05:18:14
3	17	361.34787146098034	252.84547306286618	20/04/28 05:18:14
3	17	361.21503523814033	252.8012859879883	20/04/28 05:18:15
3	17	361.21503523814033	252.8012859879883	20/04/28 05:18:15
3	17	361.20736764229895	252.95953515912947	20/04/28 05:18:15
3	17	360.97002914018367	253.13395432658805	20/04/28 05:18:15
3	17	360.97002914018367	253.13395432658805	20/04/28 05:18:15
3	17	360.97002914018367	253.13395432658805	20/04/28 05:18:15
3	17	361.2207789442685	252.9905898598707	20/04/28 05:18:15
3	17	361.51206498274365	252.8240490814218	20/04/28 05:18:15
3	17	361.71136522086874	252.71010054830242	20/04/28 05:18:15
3	17	361.86441604010804	252.622594800647	20/04/28 05:18:16
3	17	361.86441604010804	252.622594800647	20/04/28 05:18:16
3	17	362.04378038532974	252.5200444764517	20/04/28 05:18:16
3	17	362.2703821789932	252.3904864677253	20/04/28 05:18:16
3	17	362.4108284034972	252.3101873099574	20/04/28 05:18:16
3	17	362.63476702264705	252.1821519528451	20/04/28 05:18:16
3	17	362.8869052696404	252.03799365349496	20/04/28 05:18:16
3	17	363.1465133892425	251.88956450613	20/04/28 05:18:16
3	17	363.1465133892425	251.88956450613	20/04/28 05:18:16
3	17	363.51811879751847	251.67710168335253	20/04/28 05:18:16
3	17	363.6602653907274	251.5958303515345	20/04/28 05:18:17
3	17	363.8319973111019	251.4976438134724	20/04/28 05:18:17
3	17	364.0373656867548	251.38022586467858	20/04/28 05:18:17
3	17	364.1936403279055	251.2908769191359	20/04/28 05:18:17
3	34	364.33608333333336	251.2548567609841	20/04/28 05:18:17
3	34	364.33608333333336	251.4514374478133	20/04/28 05:18:17
3	34	364.33608333333336	251.68813006368273	20/04/28 05:18:17
3	34	364.33608333333336	251.89906472793396	20/04/28 05:18:17
3	34	364.33608333333336	252.16887395897442	20/04/28 05:18:17
3	34	364.33608333333336	252.34257744043902	20/04/28 05:18:17
3	34	364.33608333333336	252.51849011245784	20/04/28 05:18:18
3	34	364.33608333333336	252.8154422833739	20/04/28 05:18:18
3	34	364.33608333333336	252.99594190403832	20/04/28 05:18:18
3	34	364.33608333333336	253.15588853209613	20/04/28 05:18:18
3	34	364.33608333333336	253.15588853209613	20/04/28 05:18:18
3	34	364.33608333333336	253.62738829784638	20/04/28 05:18:18
3	34	364.33608333333336	253.9154568551721	20/04/28 05:18:18
3	34	364.33608333333336	254.13668290443505	20/04/28 05:18:18
3	34	364.33608333333336	254.37376091693713	20/04/28 05:18:18
3	34	364.33608333333336	254.60201908372048	20/04/28 05:18:19
3	34	364.33608333333336	254.60201908372048	20/04/28 05:18:19
3	34	364.33608333333336	254.76125864536095	20/04/28 05:18:19
3	34	364.33608333333336	255.21276008821215	20/04/28 05:18:19
3	34	364.30762250960015	255.4627575802377	20/04/28 05:18:19
3	34	364.2595498822254	255.74072545558002	20/04/28 05:18:19
3	34	364.2595498822254	255.74072545558002	20/04/28 05:18:19
3	34	364.21779673673774	255.98215251654696	20/04/28 05:18:19
3	34	364.1708477440117	256.25362325717805	20/04/28 05:18:19
3	34	364.1259965586998	256.5129639541311	20/04/28 05:18:19
3	34	364.0860836048704	256.74375056972633	20/04/28 05:18:20
3	34	364.03545005386394	257.03652634177985	20/04/28 05:18:20
3	34	363.98568921339216	257.3242558846932	20/04/28 05:18:20
3	34	363.95176467958584	257.5204159678649	20/04/28 05:18:20
3	34	363.920723728837	257.6999024573591	20/04/28 05:18:20
3	34	363.8906600444034	257.8737381502124	20/04/28 05:18:20
3	34	363.844232735514	258.14219238528517	20/04/28 05:18:20
3	34	363.81541384623046	258.3088303633061	20/04/28 05:18:20
3	34	363.7778554188241	258.52600252213045	20/04/28 05:18:20
3	34	363.7377338968523	258.75799513054466	20/04/28 05:18:20
3	34	363.68706170326715	259.05099434358925	20/04/28 05:18:21
3	34	363.6487587591255	259.27247148315564	20/04/28 05:18:21
3	34	363.62195704137537	259.4274456741947	20/04/28 05:18:21
3	34	363.5867361788087	259.63110145233765	20/04/28 05:18:21
3	34	363.55523806256906	259.8132313862841	20/04/28 05:18:21
3	34	363.5255962407267	259.98462776482097	20/04/28 05:18:21
3	34	363.4915235451485	260.18164455616926	20/04/28 05:18:21
3	34	363.4512537958358	260.41449425189626	20/04/28 05:18:21
3	34	363.42173812939654	260.58516116854855	20/04/28 05:18:21
3	15	363.63598634383834	260.60165790028555	20/04/28 05:18:22
3	15	363.8450830817755	260.6145534439537	20/04/28 05:18:22
3	15	364.1195887628979	260.63148292852145	20/04/28 05:18:22
3	15	364.2740972773697	260.6410118734257	20/04/28 05:18:22
3	15	364.5175658507002	260.6560272182378	20/04/28 05:18:22
3	15	364.98288938386656	260.6847249396894	20/04/28 05:18:22
3	15	364.98288938386656	260.6847249396894	20/04/28 05:18:22
3	15	365.18221837017074	260.6970180805225	20/04/28 05:18:22
3	15	365.47146612165625	260.7148567471942	20/04/28 05:18:22
3	15	365.7527129751545	260.73220197752437	20/04/28 05:18:22
3	15	366.0311144888241	260.7493717282925	20/04/28 05:18:23
3	15	366.217046819412	260.760838662268	20/04/28 05:18:23
3	15	366.44137864395805	260.7746737936437	20/04/28 05:18:23
3	15	366.7124409209702	260.7913909144581	20/04/28 05:18:23
3	15	366.86240409174536	260.80063953610767	20/04/28 05:18:23
3	15	367.0695924574953	260.813417385463	20/04/28 05:18:23
3	15	367.32355423104724	260.82907987342526	20/04/28 05:18:23
3	15	367.86032437464667	260.8621838945345	20/04/28 05:18:23
3	15	368.123755949823	260.87843040997404	20/04/28 05:18:23
3	15	368.3067348673082	260.88971519922546	20/04/28 05:18:24
3	15	368.49309792414857	260.90120869721744	20/04/28 05:18:24
3	15	368.7817731618507	260.9190120554641	20/04/28 05:18:24
3	15	369.04334604240387	260.93514394033645	20/04/28 05:18:24
3	15	369.21746031345697	260.9458820236168	20/04/28 05:18:24
3	15	369.42064772478494	260.95841312363035	20/04/28 05:18:24
3	15	369.6350686543632	260.97163702414656	20/04/28 05:18:24
3	15	369.824698614932	260.9833320006509	20/04/28 05:18:24
3	15	370.0295330851103	260.9959646790991	20/04/28 05:18:24
3	15	370.19635771557495	261.0062531911452	20/04/28 05:18:24
3	15	370.45074999822145	261.0219422297312	20/04/28 05:18:25
3	15	370.69424131401837	261.0369589771308	20/04/28 05:18:25
3	15	370.9364115030722	261.0518942471827	20/04/28 05:18:25
3	15	371.0995062857207	261.06195272974173	20/04/28 05:18:25
3	15	371.38547343971186	261.0795890733707	20/04/28 05:18:25
3	15	371.6097582053199	261.09342130249837	20/04/28 05:18:25
3	15	371.8227586106823	261.10655759556437	20/04/28 05:18:25
3	15	372.07603034474715	261.1221775269835	20/04/28 05:18:25
3	15	372.34179424885883	261.13856788325927	20/04/28 05:18:25
3	15	372.54245846105147	261.1509433709713	20/04/28 05:18:25
3	15	372.74866233453554	261.1636605041092	20/04/28 05:18:26
3	15	372.9362676038654	261.17523061260005	20/04/28 05:18:26
3	15	373.1249255815966	261.18686564437616	20/04/28 05:18:26
3	15	373.3725939722828	261.2021400029282	20/04/28 05:18:26
3	15	373.63932388790676	261.2185899356649	20/04/28 05:18:26
3	15	373.93446466935234	261.2367920409341	20/04/28 05:18:26
3	15	374.14209421852473	261.24959709922706	20/04/28 05:18:26
3	15	374.37737660469554	261.26410758042897	20/04/28 05:18:26
3	15	374.5496051281577	261.27472936471463	20/04/28 05:18:26
3	15	374.7362437759234	261.28623985912105	20/04/28 05:18:27
3	15	374.9157716953381	261.2973118162798	20/04/28 05:18:27
3	15	375.15785804045623	261.3122419154565	20/04/28 05:18:27
3	15	375.3954801943595	261.3268966962647	20/04/28 05:18:27
3	15	375.60343933233116	261.33972208116245	20/04/28 05:18:27
3	15	375.80789612992123	261.35233146755263	20/04/28 05:18:27
3	15	376.08679854984854	261.3695321105221	20/04/28 05:18:27
3	15	376.3230837156089	261.38410443576856	20/04/28 05:18:27
3	15	376.50511460754876	261.39533075780076	20/04/28 05:18:27
3	15	376.72476376767264	261.40887709699285	20/04/28 05:18:27
3	15	376.99447909994433	261.4255111481961	20/04/28 05:18:28
3	15	377.2008869889992	261.43824086350884	20/04/28 05:18:28
3	15	377.3589122817959	261.4479866973465	20/04/28 05:18:28
3	15	377.55814486301404	261.4602738926254	20/04/28 05:18:28
3	15	377.76639064602097	261.4731169556735	20/04/28 05:18:28
3	15	378.0631102219431	261.49141642933455	20/04/28 05:18:28
3	15	378.29668730371276	261.50582173994604	20/04/28 05:18:28
3	15	378.54973307868937	261.5214277358762	20/04/28 05:18:28
3	54	378.5891551053634	261.8054284200864	20/04/28 05:18:28
3	54	378.60728756036286	262.01864345877937	20/04/28 05:18:28
3	54	378.6321887435295	262.31145029230186	20/04/28 05:18:29
3	54	378.6321887435295	262.31145029230186	20/04/28 05:18:29
3	54	378.65550912143715	262.5856688290666	20/04/28 05:18:29
3	54	378.69208048042213	263.01570236403217	20/04/28 05:18:29
3	54	378.69208048042213	263.01570236403217	20/04/28 05:18:29
3	54	378.727608911775	263.4334723717796	20/04/28 05:18:29
3	54	378.7426125179896	263.6098960540481	20/04/28 05:18:29
3	54	378.75748831370106	263.7848168443272	20/04/28 05:18:29
3	54	378.77392634524784	263.9781075781185	20/04/28 05:18:29
3	54	378.7898598559063	264.1654657759827	20/04/28 05:18:30
3	54	378.81234234938904	264.4298318377202	20/04/28 05:18:30
3	54	378.83054516157006	264.6438741890515	20/04/28 05:18:30
3	54	378.8490882861039	264.86191818888926	20/04/28 05:18:30
3	54	378.8679611549747	265.083839570558	20/04/28 05:18:30
3	54	378.88248704786486	265.2546459403916	20/04/28 05:18:30
3	54	378.90074649635767	265.4693542640589	20/04/28 05:18:30
3	54	378.9148305635589	265.6349653152568	20/04/28 05:18:30
3	54	378.9148305635589	265.6349653152568	20/04/28 05:18:30
3	54	378.93934737189556	265.9232523805374	20/04/28 05:18:30
3	54	378.9838354102062	266.446376183136	20/04/28 05:18:31
3	54	378.99797390685524	266.61262725670366	20/04/28 05:18:31
3	54	379.0154910631563	266.8186071506907	20/04/28 05:18:31
3	54	379.0288254022087	266.9754023346356	20/04/28 05:18:31
3	54	379.04233641897736	267.13427502800135	20/04/28 05:18:31
3	54	379.0623004568801	267.3690271955386	20/04/28 05:18:31
3	54	379.08620184238794	267.6500776564943	20/04/28 05:18:31
3	54	379.09926068808807	267.8036333824739	20/04/28 05:18:31
3	54	379.12366346856345	268.0905796224305	20/04/28 05:18:31
3	54	379.1490164521219	268.3886990646432	20/04/28 05:18:31
3	54	379.17297315767496	268.6704000202832	20/04/28 05:18:32
3	54	379.1970227856719	268.9531936278816	20/04/28 05:18:32
3	54	379.21574422462317	269.1733343827049	20/04/28 05:18:32
3	54	379.2394695375394	269.4523144497493	20/04/28 05:18:32
3	54	379.2620790043043	269.7181735588029	20/04/28 05:18:32
3	54	379.27827120614	269.90857364202515	20/04/28 05:18:32
3	15	379.2916628515674	270.06604267741255	20/04/28 05:18:32
3	15	379.1381041046647	270.3046072296205	20/04/28 05:18:32
3	15	379.15196943914384	270.32126708500294	20/04/28 05:18:32
3	15	379.18277900377785	270.48688230906134	20/04/28 05:18:33
3	15	379.0095558997548	270.42713352470935	20/04/28 05:18:33
3	15	379.0239466570835	270.38246522526873	20/04/28 05:18:33
3	15	379.12412398430195	270.20703440041353	20/04/28 05:18:33
3	15	379.3493804163814	270.01329450860584	20/04/28 05:18:33
3	15	379.1349304185538	270.0241768797743	20/04/28 05:18:33
3	15	379.1879007923176	270.0634706457381	20/04/28 05:18:33
3	15	378.9077702693252	269.9597898359777	20/04/28 05:18:33
3	15	378.77558523525926	270.16139827680047	20/04/28 05:18:33
3	15	378.82164450013136	270.0754881195383	20/04/28 05:18:33
3	15	378.8069900986903	270.20445057211714	20/04/28 05:18:34
3	15	378.80819375401904	269.95002770158794	20/04/28 05:18:34
3	15	378.87763189154276	269.68236576794357	20/04/28 05:18:34
3	15	379.0379816330062	269.43749306235264	20/04/28 05:18:34
3	15	379.0379816330062	269.43749306235264	20/04/28 05:18:34
3	15	379.1188491850504	269.215416684732	20/04/28 05:18:34
3	15	379.013785247184	269.3669712355284	20/04/28 05:18:34
3	15	379.0019194569266	269.3939001363138	20/04/28 05:18:34
3	15	378.78569146483653	269.3840010545605	20/04/28 05:18:34
3	15	378.864970509885	269.4708339424448	20/04/28 05:18:34
3	15	379.09639387067125	269.38804045894705	20/04/28 05:18:35
3	15	379.1353913152298	269.3539998917701	20/04/28 05:18:35
3	15	379.1112107510079	269.4278650066164	20/04/28 05:18:35
3	15	379.08971162990105	269.6064586934456	20/04/28 05:18:35
3	15	379.36608883836834	269.63319823826964	20/04/28 05:18:35
3	15	379.2843092266576	269.85493591421215	20/04/28 05:18:35
3	15	379.4076572412624	270.0393900808443	20/04/28 05:18:35
3	15	379.6313309183295	269.85674648337664	20/04/28 05:18:35
3	15	379.77618974916965	269.7248980879718	20/04/28 05:18:35
3	15	379.79661557388437	269.73274467998465	20/04/28 05:18:36
3	15	379.76606130594644	269.78808128285505	20/04/28 05:18:36
3	15	379.8501082693227	269.6743808778285	20/04/28 05:18:36
3	15	379.8984302742382	269.6688122388065	20/04/28 05:18:36
3	15	379.84857924773974	269.6691213850862	20/04/28 05:18:36
3	15	379.9849888146147	269.8030790577069	20/04/28 05:18:36
3	15	379.97740459925365	269.7407291638068	20/04/28 05:18:36
3	15	380.03439826310137	269.71637348300027	20/04/28 05:18:36
3	15	379.9541472865914	269.70792564857715	20/04/28 05:18:36
3	15	380.0710488062847	269.6728417823524	20/04/28 05:18:36
3	15	380.341122102174	269.5616376119313	20/04/28 05:18:37
3	15	380.2471847827252	269.38134247361546	20/04/28 05:18:37
3	15	380.3863249472668	269.3876198389359	20/04/28 05:18:37
3	15	380.6146408774429	269.26046526883624	20/04/28 05:18:37
3	15	380.73331831642565	269.23728511455386	20/04/28 05:18:37
3	15	380.75013293304323	269.2244104774427	20/04/28 05:18:37
3	15	380.9601850366415	269.24827695653573	20/04/28 05:18:37
3	15	381.0195237288555	269.1364157908265	20/04/28 05:18:37
3	15	381.1152730689532	269.27784059734694	20/04/28 05:18:37
3	15	381.19346842821767	269.35749481267766	20/04/28 05:18:38
3	15	381.22693256059523	269.33197300775333	20/04/28 05:18:38
3	15	381.2302508044161	269.3286131202697	20/04/28 05:18:38
3	15	381.2758509197305	269.4280075351515	20/04/28 05:18:38
3	15	380.98602693714815	269.4495879216303	20/04/28 05:18:38
3	15	380.99062258769004	269.45226401151626	20/04/28 05:18:38
3	15	380.9588535849574	269.7478374532389	20/04/28 05:18:38
3	15	381.0669373996687	269.6083534657573	20/04/28 05:18:38
3	15	380.9668830617976	269.5306656281885	20/04/28 05:18:38
3	15	381.19273430976546	269.5027491522707	20/04/28 05:18:38
3	15	381.17387251540333	269.53900941537927	20/04/28 05:18:39
3	15	381.1782744032686	269.77975059269795	20/04/28 05:18:39
3	15	381.18845127108506	269.79680259185267	20/04/28 05:18:39
3	15	380.961269383729	269.80850789410044	20/04/28 05:18:39
3	15	381.068291894802	269.79880204471846	20/04/28 05:18:39
3	15	381.09314394959387	269.7873890558886	20/04/28 05:18:39
3	15	381.05117077533095	269.97155562113244	20/04/28 05:18:39
3	15	380.99185824645616	269.96212413938053	20/04/28 05:18:39
3	15	380.82058899737234	269.93701713487263	20/04/28 05:18:39
3	15	381.0310331334208	269.80781082874194	20/04/28 05:18:39
3	15	381.1329715620769	269.6773153508622	20/04/28 05:18:40
3	15	381.26645962236233	269.6963197007112	20/04/28 05:18:40
3	15	381.1195888464968	269.7116691658965	20/04/28 05:18:40
3	15	381.19377343705065	269.8045370508446	20/04/28 05:18:40
3	15	381.3440608484468	269.57126990575136	20/04/28 05:18:40
3	15	381.0954405176296	269.595071813912	20/04/28 05:18:40
3	15	381.2517516303691	269.8139316962329	20/04/28 05:18:40
3	15	381.25195145738826	269.8144553579403	20/04/28 05:18:40
3	15	381.0333186646338	269.70097818862763	20/04/28 05:18:40
3	15	380.9587951399301	269.8712596878471	20/04/28 05:18:41
3	15	381.11841288732495	269.88735388936277	20/04/28 05:18:41
3	15	380.91492444958095	269.97061068606365	20/04/28 05:18:41
3	15	380.91879009359127	269.918044374191	20/04/28 05:18:41
3	15	380.783566928391	269.89204282536446	20/04/28 05:18:41
3	15	380.8700464295866	269.9690255175754	20/04/28 05:18:41
3	15	380.76465729848155	270.02317458151174	20/04/28 05:18:41
3	15	380.6403846253098	269.78694079284486	20/04/28 05:18:41
3	15	380.6282665897948	269.7570793067123	20/04/28 05:18:41
3	15	380.59174735465837	269.7552817978545	20/04/28 05:18:41
3	15	380.59174735465837	269.7552817978545	20/04/28 05:18:42
3	15	380.59174735465837	269.7552817978545	20/04/28 05:18:42
3	15	380.6591647522111	269.49298806140746	20/04/28 05:18:42
3	15	380.696519839096	269.3476545767282	20/04/28 05:18:42
3	15	380.75647115281015	269.11440834282115	20/04/28 05:18:42
3	15	380.8097457525166	268.9071384937617	20/04/28 05:18:42
3	15	380.85791970470774	268.7197131943835	20/04/28 05:18:42
3	15	380.9040929345897	268.5400718936332	20/04/28 05:18:42
3	15	380.9752475840891	268.263238026408	20/04/28 05:18:42
3	15	381.03420779145836	268.0338477851061	20/04/28 05:18:42
3	15	381.0917922116713	267.80981017334614	20/04/28 05:18:43
3	15	381.1541930352878	267.56703389040024	20/04/28 05:18:43
3	15	381.19384673864465	267.4127574217884	20/04/28 05:18:43
3	15	381.26502143266487	267.13584556946677	20/04/28 05:18:43
3	15	381.32952897556385	266.88487289668217	20/04/28 05:18:43
3	15	381.3787040820367	266.69355251225403	20/04/28 05:18:43
3	15	381.42481089145156	266.51416962658834	20/04/28 05:18:43
3	15	381.4808006638632	266.2963361423282	20/04/28 05:18:43
3	15	381.53105190838863	266.1008289414253	20/04/28 05:18:43
3	15	381.5965904518099	265.84584506398016	20/04/28 05:18:43
3	15	381.6481555656785	265.6452261306204	20/04/28 05:18:44
3	15	381.7211150433273	265.36137040945067	20/04/28 05:18:44
3	15	381.76520032284066	265.18985247631156	20/04/28 05:18:44
3	15	381.8288627374423	264.9421678547857	20/04/28 05:18:44
1	33	381.73197787049565	264.82421544715146	20/04/28 05:18:44
1	33	381.6000352579432	264.6811668748878	20/04/28 05:18:44
1	33	381.46969464414866	264.5398551458673	20/04/28 05:18:44
1	33	381.32591815301447	264.3839766060692	20/04/28 05:18:44
1	33	381.1282046724022	264.16962105730653	20/04/28 05:18:44
1	33	381.0250899615878	264.05782690774384	20/04/28 05:18:45
1	33	380.8771809672923	263.8974680210308	20/04/28 05:18:45
1	33	380.6879630551509	263.69232313527397	20/04/28 05:18:45
1	33	380.4953293046033	263.4834748909309	20/04/28 05:18:45
1	33	380.3086459835508	263.2810779395186	20/04/28 05:18:45
1	33	380.14423596535795	263.10282909395346	20/04/28 05:18:45
1	33	379.98715457912056	262.9325257507366	20/04/28 05:18:45
1	33	379.864006361074	262.7990118204939	20/04/28 05:18:45
1	33	379.71692231696824	262.63954732221646	20/04/28 05:18:45
1	33	379.5202187008487	262.42628664091984	20/04/28 05:18:45
1	33	379.3836898802695	262.27826582733377	20/04/28 05:18:46
1	33	379.27252144412944	262.1577400490201	20/04/28 05:18:46
1	33	379.1119663225908	261.98367057698664	20/04/28 05:18:46
1	33	378.9969356411021	261.85895745788775	20/04/28 05:18:46
1	33	378.8208382010282	261.6680374291378	20/04/28 05:18:46
1	33	378.6442337907313	261.47656775713637	20/04/28 05:18:46
1	41	378.515630693122	261.38645954058245	20/04/28 05:18:46
1	41	378.3444309549168	261.37158913526645	20/04/28 05:18:46
1	41	378.10165778207727	261.3505018630672	20/04/28 05:18:46
1	41	377.84068688043635	261.3278339365636	20/04/28 05:18:46
1	41	377.62442071235637	261.30904906218706	20/04/28 05:18:47
1	41	377.3705475977638	261.2869976493029	20/04/28 05:18:47
1	41	377.1477881709024	261.2676487706182	20/04/28 05:18:47
1	41	376.9319618612825	261.24890210233735	20/04/28 05:18:47
1	41	376.7212159151059	261.23059671430815	20/04/28 05:18:47
1	41	376.4635497543999	261.208215837526	20/04/28 05:18:47
1	41	376.20295655634965	261.1855807183475	20/04/28 05:18:47
1	41	376.0261362512829	261.17022211072344	20/04/28 05:18:47
1	41	375.7472819495359	261.14600083249866	20/04/28 05:18:47
1	41	375.546518662435	261.12856253800675	20/04/28 05:18:48
1	41	375.3702623098139	261.1132529152791	20/04/28 05:18:48
1	41	375.1519630995213	261.0942914509028	20/04/28 05:18:48
1	41	374.8787979463664	261.07056433199364	20/04/28 05:18:48
1	41	374.6266323017562	261.0486612299128	20/04/28 05:18:48
1	41	374.3454035406266	261.02423370620073	20/04/28 05:18:48
1	41	374.3454035406266	261.02423370620073	20/04/28 05:18:48
1	41	374.19331872249	261.01102362240147	20/04/28 05:18:48
1	41	373.9352997346981	260.98861209906676	20/04/28 05:18:48
1	41	373.69225744024607	260.9675014509705	20/04/28 05:18:48
1	41	373.45929199455037	260.947266077725	20/04/28 05:18:49
