floorId	partitionId	location_x	location_y	timeStamp
21	962	335.906116751812	274.04579276282294	21/02/24 15:46:18
21	962	335.906116751812	274.04579276282294	21/02/24 15:46:19
21	962	336.7019889059573	278.9083575242709	21/02/24 15:46:20
21	962	336.7019889059573	278.9083575242709	21/02/24 15:46:21
21	962	335.906116751812	274.04579276282294	21/02/24 15:46:22
21	962	335.906116751812	274.04579276282294	21/02/24 15:46:23
21	962	335.906116751812	274.04579276282294	21/02/24 15:46:24
21	962	335.906116751812	274.04579276282294	21/02/24 15:46:25
21	962	335.906116751812	274.04579276282294	21/02/24 15:46:26
21	962	335.906116751812	274.04579276282294	21/02/24 15:46:27
21	962	335.906116751812	274.04579276282294	21/02/24 15:46:28
21	962	336.7019889059573	278.9083575242709	21/02/24 15:46:29
21	962	335.906116751812	274.04579276282294	21/02/24 15:46:30
21	962	335.906116751812	274.04579276282294	21/02/24 15:46:31
21	962	336.7019889059573	278.9083575242709	21/02/24 15:46:32
21	962	335.9061167518121	274.04579276282294	21/02/24 15:46:33
21	962	335.906116751812	274.04579276282294	21/02/24 15:46:34
21	962	335.906116751812	274.04579276282294	21/02/24 15:46:35
21	962	335.906116751812	274.04579276282294	21/02/24 15:46:36
21	962	335.906116751812	274.04579276282294	21/02/24 15:46:37
21	962	335.906116751812	274.04579276282294	21/02/24 15:46:38
21	962	336.7019889059573	278.9083575242709	21/02/24 15:46:39
21	962	335.906116751812	274.04579276282294	21/02/24 15:46:40
21	962	335.906116751812	274.04579276282294	21/02/24 15:46:41
21	962	335.906116751812	274.04579276282294	21/02/24 15:46:42
21	962	335.9061167518121	274.04579276282294	21/02/24 15:46:43
21	962	335.906116751812	274.04579276282294	21/02/24 15:46:44
21	962	335.906116751812	274.04579276282294	21/02/24 15:46:45
21	962	336.7019889059573	278.9083575242709	21/02/24 15:46:46
21	962	335.9061167518121	274.04579276282294	21/02/24 15:46:47
21	962	335.906116751812	274.04579276282294	21/02/24 15:46:48
21	962	335.906116751812	274.04579276282294	21/02/24 15:46:49
21	962	335.906116751812	274.04579276282294	21/02/24 15:46:50
21	962	335.9061167518121	274.04579276282294	21/02/24 15:46:51
21	962	335.906116751812	274.04579276282294	21/02/24 15:46:52
21	962	335.906116751812	274.04579276282294	21/02/24 15:46:53
21	962	335.906116751812	274.04579276282294	21/02/24 15:46:54
21	962	335.906116751812	274.04579276282294	21/02/24 15:46:55
21	962	335.906116751812	274.04579276282294	21/02/24 15:46:56
21	962	335.9061167518121	274.04579276282294	21/02/24 15:46:57
21	962	336.7019889059573	278.9083575242709	21/02/24 15:46:58
21	962	335.906116751812	274.04579276282294	21/02/24 15:46:59
21	962	335.906116751812	274.04579276282294	21/02/24 15:47:00
21	962	335.906116751812	274.04579276282294	21/02/24 15:47:01
21	962	335.906116751812	274.04579276282294	21/02/24 15:47:02
21	962	335.906116751812	274.04579276282294	21/02/24 15:47:03
21	962	335.906116751812	274.04579276282294	21/02/24 15:47:04
21	962	336.7019889059573	278.9083575242709	21/02/24 15:47:05
21	962	335.906116751812	274.04579276282294	21/02/24 15:47:06
21	962	335.906116751812	274.04579276282294	21/02/24 15:47:07
21	942	334.21131339204896	281.8578062266767	21/02/24 15:47:08
21	962	335.906116751812	274.04579276282294	21/02/24 15:47:09
21	962	335.906116751812	274.04579276282294	21/02/24 15:47:10
21	962	335.906116751812	274.04579276282294	21/02/24 15:47:11
21	962	335.906116751812	274.04579276282294	21/02/24 15:47:12
21	962	335.906116751812	274.04579276282294	21/02/24 15:47:13
21	962	335.906116751812	274.04579276282294	21/02/24 15:47:14
21	962	335.906116751812	274.04579276282294	21/02/24 15:47:15
21	962	335.906116751812	274.04579276282294	21/02/24 15:47:16
21	962	335.906116751812	274.04579276282294	21/02/24 15:47:17
21	962	335.906116751812	274.04579276282294	21/02/24 15:47:18
21	962	335.9061167518121	274.04579276282294	21/02/24 15:47:19
21	962	335.906116751812	274.04579276282294	21/02/24 15:47:20
21	962	335.906116751812	274.04579276282294	21/02/24 15:47:21
21	962	335.906116751812	274.04579276282294	21/02/24 15:47:22
21	962	335.906116751812	274.04579276282294	21/02/24 15:47:23
21	962	335.906116751812	274.04579276282294	21/02/24 15:47:24
21	962	335.906116751812	274.04579276282294	21/02/24 15:47:25
21	962	335.9061167518121	274.04579276282294	21/02/24 15:47:26
21	962	335.906116751812	274.04579276282294	21/02/24 15:47:27
21	962	335.9061167518121	274.04579276282294	21/02/24 15:47:28
21	962	335.9061167518121	274.04579276282294	21/02/24 15:47:29
21	962	335.906116751812	274.04579276282294	21/02/24 15:47:30
21	962	335.906116751812	274.04579276282294	21/02/24 15:47:31
21	962	335.9061167518121	274.04579276282294	21/02/24 15:47:32
21	962	335.9061167518121	274.04579276282294	21/02/24 15:47:33
21	962	335.9061167518121	274.04579276282294	21/02/24 15:47:34
21	962	335.9061167518121	274.04579276282294	21/02/24 15:47:35
21	962	335.9061167518121	274.04579276282294	21/02/24 15:47:36
21	962	335.9061167518121	274.04579276282294	21/02/24 15:47:37
21	962	335.9061167518121	274.04579276282294	21/02/24 15:47:38
21	962	335.9061167518121	274.04579276282294	21/02/24 15:47:39
21	962	335.9061167518121	274.04579276282294	21/02/24 15:47:40
21	962	335.9061167518121	274.04579276282294	21/02/24 15:47:41
21	962	335.9061167518121	274.04579276282294	21/02/24 15:47:42
