floorId	partitionId	location_x	location_y	timeStamp
19	940	347.8388336600784	278.142682523179	21/02/21 12:24:58
19	940	347.7602307678534	278.27170259850067	21/02/21 12:24:58
19	940	347.65642661636105	278.4420884337432	21/02/21 12:24:58
19	940	347.56849152811736	278.5864265285316	21/02/21 12:24:58
19	940	347.44282965154423	278.7926899918926	21/02/21 12:24:58
19	940	347.3357905524417	278.9683857231518	21/02/21 12:24:58
19	940	347.1953059464414	279.19897945748676	21/02/21 12:24:59
19	940	347.0892535650463	279.3730555741323	21/02/21 12:24:59
19	940	346.9460562752608	279.60810195208353	21/02/21 12:24:59
19	940	346.8157649231252	279.8219643124935	21/02/21 12:24:59
19	940	346.71085927415805	279.99415816374085	21/02/21 12:24:59
19	940	346.57331225959274	280.21993008735757	21/02/21 12:24:59
19	940	346.4561190378718	280.4122929618729	21/02/21 12:24:59
19	940	346.36687025578584	280.55878737526086	21/02/21 12:24:59
19	909	346.2824754046614	280.5643344127354	21/02/21 12:24:59
19	909	346.15671452735086	280.2932630572624	21/02/21 12:24:59
19	909	346.085141039962	280.1389899426235	21/02/21 12:25:00
19	909	345.99069122047706	279.9354080247847	21/02/21 12:25:00
19	909	345.9096170954064	279.7606567551794	21/02/21 12:25:00
19	909	345.8042611059046	279.5335671268927	21/02/21 12:25:00
19	909	345.69993603818205	279.3086995995493	21/02/21 12:25:00
19	909	345.6220529559334	279.14082646503357	21/02/21 12:25:00
19	909	345.552825234608	278.9916095332079	21/02/21 12:25:00
19	909	345.46814956113633	278.80909530402613	21/02/21 12:25:00
19	909	345.3936459546271	278.6485064624406	21/02/21 12:25:00
19	909	345.2684060700954	278.3785580811529	21/02/21 12:25:00
19	909	345.1604248669011	278.1458099344999	21/02/21 12:25:01
19	909	345.0419348338052	277.89041052437943	21/02/21 12:25:01
19	909	344.93994857226267	277.6705841781644	21/02/21 12:25:01
19	909	344.82409264417925	277.42086245121106	21/02/21 12:25:01
19	909	344.72496879449244	277.2072058922802	21/02/21 12:25:01
19	909	344.65192527917606	277.0497642050977	21/02/21 12:25:01
19	909	344.56602465463874	276.8646096544355	21/02/21 12:25:01
19	909	344.4665890897695	276.65028120883505	21/02/21 12:25:01
19	909	344.35810397502274	276.4164469057359	21/02/21 12:25:01
19	909	344.26268707682806	276.2107804975349	21/02/21 12:25:02
19	909	344.17139384161055	276.0140024410745	21/02/21 12:25:02
19	909	344.08461020419605	275.8269445997974	21/02/21 12:25:02
19	909	343.9834347168346	275.60886583725835	21/02/21 12:25:02
19	909	343.9065848052255	275.44321965099317	21/02/21 12:25:02
19	909	343.82283597378375	275.26270318399884	21/02/21 12:25:02
19	909	343.7352788282798	275.0739780842644	21/02/21 12:25:02
19	909	343.6387197054398	274.86584966729356	21/02/21 12:25:02
19	909	343.5171569083665	274.6038270662871	21/02/21 12:25:02
19	909	343.40136212540335	274.35423713461853	21/02/21 12:25:02
19	909	343.32171660936757	274.1825651611807	21/02/21 12:25:03
19	909	343.25653084817384	274.0420604746502	21/02/21 12:25:03
19	909	343.1773344659487	273.8713565869435	21/02/21 12:25:03
19	900	343.08616078141114	273.69502596842193	21/02/21 12:25:03
19	900	342.8549240217954	273.64583257572804	21/02/21 12:25:03
19	900	342.69430009288794	273.6116613824285	21/02/21 12:25:03
19	900	342.43547662326074	273.55659918297147	21/02/21 12:25:03
19	900	342.1495866920041	273.49577885458206	21/02/21 12:25:03
19	900	341.98648599376395	273.46108075247014	21/02/21 12:25:03
19	900	341.70952638271405	273.40216026366306	21/02/21 12:25:03
19	900	341.4921228968272	273.35590976667453	21/02/21 12:25:04
19	900	341.2667507831083	273.3079640208906	21/02/21 12:25:04
19	900	341.0906202345533	273.2704939436639	21/02/21 12:25:04
19	900	340.8260168261843	273.2142021179279	21/02/21 12:25:04
19	900	340.60032295932547	273.16618792226353	21/02/21 12:25:04
19	900	340.322780598565	273.1071434590702	21/02/21 12:25:04
19	900	340.0610207589093	273.05145657518085	21/02/21 12:25:04
19	900	339.89290902681773	273.01569242389724	21/02/21 12:25:04
19	900	339.67761004815594	272.96988964054435	21/02/21 12:25:04
19	900	339.4677419802959	272.92524223113895	21/02/21 12:25:05
19	900	339.2759164411524	272.88443319588225	21/02/21 12:25:05
19	900	339.077934026941	272.842314344775	21/02/21 12:25:05
19	900	338.85983667550846	272.7959162345768	21/02/21 12:25:05
19	900	338.63521519905765	272.7481301796395	21/02/21 12:25:05
19	900	338.4857483040314	272.71633253780266	21/02/21 12:25:05
19	900	338.28456033813023	272.67353173645813	21/02/21 12:25:05
19	900	338.1220147684141	272.6389517325911	21/02/21 12:25:05
19	900	337.8461362954274	272.5802612454905	21/02/21 12:25:05
19	900	337.5802351800726	272.5236933450964	21/02/21 12:25:05
19	900	337.38201855678267	272.48152466826417	21/02/21 12:25:06
19	900	337.14910052330004	272.4319736007538	21/02/21 12:25:06
19	900	336.9412028523177	272.38774537429975	21/02/21 12:25:06
19	900	336.6886685146609	272.334021127075	21/02/21 12:25:06
19	900	336.431152951566	272.2792371721313	21/02/21 12:25:06
19	900	336.14489060515433	272.2183376160057	21/02/21 12:25:06
19	900	335.9289463980968	272.1723975665283	21/02/21 12:25:06
19	900	335.77540492150473	272.13973309672105	21/02/21 12:25:06
19	900	335.52549746347773	272.08656769282817	21/02/21 12:25:06
19	900	335.31862166500673	272.0425568599054	21/02/21 12:25:06
19	900	335.04894026790936	271.98518474099274	21/02/21 12:25:07
19	900	334.85472074265647	271.9438664082568	21/02/21 12:25:07
19	900	334.6372560134226	271.8976028823362	21/02/21 12:25:07
19	900	334.4828793022186	271.8647607244125	21/02/21 12:25:07
19	900	334.3335122470703	271.8329843225478	21/02/21 12:25:07
19	900	334.16190693373244	271.7964769455139	21/02/21 12:25:07
19	900	334.16190693373244	271.7964769455139	21/02/21 12:25:07
19	900	333.91193860623866	271.7432985922284	21/02/21 12:25:07
19	900	333.74058415258105	271.70684458317453	21/02/21 12:25:07
19	900	333.54276115339434	271.6647596460778	21/02/21 12:25:07
19	900	333.36870321933725	271.62773049761637	21/02/21 12:25:08
19	900	333.1690485032912	271.585255880406	21/02/21 12:25:08
19	900	332.90997497680326	271.53014048376104	21/02/21 12:25:08
19	900	332.62730158749287	271.47000444368	21/02/21 12:25:08
19	900	332.3888638024753	271.41927910221216	21/02/21 12:25:08
19	900	332.15598360980323	271.36973608496965	21/02/21 12:25:08
19	900	331.985253117661	271.3334148177164	21/02/21 12:25:08
19	900	331.79596102845437	271.2931447495246	21/02/21 12:25:08
19	900	331.59797557763045	271.2510252524072	21/02/21 12:25:08
19	900	331.38841701461877	271.20644368717626	21/02/21 12:25:08
19	900	331.1899727125467	271.1642265738768	21/02/21 12:25:09
19	900	330.98130146330885	271.11983377610215	21/02/21 12:25:09
19	900	330.7220799223307	271.0646868908005	21/02/21 12:25:09
19	900	330.57311718664585	271.0329965040061	21/02/21 12:25:09
19	900	330.33223793689314	270.9817517644388	21/02/21 12:25:09
19	900	330.1189865782895	270.9363845925249	21/02/21 12:25:09
19	900	329.882411971656	270.88605562430695	21/02/21 12:25:09
19	900	329.60428828539494	270.8268874897143	21/02/21 12:25:09
19	900	329.4414911344195	270.79225396435834	21/02/21 12:25:09
19	900	329.19261333292167	270.7393076099715	21/02/21 12:25:10
19	900	328.9837231866552	270.694868243963	21/02/21 12:25:10
19	900	328.73533297566195	270.6420256197582	21/02/21 12:25:10
19	900	328.579696252293	270.6089154063864	21/02/21 12:25:10
19	900	328.4203511987478	270.57501628149856	21/02/21 12:25:10
19	900	328.22476077298563	270.53340630288756	21/02/21 12:25:10
19	900	327.9314275489626	270.47100248567654	21/02/21 12:25:10
19	900	327.76757625500613	270.4361447015578	21/02/21 12:25:10
19	900	327.6108227786681	270.4027969097515	21/02/21 12:25:10
19	900	327.34670500990893	270.3466083991635	21/02/21 12:25:10
19	900	327.05764609190766	270.2851138993766	21/02/21 12:25:11
19	900	326.768486443223	270.22359797010733	21/02/21 12:25:11
19	900	326.509193710568	270.16843593946237	21/02/21 12:25:11
19	900	326.2836782493611	270.12045969788153	21/02/21 12:25:11
19	900	326.13639767494067	270.0891271746889	21/02/21 12:25:11
19	900	325.8813031521726	270.0348582727485	21/02/21 12:25:11
19	900	325.6362885016707	269.9827337665155	21/02/21 12:25:11
19	900	325.41920823557257	269.9365520314228	21/02/21 12:25:11
19	900	325.14436694162873	269.87808219417053	21/02/21 12:25:11
19	900	324.94974175923403	269.8366775617861	21/02/21 12:25:11
19	900	324.68571385692206	269.78050816941885	21/02/21 12:25:12
19	900	324.41475678829505	269.7228646636791	21/02/21 12:25:12
19	900	324.17397983761066	269.671641687253	21/02/21 12:25:12
19	900	323.97251000966804	269.62878092247485	21/02/21 12:25:12
19	900	323.7712386050365	269.58596237034436	21/02/21 12:25:12
19	909	323.8053496614915	269.5547975459077	21/02/21 12:25:12
19	909	324.0922127828528	269.504654288627	21/02/21 12:25:12
19	909	324.2592693994777	269.4754530344954	21/02/21 12:25:12
19	909	324.49984057897524	269.43340154146756	21/02/21 12:25:12
19	909	324.76570952299073	269.38692803591744	21/02/21 12:25:13
19	909	324.94997362801155	269.354718937788	21/02/21 12:25:13
19	909	325.11131467115945	269.32651675760496	21/02/21 12:25:13
19	909	325.35226427213894	269.28439911705135	21/02/21 12:25:13
19	909	325.5491745413538	269.2499794877745	21/02/21 12:25:13
19	909	325.7691601106734	269.2115263295293	21/02/21 12:25:13
19	909	326.0609916285969	269.16051460374035	21/02/21 12:25:13
19	909	326.32995128015614	269.1135008469972	21/02/21 12:25:13
19	909	326.540534085956	269.0766912781687	21/02/21 12:25:13
19	909	326.82408453423005	269.02712707133594	21/02/21 12:25:13
19	909	327.01425214059145	268.99388604974007	21/02/21 12:25:14
19	909	327.29440789277635	268.94491523085685	21/02/21 12:25:14
19	909	327.46863870539835	268.91445993767707	21/02/21 12:25:14
19	909	327.62217693674586	268.88762167767226	21/02/21 12:25:14
19	909	327.7877067831396	268.8586873007612	21/02/21 12:25:14
19	909	328.07576643755493	268.80833489123927	21/02/21 12:25:14
19	909	328.31679159789024	268.76620404301985	21/02/21 12:25:14
