stationId	t_start	t_end	t_max	timeStamp
144	20/04/28 05:12:30	20/04/28 05:12:04	20/04/28 05:12:30
51	20/04/28 05:12:32	20/04/28 05:12:32	20/04/28 05:12:32
19	20/04/28 05:12:34	20/04/28 05:12:34	20/04/28 05:12:34
20	20/04/28 05:12:36	20/04/28 05:12:36	20/04/28 05:12:36
6	20/04/28 05:12:38	20/04/28 05:12:38	20/04/28 05:12:38
136	20/04/28 05:12:40	20/04/28 05:12:40	20/04/28 05:12:40
147	20/04/28 05:12:42	20/04/28 05:12:42	20/04/28 05:12:42
6	20/04/28 05:12:44	20/04/28 05:12:45	20/04/28 05:12:45
153	20/04/28 05:12:47	20/04/28 05:12:47	20/04/28 05:12:47
115	20/04/28 05:12:49	20/04/28 05:12:49	20/04/28 05:12:49
132	20/04/28 05:12:51	20/04/28 05:12:51	20/04/28 05:12:51
78	20/04/28 05:12:53	20/04/28 05:12:53	20/04/28 05:12:53
78	20/04/28 05:12:55	20/04/28 05:12:55	20/04/28 05:12:55
64	20/04/28 05:12:57	20/04/28 05:12:57	20/04/28 05:12:57
24	20/04/28 05:12:59	20/04/28 05:12:59	20/04/28 05:12:59
15	20/04/28 05:13:01	20/04/28 05:13:01	20/04/28 05:13:01
63	20/04/28 05:13:03	20/04/28 05:13:03	20/04/28 05:13:03
139	20/04/28 05:13:05	20/04/28 05:13:06	20/04/28 05:13:06
26	20/04/28 05:13:08	20/04/28 05:13:09	20/04/28 05:13:09
85	20/04/28 05:13:11	20/04/28 05:13:11	20/04/28 05:13:11
36	20/04/28 05:13:14	20/04/28 05:13:14	20/04/28 05:13:14
70	20/04/28 05:13:16	20/04/28 05:13:16	20/04/28 05:13:16
36	20/04/28 05:13:18	20/04/28 05:13:18	20/04/28 05:13:18
36	20/04/28 05:13:20	20/04/28 05:13:20	20/04/28 05:13:20
15	20/04/28 05:13:22	20/04/28 05:13:22	20/04/28 05:13:22
70	20/04/28 05:13:24	20/04/28 05:13:24	20/04/28 05:13:24
36	20/04/28 05:13:26	20/04/28 05:13:26	20/04/28 05:13:26
70	20/04/28 05:13:28	20/04/28 05:13:28	20/04/28 05:13:28
26	20/04/28 05:13:30	20/04/28 05:13:31	20/04/28 05:13:30
26	20/04/28 05:13:33	20/04/28 05:13:33	20/04/28 05:13:33
139	20/04/28 05:13:35	20/04/28 05:13:35	20/04/28 05:13:35
139	20/04/28 05:13:37	20/04/28 05:13:38	20/04/28 05:13:37
70	20/04/28 05:13:40	20/04/28 05:13:40	20/04/28 05:13:40
70	20/04/28 05:13:42	20/04/28 05:13:42	20/04/28 05:13:42
24	20/04/28 05:13:44	20/04/28 05:13:46	20/04/28 05:13:46
95	20/04/28 05:13:48	20/04/28 05:13:48	20/04/28 05:13:48
82	20/04/28 05:13:50	20/04/28 05:13:50	20/04/28 05:13:50
24	20/04/28 05:13:52	20/04/28 05:13:52	20/04/28 05:13:52
45	20/04/28 05:13:54	20/04/28 05:13:54	20/04/28 05:13:54
85	20/04/28 05:13:56	20/04/28 05:13:58	20/04/28 05:13:57
26	20/04/28 05:14:00	20/04/28 05:14:00	20/04/28 05:14:00
139	20/04/28 05:14:02	20/04/28 05:14:03	20/04/28 05:14:03
85	20/04/28 05:14:05	20/04/28 05:14:06	20/04/28 05:14:06
85	20/04/28 05:14:08	20/04/28 05:14:08	20/04/28 05:14:08
64	20/04/28 05:14:10	20/04/28 05:14:10	20/04/28 05:14:10
82	20/04/28 05:14:12	20/04/28 05:14:12	20/04/28 05:14:12
64	20/04/28 05:14:14	20/04/28 05:14:14	20/04/28 05:14:14
76	20/04/28 05:14:16	20/04/28 05:14:16	20/04/28 05:14:16
64	20/04/28 05:14:18	20/04/28 05:14:18	20/04/28 05:14:18
108	20/04/28 05:14:20	20/04/28 05:14:20	20/04/28 05:14:20
85	20/04/28 05:14:22	20/04/28 05:14:22	20/04/28 05:14:22
64	20/04/28 05:14:24	20/04/28 05:14:24	20/04/28 05:14:24
108	20/04/28 05:14:26	20/04/28 05:14:29	20/04/28 05:14:28
64	20/04/28 05:14:31	20/04/28 05:14:31	20/04/28 05:14:31
45	20/04/28 05:11:28	20/04/28 05:14:33	20/04/28 05:11:28
95	20/04/28 05:14:35	20/04/28 05:14:35	20/04/28 05:14:35
85	20/04/28 05:14:37	20/04/28 05:14:37	20/04/28 05:14:37
39	20/04/28 05:14:39	20/04/28 05:14:39	20/04/28 05:14:39
39	20/04/28 05:14:41	20/04/28 05:14:41	20/04/28 05:14:41
63	20/04/28 05:14:43	20/04/28 05:14:43	20/04/28 05:14:43
63	20/04/28 05:14:45	20/04/28 05:14:45	20/04/28 05:14:45
139	20/04/28 05:14:47	20/04/28 05:14:47	20/04/28 05:14:47
45	20/04/28 05:14:49	20/04/28 05:14:49	20/04/28 05:14:49
82	20/04/28 05:14:51	20/04/28 05:14:51	20/04/28 05:14:51
95	20/04/28 05:14:53	20/04/28 05:14:53	20/04/28 05:14:53
109	20/04/28 05:14:55	20/04/28 05:14:55	20/04/28 05:14:55
76	20/04/28 05:14:57	20/04/28 05:14:57	20/04/28 05:14:57
76	20/04/28 05:14:59	20/04/28 05:15:00	20/04/28 05:15:00
