floorId	partitionId	location_x	location_y	timeStamp
19	919	342.6760469357528	267.8687601908977	21/02/24 15:41:33
19	919	342.51593575723604	267.99010566816736	21/02/24 15:41:33
19	919	342.3855652652584	268.08891119641	21/02/24 15:41:33
19	919	342.2494310637277	268.19208493987054	21/02/24 15:41:33
19	919	342.2494310637277	268.19208493987054	21/02/24 15:41:33
19	919	342.06449232962456	268.3322467896756	21/02/24 15:41:33
19	919	341.8448094240652	268.4987406426971	21/02/24 15:41:33
19	919	341.67704578791165	268.62588578450493	21/02/24 15:41:33
19	919	341.55581569845396	268.71776396066326	21/02/24 15:41:33
19	919	341.3594280157443	268.8666027694775	21/02/24 15:41:33
19	919	341.14016062901027	269.0327817080087	21/02/24 15:41:34
19	919	340.9242493311439	269.196417125162	21/02/24 15:41:34
19	919	340.7576101769907	269.3227100416208	21/02/24 15:41:34
19	919	340.7576101769907	269.3227100416208	21/02/24 15:41:34
19	919	340.5999017766636	269.44223449509366	21/02/24 15:41:34
19	919	340.47001384898	269.54067429625144	21/02/24 15:41:34
19	919	340.28933313793345	269.67760906444477	21/02/24 15:41:34
19	919	339.9611294565733	269.92634892586625	21/02/24 15:41:34
19	919	339.8094494431853	270.04130456973405	21/02/24 15:41:34
19	919	339.5919974821866	270.2061076286775	21/02/24 15:41:35
19	909	339.525064052368	270.3759397515258	21/02/24 15:41:35
19	909	339.6937017181597	270.5761319085501	21/02/24 15:41:35
19	909	339.8559759646071	270.76876996051385	21/02/24 15:41:35
19	909	339.8559759646071	270.76876996051385	21/02/24 15:41:35
19	909	339.9716182179563	270.90605051425285	21/02/24 15:41:35
19	909	340.1077867757046	271.0676981341162	21/02/24 15:41:35
19	909	340.25088999267984	271.23757798598035	21/02/24 15:41:35
19	909	340.39546524594414	271.4092053129328	21/02/24 15:41:35
19	909	340.5682095062942	271.6142724664107	21/02/24 15:41:35
19	909	340.738987422641	271.8170053451249	21/02/24 15:41:36
19	909	340.8763398846018	271.98005839441527	21/02/24 15:41:36
19	909	340.9949916690231	272.1209116050345	21/02/24 15:41:36
19	909	341.1552097331413	272.31110873388775	21/02/24 15:41:36
19	909	341.3210972550348	272.5080361562129	21/02/24 15:41:36
19	909	341.4669221286804	272.6811469251853	21/02/24 15:41:36
19	909	341.65107753088654	272.89976040647537	21/02/24 15:41:36
19	909	341.7923314880666	273.0674449758944	21/02/24 15:41:36
19	909	341.9404951248913	273.2433321236989	21/02/24 15:41:36
19	909	342.07950556243384	273.40835337924045	21/02/24 15:41:36
19	909	342.17804746899935	273.5253338695718	21/02/24 15:41:37
19	909	342.2820893411337	273.64884344678075	21/02/24 15:41:37
19	964	342.206216264645	273.7993387420267	21/02/24 15:41:37
19	964	342.002568324082	273.9776057618806	21/02/24 15:41:37
19	964	341.83693934527605	274.12259217505806	21/02/24 15:41:37
19	964	341.67263291891214	274.2664208673089	21/02/24 15:41:37
19	964	341.4670130791116	274.4464140259078	21/02/24 15:41:37
19	964	341.2510061900478	274.6354996816472	21/02/24 15:41:37
19	964	341.0858162546789	274.7801017699702	21/02/24 15:41:37
19	964	340.89513542617425	274.94701778663523	21/02/24 15:41:38
19	964	340.7338213573159	275.08822706297946	21/02/24 15:41:38
19	964	340.7338213573159	275.08822706297946	21/02/24 15:41:38
19	964	340.5175514080114	275.27754299340285	21/02/24 15:41:38
19	964	340.3614777795425	275.414164952594	21/02/24 15:41:38
19	964	340.1928638365834	275.56176430976916	21/02/24 15:41:38
19	964	340.1928638365834	275.56176430976916	21/02/24 15:41:38
19	964	340.0559673931785	275.681599162638	21/02/24 15:41:38
19	964	339.8932996881004	275.8239933696729	21/02/24 15:41:38
19	964	339.6864984330488	276.0050207021281	21/02/24 15:41:38
19	964	339.4973639392492	276.1705831058924	21/02/24 15:41:39
19	964	339.3384541791404	276.3096877257672	21/02/24 15:41:39
19	964	339.1516924265205	276.4731731063226	21/02/24 15:41:39
19	964	338.9798640887921	276.6235862438609	21/02/24 15:41:39
19	964	338.86571403964535	276.72350961662534	21/02/24 15:41:39
19	964	338.68410479863144	276.88248465012674	21/02/24 15:41:39
19	964	338.5347950209068	277.01318574652106	21/02/24 15:41:39
19	964	338.41762694610355	277.11575100428627	21/02/24 15:41:39
19	964	338.2350328476916	277.27558815106437	21/02/24 15:41:39
19	964	338.1062780318081	277.38829607855905	21/02/24 15:41:39
19	964	337.9896593017057	277.49038045720306	21/02/24 15:41:40
19	964	337.8657723512564	277.5988272079747	21/02/24 15:41:40
19	964	337.67112460279986	277.7692157419452	21/02/24 15:41:40
19	964	337.482145297515	277.934642298551	21/02/24 15:41:40
19	964	337.35082024309656	278.04960013224485	21/02/24 15:41:40
19	964	337.18731453468854	278.19272790111125	21/02/24 15:41:40
19	964	337.0660282617506	278.2988981003584	21/02/24 15:41:40
19	964	336.9051704232264	278.4397080069775	21/02/24 15:41:40
19	964	336.7459890158366	278.5790504183621	21/02/24 15:41:40
19	964	336.6025864554959	278.70458052193544	21/02/24 15:41:41
19	964	336.4392412715663	278.8475677727082	21/02/24 15:41:41
19	964	336.2178984011879	279.04132437913006	21/02/24 15:41:41
19	964	336.0055928395601	279.22717000892226	21/02/24 15:41:41
19	964	335.88878467067553	279.32942021633454	21/02/24 15:41:41
19	964	335.6851831102386	279.5076466364809	21/02/24 15:41:41
19	964	335.48111213123417	279.68628397091817	21/02/24 15:41:41
19	964	335.3371522328308	279.8123019507509	21/02/24 15:41:41
19	964	335.1985474234853	279.93363225358206	21/02/24 15:41:41
19	964	335.0448867132663	280.0681420198172	21/02/24 15:41:41
19	964	334.83750344963966	280.2496788243245	21/02/24 15:41:42
19	964	334.66508171343713	280.4006114042755	21/02/24 15:41:42
19	964	334.50674896637463	280.53921092502736	21/02/24 15:41:42
19	964	334.3894670214949	280.6418758610861	21/02/24 15:41:42
19	948	334.3270039977547	280.5083875677531	21/02/24 15:41:42
19	948	334.273352731216	280.3523195317549	21/02/24 15:41:42
19	948	334.1915838947604	280.1144593182914	21/02/24 15:41:42
19	948	334.1404888908016	279.9658272834554	21/02/24 15:41:42
19	948	334.1404888908016	279.9658272834554	21/02/24 15:41:42
19	948	334.06811241250927	279.7552888274544	21/02/24 15:41:42
19	948	333.9808464672005	279.5014378827792	21/02/24 15:41:43
19	948	333.9295248599557	279.35214667376005	21/02/24 15:41:43
19	948	333.8127383294815	279.2118687299985	21/02/24 15:41:43
19	948	333.6816237233991	279.2266612772641	21/02/24 15:41:43
19	948	333.43917474731586	279.08531398585706	21/02/24 15:41:43
19	948	333.4215797835721	279.20648546610596	21/02/24 15:41:43
19	948	333.4564272191275	278.9816415362304	21/02/24 15:41:43
19	948	333.32491421190247	278.91570321253874	21/02/24 15:41:43
19	948	333.4869528232509	278.8800518560341	21/02/24 15:41:43
19	948	333.48547435709133	278.8797153623306	21/02/24 15:41:44
19	948	333.53996834395684	278.83318573349135	21/02/24 15:41:44
19	948	333.6139691954926	278.8198506062647	21/02/24 15:41:44
19	948	333.6179628816585	278.7547037352663	21/02/24 15:41:44
19	948	333.7488276143652	278.63867311750994	21/02/24 15:41:44
19	948	333.6369835175818	278.5524381135131	21/02/24 15:41:44
19	948	333.68897594651304	278.64958637834474	21/02/24 15:41:44
19	948	333.67510864357934	278.6109564714049	21/02/24 15:41:44
19	948	333.6372608080651	278.8092629181232	21/02/24 15:41:44
19	948	333.8337987116421	278.6699806767079	21/02/24 15:41:44
19	948	333.76015763469684	278.5653327260951	21/02/24 15:41:45
19	948	333.6760538787745	278.7587777025971	21/02/24 15:41:45
19	948	333.7317369832799	278.5149001920474	21/02/24 15:41:45
19	948	333.7508009745196	278.579156107453	21/02/24 15:41:45
19	948	333.84249892368985	278.66903468198757	21/02/24 15:41:45
19	948	333.61014637844363	278.5904036577309	21/02/24 15:41:45
19	948	333.6139844566331	278.5477053134014	21/02/24 15:41:45
19	948	333.57022102862743	278.4902222965963	21/02/24 15:41:45
19	948	333.5637502981916	278.4767431313886	21/02/24 15:41:45
19	948	333.77166247614343	278.5347596519044	21/02/24 15:41:45
19	948	333.76919649389004	278.50502815858056	21/02/24 15:41:46
19	948	333.77133843479385	278.4862250184377	21/02/24 15:41:46
19	948	333.72133417370816	278.3647626190418	21/02/24 15:41:46
19	948	333.59224087623653	278.4413782122183	21/02/24 15:41:46
19	948	333.61818126994353	278.5930166609355	21/02/24 15:41:46
19	948	333.71533432902254	278.6112309527074	21/02/24 15:41:46
19	948	333.58629708433875	278.47127877008046	21/02/24 15:41:46
19	948	333.6845167946928	278.7270071023767	21/02/24 15:41:46
19	948	333.6588886839645	278.69657919644635	21/02/24 15:41:46
19	948	333.6087907673686	278.5386582308979	21/02/24 15:41:47
19	948	333.77455783921425	278.45938056205296	21/02/24 15:41:47
19	948	333.54571750625644	278.6163863041699	21/02/24 15:41:47
19	948	333.57965822954935	278.4984571065266	21/02/24 15:41:47
19	948	333.5790514701468	278.34655555367107	21/02/24 15:41:47
19	948	333.61111889022754	278.61301896985543	21/02/24 15:41:47
19	948	333.6252169121087	278.5541222348119	21/02/24 15:41:47
19	948	333.64322780986953	278.55406113377137	21/02/24 15:41:47
19	948	333.78112420434064	278.7690086119783	21/02/24 15:41:47
19	948	333.60047779629144	278.7741742087476	21/02/24 15:41:47
19	948	333.62523632216363	278.58023583924796	21/02/24 15:41:48
19	948	333.38643873009255	278.40845302576355	21/02/24 15:41:48
19	948	333.4185710486954	278.2277395228545	21/02/24 15:41:48
19	948	333.3231635559179	278.27036760168806	21/02/24 15:41:48
19	948	333.31970081360913	278.1437410885914	21/02/24 15:41:48
19	948	333.5595653803115	278.28585189313594	21/02/24 15:41:48
19	948	333.573214453068	278.53326765732817	21/02/24 15:41:48
19	948	333.48574937557936	278.54044144159735	21/02/24 15:41:48
19	948	333.20755415230633	278.47249675626176	21/02/24 15:41:48
19	948	333.2662166089435	278.5924445065452	21/02/24 15:41:48
19	948	333.2683918613638	278.55219091750814	21/02/24 15:41:49
19	948	333.38056061702326	278.54283026002844	21/02/24 15:41:49
19	948	333.57842520925226	278.3989428768126	21/02/24 15:41:49
19	948	333.3672355356036	278.52652593912217	21/02/24 15:41:49
19	948	333.43336821525565	278.55993703069345	21/02/24 15:41:49
19	948	333.5765065654651	278.3790828322524	21/02/24 15:41:49
19	948	333.71478944137476	278.5584551732616	21/02/24 15:41:49
19	948	333.5843541871412	278.73211036712536	21/02/24 15:41:49
19	948	333.62172015589687	278.89720535676133	21/02/24 15:41:49
19	948	333.706104143359	278.6339905659681	21/02/24 15:41:50
19	948	333.79262888870255	278.547983771113	21/02/24 15:41:50
19	948	333.8693066258851	278.39370762441575	21/02/24 15:41:50
19	948	333.79534582608795	278.60279529252097	21/02/24 15:41:50
19	948	333.7225400040835	278.5885089253407	21/02/24 15:41:50
19	948	333.5822825757101	278.6082641689426	21/02/24 15:41:50
19	948	333.4511827795471	278.6767213505561	21/02/24 15:41:50
19	948	333.63015963882015	278.50743528718056	21/02/24 15:41:50
19	948	333.5983312333979	278.65897599753	21/02/24 15:41:50
19	948	333.48293673994004	278.41281132570094	21/02/24 15:41:50
19	948	333.3166339234897	278.21711968319784	21/02/24 15:41:51
19	948	333.3102185301015	278.21037705237023	21/02/24 15:41:51
19	948	333.33103806153446	278.22951191183824	21/02/24 15:41:51
19	948	333.34482561291173	278.238701406947	21/02/24 15:41:51
19	948	333.490192218064	278.2254133050528	21/02/24 15:41:51
19	948	333.7520436346691	278.25851516663704	21/02/24 15:41:51
19	948	333.7840655576863	278.35725980889805	21/02/24 15:41:51
19	948	333.7844138652641	278.3557798597785	21/02/24 15:41:51
19	948	333.5348134404891	278.4836748926667	21/02/24 15:41:51
19	948	333.48900106726944	278.48587785546033	21/02/24 15:41:51
19	948	333.49716375437157	278.4866569098347	21/02/24 15:41:52
19	948	333.49412572351497	278.5714636954953	21/02/24 15:41:52
19	948	333.76468208411904	278.5061334750712	21/02/24 15:41:52
19	948	333.75627241485876	278.5449424738758	21/02/24 15:41:52
19	948	333.74894726261545	278.49513520374705	21/02/24 15:41:52
19	948	333.70664763714086	278.4331069964409	21/02/24 15:41:52
19	948	333.8306429747884	278.19393245556876	21/02/24 15:41:52
19	948	333.9636637524697	278.3167231190223	21/02/24 15:41:52
19	948	333.9529748723469	278.107382178276	21/02/24 15:41:52
19	948	334.07043058502364	278.1426969919397	21/02/24 15:41:52
19	948	334.1818386324569	278.00209843625606	21/02/24 15:41:53
19	948	334.21746075787263	278.11353392933194	21/02/24 15:41:53
19	948	334.4714155203712	278.18628177598436	21/02/24 15:41:53
19	948	334.64851950677644	278.1812569045801	21/02/24 15:41:53
19	948	334.75565858753254	278.3580994531372	21/02/24 15:41:53
19	948	334.7993434475812	278.1392956830277	21/02/24 15:41:53
19	948	334.92225710150626	278.14778781834997	21/02/24 15:41:53
19	948	334.9569155797757	278.1412877733955	21/02/24 15:41:53
19	948	334.7030245735637	277.99703547871457	21/02/24 15:41:53
19	948	334.6908271108044	277.97524319664626	21/02/24 15:41:54
19	948	334.76337966514745	278.0961295840395	21/02/24 15:41:54
19	948	334.58332813767856	278.1642863777778	21/02/24 15:41:54
19	948	334.57998168942663	278.0290924925834	21/02/24 15:41:54
19	948	334.57998168942663	278.0290924925834	21/02/24 15:41:54
19	948	334.57998168942663	278.0290924925834	21/02/24 15:41:54
19	948	334.57366155735275	278.23325122607486	21/02/24 15:41:54
19	948	334.56552091291275	278.4962178285517	21/02/24 15:41:54
19	948	334.5597703987387	278.6819762394476	21/02/24 15:41:54
19	948	334.5549235114878	278.8385448603162	21/02/24 15:41:54
19	948	334.54919985253264	279.02343576917116	21/02/24 15:41:55
19	948	334.54394607209997	279.19314822875856	21/02/24 15:41:55
19	948	334.53835086791116	279.3738896733145	21/02/24 15:41:55
19	948	334.53090111229886	279.61453854787044	21/02/24 15:41:55
19	948	334.525867707598	279.7771322273787	21/02/24 15:41:55
19	948	334.51883961652084	280.00416010534207	21/02/24 15:41:55
19	948	334.51405668174885	280.1586628742725	21/02/24 15:41:55
19	948	334.50663709090935	280.3983373385265	21/02/24 15:41:55
19	948	334.50104786804764	280.57888556874025	21/02/24 15:41:55
19	964	334.61771868339645	280.66091691165724	21/02/24 15:41:55
19	964	334.8933981176988	280.67919742321067	21/02/24 15:41:56
19	964	335.14348182752565	280.6957806629376	21/02/24 15:41:56
19	964	335.14348182752565	280.6957806629376	21/02/24 15:41:56
19	964	335.3004156190313	280.70618706120956	21/02/24 15:41:56
19	964	335.5533651709017	280.72296033708744	21/02/24 15:41:56
19	964	335.8436778616589	280.74221119093124	21/02/24 15:41:56
19	964	336.1359703471715	280.7615933264609	21/02/24 15:41:56
19	964	336.330474894111	280.7744910699089	21/02/24 15:41:56
19	964	336.57636114936423	280.79079597325205	21/02/24 15:41:56
19	964	336.7763673557296	280.80405853589286	21/02/24 15:41:57
19	964	337.0075361419283	280.8193875127445	21/02/24 15:41:57
19	964	337.1964707471448	280.831915909149	21/02/24 15:41:57
19	964	337.39196720571204	280.8448794270064	21/02/24 15:41:57
19	964	337.54218817757385	280.8548406931365	21/02/24 15:41:57
19	964	337.8207304226783	280.87331103983695	21/02/24 15:41:57
19	964	338.0261604928675	280.88693326298545	21/02/24 15:41:57
19	964	338.24146246137553	280.9012100991693	21/02/24 15:41:57
19	964	338.499196014736	280.9183006058001	21/02/24 15:41:57
19	964	338.6722041507391	280.92977290599924	21/02/24 15:41:57
19	964	338.8418459614904	280.94102198262783	21/02/24 15:41:58
19	964	339.09338639596064	280.9577018188663	21/02/24 15:41:58
19	964	339.2534496844109	280.96831573644494	21/02/24 15:41:58
19	964	339.48626126197973	280.9837536480334	21/02/24 15:41:58
19	964	339.7850528370077	281.0035667430987	21/02/24 15:41:58
19	964	339.7850528370077	281.0035667430987	21/02/24 15:41:58
19	964	340.1774141826093	281.029584520339	21/02/24 15:41:58
19	964	340.4144655264087	281.04530357402916	21/02/24 15:41:58
19	964	340.6396858935294	281.060238106718	21/02/24 15:41:58
19	964	340.8489922604697	281.0741173700324	21/02/24 15:41:58
19	964	341.11845809546634	281.09198585312174	21/02/24 15:41:59
19	964	341.36977491086645	281.1086508610108	21/02/24 15:41:59
19	964	341.36977491086645	281.1086508610108	21/02/24 15:41:59
19	964	341.655983149431	281.127629545529	21/02/24 15:41:59
19	964	341.8804674927995	281.14251527192675	21/02/24 15:41:59
19	964	342.2603639300522	281.1677064916776	21/02/24 15:41:59
19	964	342.2603639300522	281.1677064916776	21/02/24 15:41:59
19	964	342.63156225477223	281.19232093301537	21/02/24 15:41:59
19	964	342.9099502941776	281.2107810542194	21/02/24 15:41:59
19	964	342.9099502941776	281.2107810542194	21/02/24 15:41:59
19	964	342.9099502941776	281.2107810542194	21/02/24 15:42:00
19	964	343.40006702765646	281.2432810650801	21/02/24 15:42:00
19	964	343.40006702765646	281.2432810650801	21/02/24 15:42:00
19	964	343.78101387080903	281.26854193803973	21/02/24 15:42:00
19	964	344.0464568044736	281.2861436595026	21/02/24 15:42:00
19	964	344.28165971019007	281.3017401418671	21/02/24 15:42:00
19	964	344.45797329747427	281.31343162903784	21/02/24 15:42:00
19	964	344.45797329747427	281.31343162903784	21/02/24 15:42:00
19	964	344.6471553256245	281.325976432244	21/02/24 15:42:00
19	964	344.80765440606433	281.3366192475186	21/02/24 15:42:01
19	964	344.9765422774693	281.34781832985954	21/02/24 15:42:01
19	964	345.1295656737147	281.3579654268677	21/02/24 15:42:01
19	964	345.41512610131497	281.3769011545514	21/02/24 15:42:01
19	964	345.6532335443612	281.3926902389805	21/02/24 15:42:01
19	964	345.80766041444605	281.40293040139915	21/02/24 15:42:01
19	964	346.0093274670923	281.4163030960116	21/02/24 15:42:01
19	964	346.18670827830766	281.4280653516074	21/02/24 15:42:01
19	964	346.4238739282501	281.4437919850243	21/02/24 15:42:01
19	964	346.5772325567103	281.4539613115338	21/02/24 15:42:01
19	964	346.7846149232638	281.46771299292914	21/02/24 15:42:02
19	964	346.94394967439376	281.4782786006476	21/02/24 15:42:02
19	964	347.13098076966855	281.4906807738698	21/02/24 15:42:02
19	964	347.312305641954	281.5027045631348	21/02/24 15:42:02
19	964	347.7750383949077	281.5333887215594	21/02/24 15:42:02
19	964	347.9303122139993	281.54368504580657	21/02/24 15:42:02
19	964	347.9303122139993	281.54368504580657	21/02/24 15:42:02
19	964	348.18549067195033	281.5606061221305	21/02/24 15:42:02
19	964	348.63441806241065	281.59037483653873	21/02/24 15:42:02
19	964	348.63441806241065	281.59037483653873	21/02/24 15:42:03
19	964	348.86456626946057	281.605636138016	21/02/24 15:42:03
19	964	348.86456626946057	281.605636138016	21/02/24 15:42:03
19	964	349.10362208063003	281.6214881094518	21/02/24 15:42:03
19	964	349.10362208063003	281.6214881094518	21/02/24 15:42:03
19	964	349.2815231647519	281.6332848647371	21/02/24 15:42:03
19	964	349.4579602179994	281.6449845390291	21/02/24 15:42:03
19	964	349.4579602179994	281.6449845390291	21/02/24 15:42:03
19	964	349.72903781039213	281.662959898969	21/02/24 15:42:03
19	964	349.9915022759088	281.68036411595887	21/02/24 15:42:03
19	964	350.28294459913934	281.69968987658535	21/02/24 15:42:04
19	964	350.449890870621	281.71076020996856	21/02/24 15:42:04
19	964	350.8363817974147	281.7363887153028	21/02/24 15:42:04
19	964	351.00400621446323	281.74750401703085	21/02/24 15:42:04
19	964	351.30208507837693	281.7672698516837	21/02/24 15:42:04
19	964	351.5519091957786	281.7838358776408	21/02/24 15:42:04
19	964	351.5519091957786	281.7838358776408	21/02/24 15:42:04
19	964	351.748594874586	281.7968782535907	21/02/24 15:42:04
19	964	352.29865637872985	281.8333532474801	21/02/24 15:42:04
19	964	352.5945885968133	281.8529767364262	21/02/24 15:42:04
19	964	352.7897122286555	281.86591553186184	21/02/24 15:42:05
19	964	353.00584147416237	281.8802472254084	21/02/24 15:42:05
19	964	353.2197843536116	281.89443393937006	21/02/24 15:42:05
19	964	353.3915415957015	281.90582329184883	21/02/24 15:42:05
19	964	353.68008001490387	281.92495649240544	21/02/24 15:42:05
19	964	353.68008001490387	281.92495649240544	21/02/24 15:42:05
19	964	353.96101510637106	281.9435855105559	21/02/24 15:42:05
19	964	354.32427471316294	281.9676735295105	21/02/24 15:42:05
19	964	354.32427471316294	281.9676735295105	21/02/24 15:42:05
19	964	354.48806212043274	281.9785343962214	21/02/24 15:42:06
19	964	354.65867077757616	281.9898475851646	21/02/24 15:42:06
19	964	354.9247995415937	282.00749478455634	21/02/24 15:42:06
19	964	355.2693319550733	282.0303409891747	21/02/24 15:42:06
19	964	355.50094780692996	282.0456996112879	21/02/24 15:42:06
19	964	355.66247345721683	282.0564104991846	21/02/24 15:42:06
19	964	355.9275593013408	282.0739885417703	21/02/24 15:42:06
19	964	356.15444868313455	282.08903374808295	21/02/24 15:42:06
19	964	356.3610785022358	282.10273552748816	21/02/24 15:42:06
19	959	356.5536237684822	282.122375985085	21/02/24 15:42:06
19	959	356.84584612008365	282.18210498814193	21/02/24 15:42:07
19	959	357.0930748908341	282.23263749506003	21/02/24 15:42:07
19	959	357.2516351700447	282.26504654026064	21/02/24 15:42:07
19	959	357.49636043993127	282.31506734227344	21/02/24 15:42:07
19	959	357.73461718938654	282.3637660062824	21/02/24 15:42:07
19	959	357.930824997162	282.40387004584744	21/02/24 15:42:07
19	959	358.1960771852337	282.4580864624404	21/02/24 15:42:07
19	959	358.3533554896217	282.49023347745174	21/02/24 15:42:07
19	959	358.59405701800705	282.53943184385304	21/02/24 15:42:07
19	959	358.8008040735443	282.5816900607366	21/02/24 15:42:07
19	959	359.0400304960805	282.63058692179004	21/02/24 15:42:08
19	959	359.28555965136195	282.68077203455096	21/02/24 15:42:08
19	959	359.453663361908	282.7151317164372	21/02/24 15:42:08
19	959	359.7344097829578	282.77251508820603	21/02/24 15:42:08
19	959	359.96139848494346	282.81891061134274	21/02/24 15:42:08
19	959	360.17426803457863	282.8624202399225	21/02/24 15:42:08
19	959	360.4510156496951	282.91898627280364	21/02/24 15:42:08
19	959	360.60818076590056	282.9511101526329	21/02/24 15:42:08
19	959	360.8969292979284	283.0101291217763	21/02/24 15:42:08
19	959	361.17675418449835	283.0673241358255	21/02/24 15:42:09
19	990	361.3738124919372	283.15686050048004	21/02/24 15:42:09
19	990	361.5041400235331	283.28904770115366	21/02/24 15:42:09
19	990	361.7039255272544	283.49168398336275	21/02/24 15:42:09
19	990	361.857202891041	283.64714849187817	21/02/24 15:42:09
19	990	362.0617226363233	283.85458656946844	21/02/24 15:42:09
19	990	362.1838035054932	283.9784094344745	21/02/24 15:42:09
19	990	362.3404799645457	284.13732154061194	21/02/24 15:42:09
19	990	362.45354386381166	284.25199877080416	21/02/24 15:42:09
19	990	362.6504250227979	284.4516892656143	21/02/24 15:42:09
19	959	362.7751381687015	284.57818196782637	21/02/24 15:42:10
19	959	362.7861232663808	284.6338843843826	21/02/24 15:42:10
19	959	362.8263560439189	284.59336509217457	21/02/24 15:42:10
19	959	362.8632041642264	284.6623757501713	21/02/24 15:42:10
19	959	362.72463963480914	284.6629072448398	21/02/24 15:42:10
19	959	362.8480941333094	284.8103030131738	21/02/24 15:42:10
19	959	362.74882982369985	284.7972590440766	21/02/24 15:42:10
19	959	362.8396553371468	284.79213794797926	21/02/24 15:42:10
19	959	362.80005270237274	284.66231185164685	21/02/24 15:42:10
19	959	362.7669508097642	284.62820853005616	21/02/24 15:42:10
19	959	362.6932083358503	284.7105474704743	21/02/24 15:42:11
19	959	362.9133080351	284.69651516918873	21/02/24 15:42:11
19	959	362.9405310516172	284.680414541432	21/02/24 15:42:11
19	959	362.93821112485745	284.70694520684935	21/02/24 15:42:11
19	959	362.8200230548915	284.9143436226786	21/02/24 15:42:11
19	959	362.84258105089714	284.87170238386767	21/02/24 15:42:11
19	959	362.85749390240994	284.98475550051177	21/02/24 15:42:11
19	959	362.63474614891646	285.00730508217714	21/02/24 15:42:11
19	959	362.508255564008	284.7439074019843	21/02/24 15:42:11
19	959	362.33437237472333	284.74231279374754	21/02/24 15:42:12
19	959	362.1753250014406	284.79375031843244	21/02/24 15:42:12
19	959	362.19624957367097	284.76602140936745	21/02/24 15:42:12
19	959	362.22075459729984	284.8169209964769	21/02/24 15:42:12
19	959	362.3864877930393	284.887682234752	21/02/24 15:42:12
19	959	362.4060955452685	284.87471938172826	21/02/24 15:42:12
19	959	362.18964847086994	285.03620086587	21/02/24 15:42:12
19	959	362.459059742635	284.941209848695	21/02/24 15:42:12
19	959	362.31735626455156	285.1735089470242	21/02/24 15:42:12
19	959	362.108645701067	285.13537161120075	21/02/24 15:42:12
19	959	362.02640849266595	285.1633050833355	21/02/24 15:42:13
19	959	362.0923650220272	285.0804765320069	21/02/24 15:42:13
19	959	361.96007601808134	284.87272962212893	21/02/24 15:42:13
19	959	361.9464421701612	284.7851464976159	21/02/24 15:42:13
19	959	362.19466447535393	284.8801441375447	21/02/24 15:42:13
19	959	362.0669181857668	284.99528911536015	21/02/24 15:42:13
19	959	362.06823141010995	284.9925239303293	21/02/24 15:42:13
19	959	362.0916054140685	284.9583487767998	21/02/24 15:42:13
19	959	361.99767535019123	284.9399116781332	21/02/24 15:42:13
19	959	361.74249757349276	284.96691606104525	21/02/24 15:42:14
19	959	361.65668204245156	285.2180606810217	21/02/24 15:42:14
19	959	361.45769879856863	285.37246954241925	21/02/24 15:42:14
19	959	361.6199980694315	285.57804484970745	21/02/24 15:42:14
19	959	361.6204721429176	285.5773127887984	21/02/24 15:42:14
19	959	361.7251095504621	285.5271317830933	21/02/24 15:42:14
19	959	361.7907868725078	285.56356338491224	21/02/24 15:42:14
19	959	361.70265045684	285.5810403615618	21/02/24 15:42:14
19	959	361.8987398180041	285.43207268856617	21/02/24 15:42:14
19	959	361.9565988101664	285.41046644324535	21/02/24 15:42:14
19	959	361.8925489500995	285.4617200869558	21/02/24 15:42:15
19	959	361.82741941313003	285.6983658651359	21/02/24 15:42:15
19	959	361.93886378128576	285.91026507074355	21/02/24 15:42:15
19	959	362.168472035159	286.0692860711379	21/02/24 15:42:15
19	959	362.39060697420297	286.2036615096677	21/02/24 15:42:15
19	959	362.3520199897845	286.209000249042	21/02/24 15:42:15
19	959	362.2661178398763	286.16065646710956	21/02/24 15:42:15
19	959	362.42590342283074	286.09139318006163	21/02/24 15:42:15
19	959	362.4879065114305	286.1571654034457	21/02/24 15:42:15
19	959	362.3845830263007	286.37821640544735	21/02/24 15:42:15
19	959	362.2114362804874	286.27971741903156	21/02/24 15:42:16
19	959	362.3476867010391	286.2870422703149	21/02/24 15:42:16
19	959	362.3102296873691	286.38477767788225	21/02/24 15:42:16
19	959	362.3907705179914	286.47192858904083	21/02/24 15:42:16
19	959	362.37959116248527	286.51145249350185	21/02/24 15:42:16
19	959	362.34675220959707	286.22381075389694	21/02/24 15:42:16
19	959	362.3465394653021	286.2246723764227	21/02/24 15:42:16
19	959	362.3734826071884	286.1225761499425	21/02/24 15:42:16
19	959	362.26010125802134	286.0192094658735	21/02/24 15:42:16
19	959	362.22925142508313	286.0441430096378	21/02/24 15:42:17
19	959	362.4554412788237	286.08353600072576	21/02/24 15:42:17
19	959	362.3708443709476	285.94638702967023	21/02/24 15:42:17
19	959	362.2794791438057	285.7943773639059	21/02/24 15:42:17
19	959	362.5723309085371	285.76842749443244	21/02/24 15:42:17
19	959	362.74145276409007	285.7622961135633	21/02/24 15:42:17
19	959	362.7435836546028	285.70944321424616	21/02/24 15:42:17
19	959	362.8451349449496	285.7326830541625	21/02/24 15:42:17
19	959	362.99637064644384	285.9474468161494	21/02/24 15:42:17
19	959	362.9229423879348	285.95840787106584	21/02/24 15:42:17
19	959	362.7831303497399	286.04341746445635	21/02/24 15:42:18
19	959	362.82633277302153	285.9677614883539	21/02/24 15:42:18
19	959	362.69552065980224	286.18187137373457	21/02/24 15:42:18
19	959	362.6267800891314	286.24050854588097	21/02/24 15:42:18
19	959	362.82837599648036	286.252322318334	21/02/24 15:42:18
19	959	362.7481784870415	286.4791303976823	21/02/24 15:42:18
19	959	362.823760653086	286.5142788150311	21/02/24 15:42:18
19	959	362.8355520339514	286.4814330409805	21/02/24 15:42:18
19	959	362.7245283290498	286.4768791493843	21/02/24 15:42:18
19	959	362.7438940395038	286.35585476207604	21/02/24 15:42:18
19	959	362.47169317187445	286.4237398082957	21/02/24 15:42:19
19	959	362.52366161357565	286.46889638430673	21/02/24 15:42:19
19	959	362.3588170830005	286.6897102045369	21/02/24 15:42:19
19	959	362.4018437303482	286.64418592769664	21/02/24 15:42:19
19	959	362.36721044824134	286.50082540402894	21/02/24 15:42:19
19	959	362.22025741674025	286.38824086931567	21/02/24 15:42:19
19	959	362.2768414870778	286.2092547604312	21/02/24 15:42:19
19	959	362.2768414870778	286.2092547604312	21/02/24 15:42:19
19	959	362.01555397867	286.20700429661173	21/02/24 15:42:19
19	959	362.13916069606745	286.29704440946097	21/02/24 15:42:20
19	959	361.8761285958811	286.40817163265115	21/02/24 15:42:20
19	959	361.86160194573347	286.41699469407945	21/02/24 15:42:20
19	959	362.0801118364461	286.5991491657466	21/02/24 15:42:20
19	959	362.29767986418705	286.60567421110943	21/02/24 15:42:20
19	959	361.9408505660181	286.40032076413877	21/02/24 15:42:20
19	959	361.9408505660181	286.40032076413877	21/02/24 15:42:20
19	959	362.10575223922353	286.6157204793367	21/02/24 15:42:20
19	959	362.19278236616134	286.6244642423272	21/02/24 15:42:20
19	959	362.0628869007867	286.58318631924396	21/02/24 15:42:20
19	959	362.0055793535766	286.52664610076835	21/02/24 15:42:21
19	959	361.93768662040543	286.38465171161977	21/02/24 15:42:21
19	959	361.8887943485981	286.38867007324427	21/02/24 15:42:21
19	959	362.12165818170894	286.5550131106393	21/02/24 15:42:21
19	959	362.034896253566	286.52821984000735	21/02/24 15:42:21
19	959	362.0550938739995	286.4896850459629	21/02/24 15:42:21
19	959	361.8529396586673	286.4937645054755	21/02/24 15:42:21
19	959	361.940090943574	286.4126447079726	21/02/24 15:42:21
19	959	361.92552249775605	286.57595692689335	21/02/24 15:42:21
19	959	361.86525075768964	286.5738214548482	21/02/24 15:42:21
19	959	362.13758644702455	286.5389618468442	21/02/24 15:42:22
19	959	362.34149182339513	286.4986141375041	21/02/24 15:42:22
19	959	362.1516076167178	286.3655624905062	21/02/24 15:42:22
19	959	362.27779247668343	286.130299672382	21/02/24 15:42:22
19	959	362.3514457463859	286.0777231402714	21/02/24 15:42:22
19	959	362.3514457463859	286.0777231402714	21/02/24 15:42:22
19	959	362.3349307342402	286.1767059621073	21/02/24 15:42:22
19	959	362.3264040164042	286.2473904972478	21/02/24 15:42:22
19	959	362.3264040164042	286.2473904972478	21/02/24 15:42:22
19	959	362.0509514036915	286.2429798648251	21/02/24 15:42:23
19	959	362.2357815721835	286.4162464748696	21/02/24 15:42:23
19	959	362.3882399582809	286.470479151795	21/02/24 15:42:23
19	959	362.48605996372794	286.47540061923144	21/02/24 15:42:23
19	959	362.2853460300561	286.5065909428197	21/02/24 15:42:23
19	959	362.4484180807987	286.53025017476324	21/02/24 15:42:23
19	959	362.21670226773506	286.36566970362094	21/02/24 15:42:23
19	959	361.9905146547498	286.51557076998847	21/02/24 15:42:23
19	959	361.9526652209611	286.30198514408545	21/02/24 15:42:23
19	959	361.9343462655137	286.5078505779142	21/02/24 15:42:23
19	959	362.1116592342233	286.5634816174458	21/02/24 15:42:24
19	959	362.1098677570135	286.5654478560105	21/02/24 15:42:24
19	959	362.32032562917783	286.58867176473143	21/02/24 15:42:24
19	959	362.23653284784444	286.5772110292603	21/02/24 15:42:24
19	959	362.27380169836704	286.3385494250671	21/02/24 15:42:24
19	959	362.07034267781955	286.17424445261315	21/02/24 15:42:24
19	959	362.1822721574627	286.3570761355263	21/02/24 15:42:24
19	959	361.96722046910264	286.16594100281685	21/02/24 15:42:24
19	959	362.0571872814998	285.89717915212725	21/02/24 15:42:24
19	959	362.0893298769985	286.0717095366227	21/02/24 15:42:24
19	959	362.2552133698573	286.0516253007005	21/02/24 15:42:25
19	959	361.97125048200877	286.1052102863772	21/02/24 15:42:25
19	959	362.0253091358943	286.2330557069137	21/02/24 15:42:25
19	959	362.13624284878387	286.45470128025545	21/02/24 15:42:25
19	959	362.0198372575783	286.5532423349727	21/02/24 15:42:25
19	959	362.0582878779835	286.4875487944384	21/02/24 15:42:25
19	959	362.23527440158864	286.57449066767856	21/02/24 15:42:25
19	959	362.4159872126587	286.6330473047874	21/02/24 15:42:25
19	959	362.3027316478359	286.738080273623	21/02/24 15:42:25
19	959	362.4134471087684	286.68980212187967	21/02/24 15:42:26
19	959	362.4182912558312	286.8015061793201	21/02/24 15:42:26
19	959	362.4176489284608	286.8471649225361	21/02/24 15:42:26
19	959	362.4085045533584	287.1320439329373	21/02/24 15:42:26
19	959	362.66250009874057	287.0142185390793	21/02/24 15:42:26
19	959	362.6038938552216	287.28557078011823	21/02/24 15:42:26
19	959	362.54288808202153	287.3043733903455	21/02/24 15:42:26
19	959	362.52834340376467	287.1979095944789	21/02/24 15:42:26
19	959	362.5357835392338	287.42420787164656	21/02/24 15:42:26
19	959	362.524310832317	287.40284741523965	21/02/24 15:42:26
19	959	362.40936572295357	287.23401076586293	21/02/24 15:42:27
19	959	362.23921415374247	287.134538578148	21/02/24 15:42:27
19	959	362.2478615437587	286.85041572223156	21/02/24 15:42:27
19	959	362.2205221025223	286.8655507549969	21/02/24 15:42:27
19	959	362.215013112291	286.8632826427846	21/02/24 15:42:27
19	959	362.39482132642524	286.66180019777556	21/02/24 15:42:27
19	959	362.4667669538098	286.69217295656307	21/02/24 15:42:27
19	959	362.4098390024925	286.872574699308	21/02/24 15:42:27
19	959	362.65174648552266	286.820364082181	21/02/24 15:42:27
19	959	362.700230866948	286.7770734479659	21/02/24 15:42:27
19	959	362.8924544064571	286.5483363747498	21/02/24 15:42:28
19	959	362.6674875366483	286.58389938298615	21/02/24 15:42:28
19	959	362.82245378072105	286.4959265305497	21/02/24 15:42:28
19	959	362.73669594178233	286.44033670846244	21/02/24 15:42:28
19	959	362.8966544480931	286.30149463904763	21/02/24 15:42:28
19	959	363.0501102280838	286.377641691456	21/02/24 15:42:28
19	959	362.8637952299595	286.2992501948973	21/02/24 15:42:28
19	959	362.6533873978985	286.507647180575	21/02/24 15:42:28
19	959	362.46745939904196	286.53709116723826	21/02/24 15:42:28
19	959	362.4771773221289	286.43773055759664	21/02/24 15:42:29
19	959	362.43705515819795	286.5331514798358	21/02/24 15:42:29
19	959	362.45261657357645	286.82274817074574	21/02/24 15:42:29
19	959	362.2416275412718	286.62633412030925	21/02/24 15:42:29
19	959	362.29414827002677	286.4581583883744	21/02/24 15:42:29
19	959	362.1615011821872	286.34169033666683	21/02/24 15:42:29
19	959	362.12060544578395	286.3266685567465	21/02/24 15:42:29
19	959	361.8997317503592	286.3410938413433	21/02/24 15:42:29
19	959	361.93738336153774	286.2634221411675	21/02/24 15:42:29
19	959	361.8673235598037	286.0840437679206	21/02/24 15:42:29
19	959	361.61729669358203	285.94743404431904	21/02/24 15:42:30
19	959	361.5776106469276	286.0165380047641	21/02/24 15:42:30
19	959	361.49412614010635	286.000485168145	21/02/24 15:42:30
19	959	361.4662790918805	285.87184286294104	21/02/24 15:42:30
19	959	361.4662790918805	285.87184286294104	21/02/24 15:42:30
19	959	361.4662790918805	285.87184286294104	21/02/24 15:42:30
19	959	361.4916626056988	285.71564358110896	21/02/24 15:42:30
19	959	361.52754446767887	285.4948419571812	21/02/24 15:42:30
19	959	361.55211240414	285.34366138940055	21/02/24 15:42:30
19	959	361.5904760763562	285.10758776730506	21/02/24 15:42:30
19	959	361.6254407910889	284.8924298750683	21/02/24 15:42:31
19	959	361.65747484490356	284.6953060160222	21/02/24 15:42:31
19	959	361.68697272264114	284.51378869926486	21/02/24 15:42:31
19	959	361.73454977400485	284.2210198845182	21/02/24 15:42:31
19	959	361.7698051763823	284.0040732249079	21/02/24 15:42:31
19	959	361.80575662239437	283.7828434106238	21/02/24 15:42:31
19	959	361.8440126635657	283.54743210392036	21/02/24 15:42:31
19	959	361.869986296743	283.38760148007947	21/02/24 15:42:31
19	959	361.9128782226489	283.1236629225241	21/02/24 15:42:31
19	964	361.7703395115788	283.0422082754832	21/02/24 15:42:31
19	964	361.7703395115788	283.0422082754832	21/02/24 15:42:32
19	964	361.4918423305057	282.9419851455173	21/02/24 15:42:32
19	964	361.21145266074467	282.841080963273	21/02/24 15:42:32
19	964	361.05189640746795	282.783661254221	21/02/24 15:42:32
19	964	360.77437639495975	282.68378977913255	21/02/24 15:42:32
19	964	360.56319873996125	282.60779301147676	21/02/24 15:42:32
19	964	360.37560127449206	282.5402820762115	21/02/24 15:42:32
19	964	360.11118750654333	282.4451271617963	21/02/24 15:42:32
19	964	359.8574429253197	282.3538117809938	21/02/24 15:42:32
19	964	359.71183632327467	282.3014121504323	21/02/24 15:42:33
19	964	359.5439191457133	282.2409835850681	21/02/24 15:42:33
19	964	359.28161607304145	282.1465882492103	21/02/24 15:42:33
19	964	359.02100074702815	282.0528002848601	21/02/24 15:42:33
19	964	358.77136607092314	281.9629639407691	21/02/24 15:42:33
19	964	358.5384028524413	281.8791271750496	21/02/24 15:42:33
19	964	358.3404119567456	281.8078759430087	21/02/24 15:42:33
19	964	358.07688886266885	281.7130415565173	21/02/24 15:42:33
19	964	357.8006976543651	281.61364827986506	21/02/24 15:42:33
19	964	357.64352530448787	281.55708646912035	21/02/24 15:42:33
19	964	357.3949658838049	281.4676370785471	21/02/24 15:42:34
19	964	357.13690805367014	281.37476948344744	21/02/24 15:42:34
19	964	356.99376206956737	281.323255358552	21/02/24 15:42:34
19	964	356.8084012495698	281.2565493276988	21/02/24 15:42:34
19	964	356.55732187319063	281.16619307750756	21/02/24 15:42:34
19	911	356.33970521636064	281.1517911520159	21/02/24 15:42:34
19	911	356.13957753525426	281.157692160514	21/02/24 15:42:34
19	911	355.94742581679543	281.16335798803607	21/02/24 15:42:34
19	911	355.67976420901067	281.17125031664057	21/02/24 15:42:34
19	911	355.4628386289541	281.1776466316545	21/02/24 15:42:34
19	911	355.2598816465932	281.18363106554705	21/02/24 15:42:35
19	911	354.98527890781276	281.1917280618555	21/02/24 15:42:35
19	911	354.8200235571056	281.1966008172059	21/02/24 15:42:35
19	911	354.53016275875143	281.2051477159901	21/02/24 15:42:35
19	911	354.33838657149886	281.2108024705171	21/02/24 15:42:35
19	911	354.06013102002356	281.21900717445817	21/02/24 15:42:35
19	911	353.81971861254664	281.2260960271932	21/02/24 15:42:35
19	911	353.56730225155246	281.23353883112236	21/02/24 15:42:35
19	911	353.3338405847259	281.24042273280105	21/02/24 15:42:35
19	911	353.1679754747676	281.2453134676459	21/02/24 15:42:36
19	911	352.95049596991976	281.2517261158071	21/02/24 15:42:36
19	911	352.68451790809013	281.259568803008	21/02/24 15:42:36
19	911	352.4783504536444	281.26564790158136	21/02/24 15:42:36
19	911	352.2039711694045	281.27373830906043	21/02/24 15:42:36
19	911	351.94932296290324	281.2812469216735	21/02/24 15:42:36
19	911	351.94932296290324	281.2812469216735	21/02/24 15:42:36
19	911	351.94932296290324	281.2812469216735	21/02/24 15:42:36
19	911	351.94932296290324	281.2812469216735	21/02/24 15:42:36
19	911	351.65937807552825	281.289796299925	21/02/24 15:42:36
19	911	351.4735388323686	281.2952759964222	21/02/24 15:42:37
19	911	351.3217337980682	281.2997521528065	21/02/24 15:42:37
19	911	351.1716817804451	281.3041766193583	21/02/24 15:42:37
19	911	350.885070519056	281.31262770158617	21/02/24 15:42:37
19	911	350.6436901740859	281.3197450951374	21/02/24 15:42:37
19	911	350.3861059926263	281.3273402785491	21/02/24 15:42:37
19	911	350.1160648313803	281.3353027711865	21/02/24 15:42:37
19	911	349.9492315942218	281.3402220524413	21/02/24 15:42:37
19	911	349.7934174531244	281.34481642222386	21/02/24 15:42:37
19	911	349.6018672579818	281.35046451309813	21/02/24 15:42:37
19	911	349.36162115333696	281.3575484621915	21/02/24 15:42:38
19	911	349.15917758593497	281.3635177574185	21/02/24 15:42:38
19	911	348.90994976967943	281.3708665432214	21/02/24 15:42:38
19	911	348.72096995451744	281.3764388433103	21/02/24 15:42:38
19	911	348.4215189568091	281.3852685208065	21/02/24 15:42:38
19	911	347.90956693264917	281.400364049963	21/02/24 15:42:38
19	911	347.7033092354467	281.406445809454	21/02/24 15:42:38
19	911	347.47620367824595	281.41314229349655	21/02/24 15:42:38
19	911	347.47620367824595	281.41314229349655	21/02/24 15:42:38
19	911	347.1940560039893	281.4214617614197	21/02/24 15:42:38
19	911	346.9846119714983	281.4276374738887	21/02/24 15:42:39
19	911	346.6371839994689	281.4378818109243	21/02/24 15:42:39
19	911	346.42720658459683	281.4440732508226	21/02/24 15:42:39
19	911	346.2636501119755	281.4488959126829	21/02/24 15:42:39
19	911	346.2636501119755	281.4488959126829	21/02/24 15:42:39
19	911	345.92022948997186	281.4590220881207	21/02/24 15:42:39
19	911	345.92022948997186	281.4590220881207	21/02/24 15:42:39
19	911	345.6881102179429	281.4658664076533	21/02/24 15:42:39
19	911	345.2279721861662	281.4794341381181	21/02/24 15:42:39
19	911	344.98378680632	281.4866342415401	21/02/24 15:42:40
19	911	344.98378680632	281.4866342415401	21/02/24 15:42:40
19	911	344.71640854566635	281.4945182153092	21/02/24 15:42:40
19	911	344.17707183390525	281.5104212153431	21/02/24 15:42:40
19	911	344.0027809411788	281.51556039465817	21/02/24 15:42:40
19	911	343.73253251220086	281.5235289988371	21/02/24 15:42:40
19	911	343.4400237079011	281.5321539773028	21/02/24 15:42:40
19	911	343.4400237079011	281.5321539773028	21/02/24 15:42:40
19	911	343.2349586109512	281.5382005715224	21/02/24 15:42:40
19	911	342.7103563082519	281.5536691095538	21/02/24 15:42:40
19	911	342.516819061841	281.55937579105563	21/02/24 15:42:41
19	911	342.516819061841	281.55937579105563	21/02/24 15:42:41
19	911	342.0317808896517	281.573677732497	21/02/24 15:42:41
19	911	341.77880673374773	281.5811369836887	21/02/24 15:42:41
19	911	341.77880673374773	281.5811369836887	21/02/24 15:42:41
19	911	341.44167400594364	281.5910777529054	21/02/24 15:42:41
19	911	341.44167400594364	281.5910777529054	21/02/24 15:42:41
19	911	341.02585171255197	281.60333877983294	21/02/24 15:42:41
19	911	340.83760876762364	281.6088893524053	21/02/24 15:42:41
19	911	340.6613509136335	281.61408652996965	21/02/24 15:42:41
19	911	340.46303045185493	281.61993425040407	21/02/24 15:42:42
19	911	340.46303045185493	281.61993425040407	21/02/24 15:42:42
19	911	340.1797498019506	281.6282871254945	21/02/24 15:42:42
19	911	339.92452578373303	281.6358127166176	21/02/24 15:42:42
19	911	339.92452578373303	281.6358127166176	21/02/24 15:42:42
19	911	339.6406856086125	281.6441820899907	21/02/24 15:42:42
19	911	339.2415971080957	281.65594970064814	21/02/24 15:42:42
19	911	339.2415971080957	281.65594970064814	21/02/24 15:42:42
19	911	338.969495961102	281.663972934475	21/02/24 15:42:42
19	911	338.5109732899696	281.67749303406316	21/02/24 15:42:43
19	911	338.269091992418	281.6846251988116	21/02/24 15:42:43
19	911	338.269091992418	281.6846251988116	21/02/24 15:42:43
19	911	337.97087788353235	281.6934184051339	21/02/24 15:42:43
19	911	337.68760467223524	281.70177106088795	21/02/24 15:42:43
19	911	337.2359684618204	281.7150881047919	21/02/24 15:42:43
19	911	337.0229196633329	281.72137010817806	21/02/24 15:42:43
19	911	336.8523873892227	281.72639846004404	21/02/24 15:42:43
19	911	336.6737710700764	281.73166517982685	21/02/24 15:42:43
19	911	336.44568841927025	281.73839047466475	21/02/24 15:42:43
19	911	336.254254988166	281.7440351226091	21/02/24 15:42:44
19	911	335.97538678635885	281.7522578912916	21/02/24 15:42:44
19	911	335.76857166173613	281.7583560872092	21/02/24 15:42:44
19	911	335.57832670888683	281.76396569142423	21/02/24 15:42:44
19	911	335.57832670888683	281.76396569142423	21/02/24 15:42:44
19	911	335.0747200478692	281.7788151473812	21/02/24 15:42:44
19	911	334.8714433436431	281.7848090086625	21/02/24 15:42:44
19	911	334.65021268498464	281.79133226416394	21/02/24 15:42:44
19	911	334.370132888244	281.7995907581992	21/02/24 15:42:44
19	911	334.18783868664855	281.8049659248269	21/02/24 15:42:44
19	911	333.89904233587924	281.81348143707726	21/02/24 15:42:45
19	911	333.6423496580546	281.82105033341816	21/02/24 15:42:45
19	911	333.48354231524513	281.8257329613999	21/02/24 15:42:45
19	911	333.29131699845885	281.8314009590584	21/02/24 15:42:45
19	911	333.10275788944926	281.8369608541139	21/02/24 15:42:45
19	911	332.9469549323294	281.8415548941233	21/02/24 15:42:45
19	911	332.71977999259764	281.8482534239943	21/02/24 15:42:45
19	911	332.71977999259764	281.8482534239943	21/02/24 15:42:45
19	911	332.24926338394306	281.86212717944284	21/02/24 15:42:45
19	911	332.24926338394306	281.86212717944284	21/02/24 15:42:46
19	911	331.9185667098479	281.8718781737747	21/02/24 15:42:46
19	911	331.75781176860283	281.87661822906915	21/02/24 15:42:46
19	911	331.55066925349496	281.8827260784941	21/02/24 15:42:46
19	911	331.3812043584757	281.88772295738715	21/02/24 15:42:46
19	911	331.0951890973037	281.89615646582246	21/02/24 15:42:46
19	911	330.9426884414758	281.90065313345497	21/02/24 15:42:46
19	911	330.71806693657874	281.90727637218896	21/02/24 15:42:46
19	911	330.51441930448823	281.9132811707303	21/02/24 15:42:46
19	911	330.34916348287487	281.9181539399659	21/02/24 15:42:46
19	911	330.0681665737295	281.92965978549313	21/02/24 15:42:47
19	911	329.9080682678091	281.9401612103294	21/02/24 15:42:47
19	911	329.73439988556623	281.95155274537456	21/02/24 15:42:47
19	911	329.57705355137745	281.9618736584676	21/02/24 15:42:47
19	911	329.40036837614105	281.9734630758369	21/02/24 15:42:47
19	911	329.22108789663434	281.98522272856604	21/02/24 15:42:47
19	911	329.0148267498875	281.9987521404905	21/02/24 15:42:47
19	911	328.8036654192759	282.0126029731336	21/02/24 15:42:47
19	911	328.5353461289571	282.03020300233567	21/02/24 15:42:47
19	911	328.33354668266367	282.04343975524864	21/02/24 15:42:47
19	911	328.16348601932117	282.0545946470099	21/02/24 15:42:48
19	911	327.96532661836903	282.06759263623115	21/02/24 15:42:48
19	911	327.7445761216057	282.0820724568389	21/02/24 15:42:48
19	911	327.7445761216057	282.0820724568389	21/02/24 15:42:48
19	911	327.5591622422339	282.0942344213683	21/02/24 15:42:48
19	911	327.314683887665	282.1102706376783	21/02/24 15:42:48
19	911	327.0860538711948	282.12526730437924	21/02/24 15:42:48
19	911	326.51094529551517	282.16299074839367	21/02/24 15:42:48
19	911	326.34206969909775	282.17406790734464	21/02/24 15:42:48
19	911	326.07733668484224	282.19143269977576	21/02/24 15:42:49
19	911	325.83550338522446	282.20729541739945	21/02/24 15:42:49
19	911	325.83550338522446	282.20729541739945	21/02/24 15:42:49
19	911	325.6270806264338	282.2209666172477	21/02/24 15:42:49
19	911	325.4216459682553	282.23444181680856	21/02/24 15:42:49
19	911	324.8694772854227	282.27066055058197	21/02/24 15:42:49
19	911	324.61819688246385	282.2871429377586	21/02/24 15:42:49
19	911	324.61819688246385	282.2871429377586	21/02/24 15:42:49
19	911	324.39712579161517	282.3016437872877	21/02/24 15:42:49
19	911	323.8065194575827	282.3403837851222	21/02/24 15:42:49
19	911	323.8065194575827	282.3403837851222	21/02/24 15:42:50
19	911	323.6241068891124	282.3523488828537	21/02/24 15:42:50
19	911	323.27751834093294	282.3750828747401	21/02/24 15:42:50
19	911	323.11197580758454	282.3859414060729	21/02/24 15:42:50
19	911	322.9292270237645	282.3979285573808	21/02/24 15:42:50
19	911	322.9292270237645	282.3979285573808	21/02/24 15:42:50
19	911	322.7438171220746	282.4100902609997	21/02/24 15:42:50
19	911	322.5901958128456	282.4201668362816	21/02/24 15:42:50
19	911	322.31506371858063	282.438213741846	21/02/24 15:42:50
19	911	321.93076964449654	282.46342097505703	21/02/24 15:42:50
19	911	321.93076964449654	282.46342097505703	21/02/24 15:42:51
19	911	321.7617127418678	282.47451002653577	21/02/24 15:42:51
19	911	321.26323989529226	282.50720665690386	21/02/24 15:42:51
19	911	321.0191538950393	282.5232171372803	21/02/24 15:42:51
19	911	320.72076497963883	282.54278954155427	21/02/24 15:42:51
19	911	320.43766543077356	282.56135906117845	21/02/24 15:42:51
19	911	320.2269354153717	282.57518160230256	21/02/24 15:42:51
19	911	320.06824865153106	282.58559043900704	21/02/24 15:42:51
19	911	320.06824865153106	282.58559043900704	21/02/24 15:42:51
19	911	319.8934554362129	282.5970557559072	21/02/24 15:42:52
19	911	319.6733320102628	282.6114944446805	21/02/24 15:42:52
19	911	319.5199888665792	282.62155277408186	21/02/24 15:42:52
19	911	319.2477640661205	282.6394089797684	21/02/24 15:42:52
19	911	318.88864019810626	282.6629652084567	21/02/24 15:42:52
19	911	318.6641897699873	282.67768772089556	21/02/24 15:42:52
19	911	318.4670066719016	282.6906216708935	21/02/24 15:42:52
19	911	318.24992968737445	282.7048605325953	21/02/24 15:42:52
19	911	318.08239421731423	282.71584978782903	21/02/24 15:42:52
19	911	317.8252454440536	282.73271710256176	21/02/24 15:42:52
19	911	317.609780746654	282.74685020854065	21/02/24 15:42:53
19	911	317.3852361118871	282.76157890033306	21/02/24 15:42:53
19	911	317.1186182774771	282.7790673249105	21/02/24 15:42:53
19	911	316.9080946936874	282.7928763254413	21/02/24 15:42:53
19	911	316.9080946936874	282.7928763254413	21/02/24 15:42:53
19	911	316.63277534729	282.81093551354786	21/02/24 15:42:53
19	911	316.43351243685106	282.82400588593316	21/02/24 15:42:53
19	911	316.0336983227346	282.8502311344999	21/02/24 15:42:53
19	911	316.0336983227346	282.8502311344999	21/02/24 15:42:53
19	911	315.5894384831837	282.8793717383682	21/02/24 15:42:53
19	911	315.2975992076216	282.8985145281621	21/02/24 15:42:54
19	911	315.0208853151702	282.9166651895699	21/02/24 15:42:54
19	911	314.7425328705155	282.93492332952167	21/02/24 15:42:54
19	911	314.55075933399377	282.947502446882	21/02/24 15:42:54
19	911	314.30477620058025	282.9636373670592	21/02/24 15:42:54
19	911	314.30477620058025	282.9636373670592	21/02/24 15:42:54
19	975	313.9738156266821	283.07096653551486	21/02/24 15:42:54
19	975	314.0503819644609	283.3131832034604	21/02/24 15:42:54
19	975	314.13841243352454	283.591666509739	21/02/24 15:42:54
19	975	314.2247619534289	283.8648321540248	21/02/24 15:42:54
19	975	314.29692314989325	284.0931132115967	21/02/24 15:42:55
19	975	314.3667439486176	284.31399044970067	21/02/24 15:42:55
19	975	314.4251261740838	284.49868190197463	21/02/24 15:42:55
19	975	314.47665797013434	284.6617021050392	21/02/24 15:42:55
19	975	314.56014714686097	284.9258190888588	21/02/24 15:42:55
19	975	314.63991939984436	285.1781776301277	21/02/24 15:42:55
19	975	314.6988272550191	285.36453190552066	21/02/24 15:42:55
19	975	314.6988272550191	285.36453190552066	21/02/24 15:42:55
19	975	314.84545958867847	285.8284014897585	21/02/24 15:42:55
19	975	314.9060901723853	286.0202055956764	21/02/24 15:42:56
19	975	314.9060901723853	286.0202055956764	21/02/24 15:42:56
19	975	314.9583310452095	286.18546895439425	21/02/24 15:42:56
19	975	314.9583310452095	286.18546895439425	21/02/24 15:42:56
19	975	315.00719167657945	286.34003896084204	21/02/24 15:42:56
19	975	315.0582379228176	286.50152313304653	21/02/24 15:42:56
19	975	315.11899578111786	286.6937298705754	21/02/24 15:42:56
19	975	315.1818531195777	286.8925782877696	21/02/24 15:42:56
19	975	315.2279906547949	287.03853381302696	21/02/24 15:42:56
19	975	315.28339701426495	287.21381114981966	21/02/24 15:42:56
19	975	315.3502674794353	287.42535504400877	21/02/24 15:42:57
19	975	315.4318601042749	287.6834723092578	21/02/24 15:42:57
19	975	315.4826118695168	287.8440248944521	21/02/24 15:42:57
19	975	315.5347400141631	288.0089316389656	21/02/24 15:42:57
19	975	315.6244971554742	288.2928772516643	21/02/24 15:42:57
19	975	315.6920988340613	288.506734330505	21/02/24 15:42:57
19	975	315.6920988340613	288.506734330505	21/02/24 15:42:57
19	975	315.75200936585526	288.69626056105164	21/02/24 15:42:57
19	975	315.8166370577767	288.90070946964966	21/02/24 15:42:57
19	975	315.892127096009	289.1395212772164	21/02/24 15:42:57
19	975	315.96855155506495	289.38128911356705	21/02/24 15:42:58
19	975	316.13153252519623	289.8968774082274	21/02/24 15:42:58
19	975	316.19092961239176	290.0847793631014	21/02/24 15:42:58
19	975	316.2748325652467	290.35020532261416	21/02/24 15:42:58
19	975	316.2748325652467	290.35020532261416	21/02/24 15:42:58
19	975	316.3478036249606	290.2437488701238	21/02/24 15:42:58
19	975	316.31705321754856	290.28240982141085	21/02/24 15:42:58
19	975	316.31092116926834	290.2421298118835	21/02/24 15:42:58
19	975	316.21439282286997	290.15264313522164	21/02/24 15:42:58
19	975	316.26435425071975	290.1597365199369	21/02/24 15:42:58
19	975	316.15484068045373	290.24189285859353	21/02/24 15:42:59
19	975	316.30391677217455	289.9908304783631	21/02/24 15:42:59
19	975	316.1922476586631	289.8748398852711	21/02/24 15:42:59
19	975	316.3134804168338	289.94429872167785	21/02/24 15:42:59
19	975	316.41558250402124	289.9262908624384	21/02/24 15:42:59
19	975	316.4179533321274	289.9392440504434	21/02/24 15:42:59
19	975	316.41840334253163	289.98262809282147	21/02/24 15:42:59
19	975	316.4435953393018	289.9863970717024	21/02/24 15:42:59
19	975	316.47939122715366	290.16539782161334	21/02/24 15:42:59
19	975	316.46238307849035	289.9162003549037	21/02/24 15:43:00
19	975	316.3335241200716	289.75583786107796	21/02/24 15:43:00
19	975	316.3335241200716	289.75583786107796	21/02/24 15:43:00
19	975	316.3335241200716	289.75583786107796	21/02/24 15:43:00
19	975	316.28035806266024	289.5979038764709	21/02/24 15:43:00
19	975	316.1848439742118	289.3141717114535	21/02/24 15:43:00
19	975	316.13524282497036	289.16682756892726	21/02/24 15:43:00
19	975	316.07544075884005	288.98918079480944	21/02/24 15:43:00
19	975	316.0175657737587	288.8172585675839	21/02/24 15:43:00
19	975	315.9268832464484	288.5478789376158	21/02/24 15:43:00
19	975	315.84723706952826	288.3112836606257	21/02/24 15:43:01
19	975	315.70088931267765	287.8765460572922	21/02/24 15:43:01
19	975	315.70088931267765	287.8765460572922	21/02/24 15:43:01
19	975	315.5549672715032	287.44307307609387	21/02/24 15:43:01
19	975	315.5059242004201	287.2973867489401	21/02/24 15:43:01
19	975	315.43815308630366	287.0960672865837	21/02/24 15:43:01
19	975	315.43815308630366	287.0960672865837	21/02/24 15:43:01
19	975	315.27404969058523	286.60858515164165	21/02/24 15:43:01
19	975	315.27404969058523	286.60858515164165	21/02/24 15:43:01
19	975	315.1896304529959	286.3578111198792	21/02/24 15:43:01
19	975	315.1091993749441	286.1188842319089	21/02/24 15:43:02
19	975	315.0458535867091	285.9307105505953	21/02/24 15:43:02
19	975	314.95292565559424	285.65466077077645	21/02/24 15:43:02
19	975	314.84196003462523	285.3250286045539	21/02/24 15:43:02
19	975	314.84196003462523	285.3250286045539	21/02/24 15:43:02
19	975	314.7161496752219	284.9512989670211	21/02/24 15:43:02
19	975	314.7161496752219	284.9512989670211	21/02/24 15:43:02
19	975	314.65009957801226	284.7550919217011	21/02/24 15:43:02
19	975	314.59415640973987	284.5889083093179	21/02/24 15:43:02
19	975	314.5028925974167	284.3178019261777	21/02/24 15:43:03
19	975	314.4496000424868	284.1594921706726	21/02/24 15:43:03
19	975	314.35607735304825	283.8816756141448	21/02/24 15:43:03
19	975	314.2838199929475	283.6670294027548	21/02/24 15:43:03
19	975	314.18327980167646	283.36836680120587	21/02/24 15:43:03
19	975	314.0979666308246	283.11493726988215	21/02/24 15:43:03
19	975	314.0979666308246	283.11493726988215	21/02/24 15:43:03
19	911	314.21477242874437	282.95926280015686	21/02/24 15:43:03
19	911	314.47224324239	282.91444733793315	21/02/24 15:43:03
19	911	314.6431319212709	282.884702393159	21/02/24 15:43:03
19	911	314.9099862643182	282.8382536304401	21/02/24 15:43:04
19	911	315.1151873546199	282.8025362550201	21/02/24 15:43:04
19	911	315.30808390887955	282.76896061155935	21/02/24 15:43:04
19	911	315.47971843298694	282.7390858446974	21/02/24 15:43:04
19	911	315.7104467793284	282.6989251859299	21/02/24 15:43:04
19	911	315.9429954966267	282.6584476727404	21/02/24 15:43:04
19	911	316.2292635014137	282.608619761092	21/02/24 15:43:04
19	911	316.3898968865889	282.58065985642065	21/02/24 15:43:04
19	911	316.6674044732185	282.53235678630057	21/02/24 15:43:04
19	911	316.84179345625427	282.502002577329	21/02/24 15:43:04
19	911	317.0482661237128	282.4660638707327	21/02/24 15:43:05
19	911	317.3117169440181	282.4202075264037	21/02/24 15:43:05
19	911	317.52929442428297	282.3823359121051	21/02/24 15:43:05
19	911	317.74567303244635	282.34467297391467	21/02/24 15:43:05
19	911	317.9289487037785	282.31277194478906	21/02/24 15:43:05
19	911	318.1862147525861	282.2679921240065	21/02/24 15:43:05
19	911	318.1862147525861	282.2679921240065	21/02/24 15:43:05
19	911	318.4325965897305	282.2251068130122	21/02/24 15:43:05
19	911	318.61955816121787	282.19256421478275	21/02/24 15:43:05
19	911	318.84001815512585	282.15419086912493	21/02/24 15:43:06
19	911	319.08262965487046	282.1119618244115	21/02/24 15:43:06
19	911	319.3740696506195	282.06123367416006	21/02/24 15:43:06
19	911	319.57799216928663	282.0257388473776	21/02/24 15:43:06
19	911	319.86311572932703	281.9761101381925	21/02/24 15:43:06
19	911	320.1119257777931	281.93280217186407	21/02/24 15:43:06
19	911	320.40050537371127	281.88257190383376	21/02/24 15:43:06
19	911	320.5744249759343	281.85229939545496	21/02/24 15:43:06
19	911	320.8609583767744	281.80242528887425	21/02/24 15:43:06
19	911	321.08618506365247	281.7632222509274	21/02/24 15:43:06
19	911	321.6367267271693	281.6673947713985	21/02/24 15:43:07
19	911	321.6367267271693	281.6673947713985	21/02/24 15:43:07
19	911	321.7978751707336	281.6393452154791	21/02/24 15:43:07
19	911	322.05499834710946	281.59459026312334	21/02/24 15:43:07
19	911	322.2045015682591	281.5685676787966	21/02/24 15:43:07
19	911	322.41822286404283	281.53136727335266	21/02/24 15:43:07
19	911	322.5691549436468	281.5050959814106	21/02/24 15:43:07
19	911	322.8334688859647	281.45908940175434	21/02/24 15:43:07
19	911	323.12015061039006	281.40918947791715	21/02/24 15:43:07
19	911	323.3283964405963	281.37294213397666	21/02/24 15:43:07
19	911	323.478726066686	281.34677570530954	21/02/24 15:43:08
19	911	323.7732469056016	281.2955113023909	21/02/24 15:43:08
19	911	324.03548122386144	281.2498667028445	21/02/24 15:43:08
19	911	324.2914484446202	281.20531295653825	21/02/24 15:43:08
19	911	324.44968148164924	281.17777085732666	21/02/24 15:43:08
19	911	324.657515402834	281.14159521041825	21/02/24 15:43:08
19	911	324.89924751218666	281.09951923271205	21/02/24 15:43:08
19	911	325.0813937648813	281.06781479059975	21/02/24 15:43:08
19	911	325.0813937648813	281.06781479059975	21/02/24 15:43:08
19	911	325.4343564228585	281.0063779836818	21/02/24 15:43:09
19	911	325.71968162348435	280.95671417686395	21/02/24 15:43:09
19	911	325.9432784054806	280.9177948407458	21/02/24 15:43:09
19	911	326.0957509134078	280.891255421297	21/02/24 15:43:09
19	911	326.29002304081433	280.85744034508065	21/02/24 15:43:09
19	911	326.5693182421207	280.8088261221084	21/02/24 15:43:09
19	911	326.5693182421207	280.8088261221084	21/02/24 15:43:09
19	911	326.8072478942882	280.7674120014645	21/02/24 15:43:09
19	911	327.0040757205502	280.73315207938816	21/02/24 15:43:09
19	911	327.2912981875026	280.6831580337127	21/02/24 15:43:09
19	909	327.54778976844625	280.6192352183515	21/02/24 15:43:10
19	909	327.5945335231305	280.44746660748996	21/02/24 15:43:10
19	909	327.63527184764206	280.2977660655152	21/02/24 15:43:10
19	909	327.6849765699939	280.1151168288566	21/02/24 15:43:10
19	909	327.735808269384	279.9283263056961	21/02/24 15:43:10
19	909	327.8059749251457	279.6704858932091	21/02/24 15:43:10
19	909	327.87863693808686	279.4034758271669	21/02/24 15:43:10
19	909	327.9365618721462	279.1906198953995	21/02/24 15:43:10
19	909	328.0109973830761	278.91709278150915	21/02/24 15:43:10
19	909	328.0891511956759	278.6299020773289	21/02/24 15:43:10
19	909	328.13017556768654	278.47915040067545	21/02/24 15:43:11
19	909	328.1761886450452	278.31006679939543	21/02/24 15:43:11
19	909	328.23572505301274	278.0912892073653	21/02/24 15:43:11
19	909	328.29422606248346	277.876316379473	21/02/24 15:43:11
19	909	328.3686901506545	277.6026842532005	21/02/24 15:43:11
19	909	328.4252231293627	277.39494331997514	21/02/24 15:43:11
19	909	328.4851471251084	277.1747414646463	21/02/24 15:43:11
19	909	328.5498301539719	276.9370516579706	21/02/24 15:43:11
19	909	328.6053182307571	276.73315041098806	21/02/24 15:43:11
19	909	328.64826259004127	276.5753433843937	21/02/24 15:43:11
19	909	328.6968931787447	276.396641251384	21/02/24 15:43:12
19	909	328.7431995437375	276.2264799102041	21/02/24 15:43:12
19	909	328.8731399900579	275.7489895992536	21/02/24 15:43:12
19	909	328.91810475231506	275.583758226575	21/02/24 15:43:12
19	909	328.976743001014	275.3682810876418	21/02/24 15:43:12
19	909	329.0325464853235	275.1632208171132	21/02/24 15:43:12
19	909	329.0911724921073	274.94778866337145	21/02/24 15:43:12
19	909	329.1557946411732	274.71032257082277	21/02/24 15:43:12
19	909	329.2274534450508	274.44699898286547	21/02/24 15:43:12
19	909	329.3028548541786	274.1699224965978	21/02/24 15:43:13
19	909	329.3580300985645	273.9671708103859	21/02/24 15:43:13
19	955	329.43479421634277	273.69676960798415	21/02/24 15:43:13
19	955	329.6535185229383	273.66585849615984	21/02/24 15:43:13
19	955	329.8272322810607	273.6413084793541	21/02/24 15:43:13
19	955	330.10676992617556	273.6018029504911	21/02/24 15:43:13
19	955	330.3714910248986	273.5643913632183	21/02/24 15:43:13
19	955	330.65680171784135	273.5240699610317	21/02/24 15:43:13
19	955	330.86933747408716	273.49403344323343	21/02/24 15:43:13
19	955	331.14040999666406	273.45572424391173	21/02/24 15:43:13
19	955	331.3255898361615	273.42955378844016	21/02/24 15:43:14
19	955	331.5096260020934	273.4035449621081	21/02/24 15:43:14
19	955	331.8004199389466	273.362448643003	21/02/24 15:43:14
19	955	331.9919195731527	273.33538504545686	21/02/24 15:43:14
19	955	332.1549415117221	273.31234604512184	21/02/24 15:43:14
19	955	332.36850568984323	273.282164186076	21/02/24 15:43:14
19	955	332.6599059449851	273.24098217931817	21/02/24 15:43:14
19	955	332.82373406156785	273.21782924624694	21/02/24 15:43:14
19	955	333.05892921837346	273.1845903991078	21/02/24 15:43:14
19	955	333.2201320482588	273.16180848346914	21/02/24 15:43:14
19	955	333.4514073669613	273.1291236056433	21/02/24 15:43:15
19	955	333.73580700495256	273.08893095787784	21/02/24 15:43:15
19	955	333.73580700495256	273.08893095787784	21/02/24 15:43:15
19	955	333.9624686214906	273.05689810938406	21/02/24 15:43:15
19	955	334.22657551269634	273.01957332470556	21/02/24 15:43:15
19	955	334.37650118342805	272.9983851483869	21/02/24 15:43:15
19	955	334.5282008483707	272.976946263154	21/02/24 15:43:15
19	955	334.78245751785636	272.9410135565203	21/02/24 15:43:15
19	955	335.0508589603081	272.90308184636626	21/02/24 15:43:15
19	955	335.3360288426934	272.8627803441668	21/02/24 15:43:16
19	955	335.53152535873795	272.83515188913697	21/02/24 15:43:16
19	955	335.79738340984164	272.797579622593	21/02/24 15:43:16
19	955	335.98258089075665	272.7714066739562	21/02/24 15:43:16
19	955	336.2027043948281	272.7402978211935	21/02/24 15:43:16
19	955	336.48443511443116	272.7004823570892	21/02/24 15:43:16
19	955	336.7615045119609	272.6613256521786	21/02/24 15:43:16
19	955	336.96566442592604	272.6324728464304	21/02/24 15:43:16
19	955	337.16999796051334	272.60359550382776	21/02/24 15:43:16
19	955	337.4599602064422	272.5626167230592	21/02/24 15:43:16
19	955	337.62952780883694	272.5386526598008	21/02/24 15:43:17
19	955	337.78681408544315	272.51642424924927	21/02/24 15:43:17
19	955	337.96772695034366	272.49085682199603	21/02/24 15:43:17
19	955	338.17784021720456	272.4611626613936	21/02/24 15:43:17
19	955	338.4681420160249	272.42013589346914	21/02/24 15:43:17
19	955	338.67634318154967	272.3907119597068	21/02/24 15:43:17
19	955	338.83480759620323	272.36831704933866	21/02/24 15:43:17
19	955	339.05907076154836	272.3366231608543	21/02/24 15:43:17
19	955	339.30396078068264	272.30201419176467	21/02/24 15:43:17
19	955	339.5116559522418	272.2726617673663	21/02/24 15:43:17
19	955	339.7309892845253	272.2416645852673	21/02/24 15:43:18
19	955	339.8833402554345	272.2201336545188	21/02/24 15:43:18
19	955	340.1569816094033	272.18146141628455	21/02/24 15:43:18
19	955	340.3975285206464	272.147466234916	21/02/24 15:43:18
19	955	340.54700070651757	272.12634214713626	21/02/24 15:43:18
19	909	340.78387931028107	272.0928653876316	21/02/24 15:43:18
19	909	341.0631057739508	272.1086397895831	21/02/24 15:43:18
19	909	341.0551462264372	272.10393182725346	21/02/24 15:43:18
19	909	341.0551462264372	272.10393182725346	21/02/24 15:43:18
19	909	341.24205618391943	272.2488289360917	21/02/24 15:43:19
19	909	341.2194061567521	272.2581530829058	21/02/24 15:43:19
19	909	341.2290774643526	272.3563495818679	21/02/24 15:43:19
19	909	341.3291875321601	272.4903734878264	21/02/24 15:43:19
19	909	341.1383574067607	272.42175878008413	21/02/24 15:43:19
19	909	341.1405828290499	272.4756250372617	21/02/24 15:43:19
19	909	341.14316417337335	272.47898837504323	21/02/24 15:43:19
19	909	341.11031202986334	272.4261680491725	21/02/24 15:43:19
19	909	340.9069369527026	272.5592059966955	21/02/24 15:43:19
19	909	341.04413716539534	272.6885105679275	21/02/24 15:43:20
19	909	341.04095843749496	272.83488236787304	21/02/24 15:43:20
19	909	341.14672588062615	272.8211363662132	21/02/24 15:43:20
19	909	341.2720665709616	273.02477328436083	21/02/24 15:43:20
19	909	341.4709301943986	272.98821888277223	21/02/24 15:43:20
19	909	341.651716401218	273.0537261550883	21/02/24 15:43:20
19	909	341.63851958556614	273.0616815617417	21/02/24 15:43:20
19	909	341.7576270794703	272.8189243045555	21/02/24 15:43:20
19	909	341.7007809789651	272.5893920442411	21/02/24 15:43:20
19	909	341.89085103934514	272.7706884592603	21/02/24 15:43:21
19	909	341.79909274337643	273.02587717420164	21/02/24 15:43:21
19	909	341.5977889753335	273.0868854962169	21/02/24 15:43:21
19	909	341.7152229857401	273.1189477945822	21/02/24 15:43:21
19	909	341.85076148961514	273.00912095360144	21/02/24 15:43:21
19	909	341.8620442482391	272.96669179527095	21/02/24 15:43:21
19	909	341.90937724141446	272.74439143359126	21/02/24 15:43:21
19	909	342.13091184146145	272.6590506288868	21/02/24 15:43:21
19	909	342.2480342953908	272.5814247027123	21/02/24 15:43:21
19	909	342.25648676555335	272.6789599620419	21/02/24 15:43:21
19	909	342.3161420500666	272.59580531136584	21/02/24 15:43:22
19	909	342.2264026607806	272.750918913028	21/02/24 15:43:22
19	909	342.16179473797825	272.7242976157853	21/02/24 15:43:22
19	909	342.25653261086535	272.8671953559703	21/02/24 15:43:22
19	909	342.41532112386227	272.9943380696308	21/02/24 15:43:22
19	909	342.38918203942245	272.7326219873387	21/02/24 15:43:22
19	909	342.51865711953553	272.6416813089845	21/02/24 15:43:22
19	909	342.6945495101872	272.6761784745716	21/02/24 15:43:22
19	909	342.686432197084	272.67322110356724	21/02/24 15:43:22
19	909	342.60066601664363	272.72198978840464	21/02/24 15:43:23
19	909	342.5677516276134	272.75807710141066	21/02/24 15:43:23
19	909	342.53703935804293	272.80747832201524	21/02/24 15:43:23
19	909	342.37922126224777	272.5993449002036	21/02/24 15:43:23
19	909	342.18005265733484	272.5874126636674	21/02/24 15:43:23
19	909	342.25160066570606	272.55174739530656	21/02/24 15:43:23
19	909	342.29593213775655	272.5316610061039	21/02/24 15:43:23
19	909	342.2832328507488	272.23271654846656	21/02/24 15:43:23
19	909	342.25217988241246	272.15569680393236	21/02/24 15:43:23
19	909	342.5431855632077	272.00907464731114	21/02/24 15:43:24
19	909	342.5517558099372	271.8722721084554	21/02/24 15:43:24
19	909	342.54583009828696	271.81292554945446	21/02/24 15:43:24
19	909	342.54583009828696	271.81292554945446	21/02/24 15:43:24
19	909	342.7144808239129	271.95362758521276	21/02/24 15:43:24
19	909	342.55132820836826	272.1017371518061	21/02/24 15:43:24
19	909	342.3549600659689	272.3229662838411	21/02/24 15:43:24
19	909	342.3549600659689	272.3229662838411	21/02/24 15:43:24
19	909	342.60944808775804	272.3337727294415	21/02/24 15:43:24
19	909	342.60944808775804	272.3337727294415	21/02/24 15:43:25
19	909	342.41430036489396	272.45405168722385	21/02/24 15:43:25
19	909	342.60039836078016	272.3502009564574	21/02/24 15:43:25
19	909	342.71224109298515	272.41987856618135	21/02/24 15:43:25
19	909	342.7859552606969	272.5267175643656	21/02/24 15:43:25
19	909	342.59343029305256	272.4393079030404	21/02/24 15:43:25
19	909	342.7062074916582	272.63443859842255	21/02/24 15:43:25
19	909	342.7016759985123	272.54188743325767	21/02/24 15:43:25
19	909	342.83582961624046	272.5045950729704	21/02/24 15:43:25
19	909	343.10951033150496	272.5698152564342	21/02/24 15:43:25
19	909	343.07047189454926	272.58177010241155	21/02/24 15:43:26
19	909	343.0842028164912	272.628371231542	21/02/24 15:43:26
19	909	343.37293229752703	272.6654189997239	21/02/24 15:43:26
19	909	343.3671187528866	272.4340231951086	21/02/24 15:43:26
19	909	343.347146694956	272.42405950892004	21/02/24 15:43:26
19	909	343.41547679256763	272.3150760503161	21/02/24 15:43:26
19	909	343.37768925181757	272.3896453946654	21/02/24 15:43:26
19	909	343.1501463069924	272.454192783718	21/02/24 15:43:26
19	909	343.1781410055353	272.3781442573781	21/02/24 15:43:26
19	909	343.1703067598171	272.4223871688846	21/02/24 15:43:27
19	909	343.01821856850194	272.1715549082567	21/02/24 15:43:27
19	909	342.8569135805621	272.01713026142266	21/02/24 15:43:27
19	909	343.01545947047885	272.1119870880139	21/02/24 15:43:27
19	909	343.19958042736437	272.23050821840496	21/02/24 15:43:27
19	909	343.2006564192157	272.23029020999627	21/02/24 15:43:27
19	909	343.29154624435176	272.3226257916495	21/02/24 15:43:27
19	909	343.0711231255563	272.52482829900316	21/02/24 15:43:27
19	909	343.1150475691456	272.54449890984444	21/02/24 15:43:27
19	909	343.1587885897746	272.4261407746116	21/02/24 15:43:27
19	909	343.2163169256168	272.48446386468186	21/02/24 15:43:28
19	909	343.3866369696499	272.41969652732195	21/02/24 15:43:28
19	909	343.3520432022967	272.3060621391195	21/02/24 15:43:28
19	909	343.3861869200491	272.435030808932	21/02/24 15:43:28
19	909	343.6117793189502	272.3141267371605	21/02/24 15:43:28
19	909	343.7162720228507	272.257087790812	21/02/24 15:43:28
19	909	343.75383517967674	272.07477708560486	21/02/24 15:43:28
19	909	343.7708848298927	272.02235424704304	21/02/24 15:43:28
19	909	343.88892794376267	272.2974646414573	21/02/24 15:43:28
19	909	343.84059932338613	272.5430758026245	21/02/24 15:43:29
19	909	343.680509730086	272.6019549513223	21/02/24 15:43:29
19	909	343.632340916181	272.37284965784613	21/02/24 15:43:29
19	909	343.5700993973747	272.5714615161095	21/02/24 15:43:29
19	909	343.5888939331493	272.55557854940923	21/02/24 15:43:29
19	909	343.77245953439717	272.50131338890037	21/02/24 15:43:29
19	909	343.77245953439717	272.50131338890037	21/02/24 15:43:29
19	909	343.98006037635497	272.5657161499468	21/02/24 15:43:29
19	909	343.9631473905951	272.6273968527847	21/02/24 15:43:29
19	909	343.8178541775136	272.41185930215994	21/02/24 15:43:29
19	909	343.8178541775136	272.41185930215994	21/02/24 15:43:30
19	909	344.07387195839607	272.2774121083045	21/02/24 15:43:30
19	909	344.12691303251495	272.18229870175867	21/02/24 15:43:30
19	909	344.31720001419944	271.956991976	21/02/24 15:43:30
19	909	344.3304574360249	271.90331432282596	21/02/24 15:43:30
19	909	344.3304574360249	271.90331432282596	21/02/24 15:43:30
19	909	344.2998613976068	271.7333584333469	21/02/24 15:43:30
19	909	344.32036551174343	271.75696647381346	21/02/24 15:43:30
19	909	344.13439973843265	271.80996615682614	21/02/24 15:43:30
19	909	344.13439973843265	271.80996615682614	21/02/24 15:43:31
19	909	344.0319513000606	271.654125276496	21/02/24 15:43:31
19	909	344.02859337485745	271.6609464731841	21/02/24 15:43:31
19	909	344.08281940295365	271.7052299840039	21/02/24 15:43:31
19	909	344.3155311783986	271.52414713526116	21/02/24 15:43:31
19	909	344.179021797026	271.35199007344335	21/02/24 15:43:31
19	909	344.09812289770446	271.11874046005846	21/02/24 15:43:31
19	909	344.21183534843135	271.138671641878	21/02/24 15:43:31
19	909	344.2571754647472	271.16758882816697	21/02/24 15:43:31
19	909	344.1608727748531	271.2042242955435	21/02/24 15:43:31
19	909	344.0830008752745	271.49360483631307	21/02/24 15:43:32
19	909	344.1127243579026	271.4634449029529	21/02/24 15:43:32
19	909	344.1127243579026	271.4634449029529	21/02/24 15:43:32
19	909	343.8573612208655	271.5042670134863	21/02/24 15:43:32
19	909	343.823761261866	271.5745369115589	21/02/24 15:43:32
19	909	343.823761261866	271.5745369115589	21/02/24 15:43:32
19	909	343.65463791914755	271.50187299137264	21/02/24 15:43:32
19	909	343.65463791914755	271.50187299137264	21/02/24 15:43:32
19	909	343.7729356059376	271.6740430705343	21/02/24 15:43:32
19	909	343.95828222526404	271.8033620550626	21/02/24 15:43:33
19	909	343.9430799346159	271.5156005018391	21/02/24 15:43:33
19	909	344.09056399467966	271.26105350519305	21/02/24 15:43:33
19	909	344.0690654079281	271.29449147578333	21/02/24 15:43:33
19	909	344.1300042207439	271.37327952316684	21/02/24 15:43:33
19	909	343.97970043811034	271.244649671557	21/02/24 15:43:33
19	909	343.97781262542	271.2445833219863	21/02/24 15:43:33
19	909	343.9347685395478	271.0456060101606	21/02/24 15:43:33
19	909	343.9304500335966	271.05430641707756	21/02/24 15:43:33
19	909	343.89470038813505	271.0454808582983	21/02/24 15:43:34
19	909	343.9145326524786	271.1191746778246	21/02/24 15:43:34
19	909	344.1153703731103	270.97172043341556	21/02/24 15:43:34
19	909	344.10714916685794	271.05659675921123	21/02/24 15:43:34
19	909	344.09330372325934	270.9869794070254	21/02/24 15:43:34
19	909	344.36166202379974	270.8999273712726	21/02/24 15:43:34
19	909	344.309140985615	270.8596243430722	21/02/24 15:43:34
19	909	344.29885400316334	270.8697890554753	21/02/24 15:43:34
19	909	344.2231051143334	270.88663425659973	21/02/24 15:43:34
19	909	344.05422416739304	271.04315488066015	21/02/24 15:43:34
19	909	344.05351291046344	271.0606056869681	21/02/24 15:43:35
19	909	344.071528827332	271.02515432398786	21/02/24 15:43:35
19	909	343.836447136559	270.87033637389663	21/02/24 15:43:35
19	909	343.82944223060133	270.9615862387789	21/02/24 15:43:35
19	909	343.82944223060133	270.9615862387789	21/02/24 15:43:35
19	909	343.78427893171204	270.75947233183155	21/02/24 15:43:35
19	909	343.85847116698744	270.7384305713157	21/02/24 15:43:35
19	909	343.5703173803625	270.7728420019535	21/02/24 15:43:35
19	909	343.5966436071951	270.7692792432576	21/02/24 15:43:35
19	909	343.6260606430225	270.750071987594	21/02/24 15:43:36
19	909	343.58924313959477	270.74298802519894	21/02/24 15:43:36
19	909	343.68483742231047	270.99063161300325	21/02/24 15:43:36
19	909	343.5808557953149	270.8085190345237	21/02/24 15:43:36
19	909	343.6267414851877	270.90104979794114	21/02/24 15:43:36
19	909	343.5299437532891	271.11486631510746	21/02/24 15:43:36
19	909	343.5171261155717	271.0879711445639	21/02/24 15:43:36
19	909	343.67313051380563	271.0020485021425	21/02/24 15:43:36
19	909	343.5440756090832	271.11314810599197	21/02/24 15:43:36
19	909	343.39132226446714	271.01753001291587	21/02/24 15:43:37
19	909	343.43846498836416	271.06209562769936	21/02/24 15:43:37
19	909	343.52208098099663	271.1918483398936	21/02/24 15:43:37
19	909	343.67391311642064	271.1710805760672	21/02/24 15:43:37
19	909	343.70595615950407	270.88203967366974	21/02/24 15:43:37
19	909	343.65017107416566	270.8230837424714	21/02/24 15:43:37
19	909	343.65017107416566	270.8230837424714	21/02/24 15:43:37
19	909	343.8037724532024	270.91745299025035	21/02/24 15:43:37
19	909	343.8400823917357	270.92485180942157	21/02/24 15:43:37
19	909	343.903618440241	270.9823081910291	21/02/24 15:43:37
19	909	343.9033885816954	270.98213815718424	21/02/24 15:43:38
19	909	343.88975775902327	270.91636104730463	21/02/24 15:43:38
19	909	343.79137905815037	271.06256044742554	21/02/24 15:43:38
19	909	344.0323397007004	271.0609003798849	21/02/24 15:43:38
19	909	344.0498937875615	271.10493280294884	21/02/24 15:43:38
19	909	344.1276097203679	271.04704989039925	21/02/24 15:43:38
19	909	344.05088230570357	271.11231261244154	21/02/24 15:43:38
19	909	344.05088230570357	271.11231261244154	21/02/24 15:43:38
19	909	343.69343166724536	271.0398963178497	21/02/24 15:43:38
19	909	343.7109509322747	271.0805776605464	21/02/24 15:43:39
19	909	343.69907726647943	271.06765522759434	21/02/24 15:43:39
19	909	343.67129699029147	271.3328474927821	21/02/24 15:43:39
19	909	343.6911329796204	271.3454166384835	21/02/24 15:43:39
19	909	343.73154307362034	271.5377121521276	21/02/24 15:43:39
19	909	343.74197023036896	271.5454054188986	21/02/24 15:43:39
19	909	343.74197023036896	271.5454054188986	21/02/24 15:43:39
19	909	343.74197023036896	271.5454054188986	21/02/24 15:43:39
19	909	343.5754175243433	271.78233214762326	21/02/24 15:43:39
19	909	343.44568807624125	271.9668765749792	21/02/24 15:43:40
19	909	343.3440822497642	272.11141422111547	21/02/24 15:43:40
19	909	343.17993958038136	272.34491259306634	21/02/24 15:43:40
19	909	343.08585176854945	272.47875561490685	21/02/24 15:43:40
19	909	342.93512622393587	272.69316768345067	21/02/24 15:43:40
19	909	342.81764547561625	272.8602879305585	21/02/24 15:43:40
19	909	342.81764547561625	272.8602879305585	21/02/24 15:43:40
19	909	342.69221363210494	273.0387188733525	21/02/24 15:43:40
19	909	342.5497650945623	273.24135662579096	21/02/24 15:43:40
19	909	342.44863920790243	273.38521154167574	21/02/24 15:43:40
19	909	342.3453460481091	273.5321494752191	21/02/24 15:43:41
19	964	342.23647568251414	273.702935423284	21/02/24 15:43:41
19	964	342.52156036577094	273.92915520051804	21/02/24 15:43:41
19	964	342.7359552505604	274.0992813627626	21/02/24 15:43:41
19	964	342.88790636181517	274.21985727777087	21/02/24 15:43:41
19	964	343.10930362821824	274.3955399546295	21/02/24 15:43:41
19	964	343.34129484197774	274.5796291175315	21/02/24 15:43:41
19	964	343.4864247476799	274.69479228435927	21/02/24 15:43:41
19	964	343.69953514449185	274.86389918250023	21/02/24 15:43:41
19	964	343.9287364142532	275.0457744751145	21/02/24 15:43:42
19	964	344.1233449085241	275.2001997838294	21/02/24 15:43:42
19	964	344.25643921497704	275.30581248814224	21/02/24 15:43:42
19	964	344.4349738154915	275.4474828756761	21/02/24 15:43:42
19	964	344.57704261463476	275.5602169998912	21/02/24 15:43:42
19	964	344.7421485788299	275.69123152516687	21/02/24 15:43:42
19	964	344.9732906001856	275.8746468387613	21/02/24 15:43:42
19	964	345.0952833877316	275.9714502899589	21/02/24 15:43:42
19	964	345.25772838937775	276.1003532940255	21/02/24 15:43:42
19	964	345.46855645560515	276.2676491221697	21/02/24 15:43:43
19	964	345.6492999198293	276.41107228242583	21/02/24 15:43:43
19	964	345.87702479446904	276.5917760291973	21/02/24 15:43:43
19	964	346.0732272355646	276.74746616312655	21/02/24 15:43:43
19	964	346.2097043966376	276.85576322287307	21/02/24 15:43:43
19	964	346.4211942366062	277.02358418027563	21/02/24 15:43:43
19	964	346.61949485855837	277.18093925811047	21/02/24 15:43:43
19	964	346.82870878105666	277.3469542344367	21/02/24 15:43:43
19	964	347.03246619705203	277.5086393756014	21/02/24 15:43:43
19	964	347.1681783997722	277.61632942726106	21/02/24 15:43:43
19	964	347.3825752795272	277.78645717254636	21/02/24 15:43:44
19	964	347.57865578093504	277.94205054516004	21/02/24 15:43:44
19	964	347.80758833037396	278.1237126034091	21/02/24 15:43:44
19	964	348.00669448030374	278.28170688205114	21/02/24 15:43:44
19	964	348.2285881228416	278.4577834422196	21/02/24 15:43:44
19	964	348.3599290063864	278.5620047742035	21/02/24 15:43:44
19	964	348.53540941038403	278.70125160236626	21/02/24 15:43:44
19	964	348.6956107598344	278.82837422842687	21/02/24 15:43:44
19	964	348.8578255867169	278.9570945847162	21/02/24 15:43:44
19	964	349.02126838210904	279.08678935590393	21/02/24 15:43:45
19	964	349.2365065792149	279.25758470150197	21/02/24 15:43:45
19	964	349.46358228893746	279.4377733243416	21/02/24 15:43:45
19	964	349.6886741655159	279.6163877402235	21/02/24 15:43:45
19	964	349.8390093205436	279.73568136516434	21/02/24 15:43:45
19	964	349.9980284090379	279.86186584608487	21/02/24 15:43:45
19	964	350.120592872563	279.95912293236086	21/02/24 15:43:45
19	964	350.34534601579605	280.13746855729585	21/02/24 15:43:45
19	964	350.5499786928417	280.2998482337037	21/02/24 15:43:45
19	954	350.6626464762293	280.32915477773355	21/02/24 15:43:45
19	954	350.6693249068988	280.1720274783541	21/02/24 15:43:46
19	954	350.68194907545274	279.87501136634125	21/02/24 15:43:46
19	954	350.6907282168937	279.66845943015085	21/02/24 15:43:46
19	954	350.70028350231945	279.44364670571747	21/02/24 15:43:46
19	954	350.7093252428164	279.2309164497202	21/02/24 15:43:46
19	954	350.7165885194501	279.0600291412224	21/02/24 15:43:46
19	954	350.7281640221532	278.78768559695106	21/02/24 15:43:46
19	954	350.740366445556	278.5005921269339	21/02/24 15:43:46
19	954	350.740366445556	278.5005921269339	21/02/24 15:43:46
19	954	350.7496458893905	278.28226928709114	21/02/24 15:43:47
19	954	350.7496458893905	278.28226928709114	21/02/24 15:43:47
19	954	350.7565898813395	278.1188939739583	21/02/24 15:43:47
19	954	350.7666231661686	277.8828350812148	21/02/24 15:43:47
19	954	350.7784212251572	277.60525532654634	21/02/24 15:43:47
19	954	350.7784212251572	277.60525532654634	21/02/24 15:43:47
19	954	350.79059810875185	277.3187627463616	21/02/24 15:43:47
19	954	350.79699392131175	277.1682847666359	21/02/24 15:43:47
19	954	350.6860626776148	276.9833647430512	21/02/24 15:43:47
19	954	350.6860626776148	276.9833647430512	21/02/24 15:43:48
19	954	350.71558336709677	277.20063044073834	21/02/24 15:43:48
19	954	350.7954391263588	277.2668844798727	21/02/24 15:43:48
19	954	350.7954391263588	277.2668844798727	21/02/24 15:43:48
19	954	350.7794808155505	277.26547993376676	21/02/24 15:43:48
19	954	350.7794808155505	277.26547993376676	21/02/24 15:43:48
19	954	350.740541340428	276.9775442417129	21/02/24 15:43:48
19	954	350.742918104394	276.8643044952636	21/02/24 15:43:48
19	954	350.92032226846226	276.6673468225016	21/02/24 15:43:48
19	954	350.90163189887454	276.5543201101102	21/02/24 15:43:49
19	954	350.9841492377026	276.5309094874416	21/02/24 15:43:49
19	954	350.9604042741757	276.524510126922	21/02/24 15:43:49
19	954	351.04417891565106	276.5352786502879	21/02/24 15:43:49
19	954	351.04417891565106	276.5352786502879	21/02/24 15:43:49
19	954	351.1899610283964	276.21879692663464	21/02/24 15:43:49
19	954	351.24244863836793	276.08467389450624	21/02/24 15:43:49
19	954	351.48845830113146	275.96778047066067	21/02/24 15:43:49
19	954	351.3575306242165	275.9800259782348	21/02/24 15:43:49
19	954	351.31140310674414	275.8715124249131	21/02/24 15:43:49
19	954	351.30781217614316	275.8697333116491	21/02/24 15:43:50
19	954	351.3564872166968	275.78368986714014	21/02/24 15:43:50
19	954	351.3947309050278	275.8454021295723	21/02/24 15:43:50
19	954	351.2887630449114	276.10118819980624	21/02/24 15:43:50
19	954	351.08753188432104	276.25815391438766	21/02/24 15:43:50
19	954	351.10585025923564	276.31766115638345	21/02/24 15:43:50
19	954	351.1084788553941	276.3451462113675	21/02/24 15:43:50
19	954	351.1893676829489	276.16038159486357	21/02/24 15:43:50
19	954	351.1930759255434	276.2896937713322	21/02/24 15:43:50
19	954	351.18579475085716	276.13068992622584	21/02/24 15:43:51
19	954	351.1259330312217	275.8579002656669	21/02/24 15:43:51
19	954	351.1259330312217	275.8579002656669	21/02/24 15:43:51
