floorId	partitionId	location_x	location_y	timeStamp
3	17	358.6699373519175	253.92746623111688	20/04/28 05:11:06
3	17	358.69109502972566	254.13161411043592	20/04/28 05:11:07
3	17	358.69109502972566	254.13161411043592	20/04/28 05:11:07
3	17	358.7339631483111	254.22690184659461	20/04/28 05:11:07
3	17	358.80709612641044	254.2299005778191	20/04/28 05:11:07
3	17	358.64995424393055	254.05181123897322	20/04/28 05:11:07
3	17	358.64995424393055	254.05181123897322	20/04/28 05:11:07
3	17	358.88503207132027	254.1114824422829	20/04/28 05:11:07
3	17	358.88503207132027	254.1114824422829	20/04/28 05:11:07
3	17	359.0985366495174	254.0761012349516	20/04/28 05:11:07
3	17	359.0624358983182	253.99744959762089	20/04/28 05:11:08
3	17	359.03263112595056	253.94796990547667	20/04/28 05:11:08
3	17	359.1835424770322	253.77798694172702	20/04/28 05:11:08
3	17	358.9214389332909	253.79031108297815	20/04/28 05:11:08
3	17	358.81229566461	254.03473345944275	20/04/28 05:11:08
3	17	358.8434010831229	254.22516019612945	20/04/28 05:11:08
3	17	359.03136180636994	254.386902961903	20/04/28 05:11:08
3	17	359.03031788261086	254.37194724520586	20/04/28 05:11:08
3	17	359.062377819539	254.1590196692707	20/04/28 05:11:08
3	17	359.15347849546845	254.2946822583868	20/04/28 05:11:08
3	17	358.9937083717923	254.11666957152167	20/04/28 05:11:09
3	17	358.9852530492247	254.32050135500754	20/04/28 05:11:09
3	17	358.96149660941427	254.23020003514065	20/04/28 05:11:09
3	17	358.7655606710891	254.05483689759197	20/04/28 05:11:09
3	17	358.9464212944088	253.85259953127024	20/04/28 05:11:09
3	17	358.68327230081627	253.80796925398045	20/04/28 05:11:09
3	17	358.8802646258192	253.93120040651564	20/04/28 05:11:09
3	17	359.1114390972434	253.94502751499772	20/04/28 05:11:09
3	17	358.96134002252103	253.7517781505845	20/04/28 05:11:09
3	17	358.96134002252103	253.7517781505845	20/04/28 05:11:10
3	17	359.0907200691744	253.7199090899356	20/04/28 05:11:10
3	17	359.34770071619704	253.58883969955542	20/04/28 05:11:10
3	17	359.22701306912813	253.45484381769066	20/04/28 05:11:10
3	17	359.24316023042564	253.4416791813633	20/04/28 05:11:10
3	17	359.24316023042564	253.4416791813633	20/04/28 05:11:10
3	17	359.24316023042564	253.4416791813633	20/04/28 05:11:10
3	17	359.0266263911961	253.52843347431573	20/04/28 05:11:10
3	17	358.9983716510881	253.51106209580368	20/04/28 05:11:10
3	17	358.76452445618145	253.50070633043214	20/04/28 05:11:10
3	17	358.7491282582556	253.20374130664283	20/04/28 05:11:11
3	17	358.63335897937054	253.14498070742468	20/04/28 05:11:11
3	17	358.82824486761024	253.23445763719144	20/04/28 05:11:11
3	17	358.899102192043	253.08218765143863	20/04/28 05:11:11
3	17	358.6877007215462	253.11444171485084	20/04/28 05:11:11
3	17	358.6756638407175	253.30170172214935	20/04/28 05:11:11
3	17	358.80272716399605	253.49162968807988	20/04/28 05:11:11
3	17	358.69402678687453	253.46781286210566	20/04/28 05:11:11
3	17	358.69235812839867	253.46075176442577	20/04/28 05:11:11
3	17	358.59631576408805	253.65292258879603	20/04/28 05:11:11
3	17	358.6453474139376	253.73895751046066	20/04/28 05:11:12
3	17	358.9348265252037	253.66025786952324	20/04/28 05:11:12
3	17	358.9238182103281	253.71246500130664	20/04/28 05:11:12
3	17	359.02222405735006	253.74977271882855	20/04/28 05:11:12
3	17	358.9489157253843	253.79659494703762	20/04/28 05:11:12
3	17	359.05457922290447	253.79100532019976	20/04/28 05:11:12
3	17	359.2468381356411	253.68485800787963	20/04/28 05:11:12
3	17	359.3631703367638	253.49083752873074	20/04/28 05:11:12
3	17	359.5716618723107	253.4653832506799	20/04/28 05:11:12
3	17	359.5060048797854	253.40219500106505	20/04/28 05:11:13
3	17	359.4900842818592	253.19943427989904	20/04/28 05:11:13
3	17	359.36638742814796	253.35500335648717	20/04/28 05:11:13
3	17	359.3869516049258	253.2316668468518	20/04/28 05:11:13
3	17	359.4731364707375	253.31010537186572	20/04/28 05:11:13
3	17	359.65770907690154	253.24835641232153	20/04/28 05:11:13
3	17	359.5552912557551	253.11797837054735	20/04/28 05:11:13
3	17	359.52614467432244	253.13252343084906	20/04/28 05:11:13
3	17	359.6320509895329	253.20249718497777	20/04/28 05:11:13
3	17	359.62427897890046	253.0548394441799	20/04/28 05:11:13
3	17	359.71471097715704	253.185658492868	20/04/28 05:11:14
3	17	359.7152519837177	253.16357469485783	20/04/28 05:11:14
3	17	359.6341251619183	253.31917846214648	20/04/28 05:11:14
3	17	359.5132155219991	253.32792874354394	20/04/28 05:11:14
3	17	359.7473514987115	253.4719408712999	20/04/28 05:11:14
3	17	359.7365258516826	253.46129452773468	20/04/28 05:11:14
3	17	359.7999702493167	253.5142857977343	20/04/28 05:11:14
3	17	359.89646433472456	253.62955140147886	20/04/28 05:11:14
3	17	359.9808539116474	253.50770211416076	20/04/28 05:11:14
3	17	359.6029734464499	253.5054529802881	20/04/28 05:11:15
3	17	359.49312395894617	253.53102228001512	20/04/28 05:11:15
3	17	359.37211875842144	253.59523161701404	20/04/28 05:11:15
3	17	359.37211875842144	253.59523161701404	20/04/28 05:11:15
3	17	359.6113548909814	253.6421112117871	20/04/28 05:11:15
3	17	359.7892508318395	253.76070979157686	20/04/28 05:11:15
3	17	359.91451165248327	253.64046871852952	20/04/28 05:11:15
3	17	359.9499579034242	253.92168422387388	20/04/28 05:11:15
3	17	359.92661544651975	253.7832162045079	20/04/28 05:11:15
3	17	359.72537082484155	253.9463555172084	20/04/28 05:11:15
3	17	359.93255390196396	253.73664937594137	20/04/28 05:11:16
3	17	360.0919973397282	253.7287229427777	20/04/28 05:11:16
3	17	360.3559899751857	253.7099163184013	20/04/28 05:11:16
3	17	360.3473979376486	253.76200478155724	20/04/28 05:11:16
3	17	360.5740881120205	253.7767948706364	20/04/28 05:11:16
3	17	360.6310304605749	253.7776703018521	20/04/28 05:11:16
3	17	360.4098895700246	253.75151204574465	20/04/28 05:11:16
3	17	360.6155127366371	253.79020705624086	20/04/28 05:11:16
3	17	360.73137625098644	253.78978597138104	20/04/28 05:11:16
3	17	360.8709895843119	253.61080540825512	20/04/28 05:11:17
3	17	360.9128665961184	253.7986539561392	20/04/28 05:11:17
3	17	360.91328710080967	253.8465974235148	20/04/28 05:11:17
3	17	360.6915825666193	253.68338478059826	20/04/28 05:11:17
3	17	360.4963514267118	253.6463264058984	20/04/28 05:11:17
3	17	360.3063113798043	253.79794131728067	20/04/28 05:11:17
3	17	360.3309244704631	253.65177712092336	20/04/28 05:11:17
3	17	360.08044892147745	253.63308010430566	20/04/28 05:11:17
3	17	360.33190724680594	253.64840146313793	20/04/28 05:11:17
3	17	360.19823084953623	253.42768422578828	20/04/28 05:11:17
3	17	359.9206754010112	253.50271392588942	20/04/28 05:11:18
3	17	360.10537376769565	253.56401054491627	20/04/28 05:11:18
3	17	360.31201756504265	253.61290121996268	20/04/28 05:11:18
3	17	360.15514999968485	253.74463281658905	20/04/28 05:11:18
3	17	360.1862059136465	253.61242154641425	20/04/28 05:11:18
3	17	360.1973638998814	253.64114431134013	20/04/28 05:11:18
3	17	360.14225771639144	253.6617516595989	20/04/28 05:11:18
3	17	360.2768045081681	253.76283119517697	20/04/28 05:11:18
3	17	360.25391002388085	253.74198893028753	20/04/28 05:11:18
3	17	360.24446940978106	253.7377739982793	20/04/28 05:11:19
3	17	360.4038487446495	253.60797391012545	20/04/28 05:11:19
3	17	360.37459574419785	253.77130114198852	20/04/28 05:11:19
3	17	360.4642644477867	253.95955645448555	20/04/28 05:11:19
3	17	360.48172945153027	253.9443363856214	20/04/28 05:11:19
3	17	360.5268835975775	254.05103863934332	20/04/28 05:11:19
3	17	360.6059572226693	253.952405506959	20/04/28 05:11:19
3	17	360.60641160135816	253.95080877280415	20/04/28 05:11:19
3	17	360.5483940354114	254.0475243921347	20/04/28 05:11:19
3	17	360.82621693528165	253.963078717463	20/04/28 05:11:19
3	17	360.7444764321703	254.23117891757815	20/04/28 05:11:20
3	17	360.35595001056726	253.97253529449296	20/04/28 05:11:20
3	17	360.45491271967455	253.99789323291427	20/04/28 05:11:20
3	17	360.27299869547073	253.83909667486878	20/04/28 05:11:20
3	17	360.27299869547073	253.83909667486878	20/04/28 05:11:20
3	17	360.28653335313356	253.69462380639393	20/04/28 05:11:20
3	17	360.2143284555627	253.70677319723995	20/04/28 05:11:20
3	17	360.2126167673374	253.89554977528078	20/04/28 05:11:20
3	17	360.18845049434407	253.64761801729057	20/04/28 05:11:20
3	17	360.3137662088575	253.52630304944995	20/04/28 05:11:21
3	17	360.42633266668844	253.62583124196337	20/04/28 05:11:21
3	17	360.42633266668844	253.62583124196337	20/04/28 05:11:21
3	17	360.56256647459907	253.5467626088656	20/04/28 05:11:21
3	17	360.58396970201704	253.74132281896013	20/04/28 05:11:21
3	17	360.7819701634322	253.5369088200972	20/04/28 05:11:21
3	17	360.9784768105281	253.48477509536866	20/04/28 05:11:21
3	17	360.79289301990633	253.44255234601283	20/04/28 05:11:21
3	17	360.84574899206865	253.4932824425892	20/04/28 05:11:21
3	17	360.84574899206865	253.4932824425892	20/04/28 05:11:21
3	17	360.5635968859844	253.4233353542453	20/04/28 05:11:22
3	17	360.7756874221043	253.45638201900286	20/04/28 05:11:22
3	17	360.73807618319114	253.39339566430806	20/04/28 05:11:22
3	17	360.5207326642456	253.41132437050615	20/04/28 05:11:22
3	17	360.4240130085349	253.3906224100632	20/04/28 05:11:22
3	17	360.3996155404464	253.45884139237054	20/04/28 05:11:22
3	17	360.1723814705166	253.5199476599274	20/04/28 05:11:22
3	17	360.22221581156384	253.71382831896696	20/04/28 05:11:22
3	17	360.1068264173607	253.71272227034268	20/04/28 05:11:22
3	17	360.07561063942535	253.68433010645492	20/04/28 05:11:23
3	17	360.1064346703834	253.78707400764745	20/04/28 05:11:23
3	17	360.134385948809	253.69686133355825	20/04/28 05:11:23
3	17	360.0295947561482	253.6189774151185	20/04/28 05:11:23
3	17	359.95485820176776	253.67062917560847	20/04/28 05:11:23
3	17	359.74301213222	253.60466738525926	20/04/28 05:11:23
3	17	359.6056452142837	253.3906932537073	20/04/28 05:11:23
3	17	359.40253660421035	253.2923953236879	20/04/28 05:11:23
3	17	359.39327059074674	253.30819579243382	20/04/28 05:11:23
3	17	359.6868305565399	253.277000811942	20/04/28 05:11:23
3	17	359.43279206772195	253.36613651001383	20/04/28 05:11:24
3	17	359.23073312330285	253.14794343967193	20/04/28 05:11:24
3	17	359.4035868762399	253.04566324403766	20/04/28 05:11:24
3	17	359.468169657044	252.92485811285442	20/04/28 05:11:24
3	17	359.67989888871193	252.76886278215935	20/04/28 05:11:24
3	17	359.65666704206785	252.7716240101328	20/04/28 05:11:24
3	17	359.53310319916585	252.57809282570938	20/04/28 05:11:24
3	17	359.4012866951248	252.68304251921018	20/04/28 05:11:24
3	17	359.514244294795	252.6541303870282	20/04/28 05:11:24
3	17	359.63316634214016	252.82410560751953	20/04/28 05:11:24
3	17	359.63222120228096	252.83231663277007	20/04/28 05:11:25
3	17	359.6644427113284	252.76814717756048	20/04/28 05:11:25
3	17	359.65085163832794	252.86077387729185	20/04/28 05:11:25
3	17	359.49818140727774	252.89780483578193	20/04/28 05:11:25
3	17	359.5872872498423	252.83719134139955	20/04/28 05:11:25
3	17	359.7994517793377	252.69329642229204	20/04/28 05:11:25
3	17	359.7409241717458	252.93852838211697	20/04/28 05:11:25
3	17	359.64787254907293	252.939635155661	20/04/28 05:11:25
3	17	359.69053957127375	253.15198681972555	20/04/28 05:11:25
3	17	359.6383489094439	253.22463262813667	20/04/28 05:11:26
3	17	359.7841230397079	253.47371332102125	20/04/28 05:11:26
3	17	359.83238334444644	253.48735560357042	20/04/28 05:11:26
3	17	359.5804320295496	253.34471231255006	20/04/28 05:11:26
3	17	359.38154804559963	253.504411107988	20/04/28 05:11:26
3	17	359.5284299138337	253.620344930274	20/04/28 05:11:26
3	17	359.57303414779926	253.52907705731894	20/04/28 05:11:26
3	17	359.54912912671927	253.5429146734612	20/04/28 05:11:26
3	17	359.77532628359785	253.5231194413732	20/04/28 05:11:26
3	17	359.57996182060936	253.51176202999457	20/04/28 05:11:26
3	17	359.54615646422536	253.63777599222894	20/04/28 05:11:27
3	17	359.36810303446293	253.56993157661896	20/04/28 05:11:27
3	17	359.3716730651485	253.59158274861548	20/04/28 05:11:27
3	17	359.2121264445686	253.6629376778475	20/04/28 05:11:27
3	17	359.40726694210366	253.58393474484558	20/04/28 05:11:27
3	17	359.40726694210366	253.58393474484558	20/04/28 05:11:27
3	17	359.56590754702665	253.5459832006077	20/04/28 05:11:27
3	17	359.5962229261182	253.53701938785687	20/04/28 05:11:27
3	17	359.58645519436027	253.3441669646652	20/04/28 05:11:27
3	17	359.52538278940375	253.0745909192708	20/04/28 05:11:27
3	17	359.52538278940375	253.0745909192708	20/04/28 05:11:28
3	17	359.2355356038146	253.19439542058308	20/04/28 05:11:28
3	17	359.31875365751154	253.40026098975622	20/04/28 05:11:28
3	17	359.31875365751154	253.40026098975622	20/04/28 05:11:28
3	17	359.3056623416946	253.4507912651721	20/04/28 05:11:28
3	17	359.1825057713196	253.41694256758112	20/04/28 05:11:28
3	17	358.9777859266134	253.40164693422443	20/04/28 05:11:28
3	17	359.0339166895134	253.2260421915184	20/04/28 05:11:28
3	17	359.11478623861774	253.19541920493455	20/04/28 05:11:28
3	17	359.1757362864058	253.02635078540135	20/04/28 05:11:29
3	17	359.22333394684597	252.97764394907483	20/04/28 05:11:29
3	17	359.14581729525224	253.11804128015368	20/04/28 05:11:29
3	17	359.15404084121786	253.11396558632944	20/04/28 05:11:29
3	17	359.01313017024347	252.99410872482144	20/04/28 05:11:29
3	17	358.97401151758595	252.98968307316758	20/04/28 05:11:29
3	17	358.93683239263015	252.93163595065522	20/04/28 05:11:29
3	17	358.92864764406215	253.10726573509007	20/04/28 05:11:29
3	17	358.8610052862183	253.13134792972744	20/04/28 05:11:29
3	17	358.87450408227903	253.05319556606588	20/04/28 05:11:29
3	17	358.8446876450212	253.04680751134586	20/04/28 05:11:30
3	17	358.6253347799355	252.8541496088932	20/04/28 05:11:30
3	17	358.6451908371543	252.9045897359005	20/04/28 05:11:30
3	17	358.5818727575407	253.05565666196213	20/04/28 05:11:30
3	17	358.61895092755526	253.02738385645395	20/04/28 05:11:30
3	17	358.5417693531881	253.13023878782795	20/04/28 05:11:30
3	17	358.80211324267054	253.08494070937223	20/04/28 05:11:30
3	17	358.8978190998464	252.97708314622554	20/04/28 05:11:30
3	17	358.94563208279186	252.89727446765858	20/04/28 05:11:30
3	17	358.9024431856655	253.07844385935968	20/04/28 05:11:31
3	17	358.84386296937834	252.98641352678564	20/04/28 05:11:31
3	17	358.83480821278135	253.02027100336173	20/04/28 05:11:31
3	17	358.7629893414789	252.9222515817192	20/04/28 05:11:31
3	17	358.5948094013285	253.14477920975872	20/04/28 05:11:31
3	17	358.6226309693804	253.27821368009057	20/04/28 05:11:31
3	17	358.5687815015315	253.26945509811205	20/04/28 05:11:31
3	17	358.56226687175456	253.25496191303264	20/04/28 05:11:31
3	17	358.58616834824664	253.25398318027254	20/04/28 05:11:31
3	17	358.5121616847815	253.26281383919766	20/04/28 05:11:31
3	17	358.7750585895439	253.346090855944	20/04/28 05:11:32
3	17	358.76586561616693	253.3007141413475	20/04/28 05:11:32
3	17	358.7293534075671	253.34191058311282	20/04/28 05:11:32
3	17	358.64814940232645	253.39051728919435	20/04/28 05:11:32
3	17	358.6359471088249	253.39622419688536	20/04/28 05:11:32
3	17	358.656125436996	253.58035058517035	20/04/28 05:11:32
3	17	358.6568596158256	253.5799685638824	20/04/28 05:11:32
3	17	358.57547776851607	253.63488668483885	20/04/28 05:11:32
3	17	358.739040468021	253.47996025271766	20/04/28 05:11:32
3	17	358.734922095729	253.43850596008767	20/04/28 05:11:32
3	17	358.6612345872432	253.40415450944124	20/04/28 05:11:33
3	17	358.6759810677555	253.32598018421652	20/04/28 05:11:33
3	17	358.6610738452005	253.35164842241568	20/04/28 05:11:33
3	17	358.6584081067351	253.51132762541437	20/04/28 05:11:33
3	17	358.51557959938185	253.49857988669817	20/04/28 05:11:33
3	17	358.7712405518064	253.35948807427496	20/04/28 05:11:33
3	17	358.77795692800834	253.5439526734325	20/04/28 05:11:33
3	17	358.9025585224474	253.6013566633057	20/04/28 05:11:33
3	17	358.8366685126771	253.79010275279214	20/04/28 05:11:33
3	17	358.73012554392477	253.71535587017112	20/04/28 05:11:34
3	17	358.6423288600427	253.64186335497888	20/04/28 05:11:34
3	17	358.6914638874736	253.74471922647325	20/04/28 05:11:34
3	17	358.94614883914676	253.76191066096652	20/04/28 05:11:34
3	17	358.95086680042357	253.8146033577729	20/04/28 05:11:34
3	17	359.1558827950738	253.8542450504875	20/04/28 05:11:34
3	17	359.10334878635916	253.9321227817356	20/04/28 05:11:34
3	17	359.2262227681746	253.70058663347967	20/04/28 05:11:34
3	17	359.15343265209225	253.87705745759772	20/04/28 05:11:34
3	17	359.11779762136797	253.91925310200665	20/04/28 05:11:34
3	17	359.2887540070869	253.8375077598837	20/04/28 05:11:35
3	17	359.0753449491075	253.92023438414697	20/04/28 05:11:35
3	17	359.06904646606546	253.8612963614453	20/04/28 05:11:35
3	17	359.04077777031245	253.6156991158723	20/04/28 05:11:35
3	17	358.8253264786784	253.74390171899054	20/04/28 05:11:35
3	17	358.99572818090274	253.90554278882217	20/04/28 05:11:35
3	17	358.9097197866566	253.96715287389264	20/04/28 05:11:35
3	17	358.9256932145326	254.07081915160748	20/04/28 05:11:35
3	17	358.8464695649218	253.96117490206333	20/04/28 05:11:35
3	17	358.9759525504449	253.96255319222354	20/04/28 05:11:35
3	17	358.8025741911615	254.13327708122952	20/04/28 05:11:36
3	17	359.06782451310806	254.08354078849308	20/04/28 05:11:36
3	17	359.3093328197685	253.94942504943393	20/04/28 05:11:36
3	17	359.1983140721377	254.0354343409277	20/04/28 05:11:36
3	17	359.35209135663877	254.1320907084394	20/04/28 05:11:36
3	17	359.39404185405607	254.2157371409144	20/04/28 05:11:36
3	17	359.65666599613803	254.17737691870565	20/04/28 05:11:36
3	17	359.44999307659566	254.3033798513615	20/04/28 05:11:36
3	17	359.2111802414062	254.15428711951472	20/04/28 05:11:36
3	17	359.2961675883918	254.21724456335733	20/04/28 05:11:36
3	17	359.510700856051	254.22511634516235	20/04/28 05:11:37
3	17	359.5385754799358	254.07457632681778	20/04/28 05:11:37
3	17	359.8240321702134	254.07542761683072	20/04/28 05:11:37
3	17	359.9159755572778	254.16542410587994	20/04/28 05:11:37
3	17	359.84052565476856	254.1327020124894	20/04/28 05:11:37
3	17	359.89243701104726	254.19029694949515	20/04/28 05:11:37
3	17	359.85300464927036	254.17281243390474	20/04/28 05:11:37
3	17	359.8578074375391	254.1409274342693	20/04/28 05:11:37
3	17	359.88143714517525	254.10045974897176	20/04/28 05:11:37
3	17	360.08148515117034	254.19441776291802	20/04/28 05:11:38
3	17	360.1524210892236	254.28648222722566	20/04/28 05:11:38
3	17	360.11206189462837	254.27635402879858	20/04/28 05:11:38
3	17	360.109752918836	254.2772117096471	20/04/28 05:11:38
3	17	360.03872024274835	254.26914572922348	20/04/28 05:11:38
3	17	359.9495244219717	254.48273827706706	20/04/28 05:11:38
3	17	359.78714442662323	254.56798754449557	20/04/28 05:11:38
3	17	359.78700701682885	254.56430122080997	20/04/28 05:11:38
3	17	359.9167323474836	254.59319630812925	20/04/28 05:11:38
3	17	359.8773744978854	254.7145584452894	20/04/28 05:11:38
3	17	360.05152206403676	254.81169653175354	20/04/28 05:11:39
3	17	359.94237333865885	254.80864232264796	20/04/28 05:11:39
3	17	359.96003994098317	254.7917285528445	20/04/28 05:11:39
3	17	360.1802185805207	254.68498867274886	20/04/28 05:11:39
3	17	360.2831200436852	254.42133559575805	20/04/28 05:11:39
3	17	360.46051594445817	254.52178978885644	20/04/28 05:11:39
3	17	360.4421857873907	254.5248842647473	20/04/28 05:11:39
3	17	360.3657348383394	254.37778379078776	20/04/28 05:11:39
3	17	360.34689914909956	254.24989506624834	20/04/28 05:11:39
3	17	360.42660280639757	254.2650855262974	20/04/28 05:11:40
3	17	360.39895910300686	254.26433912394864	20/04/28 05:11:40
3	17	360.6624200303489	254.37669612129218	20/04/28 05:11:40
3	17	360.68730374031884	254.55317755066062	20/04/28 05:11:40
3	17	360.39908077567304	254.54838752731177	20/04/28 05:11:40
3	17	360.34262132939784	254.55370107030777	20/04/28 05:11:40
3	17	360.2559507989965	254.41734368957367	20/04/28 05:11:40
3	17	360.29024603874353	254.51055871918493	20/04/28 05:11:40
3	17	360.3956399768165	254.3304764841431	20/04/28 05:11:40
3	17	360.54534341093336	254.5783949312064	20/04/28 05:11:40
3	17	360.5472060286327	254.44804670771174	20/04/28 05:11:41
3	17	360.5511237377804	254.39417103930626	20/04/28 05:11:41
3	17	360.35173737662416	254.55252270735107	20/04/28 05:11:41
3	17	360.3472146625191	254.38853756047175	20/04/28 05:11:41
3	17	360.5933496607015	254.2716824241063	20/04/28 05:11:41
3	17	360.5933496607015	254.2716824241063	20/04/28 05:11:41
3	17	360.5933496607015	254.2716824241063	20/04/28 05:11:41
3	17	360.62184603330377	254.5135261578642	20/04/28 05:11:41
3	17	360.6466381381815	254.71172502093478	20/04/28 05:11:41
3	17	360.51048018217756	254.71572151891002	20/04/28 05:11:42
3	17	360.55177692692155	254.69724296229015	20/04/28 05:11:42
3	17	360.42111779045473	254.4298613996489	20/04/28 05:11:42
3	17	360.5767630049651	254.562744850117	20/04/28 05:11:42
3	17	360.68461533332453	254.4772252175067	20/04/28 05:11:42
3	17	360.5707304492878	254.49727878898705	20/04/28 05:11:42
3	17	360.8007613695311	254.43166682822374	20/04/28 05:11:42
3	17	360.83425170015937	254.3661012430881	20/04/28 05:11:42
3	17	361.02179275959014	254.43869978791952	20/04/28 05:11:42
3	17	361.02679974227755	254.425559400105	20/04/28 05:11:42
3	17	361.04292016366645	254.45897285893477	20/04/28 05:11:43
3	17	360.92678822266237	254.4922725382769	20/04/28 05:11:43
3	17	361.08065563060296	254.65784825375596	20/04/28 05:11:43
3	17	361.0684790677705	254.6344582859581	20/04/28 05:11:43
3	17	361.0879425553959	254.66011770501785	20/04/28 05:11:43
3	17	361.0991886877079	254.49126688300373	20/04/28 05:11:43
3	17	360.8442536702892	254.4841900259561	20/04/28 05:11:43
3	17	360.8300906200335	254.4718572105252	20/04/28 05:11:43
3	17	360.88906608811044	254.47352389936492	20/04/28 05:11:43
3	17	360.8954263237317	254.49281785198795	20/04/28 05:11:43
3	17	360.8619986534345	254.51522562867686	20/04/28 05:11:44
3	17	360.77511210119144	254.44637173057836	20/04/28 05:11:44
3	17	360.7598287976609	254.51403652808247	20/04/28 05:11:44
3	17	360.71845327114676	254.66540426259945	20/04/28 05:11:44
3	17	360.7291430427485	254.65677241310814	20/04/28 05:11:44
3	17	360.9459076563268	254.8033311530438	20/04/28 05:11:44
3	17	360.9916218363232	254.7293759284033	20/04/28 05:11:44
3	17	360.8469767281316	254.76936226105735	20/04/28 05:11:44
3	17	360.69835203691144	254.7129702801508	20/04/28 05:11:44
3	17	360.75960305750766	254.82594785071865	20/04/28 05:11:45
3	17	360.9140784965558	254.9142160265693	20/04/28 05:11:45
3	17	360.93680477919855	254.8073581552652	20/04/28 05:11:45
3	17	360.8469210827838	254.90477322332762	20/04/28 05:11:45
3	17	360.60989422279914	254.7319340863529	20/04/28 05:11:45
3	17	360.60989422279914	254.7319340863529	20/04/28 05:11:45
3	17	360.35087939655915	254.70002823680227	20/04/28 05:11:45
3	17	360.43111355944853	254.7574466788873	20/04/28 05:11:45
3	17	360.59653920112146	254.87423150467959	20/04/28 05:11:45
3	17	360.59653920112146	254.87423150467959	20/04/28 05:11:45
3	17	360.4057872028453	254.77237113764704	20/04/28 05:11:46
3	17	360.29543057901446	254.70348724649665	20/04/28 05:11:46
3	17	360.03550593802	254.64669658985048	20/04/28 05:11:46
3	17	359.9052630419594	254.87049117988175	20/04/28 05:11:46
3	17	360.083176602588	254.70813418950493	20/04/28 05:11:46
3	17	360.083176602588	254.70813418950493	20/04/28 05:11:46
3	17	360.0796389353312	254.69511951498043	20/04/28 05:11:46
3	17	360.21511420669384	254.54883875904918	20/04/28 05:11:46
3	17	360.12656261529133	254.41024461010272	20/04/28 05:11:46
3	17	360.07586392799567	254.32370342858587	20/04/28 05:11:47
3	17	359.9913673462438	254.11945378893427	20/04/28 05:11:47
3	17	359.995069264587	254.11693450317614	20/04/28 05:11:47
3	17	359.98549113155093	254.17954970012516	20/04/28 05:11:47
3	17	359.85960656666407	254.27857954970548	20/04/28 05:11:47
3	17	359.94911533899847	254.23021871978094	20/04/28 05:11:47
3	17	359.98019739223776	254.199882777563	20/04/28 05:11:47
3	17	360.0696682192281	254.3325898623753	20/04/28 05:11:47
3	17	360.0617800143142	254.05123172301293	20/04/28 05:11:47
3	17	360.087758998385	254.02571522271177	20/04/28 05:11:47
3	17	360.1356290961073	253.96725874635524	20/04/28 05:11:48
3	17	360.14967470450347	253.9322073451667	20/04/28 05:11:48
3	17	359.9026913404173	254.10031223552656	20/04/28 05:11:48
3	17	359.84663037777636	254.19237745724732	20/04/28 05:11:48
3	17	359.92502218433964	254.1622713020457	20/04/28 05:11:48
3	17	359.9213105282507	254.16373114054684	20/04/28 05:11:48
3	17	360.0499929923321	254.32449758946476	20/04/28 05:11:48
3	17	360.2594137402717	254.40593826635657	20/04/28 05:11:48
3	17	360.18496714559143	254.4017321694859	20/04/28 05:11:48
3	17	359.9289694154339	254.3123785023997	20/04/28 05:11:48
3	17	359.90725633530053	254.33476108915056	20/04/28 05:11:49
3	17	359.97390854231844	254.44212891596527	20/04/28 05:11:49
3	17	359.9981545250034	254.44191744958093	20/04/28 05:11:49
3	17	360.07216419952607	254.6603030680463	20/04/28 05:11:49
3	17	359.8359851546689	254.67636731614138	20/04/28 05:11:49
3	17	359.7654108210094	254.67115545228376	20/04/28 05:11:49
3	17	359.860467048093	254.90746695795931	20/04/28 05:11:49
3	17	359.7223388450073	254.68189056149342	20/04/28 05:11:49
3	17	359.8049053427139	254.64486992610844	20/04/28 05:11:49
3	17	359.6708630330598	254.6025730917845	20/04/28 05:11:50
3	17	359.48153287273595	254.55083688224212	20/04/28 05:11:50
3	17	359.40836930824014	254.57307509656468	20/04/28 05:11:50
3	17	359.4239510172187	254.83105237880392	20/04/28 05:11:50
3	17	359.6337411133586	254.63742587037189	20/04/28 05:11:50
3	17	359.61799178350856	254.51122041370198	20/04/28 05:11:50
3	17	359.63216220757846	254.4449358276028	20/04/28 05:11:50
3	17	359.57808638963485	254.35821333346664	20/04/28 05:11:50
3	17	359.35230607927986	254.1771499265982	20/04/28 05:11:50
3	17	359.2294726472801	254.4419411328261	20/04/28 05:11:50
3	17	359.15019321992605	254.33977834290238	20/04/28 05:11:51
3	17	359.02722876847486	254.092032563201	20/04/28 05:11:51
3	17	359.1548969446203	254.30032452431558	20/04/28 05:11:51
3	17	359.13414842685796	254.2755116458797	20/04/28 05:11:51
3	17	359.11295387603263	254.18067705948604	20/04/28 05:11:51
3	17	359.02701021636585	254.079171195583	20/04/28 05:11:51
3	17	359.08725869471044	254.13083205439997	20/04/28 05:11:51
3	17	359.0757134935683	254.02278698998683	20/04/28 05:11:51
3	17	359.0453186136628	254.15192497744923	20/04/28 05:11:51
3	17	358.8990972191096	253.89450111176347	20/04/28 05:11:52
3	17	358.8958836660486	253.88113264067366	20/04/28 05:11:52
3	17	359.06664244062586	254.08253868525347	20/04/28 05:11:52
3	17	359.24660337813054	254.0392840718934	20/04/28 05:11:52
3	17	359.24310826000243	254.0336972968976	20/04/28 05:11:52
3	17	359.2363106601916	254.00025557301413	20/04/28 05:11:52
3	17	359.1070283096267	253.9203732512324	20/04/28 05:11:52
3	17	359.0833362851616	253.9370120049268	20/04/28 05:11:52
3	17	359.3032411404172	253.8305705872505	20/04/28 05:11:52
3	17	359.5059772154795	253.93832588845405	20/04/28 05:11:52
3	17	359.4626627879574	253.9094874496729	20/04/28 05:11:53
3	17	359.53006231191563	253.72799279796754	20/04/28 05:11:53
3	17	359.445434663851	253.50637074014253	20/04/28 05:11:53
3	17	359.5743431434568	253.48442614522355	20/04/28 05:11:53
3	17	359.61606559195855	253.41439148282737	20/04/28 05:11:53
3	17	359.7602298541744	253.3753641795453	20/04/28 05:11:53
3	17	359.558517493638	253.1623071646815	20/04/28 05:11:53
3	17	359.6076758458319	253.23031546108317	20/04/28 05:11:53
3	17	359.56598287326017	253.2186787977374	20/04/28 05:11:53
3	17	359.58697431925975	253.2689649673607	20/04/28 05:11:53
3	17	359.57951519476086	253.29596726887848	20/04/28 05:11:54
3	17	359.61212406535543	253.34009573084174	20/04/28 05:11:54
3	17	359.4074423784307	253.30971493700628	20/04/28 05:11:54
3	17	359.23858420330413	253.31514916576717	20/04/28 05:11:54
3	17	359.0970687648452	253.3013039521999	20/04/28 05:11:54
3	17	359.0728263181755	253.57995762842577	20/04/28 05:11:54
3	17	359.070438441754	253.5971306630105	20/04/28 05:11:54
3	17	359.1675186533842	253.3486752162308	20/04/28 05:11:54
3	17	359.30591610385676	253.3474728427915	20/04/28 05:11:54
3	17	359.3755080511308	253.32442234331646	20/04/28 05:11:54
3	17	359.34199921553187	253.1544669484552	20/04/28 05:11:55
3	17	359.47204274247395	253.04195173092972	20/04/28 05:11:55
3	17	359.53271635253907	253.13711602215565	20/04/28 05:11:55
3	17	359.5761422695668	253.24159309627024	20/04/28 05:11:55
3	17	359.5832721564469	253.1770510186611	20/04/28 05:11:55
3	17	359.759847989342	253.12033458248015	20/04/28 05:11:55
3	17	359.7837694070794	253.12671971873982	20/04/28 05:11:55
3	17	359.74386404961155	253.23775650533224	20/04/28 05:11:55
3	17	359.7945930078847	253.20949750679148	20/04/28 05:11:55
3	17	359.77432524690175	253.18767356426622	20/04/28 05:11:56
3	17	359.84833275317163	253.39381513842045	20/04/28 05:11:56
3	17	359.70776297460577	253.28215479877247	20/04/28 05:11:56
3	17	359.6447534218189	253.21190749759958	20/04/28 05:11:56
3	17	359.6259500074825	253.21170111393366	20/04/28 05:11:56
3	17	359.73016477323597	253.21278082601128	20/04/28 05:11:56
3	17	359.6049497621711	253.17503149863578	20/04/28 05:11:56
3	17	359.6854963808648	252.9051653909601	20/04/28 05:11:56
3	17	359.5568465493717	252.77076429860745	20/04/28 05:11:56
3	17	359.45890785018764	252.71333825164942	20/04/28 05:11:56
3	17	359.44899751270395	252.7343931165172	20/04/28 05:11:57
3	17	359.46312962002	252.74541546640043	20/04/28 05:11:57
3	17	359.4259384477807	252.82796126222325	20/04/28 05:11:57
3	17	359.48308078323464	252.83900541177624	20/04/28 05:11:57
3	17	359.43363999927726	252.88616517751555	20/04/28 05:11:57
3	17	359.3998580382496	252.85082182395112	20/04/28 05:11:57
3	17	359.3631963732393	252.74459512090513	20/04/28 05:11:57
3	17	359.40945937900597	252.80781946311265	20/04/28 05:11:57
3	17	359.4519743964072	252.9963376778087	20/04/28 05:11:57
3	17	359.6039767690463	253.0045623242055	20/04/28 05:11:58
3	17	359.7288897069744	252.82089162880737	20/04/28 05:11:58
3	17	359.68051273808044	252.56843192019053	20/04/28 05:11:58
3	17	359.83781792256434	252.62522454710177	20/04/28 05:11:58
3	17	359.83481119286705	252.6548536112297	20/04/28 05:11:58
3	17	360.0250894589502	252.61616330561424	20/04/28 05:11:58
3	17	359.84764857606694	252.5652156405938	20/04/28 05:11:58
3	17	359.7722001815816	252.6728467033738	20/04/28 05:11:58
3	17	359.6956671055623	252.9037037015439	20/04/28 05:11:58
3	17	359.91952365463794	252.96389445747363	20/04/28 05:11:58
3	17	360.131996564799	253.1082751617545	20/04/28 05:11:59
3	17	360.1178157934583	253.1331302431182	20/04/28 05:11:59
3	17	360.2696932789778	253.00245951546324	20/04/28 05:11:59
3	17	360.2535097977842	252.9074493478449	20/04/28 05:11:59
3	17	360.4168492067606	252.8542429244328	20/04/28 05:11:59
3	17	360.2109431269902	252.641148798661	20/04/28 05:11:59
3	17	360.02380738168995	252.42525488582245	20/04/28 05:11:59
3	17	359.9885018050071	252.4020449267064	20/04/28 05:11:59
3	17	359.8877210747165	252.55501317745816	20/04/28 05:11:59
3	17	360.1245620975158	252.39392632486454	20/04/28 05:11:59
3	17	360.042783119848	252.24595487952902	20/04/28 05:12:00
3	17	360.04008110313544	252.14913473660306	20/04/28 05:12:00
3	17	360.27421109641426	252.0618636247728	20/04/28 05:12:00
3	17	360.4169966292517	252.1128268746787	20/04/28 05:12:00
3	17	360.4758413373343	251.8578084686116	20/04/28 05:12:00
3	17	360.41599594641804	251.86296018778924	20/04/28 05:12:00
3	17	360.4231651203809	251.86697994904506	20/04/28 05:12:00
3	17	360.4712525284621	251.86573720390754	20/04/28 05:12:00
3	17	360.6471456108183	252.07682376387194	20/04/28 05:12:00
3	17	360.6505236654793	252.08772186204504	20/04/28 05:12:01
3	17	360.7645506110209	252.18925981380906	20/04/28 05:12:01
3	17	360.7645506110209	252.18925981380906	20/04/28 05:12:01
3	17	361.0362055209445	252.26668242970908	20/04/28 05:12:01
3	17	361.0362055209445	252.26668242970908	20/04/28 05:12:01
3	17	361.1213693665158	252.21226618983619	20/04/28 05:12:01
3	17	361.336827315079	252.4049637654818	20/04/28 05:12:01
3	17	361.50685037122366	252.33841783470325	20/04/28 05:12:01
3	17	361.52741343931837	252.4594851531851	20/04/28 05:12:01
3	17	361.6985931332687	252.56468753576544	20/04/28 05:12:01
3	17	361.6393478082043	252.64750322196434	20/04/28 05:12:02
3	17	361.6283829989844	252.81164198581794	20/04/28 05:12:02
3	17	361.6257943074573	253.01826809955878	20/04/28 05:12:02
3	17	361.63047695935506	252.959294205805	20/04/28 05:12:02
3	17	361.49935645313707	252.81068613600704	20/04/28 05:12:02
3	17	361.5086733956254	252.5677907080476	20/04/28 05:12:02
3	17	361.37166710523564	252.54676957076538	20/04/28 05:12:02
3	17	361.1158442540548	252.4527639471479	20/04/28 05:12:02
3	17	361.11949023969737	252.44421837742993	20/04/28 05:12:02
3	17	361.0864601033567	252.56712074402424	20/04/28 05:12:02
3	17	360.9465534681933	252.60973723121458	20/04/28 05:12:03
3	17	361.15775258657834	252.55451131826945	20/04/28 05:12:03
3	17	360.93573138709706	252.7463399151071	20/04/28 05:12:03
3	17	360.86236845959445	252.82085336057895	20/04/28 05:12:03
3	17	361.15937983598553	252.86256143009786	20/04/28 05:12:03
3	17	361.4206223176845	252.75318737188874	20/04/28 05:12:03
3	17	361.3631645566613	252.52223851234098	20/04/28 05:12:03
3	17	361.6187781795932	252.67501160023645	20/04/28 05:12:03
3	17	361.4440640567703	252.7130401823886	20/04/28 05:12:03
3	17	361.4440640567703	252.7130401823886	20/04/28 05:12:04
3	17	361.4353828429649	252.73162017287424	20/04/28 05:12:04
3	17	361.3342177770311	252.92991833635998	20/04/28 05:12:04
3	17	361.5217288451835	252.85323196968614	20/04/28 05:12:04
3	17	361.54767505069424	252.85662779496207	20/04/28 05:12:04
3	17	361.4343998689871	252.95724170620488	20/04/28 05:12:04
3	17	361.4361598290184	252.95349996060472	20/04/28 05:12:04
3	17	361.52841373496	253.12449058398568	20/04/28 05:12:04
3	17	361.52463953076955	253.1378798169448	20/04/28 05:12:04
3	17	361.6807899341971	253.08885053340057	20/04/28 05:12:04
3	17	361.6315036578119	253.07893943875274	20/04/28 05:12:05
3	17	361.74288236930033	252.9789888592273	20/04/28 05:12:05
3	17	361.865282188662	252.84196114074516	20/04/28 05:12:05
3	17	361.93310831570176	252.56243722877855	20/04/28 05:12:05
3	17	362.0177318885933	252.74143145023442	20/04/28 05:12:05
3	17	361.85087621203684	252.76056292392576	20/04/28 05:12:05
3	17	361.84982945547654	252.75739087538895	20/04/28 05:12:05
3	17	361.8135097006802	252.73875129323804	20/04/28 05:12:05
3	17	361.7892155261327	252.66091821678918	20/04/28 05:12:05
3	17	361.75873009416404	252.56029842077697	20/04/28 05:12:05
3	17	361.72649251655736	252.69277925165076	20/04/28 05:12:06
3	17	361.5542186984199	252.84943728164367	20/04/28 05:12:06
3	17	361.5542186984199	252.84943728164367	20/04/28 05:12:06
3	17	361.5832834974597	252.9205685623321	20/04/28 05:12:06
3	17	361.5188152865219	252.79325785488814	20/04/28 05:12:06
3	17	361.55076496263825	252.82870418143332	20/04/28 05:12:06
3	17	361.4434427074237	252.6724065409317	20/04/28 05:12:06
3	17	361.3403134004575	252.74729452279027	20/04/28 05:12:06
3	17	361.4636067948485	252.67427108689665	20/04/28 05:12:06
3	17	361.3430925895448	252.8582365342735	20/04/28 05:12:07
3	17	361.0800619841355	252.86904085844762	20/04/28 05:12:07
3	17	361.1746244908938	252.83128577101746	20/04/28 05:12:07
3	17	361.2289761221151	252.7172000024363	20/04/28 05:12:07
3	17	361.22014225355076	252.77964594263992	20/04/28 05:12:07
3	17	361.22014225355076	252.77964594263992	20/04/28 05:12:07
3	17	361.1149399682294	252.65874358817945	20/04/28 05:12:07
3	17	361.3873156746063	252.58047919709975	20/04/28 05:12:07
3	17	361.17496000303294	252.52359245670502	20/04/28 05:12:07
3	17	361.17496000303294	252.52359245670502	20/04/28 05:12:07
3	17	361.17496000303294	252.52359245670502	20/04/28 05:12:08
3	17	361.238455364469	252.24887543635265	20/04/28 05:12:08
3	17	361.43037337612583	252.23466275514355	20/04/28 05:12:08
3	17	361.4705418059099	252.40499276921764	20/04/28 05:12:08
3	17	361.2121050802092	252.29261572337506	20/04/28 05:12:08
3	17	361.0782698294012	252.22455217189187	20/04/28 05:12:08
3	17	361.1885573079355	252.1457634530448	20/04/28 05:12:08
3	17	361.1924128046985	252.10803204720614	20/04/28 05:12:08
3	17	361.2317883482229	252.2454866874612	20/04/28 05:12:08
3	17	361.0195703441828	252.1566287178777	20/04/28 05:12:09
3	17	360.8365337192168	252.2628469069497	20/04/28 05:12:09
3	17	360.851330205213	252.20276990591552	20/04/28 05:12:09
3	17	360.96234494286324	252.01348462467223	20/04/28 05:12:09
3	17	361.04743497351853	251.81162324795312	20/04/28 05:12:09
3	17	360.9510658574738	251.74927608531883	20/04/28 05:12:09
3	17	360.8326482404018	251.76945894634508	20/04/28 05:12:09
3	17	360.83159987212633	251.7452791897374	20/04/28 05:12:09
3	17	360.8592938990469	251.8062923475323	20/04/28 05:12:09
3	17	360.91355522125974	252.02338012327806	20/04/28 05:12:09
3	17	360.6688667536778	251.9214807252263	20/04/28 05:12:10
3	17	360.4529909781224	251.73070971930306	20/04/28 05:12:10
3	17	360.3691478318427	251.74619897643683	20/04/28 05:12:10
3	17	360.50880469252786	251.89227597011907	20/04/28 05:12:10
3	17	360.3100337957851	251.91290377562288	20/04/28 05:12:10
3	17	360.4153067021638	251.95642164078637	20/04/28 05:12:10
3	17	360.33524561880444	251.972307792385	20/04/28 05:12:10
3	17	360.52499145932205	251.8579290475727	20/04/28 05:12:10
3	17	360.415670734025	251.92404912352268	20/04/28 05:12:10
3	17	360.3301632745341	252.17405123686413	20/04/28 05:12:10
3	17	360.16035033294054	252.23155898869172	20/04/28 05:12:11
3	17	360.2355954870029	252.4833284663327	20/04/28 05:12:11
3	17	360.23589378281537	252.53035798909963	20/04/28 05:12:11
3	17	360.3101535754539	252.49224217551077	20/04/28 05:12:11
3	17	360.4860819573942	252.7219589530349	20/04/28 05:12:11
3	17	360.45004416591337	252.72661450456897	20/04/28 05:12:11
3	17	360.489894519641	252.58768144394483	20/04/28 05:12:11
3	17	360.35966410987425	252.35047132902653	20/04/28 05:12:11
3	17	360.3438332999262	252.49193137506722	20/04/28 05:12:11
3	17	360.5055446756465	252.3728823745204	20/04/28 05:12:11
3	17	360.41589465070035	252.56397686018875	20/04/28 05:12:12
3	17	360.4702226427546	252.84557378374797	20/04/28 05:12:12
3	17	360.4553127754805	252.88112233976472	20/04/28 05:12:12
3	17	360.5546604341919	253.06661756711372	20/04/28 05:12:12
3	17	360.73326857784804	252.83719524479235	20/04/28 05:12:12
3	17	360.70321892408464	252.94837466819888	20/04/28 05:12:12
3	17	360.8841403646739	253.04290402247906	20/04/28 05:12:12
3	17	360.972901459704	253.1938650740715	20/04/28 05:12:12
3	17	360.96244568498076	253.46457964184825	20/04/28 05:12:12
3	17	360.8923448242288	253.44455252557844	20/04/28 05:12:13
3	17	361.0859813170324	253.37526379754766	20/04/28 05:12:13
3	17	361.10439405846466	253.3218076904969	20/04/28 05:12:13
3	17	361.2614149484712	253.51118443444682	20/04/28 05:12:13
3	17	361.0776695895389	253.48367662307834	20/04/28 05:12:13
3	17	361.1481662406535	253.27938293120624	20/04/28 05:12:13
3	17	361.14055211022594	253.44571972930234	20/04/28 05:12:13
3	17	361.2687396294464	253.56382169634517	20/04/28 05:12:13
3	17	361.44528345191634	253.52251376929195	20/04/28 05:12:13
3	17	361.5429134252412	253.4162176326927	20/04/28 05:12:13
3	17	361.59114830784904	253.32103791236028	20/04/28 05:12:14
3	17	361.5929744694204	253.33488923706443	20/04/28 05:12:14
3	17	361.59860853940796	253.26579445873162	20/04/28 05:12:14
3	17	361.54163080656093	253.28194171577493	20/04/28 05:12:14
3	17	361.57509301342236	253.24602638308863	20/04/28 05:12:14
3	17	361.72375472241157	253.12637778774214	20/04/28 05:12:14
3	17	361.75752712955256	252.99604934126498	20/04/28 05:12:14
3	17	361.8060479328614	253.0308769741191	20/04/28 05:12:14
3	17	361.81411966429323	252.9675965877489	20/04/28 05:12:14
3	17	361.6714708490371	252.7283004459137	20/04/28 05:12:15
3	17	361.6456713973247	252.74405559003776	20/04/28 05:12:15
3	17	361.7244557675299	252.70711280289467	20/04/28 05:12:15
3	17	361.69305158798954	252.7237566909313	20/04/28 05:12:15
3	17	361.8308794961692	252.78739799245585	20/04/28 05:12:15
3	17	361.8600954586696	252.75092502844132	20/04/28 05:12:15
3	17	361.69503372097904	252.78020837107167	20/04/28 05:12:15
3	17	361.83812090187195	252.54179374692893	20/04/28 05:12:15
3	17	361.9264780602215	252.70742140690032	20/04/28 05:12:15
3	17	361.9449034306866	252.77528415580247	20/04/28 05:12:15
3	17	361.890496713251	252.78868215263023	20/04/28 05:12:16
3	17	361.76737360874125	252.893199414266	20/04/28 05:12:16
3	17	361.52442040748275	252.8931693870123	20/04/28 05:12:16
3	17	361.45386479480675	252.77277064338367	20/04/28 05:12:16
3	17	361.47911456159625	252.80315302485377	20/04/28 05:12:16
3	17	361.2456109085212	252.63365056343125	20/04/28 05:12:16
3	17	361.07712467382834	252.70957689019272	20/04/28 05:12:16
3	17	361.11698160694027	252.63415170186025	20/04/28 05:12:16
3	17	361.0643963534427	252.5744848624756	20/04/28 05:12:16
3	17	360.79106748969247	252.67592015882303	20/04/28 05:12:16
3	17	360.7805301541197	252.60623708076085	20/04/28 05:12:17
3	17	360.8078636918033	252.66011674073576	20/04/28 05:12:17
3	17	360.81268130557766	252.6693624230114	20/04/28 05:12:17
3	17	360.884662190638	252.87213071707978	20/04/28 05:12:17
3	17	360.9370587578576	253.04129765404775	20/04/28 05:12:17
3	17	361.17313593097805	253.0298304637317	20/04/28 05:12:17
3	17	361.12404255915845	253.04480027705876	20/04/28 05:12:17
3	17	361.1847916948524	253.26394793259084	20/04/28 05:12:17
3	17	361.23564683878107	253.32799930005237	20/04/28 05:12:17
3	17	361.48527601474376	253.35138951530357	20/04/28 05:12:18
3	17	361.3541980873477	253.5326347571779	20/04/28 05:12:18
3	17	361.53005108217263	253.7212530336896	20/04/28 05:12:18
3	17	361.7779200376948	253.59585796363166	20/04/28 05:12:18
3	17	361.8151336274433	253.54473408020309	20/04/28 05:12:18
3	17	361.9678599855377	253.5112233079793	20/04/28 05:12:18
3	17	361.93016348250785	253.68607003750446	20/04/28 05:12:18
3	17	361.91389772964163	253.49593265916766	20/04/28 05:12:18
3	17	362.04416942288503	253.28523577391348	20/04/28 05:12:18
3	17	362.1334382780661	253.54533158439418	20/04/28 05:12:18
3	17	362.37951883562005	253.53209512038106	20/04/28 05:12:19
3	17	362.5187776970639	253.31619218972574	20/04/28 05:12:19
3	17	362.44611185872145	253.19037648002777	20/04/28 05:12:19
3	17	362.3946499728632	253.37461268650162	20/04/28 05:12:19
3	17	362.55957882319865	253.18243695746986	20/04/28 05:12:19
3	17	362.6619182559469	253.25221527490606	20/04/28 05:12:19
3	17	362.6620634368277	253.25303222034572	20/04/28 05:12:19
3	17	362.65935006250027	253.19670291471195	20/04/28 05:12:19
3	17	362.66831974455135	252.93653521677044	20/04/28 05:12:19
3	17	362.84129746368495	252.9043485164033	20/04/28 05:12:19
3	17	362.8411423699064	252.9013612686596	20/04/28 05:12:20
3	17	362.79049668228976	252.84380815483033	20/04/28 05:12:20
3	17	362.8189193765719	252.83473309750505	20/04/28 05:12:20
3	17	362.857510394827	253.03272855463678	20/04/28 05:12:20
3	17	362.60383807434886	253.1462012789343	20/04/28 05:12:20
3	17	362.4186776802181	253.29408136403734	20/04/28 05:12:20
3	17	362.2194548803722	253.31133539242762	20/04/28 05:12:20
3	17	361.9771021810079	253.26604994837987	20/04/28 05:12:20
3	17	361.95739578379823	253.13295575921296	20/04/28 05:12:20
3	17	361.9359985543896	253.1207182909168	20/04/28 05:12:21
3	17	361.9359985543896	253.1207182909168	20/04/28 05:12:21
3	17	361.98847387545976	253.11425637686062	20/04/28 05:12:21
3	17	361.9565221075664	253.27120166766983	20/04/28 05:12:21
3	17	361.88305829964946	253.1833870395676	20/04/28 05:12:21
3	17	361.7455421616941	253.1347496004676	20/04/28 05:12:21
3	17	361.7856018789787	253.1220772022565	20/04/28 05:12:21
3	17	361.91702202159905	253.08996910254237	20/04/28 05:12:21
3	17	361.9206643090999	253.08907252274344	20/04/28 05:12:21
3	17	362.04055089610324	253.29340375235287	20/04/28 05:12:21
3	17	362.01650873094366	253.31728038091134	20/04/28 05:12:22
3	17	362.03620202365136	253.35082749761335	20/04/28 05:12:22
3	17	361.97682831585655	253.35173379708738	20/04/28 05:12:22
3	17	361.97156836231625	253.39241689677283	20/04/28 05:12:22
3	17	361.97264564385404	253.38739235522317	20/04/28 05:12:22
3	17	361.76889281404374	253.27022290354728	20/04/28 05:12:22
3	17	361.6374982816582	253.09014428877487	20/04/28 05:12:22
3	17	361.48026385856184	253.14947984892538	20/04/28 05:12:22
3	17	361.474167713725	253.20190914630123	20/04/28 05:12:22
3	17	361.40848214160764	252.92945898434965	20/04/28 05:12:22
3	17	361.1603404230955	252.77962988493843	20/04/28 05:12:23
3	17	361.1853377949053	252.79987961078044	20/04/28 05:12:23
3	17	361.03347970679465	252.99652416716776	20/04/28 05:12:23
3	17	361.1180471797962	252.77403872226745	20/04/28 05:12:23
3	17	361.2771553294831	252.54893737055767	20/04/28 05:12:23
3	17	361.27277343684784	252.26865338741646	20/04/28 05:12:23
3	17	361.3027848983796	252.50276570387686	20/04/28 05:12:23
3	17	361.2893206110007	252.47740568850347	20/04/28 05:12:23
3	17	361.32025383578787	252.58548954833768	20/04/28 05:12:23
3	17	361.55343214738775	252.6570517747886	20/04/28 05:12:24
3	17	361.68821409924107	252.60054492034214	20/04/28 05:12:24
3	17	361.7462032380132	252.55028891907892	20/04/28 05:12:24
3	17	361.8600167018867	252.54552457692589	20/04/28 05:12:24
3	17	362.1383698302342	252.4551942761908	20/04/28 05:12:24
3	17	362.02517539032254	252.23107896205707	20/04/28 05:12:24
3	17	362.09100847047586	251.9661827648043	20/04/28 05:12:24
3	17	362.0346035791656	251.93084055349158	20/04/28 05:12:24
3	17	362.00007281132923	252.03209860319066	20/04/28 05:12:24
3	17	361.9152212788672	252.24579735996485	20/04/28 05:12:24
3	17	361.8352154467475	252.23905417719973	20/04/28 05:12:25
3	17	361.83004273609896	252.1871113486632	20/04/28 05:12:25
3	17	361.67063520693836	251.9351455541888	20/04/28 05:12:25
3	17	361.71016070731054	251.90952227417503	20/04/28 05:12:25
3	17	361.8155842989879	251.7581768021753	20/04/28 05:12:25
3	17	361.79714227985744	251.76650148784384	20/04/28 05:12:25
3	17	361.81692205772316	251.78167841154394	20/04/28 05:12:25
3	17	361.5340985341471	251.7704823393045	20/04/28 05:12:25
3	17	361.48323268692855	251.96849906051304	20/04/28 05:12:25
3	17	361.4847805199443	251.97370648872538	20/04/28 05:12:25
3	17	361.23148548996926	251.84166863727228	20/04/28 05:12:26
3	17	361.4005286736446	251.69922667677375	20/04/28 05:12:26
3	17	361.65041369995447	251.68898381238665	20/04/28 05:12:26
3	17	361.65041369995447	251.68898381238665	20/04/28 05:12:26
3	17	361.65041369995447	251.68898381238665	20/04/28 05:12:26
3	17	361.7104440904924	251.74168568764472	20/04/28 05:12:26
3	17	361.61343007357283	251.71775815327274	20/04/28 05:12:26
3	17	361.46087043678335	251.6300155313475	20/04/28 05:12:26
3	17	361.4511596400558	251.61668804502327	20/04/28 05:12:26
3	17	361.41113095974407	251.53057420437906	20/04/28 05:12:27
3	17	361.51458014446774	251.1346694351377	20/04/28 05:12:27
3	17	361.58309673175665	251.22085608454915	20/04/28 05:12:27
3	17	361.58309673175665	251.22085608454915	20/04/28 05:12:27
3	17	361.5130792128263	251.22442125758204	20/04/28 05:12:27
3	17	361.54374338412117	251.23408318217406	20/04/28 05:12:27
3	17	361.82794013781137	251.31405475496624	20/04/28 05:12:27
3	17	361.8532913482129	251.354574339488	20/04/28 05:12:27
3	17	361.99329200378054	251.1814581195465	20/04/28 05:12:27
3	17	362.2599400067664	251.15102038329337	20/04/28 05:12:27
3	17	362.26057334659413	251.1520184859851	20/04/28 05:12:28
3	17	362.2296103682356	251.14358951240916	20/04/28 05:12:28
3	17	362.1355621401383	251.02138704067653	20/04/28 05:12:28
3	17	362.32525887367905	251.08463921112468	20/04/28 05:12:28
3	17	362.4826707292147	251.14260430510885	20/04/28 05:12:28
3	17	362.4177533437445	251.10289917092823	20/04/28 05:12:28
3	17	362.3947377642545	251.24074356386106	20/04/28 05:12:28
3	17	362.4417163817931	251.24413716573375	20/04/28 05:12:28
3	17	362.58575765817466	251.3547673822041	20/04/28 05:12:28
3	17	362.7033179534167	251.38137998374893	20/04/28 05:12:29
3	17	362.5822791865838	251.37907519892843	20/04/28 05:12:29
3	17	362.5494242892413	251.37517686016056	20/04/28 05:12:29
3	17	362.56859034031675	251.29050401393695	20/04/28 05:12:29
3	17	362.57714355682947	251.2463420095071	20/04/28 05:12:29
3	17	362.8571674678463	251.23605896607498	20/04/28 05:12:29
3	17	362.8037617183661	251.2709888678655	20/04/28 05:12:29
3	17	362.6210522804464	251.09674925803378	20/04/28 05:12:29
3	17	362.6210522804464	251.09674925803378	20/04/28 05:12:29
3	17	362.6874483210606	251.0253967849608	20/04/28 05:12:29
3	17	362.8369612099215	251.181100646652	20/04/28 05:12:30
3	17	362.99435900886596	250.96705978341691	20/04/28 05:12:30
3	17	362.99789320897094	250.97821919632506	20/04/28 05:12:30
3	17	362.90847972628893	250.8137886565768	20/04/28 05:12:30
3	17	363.0255116533795	250.93834888516483	20/04/28 05:12:30
3	17	363.12253926718995	251.14747970106805	20/04/28 05:12:30
3	17	363.10796337934863	251.22040541047488	20/04/28 05:12:30
3	17	363.2429132876416	251.36120179252427	20/04/28 05:12:30
3	17	363.096628079778	251.6021000834821	20/04/28 05:12:30
3	17	363.0161765090169	251.3891384779632	20/04/28 05:12:30
3	17	363.05758747502546	251.50243568415067	20/04/28 05:12:31
3	17	362.8892782985123	251.55338172968348	20/04/28 05:12:31
3	17	362.85250713793215	251.67656686460992	20/04/28 05:12:31
3	17	362.83036628262477	251.76859171135092	20/04/28 05:12:31
3	17	362.7675456222947	251.88611646888967	20/04/28 05:12:31
3	17	362.95239802575935	252.06138286293876	20/04/28 05:12:31
3	17	363.22625146405636	252.08128807174327	20/04/28 05:12:31
3	17	363.2280109096373	252.14136059854138	20/04/28 05:12:31
3	17	363.4131017082409	251.99934259818403	20/04/28 05:12:31
3	17	363.4131017082409	251.99934259818403	20/04/28 05:12:32
3	17	363.431526060655	251.7431075708813	20/04/28 05:12:32
3	17	363.4313421850516	251.7300640821262	20/04/28 05:12:32
3	17	363.5355946893791	251.8271031988465	20/04/28 05:12:32
3	17	363.53302552929466	251.82591573377405	20/04/28 05:12:32
3	17	363.53334707105097	251.82813974415066	20/04/28 05:12:32
3	17	363.73319682740413	251.84123367812498	20/04/28 05:12:32
3	17	363.715243751993	251.61137216661643	20/04/28 05:12:32
3	17	363.7988981886712	251.52349398145668	20/04/28 05:12:32
3	17	363.60672175878494	251.74299458366042	20/04/28 05:12:32
3	17	363.45938919948077	251.5777856861628	20/04/28 05:12:33
3	17	363.56954553670386	251.41211920516344	20/04/28 05:12:33
3	17	363.8415411703578	251.37090141373127	20/04/28 05:12:33
3	17	364.0125682593571	251.5946480120379	20/04/28 05:12:33
3	17	363.87370498781803	251.61806740065498	20/04/28 05:12:33
3	17	363.7913473572552	251.84117836861023	20/04/28 05:12:33
3	17	363.98428445902584	251.9197063263285	20/04/28 05:12:33
3	17	363.9986886836423	251.9042883414823	20/04/28 05:12:33
3	17	364.1103848098972	251.90929056477287	20/04/28 05:12:33
3	17	363.99606721598883	251.76130977818656	20/04/28 05:12:34
3	17	363.83770263295776	251.7899712176799	20/04/28 05:12:34
3	17	363.83440235373183	251.82257902691407	20/04/28 05:12:34
3	17	363.69432828352535	251.90236818221166	20/04/28 05:12:34
3	17	363.6989459026545	252.08832980048325	20/04/28 05:12:34
3	17	363.6274737399045	252.0869131533067	20/04/28 05:12:34
3	17	363.70578269030915	252.13288031908522	20/04/28 05:12:34
3	17	363.6944042840155	252.19342306261095	20/04/28 05:12:34
3	17	363.7015613150367	252.43116499494928	20/04/28 05:12:34
3	17	363.6219738644981	252.4163096462948	20/04/28 05:12:34
3	17	363.6275728524387	252.33996788709695	20/04/28 05:12:35
3	17	363.6095394298472	252.3360206365913	20/04/28 05:12:35
3	17	363.78628584680683	252.47689267178143	20/04/28 05:12:35
3	17	363.6756626467883	252.61880498425577	20/04/28 05:12:35
3	17	363.71057352167173	252.70053044602292	20/04/28 05:12:35
3	17	363.71501021706223	252.70684125377102	20/04/28 05:12:35
3	17	363.5654594140266	252.732759865831	20/04/28 05:12:35
3	17	363.55216807625555	252.73528303917368	20/04/28 05:12:35
3	17	363.7973833403488	252.67600024388827	20/04/28 05:12:35
3	17	363.7975148831304	252.68003262066895	20/04/28 05:12:35
3	17	363.96995904856465	252.4522531817556	20/04/28 05:12:36
3	17	364.06555107578237	252.4714050567467	20/04/28 05:12:36
3	17	364.0180795262538	252.290820606413	20/04/28 05:12:36
3	17	364.019128337157	252.29143229055376	20/04/28 05:12:36
3	17	364.0295463625515	252.29348496312676	20/04/28 05:12:36
3	17	364.05346977337535	252.45776703592603	20/04/28 05:12:36
3	17	364.0680583818728	252.29627378165927	20/04/28 05:12:36
3	17	363.9636038065085	252.21084170777337	20/04/28 05:12:36
3	17	363.9585680112987	252.1027366057867	20/04/28 05:12:36
3	17	364.065913390843	252.25124865198848	20/04/28 05:12:37
3	17	364.0415645680117	252.29762782531293	20/04/28 05:12:37
3	17	363.966643358297	252.58671525741036	20/04/28 05:12:37
3	17	363.8560458690405	252.85899804154852	20/04/28 05:12:37
3	17	363.996784176629	253.00597491597938	20/04/28 05:12:37
3	17	363.9756838714996	253.07245906276518	20/04/28 05:12:37
3	17	363.8198174811244	253.06058804509613	20/04/28 05:12:37
3	17	363.6500304759797	253.2153654787863	20/04/28 05:12:37
3	17	363.435372014836	253.03868783024305	20/04/28 05:12:37
3	17	363.39219590078204	253.11761511195743	20/04/28 05:12:37
3	17	363.5416940849812	253.24878208136897	20/04/28 05:12:38
3	17	363.5572803628489	253.2731731146376	20/04/28 05:12:38
3	17	363.61679278098427	253.2659099892962	20/04/28 05:12:38
3	17	363.66591613989266	253.35874163065836	20/04/28 05:12:38
3	17	363.61078828700414	253.32431517679765	20/04/28 05:12:38
3	17	363.7781398568793	253.44152891952592	20/04/28 05:12:38
3	17	363.855281786871	253.43603744457278	20/04/28 05:12:38
3	17	363.95072851750103	253.43202438740516	20/04/28 05:12:38
3	17	364.11086622008	253.38758723749493	20/04/28 05:12:38
3	17	364.0517537498568	253.20540906865978	20/04/28 05:12:39
3	17	364.0768979887787	253.1130272164933	20/04/28 05:12:39
3	17	364.10220513742723	253.28125512468336	20/04/28 05:12:39
3	17	363.89013150842345	253.18983401949606	20/04/28 05:12:39
3	17	363.9422336358712	253.28048592809031	20/04/28 05:12:39
3	17	364.1041996409875	253.42636219305888	20/04/28 05:12:39
3	17	364.02857851880657	253.3603776922069	20/04/28 05:12:39
3	17	363.93636881719203	253.46401278942287	20/04/28 05:12:39
3	17	363.68121189255635	253.49144008208262	20/04/28 05:12:39
3	17	363.406393946474	253.49730036823402	20/04/28 05:12:39
3	17	363.4660009899148	253.5268667823365	20/04/28 05:12:40
3	17	363.5140913357772	253.46324585868243	20/04/28 05:12:40
3	17	363.52009555594026	253.4300539468768	20/04/28 05:12:40
3	17	363.5293315992017	253.37078002340385	20/04/28 05:12:40
3	17	363.3785240942279	253.59052289440456	20/04/28 05:12:40
3	17	363.3702967026149	253.57303603422386	20/04/28 05:12:40
3	17	363.3760277843511	253.57845883117778	20/04/28 05:12:40
3	17	363.2797980257833	253.32847230154354	20/04/28 05:12:40
3	17	363.25786135037123	253.472602882481	20/04/28 05:12:40
3	17	363.25786135037123	253.472602882481	20/04/28 05:12:40
