floorId	partitionId	location_x	location_y	timeStamp
1	97	338.24862113773673	291.2110845008521	20/04/28 05:15:56
1	97	338.3831456435392	290.98292854753	20/04/28 05:15:56
1	97	338.51899268976365	290.7525295421409	20/04/28 05:15:56
1	97	338.65366198153043	290.52412802924937	20/04/28 05:15:56
1	97	338.7853297811409	290.3008171004134	20/04/28 05:15:56
1	97	338.9194804701172	290.0732951470738	20/04/28 05:15:56
1	97	339.03883143118867	289.8708737953599	20/04/28 05:15:56
1	97	339.19016280210315	289.6142131000272	20/04/28 05:15:57
1	97	339.19016280210315	289.6142131000272	20/04/28 05:15:57
1	97	339.4224349590695	289.2202753926427	20/04/28 05:15:57
1	97	339.5230112515753	289.0496962125789	20/04/28 05:15:57
1	97	339.5230112515753	289.0496962125789	20/04/28 05:15:57
1	97	339.6458300318905	288.84139337777924	20/04/28 05:15:57
1	97	339.7959579123288	288.58677382368904	20/04/28 05:15:57
1	97	339.8780485964566	288.44754656405837	20/04/28 05:15:57
1	97	339.9936682932322	288.25145350292206	20/04/28 05:15:57
1	97	340.0821959675712	288.101308993461	20/04/28 05:15:57
1	97	340.27739585628757	287.77024651207296	20/04/28 05:15:58
1	97	340.27739585628757	287.77024651207296	20/04/28 05:15:58
1	97	340.41505236068673	287.53677863345234	20/04/28 05:15:58
1	97	340.5542461274781	287.3007035304862	20/04/28 05:15:58
1	97	340.7003755619712	287.05286541180055	20/04/28 05:15:58
1	97	340.82378218273595	286.8435655891482	20/04/28 05:15:58
1	97	340.9198142796026	286.680693445672	20/04/28 05:15:58
1	97	341.0443153164055	286.46953747396316	20/04/28 05:15:58
1	97	341.16017272513017	286.2730412491353	20/04/28 05:15:58
1	7	341.24329666666665	286.1056835914107	20/04/28 05:15:58
1	7	341.24329666666665	285.8815127779559	20/04/28 05:15:59
1	7	341.24329666666665	285.60654130542974	20/04/28 05:15:59
1	7	341.24329666666665	285.39472685358055	20/04/28 05:15:59
1	7	341.24329666666665	284.96716836389214	20/04/28 05:15:59
1	7	341.24329666666665	284.771764155544	20/04/28 05:15:59
1	7	341.24329666666665	284.771764155544	20/04/28 05:15:59
1	7	341.24329666666665	284.34591252744667	20/04/28 05:15:59
1	7	341.24329666666665	284.34591252744667	20/04/28 05:15:59
1	7	341.24329666666665	284.0590213503109	20/04/28 05:15:59
1	7	341.24329666666665	283.52594699705094	20/04/28 05:16:00
1	7	341.24329666666665	283.23241604621944	20/04/28 05:16:00
1	7	341.24329666666665	283.23241604621944	20/04/28 05:16:00
1	7	341.24329666666665	282.64316292324185	20/04/28 05:16:00
1	7	341.24329666666665	282.64316292324185	20/04/28 05:16:00
1	7	341.24329666666665	282.4257525342041	20/04/28 05:16:00
1	7	341.24329666666665	281.99431100826445	20/04/28 05:16:00
1	7	341.24329666666665	281.7201081036389	20/04/28 05:16:00
1	7	341.24329666666665	281.4810346239126	20/04/28 05:16:00
1	7	341.24329666666665	281.4810346239126	20/04/28 05:16:00
1	7	341.24329666666665	281.22324967393695	20/04/28 05:16:01
1	7	341.24329666666665	281.01983852118934	20/04/28 05:16:01
1	7	341.24329666666665	280.82287468513783	20/04/28 05:16:01
1	7	341.24329666666665	280.5598201988959	20/04/28 05:16:01
1	7	341.24329666666665	280.5598201988959	20/04/28 05:16:01
1	7	341.24329666666665	280.08153470185647	20/04/28 05:16:01
1	7	341.24329666666665	279.86760637347754	20/04/28 05:16:01
1	7	341.24329666666665	279.6224852828408	20/04/28 05:16:01
1	7	341.24329666666665	279.6224852828408	20/04/28 05:16:01
1	7	341.24329666666665	279.6224852828408	20/04/28 05:16:01
1	7	341.24329666666665	279.4723038894968	20/04/28 05:16:02
1	7	341.24329666666665	279.26534053267363	20/04/28 05:16:02
1	7	341.24329666666665	279.068934873106	20/04/28 05:16:02
1	7	341.24329666666665	278.89225092840604	20/04/28 05:16:02
1	7	341.24329666666665	278.6031226584789	20/04/28 05:16:02
1	7	341.24329666666665	278.41855854380907	20/04/28 05:16:02
1	7	341.24329666666665	278.24084918919056	20/04/28 05:16:02
1	7	341.24329666666665	278.00435293899636	20/04/28 05:16:02
1	7	341.24329666666665	277.7473246409793	20/04/28 05:16:02
1	7	341.24329666666665	277.49845903429417	20/04/28 05:16:03
1	7	341.24329666666665	277.49845903429417	20/04/28 05:16:03
1	7	341.24329666666665	277.253527980917	20/04/28 05:16:03
1	83	341.1831250542676	277.1023368674487	20/04/28 05:16:03
1	83	340.97563760868405	277.2477385673941	20/04/28 05:16:03
1	83	340.77943845018564	277.3852297350804	20/04/28 05:16:03
1	83	340.651289313798	277.4750332517457	20/04/28 05:16:03
1	83	340.651289313798	277.4750332517457	20/04/28 05:16:03
1	83	340.5127551740094	277.57211430341647	20/04/28 05:16:03
1	83	340.3021478630695	277.71970232227454	20/04/28 05:16:03
1	83	340.08189771818184	277.8740477834653	20/04/28 05:16:04
1	83	339.84784640224836	278.03806473936106	20/04/28 05:16:04
1	83	339.7031955408847	278.1394322273153	20/04/28 05:16:04
1	83	339.2987716474303	278.4228417677886	20/04/28 05:16:04
1	83	339.2987716474303	278.4228417677886	20/04/28 05:16:04
1	7	339.0280763617823	278.61253784597653	20/04/28 05:16:04
1	7	339.26769610369195	278.7577487860253	20/04/28 05:16:04
1	7	339.174646666378	278.7618495190942	20/04/28 05:16:04
1	7	339.20641504502527	278.7717960042112	20/04/28 05:16:04
1	7	339.3627480207024	278.6675758761214	20/04/28 05:16:04
1	7	339.37197423638975	278.6523183403456	20/04/28 05:16:05
1	7	339.18781914788434	278.88069718366677	20/04/28 05:16:05
1	7	339.18781914788434	278.88069718366677	20/04/28 05:16:05
1	7	339.02697404732515	278.880273098419	20/04/28 05:16:05
1	7	339.28020059332187	278.8904055690384	20/04/28 05:16:05
1	7	339.54926534115924	278.94461482759596	20/04/28 05:16:05
1	7	339.39289233043223	278.78283504851026	20/04/28 05:16:05
1	7	339.14039459815245	278.67570818179155	20/04/28 05:16:05
1	7	339.21592558036446	278.7590245626558	20/04/28 05:16:05
1	7	339.263739455447	278.88364510652707	20/04/28 05:16:06
1	7	339.04820177579484	279.01612949011684	20/04/28 05:16:06
1	7	338.8686129166999	278.949189303725	20/04/28 05:16:06
1	7	338.9343283856937	278.8294879245258	20/04/28 05:16:06
1	7	339.21098058959933	278.8495272265706	20/04/28 05:16:06
1	7	339.3133351173018	278.9146117640235	20/04/28 05:16:06
1	7	339.1854682815674	279.1669438846498	20/04/28 05:16:06
1	7	338.9224774330043	279.0274000954814	20/04/28 05:16:06
1	7	339.1285513829466	278.9587813206674	20/04/28 05:16:06
1	7	339.1623132141126	279.0291393007618	20/04/28 05:16:06
1	7	339.1265601146202	279.0053950218452	20/04/28 05:16:07
1	7	339.2803744603583	278.8939896476931	20/04/28 05:16:07
1	7	339.2398240584543	278.89092028328713	20/04/28 05:16:07
1	7	339.2506361134034	278.92961541665824	20/04/28 05:16:07
1	7	339.1419692543154	278.8518832357169	20/04/28 05:16:07
1	7	339.33660141477276	278.8398129616179	20/04/28 05:16:07
1	7	339.33204321383874	278.7145246224658	20/04/28 05:16:07
1	7	339.35389739759364	278.52747190022814	20/04/28 05:16:07
1	7	339.5587608309801	278.7135235184892	20/04/28 05:16:07
1	7	339.52211388239357	278.4830324441472	20/04/28 05:16:07
1	7	339.3411954325297	278.611800911151	20/04/28 05:16:08
1	7	339.3432011490798	278.6148369492653	20/04/28 05:16:08
1	7	339.3233165930703	278.6906200844458	20/04/28 05:16:08
1	7	339.3277912251349	278.7017014016596	20/04/28 05:16:08
1	7	339.19252520022235	278.4628454487116	20/04/28 05:16:08
1	7	339.281066643929	278.4722479180716	20/04/28 05:16:08
1	7	339.2386149519096	278.46887294702975	20/04/28 05:16:08
1	7	339.0368700573638	278.28487249909324	20/04/28 05:16:08
1	7	339.13992259750904	278.25496296920466	20/04/28 05:16:08
1	7	339.3088131505811	278.24294927043934	20/04/28 05:16:09
1	7	339.1261636344295	278.2225897023363	20/04/28 05:16:09
1	7	339.1981257683995	278.26142448823674	20/04/28 05:16:09
1	7	339.17309527774154	278.26064833915717	20/04/28 05:16:09
1	7	339.2926830814643	278.10378916785123	20/04/28 05:16:09
1	7	339.19081002869814	277.91604091406936	20/04/28 05:16:09
1	7	339.3780635913943	277.87090906402346	20/04/28 05:16:09
1	7	339.3334221466436	277.7924402754841	20/04/28 05:16:09
1	7	339.0949213641504	277.8330445362166	20/04/28 05:16:09
1	7	339.2089908277537	277.7584349488984	20/04/28 05:16:09
1	7	339.26790349885516	277.7252723692586	20/04/28 05:16:10
1	7	339.1667337456875	277.51925234129016	20/04/28 05:16:10
1	7	339.29321205109113	277.5485494487002	20/04/28 05:16:10
1	7	339.3278959516475	277.57290354556363	20/04/28 05:16:10
1	7	339.34884914663274	277.55559328307714	20/04/28 05:16:10
1	7	339.57947300759923	277.7339855882806	20/04/28 05:16:10
1	7	339.64122843455243	277.63507521169237	20/04/28 05:16:10
1	7	339.7935655872469	277.68693319683445	20/04/28 05:16:10
1	7	339.6612354277019	277.65316711907656	20/04/28 05:16:10
1	7	339.5077272967757	277.4626617862478	20/04/28 05:16:10
1	7	339.51924282509253	277.4857091633245	20/04/28 05:16:11
1	7	339.51388202705346	277.74228635392484	20/04/28 05:16:11
1	7	339.5160769254567	277.75991518150755	20/04/28 05:16:11
1	7	339.5162559451659	277.7632030663243	20/04/28 05:16:11
1	7	339.4811557521539	277.7414316370425	20/04/28 05:16:11
1	7	339.27316286655343	277.78524284836504	20/04/28 05:16:11
1	7	339.52984978785685	277.7584945718871	20/04/28 05:16:11
1	7	339.3636343250534	277.70095090646475	20/04/28 05:16:11
1	7	339.1949714043721	277.6821320696373	20/04/28 05:16:11
1	7	339.38209123008625	277.6342046883368	20/04/28 05:16:11
1	7	339.35805946106393	277.695623378459	20/04/28 05:16:12
1	7	339.21311597017456	277.6412546231031	20/04/28 05:16:12
1	7	339.29309028028985	277.73760925350155	20/04/28 05:16:12
1	7	339.33715287775385	277.8283985023032	20/04/28 05:16:12
1	7	339.5017904454414	277.6071200723001	20/04/28 05:16:12
1	7	339.5901767039315	277.6092463214598	20/04/28 05:16:12
1	7	339.4238418318932	277.6535211045843	20/04/28 05:16:12
1	7	339.56859630196203	277.4338370135899	20/04/28 05:16:12
1	7	339.688558681328	277.47322991026095	20/04/28 05:16:12
1	7	339.5875224312517	277.2309488603574	20/04/28 05:16:13
1	7	339.39799053323003	277.2515438058215	20/04/28 05:16:13
1	7	339.40508686047326	277.2551698166165	20/04/28 05:16:13
1	7	339.1360471424684	277.1722441621905	20/04/28 05:16:13
1	7	339.14586410925966	277.1430272203897	20/04/28 05:16:13
1	7	339.2174696706732	277.02028289537384	20/04/28 05:16:13
1	7	338.9775489286123	277.0393107098331	20/04/28 05:16:13
1	7	338.8008810274924	276.8311718554098	20/04/28 05:16:13
1	7	338.89298204168	276.8405472240444	20/04/28 05:16:13
1	7	338.79917418235044	277.09903377803454	20/04/28 05:16:13
1	7	338.8943230151287	277.1567352463877	20/04/28 05:16:14
1	7	338.90499992991965	277.1747019872399	20/04/28 05:16:14
1	7	339.0779045431244	276.99170556254785	20/04/28 05:16:14
1	7	339.08088775058735	276.9071329390152	20/04/28 05:16:14
1	7	339.100357513079	276.87123784211116	20/04/28 05:16:14
1	7	338.9501124021042	276.9521802112093	20/04/28 05:16:14
1	7	338.9112763295187	277.0665187799409	20/04/28 05:16:14
1	7	338.8418099707851	276.92712924468907	20/04/28 05:16:14
1	7	338.8304876389179	276.98303749285543	20/04/28 05:16:14
1	7	338.65770571585784	276.9647418151484	20/04/28 05:16:14
1	7	338.49755398165445	276.9607551145955	20/04/28 05:16:15
1	7	338.4972484332655	277.064411655469	20/04/28 05:16:15
1	7	338.41903505802816	277.14216961880726	20/04/28 05:16:15
1	7	338.22869764713545	277.02776082222096	20/04/28 05:16:15
1	7	338.3153341283165	276.9406494858086	20/04/28 05:16:15
1	7	338.37043828447315	276.8726672715058	20/04/28 05:16:15
1	7	338.38322960376973	276.86092572192035	20/04/28 05:16:15
1	7	338.31281897091725	276.8859594500491	20/04/28 05:16:15
1	7	338.3245202356102	276.8670063561515	20/04/28 05:16:15
1	7	338.32817457695586	277.02899619811694	20/04/28 05:16:16
1	7	338.2549894353137	276.9318457906607	20/04/28 05:16:16
1	7	338.2549894353137	276.9318457906607	20/04/28 05:16:16
1	7	338.2549894353137	276.9318457906607	20/04/28 05:16:16
1	7	338.550259343683	276.9565890980672	20/04/28 05:16:16
1	7	338.3356358880682	276.95477985376937	20/04/28 05:16:16
1	7	338.4456411788201	276.8900980283311	20/04/28 05:16:16
1	7	338.3598665416187	277.0533015138877	20/04/28 05:16:16
1	7	338.3189780132741	277.1735725789847	20/04/28 05:16:16
1	7	338.45582064390715	277.04623417979155	20/04/28 05:16:16
1	7	338.49613388505855	276.91871787097597	20/04/28 05:16:17
1	7	338.62349351928555	276.8320516408804	20/04/28 05:16:17
1	7	338.84316562869986	276.96398650813035	20/04/28 05:16:17
1	7	338.6194928650614	276.99012836044903	20/04/28 05:16:17
1	7	338.4528090329874	277.02471081522935	20/04/28 05:16:17
1	7	338.5418496283681	277.2872046809405	20/04/28 05:16:17
1	7	338.6530398932571	277.12701756344944	20/04/28 05:16:17
1	7	338.75697992789	277.2912741140825	20/04/28 05:16:17
1	7	338.75077000261376	277.26002105142015	20/04/28 05:16:17
1	7	338.53093359827085	277.1763368459096	20/04/28 05:16:17
1	7	338.4355179990388	277.2130279897286	20/04/28 05:16:18
1	7	338.56049060317747	276.95844825259303	20/04/28 05:16:18
1	7	338.39990838829976	277.0909522841049	20/04/28 05:16:18
1	7	338.6429226108941	277.19818559261495	20/04/28 05:16:18
1	7	338.5512098662926	277.11153363808126	20/04/28 05:16:18
1	7	338.61264184133853	276.994954665974	20/04/28 05:16:18
1	7	338.6124633688759	276.9940926774245	20/04/28 05:16:18
1	7	338.61323484665775	276.87378141951746	20/04/28 05:16:18
1	7	338.5245926412427	276.8413212876288	20/04/28 05:16:18
1	7	338.30335809549854	276.8796160271442	20/04/28 05:16:19
1	7	338.30066521916075	276.9870120942105	20/04/28 05:16:19
1	7	338.0819025747564	276.861999665461	20/04/28 05:16:19
1	7	338.0960054407594	276.8817415091085	20/04/28 05:16:19
1	7	338.1206877393074	276.87382317793885	20/04/28 05:16:19
1	7	338.1109345986411	277.0127223912006	20/04/28 05:16:19
1	7	337.87036159474286	277.0503939853527	20/04/28 05:16:19
1	7	337.9084973184262	277.14899702905973	20/04/28 05:16:19
1	7	338.18788439290194	277.24401245615763	20/04/28 05:16:19
1	7	338.1127660140752	277.2298703301609	20/04/28 05:16:19
1	7	338.11768338197425	277.391673277498	20/04/28 05:16:20
1	7	338.1045541003979	277.44194266595014	20/04/28 05:16:20
1	7	338.14803902044616	277.598716432643	20/04/28 05:16:20
1	7	338.30383284810455	277.74083379452276	20/04/28 05:16:20
1	7	338.3042719474244	277.7922810619969	20/04/28 05:16:20
1	7	338.31843520381796	277.7847409896119	20/04/28 05:16:20
1	7	338.4484624970075	277.73366080859574	20/04/28 05:16:20
1	7	338.64135532942737	277.957582635036	20/04/28 05:16:20
1	7	338.72940106341485	278.06517398835723	20/04/28 05:16:20
1	7	338.7251085313302	278.01398253015486	20/04/28 05:16:20
1	7	338.76334944033414	277.96984090024534	20/04/28 05:16:21
1	7	339.01303416143196	278.04889187549634	20/04/28 05:16:21
1	7	338.85691012528963	277.9309978868418	20/04/28 05:16:21
1	7	338.8607078542835	277.93233179074673	20/04/28 05:16:21
1	7	338.81793405424037	277.8767640479839	20/04/28 05:16:21
1	7	338.84815947345777	277.88067130360355	20/04/28 05:16:21
1	7	338.84815947345777	277.88067130360355	20/04/28 05:16:21
1	7	338.84732453628584	277.87108851997687	20/04/28 05:16:21
1	7	339.04324099871997	277.86172801851177	20/04/28 05:16:21
1	7	338.99838135416235	277.8369494171156	20/04/28 05:16:21
1	7	339.0635847695538	277.7673220825713	20/04/28 05:16:22
1	7	339.0635847695538	277.7673220825713	20/04/28 05:16:22
1	7	339.2709376743729	277.5508287050061	20/04/28 05:16:22
1	7	339.42914064161073	277.61143351959527	20/04/28 05:16:22
1	7	339.4210896350823	277.65092057847727	20/04/28 05:16:22
1	7	339.43140530316657	277.8159037627292	20/04/28 05:16:22
1	7	339.3802688153111	277.88267099174016	20/04/28 05:16:22
1	7	339.37490713703517	277.839383496289	20/04/28 05:16:22
1	7	339.43656535843996	277.95708438261914	20/04/28 05:16:22
1	7	339.46568866436763	277.96326595155205	20/04/28 05:16:23
1	7	339.6043548327074	277.87752018834254	20/04/28 05:16:23
1	7	339.513810582901	277.7841163313251	20/04/28 05:16:23
1	7	339.3826354816025	277.56815648534547	20/04/28 05:16:23
1	7	339.40641335777286	277.55644365409614	20/04/28 05:16:23
1	7	339.4667217414725	277.42993013450916	20/04/28 05:16:23
1	7	339.29568290996934	277.45849558325455	20/04/28 05:16:23
1	7	339.3489436513724	277.18107798269034	20/04/28 05:16:23
1	7	339.0608317496224	277.19586743552594	20/04/28 05:16:23
1	7	339.07331530658104	277.2133351271157	20/04/28 05:16:23
1	7	339.08545840052244	277.2094317397124	20/04/28 05:16:24
1	7	339.09730461279224	276.92540786637164	20/04/28 05:16:24
1	7	339.3322497656128	276.98720331352007	20/04/28 05:16:24
1	7	339.3867543348641	276.8333423558275	20/04/28 05:16:24
1	7	339.45514978259405	276.9012653437114	20/04/28 05:16:24
1	7	339.24686154309785	276.94231498867936	20/04/28 05:16:24
1	7	339.26540538454515	276.94705085478915	20/04/28 05:16:24
1	7	339.22206206179095	276.93776262568895	20/04/28 05:16:24
1	7	339.19433136302507	276.85281882240173	20/04/28 05:16:24
1	7	339.17708440679473	276.9406280427581	20/04/28 05:16:24
1	7	339.30297675000287	277.03940000649095	20/04/28 05:16:25
1	7	339.31299738687886	277.19434792489665	20/04/28 05:16:25
1	7	339.31425585715067	277.2049236676583	20/04/28 05:16:25
1	7	339.49803398525984	277.320727464293	20/04/28 05:16:25
1	7	339.76356696264776	277.43693900817794	20/04/28 05:16:25
1	7	339.74000316909456	277.35700781286505	20/04/28 05:16:25
1	7	339.684229035128	277.36775026592403	20/04/28 05:16:25
1	7	339.7187623224085	277.50884496217697	20/04/28 05:16:25
1	7	339.85562993440675	277.41007463835865	20/04/28 05:16:25
1	7	340.22246501842915	277.57926999922955	20/04/28 05:16:26
1	7	340.22246501842915	277.57926999922955	20/04/28 05:16:26
1	7	340.0382554483453	277.54446415854557	20/04/28 05:16:26
1	7	340.0382554483453	277.54446415854557	20/04/28 05:16:26
1	7	340.17128536016287	277.63098401535615	20/04/28 05:16:26
1	7	340.15683591573867	277.66972752723916	20/04/28 05:16:26
1	7	340.17723775792615	277.6312753990914	20/04/28 05:16:26
1	7	340.38472278849014	277.67766862721726	20/04/28 05:16:26
1	7	340.38472278849014	277.67766862721726	20/04/28 05:16:26
1	7	340.40493825918975	277.6870483691953	20/04/28 05:16:26
1	7	340.44370558571694	277.6795243833608	20/04/28 05:16:27
1	7	340.45473121867224	277.7729904435547	20/04/28 05:16:27
1	7	340.3826695839147	277.83456493371983	20/04/28 05:16:27
1	7	340.3830274895917	277.82299964327746	20/04/28 05:16:27
1	7	340.3830274895917	277.82299964327746	20/04/28 05:16:27
1	7	340.38743279566796	277.8375773779264	20/04/28 05:16:27
1	7	340.4096482722099	277.7919894156486	20/04/28 05:16:27
1	7	340.27846717069514	277.7825562953401	20/04/28 05:16:27
1	7	339.9949389715031	277.78715639196537	20/04/28 05:16:27
1	7	339.8375023822587	277.75451550307713	20/04/28 05:16:27
1	7	339.7807973111835	277.6187807865977	20/04/28 05:16:28
1	7	339.78456141388097	277.58816439084757	20/04/28 05:16:28
1	7	339.6981589528113	277.6214788207903	20/04/28 05:16:28
1	7	339.63665861189367	277.65651274368946	20/04/28 05:16:28
1	7	339.75027373623465	277.81848575530285	20/04/28 05:16:28
1	7	339.7764138791204	277.83159250464	20/04/28 05:16:28
1	7	339.58348160030005	277.81290018907004	20/04/28 05:16:28
1	7	339.543014105116	277.70494123507797	20/04/28 05:16:28
1	7	339.4378539126664	277.4379202005049	20/04/28 05:16:28
1	7	339.50495363498226	277.4256726575323	20/04/28 05:16:29
1	7	339.45295082984825	277.4567363408904	20/04/28 05:16:29
1	7	339.5468275290095	277.71186521903763	20/04/28 05:16:29
1	7	339.5072760776046	277.79990566940364	20/04/28 05:16:29
1	7	339.6236975516414	277.8547546813638	20/04/28 05:16:29
1	7	339.6287753918018	277.89840076828654	20/04/28 05:16:29
1	7	339.37132118289253	277.96870964248774	20/04/28 05:16:29
1	7	339.2541067576174	278.2305816225834	20/04/28 05:16:29
1	7	339.093241125938	278.45332648208193	20/04/28 05:16:29
1	7	339.0063919069389	278.45952225240063	20/04/28 05:16:29
1	7	339.0872172819403	278.6428784322696	20/04/28 05:16:30
1	7	339.1572429212214	278.6451087894687	20/04/28 05:16:30
1	7	339.16149590409844	278.9046115256188	20/04/28 05:16:30
1	7	339.04172521060923	278.91421514062284	20/04/28 05:16:30
1	7	339.0220559360048	279.0067437163743	20/04/28 05:16:30
1	7	339.02111369013295	279.08624606049295	20/04/28 05:16:30
1	7	339.00303323796237	278.9897282545422	20/04/28 05:16:30
1	7	338.79077655854917	278.972008384436	20/04/28 05:16:30
1	7	338.592011020791	278.9593824014677	20/04/28 05:16:30
1	7	338.6253969252998	279.00623178917965	20/04/28 05:16:30
1	7	338.7317735175574	279.0694209269951	20/04/28 05:16:31
1	7	338.7536527945898	279.0686317539136	20/04/28 05:16:31
1	7	338.6657815940172	278.9996995549996	20/04/28 05:16:31
1	7	338.879018416154	279.1578924228074	20/04/28 05:16:31
1	7	338.8663769840455	279.16082218714894	20/04/28 05:16:31
1	7	338.7347301961886	279.01810813849823	20/04/28 05:16:31
1	7	338.58269259719583	279.0269864489733	20/04/28 05:16:31
1	7	338.4421308287958	278.7625644516245	20/04/28 05:16:31
1	7	338.4430594149918	278.7594321383179	20/04/28 05:16:31
1	7	338.66863859768864	278.79254860019466	20/04/28 05:16:31
1	7	338.43897167108554	278.8399814671262	20/04/28 05:16:32
1	7	338.45401092533126	278.8916495804441	20/04/28 05:16:32
1	7	338.4294973910901	278.91419930292307	20/04/28 05:16:32
1	7	338.6448018642753	278.9193732097492	20/04/28 05:16:32
1	7	338.6907481934547	278.9220180777846	20/04/28 05:16:32
1	7	338.72582008826964	278.7780920010515	20/04/28 05:16:32
1	7	338.8080827548001	278.536306034543	20/04/28 05:16:32
1	7	338.79697765022206	278.54215978912725	20/04/28 05:16:32
1	7	338.8284375633913	278.64350642689163	20/04/28 05:16:32
1	7	338.71026742115095	278.49728430815946	20/04/28 05:16:33
1	7	338.66872699462203	278.58332114198294	20/04/28 05:16:33
1	7	338.55397657655084	278.8526968176303	20/04/28 05:16:33
1	7	338.4002865423493	279.0555417817272	20/04/28 05:16:33
1	7	338.435527130546	279.0179230390998	20/04/28 05:16:33
1	7	338.3901128814977	279.1375223061165	20/04/28 05:16:33
1	7	338.1993438267624	279.35066778109007	20/04/28 05:16:33
1	7	338.19840465063993	279.3230775351904	20/04/28 05:16:33
1	7	338.075427275538	279.32515026866736	20/04/28 05:16:33
1	7	338.1059818352705	279.11693989599803	20/04/28 05:16:33
1	7	337.95472838037466	279.3607907716173	20/04/28 05:16:34
1	7	337.71104074362825	279.407886959888	20/04/28 05:16:34
1	7	337.66788966627894	279.4324287307947	20/04/28 05:16:34
1	7	337.4391023324342	279.26316095237604	20/04/28 05:16:34
1	7	337.2455982129376	279.3974728755019	20/04/28 05:16:34
1	7	337.45343146992195	279.34705486178063	20/04/28 05:16:34
1	7	337.54307619790586	279.1178628302478	20/04/28 05:16:34
1	7	337.43536852171593	279.0872757841582	20/04/28 05:16:34
1	7	337.44050529613304	278.80991671511816	20/04/28 05:16:34
1	7	337.4628423243607	278.8522987661066	20/04/28 05:16:35
1	7	337.57559727677136	278.9364111491568	20/04/28 05:16:35
1	7	337.6158857144553	279.0499935970521	20/04/28 05:16:35
1	7	337.6380334686254	279.03789371470543	20/04/28 05:16:35
1	7	337.6086210434872	278.898035521361	20/04/28 05:16:35
1	7	337.42483012302483	278.97971335296523	20/04/28 05:16:35
1	7	337.4461033895962	278.88575892301174	20/04/28 05:16:35
1	7	337.4325544364245	278.88061110151364	20/04/28 05:16:35
1	7	337.66455735629535	278.81558722184013	20/04/28 05:16:35
1	7	337.8260180452493	278.7124992919234	20/04/28 05:16:35
1	7	337.80600199188024	278.7081265588694	20/04/28 05:16:36
1	7	337.7672455537678	278.8253368989676	20/04/28 05:16:36
1	7	338.0160623147055	278.96251726391426	20/04/28 05:16:36
1	7	337.9665820678757	278.75283943854737	20/04/28 05:16:36
1	7	338.0522147717597	278.7528361729519	20/04/28 05:16:36
1	7	338.07941223068764	278.8254191810786	20/04/28 05:16:36
1	7	338.0743675062842	279.01973869262633	20/04/28 05:16:36
1	7	338.0743675062842	279.01973869262633	20/04/28 05:16:36
1	7	338.0756976168422	279.015477310035	20/04/28 05:16:36
1	7	337.9899994840033	279.00903488332966	20/04/28 05:16:36
1	7	337.98559141689293	278.99604229175316	20/04/28 05:16:37
1	7	337.9348818625596	278.978462323973	20/04/28 05:16:37
1	7	338.116265947643	279.0683189293397	20/04/28 05:16:37
1	7	338.26563869365725	279.19040721549027	20/04/28 05:16:37
1	7	338.2753010398454	279.102644237502	20/04/28 05:16:37
1	7	338.3750826418199	279.1808663678624	20/04/28 05:16:37
1	7	338.127572015741	279.03038775432185	20/04/28 05:16:37
1	7	338.0263562282097	278.97071566427877	20/04/28 05:16:37
1	7	337.90932192173466	278.7939328132856	20/04/28 05:16:37
1	7	337.6887998292933	278.8454531979845	20/04/28 05:16:38
1	7	337.53479193125673	278.7114581037011	20/04/28 05:16:38
1	7	337.71833077520154	278.8924231092366	20/04/28 05:16:38
1	7	337.56416120907176	278.8947202950607	20/04/28 05:16:38
1	7	337.3275755059104	279.0569646225617	20/04/28 05:16:38
1	7	337.3620380029873	279.2078381291804	20/04/28 05:16:38
1	7	337.41121217114176	279.20171963791955	20/04/28 05:16:38
1	7	337.4538404377438	279.1063765544282	20/04/28 05:16:38
1	7	337.3653852117009	279.2801258196943	20/04/28 05:16:38
1	7	337.34989869809266	279.1761523929289	20/04/28 05:16:38
1	7	337.2339488404798	279.0835237151429	20/04/28 05:16:39
1	7	337.4770997447779	279.03681552195025	20/04/28 05:16:39
1	7	337.4114062243423	278.99898782675854	20/04/28 05:16:39
1	7	337.2939120823012	279.07653410104683	20/04/28 05:16:39
1	7	337.38915405854874	279.0890735481807	20/04/28 05:16:39
1	7	337.35530255833015	279.0958440615051	20/04/28 05:16:39
1	7	337.31928470023723	279.0897688215933	20/04/28 05:16:39
1	7	337.3149399777584	279.15854084099595	20/04/28 05:16:39
1	7	337.33785397467153	279.20612816985505	20/04/28 05:16:39
1	7	337.2663814328341	279.3623891296519	20/04/28 05:16:39
1	7	337.2014958688415	279.31938803911856	20/04/28 05:16:40
1	7	337.2212550978107	279.3081272983312	20/04/28 05:16:40
1	7	337.3102125103917	279.39414642873464	20/04/28 05:16:40
1	7	337.40922845581173	279.6124546276906	20/04/28 05:16:40
1	7	337.2562842001913	279.59365188251263	20/04/28 05:16:40
1	7	337.23588879712446	279.5026335950981	20/04/28 05:16:40
1	7	337.25144874249366	279.5535705700743	20/04/28 05:16:40
1	7	337.25754547321134	279.551129183665	20/04/28 05:16:40
1	7	337.4461819954189	279.78359149499835	20/04/28 05:16:40
1	7	337.59604653459775	279.72166837581807	20/04/28 05:16:41
1	7	337.41308621123756	279.6986614236288	20/04/28 05:16:41
1	7	337.44383202912024	279.64641228252964	20/04/28 05:16:41
1	7	337.5767456083769	279.4263881680188	20/04/28 05:16:41
1	7	337.5805856390626	279.21936838065653	20/04/28 05:16:41
1	7	337.61518688755285	279.22061289680937	20/04/28 05:16:41
1	7	337.67073323728863	279.08324108535163	20/04/28 05:16:41
1	7	337.7713933012003	279.0288031888384	20/04/28 05:16:41
1	7	337.9099396909302	279.00267071483313	20/04/28 05:16:41
1	7	337.7347314940493	278.87182076233466	20/04/28 05:16:41
1	7	337.81811547687056	278.8619941505025	20/04/28 05:16:42
1	7	337.8164970449245	278.90816354826427	20/04/28 05:16:42
1	7	337.87422147291625	278.9092263312547	20/04/28 05:16:42
1	7	337.86368315956037	279.03087834388526	20/04/28 05:16:42
1	7	338.15894725895123	279.06574032253724	20/04/28 05:16:42
1	7	338.0719058256119	278.8778956453309	20/04/28 05:16:42
1	7	338.1050858265992	278.9978819907821	20/04/28 05:16:42
1	7	338.24116801055067	278.9505481932163	20/04/28 05:16:42
1	7	338.0370093675539	278.8202343187585	20/04/28 05:16:42
1	7	338.0542351088508	278.5605207341213	20/04/28 05:16:42
1	7	337.87292400442254	278.63538289976884	20/04/28 05:16:43
1	7	337.9883665271727	278.62853127509726	20/04/28 05:16:43
1	7	338.01031143360836	278.5738362014047	20/04/28 05:16:43
1	7	338.23692010800073	278.61403079975537	20/04/28 05:16:43
1	7	338.3003085991475	278.5502508196748	20/04/28 05:16:43
1	7	338.17954431614555	278.37601450330067	20/04/28 05:16:43
1	7	338.2927818097616	278.3035674223432	20/04/28 05:16:43
1	7	338.3727002837134	278.52481113833386	20/04/28 05:16:43
1	7	338.41111468024576	278.2467966860783	20/04/28 05:16:43
1	7	338.4364658388855	278.2572565682072	20/04/28 05:16:44
1	7	338.6066522554019	278.25615548929613	20/04/28 05:16:44
1	7	338.55655899864047	278.2644560026901	20/04/28 05:16:44
1	7	338.5537276105595	278.2721600715504	20/04/28 05:16:44
1	7	338.5827504594174	278.40146727600944	20/04/28 05:16:44
1	7	338.6961156305424	278.5685601155381	20/04/28 05:16:44
1	7	338.59729159637715	278.63541085062576	20/04/28 05:16:44
1	7	338.4629999066882	278.5234375876647	20/04/28 05:16:44
1	7	338.19788411011604	278.4823810173155	20/04/28 05:16:44
1	7	337.99679375039494	278.38476550143395	20/04/28 05:16:44
1	7	338.04299435576166	278.4359538677349	20/04/28 05:16:45
1	7	338.0461957415388	278.4382527152151	20/04/28 05:16:45
1	7	338.3362010676215	278.3936659775027	20/04/28 05:16:45
1	7	338.3102122049308	278.405616334159	20/04/28 05:16:45
1	7	338.60597841368724	278.3955407928035	20/04/28 05:16:45
1	7	338.6037178999921	278.30930593657166	20/04/28 05:16:45
1	7	338.69594507325945	278.1408418995856	20/04/28 05:16:45
1	7	338.69686213042274	278.14184520642715	20/04/28 05:16:45
1	7	338.4454233623256	278.1601865912435	20/04/28 05:16:45
1	7	338.5323941147497	278.0924265556228	20/04/28 05:16:45
1	7	338.50861399281996	277.8994534536949	20/04/28 05:16:46
1	7	338.5081989706279	277.9265806153252	20/04/28 05:16:46
1	7	338.46412311941396	278.0567818369998	20/04/28 05:16:46
1	7	338.46412311941396	278.0567818369998	20/04/28 05:16:46
1	7	338.46412311941396	278.0567818369998	20/04/28 05:16:46
1	7	338.430122131142	278.0422494734332	20/04/28 05:16:46
1	7	338.23447630089004	278.12956112223844	20/04/28 05:16:46
1	7	338.50290181037593	278.19917167143467	20/04/28 05:16:46
1	7	338.50290181037593	278.19917167143467	20/04/28 05:16:46
1	7	338.33516033282115	278.13150066538714	20/04/28 05:16:47
1	7	338.560360936757	278.13140795297085	20/04/28 05:16:47
1	7	338.71165821239106	278.0610283486673	20/04/28 05:16:47
1	7	338.71165821239106	278.0610283486673	20/04/28 05:16:47
1	7	338.6275066413914	277.91776843002816	20/04/28 05:16:47
1	7	338.6237025774244	277.91948553478403	20/04/28 05:16:47
1	7	338.7290941507501	277.8749933723339	20/04/28 05:16:47
1	7	338.716282686237	277.77344351523993	20/04/28 05:16:47
1	7	338.7556400688631	277.8536572741554	20/04/28 05:16:47
1	7	338.88689674097594	277.62969750275226	20/04/28 05:16:47
1	7	338.8615977663637	277.57920037901476	20/04/28 05:16:48
1	7	339.03438771597615	277.3682725590981	20/04/28 05:16:48
1	7	339.0230699421525	277.2074830531648	20/04/28 05:16:48
1	7	339.0076595659213	277.4565961508307	20/04/28 05:16:48
1	7	339.0076595659213	277.4565961508307	20/04/28 05:16:48
1	7	339.0076595659213	277.4565961508307	20/04/28 05:16:48
1	7	338.9604738871962	277.5915412499333	20/04/28 05:16:48
1	7	338.873781718491	277.60685441334266	20/04/28 05:16:48
1	7	339.00004587870944	277.56885819920666	20/04/28 05:16:48
1	7	338.9859382005621	277.58390936104155	20/04/28 05:16:48
1	7	338.98592332518075	277.5839107128103	20/04/28 05:16:49
1	7	339.1212843315401	277.4064898757758	20/04/28 05:16:49
1	7	339.1212843315401	277.4064898757758	20/04/28 05:16:49
1	7	339.12365175600075	277.44363161524967	20/04/28 05:16:49
1	7	339.1723831101852	277.5086909302475	20/04/28 05:16:49
1	7	339.0623956893838	277.45982858982603	20/04/28 05:16:49
1	7	338.9205577819378	277.73231855251885	20/04/28 05:16:49
1	7	338.86591373048617	277.7636142482655	20/04/28 05:16:49
1	7	338.62083651328476	277.6622877557477	20/04/28 05:16:49
1	7	338.51614435473397	277.665049449469	20/04/28 05:16:50
1	7	338.51614435473397	277.665049449469	20/04/28 05:16:50
1	7	338.43351463633155	277.76590831159206	20/04/28 05:16:50
1	7	338.6084744461428	277.9386870178078	20/04/28 05:16:50
1	7	338.6787437944585	278.0294385423998	20/04/28 05:16:50
1	7	338.64097837096597	278.2074991658768	20/04/28 05:16:50
1	7	338.8323620007002	278.00074173082095	20/04/28 05:16:50
1	7	338.8504044044211	278.0983524926663	20/04/28 05:16:50
1	7	338.8504044044211	278.0983524926663	20/04/28 05:16:50
1	7	338.80399558530354	278.0194558238397	20/04/28 05:16:50
1	7	338.6487528668931	278.1019946349091	20/04/28 05:16:51
1	7	338.6487528668931	278.1019946349091	20/04/28 05:16:51
1	7	338.79691308027674	278.05488908321945	20/04/28 05:16:51
1	7	339.03825969630043	277.9781561652748	20/04/28 05:16:51
1	7	339.29342098596385	277.8970310572249	20/04/28 05:16:51
1	7	339.4779738018804	277.83835496591075	20/04/28 05:16:51
1	7	339.66423312873206	277.77913631234435	20/04/28 05:16:51
1	7	339.83904516618867	277.7235571708304	20/04/28 05:16:51
1	7	340.10561965557537	277.6388033890818	20/04/28 05:16:51
1	7	340.2691455738261	277.5868125177214	20/04/28 05:16:51
1	7	340.50630115105326	277.5114120843227	20/04/28 05:16:52
1	7	340.68694484164877	277.45397884694796	20/04/28 05:16:52
1	7	340.8515183529277	277.40165490744187	20/04/28 05:16:52
1	7	341.00107527464763	277.35410529107907	20/04/28 05:16:52
1	83	341.26005643375214	277.23527026815634	20/04/28 05:16:52
1	83	341.3495998671182	277.01181472140746	20/04/28 05:16:52
1	83	341.41336050848025	276.85270010584003	20/04/28 05:16:52
1	83	341.5117685028596	276.6071230561126	20/04/28 05:16:52
1	83	341.5979388306034	276.39208509100774	20/04/28 05:16:52
1	83	341.69225061297	276.1567301341855	20/04/28 05:16:53
1	83	341.780864680024	275.9355938201215	20/04/28 05:16:53
1	83	341.8431420645265	275.7801806705363	20/04/28 05:16:53
1	83	341.9443859585601	275.5275266361106	20/04/28 05:16:53
1	83	342.02456618237267	275.3274369692643	20/04/28 05:16:53
1	83	342.1146285666505	275.10268638104367	20/04/28 05:16:53
1	83	342.20200971593556	274.8846268120161	20/04/28 05:16:53
1	83	342.3044658435597	274.6289476499001	20/04/28 05:16:53
1	83	342.38766387652066	274.42132704339815	20/04/28 05:16:53
1	83	342.4586591537732	274.2441584013359	20/04/28 05:16:53
1	83	342.5474888130995	274.02248407697607	20/04/28 05:16:54
1	83	342.65798022210623	273.74675287835515	20/04/28 05:16:54
1	83	342.65798022210623	273.74675287835515	20/04/28 05:16:54
1	83	342.7315852993327	273.56307148311646	20/04/28 05:16:54
1	83	342.79058740447164	273.41583178984655	20/04/28 05:16:54
1	83	342.8814022441471	273.18920344994757	20/04/28 05:16:54
1	83	342.9642933440098	272.9823487946798	20/04/28 05:16:54
1	83	343.0322266586132	272.8128212772893	20/04/28 05:16:54
1	83	343.1192716282467	272.5956006442398	20/04/28 05:16:54
1	83	343.21685040424546	272.3520929081363	20/04/28 05:16:54
1	83	343.3123791142369	272.1137011096659	20/04/28 05:16:55
1	83	343.41296057236616	271.86270018336455	20/04/28 05:16:55
1	83	343.5009577119916	271.6431034110702	20/04/28 05:16:55
1	83	343.5892529474236	271.4227627409942	20/04/28 05:16:55
1	83	343.6713059415071	271.21799957784447	20/04/28 05:16:55
1	83	343.7698288718681	270.9721357054919	20/04/28 05:16:55
1	83	343.859185830158	270.74914550710554	20/04/28 05:16:55
1	83	343.93863382242836	270.5508831233269	20/04/28 05:16:55
1	83	344.00409151340165	270.3875335221834	20/04/28 05:16:55
1	83	344.06152703016437	270.24420324861035	20/04/28 05:16:56
1	83	344.145485799747	270.03468422464397	20/04/28 05:16:56
1	83	344.2386214505547	269.80226430292873	20/04/28 05:16:56
1	88	344.30529771532406	269.73236024880003	20/04/28 05:16:56
1	88	344.3568866128628	269.9518837724655	20/04/28 05:16:56
1	88	344.41602433229093	270.2035294010747	20/04/28 05:16:56
1	88	344.4734988664507	270.44809776484544	20/04/28 05:16:56
1	88	344.5349711285587	270.70967745019334	20/04/28 05:16:56
1	88	344.5598564313321	270.81557057086326	20/04/28 05:16:56
1	88	344.54849836665363	270.7967961718777	20/04/28 05:16:56
1	88	344.5004574588357	270.93880338143157	20/04/28 05:16:57
1	88	344.5134900739516	270.8683663269984	20/04/28 05:16:57
1	88	344.5346449138601	270.7858963138777	20/04/28 05:16:57
1	88	344.56368926312615	270.80109672417086	20/04/28 05:16:57
1	88	344.56440003836445	270.89416819393256	20/04/28 05:16:57
1	88	344.7223720734704	270.66681773089744	20/04/28 05:16:57
1	88	344.7344710783966	270.6447416657054	20/04/28 05:16:57
1	88	344.98183714513635	270.57731072131423	20/04/28 05:16:57
1	88	344.77612866030074	270.5565956075794	20/04/28 05:16:57
1	88	345.02550810665673	270.638858746114	20/04/28 05:16:57
1	88	344.83931062547066	270.60507001249493	20/04/28 05:16:58
1	88	344.9300101662761	270.7607259985836	20/04/28 05:16:58
1	88	344.9648403820265	270.7915890682723	20/04/28 05:16:58
1	88	344.87626856397895	270.68318682304476	20/04/28 05:16:58
1	88	344.7989085904679	270.7416300038215	20/04/28 05:16:58
1	88	344.9934822021464	270.75087101977033	20/04/28 05:16:58
1	88	345.15149153759285	270.9245157337524	20/04/28 05:16:58
1	88	345.15589948085386	271.1405555508726	20/04/28 05:16:58
1	88	345.1637835622898	271.1032076776894	20/04/28 05:16:58
1	88	345.178592739046	271.1468519337069	20/04/28 05:16:58
1	88	345.1091539603924	271.11983342785567	20/04/28 05:16:59
1	88	344.9848258472936	271.1225151883477	20/04/28 05:16:59
1	88	345.1102072246012	271.20985238827615	20/04/28 05:16:59
1	88	345.0715565767885	271.2926807389309	20/04/28 05:16:59
1	88	345.1977938922203	271.54734853621824	20/04/28 05:16:59
1	88	345.3497828668735	271.34619452510356	20/04/28 05:16:59
1	88	345.5630617296744	271.26205419667974	20/04/28 05:16:59
1	88	345.6581593596055	270.99703431864845	20/04/28 05:16:59
1	88	345.7252329766062	271.1004379516997	20/04/28 05:16:59
1	88	345.7259395687147	271.0981770843418	20/04/28 05:17:00
1	88	345.5378851173428	271.08981165580286	20/04/28 05:17:00
1	88	345.42808979302833	271.10466131287166	20/04/28 05:17:00
1	88	345.14935958606173	271.0331526236205	20/04/28 05:17:00
1	88	344.96994253980614	271.009917380222	20/04/28 05:17:00
1	88	345.09390215734993	271.13267876523184	20/04/28 05:17:00
1	88	345.09390215734993	271.13267876523184	20/04/28 05:17:00
1	88	345.0921483083836	271.132774586509	20/04/28 05:17:00
1	88	345.01190696682136	271.1278857596375	20/04/28 05:17:00
1	88	345.1938971251777	271.0609241737847	20/04/28 05:17:00
1	88	345.19558060809	271.1415354264016	20/04/28 05:17:01
1	88	345.0739509106837	271.13108356422015	20/04/28 05:17:01
1	88	345.063750375106	271.1105776073247	20/04/28 05:17:01
1	88	344.91857487677487	270.95069713608893	20/04/28 05:17:01
1	88	345.021080507516	271.1990214524799	20/04/28 05:17:01
1	88	345.17419490501686	271.15315951328733	20/04/28 05:17:01
1	88	345.168431294842	270.8986549101539	20/04/28 05:17:01
1	88	345.0473148036276	270.81243075440614	20/04/28 05:17:01
1	88	345.0131672562739	270.83414607661024	20/04/28 05:17:01
1	88	345.00605695420677	270.9818464486893	20/04/28 05:17:01
1	88	344.81832646354184	270.83898806441664	20/04/28 05:17:02
1	88	344.81832646354184	270.83898806441664	20/04/28 05:17:02
1	88	344.62378164935313	270.7772298290406	20/04/28 05:17:02
1	88	344.5890536141546	270.5471275963125	20/04/28 05:17:02
1	88	344.70144920012456	270.41105264361056	20/04/28 05:17:02
1	88	344.74752837619496	270.14971398743637	20/04/28 05:17:02
1	88	344.7670654386802	270.1104489570027	20/04/28 05:17:02
1	88	344.7105448252031	270.2158791719474	20/04/28 05:17:02
1	88	344.7105448252031	270.2158791719474	20/04/28 05:17:02
1	88	344.5909783815356	269.91849383861467	20/04/28 05:17:02
1	88	344.6658853442978	269.90839965402955	20/04/28 05:17:03
1	88	344.8093861715108	269.8110347530252	20/04/28 05:17:03
1	88	345.01577179689116	269.97341610875844	20/04/28 05:17:03
1	88	344.9439874013159	270.13168915608435	20/04/28 05:17:03
1	88	345.13997384423715	269.9819886097243	20/04/28 05:17:03
1	88	345.13997384423715	269.9819886097243	20/04/28 05:17:03
1	88	345.1896698812335	270.0205621251505	20/04/28 05:17:03
1	88	345.20068559674826	269.95314857889616	20/04/28 05:17:03
1	88	345.1034022386822	270.18946682897047	20/04/28 05:17:03
1	88	345.3555022364113	270.3449173243502	20/04/28 05:17:04
1	88	345.4997254510894	270.46943130425916	20/04/28 05:17:04
1	88	345.51623176580415	270.2554237558116	20/04/28 05:17:04
1	88	345.4359437559544	270.2821884705417	20/04/28 05:17:04
1	88	345.26683328080253	270.0632073484321	20/04/28 05:17:04
1	88	345.09863881679024	269.85513386484064	20/04/28 05:17:04
1	88	345.0001675148476	269.7173214972063	20/04/28 05:17:04
1	88	345.12852492448394	269.78583953246505	20/04/28 05:17:04
1	88	345.34405778877465	269.8075365405019	20/04/28 05:17:04
1	88	345.2182336639885	269.7798518176504	20/04/28 05:17:04
1	88	345.13913512484163	269.88434406848	20/04/28 05:17:05
1	88	345.22743944107566	269.9137576319634	20/04/28 05:17:05
1	88	345.2546210190725	270.1819335199197	20/04/28 05:17:05
1	88	345.36246076158216	270.1249157204476	20/04/28 05:17:05
1	88	345.18143025500166	270.0098602386005	20/04/28 05:17:05
1	88	345.14178726161316	270.093007873062	20/04/28 05:17:05
1	88	345.19242874582505	270.0268575642769	20/04/28 05:17:05
1	88	345.24171899035736	270.01999923243085	20/04/28 05:17:05
1	88	345.2949340646159	270.2217154506076	20/04/28 05:17:05
1	88	345.27659280849787	270.26212811726487	20/04/28 05:17:05
1	88	345.31311229831044	270.26926497939985	20/04/28 05:17:06
1	88	345.17801168201254	270.2878797705279	20/04/28 05:17:06
1	88	345.17416075016877	270.2923545675339	20/04/28 05:17:06
1	88	345.0178483588689	270.2489252937842	20/04/28 05:17:06
1	88	345.08263338587614	270.3453379053672	20/04/28 05:17:06
1	88	345.02833306376755	270.3770372831299	20/04/28 05:17:06
1	88	345.070532876405	270.3078850643438	20/04/28 05:17:06
1	88	345.03602400994424	270.4162128515909	20/04/28 05:17:06
1	88	344.98121703379456	270.2642685009885	20/04/28 05:17:06
1	88	344.88116242807007	270.3820259107605	20/04/28 05:17:07
1	88	344.6955257040947	270.3304956364115	20/04/28 05:17:07
1	88	344.7019644263743	270.33595855219784	20/04/28 05:17:07
1	88	344.5590198619712	270.30281535574903	20/04/28 05:17:07
1	88	344.65590780157453	270.19548985501456	20/04/28 05:17:07
1	88	344.5959107990968	270.117205155037	20/04/28 05:17:07
1	88	344.5719776515625	270.07552329482024	20/04/28 05:17:07
1	88	344.6388239816541	269.92212937963274	20/04/28 05:17:07
1	88	344.70837031440175	269.96139466447266	20/04/28 05:17:07
1	88	344.6836925466105	270.0244638802772	20/04/28 05:17:07
1	88	344.69639591810375	270.0601378740506	20/04/28 05:17:08
1	88	344.81872535055186	270.14329771681	20/04/28 05:17:08
1	88	344.7155083491314	270.14894019969586	20/04/28 05:17:08
1	88	344.90284420178335	269.96551087354595	20/04/28 05:17:08
1	88	344.7874499268085	269.8985519045322	20/04/28 05:17:08
1	88	344.8116898769968	269.831785083021	20/04/28 05:17:08
1	88	344.88639976656367	269.90505630400054	20/04/28 05:17:08
1	88	345.12383463601213	270.0078066513158	20/04/28 05:17:08
1	88	345.12071911397163	270.01623419697876	20/04/28 05:17:08
1	88	345.1687517970955	270.0363412628069	20/04/28 05:17:08
1	88	345.2102222749353	269.9945011141427	20/04/28 05:17:09
1	88	345.2651171750573	269.9577780933429	20/04/28 05:17:09
1	88	345.36994805013273	270.1024023161606	20/04/28 05:17:09
1	88	345.375781664392	269.9926222552691	20/04/28 05:17:09
1	88	345.2587555406946	270.2533801167755	20/04/28 05:17:09
1	88	345.3300268483876	270.47268600362605	20/04/28 05:17:09
1	88	345.3270298267807	270.44959820169254	20/04/28 05:17:09
1	88	345.27441543725007	270.524614697919	20/04/28 05:17:09
1	88	345.195303770293	270.46406016134245	20/04/28 05:17:09
1	88	345.1476783095089	270.225229653172	20/04/28 05:17:10
1	88	344.9691312228992	270.2993225298153	20/04/28 05:17:10
1	88	344.8953436890108	270.34782219836933	20/04/28 05:17:10
1	88	344.8433948945902	270.347517831445	20/04/28 05:17:10
1	88	344.7479043359159	270.5096275576838	20/04/28 05:17:10
1	88	344.8062986477855	270.4791584967791	20/04/28 05:17:10
1	88	344.72045707085766	270.24965137501704	20/04/28 05:17:10
1	88	344.73894324659733	270.2120975523686	20/04/28 05:17:10
1	88	344.5367482133673	270.35252023886426	20/04/28 05:17:10
1	88	344.5027630475237	270.4276959757136	20/04/28 05:17:10
1	88	344.6391130575324	270.2911646000493	20/04/28 05:17:11
1	88	344.5874103541737	270.5170854324484	20/04/28 05:17:11
1	88	344.5904450754296	270.48513543087523	20/04/28 05:17:11
1	88	344.5904450754296	270.48513543087523	20/04/28 05:17:11
1	88	344.611399157618	270.4005964394268	20/04/28 05:17:11
1	88	344.5159213484516	270.16206147641356	20/04/28 05:17:11
1	88	344.6687469507389	270.25583681596424	20/04/28 05:17:11
1	88	344.79498102584097	270.4272611702893	20/04/28 05:17:11
1	88	344.91183664976546	270.53568019494793	20/04/28 05:17:11
1	88	344.76601402324707	270.3861704673583	20/04/28 05:17:11
1	88	344.79123658211853	270.33563829854677	20/04/28 05:17:12
1	88	344.66998503689865	270.31939479186616	20/04/28 05:17:12
1	88	344.7736148271526	270.0674600730971	20/04/28 05:17:12
1	88	344.81738915508	270.299068319211	20/04/28 05:17:12
1	88	344.7180694647389	270.3854334531941	20/04/28 05:17:12
1	88	344.6662269846905	270.3989044485643	20/04/28 05:17:12
1	88	344.5193322711783	270.31596872915003	20/04/28 05:17:12
1	88	344.67116400673194	270.57343678865396	20/04/28 05:17:12
1	88	344.5416084686254	270.49050365078784	20/04/28 05:17:12
1	88	344.55390005648684	270.51436815990996	20/04/28 05:17:13
1	88	344.59523883540913	270.46245917500204	20/04/28 05:17:13
1	88	344.7108628861687	270.3558381101216	20/04/28 05:17:13
1	88	344.84515103262703	270.26499780595094	20/04/28 05:17:13
1	88	344.84109574104184	270.482493529506	20/04/28 05:17:13
1	88	344.9896654131534	270.56798573772977	20/04/28 05:17:13
1	88	344.9896654131534	270.56798573772977	20/04/28 05:17:13
1	88	344.79137258778763	270.4693569969213	20/04/28 05:17:13
1	88	344.78156720479114	270.44654146214	20/04/28 05:17:13
1	88	345.00715390392526	270.6087368593197	20/04/28 05:17:13
1	88	345.1086842991789	270.6590269234779	20/04/28 05:17:14
1	88	345.1752739201019	270.5793506270964	20/04/28 05:17:14
1	88	345.1752739201019	270.5793506270964	20/04/28 05:17:14
1	88	345.2096359275112	270.5538033562279	20/04/28 05:17:14
1	88	345.14525577250663	270.483964138349	20/04/28 05:17:14
1	88	345.2236359451339	270.305395990167	20/04/28 05:17:14
1	88	345.2368024470944	270.2849618606209	20/04/28 05:17:14
1	88	345.2432670377382	270.1395921585641	20/04/28 05:17:14
1	88	345.2432670377382	270.1395921585641	20/04/28 05:17:14
