stationId	t_start	t_end	t_max	timeStamp
22	20/04/28 05:17:35	20/04/28 05:17:35	20/04/28 05:17:35
63	20/04/28 05:17:37	20/04/28 05:17:38	20/04/28 05:17:38
33	20/04/28 05:17:40	20/04/28 05:17:40	20/04/28 05:17:40
35	20/04/28 05:17:42	20/04/28 05:17:42	20/04/28 05:17:42
22	20/04/28 05:17:44	20/04/28 05:17:44	20/04/28 05:17:44
112	20/04/28 05:17:46	20/04/28 05:17:46	20/04/28 05:17:46
64	20/04/28 05:17:48	20/04/28 05:17:48	20/04/28 05:17:48
64	20/04/28 05:17:50	20/04/28 05:17:50	20/04/28 05:17:50
33	20/04/28 05:17:52	20/04/28 05:17:53	20/04/28 05:17:53
75	20/04/28 05:17:55	20/04/28 05:17:55	20/04/28 05:17:55
63	20/04/28 05:17:57	20/04/28 05:17:57	20/04/28 05:17:57
64	20/04/28 05:17:59	20/04/28 05:17:59	20/04/28 05:17:59
108	20/04/28 05:18:01	20/04/28 05:18:01	20/04/28 05:18:01
33	20/04/28 05:18:03	20/04/28 05:18:03	20/04/28 05:18:03
71	20/04/28 05:18:05	20/04/28 05:18:05	20/04/28 05:18:05
71	20/04/28 05:18:07	20/04/28 05:18:07	20/04/28 05:18:07
55	20/04/28 05:18:09	20/04/28 05:18:09	20/04/28 05:18:09
135	20/04/28 05:18:11	20/04/28 05:18:11	20/04/28 05:18:11
33	20/04/28 05:18:13	20/04/28 05:18:13	20/04/28 05:18:13
110	20/04/28 05:18:15	20/04/28 05:18:15	20/04/28 05:18:15
64	20/04/28 05:18:17	20/04/28 05:18:17	20/04/28 05:18:17
64	20/04/28 05:18:19	20/04/28 05:18:19	20/04/28 05:18:19
71	20/04/28 05:18:21	20/04/28 05:18:21	20/04/28 05:18:21
64	20/04/28 05:18:23	20/04/28 05:18:23	20/04/28 05:18:23
18	20/04/28 05:18:25	20/04/28 05:18:25	20/04/28 05:18:25
55	20/04/28 05:18:27	20/04/28 05:18:27	20/04/28 05:18:27
55	20/04/28 05:18:29	20/04/28 05:18:29	20/04/28 05:18:29
135	20/04/28 05:18:31	20/04/28 05:18:31	20/04/28 05:18:31
33	20/04/28 05:18:33	20/04/28 05:18:33	20/04/28 05:18:33
18	20/04/28 05:18:35	20/04/28 05:18:35	20/04/28 05:18:35
64	20/04/28 05:18:37	20/04/28 05:18:37	20/04/28 05:18:37
108	20/04/28 05:18:39	20/04/28 05:18:39	20/04/28 05:18:39
110	20/04/28 05:18:41	20/04/28 05:18:41	20/04/28 05:18:41
135	20/04/28 05:18:43	20/04/28 05:18:43	20/04/28 05:18:43
63	20/04/28 05:18:45	20/04/28 05:18:45	20/04/28 05:18:45
18	20/04/28 05:18:47	20/04/28 05:18:47	20/04/28 05:18:47
