1055	Garagedør  U-verdi= 5.0 W/m2K - 2.000x2.100	Point2D.Double[340.8808522142302, 280.66247224501615]		002	001	[]
968	Innerdør v.  - 0.810x2.100	Point2D.Double[354.8557910188038, 280.38729162216185]		203	214	[]
971	Innerdør h.  - 0.810x2.100	Point2D.Double[342.7413457000255, 273.697236887614]		220	203	[]
980	Innerdør h.  - 0.810x2.100	Point2D.Double[340.60643883361485, 275.60608556297166]		218	203	[]
982	Innerdør v.  - 0.810x2.100	Point2D.Double[371.47806056976316, 280.4726232210795]		211	209	[]
983	Innerdør h.  - 0.810x2.100	Point2D.Double[356.503852711323, 281.80232852773014]		203	209	[]
987	Innerdør v.  - 0.810x2.100	Point2D.Double[357.5492553627835, 283.0951701608222]		204	209	[]
989	Innerdør            U-verdi= 2,0 W/m2K - 0.900x2.100	Point2D.Double[325.6831459781625, 283.14637122974784]		226	231	[]
990	Innerdør v.  - 0.810x2.100	Point2D.Double[361.600133251781, 283.095170164715]		205	209	[]
991	Innerdør h.  - 0.810x2.100	Point2D.Double[343.89960338230634, 279.5240919806887]		202	203	[]
992	Innerdør            U-verdi= 2,0 W/m2K - 0.900x2.100	Point2D.Double[373.55765232086185, 282.927387269338]		239	209	[]
998	Innerdør v.  - 0.810x2.100	Point2D.Double[365.58869806094435, 283.09517016378135]		206	209	[]
1004	Innerdør v.  - 0.810x2.100	Point2D.Double[313.7850766103739, 282.9870855021845]		226	229	[]
1007	Innerdør            U-verdi= 2,0 W/m2K - 0.908x2.100	Point2D.Double[327.6706596768865, 280.6394715602468]		226	219	[]
1008	Innerdør v.  - 0.810x2.100	Point2D.Double[331.5756755408235, 269.9395409486168]		220	223	[]
1009	Innerdør gj.gang    K-verdi= 2,0 W/m2K - 0.710x2.100	Point2D.Double[334.60700339552415, 280.6530281833595]		203	200	[]
1013	Innerdør            U-verdi= 2,0 W/m2K - 1.071x2.100	Point2D.Double[330.1573535718845, 281.806505224897]		226	203	[]
959	Innerdør            U-verdi= 2,0 W/m2K - 0.796x2.100	Point2D.Double[329.7542076174418, 273.697236887614]		220	219	[]
1023	Innerdør v.  - 0.810x2.100	Point2D.Double[317.782090179252, 282.9870854929135]		226	230	[]
1031	Innerdør gj.gang    K-verdi= 2,0 W/m2K - 0.959x2.100	Point2D.Double[346.8144945849125, 280.6398261107707]		240	203	[]
1033	Innerdør v.  - 0.810x2.100	Point2D.Double[309.8537616651529, 282.9870863029762]		226	228	[]
1035	Innerdør v.  - 0.810x2.100	Point2D.Double[323.61193704985584, 269.56775419048165]		224	220	[]
1036	Innerdør v.  - 0.810x2.100	Point2D.Double[354.87848210970566, 273.69723529815667]		213	221	[]
1037	Innerdør v.  - 0.810x2.100	Point2D.Double[339.6104706122152, 270.310048279127]		220	222	[]
1038	Innerdør v.  - 0.810x2.100	Point2D.Double[345.4134978005335, 275.240654253772]		203	216	[]
1039	Innerdør v.  - 0.810x2.100	Point2D.Double[369.546103946005, 283.0951701525393]		207	209	[]
1042	Innerdør v.  - 0.810x2.100	Point2D.Double[363.3762928708395, 280.4726232210795]		212	209	[]
1043	Innerdør v.  - 0.810x2.100	Point2D.Double[340.62066079497384, 279.46143414571014]		203	217	[]
1057	Innerdør v.  - 0.810x2.100	Point2D.Double[305.83428151620166, 282.98708630133115]		226	227	[]
1058	Innerdør v.  - 0.810x2.100	Point2D.Double[377.52322404225663, 280.47236731847136]		210	209	[]
963	Innerdør h.  - 0.810x2.100	Point2D.Double[320.4950394749918, 271.27295949929385]		220	225	[]
965	Innerdør h.  - 0.810x2.100	Point2D.Double[351.03606467056085, 280.387291347904]		203	215	[]
974	Innerdør            U-verdi= 2,0 W/m2K - 0.900x2.100	Point2D.Double[319.2151360252943, 280.6394716752005]		226	225	[]
1020	Innerdør h.  - 0.810x2.100	Point2D.Double[344.12040003776553, 293.7759380658468]		203	201	[]
967	Innerdør v.  - 0.810x2.100	Point2D.Double[359.4074134746915, 271.4051140041997]		325	313	[]
970	Innerdør v.  - 0.810x2.100	Point2D.Double[323.4574171622325, 271.40511082955817]		321	325	[]
975	Innerdør v.  - 0.810x2.100	Point2D.Double[326.60741614468134, 282.98893715460065]		334	325	[]
978	Innerdør h.  - 0.810x2.100	Point2D.Double[329.24074975089366, 273.8438084452973]		325	326	[]
981	Innerdør v.  - 0.810x2.100	Point2D.Double[355.40741132892435, 271.405114004133]		325	314	[]
994	Innerdør 2 fløyet   U-verdi= 2.0 W/m2K - 1.220x2.100	Point2D.Double[354.11575286229447, 273.70701045989983]		325	311	[]
996	Innerdør v.  - 0.810x2.100	Point2D.Double[340.6210745517528, 279.3072542592723]		302	300	[]
997	Innerdør v.  - 0.810x2.100	Point2D.Double[315.4740838931051, 271.4051092416745]		323	325	[]
999	Innerdør 2 fløyet   U-verdi= 2.0 W/m2K - 0.810x2.100	Point2D.Double[359.8907459640503, 280.40824623107915]		311	309	[]
1003	Innerdør            U-verdi= 2,0 W/m2K - 0.900x2.100	Point2D.Double[330.20062815374433, 281.629988452601]		300	325	[]
1010	Innerdør v.  - 0.810x2.100	Point2D.Double[343.90015659926166, 277.55725393978133]		349	300	[]
1014	Innerdør v.  - 0.810x2.100	Point2D.Double[351.06291184602816, 281.55725489245066]		300	309	[]
1015	Innerdør v.  - 0.810x2.100	Point2D.Double[362.25054156442917, 272.4239222242375]		325	309	[]
1016	Innerdør v.  - 0.810x2.100	Point2D.Double[308.4707910577079, 275.6405879109175]		329	325	[]
1017	Innerdør v.  - 0.810x2.100	Point2D.Double[351.4240790128435, 271.4051140055242]		325	315	[]
1018	Innerdør h.  - 0.810x2.100	Point2D.Double[342.59074772986753, 273.707010054873]		325	300	[]
958	Innerdør v.  - 0.810x2.100	Point2D.Double[345.2022716764253, 275.19058863588936]		300	305	[]
1022	Innerdør h.  - 0.810x2.100	Point2D.Double[340.62107455468134, 275.62392086236065]		300	301	[]
1025	Innerdør v.  - 0.810x2.100	Point2D.Double[317.77408249348684, 282.9885923066735]		333	325	[]
1026	Innerdør v.  - 0.810x2.100	Point2D.Double[345.4139109343685, 275.19058794051]		300	305	[]
1027	Innerdør v.  - 0.810x2.100	Point2D.Double[339.4407510975725, 271.40511241757434]		325	318	[]
1028	Innerdør v.  - 0.810x2.100	Point2D.Double[313.82408347895023, 282.98859231097833]		332	325	[]
1029	Innerdør v.  - 0.810x2.100	Point2D.Double[331.4074159526825, 280.40688803990685]		300	304	[]
1034	Innerdør v.  - 0.810x2.100	Point2D.Double[329.79074962136434, 271.4051108587983]		325	320	[]
1041	Innerdør gj.gang    K-verdi= 2,0 W/m2K - 1.220x2.100	Point2D.Double[334.14908014074547, 280.40624021951083]		303	300	[]
1044	Innerdør v.  - 0.810x2.100	Point2D.Double[343.4240801850683, 271.40511241618333]		325	317	[]
1047	Innerdør v.  - 0.810x2.100	Point2D.Double[319.44074916042183, 271.40511082803465]		325	322	[]
1048	Innerdør v.  - 0.810x2.100	Point2D.Double[367.4407510821025, 282.9288591066997]		309	307	[]
1052	Innerdør h.  - 0.810x2.100	Point2D.Double[372.5496512368465, 281.79061493744985]		308	309	[]
1053	Innerdør v.  - 0.810x2.100	Point2D.Double[367.47408039515034, 280.5315908972562]		310	309	[]
1056	Innerdør h.  - 0.810x2.100	Point2D.Double[308.4650004899943, 267.140587274845]		327	324	[]
1060	Innerdør v.  - 0.810x2.100	Point2D.Double[305.8407486197379, 282.98859310728017]		325	330	[]
1062	Innerdør v.  - 0.810x2.100	Point2D.Double[309.82408093581864, 282.988593105765]		331	325	[]
1063	Innerdør v.  - 0.810x2.100	Point2D.Double[335.4740825017022, 271.4051124204223]		325	319	[]
960	Innerdør h.  - 0.810x2.100	Point2D.Double[308.4650005266911, 272.7905877974155]		328	325	[]
962	Innerdør v.  - 0.810x2.100	Point2D.Double[347.45741692381364, 271.40511400837215]		325	316	[]
964	Innerdør v.  - 0.810x2.100	Point2D.Double[311.4240849733086, 271.405109237237]		324	325	[]
979	Innerdør gj.gang    K-verdi= 2,0 W/m2K - 1.140x2.100	Point2D.Double[347.23241791773415, 280.62347938797484]		300	350	[]
1051	Innerdør v.  - 0.810x2.100	Point2D.Double[355.4574136797587, 282.9288591066997]		306	309	[]
972	Innerdør v.  - 0.810x2.100	Point2D.Double[351.4431533082327, 271.23988679250084]		119	123	[]
973	Innerdør v.  - 0.810x2.100	Point2D.Double[355.4592951997122, 271.2398852030437]		119	122	[]
984	Innerdør h.  - 0.810x2.100	Point2D.Double[339.568316642623, 283.2621472099048]		108	102	[]
985	Innerdør v.  - 0.810x2.100	Point2D.Double[352.2842805245513, 287.00361531694244]		103	102	[]
986	Innerdør v.  - 1.023x2.100	Point2D.Double[349.672836151123, 273.69461269378667]		119	102	[]
988	Innerdør v.  - 0.810x2.100	Point2D.Double[377.62709189097086, 280.47000061670934]		116	115	[]
993	Innerdør h.  - 0.810x2.100	Point2D.Double[363.47826608657834, 273.69461269378667]		119	112	[]
995	Innerdør v.  - 0.810x2.100	Point2D.Double[371.51094961802164, 280.470001411438]		116	114	[]
1000	Innerdør v.  - 0.810x2.100	Point2D.Double[367.53060627619436, 280.470001411438]		116	113	[]
1001	Innerdør h.  - 0.810x2.100	Point2D.Double[335.3415208839483, 287.2444396226218]		106	108	[]
1005	Innerdør v.  - 0.810x2.100	Point2D.Double[351.7395565219422, 275.6112330192275]		110	102	[]
1006	Innerdør v.  - 0.810x2.100	Point2D.Double[363.470070845286, 271.2398852030437]		120	119	[]
1011	Innerdør h.  - 0.810x2.100	Point2D.Double[335.3415208772412, 283.26810846811634]		108	107	[]
1012	Innerdør v.  - 0.810x2.100	Point2D.Double[359.4646832211812, 271.2398852030437]		121	119	[]
1019	Innerdør v.  - 0.810x2.100	Point2D.Double[341.6774393483003, 280.37329247792565]		102	16	[]
1021	Innerdør v.  - 0.810x2.100	Point2D.Double[344.54888393491433, 272.7082746273435]		125	119	[]
1030	Innerdør h.  - 0.810x2.100	Point2D.Double[348.42297290159416, 275.1837222802378]		102	109	[]
1032	Innerdør v.  - 0.810x2.100	Point2D.Double[364.4426954931253, 281.61114861740367]		116	102	[]
1040	Innerdør v.  - 0.810x2.100	Point2D.Double[337.51572220166514, 288.3433347066244]		108	105	[]
1045	Innerdør v.  - 0.810x2.100	Point2D.Double[360.57609526952103, 288.00484767754875]		102	101	[]
1046	Innerdør h.  - 0.810x2.100	Point2D.Double[351.7395565587645, 279.327904486055]		102	111	[]
1050	Innerdør v.  - 0.810x2.100	Point2D.Double[347.4655939006805, 271.23988679250084]		119	124	[]
1054	Innerdør gj.gang    K-verdi= 2,0 W/m2K - 0.820x2.100	Point2D.Double[346.9320908053717, 280.28226982752483]		102	15	[]
1061	Innerdør v.  - 0.810x2.100	Point2D.Double[373.5405179578877, 283.0925481895383]		116	117	[]
961	Innerdør h.  - 0.810x2.100	Point2D.Double[367.51983133145336, 283.09254817320783]		116	118	[]
