floorId	partitionId	location_x	location_y	timeStamp
19	958	365.55243192741585	288.59648801263694	21/02/24 15:47:16
19	958	365.55243192741585	288.59648801263694	21/02/24 15:47:17
19	958	365.55243192741585	288.59648801263694	21/02/24 15:47:18
19	NULL	368.6441963719141	285.32200544753397	21/02/24 15:47:19
19	958	364.8238741505902	287.1482151372541	21/02/24 15:47:20
19	959	362.3530560401282	287.71527633822046	21/02/24 15:47:21
19	NULL	360.5547106147949	283.12207921272073	21/02/24 15:47:22
19	990	357.82242061436574	282.16385269148645	21/02/24 15:47:23
19	964	355.45075825430985	281.0224406867282	21/02/24 15:47:24
19	964	355.482293890607	282.3613173869535	21/02/24 15:47:25
19	964	355.482293890607	282.3613173869535	21/02/24 15:47:26
19	964	355.482293890607	282.3613173869535	21/02/24 15:47:27
19	964	349.72234002988336	284.71465847817086	21/02/24 15:47:28
19	964	349.72234002988336	284.71465847817086	21/02/24 15:47:29
19	915	340.4816646036116	277.3793474911017	21/02/24 15:47:30
19	915	340.4816646036116	277.3793474911017	21/02/24 15:47:31
19	915	336.5415648801153	280.3558442180772	21/02/24 15:47:32
19	955	332.13398995625107	274.9863189954403	21/02/24 15:47:33
19	955	328.92321811554416	278.4499778858854	21/02/24 15:47:34
19	955	328.92321811554416	278.4499778858854	21/02/24 15:47:35
19	955	328.92321811554416	278.4499778858854	21/02/24 15:47:36
19	955	328.92321811554416	278.4499778858854	21/02/24 15:47:37
19	NULL	322.7688919024709	282.9508947625264	21/02/24 15:47:38
19	NULL	322.7688919024709	282.9508947625264	21/02/24 15:47:39
19	897	319.01521359261704	283.59757186890573	21/02/24 15:47:40
19	897	319.01521359261704	283.59757186890573	21/02/24 15:47:41
19	897	319.01521359261704	283.59757186890573	21/02/24 15:47:42
19	897	319.01521359261704	283.59757186890573	21/02/24 15:47:43
19	897	319.01521359261704	283.59757186890573	21/02/24 15:47:44
19	897	319.01521359261704	283.59757186890573	21/02/24 15:47:45
19	897	319.01521359261704	283.59757186890573	21/02/24 15:47:46
19	897	319.01521359261704	283.59757186890573	21/02/24 15:47:47
19	897	319.9192972394814	288.14314324577873	21/02/24 15:47:48
19	897	319.9192972394814	288.14314324577873	21/02/24 15:47:49
19	897	319.01521359261704	283.59757186890573	21/02/24 15:47:50
19	897	319.01521359261704	283.59757186890573	21/02/24 15:47:51
19	897	319.01521359261704	283.59757186890573	21/02/24 15:47:52
19	897	319.01521359261704	283.59757186890573	21/02/24 15:47:53
19	897	319.01521359261704	283.59757186890573	21/02/24 15:47:54
19	897	319.01521359261704	283.59757186890573	21/02/24 15:47:55
19	897	319.01521359261704	283.59757186890573	21/02/24 15:47:56
19	897	319.01521359261704	283.59757186890573	21/02/24 15:47:57
19	897	319.01521359261704	283.59757186890573	21/02/24 15:47:58
19	897	319.01521359261704	283.59757186890573	21/02/24 15:47:59
