floorId	partitionId	location_x	location_y	timeStamp
19	900	325.24350674344265	264.32910465217833	21/02/21 12:24:02
19	900	325.15694865185566	264.56133180910206	21/02/21 12:24:02
19	900	325.0921649767029	264.7351402702172	21/02/21 12:24:02
19	900	325.0349413581533	264.88866581590594	21/02/21 12:24:02
19	900	324.98114670209964	265.0329917801686	21/02/21 12:24:02
19	900	324.89032347522505	265.2766618908771	21/02/21 12:24:02
19	900	324.7965377982577	265.5282799744437	21/02/21 12:24:02
19	900	324.73022573677594	265.70618895123977	21/02/21 12:24:02
19	900	324.6507050692776	265.91953536624555	21/02/21 12:24:02
19	900	324.55244541657686	266.1831567027219	21/02/21 12:24:02
19	900	324.47341708067404	266.3951822387133	21/02/21 12:24:03
19	900	324.38353582307093	266.6363251351336	21/02/21 12:24:03
19	900	324.30645573607814	266.84312370392814	21/02/21 12:24:03
19	900	324.21702248161733	267.08306465037333	21/02/21 12:24:03
19	900	324.1251116381566	267.32965273331297	21/02/21 12:24:03
19	900	324.02732869874757	267.5919950932042	21/02/21 12:24:03
19	900	323.94183672213745	267.82136196467695	21/02/21 12:24:03
19	900	323.8875675085068	267.9669611219467	21/02/21 12:24:03
19	900	323.7905949559579	268.2271292906897	21/02/21 12:24:03
19	900	323.7094054766921	268.4449529695201	21/02/21 12:24:04
19	900	323.63184087487616	268.6530514456693	21/02/21 12:24:04
19	900	323.53521475848294	268.91229015903707	21/02/21 12:24:04
19	900	323.44737331197166	269.1479604356036	21/02/21 12:24:04
19	900	323.3938055071251	269.29167777957565	21/02/21 12:24:04
19	900	323.33184235696166	269.4579190394356	21/02/21 12:24:04
19	900	323.33184235696166	269.4579190394356	21/02/21 12:24:04
19	909	323.16026927507664	269.65913002409474	21/02/21 12:24:04
19	909	322.97533427926476	269.8031958291719	21/02/21 12:24:04
19	909	322.81413701739433	269.92876975424565	21/02/21 12:24:04
19	909	322.63244342475184	270.07031048095604	21/02/21 12:24:05
19	909	322.44822715044864	270.2138163963686	21/02/21 12:24:05
19	909	322.26097414885334	270.3596879460421	21/02/21 12:24:05
19	909	322.05340148610657	270.5213886703389	21/02/21 12:24:05
19	909	321.9209675640018	270.6245557292495	21/02/21 12:24:05
19	909	321.6917230510925	270.80313899396265	21/02/21 12:24:05
19	909	321.543884180449	270.91830662801397	21/02/21 12:24:05
19	909	321.39635580859147	271.0332323810877	21/02/21 12:24:05
19	909	321.2665150737935	271.1343793268475	21/02/21 12:24:05
19	909	321.1411453664041	271.2320433073616	21/02/21 12:24:05
19	909	320.9058814749669	271.41531571492663	21/02/21 12:24:06
19	909	320.75367803940685	271.53388337911156	21/02/21 12:24:06
19	909	320.58812337015354	271.66285175854426	21/02/21 12:24:06
19	911	320.4805909537528	271.91036820767886	21/02/21 12:24:06
19	911	320.4669592101587	272.0658297664108	21/02/21 12:24:06
19	911	320.44620272576833	272.3025445633719	21/02/21 12:24:06
19	911	320.43070376572945	272.4793005645193	21/02/21 12:24:06
19	911	320.40918517457084	272.7247067152531	21/02/21 12:24:06
19	911	320.3925507343132	272.9144121621917	21/02/21 12:24:06
19	911	320.3789121344045	273.0699519129273	21/02/21 12:24:06
19	911	320.3789121344045	273.0699519129273	21/02/21 12:24:07
19	911	320.34218077095437	273.48885027151726	21/02/21 12:24:07
19	911	320.34218077095437	273.48885027151726	21/02/21 12:24:07
19	911	320.32760261266264	273.6551051013432	21/02/21 12:24:07
19	911	320.3035737564873	273.92913926357363	21/02/21 12:24:07
19	911	320.3035737564873	273.92913926357363	21/02/21 12:24:07
19	911	320.2784985398352	274.2151065163576	21/02/21 12:24:07
19	911	320.25390955177676	274.4955286343945	21/02/21 12:24:07
19	911	320.2301536883171	274.76644948446443	21/02/21 12:24:07
19	911	320.2060954526059	275.0408187020315	21/02/21 12:24:08
19	911	320.16903178357944	275.46350679907346	21/02/21 12:24:08
19	911	320.1536177354274	275.63929443295416	21/02/21 12:24:08
19	911	320.1294211133707	275.9152418607358	21/02/21 12:24:08
19	911	320.1128594807671	276.10411698165626	21/02/21 12:24:08
19	911	320.1128594807671	276.10411698165626	21/02/21 12:24:08
19	911	320.06963881118224	276.597021841309	21/02/21 12:24:08
19	911	320.04856590904893	276.8373451858634	21/02/21 12:24:08
19	911	320.03314557336944	277.0132045250846	21/02/21 12:24:08
19	911	320.01571998897884	277.21193247888317	21/02/21 12:24:08
19	911	319.9903265115471	277.50152929794734	21/02/21 12:24:09
19	911	319.976084829992	277.6639468198316	21/02/21 12:24:09
19	911	319.95070302908164	277.9534104754302	21/02/21 12:24:09
19	911	319.9295249603873	278.19493317921456	21/02/21 12:24:09
19	911	319.9295249603873	278.19493317921456	21/02/21 12:24:09
19	911	319.8926898328362	278.6150149028499	21/02/21 12:24:09
19	911	319.8926898328362	278.6150149028499	21/02/21 12:24:09
19	911	319.87605744752824	278.80469691436537	21/02/21 12:24:09
19	911	319.85099116070984	279.0905623279493	21/02/21 12:24:09
19	911	319.8345692828393	279.2778436330463	21/02/21 12:24:09
19	911	319.81424964869655	279.50957642459093	21/02/21 12:24:10
19	911	319.79600499470007	279.71764535790277	21/02/21 12:24:10
19	911	319.77176316417547	279.99410836014744	21/02/21 12:24:10
19	911	319.7491599066973	280.2518844557516	21/02/21 12:24:10
19	911	319.72693233392386	280.5053761009194	21/02/21 12:24:10
19	911	319.7067146943548	280.65316794527064	21/02/21 12:24:10
19	911	319.6246408165534	280.7860506445059	21/02/21 12:24:10
19	911	319.4792636381151	281.0214253142008	21/02/21 12:24:10
19	911	319.34499172211	281.2388198751526	21/02/21 12:24:10
19	911	319.34499172211	281.2388198751526	21/02/21 12:24:10
19	911	319.2383195086474	281.4115288056678	21/02/21 12:24:11
19	911	319.0945305459511	281.64433205555883	21/02/21 12:24:11
19	911	319.00670736537654	281.7865232326153	21/02/21 12:24:11
19	911	318.8886667127638	281.9776383713033	21/02/21 12:24:11
19	911	318.7484095561398	282.204723408084	21/02/21 12:24:11
19	911	318.6025412128861	282.44089330408224	21/02/21 12:24:11
19	911	318.45188740734056	282.684811160375	21/02/21 12:24:11
19	911	318.3358149476151	282.87273967269067	21/02/21 12:24:11
19	897	318.35314847495283	283.0853205497136	21/02/21 12:24:11
19	897	318.54338381653264	283.29778246014473	21/02/21 12:24:12
19	897	318.71347642765573	283.48774821944755	21/02/21 12:24:12
19	897	318.8280861081006	283.61574857657894	21/02/21 12:24:12
19	897	318.99634442680735	283.803665729835	21/02/21 12:24:12
19	897	319.18322510685334	284.0123810293978	21/02/21 12:24:12
19	897	319.32865187090465	284.17479905257676	21/02/21 12:24:12
19	897	319.50480863610244	284.3715374848706	21/02/21 12:24:12
19	897	319.6649430530682	284.5503815622738	21/02/21 12:24:12
19	897	319.76821398643716	284.665718384619	21/02/21 12:24:12
19	897	319.90894979380744	284.82289737276943	21/02/21 12:24:12
