floorId	partitionId	location_x	location_y	timeStamp
1	16	330.71128525095463	290.0288388939632	20/04/28 05:11:37
1	16	330.71128525095463	290.0288388939632	20/04/28 05:11:38
1	16	330.71128525095463	290.0288388939632	20/04/28 05:11:39
1	16	330.71128525095463	290.0288388939632	20/04/28 05:11:40
1	16	330.71128525095463	290.0288388939632	20/04/28 05:11:41
1	16	330.71128525095463	290.0288388939632	20/04/28 05:11:42
1	16	330.71128525095463	290.0288388939632	20/04/28 05:11:43
1	16	330.71128525095463	290.0288388939632	20/04/28 05:11:44
1	50	327.6844095055158	288.5207594301078	20/04/28 05:11:45
1	50	327.6844095055158	288.5207594301078	20/04/28 05:11:46
1	16	330.71128525095463	290.0288388939632	20/04/28 05:11:47
1	NULL	329.51418849486976	287.81038907531865	20/04/28 05:11:48
1	50	327.6844095055158	288.5207594301078	20/04/28 05:11:49
1	50	327.6844095055158	288.5207594301078	20/04/28 05:11:50
1	50	327.6844095055158	288.5207594301078	20/04/28 05:11:51
1	50	327.6844095055158	288.52075943010783	20/04/28 05:11:52
1	50	327.6844095055158	288.52075943010783	20/04/28 05:11:53
1	50	327.6844095055158	288.5207594301078	20/04/28 05:11:54
1	50	327.6844095055158	288.5207594301078	20/04/28 05:11:55
1	50	327.6844095055158	288.5207594301078	20/04/28 05:11:56
1	50	327.6844095055158	288.5207594301078	20/04/28 05:11:57
1	50	327.6844095055158	288.52075943010783	20/04/28 05:11:58
1	50	327.6844095055158	288.52075943010783	20/04/28 05:11:59
1	50	327.6844095055158	288.52075943010783	20/04/28 05:12:00
1	50	327.6844095055158	288.52075943010783	20/04/28 05:12:01
1	50	327.6844095055158	288.52075943010783	20/04/28 05:12:02
1	50	327.6844095055158	288.52075943010783	20/04/28 05:12:03
1	50	327.6844095055158	288.52075943010783	20/04/28 05:12:04
1	59	325.9232207888915	287.3354881525654	20/04/28 05:12:05
1	59	325.9232207888915	287.3354881525654	20/04/28 05:12:06
1	50	327.6844095055158	288.52075943010783	20/04/28 05:12:07
1	59	327.24666432405417	286.5327323121273	20/04/28 05:12:08
1	59	325.9232207888915	287.3354881525654	20/04/28 05:12:09
1	59	325.9232207888915	287.3354881525654	20/04/28 05:12:10
1	50	327.6844095055158	288.52075943010783	20/04/28 05:12:11
1	50	327.6844095055158	288.52075943010783	20/04/28 05:12:12
1	50	327.6844095055158	288.52075943010783	20/04/28 05:12:13
1	50	327.6844095055158	288.52075943010783	20/04/28 05:12:14
1	59	325.9232207888915	287.3354881525654	20/04/28 05:12:15
1	50	327.6844095055158	288.52075943010783	20/04/28 05:12:16
1	59	325.9232207888915	287.3354881525654	20/04/28 05:12:17
1	59	325.9232207888915	287.3354881525654	20/04/28 05:12:18
1	50	327.6844095055158	288.52075943010783	20/04/28 05:12:19
1	50	327.6844095055158	288.52075943010783	20/04/28 05:12:20
1	59	325.9232207888915	287.3354881525654	20/04/28 05:12:21
1	50	327.6844095055158	288.52075943010783	20/04/28 05:12:22
1	50	327.6844095055158	288.52075943010783	20/04/28 05:12:23
1	50	327.6844095055158	288.52075943010783	20/04/28 05:12:24
1	50	324.9201609604908	290.69669688883477	20/04/28 05:12:25
1	50	325.82176653676186	290.66965224740585	20/04/28 05:12:26
1	93	325.32504216255245	294.1232464693243	20/04/28 05:12:27
1	93	325.32504216255245	294.1232464693243	20/04/28 05:12:28
1	93	325.32504216255245	294.1232464693243	20/04/28 05:12:29
1	93	325.32504216255245	294.1232464693243	20/04/28 05:12:30
1	50	325.82176653676186	290.66965224740585	20/04/28 05:12:31
1	50	325.82176653676186	290.6696522474059	20/04/28 05:12:32
1	50	328.0892907075774	291.9473090105973	20/04/28 05:12:33
1	50	327.6844095055158	288.5207594301078	20/04/28 05:12:34
1	50	325.82176653676186	290.66965224740585	20/04/28 05:12:35
1	50	325.82176653676186	290.6696522474059	20/04/28 05:12:36
1	93	325.32504216255245	294.1232464693243	20/04/28 05:12:37
1	93	325.32504216255245	294.1232464693243	20/04/28 05:12:38
1	93	325.32504216255245	294.1232464693243	20/04/28 05:12:39
1	93	325.32504216255245	294.1232464693243	20/04/28 05:12:40
1	93	325.32504216255245	294.1232464693243	20/04/28 05:12:41
1	93	325.32504216255245	294.1232464693243	20/04/28 05:12:42
1	93	325.32504216255245	294.1232464693243	20/04/28 05:12:43
1	93	325.32504216255245	294.1232464693243	20/04/28 05:12:44
1	93	325.32504216255245	294.1232464693243	20/04/28 05:12:45
1	93	325.32504216255245	294.1232464693243	20/04/28 05:12:46
1	93	325.32504216255245	294.1232464693243	20/04/28 05:12:47
1	93	325.32504216255245	294.1232464693243	20/04/28 05:12:48
1	93	325.32504216255245	294.1232464693243	20/04/28 05:12:49
1	93	325.32504216255245	294.1232464693243	20/04/28 05:12:50
1	93	325.32504216255245	294.1232464693243	20/04/28 05:12:51
1	93	325.32504216255245	294.1232464693243	20/04/28 05:12:52
1	93	325.3250421625525	294.12324646932433	20/04/28 05:12:53
1	93	325.3250421625525	294.12324646932433	20/04/28 05:12:54
1	93	325.3250421625525	294.12324646932433	20/04/28 05:12:55
1	93	325.3250421625525	294.12324646932433	20/04/28 05:12:56
1	93	325.3250421625525	294.12324646932433	20/04/28 05:12:57
1	93	325.32504216255245	294.1232464693243	20/04/28 05:12:58
1	93	325.3250421625525	294.12324646932433	20/04/28 05:12:59
1	93	325.32504216255245	294.1232464693243	20/04/28 05:13:00
1	93	325.3250421625525	294.12324646932433	20/04/28 05:13:01
1	93	325.3250421625525	294.12324646932433	20/04/28 05:13:02
1	93	325.32504216255245	294.1232464693243	20/04/28 05:13:03
1	93	325.3250421625525	294.12324646932433	20/04/28 05:13:04
1	93	325.32504216255245	294.1232464693243	20/04/28 05:13:05
1	93	325.32504216255245	294.1232464693243	20/04/28 05:13:06
1	93	325.3250421625525	294.12324646932433	20/04/28 05:13:07
1	93	325.32504216255245	294.1232464693243	20/04/28 05:13:08
