floorId	partitionId	location_x	location_y	timeStamp
1	39	325.34900758582904	280.0734464773253	20/04/28 05:08:49
1	39	325.06364211862194	280.15435766628457	20/04/28 05:08:49
1	39	324.88608357707386	280.2047017841175	20/04/28 05:08:49
1	39	324.70993750077423	280.2546454181648	20/04/28 05:08:49
1	39	324.53134915201446	280.30528152271467	20/04/28 05:08:49
1	39	324.36687177014585	280.35191666975663	20/04/28 05:08:49
1	39	324.15625732198794	280.41163330463627	20/04/28 05:08:49
1	39	323.99252548667135	280.45805706289826	20/04/28 05:08:49
1	39	323.8027839276999	280.51185549647056	20/04/28 05:08:49
1	39	323.5412714252562	280.5860035274413	20/04/28 05:08:50
1	39	323.25372915944394	280.66753191568887	20/04/28 05:08:50
1	39	322.9711211008791	280.74766128190737	20/04/28 05:08:50
1	39	322.9711211008791	280.74766128190737	20/04/28 05:08:50
1	39	322.72552337594385	280.8172969113501	20/04/28 05:08:50
1	39	322.54801260225787	280.867627485307	20/04/28 05:08:50
1	39	322.26608994900334	280.94756251491174	20/04/28 05:08:50
1	4	322.2352133333333	281.2154168684525	20/04/28 05:08:50
1	39	322.11148845637473	281.43460347034215	20/04/28 05:08:50
1	39	321.85100637307875	281.5677787093217	20/04/28 05:08:50
1	39	321.6909009690404	281.6496349167619	20/04/28 05:08:51
1	39	321.48356106562125	281.7556404463494	20/04/28 05:08:51
1	39	321.25021416255134	281.8749424313007	20/04/28 05:08:51
1	39	321.0099429406485	281.99778457457575	20/04/28 05:08:51
1	39	320.86966997922957	282.06950115839203	20/04/28 05:08:51
1	39	320.7349805176384	282.13836309702697	20/04/28 05:08:51
1	39	320.52955083928424	282.2433919963744	20/04/28 05:08:51
1	39	320.38331852709797	282.31815538461024	20/04/28 05:08:51
1	39	320.1471594933257	282.43889511212564	20/04/28 05:08:51
1	39	319.8866759865983	282.5720710788551	20/04/28 05:08:51
1	39	319.69526218708415	282.6699341570819	20/04/28 05:08:52
1	39	319.54709171937657	282.74568845540824	20/04/28 05:08:52
1	39	319.3332938195902	282.85499572920264	20/04/28 05:08:52
1	39	319.14853968930436	282.94945395505044	20/04/28 05:08:52
1	39	318.973417548359	283.0389876867985	20/04/28 05:08:52
1	39	318.7808378742475	283.13744683530456	20/04/28 05:08:52
1	39	318.5759152227068	283.24221650984776	20/04/28 05:08:52
1	39	318.3792896588956	283.34274417808007	20/04/28 05:08:52
1	39	318.12780379740934	283.47131996832104	20/04/28 05:08:52
1	39	317.8913883452814	283.59219079343575	20/04/28 05:08:53
1	39	317.6371033190592	283.72219769720266	20/04/28 05:08:53
1	39	317.3825215808988	283.8523562992467	20/04/28 05:08:53
1	39	317.20489747986386	283.94316919433925	20/04/28 05:08:53
1	39	317.03500560253383	284.03002887803734	20/04/28 05:08:53
1	39	316.8126781230447	284.1436970230323	20/04/28 05:08:53
1	39	316.66021134349717	284.2216478730323	20/04/28 05:08:53
1	39	316.4352860646707	284.33664418057566	20/04/28 05:08:53
1	39	316.2645296917299	284.4239458501797	20/04/28 05:08:53
1	39	316.04171845848265	284.53786132129216	20/04/28 05:08:53
1	39	315.8315989332942	284.6452879727807	20/04/28 05:08:54
1	4	315.7637290516572	284.67998743307425	20/04/28 05:08:54
1	4	315.73286304769647	284.5274122101874	20/04/28 05:08:54
1	4	315.84877258872103	284.6858067756262	20/04/28 05:08:54
1	4	315.9730745956881	284.68430226774586	20/04/28 05:08:54
1	4	315.9853100211737	284.7039919888578	20/04/28 05:08:54
1	4	316.07822557140963	284.7973267031274	20/04/28 05:08:54
1	4	316.31343480614413	284.97014406288355	20/04/28 05:08:54
1	4	316.31703308832357	284.9715782416665	20/04/28 05:08:54
1	4	316.59474062269726	284.91632571471973	20/04/28 05:08:54
1	4	316.35714525444234	284.9670667775008	20/04/28 05:08:55
1	4	316.4403569216609	284.7273821949751	20/04/28 05:08:55
1	4	316.21751671348414	284.5437945160642	20/04/28 05:08:55
1	4	316.39836992748764	284.60980316409774	20/04/28 05:08:55
1	4	316.44673820052526	284.49129583573296	20/04/28 05:08:55
1	4	316.4731023014069	284.54140796947627	20/04/28 05:08:55
1	4	316.5280392613215	284.7420929360102	20/04/28 05:08:55
1	4	316.54471866471255	284.6268914475743	20/04/28 05:08:55
1	4	316.8131627487532	284.62782114017	20/04/28 05:08:55
1	4	316.8587522510265	284.4299221184529	20/04/28 05:08:56
1	4	316.8553029030621	284.4759931658262	20/04/28 05:08:56
1	4	317.0399755293365	284.4517822096334	20/04/28 05:08:56
1	4	316.9766149703284	284.72023642792266	20/04/28 05:08:56
1	4	316.87260885631497	284.79326067148315	20/04/28 05:08:56
1	4	316.72102043743223	284.9000542480261	20/04/28 05:08:56
1	4	316.7582998491834	284.96182410284194	20/04/28 05:08:56
1	4	316.9590139153552	285.0716132633383	20/04/28 05:08:56
1	4	317.2428290420519	284.99517060367657	20/04/28 05:08:56
1	4	317.1848298847876	285.16699359999814	20/04/28 05:08:56
1	4	317.096961239103	285.1593063693483	20/04/28 05:08:57
1	4	317.1133280060772	284.948124851653	20/04/28 05:08:57
1	4	317.14782673762545	285.0004609653702	20/04/28 05:08:57
1	4	317.0975393235838	284.75840583374963	20/04/28 05:08:57
1	4	316.98541723186554	284.68089220973843	20/04/28 05:08:57
1	4	317.1123737213083	284.940386675618	20/04/28 05:08:57
1	4	317.2308140385866	284.81918499907846	20/04/28 05:08:57
1	4	317.222077933383	284.6013281662198	20/04/28 05:08:57
1	4	317.2179205772577	284.594619613168	20/04/28 05:08:57
1	4	316.9791003298188	284.5431510456945	20/04/28 05:08:57
1	4	317.0052298010082	284.46898871058147	20/04/28 05:08:58
1	4	316.93989479612475	284.50883301219557	20/04/28 05:08:58
1	4	317.2124564218843	284.57582666942653	20/04/28 05:08:58
1	4	317.18970938646083	284.49804481221327	20/04/28 05:08:58
1	4	317.3500224250028	284.5564049633767	20/04/28 05:08:58
1	4	317.45337151519556	284.58154022718327	20/04/28 05:08:58
1	4	317.4532378761484	284.6047932296203	20/04/28 05:08:58
1	4	317.62070817918277	284.46653013036484	20/04/28 05:08:58
1	4	317.53828599774647	284.6639746604368	20/04/28 05:08:58
1	4	317.797218862674	284.66406284473516	20/04/28 05:08:59
1	4	317.6135195862067	284.602913000566	20/04/28 05:08:59
1	4	317.698677989991	284.5662856975638	20/04/28 05:08:59
1	4	317.4302086409599	284.5961847499598	20/04/28 05:08:59
1	4	317.51742020555247	284.6078730195988	20/04/28 05:08:59
1	4	317.62683901821356	284.63797871618715	20/04/28 05:08:59
1	4	317.5523715991436	284.5958441158896	20/04/28 05:08:59
1	4	317.5474867973112	284.6204050951926	20/04/28 05:08:59
1	4	317.56519894964055	284.61229106219383	20/04/28 05:08:59
1	4	317.6662160257723	284.53999050262496	20/04/28 05:08:59
1	4	317.54458926528235	284.720823908505	20/04/28 05:09:00
1	4	317.5310495063736	284.6935613442126	20/04/28 05:09:00
1	4	317.5329238026981	284.7590468300192	20/04/28 05:09:00
1	4	317.596006571636	284.62218280007954	20/04/28 05:09:00
1	4	317.5945197993831	284.76376242741975	20/04/28 05:09:00
1	4	317.84203975966915	284.8072707214789	20/04/28 05:09:00
1	4	317.9512095676084	284.8650570189138	20/04/28 05:09:00
1	4	317.95744575904683	284.7754792822583	20/04/28 05:09:00
1	4	317.71391661920114	284.6365568397675	20/04/28 05:09:00
1	4	317.6657786128736	284.6673263827576	20/04/28 05:09:00
1	4	317.88160467359785	284.7280730192782	20/04/28 05:09:01
1	4	317.7351419527803	284.6405025159105	20/04/28 05:09:01
1	4	317.55905990243593	284.6999261143697	20/04/28 05:09:01
1	4	317.7498061940919	284.6033122520259	20/04/28 05:09:01
1	4	317.91947195559976	284.75839600650903	20/04/28 05:09:01
1	4	318.0424261255657	284.87766446532953	20/04/28 05:09:01
1	4	317.88681288726673	284.87453156457923	20/04/28 05:09:01
1	4	317.8684806270606	284.77849097473467	20/04/28 05:09:01
1	4	317.6578002547979	284.7668152558042	20/04/28 05:09:01
1	4	317.7784428989999	284.614871401351	20/04/28 05:09:02
1	4	317.7181211455806	284.517086566364	20/04/28 05:09:02
1	4	317.712571643025	284.5995432099611	20/04/28 05:09:02
1	4	317.50986254337755	284.5490136863306	20/04/28 05:09:02
1	4	317.7344540205111	284.5360349406549	20/04/28 05:09:02
1	4	317.5170569038109	284.34885810985077	20/04/28 05:09:02
1	4	317.39621328067426	284.60055470982365	20/04/28 05:09:02
1	4	317.5268864471574	284.358623845988	20/04/28 05:09:02
1	4	317.25048069177586	284.447770749238	20/04/28 05:09:02
1	4	317.21753283545013	284.5241253035274	20/04/28 05:09:02
1	4	317.1271248636845	284.5061026275991	20/04/28 05:09:03
1	4	317.1657660832572	284.4806607559695	20/04/28 05:09:03
1	4	316.9795900696935	284.4105189815627	20/04/28 05:09:03
1	4	316.78003917884257	284.5574794445616	20/04/28 05:09:03
1	4	316.7208206244896	284.4508394093671	20/04/28 05:09:03
1	4	316.6912029738977	284.6339592153813	20/04/28 05:09:03
1	4	316.6423783040611	284.65255114953794	20/04/28 05:09:03
1	4	316.6629733523514	284.5426591668584	20/04/28 05:09:03
1	4	316.74046921152893	284.4977693255592	20/04/28 05:09:03
1	4	316.4952992158832	284.3543189240608	20/04/28 05:09:04
1	4	316.4943333976853	284.62726575672207	20/04/28 05:09:04
1	4	316.4841632698772	284.53759092149016	20/04/28 05:09:04
1	4	316.475859766935	284.4489086130448	20/04/28 05:09:04
1	4	316.2363013706523	284.3894549560164	20/04/28 05:09:04
1	4	316.2309682072133	284.19468498470764	20/04/28 05:09:04
1	4	316.0714747876141	284.4023908936979	20/04/28 05:09:04
1	4	315.8550799129538	284.21234193173007	20/04/28 05:09:04
1	4	315.922969661578	284.27216855753966	20/04/28 05:09:04
1	4	316.15380296951304	284.2922858988516	20/04/28 05:09:04
1	4	316.2189269085716	284.5384373966489	20/04/28 05:09:05
1	4	315.9654067321836	284.5522337494489	20/04/28 05:09:05
1	4	316.03128123692244	284.62982540660687	20/04/28 05:09:05
1	4	316.03128411164295	284.68073370727234	20/04/28 05:09:05
1	4	316.2160849901446	284.67263977674	20/04/28 05:09:05
1	4	315.95126658901535	284.6325578304834	20/04/28 05:09:05
1	4	316.0799910200608	284.5893405441174	20/04/28 05:09:05
1	4	316.01227646793166	284.66423592277397	20/04/28 05:09:05
1	4	316.11154498560245	284.6553966442405	20/04/28 05:09:05
1	4	315.864119791807	284.51381119197305	20/04/28 05:09:06
1	4	315.70920495389396	284.4657216360216	20/04/28 05:09:06
1	4	315.58218841732776	284.64507696694176	20/04/28 05:09:06
1	4	315.58529580620046	284.67201551791555	20/04/28 05:09:06
1	4	315.5790590547361	284.64770816695676	20/04/28 05:09:06
1	4	315.6939175630532	284.65144379433804	20/04/28 05:09:06
1	4	315.6209242925939	284.89284874245584	20/04/28 05:09:06
1	4	315.65932716145153	284.75807658222107	20/04/28 05:09:06
1	4	315.5492789979689	284.4864649990909	20/04/28 05:09:06
1	4	315.5634025453183	284.43362429940913	20/04/28 05:09:06
1	4	315.5575002619157	284.2837084215623	20/04/28 05:09:07
1	4	315.54050737140113	284.1362031819283	20/04/28 05:09:07
1	4	315.6338294863418	284.1079896264247	20/04/28 05:09:07
1	4	315.47772505860553	284.14663683986635	20/04/28 05:09:07
1	4	315.45487753216395	284.1693097260653	20/04/28 05:09:07
1	4	315.4951922028723	284.13979678337546	20/04/28 05:09:07
1	4	315.5545365702858	284.2049981501445	20/04/28 05:09:07
1	4	315.37164028245036	284.1347742547448	20/04/28 05:09:07
1	4	315.50844720473003	284.0323033209333	20/04/28 05:09:07
1	4	315.49714566175595	283.9828385556124	20/04/28 05:09:07
1	4	315.4493046370295	283.80260362843205	20/04/28 05:09:08
1	4	315.44952803116286	283.7305626497612	20/04/28 05:09:08
1	4	315.39980773216774	283.9615061253103	20/04/28 05:09:08
1	4	315.46713138764153	284.11103839316416	20/04/28 05:09:08
1	4	315.48546640936	283.98778519996347	20/04/28 05:09:08
1	4	315.4403145122742	283.92700268298364	20/04/28 05:09:08
1	4	315.49329552289566	284.0797055909888	20/04/28 05:09:08
1	4	315.43852148480374	284.10891224726873	20/04/28 05:09:08
1	4	315.51438490028806	284.14833533178245	20/04/28 05:09:08
1	4	315.32425241089896	284.16972968956725	20/04/28 05:09:09
1	4	315.3557020499339	284.19017596898334	20/04/28 05:09:09
1	4	315.4410717752978	284.46972617598124	20/04/28 05:09:09
1	4	315.3910688206507	284.46118384627715	20/04/28 05:09:09
1	4	315.1650983470063	284.4613925025321	20/04/28 05:09:09
1	4	315.1471212855226	284.5013063361636	20/04/28 05:09:09
1	4	315.2741717923852	284.6799051394051	20/04/28 05:09:09
1	4	314.9797675723337	284.7282605778161	20/04/28 05:09:09
1	4	314.9420926355314	284.7697207534222	20/04/28 05:09:09
1	4	315.0340411764588	285.0121670600692	20/04/28 05:09:09
1	4	315.040670039295	285.04849196795897	20/04/28 05:09:10
1	4	315.05245893469333	285.0509321255954	20/04/28 05:09:10
1	4	314.80990270042724	285.051310668932	20/04/28 05:09:10
1	4	314.8590026487005	284.975457120479	20/04/28 05:09:10
1	4	314.9309188828484	284.7827928329357	20/04/28 05:09:10
1	4	314.92305112778416	284.8187767463818	20/04/28 05:09:10
1	4	315.0362813702482	284.7630195362014	20/04/28 05:09:10
1	4	315.2297844110777	284.8907420026403	20/04/28 05:09:10
1	4	315.14270252214186	284.9777443886147	20/04/28 05:09:10
1	4	315.1841440933978	285.2280637574905	20/04/28 05:09:10
1	4	315.39537158197163	285.20422277447625	20/04/28 05:09:11
1	4	315.38789105154154	285.19509256967405	20/04/28 05:09:11
1	4	315.3851274011646	285.1730291453189	20/04/28 05:09:11
1	4	315.4329935300766	285.39114854720714	20/04/28 05:09:11
1	4	315.37065761629844	285.4498420215128	20/04/28 05:09:11
1	4	315.5962976297607	285.26495870472536	20/04/28 05:09:11
1	4	315.3891786232826	285.44309291770975	20/04/28 05:09:11
1	4	315.477969996851	285.3587421006534	20/04/28 05:09:11
1	4	315.4735160878482	285.3725247447943	20/04/28 05:09:11
1	4	315.46973818414284	285.24937557719267	20/04/28 05:09:12
1	4	315.470050088349	285.5087668940469	20/04/28 05:09:12
1	4	315.2547788083342	285.3091208218111	20/04/28 05:09:12
1	4	315.3577914927127	285.3359590082939	20/04/28 05:09:12
1	4	315.44883505670157	285.50202373099364	20/04/28 05:09:12
1	4	315.3974441193517	285.4235516911707	20/04/28 05:09:12
1	4	315.48018097527523	285.3582710138488	20/04/28 05:09:12
1	4	315.33132772139686	285.5727584361963	20/04/28 05:09:12
1	4	315.4853588860893	285.6674054307385	20/04/28 05:09:12
1	4	315.42743879722804	285.78949910160554	20/04/28 05:09:12
1	4	315.578493426074	285.8806469643254	20/04/28 05:09:13
1	4	315.5725625102291	285.79136138419807	20/04/28 05:09:13
1	4	315.6622708244598	285.92670595801945	20/04/28 05:09:13
1	4	315.68528744448525	285.8640314375308	20/04/28 05:09:13
1	4	315.76780141765374	285.63531690964413	20/04/28 05:09:13
1	4	315.7865341169773	285.67800564110104	20/04/28 05:09:13
1	4	315.6392591537783	285.7584422441818	20/04/28 05:09:13
1	4	315.5410162869506	285.61591705919983	20/04/28 05:09:13
1	4	315.52638539319133	285.58078566154074	20/04/28 05:09:13
1	4	315.6287984001265	285.6623532102005	20/04/28 05:09:13
1	4	315.6613130521796	285.6275413019264	20/04/28 05:09:14
1	4	315.4335262276436	285.45221464971576	20/04/28 05:09:14
1	4	315.47051498003424	285.3629668509206	20/04/28 05:09:14
1	4	315.50064685763977	285.35601145758665	20/04/28 05:09:14
1	4	315.67233923475504	285.334823015665	20/04/28 05:09:14
1	4	315.73612614703967	285.2150636603087	20/04/28 05:09:14
1	4	315.8975750813807	285.1639885690694	20/04/28 05:09:14
1	4	316.17015246656655	285.059468476321	20/04/28 05:09:14
1	4	316.2929179268634	284.98381359575313	20/04/28 05:09:14
1	4	316.24190085471395	284.7946029738086	20/04/28 05:09:15
1	4	316.39157084543575	284.770796744452	20/04/28 05:09:15
1	4	316.37160299058576	284.6036629079098	20/04/28 05:09:15
1	4	316.3409354207627	284.59181696723164	20/04/28 05:09:15
1	4	316.5520048444156	284.748108490735	20/04/28 05:09:15
1	4	316.4372428729552	284.60397774256404	20/04/28 05:09:15
1	4	316.4148537695672	284.3950533562899	20/04/28 05:09:15
1	4	316.1330376464326	284.36282465146843	20/04/28 05:09:15
1	4	316.0189047880346	284.2807618461159	20/04/28 05:09:15
1	4	316.02110310008254	284.12206674796744	20/04/28 05:09:15
1	4	316.23122123391346	284.25368667361744	20/04/28 05:09:16
1	4	316.2800346641899	284.25537392507346	20/04/28 05:09:16
1	4	316.3947447875864	284.2584836010519	20/04/28 05:09:16
1	4	316.2450046828181	284.11245898519616	20/04/28 05:09:16
1	4	316.4049273345067	283.89745989555536	20/04/28 05:09:16
1	4	316.35910700434374	283.80714311134477	20/04/28 05:09:16
1	4	316.41907890923545	283.8752817102702	20/04/28 05:09:16
1	4	316.2893202729072	283.72614439085595	20/04/28 05:09:16
1	4	316.2433664621147	283.7392801379665	20/04/28 05:09:16
1	4	316.4122538267854	283.6372989056232	20/04/28 05:09:17
1	4	316.51178698138375	283.58715021324434	20/04/28 05:09:17
1	4	316.549562002112	283.65982794423445	20/04/28 05:09:17
1	4	316.6084999173316	283.6552572618748	20/04/28 05:09:17
1	4	316.51326761911815	283.58784721522255	20/04/28 05:09:17
1	4	316.51040993020786	283.58922750520463	20/04/28 05:09:17
1	4	316.5660258194255	283.81425255632	20/04/28 05:09:17
1	4	316.56944258492035	283.7317780668992	20/04/28 05:09:17
1	4	316.4221243622222	283.66139573121535	20/04/28 05:09:17
1	4	316.39611143686625	283.76201276165983	20/04/28 05:09:17
1	4	316.40585825772865	283.7672035910453	20/04/28 05:09:18
1	4	316.40585825772865	283.7672035910453	20/04/28 05:09:18
1	4	316.40585825772865	283.7672035910453	20/04/28 05:09:18
1	4	316.35629334092755	283.6444614416631	20/04/28 05:09:18
1	4	316.13735915868415	283.48349788726335	20/04/28 05:09:18
1	4	316.1769751831551	283.6378460596494	20/04/28 05:09:18
1	4	316.1171906046066	283.9114277018549	20/04/28 05:09:18
1	4	316.13971497271746	283.7529740665193	20/04/28 05:09:18
1	4	316.2984173628432	283.8811407039288	20/04/28 05:09:18
1	4	316.31913966426237	283.93403728355725	20/04/28 05:09:18
1	4	316.2254946780577	283.7289845499799	20/04/28 05:09:19
1	4	316.09835468615876	283.5459079852382	20/04/28 05:09:19
1	4	316.05899273495197	283.5987860574814	20/04/28 05:09:19
1	4	316.0656607575847	283.74105117370635	20/04/28 05:09:19
1	4	315.94517265305444	283.83492809261645	20/04/28 05:09:19
1	4	315.82695060630675	283.59346254878824	20/04/28 05:09:19
1	4	316.0788962844257	283.4555045332811	20/04/28 05:09:19
1	4	316.02219619832107	283.48004402997447	20/04/28 05:09:19
1	4	316.1201624437769	283.3580792888116	20/04/28 05:09:19
1	4	316.174549493444	283.1580048896721	20/04/28 05:09:20
1	4	316.106314511203	283.2487531271841	20/04/28 05:09:20
1	4	316.13492468418514	283.256333099584	20/04/28 05:09:20
1	4	316.41395452091854	283.3605191649521	20/04/28 05:09:20
1	4	316.40283262613866	283.3740716479366	20/04/28 05:09:20
1	4	316.26552320868853	283.39930655136993	20/04/28 05:09:20
1	4	316.2769514678934	283.3707829079894	20/04/28 05:09:20
1	4	316.4748816059621	283.30070926907695	20/04/28 05:09:20
1	4	316.46965972214105	283.30687094624824	20/04/28 05:09:20
1	4	316.24964221716664	283.2146723441875	20/04/28 05:09:20
1	4	316.0125326834123	283.0840147790739	20/04/28 05:09:21
1	4	316.0439936174994	283.2788510952663	20/04/28 05:09:21
1	4	316.07835272454304	283.5272288074855	20/04/28 05:09:21
1	4	316.0420941149785	283.47800497121324	20/04/28 05:09:21
1	4	315.8142598254119	283.6408778296395	20/04/28 05:09:21
1	4	315.59180520123954	283.7294801514613	20/04/28 05:09:21
1	4	315.6179263503093	283.64470990110397	20/04/28 05:09:21
1	4	315.59905902412055	283.6954916192043	20/04/28 05:09:21
1	4	315.5709803347077	283.447587598583	20/04/28 05:09:21
1	4	315.62011502663273	283.323929410308	20/04/28 05:09:22
1	4	315.6107396112858	283.3189090192698	20/04/28 05:09:22
1	4	315.63672474848363	283.5856538360258	20/04/28 05:09:22
1	4	315.58269298950177	283.5208836918601	20/04/28 05:09:22
1	4	315.52747162067146	283.4602347488481	20/04/28 05:09:22
1	4	315.7747536532742	283.3696077599319	20/04/28 05:09:22
1	4	315.6194586369453	283.36322534901035	20/04/28 05:09:22
1	4	315.4789904007714	283.3795987370931	20/04/28 05:09:22
1	4	315.60255264189726	283.1948437358008	20/04/28 05:09:22
1	4	315.3755263782369	283.06059080989615	20/04/28 05:09:22
1	4	315.3982811674195	283.1552445401707	20/04/28 05:09:23
1	4	315.40063843725017	283.16673588576884	20/04/28 05:09:23
1	4	315.41908655433014	283.1410690649265	20/04/28 05:09:23
1	4	315.4129421432447	283.1470145448749	20/04/28 05:09:23
1	4	315.5145883947092	283.0734346743687	20/04/28 05:09:23
1	4	315.33330809417373	283.0103673969205	20/04/28 05:09:23
1	4	315.36661444318037	282.88443427760365	20/04/28 05:09:23
1	4	315.36663805586807	282.8815130051219	20/04/28 05:09:23
1	4	315.4080314907389	282.94795866990074	20/04/28 05:09:23
1	4	315.4456466079083	282.85981355352584	20/04/28 05:09:23
1	4	315.39992964387807	283.11243350141893	20/04/28 05:09:24
1	4	315.5310130300807	283.267557086652	20/04/28 05:09:24
1	4	315.6722026502573	283.37955692716207	20/04/28 05:09:24
1	4	315.4841054250139	283.2675633015203	20/04/28 05:09:24
1	4	315.532817559732	283.2754026361423	20/04/28 05:09:24
1	4	315.310196001638	283.16871203596577	20/04/28 05:09:24
1	4	315.2513158763923	283.1464882639051	20/04/28 05:09:24
1	4	315.2513158763923	283.1464882639051	20/04/28 05:09:24
1	4	315.2513158763923	283.1464882639051	20/04/28 05:09:24
1	4	315.2405494887922	283.15363248757103	20/04/28 05:09:25
1	4	315.26531141597695	283.1426809242532	20/04/28 05:09:25
1	4	315.36502411458383	283.27513455271577	20/04/28 05:09:25
1	4	315.3014322453747	283.120815467091	20/04/28 05:09:25
1	4	315.3275583730615	283.2596304050945	20/04/28 05:09:25
1	4	315.5094595780528	283.09710228389895	20/04/28 05:09:25
1	4	315.2626523040182	283.184114891356	20/04/28 05:09:25
1	4	315.3376192394399	283.188504095952	20/04/28 05:09:25
1	4	315.31180500270375	283.42930345557244	20/04/28 05:09:25
1	4	315.1319747372466	283.4704628504293	20/04/28 05:09:25
1	4	315.0843301187247	283.7325692101907	20/04/28 05:09:26
1	4	315.13882832434876	283.8222211071499	20/04/28 05:09:26
1	4	315.1866128967464	283.693006404069	20/04/28 05:09:26
1	4	315.15376917825967	283.6423027720271	20/04/28 05:09:26
1	4	315.1597992210904	283.6072360825373	20/04/28 05:09:26
1	4	315.2201495401237	283.55316858048684	20/04/28 05:09:26
1	4	315.3043161375389	283.5572957621575	20/04/28 05:09:26
1	4	315.29434378591077	283.5722000240327	20/04/28 05:09:26
1	4	315.10934670841306	283.5081138501216	20/04/28 05:09:26
1	4	314.98606343721326	283.63522146521353	20/04/28 05:09:26
1	4	314.8933813676231	283.662454306002	20/04/28 05:09:27
1	4	314.9986558185334	283.67169190141	20/04/28 05:09:27
1	4	314.96405085465386	283.6815186072424	20/04/28 05:09:27
1	4	314.86940704096355	283.44272823498727	20/04/28 05:09:27
1	4	314.9157105313345	283.5366135513026	20/04/28 05:09:27
1	4	314.81575987884554	283.48736892784467	20/04/28 05:09:27
1	4	314.79760241383036	283.7681985938503	20/04/28 05:09:27
1	4	314.9747437809456	284.0040964916602	20/04/28 05:09:27
1	4	314.99709462867025	284.09619874050424	20/04/28 05:09:27
1	4	314.94170696786244	283.9722565063123	20/04/28 05:09:28
1	4	315.1746688826467	283.90211560500524	20/04/28 05:09:28
1	4	315.2125711962589	283.92825793135745	20/04/28 05:09:28
1	4	314.99558036732276	283.72793015110875	20/04/28 05:09:28
1	4	314.77250525487773	283.5310460371682	20/04/28 05:09:28
1	4	314.7261129535275	283.4793311509704	20/04/28 05:09:28
1	4	314.85980283875216	283.6228785859923	20/04/28 05:09:28
1	4	314.8172121145447	283.6391046180507	20/04/28 05:09:28
1	4	314.85715971032135	283.6658431494915	20/04/28 05:09:28
1	4	314.8463947279154	283.6590523820495	20/04/28 05:09:28
1	4	314.8422477991901	283.66638497678116	20/04/28 05:09:29
1	4	314.8066379893887	283.6848059515358	20/04/28 05:09:29
1	4	314.82155817602404	283.71092566601067	20/04/28 05:09:29
1	4	315.0463658632355	283.88405383486287	20/04/28 05:09:29
1	4	314.9852746754439	284.0109128177237	20/04/28 05:09:29
1	4	315.15477603705494	283.7864859815023	20/04/28 05:09:29
1	4	315.16108437264836	283.7123956170291	20/04/28 05:09:29
1	4	315.3216956714277	283.6900712755118	20/04/28 05:09:29
1	4	315.213898420054	283.7307600009521	20/04/28 05:09:29
1	4	315.1413718345394	284.0030251195665	20/04/28 05:09:29
1	4	315.19762056210914	284.02299474692387	20/04/28 05:09:30
1	4	315.1493490369283	283.9756460862493	20/04/28 05:09:30
1	4	314.9353680180151	283.86814711140977	20/04/28 05:09:30
1	4	314.96705160327815	283.8375479056499	20/04/28 05:09:30
1	4	314.6964519220213	283.74520542572526	20/04/28 05:09:30
1	4	314.80851758052603	283.7881773260452	20/04/28 05:09:30
1	4	314.986476454774	284.02541169864963	20/04/28 05:09:30
1	4	314.9698919699067	283.8307339879818	20/04/28 05:09:30
1	4	314.70463639241143	283.9359744721174	20/04/28 05:09:30
1	4	314.67732339650195	283.9417678726676	20/04/28 05:09:31
1	4	314.8903389333268	284.1058252932182	20/04/28 05:09:31
1	4	314.86552095274976	284.1391976244105	20/04/28 05:09:31
1	4	314.6880191800497	283.9176132722893	20/04/28 05:09:31
1	4	314.6741428193533	283.97814440090286	20/04/28 05:09:31
1	4	314.92151275730447	283.8111470450593	20/04/28 05:09:31
1	4	314.67665175027514	283.90796209614075	20/04/28 05:09:31
1	4	314.79632038461887	283.74856629731016	20/04/28 05:09:31
1	4	314.71704725609794	283.6687316800024	20/04/28 05:09:31
1	4	314.7529734026065	283.9610142047425	20/04/28 05:09:31
1	4	314.74774034944187	283.94171353385406	20/04/28 05:09:32
1	4	314.9520208857863	283.91327791751746	20/04/28 05:09:32
1	4	314.8771399219263	283.9159730471466	20/04/28 05:09:32
1	4	314.84126141733674	283.914443865364	20/04/28 05:09:32
1	4	314.8433878566541	283.77718374909557	20/04/28 05:09:32
1	4	314.82969309867593	283.8750835951802	20/04/28 05:09:32
1	4	314.82969309867593	283.8750835951802	20/04/28 05:09:32
1	4	314.67223340603124	284.09004862605883	20/04/28 05:09:32
1	4	314.6813215792838	284.0895738691711	20/04/28 05:09:32
1	4	314.82727555579584	284.0981934826979	20/04/28 05:09:33
1	4	314.5642878592422	284.1542596405739	20/04/28 05:09:33
1	4	314.63838998832506	283.95397494712836	20/04/28 05:09:33
1	4	314.5827495536618	284.23086416749203	20/04/28 05:09:33
1	4	314.46661864693664	284.34749602054404	20/04/28 05:09:33
1	4	314.59830802098963	284.1843872495777	20/04/28 05:09:33
1	4	314.53092249684926	284.16419492618826	20/04/28 05:09:33
1	4	314.49369395758146	284.12424716371163	20/04/28 05:09:33
1	4	314.5119674947695	284.14638149538285	20/04/28 05:09:33
1	4	314.4518332045826	284.19154270541185	20/04/28 05:09:33
1	4	314.1937664198438	284.3201670764255	20/04/28 05:09:34
1	4	314.08252762866863	284.46689491807876	20/04/28 05:09:34
1	4	313.8782938601987	284.6140889877323	20/04/28 05:09:34
1	4	314.1375788063413	284.5867643066542	20/04/28 05:09:34
1	4	314.16624347777685	284.59493515234163	20/04/28 05:09:34
1	4	314.1252416984803	284.42982697628645	20/04/28 05:09:34
1	4	313.9218693461571	284.4659678852086	20/04/28 05:09:34
1	4	313.7924998038139	284.1974465526661	20/04/28 05:09:34
1	4	313.80399948702177	284.348541194959	20/04/28 05:09:34
1	4	313.59006081293137	284.3730567891543	20/04/28 05:09:34
1	4	313.69297768774766	284.57004566880664	20/04/28 05:09:35
1	4	313.7731768981179	284.62929019031606	20/04/28 05:09:35
1	4	313.8712135199484	284.352701453949	20/04/28 05:09:35
1	4	313.82447905616596	284.4946561846173	20/04/28 05:09:35
1	4	313.7251479813657	284.6795664735742	20/04/28 05:09:35
1	4	313.60583326679136	284.6215163070393	20/04/28 05:09:35
1	4	313.6173787299614	284.70079789703107	20/04/28 05:09:35
1	4	313.70966398588115	284.55923124243924	20/04/28 05:09:35
1	4	313.8027652778502	284.5299193385574	20/04/28 05:09:35
1	4	313.7956491796781	284.52206634166816	20/04/28 05:09:36
1	4	313.57976596222136	284.45104009201725	20/04/28 05:09:36
1	4	313.5155197192778	284.46314574144617	20/04/28 05:09:36
1	4	313.535391235135	284.2980391081085	20/04/28 05:09:36
1	4	313.30089297781484	284.2612616527989	20/04/28 05:09:36
1	4	313.50169941804114	284.2967304377147	20/04/28 05:09:36
1	4	313.6848461588067	284.15659811348445	20/04/28 05:09:36
1	4	313.7442556926945	283.9042504741153	20/04/28 05:09:36
1	4	313.64558341202616	283.864306470387	20/04/28 05:09:36
1	4	313.62365843834556	283.6792125994887	20/04/28 05:09:36
1	4	313.7911836093688	283.4684180763039	20/04/28 05:09:37
1	4	313.6520661536935	283.6382668603882	20/04/28 05:09:37
1	4	313.88071519121246	283.5719802391577	20/04/28 05:09:37
1	4	313.88071519121246	283.5719802391577	20/04/28 05:09:37
1	4	313.85334370419275	283.84982973731735	20/04/28 05:09:37
1	4	314.062301868311	284.0279535546753	20/04/28 05:09:37
1	4	314.080728917009	284.0191439635273	20/04/28 05:09:37
1	4	314.0022659064006	284.15270278576446	20/04/28 05:09:37
1	4	314.2209151683998	283.9865633349156	20/04/28 05:09:37
1	4	313.9653269481153	284.0701538636283	20/04/28 05:09:38
1	4	314.25512032860735	284.1204736929734	20/04/28 05:09:38
1	4	314.22458705874874	284.08835617991394	20/04/28 05:09:38
1	4	314.0343400093182	284.1510155604548	20/04/28 05:09:38
1	4	314.2309035054043	283.9244926269995	20/04/28 05:09:38
1	4	314.2666802100205	283.97260595035584	20/04/28 05:09:38
1	4	314.2190370135819	283.9261797670097	20/04/28 05:09:38
1	4	314.2341122778773	283.8472948877899	20/04/28 05:09:38
1	4	314.1626024070502	283.8317948660194	20/04/28 05:09:38
1	4	314.36723556280117	283.8951973773965	20/04/28 05:09:38
1	4	314.38149470018266	283.903946654297	20/04/28 05:09:39
1	4	314.23720033327646	283.79916331462175	20/04/28 05:09:39
1	4	314.1674630609946	284.07698595150583	20/04/28 05:09:39
1	4	314.12273935914646	283.99380594568765	20/04/28 05:09:39
1	4	314.08539506866276	283.91374846856365	20/04/28 05:09:39
1	4	313.89024400610225	283.9293907976123	20/04/28 05:09:39
1	4	313.89452405965187	283.89737264058317	20/04/28 05:09:39
1	4	314.01151052493947	284.08232030426257	20/04/28 05:09:39
1	4	314.14781965588924	284.1069228589522	20/04/28 05:09:39
1	4	314.146310540701	284.1132970621502	20/04/28 05:09:39
1	4	314.2647014010062	284.1126503646648	20/04/28 05:09:40
1	4	314.24914498722757	284.00589831958496	20/04/28 05:09:40
1	4	314.3231802111748	283.74229131977273	20/04/28 05:09:40
1	4	314.3231802111748	283.74229131977273	20/04/28 05:09:40
1	4	314.3460891729021	283.7024394212197	20/04/28 05:09:40
1	4	314.3460891729021	283.7024394212197	20/04/28 05:09:40
1	4	314.34218905684685	283.6998304896995	20/04/28 05:09:40
1	4	314.4459135568668	283.9583623312117	20/04/28 05:09:40
1	4	314.4457305068696	284.1043909106889	20/04/28 05:09:40
1	4	314.5648744243113	284.2397316915451	20/04/28 05:09:41
1	4	314.5669462738325	284.24958803926256	20/04/28 05:09:41
1	4	314.5775060410621	284.1380651764788	20/04/28 05:09:41
1	4	314.574494459063	284.1186980538542	20/04/28 05:09:41
1	4	314.57079477633926	284.1209482037279	20/04/28 05:09:41
1	4	314.480827303425	284.05423505386625	20/04/28 05:09:41
1	4	314.66996659149913	284.20427139872714	20/04/28 05:09:41
1	4	314.76466785051326	284.23949769549387	20/04/28 05:09:41
1	4	314.7500102359138	284.2382605074642	20/04/28 05:09:41
1	4	314.6849821321213	284.30469446942664	20/04/28 05:09:42
1	4	314.89879110042267	284.24000050756064	20/04/28 05:09:42
1	4	315.0164278129966	284.128105604778	20/04/28 05:09:42
1	4	314.9094091642119	284.1998585910599	20/04/28 05:09:42
1	4	314.86597352008937	284.1121463188897	20/04/28 05:09:42
1	4	314.8988013680412	284.1986107261223	20/04/28 05:09:42
1	4	314.9869544182393	284.13374423385005	20/04/28 05:09:42
1	4	315.0035101308676	283.87439717843597	20/04/28 05:09:42
1	4	314.99848259067284	283.9465908477812	20/04/28 05:09:42
1	4	314.8136664051473	283.8580442805829	20/04/28 05:09:42
1	4	315.0087126844156	283.8298035990756	20/04/28 05:09:43
1	4	314.99422299236244	283.87139548050794	20/04/28 05:09:43
1	4	315.07955310165477	283.7319527892925	20/04/28 05:09:43
1	4	314.84198804533384	283.6735051933974	20/04/28 05:09:43
1	4	314.7474382350965	283.74058192531203	20/04/28 05:09:43
1	4	314.62834929864067	283.96794954776914	20/04/28 05:09:43
1	4	314.62996322235193	283.96980106928464	20/04/28 05:09:43
1	4	314.62999777075066	283.97054259920884	20/04/28 05:09:43
1	4	314.8738048623258	283.815969831917	20/04/28 05:09:43
1	4	314.8264691716675	283.5306827752346	20/04/28 05:09:43
1	4	314.82318659015465	283.3849742898599	20/04/28 05:09:44
1	4	314.67002740931247	283.567088023055	20/04/28 05:09:44
1	4	314.7479921889639	283.40924569939506	20/04/28 05:09:44
1	4	314.7232349882883	283.392028830957	20/04/28 05:09:44
1	4	314.71464959709004	283.385672269017	20/04/28 05:09:44
1	4	314.80362909663603	283.3801719617112	20/04/28 05:09:44
1	4	314.90704970025183	283.46994211926796	20/04/28 05:09:44
1	4	314.90704970025183	283.46994211926796	20/04/28 05:09:44
1	4	314.80262179241856	283.3269434542741	20/04/28 05:09:44
1	4	314.8444806279979	283.2453836176595	20/04/28 05:09:45
1	4	314.8642780257544	283.1943326419624	20/04/28 05:09:45
1	4	314.9215142200878	283.2065894100673	20/04/28 05:09:45
1	4	314.9404862650165	283.17720365591373	20/04/28 05:09:45
1	4	315.02087165549284	283.1086470668936	20/04/28 05:09:45
1	4	315.23907370515616	283.23728059762965	20/04/28 05:09:45
1	4	315.3209120836317	283.18179801157305	20/04/28 05:09:45
1	4	315.5589707502812	283.3600774255475	20/04/28 05:09:45
1	4	315.8233388655627	283.3189073201276	20/04/28 05:09:45
1	4	315.89056745109235	283.2301277705507	20/04/28 05:09:45
1	4	315.89056745109235	283.2301277705507	20/04/28 05:09:46
1	4	315.9140520965153	283.52542645283603	20/04/28 05:09:46
1	4	315.89999124486803	283.42597060149245	20/04/28 05:09:46
1	4	315.8145990600928	283.6552571020859	20/04/28 05:09:46
1	4	316.09995382110753	283.67849017109916	20/04/28 05:09:46
1	4	316.0957446771334	283.79496121897654	20/04/28 05:09:46
1	4	316.1107769056515	283.7858124559567	20/04/28 05:09:46
1	4	316.3029114939378	283.78173590068906	20/04/28 05:09:46
1	4	316.10374165984166	283.6111779702316	20/04/28 05:09:46
1	4	316.0534693711866	283.81614352804263	20/04/28 05:09:47
1	4	316.29378039204164	283.8214781979839	20/04/28 05:09:47
1	4	316.49986373139416	283.92473651840834	20/04/28 05:09:47
1	4	316.30915750589895	284.0662486659039	20/04/28 05:09:47
1	4	316.31082643817064	284.0341019253273	20/04/28 05:09:47
1	4	316.2500672227224	284.01131759289785	20/04/28 05:09:47
1	4	316.2584981252759	283.79372410877403	20/04/28 05:09:47
1	4	316.3176797644005	283.75990584724093	20/04/28 05:09:47
1	4	316.3466209480644	283.63962845377694	20/04/28 05:09:47
1	4	316.55744560045457	283.4919452977347	20/04/28 05:09:47
1	4	316.5697018573166	283.41510592759414	20/04/28 05:09:48
1	4	316.6329105250491	283.6395208561747	20/04/28 05:09:48
1	4	316.5073682196561	283.41542970950087	20/04/28 05:09:48
1	4	316.44866853093845	283.66820457752766	20/04/28 05:09:48
1	4	316.3500999077525	283.65338653313574	20/04/28 05:09:48
1	4	316.2796585443022	283.7036839515294	20/04/28 05:09:48
1	4	316.36362197782336	283.90989570780323	20/04/28 05:09:48
1	4	316.3674700833658	283.9302434050118	20/04/28 05:09:48
1	4	316.3016547438282	283.75963495084676	20/04/28 05:09:48
1	4	316.32177968921496	283.73933473243073	20/04/28 05:09:48
1	4	316.32177968921496	283.73933473243073	20/04/28 05:09:49
1	4	316.32177968921496	283.73933473243073	20/04/28 05:09:49
1	4	316.5978887401555	283.8009910807173	20/04/28 05:09:49
1	4	316.60449537948205	283.77464032810053	20/04/28 05:09:49
1	4	316.51430840371376	283.8614997299034	20/04/28 05:09:49
1	4	316.49766873600544	283.85143138238993	20/04/28 05:09:49
1	4	316.367377638934	283.7456782350607	20/04/28 05:09:49
1	4	316.53773531136414	283.7418153185274	20/04/28 05:09:49
1	4	316.57100332788514	283.73512599656885	20/04/28 05:09:49
1	4	316.59262503479385	283.7242915940516	20/04/28 05:09:50
1	4	316.3755792509953	283.85798132092367	20/04/28 05:09:50
1	4	316.379193353495	283.85856459781957	20/04/28 05:09:50
1	4	316.2205795557222	283.91271910147395	20/04/28 05:09:50
1	4	316.0183720853733	283.81789975101634	20/04/28 05:09:50
1	4	316.24079362675656	283.65398986571773	20/04/28 05:09:50
1	4	316.231862614988	283.9244686085544	20/04/28 05:09:50
1	4	315.95848535198047	283.9687585457362	20/04/28 05:09:50
1	4	316.0872646586461	283.8311378098325	20/04/28 05:09:50
1	4	316.01963457716727	283.8111591577389	20/04/28 05:09:50
1	4	316.0336930311949	283.79624119677464	20/04/28 05:09:51
1	4	315.98576096190516	283.903801917737	20/04/28 05:09:51
1	4	316.04384289187857	283.99340799506024	20/04/28 05:09:51
1	4	316.2167110566426	283.8139289526188	20/04/28 05:09:51
1	4	316.0750058876267	284.04194326229043	20/04/28 05:09:51
1	4	316.0545110720396	284.0685577120679	20/04/28 05:09:51
1	4	316.007821523049	284.0613301006092	20/04/28 05:09:51
1	4	316.0012303968359	284.052309044511	20/04/28 05:09:51
1	4	316.0479332250644	283.9467238335126	20/04/28 05:09:51
1	4	316.02515539568776	283.91342362424257	20/04/28 05:09:51
1	4	316.0237485736762	283.91402610435046	20/04/28 05:09:52
1	4	316.0843269693119	284.0367301606528	20/04/28 05:09:52
1	4	316.02158768725405	284.0859170451504	20/04/28 05:09:52
1	4	315.9439893110607	284.0408450781953	20/04/28 05:09:52
1	4	315.8661323724409	284.11568711120606	20/04/28 05:09:52
1	4	315.9245567160034	284.1411444034421	20/04/28 05:09:52
1	4	316.02213216855205	284.0340379550702	20/04/28 05:09:52
1	4	316.0331573915858	283.90868759161145	20/04/28 05:09:52
1	4	316.03275751953925	283.90799720224254	20/04/28 05:09:52
1	4	315.7637452738023	283.82737079649763	20/04/28 05:09:53
1	4	315.65497730063043	284.05706667529216	20/04/28 05:09:53
1	4	315.66002507112387	283.87408668522596	20/04/28 05:09:53
1	4	315.60391725923307	283.74317096261126	20/04/28 05:09:53
1	4	315.6090448587222	283.70606069545425	20/04/28 05:09:53
1	4	315.76786125360684	283.8065649566029	20/04/28 05:09:53
1	4	315.52595084106804	283.82004098089675	20/04/28 05:09:53
1	4	315.65655018425497	283.8571708675174	20/04/28 05:09:53
1	4	315.9287165938919	283.7895656382016	20/04/28 05:09:53
1	4	315.7663643883103	283.90458388435104	20/04/28 05:09:53
1	4	315.80152626107514	283.68358985417393	20/04/28 05:09:54
1	4	315.92006812269005	283.69597411823224	20/04/28 05:09:54
1	4	316.1688282561385	283.7143001089997	20/04/28 05:09:54
1	4	316.089798049221	283.4706964373669	20/04/28 05:09:54
1	4	316.2280263556923	283.40530902704376	20/04/28 05:09:54
1	4	316.2331339339874	283.4173701083419	20/04/28 05:09:54
1	4	316.20088031806426	283.443236172422	20/04/28 05:09:54
1	4	316.00993785986486	283.5300486515092	20/04/28 05:09:54
1	4	316.09281482927173	283.6347443306847	20/04/28 05:09:54
1	4	315.9972334860265	283.56030089016343	20/04/28 05:09:54
1	4	316.1005033741528	283.5860396358603	20/04/28 05:09:55
1	4	316.08764530028594	283.52522262806195	20/04/28 05:09:55
1	4	316.08456653735243	283.5374796935482	20/04/28 05:09:55
1	4	316.0566110030283	283.5119360574909	20/04/28 05:09:55
1	4	315.91062827806456	283.4783037757769	20/04/28 05:09:55
1	4	315.8991542115622	283.4870183243585	20/04/28 05:09:55
1	4	315.78842448841624	283.59299280972846	20/04/28 05:09:55
1	4	315.74946362551987	283.6276811632128	20/04/28 05:09:55
1	4	315.79854282987634	283.4468096676435	20/04/28 05:09:55
1	4	315.84342634276504	283.3040222954859	20/04/28 05:09:56
1	4	315.7402648243513	283.39394427780024	20/04/28 05:09:56
1	4	315.7206886371463	283.60234942394806	20/04/28 05:09:56
1	4	315.63868973600194	283.7745516763175	20/04/28 05:09:56
1	4	315.5738259990733	283.62305233094224	20/04/28 05:09:56
1	4	315.53284370951656	283.54852010964146	20/04/28 05:09:56
1	4	315.3353827215109	283.4180773921268	20/04/28 05:09:56
1	4	315.4061810670667	283.28469358736584	20/04/28 05:09:56
1	4	315.42040155243035	283.0152151420802	20/04/28 05:09:56
1	4	315.3594767428436	283.1798940320187	20/04/28 05:09:56
1	4	315.3776691742369	283.1381203405958	20/04/28 05:09:57
1	4	315.3776691742369	283.1381203405958	20/04/28 05:09:57
1	4	315.6132482319648	282.9922833754789	20/04/28 05:09:57
1	4	315.6853596807718	283.03535334370054	20/04/28 05:09:57
1	4	315.55672423421754	283.0190521338438	20/04/28 05:09:57
1	4	315.5579997175871	283.01673864071864	20/04/28 05:09:57
1	4	315.6672462476857	282.8492564158373	20/04/28 05:09:57
1	4	315.54583556422	283.09126644892365	20/04/28 05:09:57
1	4	315.53528782892965	283.43037301569694	20/04/28 05:09:57
1	4	315.6142137389107	283.3297745069063	20/04/28 05:09:58
1	4	315.84679994087463	283.2772734634738	20/04/28 05:09:58
1	4	315.8418026921505	283.354193989325	20/04/28 05:09:58
1	4	315.565751465058	283.2669175245104	20/04/28 05:09:58
1	4	315.3469366023543	283.3538998510753	20/04/28 05:09:58
1	4	315.08662156938584	283.3504190083638	20/04/28 05:09:58
1	4	314.9511166470982	283.3468070946675	20/04/28 05:09:58
1	4	314.75512020752313	283.53547016506667	20/04/28 05:09:58
1	4	314.76180288131457	283.4218795707179	20/04/28 05:09:58
1	4	314.89737854095836	283.3268511238924	20/04/28 05:09:58
1	4	314.8462633942218	283.35047053947375	20/04/28 05:09:59
1	4	315.13837730057963	283.29235144042997	20/04/28 05:09:59
1	4	314.97412909146357	283.3675046826629	20/04/28 05:09:59
1	4	315.0639425451994	283.51132120544986	20/04/28 05:09:59
1	4	315.23941144425754	283.71865763991707	20/04/28 05:09:59
1	4	315.28872209738165	283.7424692021376	20/04/28 05:09:59
1	4	315.3159294827985	283.8153017125653	20/04/28 05:09:59
1	4	315.43126591288126	283.96289608241045	20/04/28 05:09:59
1	4	315.4331401328542	283.78069371555637	20/04/28 05:09:59
1	4	315.45445000855756	283.7970665004114	20/04/28 05:10:00
1	4	315.4650329597792	283.80617175914705	20/04/28 05:10:00
1	4	315.6766850707625	283.81892037957664	20/04/28 05:10:00
1	4	315.47866954574636	283.72538823780286	20/04/28 05:10:00
1	4	315.53858910790933	283.6632261765256	20/04/28 05:10:00
1	4	315.4248121414813	283.72690079412234	20/04/28 05:10:00
1	4	315.5781204053365	283.70862852669865	20/04/28 05:10:00
1	4	315.6477494503884	283.7196055343635	20/04/28 05:10:00
1	4	315.78933711043675	283.906790289709	20/04/28 05:10:00
1	4	315.7870009771518	283.70145869312586	20/04/28 05:10:00
1	4	315.6064290779406	283.68015441962984	20/04/28 05:10:01
1	4	315.51392562097	283.6249352971605	20/04/28 05:10:01
1	4	315.6814312653297	283.412579247962	20/04/28 05:10:01
1	4	315.4703176599522	283.48711242064127	20/04/28 05:10:01
1	4	315.32640554520503	283.31172348929215	20/04/28 05:10:01
1	4	315.18867405591624	283.43791840699095	20/04/28 05:10:01
1	4	315.0440209350045	283.2771935314957	20/04/28 05:10:01
1	4	315.0392690808694	283.2511312755956	20/04/28 05:10:01
1	4	314.8175934790906	283.1414638110523	20/04/28 05:10:01
1	4	314.85990837471496	283.1345501870849	20/04/28 05:10:02
1	4	315.0560019731811	283.06247437311094	20/04/28 05:10:02
1	4	315.0990044257026	282.85005892425664	20/04/28 05:10:02
1	4	315.1003004048488	282.81745630622913	20/04/28 05:10:02
1	4	315.1436995698978	282.7520940260541	20/04/28 05:10:02
1	4	314.9819857331189	282.871275378209	20/04/28 05:10:02
1	4	315.0527226617471	282.9265954635579	20/04/28 05:10:02
1	4	315.0527226617471	282.9265954635579	20/04/28 05:10:02
1	4	315.1808781834254	283.1796781280055	20/04/28 05:10:02
1	4	315.39988704466117	283.17200744333377	20/04/28 05:10:02
1	4	315.2223399915343	283.15854805661417	20/04/28 05:10:03
1	4	315.09719143117735	283.0067297741945	20/04/28 05:10:03
1	4	315.0238948983098	283.1641786516903	20/04/28 05:10:03
1	4	315.30048831618444	283.2354384441655	20/04/28 05:10:03
1	4	315.30298519763124	283.23528936326477	20/04/28 05:10:03
1	4	315.22680216505046	283.1327115937131	20/04/28 05:10:03
1	4	315.15324305104576	283.33250007071064	20/04/28 05:10:03
1	4	315.1100360351232	283.3613294493612	20/04/28 05:10:03
1	4	315.2371905360321	283.1278339997313	20/04/28 05:10:03
1	4	315.31441568299823	283.004991583951	20/04/28 05:10:03
1	4	315.55922626656593	283.055167929231	20/04/28 05:10:04
1	4	315.3906440420809	283.1384259567298	20/04/28 05:10:04
1	4	315.4057958766141	282.9520789174436	20/04/28 05:10:04
1	4	315.5632137884843	282.725773942227	20/04/28 05:10:04
1	4	315.6652653423772	282.79781481059734	20/04/28 05:10:04
1	4	315.6324673196728	282.78554482413864	20/04/28 05:10:04
1	4	315.40131376153084	282.69465082410807	20/04/28 05:10:04
1	4	315.4072438812802	282.9832286552098	20/04/28 05:10:04
1	4	315.27248195363643	283.1215906433461	20/04/28 05:10:04
1	4	315.29943378150966	283.1371936662599	20/04/28 05:10:05
1	4	315.2899487365873	283.35855732190606	20/04/28 05:10:05
1	4	315.16346876905226	283.63480011570925	20/04/28 05:10:05
1	4	315.1908006516953	283.54133279163716	20/04/28 05:10:05
1	4	315.0445226779365	283.51032013065117	20/04/28 05:10:05
1	4	315.07689100380435	283.49110847382184	20/04/28 05:10:05
1	4	315.07689100380435	283.49110847382184	20/04/28 05:10:05
1	4	314.9388341352766	283.52478535451155	20/04/28 05:10:05
1	4	314.88583438178057	283.55171811487344	20/04/28 05:10:05
1	4	315.1110894231177	283.44275121034866	20/04/28 05:10:05
1	4	315.19593468265373	283.31961657293596	20/04/28 05:10:06
1	4	315.3594294698211	283.54842340420225	20/04/28 05:10:06
1	4	315.35231103397336	283.5465538369951	20/04/28 05:10:06
1	4	315.24481888949873	283.6176315538869	20/04/28 05:10:06
1	4	315.27876674886267	283.57160341998326	20/04/28 05:10:06
1	4	315.1834141087085	283.33612314511885	20/04/28 05:10:06
1	4	314.892709838579	283.3324165348395	20/04/28 05:10:06
1	4	314.8907881497593	283.32057182099936	20/04/28 05:10:06
1	4	315.010252189133	283.192085380636	20/04/28 05:10:06
1	4	314.82971006832065	283.29191007705856	20/04/28 05:10:07
1	4	314.90498448412154	283.29060367049175	20/04/28 05:10:07
1	4	314.97515402216857	283.00698438230484	20/04/28 05:10:07
1	4	314.97515402216857	283.00698438230484	20/04/28 05:10:07
1	4	314.68894203510655	282.8951415268678	20/04/28 05:10:07
1	4	314.3948172812663	282.9052595335438	20/04/28 05:10:07
1	4	314.22980150442504	282.8245315321495	20/04/28 05:10:07
1	4	314.4359757435249	282.6141407449294	20/04/28 05:10:07
1	4	314.6410209652614	282.7537943663629	20/04/28 05:10:07
1	4	314.76039819165226	282.7083219884132	20/04/28 05:10:07
1	4	314.76039819165226	282.7083219884132	20/04/28 05:10:08
1	4	314.81501238855674	282.7058678286562	20/04/28 05:10:08
1	4	314.8047385580683	282.680623539281	20/04/28 05:10:08
1	4	314.7371973769711	282.85900139522323	20/04/28 05:10:08
1	4	314.9142957402367	282.83876082731524	20/04/28 05:10:08
1	4	314.8790157904056	282.6778319485401	20/04/28 05:10:08
1	4	314.6451121753499	282.5243593657201	20/04/28 05:10:08
1	4	314.572461289325	282.4203525457668	20/04/28 05:10:08
1	4	314.4560715843415	282.38991183268934	20/04/28 05:10:08
1	4	314.45445881307813	282.387934332152	20/04/28 05:10:08
1	4	314.2827240385781	282.5136051637082	20/04/28 05:10:09
1	4	314.26662207012583	282.4883100233289	20/04/28 05:10:09
1	4	314.29737122584885	282.4178276443712	20/04/28 05:10:09
1	4	314.3282494169814	282.35096505870115	20/04/28 05:10:09
1	4	314.4291018809407	282.26750636041066	20/04/28 05:10:09
1	4	314.3006141869631	282.4722275428657	20/04/28 05:10:09
1	4	314.18314452801457	282.44742569247325	20/04/28 05:10:09
1	4	314.1765116121874	282.3765014488019	20/04/28 05:10:09
1	4	314.30553143271493	282.48174324897434	20/04/28 05:10:09
1	4	314.0391757626229	282.5742726711731	20/04/28 05:10:10
1	4	314.01139560928385	282.5662809607306	20/04/28 05:10:10
1	4	314.20664417610055	282.4787450451776	20/04/28 05:10:10
1	4	314.0594058725427	282.24795981947915	20/04/28 05:10:10
1	4	314.0464723347346	282.08764601477213	20/04/28 05:10:10
1	4	313.82595703453956	282.10336905025673	20/04/28 05:10:10
1	4	314.06569448064056	282.19461265269723	20/04/28 05:10:10
1	4	314.0919485779956	282.02798211056586	20/04/28 05:10:10
1	4	314.01719321983103	282.0751704196369	20/04/28 05:10:10
1	4	313.7526002803154	282.18587344007466	20/04/28 05:10:10
1	4	313.64189822829604	282.2739510766179	20/04/28 05:10:11
1	4	313.78754865939425	282.0197395199735	20/04/28 05:10:11
1	4	313.9045144417057	282.10847042209537	20/04/28 05:10:11
1	4	313.74509529285183	282.0445239178327	20/04/28 05:10:11
1	4	313.7244010941969	282.2941540118685	20/04/28 05:10:11
1	4	313.73281418915803	282.26388653083444	20/04/28 05:10:11
1	4	313.6906302958643	282.17680756149963	20/04/28 05:10:11
1	4	313.59933592191106	282.1585632242294	20/04/28 05:10:11
1	4	313.6315249886395	282.22570281634484	20/04/28 05:10:11
1	4	313.68024587851477	282.345589076121	20/04/28 05:10:12
1	4	313.6812761618876	282.34485210542294	20/04/28 05:10:12
1	4	313.77139079722224	282.11151287306035	20/04/28 05:10:12
1	4	313.8410175861086	282.2625305790199	20/04/28 05:10:12
1	4	314.02576409803953	282.29867491719455	20/04/28 05:10:12
1	4	313.8751170270583	282.3655986714072	20/04/28 05:10:12
1	4	314.04918709429506	282.59784707542633	20/04/28 05:10:12
1	4	314.01049121003746	282.58177838034527	20/04/28 05:10:12
1	4	314.10970733090613	282.4517171681282	20/04/28 05:10:12
1	4	313.98455384359585	282.62671282442307	20/04/28 05:10:12
1	4	313.82993263598286	282.4085703829803	20/04/28 05:10:13
1	4	313.83246324490824	282.3974787346611	20/04/28 05:10:13
1	4	313.56782167238805	282.3796078695332	20/04/28 05:10:13
1	4	313.65594644810636	282.595612154336	20/04/28 05:10:13
1	4	313.6043626863104	282.5128921144833	20/04/28 05:10:13
1	4	313.64805264310627	282.58148756603083	20/04/28 05:10:13
1	4	313.8757113489076	282.7655792418127	20/04/28 05:10:13
1	4	313.97683140854093	282.71395714264503	20/04/28 05:10:13
1	4	314.0591436085688	282.69327496906226	20/04/28 05:10:13
1	4	313.9481806899299	282.8822774256842	20/04/28 05:10:14
1	4	314.18324285879277	282.9081084078815	20/04/28 05:10:14
1	4	314.2556722980946	283.10700906553467	20/04/28 05:10:14
1	4	314.19211629610953	283.3407975179514	20/04/28 05:10:14
1	4	314.19802062903165	283.411357253267	20/04/28 05:10:14
1	4	314.27900661138204	283.4013399470078	20/04/28 05:10:14
1	4	314.3240677229197	283.253058914293	20/04/28 05:10:14
1	4	314.28242495699357	283.2457677949165	20/04/28 05:10:14
1	4	314.3418311229128	282.9555214494481	20/04/28 05:10:14
1	4	314.3418311229128	282.9555214494481	20/04/28 05:10:14
1	4	314.3418311229128	282.9555214494481	20/04/28 05:10:15
1	4	314.4525367943135	283.07134079287147	20/04/28 05:10:15
1	4	314.4729551246935	283.0427269668108	20/04/28 05:10:15
1	4	314.41471695554515	283.06403591883964	20/04/28 05:10:15
1	4	314.2253332401315	283.18543541004635	20/04/28 05:10:15
1	4	314.11820758322153	283.30311473049125	20/04/28 05:10:15
1	4	313.96163236277397	283.4126302893597	20/04/28 05:10:15
1	4	313.9331793551237	283.4454713951649	20/04/28 05:10:15
1	4	314.072839897136	283.61132542053787	20/04/28 05:10:15
1	4	314.0469705529951	283.90457127073864	20/04/28 05:10:16
1	4	313.77944369315884	283.8838322880794	20/04/28 05:10:16
1	4	313.8603218160384	283.89153996203385	20/04/28 05:10:16
1	4	313.9626327687438	283.7913953767529	20/04/28 05:10:16
1	4	313.9177285095503	283.7707926591851	20/04/28 05:10:16
1	4	313.8120013312271	283.69770001582486	20/04/28 05:10:16
1	4	313.75843031424654	283.71104270969414	20/04/28 05:10:16
1	4	313.7423079491366	283.7562732748499	20/04/28 05:10:16
1	4	313.7375687026315	283.7410261664893	20/04/28 05:10:16
1	4	313.7892381483502	283.5248620582617	20/04/28 05:10:16
1	4	313.7810856969819	283.53890883475066	20/04/28 05:10:17
1	4	313.73377147876215	283.5622735004648	20/04/28 05:10:17
1	4	313.65561506314634	283.39832553639025	20/04/28 05:10:17
1	4	313.38790627775074	283.4198569289591	20/04/28 05:10:17
1	4	313.4621690147104	283.1911288948212	20/04/28 05:10:17
1	4	313.4686296573728	283.1102167210489	20/04/28 05:10:17
1	4	313.34597750497267	283.24208625033054	20/04/28 05:10:17
1	4	313.3454983618181	283.24774182170955	20/04/28 05:10:17
1	4	313.45323010366667	283.1986694603109	20/04/28 05:10:17
1	4	313.59418421648303	283.3967766012414	20/04/28 05:10:17
1	4	313.5167128566099	283.62614435777016	20/04/28 05:10:18
1	4	313.45698950155605	283.6486751112015	20/04/28 05:10:18
1	4	313.5192067213287	283.8497772888837	20/04/28 05:10:18
1	4	313.6146060499961	283.9120522934186	20/04/28 05:10:18
1	4	313.6947817854111	283.98488951885247	20/04/28 05:10:18
1	4	313.6524672196234	284.22642056424513	20/04/28 05:10:18
1	4	313.71087417587336	284.2022469803973	20/04/28 05:10:18
1	4	313.72956992722544	284.02727587662156	20/04/28 05:10:18
1	4	313.8744776173221	284.25500719627723	20/04/28 05:10:18
1	4	314.01324829450493	284.490231998049	20/04/28 05:10:19
1	4	313.9629127329274	284.6087047496956	20/04/28 05:10:19
1	4	313.8921915194139	284.8726958075527	20/04/28 05:10:19
1	4	313.8952244872012	284.8537706444504	20/04/28 05:10:19
1	4	313.8336149374539	284.61565334698696	20/04/28 05:10:19
1	4	313.8658088886949	284.3736707452683	20/04/28 05:10:19
1	4	313.8609373075754	284.4961770885819	20/04/28 05:10:19
1	4	313.839019206234	284.5071760256093	20/04/28 05:10:19
1	4	313.77872664874286	284.33258986009514	20/04/28 05:10:19
1	4	313.7149087762336	284.5528792656255	20/04/28 05:10:19
1	4	313.67979332225696	284.49488318241123	20/04/28 05:10:20
1	4	313.76278817660494	284.63433370005833	20/04/28 05:10:20
1	4	313.8481480527325	284.736616586764	20/04/28 05:10:20
1	4	313.60958838727834	284.86301619153335	20/04/28 05:10:20
1	4	313.4879286336018	284.87131291226143	20/04/28 05:10:20
1	4	313.49072804078827	285.05133894001636	20/04/28 05:10:20
1	4	313.4498365021701	285.10681016920034	20/04/28 05:10:20
1	4	313.42173003368487	285.1470997622106	20/04/28 05:10:20
1	4	313.44607968514214	285.1632036598083	20/04/28 05:10:20
1	4	313.44836322091993	285.2263933967146	20/04/28 05:10:21
1	4	313.5034294186104	285.08055743671844	20/04/28 05:10:21
1	4	313.54510458096075	285.05002586145713	20/04/28 05:10:21
1	4	313.4282982077038	284.94227269905195	20/04/28 05:10:21
1	4	313.32643718151473	284.8451519317791	20/04/28 05:10:21
1	4	313.2428405000164	284.85797192116297	20/04/28 05:10:21
1	4	313.1771029180575	284.98109325773095	20/04/28 05:10:21
1	4	313.1261371070986	284.76262930071874	20/04/28 05:10:21
1	4	313.1833458238743	284.8220162709961	20/04/28 05:10:21
1	4	313.18592606610866	284.8632311396473	20/04/28 05:10:21
1	4	313.20052012687887	284.8339415251716	20/04/28 05:10:22
1	4	313.20052012687887	284.8339415251716	20/04/28 05:10:22
1	4	313.20052012687887	284.8339415251716	20/04/28 05:10:22
1	4	313.16646862718653	284.85914287247414	20/04/28 05:10:22
1	4	313.1644821468838	284.8600025455827	20/04/28 05:10:22
1	4	313.0706121311804	285.02728191439166	20/04/28 05:10:22
1	4	312.8512142539531	285.228907919236	20/04/28 05:10:22
1	4	312.8512142539531	285.228907919236	20/04/28 05:10:22
