floorId	partitionId	location_x	location_y	timeStamp
18	982	360.3327834419265	278.3422844929435	21/02/24 15:39:04
18	982	360.3327834419265	278.3422844929435	21/02/24 15:39:05
18	982	360.3327834419265	278.3422844929435	21/02/24 15:39:06
18	979	348.2367582443579	277.1518332869306	21/02/24 15:39:07
18	982	360.3327834419265	278.3422844929435	21/02/24 15:39:08
18	979	348.2367582443579	277.1518332869306	21/02/24 15:39:09
18	979	348.2367582443579	277.1518332869306	21/02/24 15:39:10
18	979	348.2367582443579	277.1518332869306	21/02/24 15:39:11
18	979	348.2367582443579	277.1518332869306	21/02/24 15:39:12
18	979	348.2367582443579	277.1518332869306	21/02/24 15:39:13
18	979	348.2367582443579	277.1518332869306	21/02/24 15:39:14
18	982	360.3327834419265	278.3422844929435	21/02/24 15:39:15
18	982	360.3327834419265	278.3422844929435	21/02/24 15:39:16
18	979	348.2367582443579	277.1518332869306	21/02/24 15:39:17
18	979	348.2367582443579	277.1518332869306	21/02/24 15:39:18
18	979	348.2367582443579	277.1518332869306	21/02/24 15:39:19
18	979	348.2367582443579	277.1518332869306	21/02/24 15:39:20
18	979	348.2367582443579	277.1518332869306	21/02/24 15:39:21
18	979	348.2367582443579	277.1518332869306	21/02/24 15:39:22
18	979	348.2367582443579	277.1518332869306	21/02/24 15:39:23
18	979	348.2367582443579	277.1518332869306	21/02/24 15:39:24
18	979	348.2367582443579	277.15183328693064	21/02/24 15:39:25
18	979	348.2367582443579	277.15183328693064	21/02/24 15:39:26
18	979	341.3179542174323	279.8134374747344	21/02/24 15:39:27
18	979	341.3179542174323	279.8134374747344	21/02/24 15:39:28
18	979	341.3179542174323	279.8134374747344	21/02/24 15:39:29
18	979	341.3179542174323	279.8134374747344	21/02/24 15:39:30
18	979	341.3179542174323	279.8134374747344	21/02/24 15:39:31
18	979	341.3179542174323	279.8134374747344	21/02/24 15:39:32
18	979	341.3179542174323	279.8134374747344	21/02/24 15:39:33
18	979	341.3179542174323	279.8134374747344	21/02/24 15:39:34
18	979	341.3179542174323	279.8134374747344	21/02/24 15:39:35
18	979	341.3179542174323	279.8134374747344	21/02/24 15:39:36
18	979	341.3179542174323	279.8134374747344	21/02/24 15:39:37
18	979	341.3179542174323	279.8134374747344	21/02/24 15:39:38
18	979	341.3179542174323	279.8134374747344	21/02/24 15:39:39
18	979	341.3179542174323	279.8134374747344	21/02/24 15:39:40
18	979	341.3179542174323	279.8134374747344	21/02/24 15:39:41
18	979	341.3179542174323	279.8134374747344	21/02/24 15:39:42
18	979	341.3179542174323	279.8134374747344	21/02/24 15:39:43
18	979	341.3179542174323	279.8134374747344	21/02/24 15:39:44
18	979	341.3179542174323	279.8134374747344	21/02/24 15:39:45
18	979	341.3179542174323	279.8134374747344	21/02/24 15:39:46
18	979	341.3179542174323	279.8134374747344	21/02/24 15:39:47
18	979	341.3179542174323	279.8134374747344	21/02/24 15:39:48
18	979	341.3179542174323	279.8134374747344	21/02/24 15:39:49
18	979	341.3179542174323	279.8134374747344	21/02/24 15:39:50
18	979	341.3179542174323	279.8134374747344	21/02/24 15:39:51
18	979	341.3179542174323	279.8134374747344	21/02/24 15:39:52
18	979	341.3179542174323	279.8134374747344	21/02/24 15:39:53
18	979	341.3179542174323	279.8134374747344	21/02/24 15:39:54
18	979	341.3179542174323	279.8134374747344	21/02/24 15:39:55
18	979	341.3179542174323	279.8134374747344	21/02/24 15:39:56
18	979	341.3179542174323	279.8134374747344	21/02/24 15:39:57
18	979	341.3179542174323	279.8134374747344	21/02/24 15:39:58
18	979	341.3179542174323	279.8134374747344	21/02/24 15:39:59
18	979	341.3179542174323	279.8134374747344	21/02/24 15:40:00
18	979	341.3179542174323	279.8134374747344	21/02/24 15:40:01
18	979	341.3179542174323	279.8134374747344	21/02/24 15:40:02
18	979	341.3179542174323	279.8134374747344	21/02/24 15:40:03
18	979	341.3179542174323	279.8134374747344	21/02/24 15:40:04
18	979	341.3179542174323	279.8134374747344	21/02/24 15:40:05
18	979	341.3179542174323	279.8134374747344	21/02/24 15:40:06
18	979	348.2367582443579	277.15183328693064	21/02/24 15:40:07
18	979	348.2367582443579	277.1518332869306	21/02/24 15:40:08
18	979	348.2367582443579	277.15183328693064	21/02/24 15:40:09
18	979	348.2367582443579	277.15183328693064	21/02/24 15:40:10
18	979	348.2367582443579	277.15183328693064	21/02/24 15:40:11
18	979	348.2367582443579	277.1518332869306	21/02/24 15:40:12
18	979	348.2367582443579	277.1518332869306	21/02/24 15:40:13
18	979	348.2367582443579	277.1518332869306	21/02/24 15:40:14
18	979	348.2367582443579	277.1518332869306	21/02/24 15:40:15
18	979	348.2367582443579	277.1518332869306	21/02/24 15:40:16
18	979	348.2367582443579	277.1518332869306	21/02/24 15:40:17
18	979	348.2367582443579	277.1518332869306	21/02/24 15:40:18
18	979	348.2367582443579	277.1518332869306	21/02/24 15:40:19
18	979	341.3179542174323	279.8134374747344	21/02/24 15:40:20
18	979	341.3179542174323	279.8134374747344	21/02/24 15:40:21
18	979	341.3179542174323	279.8134374747344	21/02/24 15:40:22
18	979	341.3179542174323	279.8134374747344	21/02/24 15:40:23
18	979	341.3179542174323	279.8134374747344	21/02/24 15:40:24
18	979	341.3179542174323	279.8134374747344	21/02/24 15:40:25
18	979	341.3179542174323	279.8134374747344	21/02/24 15:40:26
18	982	335.5707947754775	282.66660998132573	21/02/24 15:40:27
18	982	335.5707947754775	282.66660998132573	21/02/24 15:40:28
18	982	335.5707947754775	282.66660998132573	21/02/24 15:40:29
18	982	335.5707947754775	282.66660998132573	21/02/24 15:40:30
18	982	335.5707947754775	282.66660998132573	21/02/24 15:40:31
18	982	335.5707947754775	282.66660998132573	21/02/24 15:40:32
18	982	335.5707947754775	282.66660998132573	21/02/24 15:40:33
18	982	335.5707947754775	282.66660998132573	21/02/24 15:40:34
18	982	335.5707947754775	282.66660998132573	21/02/24 15:40:35
18	982	335.5707947754775	282.66660998132573	21/02/24 15:40:36
18	982	335.5707947754775	282.66660998132573	21/02/24 15:40:37
18	982	335.5707947754775	282.66660998132573	21/02/24 15:40:38
18	982	335.5707947754775	282.66660998132573	21/02/24 15:40:39
18	982	335.5707947754775	282.66660998132573	21/02/24 15:40:40
18	982	335.5707947754775	282.66660998132573	21/02/24 15:40:44
18	982	335.5707947754775	282.66660998132573	21/02/24 15:40:51
18	982	335.5707947754775	282.66660998132573	21/02/24 15:40:52
18	982	335.5707947754775	282.66660998132573	21/02/24 15:40:53
18	982	335.5707947754775	282.66660998132573	21/02/24 15:40:54
18	982	335.5707947754775	282.66660998132573	21/02/24 15:40:55
18	982	335.5707947754775	282.66660998132573	21/02/24 15:40:56
18	982	335.5707947754775	282.66660998132573	21/02/24 15:40:57
18	982	335.5707947754775	282.66660998132573	21/02/24 15:40:58
18	982	335.5707947754775	282.66660998132573	21/02/24 15:40:59
18	982	335.5707947754775	282.66660998132573	21/02/24 15:41:00
18	982	335.5707947754775	282.66660998132573	21/02/24 15:41:01
18	982	335.5707947754775	282.66660998132573	21/02/24 15:41:02
18	982	335.5707947754775	282.66660998132573	21/02/24 15:41:03
18	979	341.3179542174323	279.8134374747344	21/02/24 15:41:04
18	979	341.3179542174323	279.8134374747344	21/02/24 15:41:05
18	979	341.3179542174323	279.8134374747344	21/02/24 15:41:06
18	979	341.3179542174323	279.8134374747344	21/02/24 15:41:07
18	979	341.3179542174323	279.8134374747344	21/02/24 15:41:08
18	979	341.3179542174323	279.8134374747344	21/02/24 15:41:09
18	979	341.3179542174323	279.8134374747344	21/02/24 15:41:10
18	982	335.5707947754775	282.66660998132573	21/02/24 15:41:11
18	982	335.5707947754775	282.66660998132573	21/02/24 15:41:12
18	979	341.3179542174323	279.8134374747344	21/02/24 15:41:13
18	979	341.3179542174323	279.8134374747344	21/02/24 15:41:14
18	982	335.5707947754775	282.66660998132573	21/02/24 15:41:15
18	979	341.3179542174323	279.8134374747344	21/02/24 15:41:16
18	979	341.3179542174323	279.8134374747344	21/02/24 15:41:17
18	979	341.3179542174323	279.8134374747344	21/02/24 15:41:18
18	979	341.3179542174323	279.8134374747344	21/02/24 15:41:19
18	979	341.3179542174323	279.8134374747344	21/02/24 15:41:20
18	979	341.3179542174323	279.8134374747344	21/02/24 15:41:21
18	979	341.3179542174323	279.8134374747344	21/02/24 15:41:22
18	979	341.3179542174323	279.8134374747344	21/02/24 15:41:23
18	979	341.3179542174323	279.8134374747344	21/02/24 15:41:24
18	979	341.3179542174323	279.8134374747344	21/02/24 15:41:25
18	979	341.3179542174323	279.8134374747344	21/02/24 15:41:26
18	979	341.3179542174323	279.8134374747344	21/02/24 15:41:27
18	979	341.3179542174323	279.8134374747344	21/02/24 15:41:28
18	979	341.3179542174323	279.8134374747344	21/02/24 15:41:29
18	979	341.3179542174323	279.8134374747344	21/02/24 15:41:30
18	979	341.3179542174323	279.8134374747344	21/02/24 15:41:31
18	979	341.3179542174323	279.8134374747344	21/02/24 15:41:32
18	979	341.3179542174323	279.8134374747344	21/02/24 15:41:33
18	979	341.3179542174323	279.8134374747344	21/02/24 15:41:34
18	979	341.3179542174323	279.8134374747344	21/02/24 15:41:35
18	979	341.3179542174323	279.8134374747344	21/02/24 15:41:36
18	979	341.3179542174323	279.8134374747344	21/02/24 15:41:37
18	982	335.5707947754775	282.66660998132573	21/02/24 15:41:38
18	982	335.5707947754775	282.66660998132573	21/02/24 15:41:39
18	982	335.5707947754775	282.66660998132573	21/02/24 15:41:40
18	982	335.5707947754775	282.66660998132573	21/02/24 15:41:41
18	982	335.5707947754775	282.66660998132573	21/02/24 15:41:42
18	982	335.5707947754775	282.66660998132573	21/02/24 15:41:43
18	982	335.5707947754775	282.66660998132573	21/02/24 15:41:44
18	982	335.5707947754775	282.66660998132573	21/02/24 15:41:45
18	982	335.5707947754775	282.66660998132573	21/02/24 15:41:46
18	982	335.5707947754775	282.66660998132573	21/02/24 15:41:47
18	982	335.5707947754775	282.66660998132573	21/02/24 15:41:48
18	982	335.5707947754775	282.66660998132573	21/02/24 15:41:49
18	982	335.5707947754775	282.66660998132573	21/02/24 15:41:50
18	982	335.5707947754775	282.66660998132573	21/02/24 15:41:51
18	982	335.5707947754775	282.66660998132573	21/02/24 15:41:52
18	982	335.5707947754775	282.66660998132573	21/02/24 15:41:53
18	982	335.5707947754775	282.66660998132573	21/02/24 15:41:54
18	982	335.5707947754775	282.66660998132573	21/02/24 15:41:55
18	982	335.5707947754775	282.66660998132573	21/02/24 15:41:56
18	982	335.5707947754775	282.66660998132573	21/02/24 15:41:57
18	982	335.5707947754775	282.66660998132573	21/02/24 15:41:58
18	982	335.5707947754775	282.66660998132573	21/02/24 15:41:59
18	982	335.5707947754775	282.66660998132573	21/02/24 15:42:00
18	982	335.5707947754775	282.66660998132573	21/02/24 15:42:01
18	982	335.5707947754775	282.66660998132573	21/02/24 15:42:02
