floorId	partitionId	location_x	location_y	timeStamp
19	895	344.2324469898725	280.2334178530586	21/02/24 15:45:09
19	895	344.0718492657131	279.9885682409607	21/02/24 15:45:09
19	895	343.95999361134545	279.81803149315664	21/02/24 15:45:09
19	895	343.95999361134545	279.81803149315664	21/02/24 15:45:10
19	895	343.95999361134545	279.81803149315664	21/02/24 15:45:10
19	909	343.82733564119985	279.4588330373857	21/02/24 15:45:10
19	909	343.7875393554643	279.3117321607045	21/02/24 15:45:10
19	909	343.74519981954404	279.155230549134	21/02/24 15:45:10
19	909	343.74519981954404	279.155230549134	21/02/24 15:45:10
19	909	343.65348424336594	278.81621796512655	21/02/24 15:45:10
19	909	343.65348424336594	278.81621796512655	21/02/24 15:45:10
19	909	343.52632135321335	278.34617981264563	21/02/24 15:45:10
19	909	343.52632135321335	278.34617981264563	21/02/24 15:45:10
19	909	343.48543349527085	278.19504410644123	21/02/24 15:45:11
19	909	343.348759761688	277.6898505775048	21/02/24 15:45:11
19	909	343.30057821558034	277.5117548697954	21/02/24 15:45:11
19	909	343.23495806467224	277.26920002961083	21/02/24 15:45:11
19	909	343.1566432044261	276.9797211401506	21/02/24 15:45:11
19	909	343.1566432044261	276.9797211401506	21/02/24 15:45:11
19	909	343.03027416436424	276.51261733297724	21/02/24 15:45:11
19	909	343.03027416436424	276.51261733297724	21/02/24 15:45:11
19	909	342.9526920335893	276.22584686581325	21/02/24 15:45:11
19	909	342.88392664346185	275.9716661304481	21/02/24 15:45:12
19	909	342.8101654587383	275.6990192053062	21/02/24 15:45:12
19	909	342.7401502325238	275.44021864221804	21/02/24 15:45:12
19	909	342.69032481160673	275.25604660298296	21/02/24 15:45:12
19	909	342.62778276927446	275.02486951983417	21/02/24 15:45:12
19	909	342.49411233828147	274.5307772390604	21/02/24 15:45:12
19	909	342.425600626438	274.27753418662917	21/02/24 15:45:12
19	909	342.36799905819544	274.06461880947614	21/02/24 15:45:12
19	909	342.3116063021194	273.8561716214053	21/02/24 15:45:12
19	909	342.2654336616737	273.69608717249235	21/02/24 15:45:13
19	909	342.03402154600263	273.61228552131837	21/02/24 15:45:13
19	909	341.8814877343685	273.557048200499	21/02/24 15:45:13
19	909	341.6956772180737	273.4897603317293	21/02/24 15:45:13
19	909	341.4198683190548	273.3898812001668	21/02/24 15:45:13
19	909	341.173218518405	273.30056150099614	21/02/24 15:45:13
19	909	340.9238019468411	273.2102398665104	21/02/24 15:45:13
19	909	340.9238019468411	273.2102398665104	21/02/24 15:45:13
19	909	340.70972994368884	273.1327176188862	21/02/24 15:45:13
19	909	340.53348599144846	273.068894105738	21/02/24 15:45:13
19	909	340.2543356060911	272.9678049162158	21/02/24 15:45:14
19	909	340.0249854227941	272.8847499560137	21/02/24 15:45:14
19	909	339.5809485247864	272.72395014167677	21/02/24 15:45:14
19	909	339.3744948395433	272.64918672808386	21/02/24 15:45:14
19	909	339.1898345226757	272.58231538293	21/02/24 15:45:14
19	909	339.1898345226757	272.58231538293	21/02/24 15:45:14
19	909	338.9918353087374	272.51061360097674	21/02/24 15:45:14
19	909	338.61121288995383	272.37277817660663	21/02/24 15:45:14
19	909	338.61121288995383	272.37277817660663	21/02/24 15:45:14
19	909	338.3465244079089	272.2769260999866	21/02/24 15:45:15
19	909	338.0932303459129	272.1852003034946	21/02/24 15:45:15
19	909	337.9034675989875	272.11648120692723	21/02/24 15:45:15
19	909	337.65566075056074	272.02674250413645	21/02/24 15:45:15
19	909	337.4359810237326	271.9471895222873	21/02/24 15:45:15
19	909	337.2414463015467	271.87674234244724	21/02/24 15:45:15
19	909	337.06203115056115	271.81177043786647	21/02/24 15:45:15
19	909	336.8795497175793	271.7456881355284	21/02/24 15:45:15
19	909	336.7269749544848	271.6904359848891	21/02/24 15:45:15
19	909	336.529254324342	271.6188350869453	21/02/24 15:45:16
19	909	336.27801317407403	271.5278527147637	21/02/24 15:45:16
19	909	336.09129153682596	271.4602349002602	21/02/24 15:45:16
19	909	335.8302991380124	271.36572129235765	21/02/24 15:45:16
19	909	335.58724245712847	271.2777027755748	21/02/24 15:45:16
19	909	335.4032512194186	271.2110737251601	21/02/24 15:45:16
19	909	335.1481699381112	271.11870071999067	21/02/24 15:45:16
19	909	334.9294425954394	271.03949262658705	21/02/24 15:45:16
19	909	334.9294425954394	271.03949262658705	21/02/24 15:45:16
19	909	334.67574363514296	270.9476202036056	21/02/24 15:45:16
19	909	334.468491066721	270.8725674891293	21/02/24 15:45:17
19	909	334.0179576588752	270.7094150829684	21/02/24 15:45:17
19	909	334.0179576588752	270.7094150829684	21/02/24 15:45:17
19	909	333.73651912919104	270.6074972839667	21/02/24 15:45:17
19	909	333.34386790610233	270.4653058488515	21/02/24 15:45:17
19	909	333.11556703897105	270.3826308792434	21/02/24 15:45:17
19	909	332.9383584019266	270.31845802319583	21/02/24 15:45:17
19	909	332.70698717070604	270.2346711775753	21/02/24 15:45:17
19	909	332.4748646498182	270.1506122661883	21/02/24 15:45:17
19	909	332.2209949259389	270.0586780043089	21/02/24 15:45:18
19	909	331.9995960357108	269.9785024589819	21/02/24 15:45:18
19	909	331.9995960357108	269.9785024589819	21/02/24 15:45:18
19	950	331.93815203958894	269.72953288603225	21/02/24 15:45:18
19	950	331.93793085804305	269.5789381391954	21/02/24 15:45:18
19	950	331.93752725886344	269.3041416319518	21/02/24 15:45:18
19	950	331.93709704929364	269.01122704459067	21/02/24 15:45:18
19	950	331.93680750015886	268.81408320751075	21/02/24 15:45:18
19	950	331.9365243972618	268.6213283873127	21/02/24 15:45:18
19	950	331.9361095258761	268.33885703079113	21/02/24 15:45:19
19	950	331.9358830369398	268.184648668228	21/02/24 15:45:19
19	950	331.93564346263014	268.0215309344776	21/02/24 15:45:19
19	950	331.93520575102224	267.7235084728083	21/02/24 15:45:19
19	950	331.93495437852556	267.552357767887	21/02/24 15:45:19
19	950	331.93495437852556	267.552357767887	21/02/24 15:45:19
19	950	331.9346001878461	267.3112017732002	21/02/24 15:45:19
19	950	331.9342536741482	267.0752727656209	21/02/24 15:45:19
19	950	331.93391492212226	266.84462840793077	21/02/24 15:45:19
19	950	331.93367427248995	266.6807785247603	21/02/24 15:45:20
19	950	331.9332682248677	266.40431495888294	21/02/24 15:45:20
19	950	331.93301795400305	266.23391431653477	21/02/24 15:45:20
19	950	331.93238935509913	265.8059233988599	21/02/24 15:45:20
19	950	331.93238935509913	265.8059233988599	21/02/24 15:45:20
19	950	331.9320924667938	265.6037825782801	21/02/24 15:45:20
19	950	331.93140655605043	265.1367700418915	21/02/24 15:45:20
19	950	331.93140655605043	265.1367700418915	21/02/24 15:45:20
19	950	331.93105187339177	264.89527907584824	21/02/24 15:45:20
19	950	331.9304355879317	264.47567194968485	21/02/24 15:45:20
19	950	331.9304355879317	264.47567194968485	21/02/24 15:45:21
19	950	331.9302310550985	264.3364127266267	21/02/24 15:45:21
19	950	331.97665573529497	264.3170445697883	21/02/24 15:45:21
19	950	331.99510572372117	264.41905274127356	21/02/24 15:45:21
19	950	332.01379837634863	264.415803673502	21/02/24 15:45:21
19	950	331.9463274004872	264.3597162584796	21/02/24 15:45:21
19	950	332.0224998236901	264.1539101574171	21/02/24 15:45:21
19	950	332.00893643547744	264.38893703703445	21/02/24 15:45:21
19	950	331.9478803980516	264.2730023547114	21/02/24 15:45:21
19	950	331.9400780069025	264.2722592995534	21/02/24 15:45:22
19	950	331.9400780069025	264.2722592995534	21/02/24 15:45:22
19	950	331.9210106422565	264.0201480635964	21/02/24 15:45:22
19	950	331.97408634243857	263.8980311408939	21/02/24 15:45:22
19	950	331.97408634243857	263.8980311408939	21/02/24 15:45:22
19	950	332.04602358946283	264.17108785579524	21/02/24 15:45:22
19	950	332.0649265372404	264.13695221870904	21/02/24 15:45:22
19	950	331.9404831975787	263.87180490399527	21/02/24 15:45:22
19	950	332.0825814300191	263.81824381463616	21/02/24 15:45:22
19	950	332.17539485851216	263.837153780226	21/02/24 15:45:23
19	950	332.0721974752937	264.1140387314724	21/02/24 15:45:23
19	950	332.1473366623038	264.07099938923983	21/02/24 15:45:23
19	950	332.1473366623038	264.07099938923983	21/02/24 15:45:23
19	950	332.25773618290754	264.2048047239079	21/02/24 15:45:23
19	950	332.2608326419615	264.1904601649929	21/02/24 15:45:23
19	950	332.4620394763803	264.18060445352	21/02/24 15:45:23
19	950	332.4774914272048	264.3343863537648	21/02/24 15:45:23
19	950	332.486608277727	264.1378891619737	21/02/24 15:45:23
19	950	332.5524449585319	264.3298021743353	21/02/24 15:45:23
19	950	332.44215319446283	264.2796612708601	21/02/24 15:45:24
19	950	332.31995626919115	264.05256391036227	21/02/24 15:45:24
19	950	332.5102570634077	264.2097761291728	21/02/24 15:45:24
19	950	332.51094896397797	264.2183957809741	21/02/24 15:45:24
19	950	332.4210534628424	263.98891943579474	21/02/24 15:45:24
19	950	332.50613781603926	263.74020513523107	21/02/24 15:45:24
19	950	332.62713506526075	263.78515049639475	21/02/24 15:45:24
19	950	332.60865598015613	263.7919564891646	21/02/24 15:45:24
19	950	332.50613179904474	263.85318843753225	21/02/24 15:45:24
19	950	332.381420748877	263.90362882007634	21/02/24 15:45:25
19	950	332.50150032477654	264.0394436701181	21/02/24 15:45:25
19	950	332.69272127603796	264.19850404566904	21/02/24 15:45:25
19	950	332.69272127603796	264.19850404566904	21/02/24 15:45:25
19	950	332.6864234748343	264.35662269538375	21/02/24 15:45:25
19	950	332.5667846701961	264.3958495250155	21/02/24 15:45:25
19	950	332.5579946072482	264.41771713558376	21/02/24 15:45:25
19	950	332.74041664140356	264.3793713042912	21/02/24 15:45:25
19	950	332.7677747475041	264.34913295435763	21/02/24 15:45:25
19	950	332.7164165932512	264.6056931950335	21/02/24 15:45:26
19	950	332.68856374817506	264.8415004207932	21/02/24 15:45:26
19	950	332.9081431783646	264.9375966316293	21/02/24 15:45:26
19	950	332.6997468620352	264.98262253760623	21/02/24 15:45:26
19	950	332.92665100233984	264.95327749738084	21/02/24 15:45:26
19	950	333.05836978169566	265.14166626787585	21/02/24 15:45:26
19	950	333.05836978169566	265.14166626787585	21/02/24 15:45:26
19	950	333.0570883461114	265.1267129293185	21/02/24 15:45:26
19	950	333.2236558194597	264.89437641857063	21/02/24 15:45:26
19	950	333.33382610034283	264.97163287586585	21/02/24 15:45:26
19	950	333.2531960442389	264.8187509446817	21/02/24 15:45:27
19	950	333.1637861953962	264.6269585409414	21/02/24 15:45:27
19	950	333.1637861953962	264.6269585409414	21/02/24 15:45:27
19	950	333.2433284353511	264.6232222357117	21/02/24 15:45:27
19	950	333.3764842553972	264.7241260261127	21/02/24 15:45:27
19	950	333.3754454666799	264.7507774513376	21/02/24 15:45:27
19	950	333.1487283621696	264.92417045634966	21/02/24 15:45:27
19	950	333.2426990244007	264.9193808151166	21/02/24 15:45:27
19	950	333.32021499084124	265.06845208882373	21/02/24 15:45:27
19	950	333.353881587256	264.81924047973985	21/02/24 15:45:28
19	950	333.414886605162	264.80220723607385	21/02/24 15:45:28
19	950	333.414886605162	264.80220723607385	21/02/24 15:45:28
19	950	333.41613725228444	264.6348066321697	21/02/24 15:45:28
19	950	333.4168228880682	264.6405899879341	21/02/24 15:45:28
19	950	333.57898419922105	264.72377747033397	21/02/24 15:45:28
19	950	333.5240773930665	264.7306458900402	21/02/24 15:45:28
19	950	333.6417055776558	264.6230132375408	21/02/24 15:45:28
19	950	333.6371913451241	264.5423274545463	21/02/24 15:45:28
19	950	333.5928273556597	264.3738004123577	21/02/24 15:45:29
19	950	333.45833662845735	264.53912734784217	21/02/24 15:45:29
19	950	333.45833662845735	264.53912734784217	21/02/24 15:45:29
19	950	333.22556072734244	264.7102754811082	21/02/24 15:45:29
19	950	333.22556072734244	264.7102754811082	21/02/24 15:45:29
19	950	333.1779428615365	264.6457070677628	21/02/24 15:45:29
19	950	332.97860206333127	264.6543237934865	21/02/24 15:45:29
19	950	333.0622100442728	264.8086496375603	21/02/24 15:45:29
19	950	333.0622100442728	264.8086496375603	21/02/24 15:45:29
19	950	332.9876967034783	264.808538876424	21/02/24 15:45:29
19	950	332.84801152917686	264.8906418979057	21/02/24 15:45:30
19	950	332.84335405358286	264.89629640362176	21/02/24 15:45:30
19	950	333.05298741409825	264.7384332375769	21/02/24 15:45:30
19	950	333.1475461090323	264.7728053372805	21/02/24 15:45:30
19	950	333.17284768822924	264.7998541837194	21/02/24 15:45:30
19	950	333.2820993510496	264.81704897432024	21/02/24 15:45:30
19	950	333.25791843792496	264.78626320505913	21/02/24 15:45:30
19	950	333.23875917632904	264.81257917334057	21/02/24 15:45:30
19	950	333.16524537793487	264.80292759405296	21/02/24 15:45:30
19	950	333.056303139135	264.8184083692226	21/02/24 15:45:31
19	950	332.91122290631	264.6554831920304	21/02/24 15:45:31
19	950	332.9128431610241	264.6143110852287	21/02/24 15:45:31
19	950	332.9767788206372	264.4182028835237	21/02/24 15:45:31
19	950	333.08411475030397	264.3108951634491	21/02/24 15:45:31
19	950	332.821361609848	264.302682379856	21/02/24 15:45:31
19	950	332.8649081733785	264.31831151345943	21/02/24 15:45:31
19	950	332.8708428883224	264.31647753178436	21/02/24 15:45:31
19	950	333.03019705950976	264.25390698637847	21/02/24 15:45:31
19	950	332.8104592861915	264.12690351800813	21/02/24 15:45:32
19	950	332.62395200020137	264.1378981287956	21/02/24 15:45:32
19	950	332.6146858205417	264.0789367297866	21/02/24 15:45:32
19	950	332.6777664527916	264.1386856717974	21/02/24 15:45:32
19	950	332.53033120498526	264.1099637047619	21/02/24 15:45:32
19	950	332.6371453385577	264.0143827893227	21/02/24 15:45:32
19	950	332.8391575900279	264.100293051375	21/02/24 15:45:32
19	950	332.8391575900279	264.100293051375	21/02/24 15:45:32
19	950	332.8941145038182	264.2042785996115	21/02/24 15:45:32
19	950	332.8872089247015	263.97087045722867	21/02/24 15:45:32
19	950	332.96062806238854	263.92848704706876	21/02/24 15:45:33
19	950	332.96062806238854	263.92848704706876	21/02/24 15:45:33
19	950	333.1627365201227	263.9208397998698	21/02/24 15:45:33
19	950	333.3175935656243	263.64227563968086	21/02/24 15:45:33
19	950	333.3781235593658	263.5964782211681	21/02/24 15:45:33
19	950	333.3781235593658	263.5964782211681	21/02/24 15:45:33
19	950	333.2168265520315	263.6686054639747	21/02/24 15:45:33
19	950	333.2168265520315	263.6686054639747	21/02/24 15:45:33
19	950	332.8383346836571	263.7289743824167	21/02/24 15:45:33
19	950	332.8383346836571	263.7289743824167	21/02/24 15:45:34
19	950	333.0571627620061	263.63129972509864	21/02/24 15:45:34
19	950	333.0505249157977	263.5343491019421	21/02/24 15:45:34
19	950	333.2051888428962	263.55626248676333	21/02/24 15:45:34
19	950	333.1723098350019	263.613598673836	21/02/24 15:45:34
19	950	333.1113312892239	263.776110755861	21/02/24 15:45:34
19	950	332.9517771949213	263.7120885619751	21/02/24 15:45:34
19	950	333.03665897481676	263.88485636587876	21/02/24 15:45:34
19	950	333.03665897481676	263.88485636587876	21/02/24 15:45:34
19	950	332.7692155277461	263.94182632639735	21/02/24 15:45:35
19	950	332.8094284863117	264.0557204953303	21/02/24 15:45:35
19	950	332.7097449728427	264.0527434858794	21/02/24 15:45:35
19	950	332.5861739347446	264.1333830857	21/02/24 15:45:35
19	950	332.5676963005332	264.2122879646991	21/02/24 15:45:35
19	950	332.622442666617	264.0538978722161	21/02/24 15:45:35
19	950	332.50628497663484	264.1093891197631	21/02/24 15:45:35
19	950	332.50628497663484	264.1093891197631	21/02/24 15:45:35
19	950	332.49431624219136	263.97771189015094	21/02/24 15:45:35
19	950	332.49431624219136	263.97771189015094	21/02/24 15:45:35
19	950	332.5555244136769	263.88244737738586	21/02/24 15:45:36
19	950	332.8023397944582	263.83474683310294	21/02/24 15:45:36
19	950	332.5698612927815	263.93412198893583	21/02/24 15:45:36
19	950	332.3984184187336	263.8030787303482	21/02/24 15:45:36
19	950	332.3984184187336	263.8030787303482	21/02/24 15:45:36
19	950	332.41310683550927	263.9141549172011	21/02/24 15:45:36
19	950	332.41310683550927	263.9141549172011	21/02/24 15:45:36
19	950	332.5169040358769	263.99193644623136	21/02/24 15:45:36
19	950	332.56212493222375	264.01474591449585	21/02/24 15:45:36
19	950	332.5654568896634	264.00951917215264	21/02/24 15:45:37
19	950	332.38845388398715	264.16128783097395	21/02/24 15:45:37
19	950	332.38845388398715	264.16128783097395	21/02/24 15:45:37
19	950	332.38845388398715	264.16128783097395	21/02/24 15:45:37
19	950	332.3651547359262	264.4148725204653	21/02/24 15:45:37
19	950	332.3486455061786	264.5945566826636	21/02/24 15:45:37
19	950	332.3319648119995	264.77610703990626	21/02/24 15:45:37
19	950	332.31258605405895	264.9870227481642	21/02/24 15:45:37
19	950	332.2885238712528	265.24891220177926	21/02/24 15:45:37
19	950	332.2649573712192	265.505406712985	21/02/24 15:45:38
19	950	332.2457405224877	265.71456022391266	21/02/24 15:45:38
19	950	332.23150967216935	265.8694468210423	21/02/24 15:45:38
19	950	332.2171810778399	266.02539725040464	21/02/24 15:45:38
19	950	332.1922225191277	266.2970427348066	21/02/24 15:45:38
19	950	332.1723318927838	266.51352954762956	21/02/24 15:45:38
19	950	332.1536666338457	266.7166796319035	21/02/24 15:45:38
19	950	332.13810652489013	266.88603369530665	21/02/24 15:45:38
19	950	332.12416076101437	267.0378174512151	21/02/24 15:45:38
19	950	332.1031673149322	267.2663072008047	21/02/24 15:45:39
19	950	332.08366224074183	267.4785977175708	21/02/24 15:45:39
19	950	332.0649580727743	267.68217128231345	21/02/24 15:45:39
19	950	332.04149538341187	267.937535932602	21/02/24 15:45:39
19	950	332.02604520727687	268.1056935024637	21/02/24 15:45:39
19	950	332.00615557352364	268.3221695120677	21/02/24 15:45:39
19	950	331.99132872018004	268.48354292329464	21/02/24 15:45:39
19	950	331.9736185793481	268.6762976348388	21/02/24 15:45:39
19	950	331.95769320285666	268.84962721933925	21/02/24 15:45:39
19	950	331.93255533467106	269.12322428313036	21/02/24 15:45:39
19	950	331.93255533467106	269.12322428313036	21/02/24 15:45:40
19	950	331.9178795622355	269.2829533507502	21/02/24 15:45:40
19	950	331.8999636021932	269.4779481699761	21/02/24 15:45:40
19	950	331.87854537812984	269.7110611440796	21/02/24 15:45:40
19	950	331.864739606645	269.86132124226015	21/02/24 15:45:40
19	909	331.92385777677003	269.9556937017559	21/02/24 15:45:40
19	909	331.92385777677003	269.9556937017559	21/02/24 15:45:40
19	909	332.0945700735633	269.9636133291901	21/02/24 15:45:40
19	950	331.9389626420895	270.0360506324865	21/02/24 15:45:40
19	950	331.7840148552337	270.0878928325736	21/02/24 15:45:41
19	950	331.6180549459914	270.1434194521915	21/02/24 15:45:41
19	950	331.45867774349097	270.1967436395775	21/02/24 15:45:41
19	950	331.3070427487363	270.24747745061023	21/02/24 15:45:41
19	950	331.12998966136576	270.30671560926845	21/02/24 15:45:41
19	950	330.97709696205874	270.3578702212198	21/02/24 15:45:41
19	950	330.97709696205874	270.3578702212198	21/02/24 15:45:41
19	950	330.8302459916392	270.4070034005053	21/02/24 15:45:41
19	950	330.30550147302705	270.5825716411399	21/02/24 15:45:41
19	950	330.159327047579	270.631478463015	21/02/24 15:45:41
19	950	330.159327047579	270.631478463015	21/02/24 15:45:42
19	950	330.0027828426073	270.68385479030115	21/02/24 15:45:42
19	950	329.7438630951627	270.7704837743345	21/02/24 15:45:42
19	950	329.5000230025312	270.852067429887	21/02/24 15:45:42
19	950	329.2529690119747	270.93472638662746	21/02/24 15:45:42
19	950	329.0221390504667	271.01195713185734	21/02/24 15:45:42
19	950	328.8109636005942	271.08261189981454	21/02/24 15:45:42
19	950	328.41801819937365	271.2140829877646	21/02/24 15:45:42
19	950	328.16778311148676	271.2978062713189	21/02/24 15:45:42
19	950	328.16778311148676	271.2978062713189	21/02/24 15:45:43
19	950	327.75327443978483	271.4364919662376	21/02/24 15:45:43
19	950	327.48514807484594	271.52620128666	21/02/24 15:45:43
19	950	327.3305490305351	271.57792680498505	21/02/24 15:45:43
19	950	327.3305490305351	271.57792680498505	21/02/24 15:45:43
19	950	327.1371572664165	271.6426315338107	21/02/24 15:45:43
19	950	326.9924490007143	271.6910478101385	21/02/24 15:45:43
19	950	326.76702795703505	271.7664688476854	21/02/24 15:45:43
19	950	326.55990724439647	271.83576698768906	21/02/24 15:45:43
19	950	326.4100998313931	271.8858893291374	21/02/24 15:45:44
19	950	326.2125661628925	271.9519798501713	21/02/24 15:45:44
19	950	325.95281803903123	272.03888599115413	21/02/24 15:45:44
19	950	325.7656301567116	272.1015150344339	21/02/24 15:45:44
19	950	325.54870343214594	272.1740940553246	21/02/24 15:45:44
19	950	325.40496994299684	272.22218419236293	21/02/24 15:45:44
19	950	325.2554410084996	272.27221336088684	21/02/24 15:45:44
19	950	325.01885683151914	272.3513693429718	21/02/24 15:45:44
19	950	325.01885683151914	272.3513693429718	21/02/24 15:45:44
19	950	324.8239768648877	272.4165719923809	21/02/24 15:45:44
19	950	324.6651306776025	272.46971851348593	21/02/24 15:45:45
19	950	324.47237156448347	272.53421157088104	21/02/24 15:45:45
19	950	324.1926550981187	272.62779869020164	21/02/24 15:45:45
19	950	323.9894737673233	272.6957787976869	21/02/24 15:45:45
19	950	323.80396965227465	272.75784448861725	21/02/24 15:45:45
19	950	323.54351465884736	272.84498713296824	21/02/24 15:45:45
19	909	323.2685900152393	272.93697101135734	21/02/24 15:45:45
19	909	323.20920597530966	272.88416272389895	21/02/24 15:45:45
19	909	323.1049355844044	272.9502355912227	21/02/24 15:45:45
19	909	323.07203118516827	272.916432600555	21/02/24 15:45:46
19	909	323.000374278202	273.15480934077056	21/02/24 15:45:46
19	909	322.76065176262364	273.1045082702794	21/02/24 15:45:46
19	909	322.8259838175974	273.1501230296472	21/02/24 15:45:46
19	909	322.7879183889782	273.2627932784972	21/02/24 15:45:46
19	909	322.77200073349275	273.20342971481614	21/02/24 15:45:46
19	909	322.70864138282604	273.2369211341408	21/02/24 15:45:46
19	909	322.9444132133888	273.27205870573874	21/02/24 15:45:46
19	909	322.9181735728558	273.31844876582954	21/02/24 15:45:46
19	909	323.09527157175546	273.2627895594674	21/02/24 15:45:47
19	909	323.0133553922062	273.1443449244254	21/02/24 15:45:47
19	909	322.99623369326196	273.1481061417811	21/02/24 15:45:47
19	909	322.8297291854298	273.2933686654161	21/02/24 15:45:47
19	909	322.69153089322504	273.30734377640437	21/02/24 15:45:47
19	909	322.67893976165186	273.33526669854865	21/02/24 15:45:47
19	909	322.92860497788627	273.2849821742525	21/02/24 15:45:47
19	909	322.85631244702364	273.13483981603264	21/02/24 15:45:47
19	909	322.84560143735547	273.1212074981532	21/02/24 15:45:47
19	909	322.90626337514783	273.35078033793843	21/02/24 15:45:47
19	909	323.0128235170904	273.29055677171016	21/02/24 15:45:48
19	909	323.05303395245164	273.35982869280673	21/02/24 15:45:48
19	909	322.95084633512374	273.53023222380057	21/02/24 15:45:48
19	909	323.092674415268	273.3549594235871	21/02/24 15:45:48
19	909	323.11134469142	273.3164775018288	21/02/24 15:45:48
19	909	323.12033681787267	273.32393959613165	21/02/24 15:45:48
19	909	323.2491517169598	273.4186247324534	21/02/24 15:45:48
19	909	323.13585485294607	273.32608223213265	21/02/24 15:45:48
19	909	323.11220648468884	273.30464877860913	21/02/24 15:45:48
19	909	323.2815137618934	273.3817880537984	21/02/24 15:45:49
19	909	323.26222275036196	273.3820280406758	21/02/24 15:45:49
19	909	323.449926760642	273.22317583201965	21/02/24 15:45:49
19	909	323.4156360430968	273.3547232766397	21/02/24 15:45:49
19	909	323.3577148286381	273.46119228173956	21/02/24 15:45:49
19	909	323.31534926855505	273.421588004318	21/02/24 15:45:49
19	909	323.3243327562578	273.45558343625385	21/02/24 15:45:49
19	909	323.3243327562578	273.45558343625385	21/02/24 15:45:49
19	909	323.2962787678187	273.49854296358995	21/02/24 15:45:49
19	909	323.3121821955202	273.5171288457087	21/02/24 15:45:49
19	909	323.5017308061712	273.4867031317327	21/02/24 15:45:50
19	909	323.4008973400888	273.67241707424364	21/02/24 15:45:50
19	909	323.30133441139355	273.46537487642433	21/02/24 15:45:50
19	909	323.30821203933624	273.46209320060126	21/02/24 15:45:50
19	909	323.19767118648633	273.42248181315654	21/02/24 15:45:50
19	909	323.17365641146176	273.4047832068609	21/02/24 15:45:50
19	909	322.98062986691406	273.24508839297584	21/02/24 15:45:50
19	909	322.98895022385994	273.3230529522534	21/02/24 15:45:50
19	909	323.13847773504955	273.3022363698667	21/02/24 15:45:50
19	909	323.1476839001343	273.29572603556363	21/02/24 15:45:51
19	909	323.39652129481175	273.0038815371669	21/02/24 15:45:51
19	909	323.39652129481175	273.0038815371669	21/02/24 15:45:51
19	909	323.3753646497549	273.0221425145227	21/02/24 15:45:51
19	909	323.4229243803456	273.0529066167555	21/02/24 15:45:51
19	909	323.3584016345115	273.149983630466	21/02/24 15:45:51
19	909	323.213345043079	273.1279212508385	21/02/24 15:45:51
19	909	323.27209444575544	273.05099999022195	21/02/24 15:45:51
19	909	323.4189586035856	272.9034042891746	21/02/24 15:45:51
19	909	323.38318179849443	272.84685732394155	21/02/24 15:45:52
19	909	323.34990308469577	272.73820817880096	21/02/24 15:45:52
19	909	323.30261846970706	272.97837535416073	21/02/24 15:45:52
19	909	323.0297889810726	272.98484794292676	21/02/24 15:45:52
19	909	323.2782844770197	273.0543875567378	21/02/24 15:45:52
19	909	323.2782844770197	273.0543875567378	21/02/24 15:45:52
19	909	323.16334602073954	273.0172293496937	21/02/24 15:45:52
19	909	323.2469112093571	273.30922182383796	21/02/24 15:45:52
19	909	323.2469112093571	273.30922182383796	21/02/24 15:45:52
19	909	323.31336522395713	273.1018079006952	21/02/24 15:45:52
19	909	323.2800834051743	273.1576231773254	21/02/24 15:45:53
19	909	323.25699724510486	272.99242963922035	21/02/24 15:45:53
19	909	323.1704158593703	272.8792272075978	21/02/24 15:45:53
19	909	323.0503133129383	272.91541514903423	21/02/24 15:45:53
19	909	323.0503133129383	272.91541514903423	21/02/24 15:45:53
19	909	323.1118967432673	272.83197774836583	21/02/24 15:45:53
19	909	322.8736697476537	273.0120871595109	21/02/24 15:45:53
19	909	322.78574737030954	272.86012389076546	21/02/24 15:45:53
19	909	322.6888776029832	272.75197405712356	21/02/24 15:45:53
19	909	322.5462490948627	272.5472530824147	21/02/24 15:45:54
19	909	322.4899809218121	272.7547906009383	21/02/24 15:45:54
19	909	322.443550987729	272.8037076566395	21/02/24 15:45:54
19	909	322.2775400690953	272.7150587251711	21/02/24 15:45:54
19	909	322.27483820547104	272.5707450496309	21/02/24 15:45:54
19	909	322.1584843982553	272.5950733388952	21/02/24 15:45:54
19	909	322.1693886078062	272.5961816973132	21/02/24 15:45:54
19	909	322.2373240130689	272.6709339793074	21/02/24 15:45:54
19	909	322.2871449864658	272.90375408243017	21/02/24 15:45:54
19	909	322.2878756122397	273.0444836211632	21/02/24 15:45:54
19	909	322.4018198841527	272.9182715353468	21/02/24 15:45:55
19	909	322.438496898501	272.9826520410714	21/02/24 15:45:55
19	909	322.40877152997405	272.96020235347163	21/02/24 15:45:55
19	909	322.29775360213114	273.1848039941271	21/02/24 15:45:55
19	909	322.32081009644673	273.0643378548624	21/02/24 15:45:55
19	909	322.1312521913671	273.0325283019449	21/02/24 15:45:55
19	909	322.188357637298	273.05163113130834	21/02/24 15:45:55
19	909	322.188357637298	273.05163113130834	21/02/24 15:45:55
19	909	322.2002428516641	273.0430627471509	21/02/24 15:45:55
19	909	322.60116814365875	273.031947956573	21/02/24 15:45:56
19	909	322.4475470881722	273.0169350595717	21/02/24 15:45:56
19	909	322.4475470881722	273.0169350595717	21/02/24 15:45:56
19	909	322.1880862550153	273.1300020561931	21/02/24 15:45:56
19	909	322.17151357620327	273.12429944756315	21/02/24 15:45:56
19	909	322.2169945756417	273.3316804799755	21/02/24 15:45:56
19	909	322.2247690403536	273.45731322877054	21/02/24 15:45:56
19	909	322.148815200547	273.2624111311509	21/02/24 15:45:56
19	909	322.148815200547	273.2624111311509	21/02/24 15:45:56
19	909	321.9977823253833	273.39763907811727	21/02/24 15:45:56
19	909	322.3777186702248	273.37347920674995	21/02/24 15:45:57
19	909	322.35696656251383	273.3978875737723	21/02/24 15:45:57
19	909	322.4024172617305	273.40888645095697	21/02/24 15:45:57
19	909	322.6036153929721	273.3885674107726	21/02/24 15:45:57
19	909	322.58094708415854	273.37973497409234	21/02/24 15:45:57
19	909	322.58094708415854	273.37973497409234	21/02/24 15:45:57
19	909	322.6843230683763	273.38004089072064	21/02/24 15:45:57
19	909	322.5839217522236	273.5260666344962	21/02/24 15:45:57
19	909	322.6099994017213	273.3148997574207	21/02/24 15:45:57
19	909	322.40363365614985	273.25739909761984	21/02/24 15:45:58
19	909	322.41432076871996	273.1189263054386	21/02/24 15:45:58
19	909	322.41432076871996	273.1189263054386	21/02/24 15:45:58
19	909	322.26801833693804	272.97177337951683	21/02/24 15:45:58
19	909	322.26801833693804	272.97177337951683	21/02/24 15:45:58
19	909	322.4670702593977	272.8136419513988	21/02/24 15:45:58
19	909	322.4670702593977	272.8136419513988	21/02/24 15:45:58
19	909	322.6819518477435	272.67181144376	21/02/24 15:45:58
19	909	322.7378927398584	272.39849646126225	21/02/24 15:45:58
19	909	322.74221858829907	272.39813147988264	21/02/24 15:45:59
19	909	322.86220956894147	272.40734066552517	21/02/24 15:45:59
19	909	322.8415104558303	272.59239079353046	21/02/24 15:45:59
19	909	322.90513658148785	272.5991177124006	21/02/24 15:45:59
19	909	322.87530016256284	272.4403094631691	21/02/24 15:45:59
19	909	322.8707917911765	272.4491764724739	21/02/24 15:45:59
19	909	322.8707917911765	272.4491764724739	21/02/24 15:45:59
19	909	322.48724054781894	272.41820076118586	21/02/24 15:45:59
19	909	322.48724054781894	272.41820076118586	21/02/24 15:45:59
19	909	322.67897993873163	272.54802704574206	21/02/24 15:45:59
19	909	322.85969403229063	272.61340512373675	21/02/24 15:46:00
19	909	322.75275065107365	272.6312729386964	21/02/24 15:46:00
19	909	322.50719763491924	272.568248393198	21/02/24 15:46:00
19	909	322.50719763491924	272.568248393198	21/02/24 15:46:00
19	909	322.20698280839696	272.7657099827804	21/02/24 15:46:00
19	909	322.1108655792206	272.77670572911234	21/02/24 15:46:00
19	909	322.1108655792206	272.77670572911234	21/02/24 15:46:00
19	909	322.10050259765546	272.80709853010404	21/02/24 15:46:00
19	909	322.03725238355946	272.8409118854018	21/02/24 15:46:00
19	909	321.99280913488514	272.88206052170904	21/02/24 15:46:01
19	909	321.989124582285	273.0850102805706	21/02/24 15:46:01
19	909	322.31775886163183	272.67254219461097	21/02/24 15:46:01
19	909	322.26485876102896	272.93272157529935	21/02/24 15:46:01
19	909	322.26485876102896	272.93272157529935	21/02/24 15:46:01
19	909	322.192873670807	272.87398243950315	21/02/24 15:46:01
19	909	322.1649620157957	272.8814525284317	21/02/24 15:46:01
19	909	322.1649620157957	272.8814525284317	21/02/24 15:46:01
19	909	322.1776053420148	272.93572966357146	21/02/24 15:46:01
19	909	322.15962855854116	272.892989538631	21/02/24 15:46:02
19	909	321.93296638779947	272.72188424492157	21/02/24 15:46:02
19	909	321.82567626710517	272.95567030821553	21/02/24 15:46:02
19	909	321.69979053706567	273.1567898184236	21/02/24 15:46:02
19	909	321.50863570973354	273.1517887489694	21/02/24 15:46:02
19	909	321.4259310622999	273.3622708850892	21/02/24 15:46:02
19	909	321.4729437420829	273.36653055984027	21/02/24 15:46:02
19	909	321.7585115899288	273.402695005972	21/02/24 15:46:02
19	909	321.67654083355905	273.41875037175936	21/02/24 15:46:02
19	909	321.67654083355905	273.41875037175936	21/02/24 15:46:03
19	909	321.9143883410169	273.30118524951104	21/02/24 15:46:03
19	909	321.9143883410169	273.30118524951104	21/02/24 15:46:03
19	909	321.74341614130816	273.48381213075504	21/02/24 15:46:03
19	909	321.55801111200327	273.5342803284465	21/02/24 15:46:03
19	909	321.53666714761124	273.4136587686444	21/02/24 15:46:03
19	909	321.391549344916	273.406734279025	21/02/24 15:46:03
19	909	321.40922326348715	273.68517409165287	21/02/24 15:46:03
19	909	321.4364480061747	273.6451551501689	21/02/24 15:46:03
19	909	321.43350541237066	273.39379432118534	21/02/24 15:46:03
19	909	321.29397289178587	273.26857134829214	21/02/24 15:46:04
19	909	321.29397289178587	273.26857134829214	21/02/24 15:46:04
19	909	321.40538929098483	273.1687088570288	21/02/24 15:46:04
19	909	321.5696508159033	273.2837499322451	21/02/24 15:46:04
19	909	321.5036301504237	273.4342743268859	21/02/24 15:46:04
19	909	321.5047927359749	273.35282703631947	21/02/24 15:46:04
19	909	321.5660736800711	273.3386817810495	21/02/24 15:46:04
19	909	321.7425924658693	273.2833990309474	21/02/24 15:46:04
19	909	321.89756865656443	273.4182736911317	21/02/24 15:46:04
19	909	321.94775372398345	273.5142966202056	21/02/24 15:46:05
19	909	321.8497851974497	273.4755774285497	21/02/24 15:46:05
19	909	321.68729368479774	273.327307248071	21/02/24 15:46:05
19	909	321.6998312308862	273.32604241050825	21/02/24 15:46:05
19	909	321.7049884680497	273.3189157322181	21/02/24 15:46:05
19	909	321.83861948423333	273.30901926216586	21/02/24 15:46:05
19	909	321.57644226046	273.2658482564117	21/02/24 15:46:05
19	909	321.6032036208671	273.4161728149513	21/02/24 15:46:05
19	909	321.3617235136811	273.36581462993	21/02/24 15:46:05
19	909	321.43177353036566	273.1459155377777	21/02/24 15:46:06
19	909	321.3866381855722	273.0906210872167	21/02/24 15:46:06
19	909	321.27764122665815	272.9867770987117	21/02/24 15:46:06
19	909	321.30343815238575	273.03773912286044	21/02/24 15:46:06
19	909	321.5376602122545	273.042783857809	21/02/24 15:46:06
19	909	321.7520951435787	272.85114067791187	21/02/24 15:46:06
19	909	321.74642530305977	272.7757737752616	21/02/24 15:46:06
19	909	321.87081000236634	272.5434327385951	21/02/24 15:46:06
19	909	321.69893575516505	272.7044370053738	21/02/24 15:46:06
19	909	321.61252324237626	272.75011752386825	21/02/24 15:46:07
19	909	321.68793181582663	272.58163518372334	21/02/24 15:46:07
19	909	321.64654728617796	272.65497112708346	21/02/24 15:46:07
19	909	321.58059344190883	272.7872162539661	21/02/24 15:46:07
19	909	321.59458370037504	272.7505048837709	21/02/24 15:46:07
19	909	321.5350396159606	272.70085211230315	21/02/24 15:46:07
19	909	321.69791775928655	272.55909556199015	21/02/24 15:46:07
19	909	321.51182549042153	272.4094835828265	21/02/24 15:46:07
19	909	321.51524159499746	272.4333623612459	21/02/24 15:46:07
19	909	321.68096064865983	272.4755988129207	21/02/24 15:46:07
19	909	321.55460803786565	272.284505207233	21/02/24 15:46:08
19	909	321.55890958309226	272.27765701217334	21/02/24 15:46:08
19	909	321.28151507824623	272.3051664891145	21/02/24 15:46:08
19	909	321.26991557391295	272.3315823629623	21/02/24 15:46:08
19	909	321.15896554675345	272.4936417142335	21/02/24 15:46:08
19	909	321.31576161901495	272.26427286829806	21/02/24 15:46:08
19	909	321.39278529812606	272.3460345295916	21/02/24 15:46:08
19	909	321.35895046285214	272.36858240728253	21/02/24 15:46:08
19	909	321.3742419435051	272.3115801073771	21/02/24 15:46:08
19	909	321.2726306700362	272.45708124370634	21/02/24 15:46:09
19	909	321.1535959321046	272.29191159663526	21/02/24 15:46:09
19	909	321.1657140557367	272.0866397497588	21/02/24 15:46:09
19	909	321.038318174093	271.86204227115815	21/02/24 15:46:09
19	909	320.9581857794592	271.9718079866599	21/02/24 15:46:09
19	909	320.96354266240144	271.9716684475452	21/02/24 15:46:09
19	909	320.9678858676845	272.08737380716286	21/02/24 15:46:09
19	909	320.9543688809474	272.1436648682632	21/02/24 15:46:09
19	909	321.10560724803963	271.9923976859342	21/02/24 15:46:09
19	909	321.13374817193613	272.1546670245687	21/02/24 15:46:09
19	909	321.1515270688236	272.08939977161486	21/02/24 15:46:10
19	909	321.1741953292485	271.8755238039741	21/02/24 15:46:10
19	909	321.04069808720294	271.87132987903254	21/02/24 15:46:10
19	909	321.0429086490661	271.84566399545673	21/02/24 15:46:10
19	909	321.00850516672057	271.7900772675454	21/02/24 15:46:10
19	909	321.00850516672057	271.7900772675454	21/02/24 15:46:10
19	909	321.00850516672057	271.7900772675454	21/02/24 15:46:10
19	909	321.2150391649476	271.80773181671725	21/02/24 15:46:10
19	909	321.42387853971206	271.82558342973226	21/02/24 15:46:10
19	909	321.7199524956089	271.8508918644585	21/02/24 15:46:11
19	909	321.9182827217071	271.867845154275	21/02/24 15:46:11
19	909	322.19283804800085	271.8913141741461	21/02/24 15:46:11
19	909	322.45875144339317	271.9140444808012	21/02/24 15:46:11
19	909	322.68956953329644	271.93377483683423	21/02/24 15:46:11
19	909	322.9847889010788	271.9590102212733	21/02/24 15:46:11
19	909	323.24226189217865	271.9810190412294	21/02/24 15:46:11
19	909	323.48467024338737	272.0017401340897	21/02/24 15:46:11
19	909	323.7182206010793	272.0217040446776	21/02/24 15:46:11
19	909	323.89390837992795	272.0367218555814	21/02/24 15:46:12
19	909	324.0529131722766	272.050313602941	21/02/24 15:46:12
19	909	324.2392834408381	272.0662445542552	21/02/24 15:46:12
19	909	324.45871867557435	272.08500190256075	21/02/24 15:46:12
19	909	324.72828372050503	272.1080443526251	21/02/24 15:46:12
19	909	324.993593149831	272.13072303219354	21/02/24 15:46:12
19	909	325.19421268447786	272.1478720123598	21/02/24 15:46:12
19	909	325.43115367390857	272.1681257545264	21/02/24 15:46:12
19	909	325.59339314065494	272.1819940022138	21/02/24 15:46:12
19	909	325.76418151656054	272.1965930116083	21/02/24 15:46:13
19	909	325.76418151656054	272.1965930116083	21/02/24 15:46:13
19	909	326.1273150997988	272.22763371074865	21/02/24 15:46:13
19	909	326.29588040815577	272.2420426920815	21/02/24 15:46:13
19	909	326.29588040815577	272.2420426920815	21/02/24 15:46:13
19	909	326.48085417399056	272.2578542701871	21/02/24 15:46:13
19	909	326.66457087924493	272.2735583946143	21/02/24 15:46:13
19	909	326.846359527505	272.2890977085149	21/02/24 15:46:13
19	909	327.05763964718955	272.3071579566775	21/02/24 15:46:13
19	909	327.2695125502744	272.3252688760312	21/02/24 15:46:13
19	909	327.5033452893622	272.3452569246123	21/02/24 15:46:14
19	909	327.71826322614567	272.3636281337857	21/02/24 15:46:14
19	909	328.19283523592935	272.40419460203896	21/02/24 15:46:14
19	909	328.4265276317803	272.42417065406454	21/02/24 15:46:14
19	909	328.4265276317803	272.42417065406454	21/02/24 15:46:14
19	909	328.7965141083823	272.4557971392929	21/02/24 15:46:14
19	909	328.99406722902256	272.4726840020483	21/02/24 15:46:14
19	909	329.21002903820676	272.49114444155083	21/02/24 15:46:14
19	909	329.41152437675436	272.5083682855321	21/02/24 15:46:14
19	909	329.41152437675436	272.5083682855321	21/02/24 15:46:15
19	909	329.6061295196114	272.52500315481825	21/02/24 15:46:15
19	909	329.7731671349431	272.53928154878116	21/02/24 15:46:15
19	909	330.005191507847	272.55911501801944	21/02/24 15:46:15
19	909	330.1775551082279	272.57384867777756	21/02/24 15:46:15
19	909	330.37012266686776	272.5903093741379	21/02/24 15:46:15
19	909	330.60306791678215	272.6102215600456	21/02/24 15:46:15
19	909	330.8463468374956	272.63101706928416	21/02/24 15:46:15
19	909	331.13026722373564	272.65528661552247	21/02/24 15:46:15
19	909	331.2826866785668	272.66831544749766	21/02/24 15:46:15
19	909	331.54027914410483	272.69033448014204	21/02/24 15:46:16
19	909	331.8017461001198	272.7126847046639	21/02/24 15:46:16
19	909	332.04782645450933	272.7337196807651	21/02/24 15:46:16
19	909	332.319073595191	272.75690591656155	21/02/24 15:46:16
19	909	332.6150360720743	272.7822048220493	21/02/24 15:46:16
19	909	332.84496740783885	272.8018593782398	21/02/24 15:46:16
19	909	333.0143347747282	272.8163369196253	21/02/24 15:46:16
19	909	333.25157330972587	272.8366160960201	21/02/24 15:46:16
19	909	333.52124006995456	272.8596672407195	21/02/24 15:46:16
19	909	333.8101131149107	272.8843601407765	21/02/24 15:46:17
19	909	334.089074091864	272.90820575615663	21/02/24 15:46:17
19	909	334.2474844670825	272.92174669267376	21/02/24 15:46:17
19	909	334.458248733918	272.9397628456774	21/02/24 15:46:17
19	909	334.7325711501646	272.9632119563717	21/02/24 15:46:17
19	909	334.92090661321816	272.97931089273	21/02/24 15:46:17
19	909	335.20732835657253	273.00379425525307	21/02/24 15:46:17
19	909	335.4674517171151	273.0260296290843	21/02/24 15:46:17
19	909	335.71036639583394	273.0467940028766	21/02/24 15:46:17
19	909	335.9844119404397	273.0702194465522	21/02/24 15:46:18
19	909	336.2328162426907	273.0914530739754	21/02/24 15:46:18
19	909	336.45138032204795	273.1101359558221	21/02/24 15:46:18
19	909	336.7097238477628	273.13221918917407	21/02/24 15:46:18
19	909	336.9198545476595	273.1501811848052	21/02/24 15:46:18
19	909	337.0899968475007	273.1647249675458	21/02/24 15:46:18
19	909	337.28089142962517	273.18104265768727	21/02/24 15:46:18
19	909	337.4953400293649	273.1993737478779	21/02/24 15:46:18
19	909	337.7607064596155	273.2220572998918	21/02/24 15:46:18
19	909	338.04980905911503	273.24676982229676	21/02/24 15:46:18
19	909	338.2112883388808	273.2605730891164	21/02/24 15:46:19
19	909	338.5699511724549	273.2912316280775	21/02/24 15:46:19
19	909	338.5699511724549	273.2912316280775	21/02/24 15:46:19
19	909	338.7875797423654	273.3098345424726	21/02/24 15:46:19
19	909	339.1096129891535	273.3373619802755	21/02/24 15:46:19
19	909	339.3363950766824	273.356747338376	21/02/24 15:46:19
19	909	339.4972398618011	273.37049636852254	21/02/24 15:46:19
19	909	339.77267603515776	273.3940406832986	21/02/24 15:46:19
19	909	339.77267603515776	273.3940406832986	21/02/24 15:46:19
19	909	340.22351043018534	273.4325780575987	21/02/24 15:46:20
19	909	340.43636847507855	273.4507731869839	21/02/24 15:46:20
19	909	340.73443949624965	273.4762523310722	21/02/24 15:46:20
19	909	340.93903401787804	273.49374109356836	21/02/24 15:46:20
19	909	341.1061497247913	273.50802616280833	21/02/24 15:46:20
19	909	341.2728174261588	273.5222729364844	21/02/24 15:46:20
19	909	341.4873224406617	273.5406088490153	21/02/24 15:46:20
19	909	341.6959062636603	273.55843861743693	21/02/24 15:46:20
19	909	341.85743918714553	273.5722464697277	21/02/24 15:46:20
19	909	341.85743918714553	273.5722464697277	21/02/24 15:46:21
19	909	342.11807694663753	273.59452581443844	21/02/24 15:46:21
19	909	342.5032584804468	273.6274511748492	21/02/24 15:46:21
19	909	342.7529412858166	273.64879408886145	21/02/24 15:46:21
19	909	342.7529412858166	273.64879408886145	21/02/24 15:46:21
19	909	343.25009686722836	273.6912910033328	21/02/24 15:46:21
19	964	343.42929460619865	273.7679571143805	21/02/24 15:46:21
19	964	343.5675559441389	273.8571395084658	21/02/24 15:46:21
19	964	343.76457377826455	273.9842214706873	21/02/24 15:46:21
19	964	343.92004462655	274.08450447580736	21/02/24 15:46:22
19	964	343.92004462655	274.08450447580736	21/02/24 15:46:22
19	964	344.29332894103584	274.32528320206785	21/02/24 15:46:22
19	964	344.4535819333001	274.42865082256367	21/02/24 15:46:22
19	964	344.4535819333001	274.42865082256367	21/02/24 15:46:22
19	964	344.8731714578286	274.6992976923829	21/02/24 15:46:22
19	964	344.8731714578286	274.6992976923829	21/02/24 15:46:22
19	964	345.0262575398829	274.79804245720385	21/02/24 15:46:22
19	964	345.39906446516596	275.03851325420044	21/02/24 15:46:22
19	964	345.61964305907844	275.1807925593347	21/02/24 15:46:22
19	964	345.8399873668456	275.32292074341336	21/02/24 15:46:23
19	964	346.025536430327	275.4426050307786	21/02/24 15:46:23
19	964	346.2026111962208	275.5568231613837	21/02/24 15:46:23
19	964	346.2026111962208	275.5568231613837	21/02/24 15:46:23
19	964	346.4153336803066	275.6940350579931	21/02/24 15:46:23
19	964	346.5911740848184	275.80745699130364	21/02/24 15:46:23
19	964	346.750037903815	275.9099285565489	21/02/24 15:46:23
19	964	346.750037903815	275.9099285565489	21/02/24 15:46:23
19	964	346.93672826339275	276.03034901152074	21/02/24 15:46:23
19	964	347.4186611229735	276.3412090599338	21/02/24 15:46:24
19	964	347.6445578066522	276.4869186803274	21/02/24 15:46:24
19	964	347.8347001268896	276.6095657455758	21/02/24 15:46:24
19	964	347.8347001268896	276.6095657455758	21/02/24 15:46:24
19	964	347.9615863251764	276.6914108593884	21/02/24 15:46:24
19	964	348.13148537201715	276.80100045237066	21/02/24 15:46:24
19	964	348.3140943795876	276.9187883222067	21/02/24 15:46:24
19	964	348.516096265886	277.04908513618386	21/02/24 15:46:24
19	964	348.6746025133729	277.1513260578974	21/02/24 15:46:24
19	964	348.8200474467314	277.2451420700792	21/02/24 15:46:24
19	964	349.03396673202263	277.3831259366286	21/02/24 15:46:25
19	964	349.03396673202263	277.3831259366286	21/02/24 15:46:25
19	964	349.4400214987464	277.6450425126261	21/02/24 15:46:25
19	964	349.4400214987464	277.6450425126261	21/02/24 15:46:25
19	964	349.6060653006237	277.7521453657812	21/02/24 15:46:25
19	964	349.96576331947733	277.98416055489326	21/02/24 15:46:25
19	964	349.96576331947733	277.98416055489326	21/02/24 15:46:25
19	964	350.1404926873857	278.0968658388086	21/02/24 15:46:25
19	964	350.3326564231659	278.220816773094	21/02/24 15:46:25
19	964	350.5342139212336	278.3508269443486	21/02/24 15:46:26
19	964	350.6694659218111	278.43806823244853	21/02/24 15:46:26
19	964	350.8185619283142	278.5342392879771	21/02/24 15:46:26
19	964	351.0399239507337	278.6770239262066	21/02/24 15:46:26
19	964	351.2107284115012	278.78719753625995	21/02/24 15:46:26
19	964	351.2107284115012	278.78719753625995	21/02/24 15:46:26
19	964	351.35267907071477	278.87875964479474	21/02/24 15:46:26
19	964	351.5025427121311	278.97542584611284	21/02/24 15:46:26
19	964	351.8660568649976	279.20990254740525	21/02/24 15:46:26
19	964	351.8660568649976	279.20990254740525	21/02/24 15:46:27
19	964	352.08103033159705	279.34856639010894	21/02/24 15:46:27
19	964	352.2754061145292	279.4739441561014	21/02/24 15:46:27
19	964	352.40305831261054	279.5562833610067	21/02/24 15:46:27
19	964	352.555499982492	279.65461246212	21/02/24 15:46:27
19	964	352.8043248737288	279.8151114117113	21/02/24 15:46:27
19	964	353.0120891900116	279.9491251527008	21/02/24 15:46:27
19	964	353.2266008863632	280.08749114079933	21/02/24 15:46:27
19	964	353.3650871445172	280.1768186146548	21/02/24 15:46:27
19	964	353.68395821811487	280.38249929279397	21/02/24 15:46:27
19	964	353.87098589112253	280.5031373242748	21/02/24 15:46:28
19	964	353.87098589112253	280.5031373242748	21/02/24 15:46:28
19	964	354.0787742162838	280.6371665516562	21/02/24 15:46:28
19	964	354.31673057736447	280.79065499813834	21/02/24 15:46:28
19	964	354.68958848516263	281.03115868026987	21/02/24 15:46:28
19	964	354.8702225292396	281.14767264392793	21/02/24 15:46:28
19	964	355.09056987500696	281.28980278760093	21/02/24 15:46:28
19	964	355.23956542475514	281.3859090457389	21/02/24 15:46:28
19	964	355.3835015985468	281.4787518661936	21/02/24 15:46:28
19	964	355.57301459638717	281.60099300105793	21/02/24 15:46:29
19	964	355.7521029619379	281.71650995923704	21/02/24 15:46:29
19	964	355.89193099179937	281.8067029130233	21/02/24 15:46:29
19	964	356.0977262987697	281.9394465884465	21/02/24 15:46:29
19	964	356.235209628572	282.0281271457248	21/02/24 15:46:29
19	964	356.36284505949766	282.11045553535007	21/02/24 15:46:29
19	958	356.5786138025066	282.20890744567333	21/02/24 15:46:29
19	958	356.74128968253876	282.2252228142656	21/02/24 15:46:29
19	958	357.00093076196697	282.25126318307576	21/02/24 15:46:29
19	958	357.24970148572817	282.2762133235165	21/02/24 15:46:30
19	958	357.46212456852953	282.29751802395964	21/02/24 15:46:30
19	958	357.68839041286816	282.3202110664039	21/02/24 15:46:30
19	958	357.9488928581868	282.3463378248005	21/02/24 15:46:30
19	958	358.187500306791	282.370268652604	21/02/24 15:46:30
19	958	358.4069516361076	282.3922782420106	21/02/24 15:46:30
19	958	358.4069516361076	282.3922782420106	21/02/24 15:46:30
19	958	358.63850875081977	282.4155019656256	21/02/24 15:46:30
19	958	359.1513013319054	282.46693183937293	21/02/24 15:46:30
19	958	359.1513013319054	282.46693183937293	21/02/24 15:46:30
19	958	359.3831408785256	282.4901838891336	21/02/24 15:46:31
19	958	359.8067257944211	282.5326667945993	21/02/24 15:46:31
19	958	360.0532364559587	282.55739026500015	21/02/24 15:46:31
19	958	360.2150364611212	282.57361778884655	21/02/24 15:46:31
19	958	360.38760427515354	282.590925256263	21/02/24 15:46:31
19	958	360.6552246810431	282.61776590137913	21/02/24 15:46:31
19	958	360.8497054812617	282.6372711036197	21/02/24 15:46:31
19	958	361.12487757008205	282.6648691350827	21/02/24 15:46:31
19	958	361.40797254174566	282.6932617819115	21/02/24 15:46:31
19	958	361.6143008944351	282.7139552192207	21/02/24 15:46:32
19	958	361.8553422983847	282.73813015745156	21/02/24 15:46:32
19	958	362.03189816136273	282.75583760111834	21/02/24 15:46:32
19	958	362.29097585389883	282.7818214657633	21/02/24 15:46:32
19	958	362.29097585389883	282.7818214657633	21/02/24 15:46:32
19	958	362.29097585389883	282.7818214657633	21/02/24 15:46:32
19	958	362.5696940000215	282.8097751444921	21/02/24 15:46:32
19	958	362.8217833350832	282.8350581207938	21/02/24 15:46:32
19	958	363.0717554066081	282.8601287488666	21/02/24 15:46:32
19	958	363.43810601227034	282.89687141264807	21/02/24 15:46:33
19	958	363.43810601227034	282.89687141264807	21/02/24 15:46:33
19	958	363.80831681934956	282.93400123037605	21/02/24 15:46:33
19	958	364.09913654699915	282.96316862169164	21/02/24 15:46:33
19	958	364.3626850422515	282.9896008797567	21/02/24 15:46:33
19	958	364.3626850422515	282.9896008797567	21/02/24 15:46:33
19	958	364.5710198749351	283.0104955544016	21/02/24 15:46:33
19	958	364.83950897251674	283.037423323836	21/02/24 15:46:33
19	958	365.0687899782223	283.06041876801953	21/02/24 15:46:33
19	958	365.26222073403716	283.0798186574043	21/02/24 15:46:33
19	958	365.4129228369784	283.09493313139166	21/02/24 15:46:34
19	958	365.4129228369784	283.09493313139166	21/02/24 15:46:34
19	990	365.79655922986103	283.26719546568347	21/02/24 15:46:34
19	990	365.79655922986103	283.26719546568347	21/02/24 15:46:34
19	990	365.97999310943203	283.34995838787455	21/02/24 15:46:34
19	990	366.23844213065144	283.4665671423946	21/02/24 15:46:34
19	990	366.40909352435784	283.54356277729124	21/02/24 15:46:34
19	990	366.6044362864658	283.6316988285962	21/02/24 15:46:34
19	990	366.8224931488524	283.73008317927963	21/02/24 15:46:34
19	990	367.0684774441631	283.8410680155631	21/02/24 15:46:35
19	958	367.16449423739425	283.88438951323747	21/02/24 15:46:35
19	958	366.875391874452	283.9074008261171	21/02/24 15:46:35
19	958	366.955310796194	283.98121550967574	21/02/24 15:46:35
19	958	366.9523289497066	284.0511644090814	21/02/24 15:46:35
19	958	366.99459144899174	284.0257515007272	21/02/24 15:46:35
19	958	366.8494264531211	284.10774123279555	21/02/24 15:46:35
19	958	367.042435896786	283.93664193178137	21/02/24 15:46:35
19	958	367.01207089012183	283.7669032193325	21/02/24 15:46:35
19	958	367.0286874704153	283.6816103050789	21/02/24 15:46:36
19	958	367.03350015184077	283.6483504101294	21/02/24 15:46:36
19	958	367.2148917597783	283.7334472367532	21/02/24 15:46:36
19	958	367.0901560306104	283.74679810985333	21/02/24 15:46:36
19	958	367.15383718942394	283.62481171916073	21/02/24 15:46:36
19	958	367.13240463619906	283.80487718568094	21/02/24 15:46:36
19	958	367.08984542068475	283.5857874195736	21/02/24 15:46:36
19	958	367.14014340653097	283.72664209237456	21/02/24 15:46:36
19	958	367.23073066470977	283.9917320174769	21/02/24 15:46:36
19	958	367.0707828456206	283.75268569863795	21/02/24 15:46:36
19	958	367.01908345045524	283.7747189821857	21/02/24 15:46:37
19	958	366.88150928263565	283.5470928910823	21/02/24 15:46:37
19	958	366.8761884309234	283.36164597113907	21/02/24 15:46:37
19	958	367.0614009190156	283.45838070427527	21/02/24 15:46:37
19	958	367.0614009190156	283.45838070427527	21/02/24 15:46:37
19	958	367.26546113281745	283.5295708864084	21/02/24 15:46:37
19	958	367.46823863369605	283.4737339953069	21/02/24 15:46:37
19	958	367.4056723579382	283.42868600744833	21/02/24 15:46:37
19	958	367.21082903431875	283.56028459792697	21/02/24 15:46:37
19	958	367.2555315149437	283.5429141000554	21/02/24 15:46:38
19	958	367.29372911208054	283.5541898854387	21/02/24 15:46:38
19	958	367.32780424259226	283.3056172670784	21/02/24 15:46:38
19	958	367.1574556083812	283.1613463068131	21/02/24 15:46:38
19	958	366.951296300217	283.3399304222103	21/02/24 15:46:38
19	958	366.7559017449836	283.4920473900229	21/02/24 15:46:38
19	958	366.7559017449836	283.4920473900229	21/02/24 15:46:38
19	958	366.850639090195	283.4821301280968	21/02/24 15:46:38
19	958	366.7862169242453	283.57805977434055	21/02/24 15:46:38
19	958	367.01354998020406	283.43244120530824	21/02/24 15:46:39
19	958	366.9795449810187	283.37550919926946	21/02/24 15:46:39
19	958	367.07319093863015	283.3927609658822	21/02/24 15:46:39
19	958	367.1505802705626	283.52091181144357	21/02/24 15:46:39
19	958	367.1484878968046	283.4958504387192	21/02/24 15:46:39
19	958	367.14360370143646	283.48125689355027	21/02/24 15:46:39
19	958	366.92761981520573	283.6808431748579	21/02/24 15:46:39
19	958	366.6769375811948	283.73296692872555	21/02/24 15:46:39
19	958	366.6763985809695	283.88485415124313	21/02/24 15:46:39
19	958	366.70692724831395	283.96611535288775	21/02/24 15:46:39
19	958	366.6692602580558	283.77144895694573	21/02/24 15:46:40
19	958	366.4169336068921	283.9110398815837	21/02/24 15:46:40
19	958	366.30043412981905	283.7707692360092	21/02/24 15:46:40
19	958	366.30680759517924	283.5086651063901	21/02/24 15:46:40
19	958	366.272849134957	283.51957438396744	21/02/24 15:46:40
19	958	366.33990601018917	283.60111695634004	21/02/24 15:46:40
19	958	366.33990601018917	283.60111695634004	21/02/24 15:46:40
19	958	366.26269732179185	283.693962300576	21/02/24 15:46:40
19	958	366.1375665079988	283.5148334742325	21/02/24 15:46:40
19	958	366.5810281417585	283.64454118676946	21/02/24 15:46:41
19	958	366.5810281417585	283.64454118676946	21/02/24 15:46:41
19	958	366.55255922095716	283.3293399567345	21/02/24 15:46:41
19	958	366.5349984687266	283.52704681626835	21/02/24 15:46:41
19	958	366.744020483492	283.41273021984154	21/02/24 15:46:41
19	958	366.744020483492	283.41273021984154	21/02/24 15:46:41
19	958	366.4804881335638	283.41868743943377	21/02/24 15:46:41
19	958	366.2390688083354	283.46094171813667	21/02/24 15:46:41
19	958	365.97159491271947	283.5477525158353	21/02/24 15:46:41
19	958	365.72683875600325	283.6900984680733	21/02/24 15:46:42
19	958	365.7465612835849	283.6831792839413	21/02/24 15:46:42
19	958	365.8708770616034	283.71025343827193	21/02/24 15:46:42
19	958	365.8708770616034	283.71025343827193	21/02/24 15:46:42
19	958	365.76516099034586	283.6131653683845	21/02/24 15:46:42
19	958	366.0002406663952	283.558971232873	21/02/24 15:46:42
19	958	365.79697129277633	283.49661838755765	21/02/24 15:46:42
19	958	365.6063595178006	283.5358258580127	21/02/24 15:46:42
19	958	365.4234901940836	283.34026398891467	21/02/24 15:46:42
19	958	365.5260535639595	283.1977854621822	21/02/24 15:46:42
19	958	365.5354835831172	283.2165857259163	21/02/24 15:46:43
19	958	365.25889345110227	283.1898377106068	21/02/24 15:46:43
19	958	365.1948807083344	283.3926925681539	21/02/24 15:46:43
19	958	365.23169225088463	283.2797438739631	21/02/24 15:46:43
19	958	365.3351943598769	283.1715272941476	21/02/24 15:46:43
19	958	365.3593308503928	283.1016574644115	21/02/24 15:46:43
19	958	365.4239651379433	283.1489356706566	21/02/24 15:46:43
19	958	365.317575461329	283.3794091004978	21/02/24 15:46:43
19	958	365.1361359421855	283.2369483614809	21/02/24 15:46:43
19	958	365.2343278995656	283.1669590719087	21/02/24 15:46:44
19	958	365.3780410246484	283.2945603891736	21/02/24 15:46:44
19	958	365.37123836958284	283.30220605276	21/02/24 15:46:44
19	958	365.29763882602447	283.32291710133336	21/02/24 15:46:44
19	958	365.25983169060623	283.30965514429045	21/02/24 15:46:44
19	958	365.2655244329145	283.3683122302162	21/02/24 15:46:44
19	958	365.1667554762113	283.3679172911691	21/02/24 15:46:44
19	958	365.0400537039178	283.18802588391304	21/02/24 15:46:44
19	958	365.2999375914024	283.2539568088507	21/02/24 15:46:44
19	958	365.4282005297056	283.1789832341603	21/02/24 15:46:45
19	958	365.38213069466957	283.1347369224954	21/02/24 15:46:45
19	958	365.26876289013404	283.2083382680286	21/02/24 15:46:45
19	958	365.33718327886646	283.21614672515716	21/02/24 15:46:45
19	958	365.24306224935293	283.44662388184327	21/02/24 15:46:45
19	958	365.41062147187955	283.43956751089473	21/02/24 15:46:45
19	958	364.89468323767704	283.65177509635777	21/02/24 15:46:45
19	958	364.89468323767704	283.65177509635777	21/02/24 15:46:45
19	958	364.88388213904386	283.6247412544367	21/02/24 15:46:45
19	958	365.09691332151147	283.8240990435351	21/02/24 15:46:45
19	958	365.20756231143037	283.5887896420942	21/02/24 15:46:46
19	958	365.20989861344174	283.58400432429477	21/02/24 15:46:46
19	958	365.34010971586224	283.3679265813158	21/02/24 15:46:46
19	958	365.49007691100104	283.33836475077726	21/02/24 15:46:46
19	958	365.7552891977866	283.5815963330671	21/02/24 15:46:46
19	958	365.9628593269272	283.57454025920174	21/02/24 15:46:46
19	958	365.93770600480036	283.57933765779654	21/02/24 15:46:46
19	958	365.75164235937604	283.8037147097517	21/02/24 15:46:46
19	958	366.0069252183118	283.84531549277415	21/02/24 15:46:46
19	958	366.15139290204735	283.85695276046744	21/02/24 15:46:47
19	958	366.15139290204735	283.85695276046744	21/02/24 15:46:47
19	958	366.35960688541707	283.753906445925	21/02/24 15:46:47
19	958	366.24530822480614	283.5629458529503	21/02/24 15:46:47
19	958	366.4502055343716	283.6411044548203	21/02/24 15:46:47
19	958	366.25628353600285	283.5357268989424	21/02/24 15:46:47
19	958	366.25628353600285	283.5357268989424	21/02/24 15:46:47
19	958	366.4315201007366	283.7018235107969	21/02/24 15:46:47
19	958	366.5211141234683	283.88206431391	21/02/24 15:46:47
19	958	366.5211141234683	283.88206431391	21/02/24 15:46:48
19	958	366.58317509855016	283.54141644724797	21/02/24 15:46:48
19	958	366.58317509855016	283.54141644724797	21/02/24 15:46:48
19	958	366.59853624423477	283.5366125106411	21/02/24 15:46:48
19	958	366.7635220438042	283.4698546058745	21/02/24 15:46:48
19	958	367.0387910461485	283.4513420282267	21/02/24 15:46:48
19	958	367.1210343688588	283.1859829094656	21/02/24 15:46:48
19	958	367.20700855005174	283.26482427884224	21/02/24 15:46:48
19	958	366.99845255010786	283.36466107921575	21/02/24 15:46:48
19	958	367.0379052281954	283.3890585189489	21/02/24 15:46:48
19	958	367.0214663791775	283.34675345287167	21/02/24 15:46:49
19	958	367.1730058649293	283.2643745105809	21/02/24 15:46:49
19	958	366.9356323638223	283.1476798497425	21/02/24 15:46:49
19	958	367.2141109681038	283.21210846302955	21/02/24 15:46:49
19	958	367.27389094300923	283.1248201409603	21/02/24 15:46:49
19	958	367.26179657655314	283.19089512093865	21/02/24 15:46:49
19	958	367.26179657655314	283.19089512093865	21/02/24 15:46:49
19	958	367.3045202999098	283.2889498686651	21/02/24 15:46:49
19	958	367.25612931102273	283.2271272311763	21/02/24 15:46:49
19	958	367.1111984252098	283.24850599086494	21/02/24 15:46:50
19	958	367.1694334900249	283.39282151894577	21/02/24 15:46:50
19	958	367.17021553217194	283.3930498436803	21/02/24 15:46:50
19	958	367.4075444622436	283.5198494042062	21/02/24 15:46:50
19	958	367.52056582881215	283.5446907793947	21/02/24 15:46:50
19	958	367.75858445503735	283.85742789492554	21/02/24 15:46:50
19	958	367.75858445503735	283.85742789492554	21/02/24 15:46:50
19	958	367.92583918818866	283.83401878987314	21/02/24 15:46:50
19	958	367.85736878943806	283.9923155166412	21/02/24 15:46:50
19	958	368.02184188054053	283.7661391879666	21/02/24 15:46:51
19	958	368.2235190115956	283.975835535356	21/02/24 15:46:51
19	958	368.3165634138906	284.1390628739552	21/02/24 15:46:51
19	958	368.53235465308177	284.0461545511027	21/02/24 15:46:51
19	958	368.5081877717964	284.1850152165322	21/02/24 15:46:51
19	958	368.4617180606865	284.2097867232702	21/02/24 15:46:51
19	958	368.49002521327145	284.2133034325698	21/02/24 15:46:51
19	958	368.4784049284192	284.19668698815997	21/02/24 15:46:51
19	958	368.4784049284192	284.19668698815997	21/02/24 15:46:51
19	958	368.4232063681711	284.4200775275642	21/02/24 15:46:51
19	958	368.4232063681711	284.4200775275642	21/02/24 15:46:52
19	958	368.22909915056283	284.32947264123356	21/02/24 15:46:52
19	958	368.22909915056283	284.32947264123356	21/02/24 15:46:52
19	958	368.0087227559775	284.2266058935289	21/02/24 15:46:52
19	958	367.7543530856665	284.10787184876506	21/02/24 15:46:52
19	958	367.57429035724687	284.0238226143169	21/02/24 15:46:52
19	958	367.3352744433306	283.91225535793956	21/02/24 15:46:52
19	958	367.07379062231763	283.79020058752917	21/02/24 15:46:52
19	958	366.6031022855729	283.57049385135844	21/02/24 15:46:52
19	958	366.3578745212319	283.45602704282345	21/02/24 15:46:53
19	958	366.2186238622621	283.3910279650824	21/02/24 15:46:53
19	958	366.00723947863344	283.2923584859835	21/02/24 15:46:53
19	958	366.00723947863344	283.2923584859835	21/02/24 15:46:53
19	958	365.6393709005172	283.1206457021132	21/02/24 15:46:53
19	958	365.7103314781763	283.09517016378135	21/02/24 15:46:53
19	990	365.7915752068985	283.00998908882303	21/02/24 15:46:53
19	990	365.7944520484671	282.75076216597375	21/02/24 15:46:53
19	990	365.7966419429454	282.5534347868194	21/02/24 15:46:53
19	990	365.79890505727485	282.34950970103665	21/02/24 15:46:53
19	990	365.80086139801654	282.1732274211766	21/02/24 15:46:54
19	990	365.80325319596363	281.95770689037266	21/02/24 15:46:54
19	990	365.80325319596363	281.95770689037266	21/02/24 15:46:54
19	990	365.8061956878084	281.6925643414244	21/02/24 15:46:54
19	990	365.8102928659956	281.32337512175644	21/02/24 15:46:54
19	990	365.8106103352452	281.3237107511532	21/02/24 15:46:54
19	990	365.7750961729609	281.3602616080028	21/02/24 15:46:54
19	990	365.84161692741714	281.64786542441635	21/02/24 15:46:54
19	990	365.5607191759204	281.73189812202384	21/02/24 15:46:54
19	990	365.5607191759204	281.73189812202384	21/02/24 15:46:54
19	990	365.5607191759204	281.73189812202384	21/02/24 15:46:55
19	990	365.30237812803284	281.72784628891156	21/02/24 15:46:55
19	990	365.30237812803284	281.72784628891156	21/02/24 15:46:55
19	990	364.8794487582175	281.72121304483835	21/02/24 15:46:55
19	990	364.7111543973006	281.71857350818806	21/02/24 15:46:55
19	990	364.7111543973006	281.71857350818806	21/02/24 15:46:55
19	990	364.4490117695089	281.71446205091826	21/02/24 15:46:55
19	990	364.27053044516157	281.7116627414557	21/02/24 15:46:55
19	990	364.0272245985783	281.7078467211459	21/02/24 15:46:55
19	990	363.87616567120426	281.70547750584376	21/02/24 15:46:55
19	990	363.70520233132584	281.70279610880226	21/02/24 15:46:56
19	990	363.417527996201	281.6982842110371	21/02/24 15:46:56
19	990	363.1873688375748	281.69467438399784	21/02/24 15:46:56
19	990	362.9109155583663	281.69033847779997	21/02/24 15:46:56
19	990	362.6289077787759	281.68591545455763	21/02/24 15:46:56
19	990	362.4351232278314	281.68287612857137	21/02/24 15:46:56
19	990	362.2500914566722	281.6799740815938	21/02/24 15:46:56
19	990	361.99647159836474	281.6759962958403	21/02/24 15:46:56
19	990	361.7434727011598	281.67202824926994	21/02/24 15:46:56
19	990	361.5043287729095	281.66827750468246	21/02/24 15:46:57
19	990	361.3129197408402	281.66527543644565	21/02/24 15:46:57
19	990	361.1470802201849	281.66267440162517	21/02/24 15:46:57
19	990	360.98354925886315	281.66010957435753	21/02/24 15:46:57
19	990	360.8035570856592	281.65728656867066	21/02/24 15:46:57
19	990	360.511169644622	281.65270075033135	21/02/24 15:46:57
19	990	360.2534267951362	281.6486582993909	21/02/24 15:46:57
19	990	360.05774921934636	281.64558928311413	21/02/24 15:46:57
19	990	359.87045686093404	281.64265178098003	21/02/24 15:46:57
19	990	359.5813882655832	281.6381180155721	21/02/24 15:46:57
19	990	359.3069765641953	281.6338141295766	21/02/24 15:46:58
19	990	359.08428008244357	281.6303213475115	21/02/24 15:46:58
19	990	358.8270722795535	281.6262872882669	21/02/24 15:46:58
19	990	358.59157202267477	281.62259369119215	21/02/24 15:46:58
19	990	358.2928263761552	281.6179081504598	21/02/24 15:46:58
19	990	358.01856799761174	281.61360666918694	21/02/24 15:46:58
19	990	357.7956355845546	281.61011018676413	21/02/24 15:46:58
19	990	357.6249129087069	281.60743256430857	21/02/24 15:46:58
19	990	357.3547587822238	281.60319545431753	21/02/24 15:46:58
19	990	357.14351354885	281.5998822741691	21/02/24 15:46:58
19	990	356.86720055333734	281.5955485681873	21/02/24 15:46:59
19	990	356.58549056235006	281.5911302154754	21/02/24 15:46:59
19	933	356.399562875145	281.55107579353773	21/02/24 15:46:59
19	933	356.17916799018917	281.4691349851321	21/02/24 15:46:59
19	933	355.9224302075265	281.37368221877654	21/02/24 15:46:59
19	933	355.7483164803466	281.30894832278574	21/02/24 15:46:59
19	933	355.5679312670978	281.2418827454653	21/02/24 15:46:59
19	933	355.3702149356155	281.1683736164313	21/02/24 15:46:59
19	933	355.1814479286035	281.09819176462486	21/02/24 15:46:59
19	933	355.0396287377036	281.0454646827232	21/02/24 15:47:00
19	933	354.8695932460826	280.98224703752305	21/02/24 15:47:00
19	933	354.69963843589545	280.9190593889442	21/02/24 15:47:00
19	933	354.4703797626704	280.8338231048906	21/02/24 15:47:00
19	933	354.288481041448	280.76619481910757	21/02/24 15:47:00
19	933	354.0758172118814	280.68712834659476	21/02/24 15:47:00
19	933	353.85755797713864	280.605981553463	21/02/24 15:47:00
19	933	353.58158277351305	280.5033764894229	21/02/24 15:47:00
19	933	353.4017338767422	280.4365103096782	21/02/24 15:47:00
19	933	353.08758288608107	280.3197118361503	21/02/24 15:47:00
19	933	352.93978824512834	280.26476313641024	21/02/24 15:47:01
19	933	352.6611153520688	280.16115509603935	21/02/24 15:47:01
19	933	352.4286047307627	280.0747097673443	21/02/24 15:47:01
19	933	352.1724635639263	279.9794788173123	21/02/24 15:47:01
19	933	351.9672026032811	279.9031646639564	21/02/24 15:47:01
19	933	351.7634498542924	279.82741124994067	21/02/24 15:47:01
19	933	351.5393866250611	279.7441065845857	21/02/24 15:47:01
19	933	351.36831562464255	279.6805039466576	21/02/24 15:47:01
19	933	351.13923944800166	279.59533551316974	21/02/24 15:47:01
19	933	350.86738133098703	279.4942611443872	21/02/24 15:47:01
19	933	350.60892429263504	279.3981691744446	21/02/24 15:47:02
19	933	350.3498195263554	279.3018363851652	21/02/24 15:47:02
19	933	350.0969612752581	279.2078259932675	21/02/24 15:47:02
19	933	349.8498450738162	279.11595044306887	21/02/24 15:47:02
19	933	349.63000850592226	279.03421721185543	21/02/24 15:47:02
19	933	349.63000850592226	279.03421721185543	21/02/24 15:47:02
19	933	349.44013899065123	278.96362545753226	21/02/24 15:47:02
19	933	349.19963698868213	278.87420900638153	21/02/24 15:47:02
19	933	348.98745776481326	278.7953227058479	21/02/24 15:47:02
19	933	348.98745776481326	278.7953227058479	21/02/24 15:47:03
19	933	348.45594040430785	278.5977093982153	21/02/24 15:47:03
19	933	348.1986789196435	278.5020619242312	21/02/24 15:47:03
19	933	347.93012113710313	278.40221458970984	21/02/24 15:47:03
19	933	347.6980841848476	278.3159453668483	21/02/24 15:47:03
19	933	347.477162417309	278.2338086683032	21/02/24 15:47:03
19	933	347.21891776702665	278.13779566230806	21/02/24 15:47:03
19	933	347.21891776702665	278.13779566230806	21/02/24 15:47:03
19	933	347.07391549622207	278.0838851403249	21/02/24 15:47:03
19	933	346.8245148618988	277.9911602588132	21/02/24 15:47:03
19	933	346.4162530855725	277.8393722533883	21/02/24 15:47:04
19	933	346.1770049102291	277.75042196354315	21/02/24 15:47:04
19	933	345.9129448288471	277.6522468332971	21/02/24 15:47:04
19	933	345.66019136611027	277.55827540075626	21/02/24 15:47:04
19	933	345.5140878099979	277.5039554309385	21/02/24 15:47:04
19	933	345.3515962212311	277.4435425400253	21/02/24 15:47:04
19	933	345.10787734519295	277.35293008443097	21/02/24 15:47:04
19	933	344.83070477533613	277.24987985054514	21/02/24 15:47:04
19	933	344.83070477533613	277.24987985054514	21/02/24 15:47:04
19	933	344.6005056379622	277.16429391049724	21/02/24 15:47:04
19	933	344.3260916500401	277.06226929221873	21/02/24 15:47:05
19	933	343.882419336616	276.89731597201603	21/02/24 15:47:05
19	933	343.882419336616	276.89731597201603	21/02/24 15:47:05
19	933	343.61913746342907	276.7994301724803	21/02/24 15:47:05
19	933	343.1646997290875	276.6304743669522	21/02/24 15:47:05
19	933	342.97157671479073	276.5586729913605	21/02/24 15:47:05
19	933	342.97157671479073	276.5586729913605	21/02/24 15:47:05
19	933	342.539561603833	276.3980537127306	21/02/24 15:47:05
19	933	342.539561603833	276.3980537127306	21/02/24 15:47:05
19	933	342.0338289354106	276.2100269184791	21/02/24 15:47:06
19	933	341.77288003051194	276.1130084952782	21/02/24 15:47:06
19	933	341.5069834763014	276.0141505811817	21/02/24 15:47:06
19	933	341.3126950344279	275.9419159102447	21/02/24 15:47:06
19	933	341.3126950344279	275.9419159102447	21/02/24 15:47:06
19	933	341.1080950918405	275.8658475173747	21/02/24 15:47:06
19	933	340.7414238177806	275.72952248142116	21/02/24 15:47:06
19	933	340.7414238177806	275.72952248142116	21/02/24 15:47:06
19	964	340.53440187202364	275.6759524257736	21/02/24 15:47:06
19	964	340.365915505147	275.66803793488845	21/02/24 15:47:06
19	964	340.1064318076677	275.6558489287593	21/02/24 15:47:07
19	964	339.8185330158007	275.64232514991414	21/02/24 15:47:07
19	964	339.6425294708055	275.6340575465559	21/02/24 15:47:07
19	964	339.1828411900881	275.61246411573313	21/02/24 15:47:07
19	964	338.8903765025763	275.59872585817294	21/02/24 15:47:07
19	964	338.6862850439463	275.58913885111116	21/02/24 15:47:07
19	964	338.4880654349406	275.57982766874187	21/02/24 15:47:07
19	964	338.26359852601246	275.56928354379187	21/02/24 15:47:07
19	964	338.0997628206368	275.5615875134193	21/02/24 15:47:07
19	964	337.8855976449716	275.55152730283885	21/02/24 15:47:07
19	964	337.6728439313996	275.5415333943817	21/02/24 15:47:08
19	933	337.4973574331008	275.5332900788127	21/02/24 15:47:08
19	933	337.6329302911047	275.5025067805385	21/02/24 15:47:08
19	933	337.6548609414257	275.43837902873287	21/02/24 15:47:08
19	933	337.7483746827754	275.5442839097998	21/02/24 15:47:08
19	933	337.9215590443627	275.47640313946744	21/02/24 15:47:08
19	933	337.9269425866607	275.52180703427246	21/02/24 15:47:08
19	933	337.9878620759569	275.54042342138814	21/02/24 15:47:08
19	933	337.87379297556413	275.73969989978735	21/02/24 15:47:08
19	933	337.9299316610745	275.71668517498074	21/02/24 15:47:09
19	933	338.02808740025176	275.58639498487014	21/02/24 15:47:09
19	933	338.0262046901433	275.5794804398671	21/02/24 15:47:09
19	933	338.1338913702701	275.3135917902369	21/02/24 15:47:09
19	933	338.06798931632716	275.2810060219343	21/02/24 15:47:09
19	933	337.98665854332427	275.2912804359555	21/02/24 15:47:09
19	933	337.9227554552662	275.526753113731	21/02/24 15:47:09
19	933	337.98148740069354	275.47901849535543	21/02/24 15:47:09
19	933	337.9805644651373	275.4780850412495	21/02/24 15:47:09
19	933	337.9502683892774	275.59179468106953	21/02/24 15:47:09
19	933	337.858229172798	275.7505798149386	21/02/24 15:47:10
19	933	337.71094572772506	275.8530785765546	21/02/24 15:47:10
19	933	337.503561200524	276.06373315123506	21/02/24 15:47:10
19	933	337.56816777868863	276.11223605087844	21/02/24 15:47:10
19	933	337.5598755649917	276.28124551190075	21/02/24 15:47:10
19	933	337.48513678052586	276.2920215284234	21/02/24 15:47:10
19	933	337.6381771997923	276.5246023648343	21/02/24 15:47:10
19	933	337.6674704899772	276.44493187137635	21/02/24 15:47:10
19	933	337.81536758371766	276.56886165953074	21/02/24 15:47:10
19	933	337.82279163156784	276.6357898809225	21/02/24 15:47:10
19	933	337.82279163156784	276.6357898809225	21/02/24 15:47:11
19	933	337.740382876488	276.4385164077899	21/02/24 15:47:11
19	933	337.4730067242876	276.51085766983414	21/02/24 15:47:11
19	933	337.76699883347163	276.4812761619938	21/02/24 15:47:11
19	933	337.828384220882	276.56929018335654	21/02/24 15:47:11
19	933	338.02238130071254	276.36221461660983	21/02/24 15:47:11
19	933	338.01624893576945	276.3932524376729	21/02/24 15:47:11
19	933	338.01624893576945	276.3932524376729	21/02/24 15:47:11
19	933	337.92321564851676	276.5867893198866	21/02/24 15:47:11
19	933	337.80787114876006	276.7284034545945	21/02/24 15:47:11
19	933	337.8528315910493	276.65561723477896	21/02/24 15:47:12
19	933	338.0208755978105	276.8401853272196	21/02/24 15:47:12
19	933	338.1066981844543	276.75789356432705	21/02/24 15:47:12
19	933	338.14055079818127	276.5925890577917	21/02/24 15:47:12
19	933	338.1688743029692	276.6666326041832	21/02/24 15:47:12
19	933	338.1727144233809	276.6098585821668	21/02/24 15:47:12
19	933	338.1948722353402	276.5526599126203	21/02/24 15:47:12
19	933	338.28895373515036	276.5324681983925	21/02/24 15:47:12
19	933	338.43662866579524	276.7000802916035	21/02/24 15:47:12
19	933	338.43266238219366	276.72898084407075	21/02/24 15:47:13
19	933	338.4436839014135	276.7429742255655	21/02/24 15:47:13
19	933	338.58511308777264	276.8615845381448	21/02/24 15:47:13
19	933	338.691319852466	276.77853137920727	21/02/24 15:47:13
19	933	338.703471121586	276.79934340897165	21/02/24 15:47:13
19	933	338.5925712258352	276.67818086990144	21/02/24 15:47:13
19	933	338.7538542694376	276.7605901269591	21/02/24 15:47:13
19	933	338.49762595978535	276.66263548200277	21/02/24 15:47:13
19	933	338.5080520381376	276.6693551600805	21/02/24 15:47:13
19	933	338.4028535704923	276.7031282396259	21/02/24 15:47:13
19	933	338.3848813436352	276.69419742403016	21/02/24 15:47:14
19	933	338.42692295995874	276.59643347892626	21/02/24 15:47:14
19	933	338.46749019820646	276.55920673869724	21/02/24 15:47:14
19	933	338.50354871925396	276.53338644682395	21/02/24 15:47:14
19	933	338.61469533374265	276.46090310153664	21/02/24 15:47:14
19	933	338.8922009056481	276.36126951473307	21/02/24 15:47:14
19	933	338.8922009056481	276.36126951473307	21/02/24 15:47:14
19	933	338.9454523449334	276.2345911197791	21/02/24 15:47:14
19	933	338.9454523449334	276.2345911197791	21/02/24 15:47:14
19	933	338.8918358471759	276.19748435815313	21/02/24 15:47:14
19	933	338.89241850058664	276.1952778034774	21/02/24 15:47:15
19	933	338.8258269601723	275.9262251460303	21/02/24 15:47:15
19	933	338.5642083984196	275.92282444695945	21/02/24 15:47:15
19	933	338.44663741711935	275.8701875771348	21/02/24 15:47:15
19	933	338.47108356177733	275.9435871863919	21/02/24 15:47:15
19	933	338.47068048444487	275.93886496877116	21/02/24 15:47:15
19	933	338.6998080130261	275.76722915643677	21/02/24 15:47:15
19	933	338.8070331199245	275.77741358948686	21/02/24 15:47:15
19	933	338.63800476351315	275.827781603159	21/02/24 15:47:15
19	933	338.63800476351315	275.827781603159	21/02/24 15:47:15
19	933	338.54123379983787	275.98993268965694	21/02/24 15:47:16
19	933	338.62839783139293	275.87435054963237	21/02/24 15:47:16
19	933	338.6018078935274	276.02508983995233	21/02/24 15:47:16
19	933	338.5075210715255	275.99967468306653	21/02/24 15:47:16
19	933	338.42607810847176	275.738775137216	21/02/24 15:47:16
19	933	338.5421271706167	275.90388235338537	21/02/24 15:47:16
19	933	338.5421271706167	275.90388235338537	21/02/24 15:47:16
19	933	338.5206615324118	275.8208950938625	21/02/24 15:47:16
19	933	338.59163752771474	276.08002869216733	21/02/24 15:47:16
19	933	338.78648126127797	276.11846941451864	21/02/24 15:47:17
19	933	338.87781101521375	276.1369973323112	21/02/24 15:47:17
19	933	338.85371987381575	275.87947388166396	21/02/24 15:47:17
19	933	338.698233953553	276.0913508948715	21/02/24 15:47:17
19	933	338.9233435606088	276.0030232200015	21/02/24 15:47:17
19	933	338.94820859573844	275.85837687519825	21/02/24 15:47:17
19	933	338.9458411960066	275.8656490767501	21/02/24 15:47:17
19	933	338.71646022541523	275.7662271563656	21/02/24 15:47:17
19	933	338.9824017272595	275.6814528340837	21/02/24 15:47:17
19	933	339.1685104660162	275.57631163991556	21/02/24 15:47:17
19	933	339.320008623575	275.48610603617715	21/02/24 15:47:18
19	933	339.31246452831516	275.49762748018566	21/02/24 15:47:18
19	933	339.31246452831516	275.49762748018566	21/02/24 15:47:18
19	933	339.14849241013087	275.2439684526965	21/02/24 15:47:18
19	933	339.14849241013087	275.2439684526965	21/02/24 15:47:18
19	933	338.97702971993783	275.30539485346515	21/02/24 15:47:18
19	933	338.9428676095328	275.31886875581955	21/02/24 15:47:18
19	933	338.85525979238855	275.2416998569632	21/02/24 15:47:18
19	933	338.9194709116382	274.99707377549004	21/02/24 15:47:18
19	933	339.12741436214884	275.0349245168229	21/02/24 15:47:18
19	933	339.196652390689	275.0517376275469	21/02/24 15:47:19
19	933	339.196652390689	275.0517376275469	21/02/24 15:47:19
19	933	339.2229448217793	275.1111627395805	21/02/24 15:47:19
19	933	339.19069043024945	275.04203771252776	21/02/24 15:47:19
19	933	339.1104829301506	275.0991301930591	21/02/24 15:47:19
19	933	339.3268076639298	275.1002670644395	21/02/24 15:47:19
19	933	339.2198515245459	275.24741669652883	21/02/24 15:47:19
19	933	339.3946820316752	275.3123539800186	21/02/24 15:47:19
19	933	339.19019188995816	275.2142477678502	21/02/24 15:47:19
19	933	339.19019188995816	275.2142477678502	21/02/24 15:47:19
19	933	339.33559045550675	275.0300376154677	21/02/24 15:47:20
19	933	339.2740810599466	274.5026353009468	21/02/24 15:47:20
19	933	339.41824877734524	274.61112916796185	21/02/24 15:47:20
19	933	339.2105281740204	274.4490180589485	21/02/24 15:47:20
19	933	339.2105281740204	274.4490180589485	21/02/24 15:47:20
19	933	339.34224642866667	274.43214194801675	21/02/24 15:47:20
19	933	339.1706003549714	274.5527037053599	21/02/24 15:47:20
19	933	339.0221777954856	274.32267803953374	21/02/24 15:47:20
19	933	339.2791834011366	274.2549207817839	21/02/24 15:47:20
19	933	339.2836639970643	274.322473954122	21/02/24 15:47:21
19	933	339.2836639970643	274.322473954122	21/02/24 15:47:21
19	933	339.2004927843817	274.42304111790315	21/02/24 15:47:21
19	933	339.3581561622082	274.3184644764936	21/02/24 15:47:21
19	933	339.3581561622082	274.3184644764936	21/02/24 15:47:21
19	933	339.29155711887216	274.7153499812873	21/02/24 15:47:21
19	933	339.29155711887216	274.7153499812873	21/02/24 15:47:21
19	933	338.98519788459794	274.80249602128265	21/02/24 15:47:21
19	933	338.86393872788585	274.6520275732145	21/02/24 15:47:21
19	933	338.86393872788585	274.6520275732145	21/02/24 15:47:21
19	933	338.9369178272597	274.7588123814789	21/02/24 15:47:22
19	933	339.17993127065824	274.8019629086449	21/02/24 15:47:22
19	933	339.17993127065824	274.8019629086449	21/02/24 15:47:22
19	933	339.35260343171115	274.57252631479105	21/02/24 15:47:22
19	933	339.35260343171115	274.57252631479105	21/02/24 15:47:22
19	933	339.47731240889635	274.60953969669276	21/02/24 15:47:22
19	933	339.11895678698045	274.7227465076057	21/02/24 15:47:22
19	933	339.11895678698045	274.7227465076057	21/02/24 15:47:22
19	933	339.0843394726905	274.4580067398542	21/02/24 15:47:22
19	933	339.2317229562478	274.554823650318	21/02/24 15:47:23
19	933	339.2317229562478	274.554823650318	21/02/24 15:47:23
19	933	339.149406584978	274.77886158603826	21/02/24 15:47:23
19	933	339.10423982592084	274.8293805484037	21/02/24 15:47:23
19	933	339.33558238337747	274.67210046548735	21/02/24 15:47:23
19	933	339.5807930208876	274.5113719200058	21/02/24 15:47:23
19	933	339.68709509398855	274.51875188131123	21/02/24 15:47:23
19	933	339.5858558802291	274.79568037724835	21/02/24 15:47:23
19	933	339.4532897948851	275.02947337170946	21/02/24 15:47:23
19	933	339.4532897948851	275.02947337170946	21/02/24 15:47:23
19	933	339.42944377689855	275.3192494988383	21/02/24 15:47:24
19	933	339.1394488350106	275.3831242862815	21/02/24 15:47:24
19	933	339.14397311705807	275.4063124863106	21/02/24 15:47:24
19	933	339.14113703941376	275.36317575059195	21/02/24 15:47:24
19	933	339.06835297025464	275.43028248708396	21/02/24 15:47:24
19	933	338.87900308503015	275.30110168211297	21/02/24 15:47:24
19	933	338.7932252766638	275.5030629090307	21/02/24 15:47:24
19	933	338.65327700763254	275.32483188502886	21/02/24 15:47:24
19	933	338.7233900171675	275.20335608456395	21/02/24 15:47:24
19	933	338.72469111783016	275.32526106657593	21/02/24 15:47:24
19	933	338.74580934431043	275.4473926971129	21/02/24 15:47:25
19	933	338.58434673526733	275.4368282968452	21/02/24 15:47:25
19	933	338.62692840408056	275.2564131903595	21/02/24 15:47:25
19	933	338.4387858569454	275.12601852356937	21/02/24 15:47:25
19	933	338.4921983851309	275.097722476954	21/02/24 15:47:25
19	933	338.27308480622384	274.9820884914844	21/02/24 15:47:25
19	933	338.30264952591216	274.9050693709487	21/02/24 15:47:25
19	933	338.4192857751547	275.035568288841	21/02/24 15:47:25
19	933	338.60425589408857	275.0889150465956	21/02/24 15:47:25
19	933	338.7045794799337	274.9476720604758	21/02/24 15:47:25
19	933	338.72007352264944	274.99068593758557	21/02/24 15:47:26
19	933	338.7823627805689	274.97514323825163	21/02/24 15:47:26
19	933	338.58558684470654	274.8614332066426	21/02/24 15:47:26
19	933	338.7761598263047	274.70935308457865	21/02/24 15:47:26
19	933	338.78386308189533	274.71057755173973	21/02/24 15:47:26
19	933	338.75431408552697	274.74093198534547	21/02/24 15:47:26
19	933	338.8953825727761	274.7804134602068	21/02/24 15:47:26
19	933	338.7227105205906	274.76635059587966	21/02/24 15:47:26
19	933	338.53012858857335	274.72487320834114	21/02/24 15:47:26
19	933	338.6236948907073	274.6106499332757	21/02/24 15:47:27
19	933	338.63434198010464	274.6574764105261	21/02/24 15:47:27
19	933	338.74901914127963	274.80786965123735	21/02/24 15:47:27
19	933	338.7473758857882	274.8080439338046	21/02/24 15:47:27
19	933	338.82085675184385	274.7297395194029	21/02/24 15:47:27
19	933	339.0755779403084	274.6762043894769	21/02/24 15:47:27
19	933	339.11664655399085	274.47348144074283	21/02/24 15:47:27
19	933	339.12450298108956	274.3939153552576	21/02/24 15:47:27
19	933	339.12450298108956	274.3939153552576	21/02/24 15:47:27
19	933	338.95207945200053	274.35457231522327	21/02/24 15:47:27
19	933	338.974314263338	274.6412721798149	21/02/24 15:47:28
19	933	338.974314263338	274.6412721798149	21/02/24 15:47:28
19	933	339.01976284633747	274.4795020101623	21/02/24 15:47:28
19	933	339.18585178327515	274.4647801914674	21/02/24 15:47:28
19	933	339.31958188212576	274.22793653483615	21/02/24 15:47:28
19	933	339.3115594359515	274.36579082568545	21/02/24 15:47:28
19	933	339.1244755690457	274.4921793654438	21/02/24 15:47:28
19	933	339.09686643274085	274.2919777631431	21/02/24 15:47:28
19	933	339.1829502920909	274.2293980449717	21/02/24 15:47:28
19	933	339.1958345304027	274.48139119342096	21/02/24 15:47:28
19	933	339.27755817701006	274.52071060139787	21/02/24 15:47:29
19	933	339.27755817701006	274.52071060139787	21/02/24 15:47:29
19	933	339.33058167138716	274.73013330190724	21/02/24 15:47:29
19	933	339.108714123636	274.58406072702934	21/02/24 15:47:29
19	933	338.91776604537034	274.4269824544938	21/02/24 15:47:29
19	933	339.18512720303085	274.4590027389718	21/02/24 15:47:29
19	933	339.18512720303085	274.4590027389718	21/02/24 15:47:29
19	933	338.94342207149714	274.612214905189	21/02/24 15:47:29
19	933	338.8211960107726	274.7358811461878	21/02/24 15:47:29
19	933	338.8211960107726	274.7358811461878	21/02/24 15:47:30
19	933	338.90413881309775	274.7711940020741	21/02/24 15:47:30
19	933	338.87881328864853	274.76757765397383	21/02/24 15:47:30
19	933	338.98212819836584	274.55266377940285	21/02/24 15:47:30
19	933	338.98212819836584	274.55266377940285	21/02/24 15:47:30
19	933	339.0472297258901	274.43421674802596	21/02/24 15:47:30
19	933	339.2824563606146	274.3910989791852	21/02/24 15:47:30
19	933	339.07791103857744	274.3140078189016	21/02/24 15:47:30
19	933	338.9905357027538	274.5036509122326	21/02/24 15:47:30
19	933	338.9139117315438	274.59148144100476	21/02/24 15:47:30
19	933	338.6926024445268	274.6414317335642	21/02/24 15:47:31
19	933	338.8423562740852	274.74646315534164	21/02/24 15:47:31
19	933	338.6226211683666	274.90272300513385	21/02/24 15:47:31
19	933	338.7770466344236	275.15162202229124	21/02/24 15:47:31
19	933	338.9511707466873	275.1787244732319	21/02/24 15:47:31
19	933	338.90098177301604	275.10042030852225	21/02/24 15:47:31
19	933	339.0156872020039	275.12980177526003	21/02/24 15:47:31
19	933	339.0148389086439	275.153476578878	21/02/24 15:47:31
19	933	339.1973705823632	275.24113188449724	21/02/24 15:47:31
19	933	339.17728528720505	275.3118875044192	21/02/24 15:47:31
19	933	339.19539507865727	275.40296248390683	21/02/24 15:47:32
19	933	339.17540040891936	275.41594735411184	21/02/24 15:47:32
19	933	339.30530208665886	275.63643322256297	21/02/24 15:47:32
19	933	339.5451895966306	275.79627914340955	21/02/24 15:47:32
19	933	339.66431873368265	275.6749997642973	21/02/24 15:47:32
19	933	339.60488331188606	275.65024890427975	21/02/24 15:47:32
19	933	339.6364161714155	275.6894068921081	21/02/24 15:47:32
19	933	339.60135980630616	275.51733271861525	21/02/24 15:47:32
19	933	339.55480937152043	275.4429526126917	21/02/24 15:47:32
19	933	339.6088965884444	275.45430773327695	21/02/24 15:47:33
19	933	339.46928861826916	275.52511683809234	21/02/24 15:47:33
19	933	339.46928861826916	275.52511683809234	21/02/24 15:47:33
19	933	339.4363164569216	275.5596206916939	21/02/24 15:47:33
19	933	339.23193501452477	275.3673449083115	21/02/24 15:47:33
19	933	339.1289849253075	275.1202900690331	21/02/24 15:47:33
19	933	339.1197786751074	275.11939980565404	21/02/24 15:47:33
19	933	339.23816739972904	275.04270486652933	21/02/24 15:47:33
19	933	339.21192463787645	275.135119822408	21/02/24 15:47:33
19	933	339.3653744521117	275.03805174551223	21/02/24 15:47:33
19	933	339.2726307838786	275.0109750693002	21/02/24 15:47:34
19	933	339.28429859216794	275.0579037056679	21/02/24 15:47:34
19	933	339.1419600634121	275.2455708233688	21/02/24 15:47:34
19	933	339.3118531895254	275.1938401250598	21/02/24 15:47:34
19	933	339.38879991761627	275.2419779924313	21/02/24 15:47:34
19	933	339.4171759516418	275.2879215667878	21/02/24 15:47:34
19	933	339.4268791152056	275.3412911915409	21/02/24 15:47:34
19	933	339.51983923764163	275.5586576767271	21/02/24 15:47:34
19	933	339.2790065475437	275.5688056558705	21/02/24 15:47:34
19	933	339.08445716901474	275.79376867294127	21/02/24 15:47:34
19	933	339.037974318986	276.04884019065145	21/02/24 15:47:35
19	933	339.13093979926504	276.17632992703705	21/02/24 15:47:35
19	933	339.15295708694265	276.006374485098	21/02/24 15:47:35
19	933	339.2275094499446	275.94924375156813	21/02/24 15:47:35
19	933	339.22657282027666	275.96410473642317	21/02/24 15:47:35
19	933	339.21796022481834	275.9511878745458	21/02/24 15:47:35
19	933	339.2759165519212	275.9347848033875	21/02/24 15:47:35
19	933	339.4736899331051	275.96953235456914	21/02/24 15:47:35
19	933	339.47254119511837	275.97924335403536	21/02/24 15:47:35
19	933	339.47254119511837	275.97924335403536	21/02/24 15:47:35
19	933	339.55591480454825	276.2146690066124	21/02/24 15:47:36
19	933	339.6347592370307	276.2666153992458	21/02/24 15:47:36
19	933	339.6565728323583	276.491563967023	21/02/24 15:47:36
19	933	339.75665534226806	276.2626107273658	21/02/24 15:47:36
19	933	339.7400147967213	276.27360042154544	21/02/24 15:47:36
19	933	339.9213580408524	276.12567651003366	21/02/24 15:47:36
19	933	339.7944903021596	275.9345358866891	21/02/24 15:47:36
19	933	339.66844526911706	275.8187733736167	21/02/24 15:47:36
19	933	339.70273659895736	275.8163032664037	21/02/24 15:47:36
19	933	339.8519658149129	275.69159368302167	21/02/24 15:47:37
19	933	340.0921683967621	275.6661425276659	21/02/24 15:47:37
19	933	340.23090205435346	275.7063870003935	21/02/24 15:47:37
19	933	340.4291967371971	275.7289275589163	21/02/24 15:47:37
19	933	340.2250026708324	275.804387368641	21/02/24 15:47:37
19	933	340.2614329667266	275.7332069861077	21/02/24 15:47:37
19	933	340.4262066665969	275.60078144132916	21/02/24 15:47:37
19	933	340.4262066665969	275.60078144132916	21/02/24 15:47:37
19	933	340.4262066665969	275.60078144132916	21/02/24 15:47:37
19	933	340.4833500731734	275.45596539527776	21/02/24 15:47:37
19	933	340.5680185394211	275.2413937895266	21/02/24 15:47:38
19	911	340.55769597607855	275.17242302316134	21/02/24 15:47:38
19	911	340.40468971679365	275.26155983273844	21/02/24 15:47:38
19	911	340.22323030803915	275.36727258488156	21/02/24 15:47:38
19	911	339.98399947884036	275.5066412157267	21/02/24 15:47:38
19	911	339.80623420191563	275.6102018786219	21/02/24 15:47:38
19	911	339.5824162607471	275.7405914280111	21/02/24 15:47:38
19	911	339.3499066619395	275.87604447372723	21/02/24 15:47:38
19	911	339.14117565517654	275.99764483236373	21/02/24 15:47:38
19	911	338.95621159881125	276.1053992859913	21/02/24 15:47:38
19	911	338.74135602036444	276.2305676344766	21/02/24 15:47:39
19	911	338.60640659636647	276.30918507905477	21/02/24 15:47:39
19	911	338.4335211233405	276.4099029160883	21/02/24 15:47:39
19	911	338.1836855343934	276.55544955856976	21/02/24 15:47:39
19	911	338.04215538712947	276.6379007330841	21/02/24 15:47:39
19	911	337.802909194995	276.77727831390996	21/02/24 15:47:39
19	911	337.59787557095905	276.8967246894244	21/02/24 15:47:39
19	911	337.40865369164896	277.0069596216599	21/02/24 15:47:39
19	911	337.2616593488665	277.0925940708828	21/02/24 15:47:39
19	911	337.07175062268436	277.2032291392901	21/02/24 15:47:40
19	911	336.8352166299344	277.34102667495176	21/02/24 15:47:40
19	911	336.6956202072428	277.4223513201347	21/02/24 15:47:40
19	911	336.5526323431799	277.50565171627784	21/02/24 15:47:40
19	911	336.3736402678149	277.6099270747644	21/02/24 15:47:40
19	911	335.94746338650464	277.8582048098915	21/02/24 15:47:40
19	911	335.7874044521648	277.9514502942138	21/02/24 15:47:40
19	911	335.64706292674714	278.0332090136635	21/02/24 15:47:40
19	911	335.4810462991048	278.12992526954713	21/02/24 15:47:40
19	911	335.2504842809573	278.264243713795	21/02/24 15:47:40
19	911	335.109635763019	278.346297791722	21/02/24 15:47:41
19	911	334.8944687662447	278.4716475630869	21/02/24 15:47:41
19	911	334.68543016953186	278.5934271143062	21/02/24 15:47:41
19	911	334.464906581122	278.72189747361847	21/02/24 15:47:41
19	911	334.2400001415428	278.85292114919315	21/02/24 15:47:41
19	911	334.09785438341345	278.9357309599407	21/02/24 15:47:41
19	911	333.96414606973536	279.0136253712603	21/02/24 15:47:41
19	911	333.78956822880014	279.115329130548	21/02/24 15:47:41
19	911	333.6570839585056	279.19251045128874	21/02/24 15:47:41
19	911	333.5264923880195	279.26858914248214	21/02/24 15:47:41
19	911	333.3692012496601	279.36022219274844	21/02/24 15:47:42
19	911	333.2174305484857	279.4486392036158	21/02/24 15:47:42
19	911	333.0084791371157	279.5703679632967	21/02/24 15:47:42
19	911	332.82904957702755	279.67489818712437	21/02/24 15:47:42
19	911	332.6092055802453	279.8029726369504	21/02/24 15:47:42
19	911	332.47724757274045	279.8798473729391	21/02/24 15:47:42
19	911	332.27560435803207	279.99731859873066	21/02/24 15:47:42
19	911	332.07095629253445	280.1165403595256	21/02/24 15:47:42
19	911	331.8269560756918	280.25868749106866	21/02/24 15:47:42
19	911	331.6170945142087	280.38094647662194	21/02/24 15:47:43
19	911	331.4263242507887	280.49208345051386	21/02/24 15:47:43
19	911	331.17106482741303	280.64078985455603	21/02/24 15:47:43
19	911	330.95140260456947	280.7687584083943	21/02/24 15:47:43
19	911	330.7932947331919	280.8608672625647	21/02/24 15:47:43
19	911	330.633140208824	280.9541684347404	21/02/24 15:47:43
19	911	330.40024447649876	281.08984643014145	21/02/24 15:47:43
19	911	330.16172101757303	281.22880296850343	21/02/24 15:47:43
19	911	329.892863253985	281.25038939349827	21/02/24 15:47:43
19	911	329.6222777811584	281.26987030005097	21/02/24 15:47:43
19	911	329.4285044227831	281.2838210884931	21/02/24 15:47:44
19	911	329.2054006632054	281.29988353059866	21/02/24 15:47:44
19	911	328.9426325112583	281.31880162608854	21/02/24 15:47:44
19	911	328.76003465511724	281.33194782989267	21/02/24 15:47:44
19	911	328.4843938541258	281.3517926967665	21/02/24 15:47:44
19	911	328.4843938541258	281.3517926967665	21/02/24 15:47:44
19	911	328.22876976844606	281.3701964524217	21/02/24 15:47:44
19	911	328.0660966481233	281.38190816710664	21/02/24 15:47:44
19	911	327.8759559372846	281.39559742167387	21/02/24 15:47:44
19	911	327.66127915146467	281.4110531605201	21/02/24 15:47:44
19	911	327.3927248175038	281.4303878344387	21/02/24 15:47:45
19	911	327.3927248175038	281.4303878344387	21/02/24 15:47:45
19	911	327.2067031433288	281.4437805373563	21/02/24 15:47:45
19	911	326.969566201313	281.4608533038997	21/02/24 15:47:45
19	911	326.79363463178277	281.47351956580167	21/02/24 15:47:45
19	911	326.5542979825509	281.4907507011232	21/02/24 15:47:45
19	911	326.2808622776831	281.51043681124236	21/02/24 15:47:45
19	911	326.0248294443707	281.52886999484264	21/02/24 15:47:45
19	911	325.7948115610554	281.5454302219809	21/02/24 15:47:45
19	911	325.52866471299984	281.56459156801367	21/02/24 15:47:46
19	911	325.2447694309311	281.5850307194691	21/02/24 15:47:46
19	911	325.03413811247174	281.60019520331633	21/02/24 15:47:46
19	911	324.7723198925293	281.6190449080814	21/02/24 15:47:46
19	911	324.5535659202041	281.6347941855588	21/02/24 15:47:46
19	911	324.37324845772724	281.64777621153246	21/02/24 15:47:46
19	911	324.184821347357	281.6613420947662	21/02/24 15:47:46
19	911	323.91066053919894	281.68108040897926	21/02/24 15:47:46
19	911	323.6599811676816	281.69912816801155	21/02/24 15:47:46
19	911	323.4469357029931	281.71446645925727	21/02/24 15:47:46
19	911	323.15470555873964	281.73550568236345	21/02/24 15:47:47
19	911	322.93845774338115	281.7510745280935	21/02/24 15:47:47
19	911	322.6839508445491	281.7693978514463	21/02/24 15:47:47
19	911	322.41607022356936	281.7886840211363	21/02/24 15:47:47
19	911	322.172525694106	281.8062181044348	21/02/24 15:47:47
19	911	322.00074388913623	281.8185856024202	21/02/24 15:47:47
19	911	321.78203301255724	281.8343317772026	21/02/24 15:47:47
19	911	321.5545270476959	281.85071115779294	21/02/24 15:47:47
19	911	321.3225176135404	281.86741476740997	21/02/24 15:47:47
19	911	321.0286202093229	281.8885740255469	21/02/24 15:47:47
19	911	320.81382375635246	281.9040383798763	21/02/24 15:47:48
19	911	320.57724724196083	281.9210707982145	21/02/24 15:47:48
19	911	320.3251705602121	281.9392191571414	21/02/24 15:47:48
19	911	320.1045338795337	281.9551039809403	21/02/24 15:47:48
19	911	319.81439346865653	281.97599275287774	21/02/24 15:47:48
19	911	319.53535357767123	281.99608233856014	21/02/24 15:47:48
19	911	319.36494935716854	282.0083506568151	21/02/24 15:47:48
19	911	319.18092097195887	282.0215998521169	21/02/24 15:47:48
19	911	319.00012276012956	282.0346164898275	21/02/24 15:47:48
19	911	318.72052414745446	282.05474630089566	21/02/24 15:47:49
19	911	318.5216402690395	282.0690650232194	21/02/24 15:47:49
19	911	318.2958394617041	282.08532164032925	21/02/24 15:47:49
19	911	318.0831216314312	282.10063634340753	21/02/24 15:47:49
19	911	317.8150809502233	282.11993403669607	21/02/24 15:47:49
19	911	317.63046292211124	282.1332256835684	21/02/24 15:47:49
19	911	317.37797683857883	282.15140351753627	21/02/24 15:47:49
19	911	317.1211529867224	282.16989365082486	21/02/24 15:47:49
19	911	316.9491315287531	282.1822784027214	21/02/24 15:47:49
19	911	316.77938590191474	282.19449930526883	21/02/24 15:47:49
19	911	316.4937352744251	282.2150648335018	21/02/24 15:47:50
19	911	316.2439659167628	282.23304707573203	21/02/24 15:47:50
19	911	316.02831963731967	282.24857261364946	21/02/24 15:47:50
19	911	315.80171505168164	282.2648870990914	21/02/24 15:47:50
19	911	315.5313294185071	282.2843536181105	21/02/24 15:47:50
19	911	315.2393034566397	282.30537814102627	21/02/24 15:47:50
19	911	314.972776667799	282.3245668410439	21/02/24 15:47:50
19	911	314.76607331349936	282.3394485295809	21/02/24 15:47:50
19	911	314.5723560473367	282.3533952796423	21/02/24 15:47:50
19	911	314.3244839853021	282.3712409253345	21/02/24 15:47:50
19	911	314.0797627245904	282.3888597278577	21/02/24 15:47:51
19	911	313.8853992713003	282.4028530004132	21/02/24 15:47:51
19	911	313.65532093541765	282.41941757985757	21/02/24 15:47:51
19	911	313.35967713107516	282.440702570752	21/02/24 15:47:51
19	911	313.1314393390464	282.45713463952444	21/02/24 15:47:51
19	911	312.9743768835887	282.46844241220623	21/02/24 15:47:51
19	911	312.7009566570598	282.4881274079563	21/02/24 15:47:51
19	911	312.42083017246796	282.5082952233688	21/02/24 15:47:51
19	911	312.1328262606493	282.52903017722406	21/02/24 15:47:51
19	911	311.8833292036787	282.54699281505987	21/02/24 15:47:51
19	911	311.6413285722448	282.5644157448181	21/02/24 15:47:52
19	911	311.45370975666776	282.57792343455327	21/02/24 15:47:52
19	911	311.20951088048866	282.5955046277985	21/02/24 15:47:52
19	911	311.0564292188367	282.6065258016791	21/02/24 15:47:52
19	911	310.89567211620675	282.61809957192366	21/02/24 15:47:52
19	911	310.64365184475383	282.63624386956934	21/02/24 15:47:52
19	911	310.34847199865754	282.65749545760906	21/02/24 15:47:52
19	911	310.34847199865754	282.65749545760906	21/02/24 15:47:52
19	911	310.34847199865754	282.65749545760906	21/02/24 15:47:52
19	911	310.1830957396132	282.6694017858196	21/02/24 15:47:53
19	911	309.9469010037347	282.68640671786505	21/02/24 15:47:53
19	911	309.7553250621102	282.70019930243194	21/02/24 15:47:53
19	911	309.5948428590322	282.7117532811762	21/02/24 15:47:53
19	911	309.361334949588	282.7285647741055	21/02/24 15:47:53
19	911	309.13481924718735	282.7448728603641	21/02/24 15:47:53
19	911	308.8586156977744	282.7647582425298	21/02/24 15:47:53
19	911	308.566405359304	282.78579603971093	21/02/24 15:47:53
19	911	308.3521987032851	282.80121793137897	21/02/24 15:47:53
19	911	308.08411787248286	282.8205185152532	21/02/24 15:47:53
19	911	307.8516940416488	282.83725195952053	21/02/24 15:47:54
19	911	307.5807813509271	282.8567564242531	21/02/24 15:47:54
19	911	307.4002188874399	282.86975608917	21/02/24 15:47:54
19	911	307.23015641717086	282.88199980298367	21/02/24 15:47:54
19	911	306.99113341006176	282.89920835751843	21/02/24 15:47:54
19	911	306.7601412771663	282.91583872613484	21/02/24 15:47:54
19	911	306.5744754238859	282.9292058115885	21/02/24 15:47:54
19	911	306.35501053505607	282.94500627177666	21/02/24 15:47:54
19	911	306.15026366501394	282.9597471024672	21/02/24 15:47:54
19	911	305.9395107177255	282.9749203430294	21/02/24 15:47:54
19	929	305.79420095420636	283.06621443129234	21/02/24 15:47:55
19	929	305.84197383441506	283.22589958276063	21/02/24 15:47:55
19	929	305.913126946968	283.4637352649684	21/02/24 15:47:55
19	929	305.9684182416983	283.6485513936028	21/02/24 15:47:55
19	929	306.0117590028813	283.7934217883545	21/02/24 15:47:55
19	929	306.08694605089795	284.0447412628879	21/02/24 15:47:55
19	929	306.1570188391534	284.2789658639063	21/02/24 15:47:55
19	929	306.2023527597814	284.43049857347927	21/02/24 15:47:55
19	929	306.285799523708	284.7094268917837	21/02/24 15:47:55
19	929	306.34860851455215	284.91937159624166	21/02/24 15:47:55
19	929	306.43109220727814	285.19508076238515	21/02/24 15:47:56
19	929	306.4840053702557	285.37194777161363	21/02/24 15:47:56
19	929	306.5603478737117	285.6271294599393	21/02/24 15:47:56
19	929	306.6058278485424	285.7791503688293	21/02/24 15:47:56
19	929	306.6669839680339	285.98357020203906	21/02/24 15:47:56
19	929	306.7527131226232	286.27012761653964	21/02/24 15:47:56
19	929	306.80836197623324	286.4561389179085	21/02/24 15:47:56
19	929	306.8653190272514	286.6465229868466	21/02/24 15:47:56
19	929	306.9186564521365	286.82480812968276	21/02/24 15:47:56
19	929	306.9702604030412	286.99729897973384	21/02/24 15:47:56
19	929	307.0297042532584	287.1959953987967	21/02/24 15:47:57
19	929	307.0775804623646	287.3560259364042	21/02/24 15:47:57
19	929	307.1206698317568	287.5000560314709	21/02/24 15:47:57
19	929	307.17924947580025	287.6958637636229	21/02/24 15:47:57
19	929	307.2640864224152	287.97943889267395	21/02/24 15:47:57
19	929	307.3250511404162	288.1832189491764	21/02/24 15:47:57
19	929	307.40479539652114	288.44977130187567	21/02/24 15:47:57
19	929	307.4801778300269	288.7017438699903	21/02/24 15:47:57
19	929	307.5413777200665	288.9063100101964	21/02/24 15:47:57
19	929	307.6043834083894	289.11691219367924	21/02/24 15:47:58
19	929	307.67555440426247	289.3548076524937	21/02/24 15:47:58
19	929	307.74817509340363	289.5975488415237	21/02/24 15:47:58
19	929	307.81212855888623	289.81131905545885	21/02/24 15:47:58
19	929	307.85644819681204	289.95946143381843	21/02/24 15:47:58
19	929	307.8723163105636	289.90300525579624	21/02/24 15:47:58
19	929	308.0019737150047	289.99331625380853	21/02/24 15:47:58
19	929	307.781188806139	290.14619655566815	21/02/24 15:47:58
19	929	307.79329955044614	290.1480298753416	21/02/24 15:47:58
19	929	307.7077995611044	290.1749620073849	21/02/24 15:47:58
19	929	307.7575341755966	290.10336376834994	21/02/24 15:47:59
19	929	307.7390227284988	290.10562626189244	21/02/24 15:47:59
19	929	307.8780029151766	289.97174045498355	21/02/24 15:47:59
19	929	307.9781411486353	290.1302595535141	21/02/24 15:47:59
19	929	307.9563550201354	290.1845753088904	21/02/24 15:47:59
19	929	307.76733461445326	290.04565255087164	21/02/24 15:47:59
19	929	307.66511313958233	289.99984446550576	21/02/24 15:47:59
19	929	307.58171953928996	289.96570692514956	21/02/24 15:47:59
19	929	307.56536685652503	289.9541903817009	21/02/24 15:47:59
19	929	307.67924746158144	289.90949966644735	21/02/24 15:47:59
19	929	307.5948230253825	289.93002601301106	21/02/24 15:48:00
