floorId	partitionId	location_x	location_y	timeStamp
1	50	323.4319627583379	288.33118358547455	20/04/28 05:09:41
1	50	323.54244524394414	288.44421434386857	20/04/28 05:09:41
1	50	323.4708470117254	288.4815675789995	20/04/28 05:09:41
1	50	323.5047151794782	288.4797561779338	20/04/28 05:09:41
1	50	323.26515091471015	288.4144401289678	20/04/28 05:09:41
1	50	323.34977886146277	288.5507016910092	20/04/28 05:09:42
1	50	323.33161789540316	288.645403856081	20/04/28 05:09:42
1	50	323.3141837352146	288.6813034268879	20/04/28 05:09:42
1	50	323.3267523888209	288.7259806646603	20/04/28 05:09:42
1	50	323.38121844218836	288.55232021379874	20/04/28 05:09:42
1	50	323.38121844218836	288.55232021379874	20/04/28 05:09:42
1	50	323.4404465306327	288.6600882609893	20/04/28 05:09:42
1	50	323.5753106120907	288.77705184350157	20/04/28 05:09:42
1	50	323.59368801926604	288.6789733122503	20/04/28 05:09:42
1	50	323.47831211269204	288.58293895959235	20/04/28 05:09:42
1	50	323.491261147289	288.3850635078715	20/04/28 05:09:43
1	50	323.4792366104194	288.346883739295	20/04/28 05:09:43
1	50	323.5784816814226	288.3460834943019	20/04/28 05:09:43
1	50	323.5327792181364	288.11202079906474	20/04/28 05:09:43
1	50	323.4820132472244	288.1860669309572	20/04/28 05:09:43
1	50	323.4970569088259	288.10309520578596	20/04/28 05:09:43
1	50	323.46441488709445	288.0238130112683	20/04/28 05:09:43
1	50	323.48317706616723	288.07235921444726	20/04/28 05:09:43
1	50	323.62331733228626	288.2605504773132	20/04/28 05:09:43
1	50	323.6242971138346	288.26205423979354	20/04/28 05:09:43
1	50	323.7113217611936	288.20541943746923	20/04/28 05:09:44
1	50	323.8691372101732	287.98257237534585	20/04/28 05:09:44
1	50	323.6908861466901	287.8922576083789	20/04/28 05:09:44
1	50	323.8343668125279	288.0168164893957	20/04/28 05:09:44
1	50	324.02087757574446	288.14208875558126	20/04/28 05:09:44
1	50	324.13019305108475	288.24184279196214	20/04/28 05:09:44
1	50	324.20157864818094	288.1129612729927	20/04/28 05:09:44
1	50	324.3918896475987	288.1045291038673	20/04/28 05:09:44
1	50	324.24123908957927	288.1290027777228	20/04/28 05:09:44
1	50	324.37432030966335	287.90005566404386	20/04/28 05:09:45
1	50	324.30515388986413	287.95071875516317	20/04/28 05:09:45
1	50	324.3010942797561	287.99345066605525	20/04/28 05:09:45
1	50	324.31058913426506	288.0498755852335	20/04/28 05:09:45
1	50	324.32753636684197	288.0503940788976	20/04/28 05:09:45
1	50	324.3677460509334	287.87472591203317	20/04/28 05:09:45
1	50	324.39256470334465	287.9447907590719	20/04/28 05:09:45
1	50	324.4138035149832	288.1368985931219	20/04/28 05:09:45
1	50	324.62644205093994	288.0361102143287	20/04/28 05:09:45
1	50	324.62644205093994	288.0361102143287	20/04/28 05:09:45
1	50	324.42230931857245	288.1095589139532	20/04/28 05:09:46
1	50	324.42230931857245	288.1095589139532	20/04/28 05:09:46
1	50	324.7084530599658	288.2290230990405	20/04/28 05:09:46
1	50	324.7084530599658	288.2290230990405	20/04/28 05:09:46
1	50	324.78428851656724	288.13256124715116	20/04/28 05:09:46
1	50	324.80336374415805	288.3930176329086	20/04/28 05:09:46
1	50	324.9074822017637	288.4420091296572	20/04/28 05:09:46
1	50	324.7343899146471	288.25867336001664	20/04/28 05:09:46
1	50	324.7600176003002	288.27201659466175	20/04/28 05:09:46
1	50	324.80629603088215	288.2684606942078	20/04/28 05:09:47
1	50	324.73320084467406	288.256663070796	20/04/28 05:09:47
1	50	324.9671902222778	288.14396885320605	20/04/28 05:09:47
1	50	324.9164307397626	288.04700900930703	20/04/28 05:09:47
1	50	324.9000339950783	287.90842679733646	20/04/28 05:09:47
1	50	324.67125381108133	287.9782289919299	20/04/28 05:09:47
1	50	324.674046770997	287.9727760945946	20/04/28 05:09:47
1	50	324.71182892305484	287.97835820781387	20/04/28 05:09:47
1	50	324.64399100626144	287.9779564375345	20/04/28 05:09:47
1	50	324.46741302333396	288.13159078853636	20/04/28 05:09:47
1	50	324.2355523865159	288.14977790614586	20/04/28 05:09:48
1	50	324.19700403505533	287.9840294700716	20/04/28 05:09:48
1	50	324.22585966861755	288.02900140967375	20/04/28 05:09:48
1	50	324.0107741767695	287.9516867947448	20/04/28 05:09:48
1	50	323.9944247683661	288.0832147678604	20/04/28 05:09:48
1	50	323.98792552940046	288.0881577115302	20/04/28 05:09:48
1	50	323.9463880460989	288.069651533449	20/04/28 05:09:48
1	50	323.9003913164501	287.91520527124294	20/04/28 05:09:48
1	50	323.9029994542089	287.9467224448454	20/04/28 05:09:48
1	50	323.9029994542089	287.9467224448454	20/04/28 05:09:48
1	50	323.9029994542089	287.9467224448454	20/04/28 05:09:49
1	50	323.9575409953659	287.8934035273081	20/04/28 05:09:49
1	50	324.19050552213673	287.8645418551825	20/04/28 05:09:49
1	50	324.0048459965836	287.98161602398756	20/04/28 05:09:49
1	50	324.23187135033265	288.1775881642021	20/04/28 05:09:49
1	50	324.0980450552703	287.9715784591818	20/04/28 05:09:49
1	50	324.09308392256406	287.97292585678326	20/04/28 05:09:49
1	50	324.08647963367775	287.9808607887987	20/04/28 05:09:49
1	50	324.0866118998293	287.9818167817729	20/04/28 05:09:49
1	50	323.9511170353675	287.96972212509183	20/04/28 05:09:50
1	50	323.8901190659158	288.02375006821103	20/04/28 05:09:50
1	50	323.8254212451899	287.91971082062844	20/04/28 05:09:50
1	50	323.7517570243882	288.0385880363284	20/04/28 05:09:50
1	50	323.81938778786343	288.0665629700211	20/04/28 05:09:50
1	50	323.8804032040043	288.09677493165026	20/04/28 05:09:50
1	50	323.8143627963422	288.0016091955857	20/04/28 05:09:50
1	50	323.81642864284754	287.88476070920905	20/04/28 05:09:50
1	50	323.87137841878206	288.09161260300743	20/04/28 05:09:50
1	50	323.6777556115503	288.22391478076565	20/04/28 05:09:50
1	50	323.6777556115503	288.22391478076565	20/04/28 05:09:51
1	50	323.80721257443975	288.1242237740838	20/04/28 05:09:51
1	50	323.8393492032271	287.99779865193636	20/04/28 05:09:51
1	50	323.91467690828983	288.1157996176239	20/04/28 05:09:51
1	50	323.9062710793812	288.09807534504426	20/04/28 05:09:51
1	50	323.9582983832829	288.08424063462655	20/04/28 05:09:51
1	50	323.9308249134819	288.0954740910373	20/04/28 05:09:51
1	50	323.9308249134819	288.0954740910373	20/04/28 05:09:51
1	50	324.1043929682579	288.10508274812327	20/04/28 05:09:51
1	50	324.0518997812137	288.1296686041041	20/04/28 05:09:52
1	50	323.89449663490234	288.37398748138463	20/04/28 05:09:52
1	50	323.8542631935289	288.37823114055885	20/04/28 05:09:52
1	50	323.94031961690075	288.3882643421861	20/04/28 05:09:52
1	50	324.0087856006776	288.4229088990826	20/04/28 05:09:52
1	50	323.8327332768827	288.27069266821076	20/04/28 05:09:52
1	50	323.8330435253667	288.2643510087826	20/04/28 05:09:52
1	50	323.7418671505398	288.4083577759879	20/04/28 05:09:52
1	50	323.77585116335126	288.4446086469011	20/04/28 05:09:52
1	50	323.7874903251586	288.6794215096045	20/04/28 05:09:52
1	50	323.7166028126107	288.9651711381331	20/04/28 05:09:53
1	50	323.8775500164598	289.12891190441985	20/04/28 05:09:53
1	50	323.6743180189206	289.2866229556642	20/04/28 05:09:53
1	50	323.5543834703068	289.2609343290727	20/04/28 05:09:53
1	50	323.58454442897136	289.44487563876135	20/04/28 05:09:53
1	50	323.5123201438843	289.7075552578872	20/04/28 05:09:53
1	50	323.6962620613488	289.6151274536205	20/04/28 05:09:53
1	50	323.843430212801	289.6740638160267	20/04/28 05:09:53
1	50	323.8454870335939	289.6760210019346	20/04/28 05:09:53
1	50	323.9052634557957	289.6020715423256	20/04/28 05:09:53
1	50	323.64661574711675	289.63600655508736	20/04/28 05:09:54
1	50	323.9126714053279	289.5180079985427	20/04/28 05:09:54
1	50	323.97270885006003	289.5508287634536	20/04/28 05:09:54
1	50	323.80481351518847	289.5675402057447	20/04/28 05:09:54
1	50	323.8015740353581	289.5161842855369	20/04/28 05:09:54
1	50	323.92452775924534	289.4935507619099	20/04/28 05:09:54
1	50	324.02087911564024	289.47388524561563	20/04/28 05:09:54
1	50	324.0507526641279	289.4947777355368	20/04/28 05:09:54
1	50	324.0507526641279	289.4947777355368	20/04/28 05:09:54
1	50	324.0507526641279	289.4947777355368	20/04/28 05:09:55
1	50	324.0084594258275	289.2756954427678	20/04/28 05:09:55
1	50	323.87084308308863	289.4808208183271	20/04/28 05:09:55
1	50	323.7688642117359	289.60748393890344	20/04/28 05:09:55
1	50	323.75712757120994	289.3214066815745	20/04/28 05:09:55
1	50	323.7573364313278	289.32140412933984	20/04/28 05:09:55
1	50	323.7527941916851	289.31326091959295	20/04/28 05:09:55
1	50	323.62493552683947	289.55137811249085	20/04/28 05:09:55
1	50	323.72636775606634	289.3629434178447	20/04/28 05:09:55
1	50	323.59664108549345	289.33635789446004	20/04/28 05:09:55
1	50	323.35058514092765	289.1930784156245	20/04/28 05:09:56
1	50	323.344371612679	289.1954962033484	20/04/28 05:09:56
1	50	323.2476269337874	289.1351172304445	20/04/28 05:09:56
1	50	323.2305489723627	289.07776212978854	20/04/28 05:09:56
1	50	323.1273616988397	289.15922856255173	20/04/28 05:09:56
1	50	323.0417086479048	289.1835214576429	20/04/28 05:09:56
1	50	323.03127846862793	289.1625008562059	20/04/28 05:09:56
1	50	322.94139949321743	289.2734791812336	20/04/28 05:09:56
1	50	322.91796984702137	289.24304733390323	20/04/28 05:09:56
1	50	322.92381194750647	289.0811130785383	20/04/28 05:09:57
1	50	322.788531921157	288.92282407638965	20/04/28 05:09:57
1	50	322.8988294346438	288.9959796148463	20/04/28 05:09:57
1	50	323.1783762760187	288.9629742412883	20/04/28 05:09:57
1	50	323.2247315775621	288.72249406282054	20/04/28 05:09:57
1	50	323.29648036751075	288.8911578859677	20/04/28 05:09:57
1	50	323.30158521971674	288.92215728926664	20/04/28 05:09:57
1	50	323.32918626680515	288.99515656228544	20/04/28 05:09:57
1	50	323.34504342354785	288.9635107269839	20/04/28 05:09:57
1	50	323.34504342354785	288.9635107269839	20/04/28 05:09:57
1	50	323.4529962137756	288.90783309668575	20/04/28 05:09:58
1	50	323.50838794056625	288.878787718907	20/04/28 05:09:58
1	50	323.5613453561016	289.0154662731597	20/04/28 05:09:58
1	50	323.5734268457338	289.0095030982001	20/04/28 05:09:58
1	50	323.45234258835137	288.92804862197437	20/04/28 05:09:58
1	50	323.413338691387	288.9745141381751	20/04/28 05:09:58
1	50	323.285522224657	288.947391226867	20/04/28 05:09:58
1	50	323.2469003182455	288.8944975351146	20/04/28 05:09:58
1	50	323.3389137092604	288.9924347289554	20/04/28 05:09:58
1	50	323.1804173760288	289.2153353975091	20/04/28 05:09:58
1	50	322.9804228803975	289.4341312532595	20/04/28 05:09:59
1	50	322.9598088383346	289.4355623448755	20/04/28 05:09:59
1	50	322.9077990546504	289.4045348029081	20/04/28 05:09:59
1	50	322.9556854790457	289.35362822605964	20/04/28 05:09:59
1	50	322.9624390043737	289.35008436098894	20/04/28 05:09:59
1	50	322.8253802316433	289.584230232575	20/04/28 05:09:59
1	50	322.89645484603903	289.55198609952504	20/04/28 05:09:59
1	50	322.77868204860613	289.3344067071676	20/04/28 05:09:59
1	50	322.8019235775502	289.1558218354989	20/04/28 05:09:59
1	50	322.8635587615005	289.22500456492605	20/04/28 05:10:00
1	50	322.86501936987577	289.22256028428075	20/04/28 05:10:00
1	50	322.81223338247094	289.2445466126185	20/04/28 05:10:00
1	50	322.9026559479282	289.23303061154644	20/04/28 05:10:00
1	50	322.8938336908627	289.2420628047485	20/04/28 05:10:00
1	50	322.97241830416556	289.084736011619	20/04/28 05:10:00
1	50	322.82491408066636	288.8320618678288	20/04/28 05:10:00
1	50	323.07422945949725	288.7734377646026	20/04/28 05:10:00
1	50	322.9506034182723	288.8775781114618	20/04/28 05:10:00
1	50	323.0148988025315	289.1539031030923	20/04/28 05:10:00
1	50	323.0061369682465	289.2691408531833	20/04/28 05:10:01
1	50	323.11602691010944	289.30636799126165	20/04/28 05:10:01
1	50	323.2264401700277	289.5352650861079	20/04/28 05:10:01
1	50	323.2445094155622	289.5237956453761	20/04/28 05:10:01
1	50	323.41119267806596	289.49395954586436	20/04/28 05:10:01
1	50	323.4140180947956	289.4573023364025	20/04/28 05:10:01
1	50	323.3585473698107	289.4302936587626	20/04/28 05:10:01
1	50	323.39717534618325	289.417328836788	20/04/28 05:10:01
1	50	323.4780200717499	289.1836693973355	20/04/28 05:10:01
1	50	323.49973515672934	289.28496780487495	20/04/28 05:10:02
1	50	323.36829326806236	289.0775764961818	20/04/28 05:10:02
1	50	323.4200848226554	289.0552213046268	20/04/28 05:10:02
1	50	323.3219238312502	289.12689780453053	20/04/28 05:10:02
1	50	323.4276292769782	289.0178876670348	20/04/28 05:10:02
1	50	323.57055538652924	288.7870575646306	20/04/28 05:10:02
1	50	323.5687788287543	288.69474418698144	20/04/28 05:10:02
1	50	323.6735652400244	288.5607314313627	20/04/28 05:10:02
1	50	323.7231738712524	288.6436279605036	20/04/28 05:10:02
1	50	323.71144650327705	288.58207402476665	20/04/28 05:10:02
1	50	323.773432272156	288.3668051102306	20/04/28 05:10:03
1	50	324.06218746859196	288.4159177475571	20/04/28 05:10:03
1	50	324.06218746859196	288.4159177475571	20/04/28 05:10:03
1	50	323.9426884616427	288.35990029127345	20/04/28 05:10:03
1	50	323.8334104736454	288.39395501657293	20/04/28 05:10:03
1	50	323.7852716145227	288.44988322065336	20/04/28 05:10:03
1	50	323.79250020270206	288.4404758615693	20/04/28 05:10:03
1	50	323.9079941983866	288.29168095748645	20/04/28 05:10:03
1	50	323.79357177176416	288.0637326271332	20/04/28 05:10:03
1	50	324.0038739194816	287.88499658138466	20/04/28 05:10:03
1	50	324.0038739194816	287.88499658138466	20/04/28 05:10:04
1	50	324.0020420008329	287.9029842359001	20/04/28 05:10:04
1	50	324.07064824296293	287.90126057504233	20/04/28 05:10:04
1	50	324.29772009239764	287.9711402571076	20/04/28 05:10:04
1	50	324.2499469336048	287.9845664962943	20/04/28 05:10:04
1	50	324.2499469336048	287.9845664962943	20/04/28 05:10:04
1	50	324.4105461160877	288.05795685175485	20/04/28 05:10:04
1	50	324.29223197171024	287.96960023509035	20/04/28 05:10:04
1	50	324.13701517073366	288.0156918273569	20/04/28 05:10:04
1	50	324.02151531679857	287.8898732172091	20/04/28 05:10:05
1	50	323.89161553377164	288.1489137747809	20/04/28 05:10:05
1	50	323.8926270254914	288.1519090772936	20/04/28 05:10:05
1	50	323.85530591379677	288.081522775188	20/04/28 05:10:05
1	50	323.82627812133353	288.186304904808	20/04/28 05:10:05
1	50	323.7196905262292	288.1804950791751	20/04/28 05:10:05
1	50	323.6737282178943	288.1010257652018	20/04/28 05:10:05
1	50	323.5977299212433	287.92115141262303	20/04/28 05:10:05
1	50	323.587414096475	288.00551638810884	20/04/28 05:10:05
1	50	323.55099873650965	288.0818381066524	20/04/28 05:10:05
1	50	323.301339558411	288.0203931582846	20/04/28 05:10:06
1	50	323.29091934228654	288.16632807175563	20/04/28 05:10:06
1	50	323.2550384650803	288.1085266169943	20/04/28 05:10:06
1	50	323.1648358174533	288.0186492407866	20/04/28 05:10:06
1	50	323.17001366503007	287.85674257832477	20/04/28 05:10:06
1	50	323.0858919274943	287.96150960033026	20/04/28 05:10:06
1	50	323.09701255180966	287.9219079868864	20/04/28 05:10:06
1	50	323.0091406733028	287.9097929498816	20/04/28 05:10:06
1	50	322.99375891613363	287.9607181458696	20/04/28 05:10:06
1	50	323.168236651737	287.88390702418616	20/04/28 05:10:07
1	50	323.1469458038366	288.0829352233369	20/04/28 05:10:07
1	50	323.3917482462258	288.17012397041583	20/04/28 05:10:07
1	50	323.3567812423578	288.34895703358643	20/04/28 05:10:07
1	50	323.36121715277875	288.60266015285083	20/04/28 05:10:07
1	50	323.18000036929146	288.5324661315495	20/04/28 05:10:07
1	50	323.3261600299826	288.6442698592085	20/04/28 05:10:07
1	50	323.2447173722102	288.5337798812401	20/04/28 05:10:07
1	50	323.371924966301	288.6161960361494	20/04/28 05:10:07
1	50	323.08153706490117	288.6516192638239	20/04/28 05:10:07
1	50	323.11678941111444	288.7955094963259	20/04/28 05:10:08
1	50	323.1128812179634	288.7922197494488	20/04/28 05:10:08
1	50	322.971435741635	288.85609876773907	20/04/28 05:10:08
1	50	322.96886010858094	288.96002957051155	20/04/28 05:10:08
1	50	322.9122646026049	288.9356769208477	20/04/28 05:10:08
1	50	322.9031928981579	289.1542063599679	20/04/28 05:10:08
1	50	322.79490208646814	289.17862726298597	20/04/28 05:10:08
1	50	322.97131317989874	288.9739665605476	20/04/28 05:10:08
1	50	322.96894149469256	289.0468955572781	20/04/28 05:10:08
1	50	323.0718172495486	288.9670427020009	20/04/28 05:10:09
1	50	322.93261161315036	289.0346020121109	20/04/28 05:10:09
1	50	322.9350782866064	288.8991841612983	20/04/28 05:10:09
1	50	322.9749392513411	288.8922127296638	20/04/28 05:10:09
1	50	322.9275288148847	288.6462163488295	20/04/28 05:10:09
1	50	322.957937099417	288.9167283341625	20/04/28 05:10:09
1	50	323.0117350969711	288.91535760289554	20/04/28 05:10:09
1	50	322.72796501138794	288.97067671482324	20/04/28 05:10:09
1	50	322.7314198186737	288.9600055689079	20/04/28 05:10:09
1	50	322.72529768161274	288.7380268501881	20/04/28 05:10:09
1	50	322.72362773912454	288.72904460117746	20/04/28 05:10:10
1	50	322.5712923616392	288.7293042744672	20/04/28 05:10:10
1	50	322.5757062472723	288.9121279395156	20/04/28 05:10:10
1	50	322.5540853922689	289.13370678972484	20/04/28 05:10:10
1	50	322.51101621751815	289.1217925401038	20/04/28 05:10:10
1	50	322.72407559752645	289.25577170337505	20/04/28 05:10:10
1	50	322.70694489526807	289.1678407067207	20/04/28 05:10:10
1	50	322.5843170299204	289.18389589761154	20/04/28 05:10:10
1	50	322.68743895276333	289.3456321699618	20/04/28 05:10:10
1	50	322.69207159824833	289.3947483426249	20/04/28 05:10:10
1	50	322.8163477914598	289.2683302031242	20/04/28 05:10:11
1	50	322.6989330906137	289.3178141768532	20/04/28 05:10:11
1	50	322.69976601087154	289.24897722055147	20/04/28 05:10:11
1	50	322.7003656917759	289.24264721433036	20/04/28 05:10:11
1	50	322.6757099741949	289.44824187433727	20/04/28 05:10:11
1	50	322.87400506637897	289.4717804808386	20/04/28 05:10:11
1	50	322.9953722914987	289.42080125250385	20/04/28 05:10:11
1	50	323.1500550263239	289.17924118366045	20/04/28 05:10:11
1	50	323.3962354926809	289.10871597671013	20/04/28 05:10:11
1	50	323.49453034050146	289.22179388768353	20/04/28 05:10:12
1	50	323.75572183925755	289.2535091705861	20/04/28 05:10:12
1	50	323.758339978134	289.25097580850746	20/04/28 05:10:12
1	50	323.8863789206867	289.25079666679403	20/04/28 05:10:12
1	50	323.81943751078575	289.18445803846913	20/04/28 05:10:12
1	50	323.80218474323084	289.1919686184662	20/04/28 05:10:12
1	50	323.84360113379444	289.20820221439465	20/04/28 05:10:12
1	50	323.85001676000604	289.19304950705737	20/04/28 05:10:12
1	50	323.9033402313644	289.4871543771072	20/04/28 05:10:12
1	50	324.17589779413976	289.5337375359936	20/04/28 05:10:12
1	50	324.2954492501785	289.54350769346075	20/04/28 05:10:13
1	50	324.3649979803146	289.6171010579466	20/04/28 05:10:13
1	50	324.32576591450567	289.5395208987372	20/04/28 05:10:13
1	50	324.3317950148555	289.537046096117	20/04/28 05:10:13
1	50	324.3040038069051	289.2706470057616	20/04/28 05:10:13
1	50	324.26656396171427	289.1371470774715	20/04/28 05:10:13
1	50	324.2688450962961	289.13573199464145	20/04/28 05:10:13
1	50	324.3799017438848	289.1894379921141	20/04/28 05:10:13
1	50	324.4681162951904	288.9343917147993	20/04/28 05:10:13
1	50	324.3422909986193	288.94415192197596	20/04/28 05:10:14
1	50	324.3828853211961	288.83622990590186	20/04/28 05:10:14
1	50	324.31907887696417	288.8899551920812	20/04/28 05:10:14
1	50	324.3473069119095	288.74141496611816	20/04/28 05:10:14
1	50	324.4421045416063	288.58544719161506	20/04/28 05:10:14
1	50	324.4417606344032	288.52554790308596	20/04/28 05:10:14
1	50	324.6341798672825	288.4838513277183	20/04/28 05:10:14
1	50	324.5372962848053	288.6076150867583	20/04/28 05:10:14
1	50	324.3498429610878	288.8221511664616	20/04/28 05:10:14
1	50	324.3173803840275	288.848300752634	20/04/28 05:10:14
1	50	324.26302421701564	288.93635866298877	20/04/28 05:10:15
1	50	324.3034972173673	288.9108739579728	20/04/28 05:10:15
1	50	324.3423537403847	288.8759317962911	20/04/28 05:10:15
1	50	324.25656234228654	288.87504076693233	20/04/28 05:10:15
1	50	324.26439052744763	288.88944436148006	20/04/28 05:10:15
1	50	324.4890541185808	288.7410550003599	20/04/28 05:10:15
1	50	324.34541532741173	288.7036586885945	20/04/28 05:10:15
1	50	324.34884165196183	288.7114092603292	20/04/28 05:10:15
1	50	324.2726812918661	288.4299288704345	20/04/28 05:10:15
1	50	324.12177074110684	288.5795111711774	20/04/28 05:10:16
1	50	323.97931430853146	288.6081957864176	20/04/28 05:10:16
1	50	323.87213594778166	288.5016730683896	20/04/28 05:10:16
1	50	323.9481552869484	288.58753330376214	20/04/28 05:10:16
1	50	324.02509334452975	288.78821645848654	20/04/28 05:10:16
1	50	323.79538157066236	288.7587539299791	20/04/28 05:10:16
1	50	323.6894839264783	288.87151337997557	20/04/28 05:10:16
1	50	323.6022464402909	288.893663408119	20/04/28 05:10:16
1	50	323.50559845666606	288.75493696746395	20/04/28 05:10:16
1	50	323.4659350588842	288.8385112801128	20/04/28 05:10:16
1	50	323.350316893377	288.65310640024916	20/04/28 05:10:17
1	50	323.3384353957369	288.61288781685914	20/04/28 05:10:17
1	50	323.37001104646043	288.5066633153289	20/04/28 05:10:17
1	50	323.2860362163651	288.66700303589454	20/04/28 05:10:17
1	50	323.08851200810886	288.6151832481023	20/04/28 05:10:17
1	50	322.8797282227266	288.515447691573	20/04/28 05:10:17
1	50	322.91236100477295	288.40830330571754	20/04/28 05:10:17
1	50	322.9853953971802	288.4179240188094	20/04/28 05:10:17
1	50	323.06986331056595	288.16569425010647	20/04/28 05:10:17
1	50	323.1636343969505	288.1464221583341	20/04/28 05:10:18
1	50	323.0880833940442	288.26016116066666	20/04/28 05:10:18
1	50	322.91311880592394	288.366963372865	20/04/28 05:10:18
1	50	322.7461269015858	288.48103351015504	20/04/28 05:10:18
1	50	322.74921064639483	288.40899499706205	20/04/28 05:10:18
1	50	322.84218300424146	288.47898308429274	20/04/28 05:10:18
1	50	323.0384308016452	288.2716139004587	20/04/28 05:10:18
1	50	323.03452629888557	288.47840314245093	20/04/28 05:10:18
1	50	323.1196461555469	288.3509861917452	20/04/28 05:10:18
1	50	323.2135050858936	288.6351579946486	20/04/28 05:10:18
1	50	323.0944769039597	288.8191655192406	20/04/28 05:10:19
1	50	323.0945298075601	288.81963630498194	20/04/28 05:10:19
1	50	323.0413414410841	288.8995706871573	20/04/28 05:10:19
1	50	322.7846364127906	288.7969375781093	20/04/28 05:10:19
1	50	322.76476876691277	288.7826953469785	20/04/28 05:10:19
1	50	322.730499161595	288.77718065897636	20/04/28 05:10:19
1	50	322.7345527489653	288.7744623029686	20/04/28 05:10:19
1	50	322.94626051519083	288.9555319065012	20/04/28 05:10:19
1	50	323.0570657785016	289.0106271105227	20/04/28 05:10:19
1	50	323.33254176587377	289.0490582001509	20/04/28 05:10:19
1	50	323.4759020697529	288.8343848745901	20/04/28 05:10:20
1	50	323.48688139052206	288.8333282580795	20/04/28 05:10:20
1	50	323.57334601226836	288.6193625280981	20/04/28 05:10:20
1	50	323.7320641584973	288.65760953090467	20/04/28 05:10:20
1	50	323.77553178378645	288.7314754901511	20/04/28 05:10:20
1	50	323.52496871276713	288.62529319953234	20/04/28 05:10:20
1	50	323.3674847153076	288.8002706993711	20/04/28 05:10:20
1	50	323.1193297937005	288.77131748984885	20/04/28 05:10:20
1	50	323.1006713572287	288.77291893080417	20/04/28 05:10:20
1	50	322.96623422069854	288.9514468255204	20/04/28 05:10:21
1	50	322.91712775713376	288.7958782612086	20/04/28 05:10:21
1	50	322.9626593788714	288.702007854047	20/04/28 05:10:21
1	50	322.7801581438446	288.62040287403715	20/04/28 05:10:21
1	50	322.79167707253146	288.5600253641779	20/04/28 05:10:21
1	50	322.98732898397964	288.76696105295554	20/04/28 05:10:21
1	50	323.05624862988384	288.7420296687813	20/04/28 05:10:21
1	50	322.8277501807081	288.7695132733415	20/04/28 05:10:21
1	50	322.8194181965745	288.6106824651976	20/04/28 05:10:21
1	50	322.75859710971537	288.54524862525375	20/04/28 05:10:21
1	50	322.5803634782656	288.4633360939771	20/04/28 05:10:22
1	50	322.6119428895347	288.5855513818839	20/04/28 05:10:22
1	50	322.62693529435325	288.5680155802412	20/04/28 05:10:22
1	50	322.517869673199	288.5852010091137	20/04/28 05:10:22
1	50	322.46161594134884	288.7836451710065	20/04/28 05:10:22
1	50	322.46117735128166	288.7324430746484	20/04/28 05:10:22
1	50	322.59817340162823	288.7357504290043	20/04/28 05:10:22
1	50	322.57417819771496	288.5741708332268	20/04/28 05:10:22
1	50	322.5935869783985	288.57463030980495	20/04/28 05:10:22
1	50	322.4970082564522	288.68060498542724	20/04/28 05:10:23
1	50	322.5488798443964	288.87615461146027	20/04/28 05:10:23
1	50	322.5955386524133	288.6911908109635	20/04/28 05:10:23
1	50	322.8206180749856	288.51250263449924	20/04/28 05:10:23
1	50	323.00758700810076	288.63472757791163	20/04/28 05:10:23
1	50	322.81372885416874	288.45538852399045	20/04/28 05:10:23
1	50	322.8734773188173	288.4834180552083	20/04/28 05:10:23
1	50	322.8406022087291	288.5154329657298	20/04/28 05:10:23
1	50	322.59474520504716	288.6539834486394	20/04/28 05:10:23
1	50	322.4873185279124	288.7623046496222	20/04/28 05:10:23
1	50	322.494899241439	288.79257757196956	20/04/28 05:10:24
1	50	322.5641324855035	289.0121620007949	20/04/28 05:10:24
1	50	322.50294107303677	288.9965530922658	20/04/28 05:10:24
1	50	322.67015254483573	289.12335837236714	20/04/28 05:10:24
1	50	322.5773745157197	289.09296778595416	20/04/28 05:10:24
1	50	322.6859293524017	288.8212735604249	20/04/28 05:10:24
1	50	322.5090805021831	288.67603354557326	20/04/28 05:10:24
1	50	322.5146921092294	288.6835889749966	20/04/28 05:10:24
1	50	322.5060862088427	288.7302893015427	20/04/28 05:10:24
1	50	322.5060862088427	288.7302893015427	20/04/28 05:10:25
1	50	322.5060862088427	288.7302893015427	20/04/28 05:10:25
1	50	322.5060862088427	288.7302893015427	20/04/28 05:10:25
1	50	322.5060862088427	288.7302893015427	20/04/28 05:10:25
1	50	322.504851152498	288.73465864828853	20/04/28 05:10:25
1	50	322.55753236253526	288.8713154547207	20/04/28 05:10:25
1	50	322.5706826925606	288.88627510359987	20/04/28 05:10:25
1	50	322.643158557076	288.90878631891644	20/04/28 05:10:25
1	50	322.67741323109925	288.9211781520407	20/04/28 05:10:25
1	50	322.71438577805236	288.8541112131534	20/04/28 05:10:25
1	50	322.49650480420814	288.9245368701191	20/04/28 05:10:26
1	50	322.48237354634364	289.13702598363807	20/04/28 05:10:26
1	50	322.577283334474	289.37133622390706	20/04/28 05:10:26
1	50	322.8166480842794	289.49050877439504	20/04/28 05:10:26
1	50	322.8241239520992	289.406635016329	20/04/28 05:10:26
1	50	322.564702988102	289.4632360481336	20/04/28 05:10:26
1	50	322.61626440953506	289.5738508975877	20/04/28 05:10:26
1	50	322.5979091137473	289.44153788171377	20/04/28 05:10:26
1	50	322.514992252639	289.54544374245495	20/04/28 05:10:26
1	50	322.5342045862538	289.5569428515927	20/04/28 05:10:26
1	50	322.51164280501195	289.465839438238	20/04/28 05:10:27
1	50	322.5787378892823	289.4195573434754	20/04/28 05:10:27
1	50	322.59267167448485	289.2532205209089	20/04/28 05:10:27
1	50	322.59316652635385	289.2639618397224	20/04/28 05:10:27
1	50	322.74479734931776	289.27891807516653	20/04/28 05:10:27
1	50	322.78743905789645	289.35007412537726	20/04/28 05:10:27
1	50	322.6991532229683	289.0737939328447	20/04/28 05:10:27
1	50	322.7142735268962	288.96264873279887	20/04/28 05:10:27
1	50	322.64826860625936	289.11298720725176	20/04/28 05:10:27
1	50	322.5719555988781	289.01464687039424	20/04/28 05:10:28
1	50	322.5592210116115	289.14574246185106	20/04/28 05:10:28
1	50	322.5026888368843	289.11468214353835	20/04/28 05:10:28
1	50	322.4873579670887	289.1465265924331	20/04/28 05:10:28
1	50	322.4807118808762	289.0452120551668	20/04/28 05:10:28
1	50	322.4677954578458	289.2068130481774	20/04/28 05:10:28
1	50	322.51102166919736	289.3714824213317	20/04/28 05:10:28
1	50	322.51302763724334	289.3929647735562	20/04/28 05:10:28
1	50	322.6159962706051	289.345206576207	20/04/28 05:10:28
1	50	322.8296043893802	289.4715781429533	20/04/28 05:10:28
1	50	322.80708574935255	289.4769743943583	20/04/28 05:10:29
1	50	322.97482795202404	289.423222311419	20/04/28 05:10:29
1	50	322.95480441144747	289.3451622886668	20/04/28 05:10:29
1	50	323.0051713736028	289.2826950244908	20/04/28 05:10:29
1	50	323.0110070206613	289.32100539761484	20/04/28 05:10:29
1	50	322.96524573570645	289.3209010487434	20/04/28 05:10:29
1	50	322.86208408525636	289.4605610831165	20/04/28 05:10:29
1	50	322.85157461415133	289.5149499759682	20/04/28 05:10:29
1	50	323.0609342887348	289.54485658858704	20/04/28 05:10:29
1	50	323.0929252427098	289.56070549408435	20/04/28 05:10:30
1	50	323.15085617022015	289.4802383709311	20/04/28 05:10:30
1	50	323.052514601304	289.4025868098666	20/04/28 05:10:30
1	50	323.16409359568866	289.2899127232095	20/04/28 05:10:30
1	50	323.2064421984053	289.38880270938256	20/04/28 05:10:30
1	50	323.35261380585325	289.5604558879721	20/04/28 05:10:30
1	50	323.3898175791718	289.56999553083637	20/04/28 05:10:30
1	50	323.5987696624242	289.4588878918301	20/04/28 05:10:30
1	50	323.64078130304773	289.55713255835053	20/04/28 05:10:30
1	50	323.6138871837801	289.54733774321267	20/04/28 05:10:30
1	50	323.6427559623317	289.5385621526849	20/04/28 05:10:31
1	50	323.6478119296578	289.53060770190666	20/04/28 05:10:31
1	50	323.72162762300934	289.6746245493473	20/04/28 05:10:31
1	50	323.53569336226207	289.7109091641944	20/04/28 05:10:31
1	50	323.4859481299187	289.96116198679863	20/04/28 05:10:31
1	50	323.48602913245645	289.96111434103597	20/04/28 05:10:31
1	50	323.42548736685535	289.79472717387915	20/04/28 05:10:31
1	50	323.5333891561834	289.5210586353986	20/04/28 05:10:31
1	50	323.74536496278415	289.56586105582716	20/04/28 05:10:31
1	50	323.92769249061655	289.51074543128476	20/04/28 05:10:31
1	50	323.898238302914	289.72978438779364	20/04/28 05:10:32
1	50	323.77789581276437	289.89780055591825	20/04/28 05:10:32
1	50	323.63191916128955	289.95121540526134	20/04/28 05:10:32
1	50	323.6492430578506	289.91991693578007	20/04/28 05:10:32
1	50	323.47092040433813	289.87868624460776	20/04/28 05:10:32
1	50	323.6788464602539	289.9210079932169	20/04/28 05:10:32
1	50	323.69257317966554	289.90870020361257	20/04/28 05:10:32
1	50	323.41584898345155	289.92595853558316	20/04/28 05:10:32
1	50	323.4083722929193	289.91509503775586	20/04/28 05:10:32
1	50	323.2337136798557	289.8380884168741	20/04/28 05:10:33
1	50	323.35857091228155	289.862791394812	20/04/28 05:10:33
1	50	323.4365033855722	289.86804945475257	20/04/28 05:10:33
1	50	323.471521246794	289.76666180261816	20/04/28 05:10:33
1	50	323.49512667615784	289.6936301374753	20/04/28 05:10:33
1	50	323.687174050301	289.7683517843191	20/04/28 05:10:33
1	50	323.5143410490324	289.75210421576287	20/04/28 05:10:33
1	50	323.5031014585685	289.48783185874106	20/04/28 05:10:33
1	50	323.57359028247146	289.34905101730135	20/04/28 05:10:33
1	50	323.6823186683699	289.1279903160913	20/04/28 05:10:33
1	50	323.56288299091517	289.22427000482526	20/04/28 05:10:34
1	50	323.70356550446627	289.1856745490719	20/04/28 05:10:34
1	50	323.6529428466725	289.3364662956862	20/04/28 05:10:34
1	50	323.6851404405274	289.2490068422198	20/04/28 05:10:34
1	50	323.7618533564536	289.19562948793686	20/04/28 05:10:34
1	50	323.8749801158683	289.3660970006254	20/04/28 05:10:34
1	50	323.8743556914417	289.13560988936285	20/04/28 05:10:34
1	50	323.9323572315406	289.0438550310278	20/04/28 05:10:34
1	50	323.6767777927376	289.0432256368396	20/04/28 05:10:34
1	50	323.7932411608695	289.28709041944336	20/04/28 05:10:34
1	50	323.7625418652248	289.12368003834484	20/04/28 05:10:35
1	50	323.8493847831042	289.1938193908887	20/04/28 05:10:35
1	50	324.05179736499076	288.97536151385367	20/04/28 05:10:35
1	50	323.9895958174162	289.03020817778133	20/04/28 05:10:35
1	50	323.88731321394647	289.257440638338	20/04/28 05:10:35
1	50	323.8130553481962	289.48626900259603	20/04/28 05:10:35
1	50	323.77494404919975	289.5486503005022	20/04/28 05:10:35
1	50	323.65380689569594	289.63031858849564	20/04/28 05:10:35
1	50	323.68009240941126	289.8993381621504	20/04/28 05:10:35
1	50	323.44830191236014	289.804371877572	20/04/28 05:10:36
1	50	323.6703863402308	289.89787863123445	20/04/28 05:10:36
1	50	323.6703863402308	289.89787863123445	20/04/28 05:10:36
1	50	323.62241139292576	289.72673537552225	20/04/28 05:10:36
1	50	323.78588037289353	289.48448693334643	20/04/28 05:10:36
1	50	323.9073473145209	289.6925577172515	20/04/28 05:10:36
1	50	323.9073473145209	289.6925577172515	20/04/28 05:10:36
1	50	323.86191001635683	289.6170298896328	20/04/28 05:10:36
1	50	323.8315393134242	289.58997134653777	20/04/28 05:10:36
1	50	323.93482627936595	289.69258602768065	20/04/28 05:10:36
1	50	323.9185311013862	289.6243065294118	20/04/28 05:10:37
1	50	323.6658365542807	289.56473482108754	20/04/28 05:10:37
1	50	323.59317986436616	289.495740725984	20/04/28 05:10:37
1	50	323.60311879161577	289.77107967106355	20/04/28 05:10:37
1	50	323.63165902173137	289.8014663381943	20/04/28 05:10:37
1	50	323.8391627652203	289.74309559560845	20/04/28 05:10:37
1	50	323.6063420014508	289.70423128296704	20/04/28 05:10:37
1	50	323.6063420014508	289.70423128296704	20/04/28 05:10:37
1	50	323.67680625049275	289.68813604695333	20/04/28 05:10:37
1	50	323.5566889550977	289.9013610938477	20/04/28 05:10:37
1	50	323.4345511531	289.7484708809811	20/04/28 05:10:38
1	50	323.4345511531	289.7484708809811	20/04/28 05:10:38
1	50	323.3280028946646	289.9245783187937	20/04/28 05:10:38
1	50	323.300843526311	289.8572000819937	20/04/28 05:10:38
1	50	323.32192133186106	289.89900757486447	20/04/28 05:10:38
1	50	323.4324632258342	289.9422300554913	20/04/28 05:10:38
1	50	323.571876949884	289.6847714701559	20/04/28 05:10:38
1	50	323.57738876369615	289.73494451119825	20/04/28 05:10:38
1	50	323.57738876369615	289.73494451119825	20/04/28 05:10:38
1	50	323.7417410491469	289.8565717662832	20/04/28 05:10:39
1	50	323.7618766135717	289.91460753173743	20/04/28 05:10:39
1	50	323.7618766135717	289.91460753173743	20/04/28 05:10:39
1	50	323.5200406443196	289.90222484020546	20/04/28 05:10:39
1	50	323.5550488148455	289.7270065125846	20/04/28 05:10:39
1	50	323.5550488148455	289.7270065125846	20/04/28 05:10:39
