129.082697131361/35.23540386862928
129.082697131361/35.23540386862928
129.082697131361/35.23540386862928
129.08269650320784/35.23540388486679
129.08269552858275/35.235403910060455
129.08269517365383/35.235403919235225
129.08270077209264/35.23540354068908
129.08271722970267/35.23540061207805
129.08272491250332/35.235399021244554
129.08272353126617/35.23539936591614
129.0827256763998/35.23540204743091
129.082735110323/35.235398086254015
129.0827325205948/35.235388098722346
129.0827274324205/35.235374292802305
129.08272553080164/35.235357978685116
129.08271786521024/35.23534108295087
129.08271135373604/35.23532635998821
129.08270833078927/35.235309003964105
129.0827029471753/35.23529616557772
129.08269799153348/35.235280627727555
129.08269532707487/35.23526251148779
129.08269363758643/35.235244894514246
129.08269228123876/35.23522471497403
129.0826912511708/35.23520579652864
129.08269262238878/35.23519142745134
129.08269569348215/35.23517887634187
129.08269590785997/35.235162998414864
129.0826974372813/35.23514940971119
129.08270052282165/35.23513842413282
129.0827014596124/35.23512248325631
129.0827036664925/35.23511098282754
129.08270564518173/35.23509932570829
129.0827058318701/35.23508359725004
129.0827064217425/35.23506699263876
129.08270765916814/35.235046501930356
129.08270780656449/35.23502775597533
129.08270891077743/35.23501288037213
129.0827086045635/35.234997619003245
129.08270567007744/35.234980654108185
129.08270310101943/35.23496490603555
129.08270930290698/35.23495183263794
129.08272325253736/35.23494871825038
129.08273153959922/35.2349517647823
129.08273531189062/35.23496284625334
129.08273704457528/35.23497517938751
129.08273788940062/35.23498952186517
129.08273840977316/35.235006598952566
129.08274089347728/35.235023671222635
129.08274337237825/35.23504793435399
129.08274617691495/35.2350877134656
129.08274775950136/35.235113353346186
129.08274880884684/35.23513692597212
129.08275082879157/35.235163157351295
129.08275567916235/35.235183673221435
129.082765966694/35.23519218502827
129.08277847868817/35.23519190336072
129.08278509861796/35.235191712080635
129.08278702218485/35.23518966749973
129.08278995359203/35.23518531488566
129.082799471417/35.23518382426938
129.08280430836928/35.23518380887292