stationId	t_start	t_end	t_max	timeStamp
125	20/04/28 05:09:17	20/04/28 05:09:17	20/04/28 05:09:17
66	20/04/28 05:09:19	20/04/28 05:09:21	20/04/28 05:09:21
11	20/04/28 05:09:23	20/04/28 05:09:25	20/04/28 05:09:25
11	20/04/28 05:09:27	20/04/28 05:09:29	20/04/28 05:09:29
23	20/04/28 05:09:31	20/04/28 05:09:32	20/04/28 05:09:32
32	20/04/28 05:11:39	20/04/28 05:09:34	20/04/28 05:09:34
16	20/04/28 05:09:36	20/04/28 05:09:36	20/04/28 05:09:36
74	20/04/28 05:09:39	20/04/28 05:09:41	20/04/28 05:09:41
74	20/04/28 05:09:43	20/04/28 05:09:43	20/04/28 05:09:43
81	20/04/28 05:09:45	20/04/28 05:09:45	20/04/28 05:09:45
81	20/04/28 05:09:47	20/04/28 05:09:47	20/04/28 05:09:47
16	20/04/28 05:09:49	20/04/28 05:09:49	20/04/28 05:09:49
104	20/04/28 05:09:51	20/04/28 05:09:51	20/04/28 05:09:51
16	20/04/28 05:09:53	20/04/28 05:09:53	20/04/28 05:09:53
104	20/04/28 05:09:55	20/04/28 05:09:55	20/04/28 05:09:55
74	20/04/28 05:09:57	20/04/28 05:09:57	20/04/28 05:09:57
104	20/04/28 05:09:59	20/04/28 05:09:59	20/04/28 05:09:59
91	20/04/28 05:10:01	20/04/28 05:10:01	20/04/28 05:10:01
81	20/04/28 05:10:03	20/04/28 05:10:03	20/04/28 05:10:03
118	20/04/28 05:09:46	20/04/28 05:10:05	20/04/28 05:10:05
91	20/04/28 05:10:07	20/04/28 05:10:07	20/04/28 05:10:07
7	20/04/28 05:10:09	20/04/28 05:10:09	20/04/28 05:10:09
16	20/04/28 05:10:11	20/04/28 05:10:11	20/04/28 05:10:11
16	20/04/28 05:10:13	20/04/28 05:10:13	20/04/28 05:10:13
5	20/04/28 05:10:15	20/04/28 05:10:15	20/04/28 05:10:15
42	20/04/28 05:10:17	20/04/28 05:10:17	20/04/28 05:10:17
23	20/04/28 05:10:19	20/04/28 05:10:19	20/04/28 05:10:19
32	20/04/28 05:10:21	20/04/28 05:10:21	20/04/28 05:10:21
41	20/04/28 05:10:23	20/04/28 05:10:23	20/04/28 05:10:23
91	20/04/28 05:10:25	20/04/28 05:10:25	20/04/28 05:10:25
118	20/04/28 05:10:27	20/04/28 05:10:27	20/04/28 05:10:27
41	20/04/28 05:10:29	20/04/28 05:10:29	20/04/28 05:10:29
74	20/04/28 05:10:31	20/04/28 05:10:31	20/04/28 05:10:31
131	20/04/28 05:10:33	20/04/28 05:10:33	20/04/28 05:10:33
10	20/04/28 05:10:35	20/04/28 05:10:37	20/04/28 05:10:37
96	20/04/28 05:10:39	20/04/28 05:10:42	20/04/28 05:10:40
125	20/04/28 05:10:44	20/04/28 05:10:45	20/04/28 05:10:45
87	20/04/28 05:10:47	20/04/28 05:10:47	20/04/28 05:10:47
26	20/04/28 05:10:49	20/04/28 05:10:49	20/04/28 05:10:49
10	20/04/28 05:10:51	20/04/28 05:10:51	20/04/28 05:10:51
96	20/04/28 05:10:53	20/04/28 05:10:53	20/04/28 05:10:53
26	20/04/28 05:10:55	20/04/28 05:10:55	20/04/28 05:10:55
11	20/04/28 05:10:57	20/04/28 05:10:57	20/04/28 05:10:57
94	20/04/28 05:10:59	20/04/28 05:10:59	20/04/28 05:10:59
99	20/04/28 05:11:01	20/04/28 05:11:01	20/04/28 05:11:01
10	20/04/28 05:11:03	20/04/28 05:11:03	20/04/28 05:11:03
147	20/04/28 05:11:05	20/04/28 05:11:06	20/04/28 05:11:05
96	20/04/28 05:11:08	20/04/28 05:11:08	20/04/28 05:11:08
72	20/04/28 05:11:10	20/04/28 05:11:10	20/04/28 05:11:10
143	20/04/28 05:11:12	20/04/28 05:11:12	20/04/28 05:11:12
86	20/04/28 05:11:14	20/04/28 05:11:14	20/04/28 05:11:14
151	20/04/28 05:11:16	20/04/28 05:11:16	20/04/28 05:11:16
87	20/04/28 05:11:18	20/04/28 05:11:18	20/04/28 05:11:18
87	20/04/28 05:11:20	20/04/28 05:11:21	20/04/28 05:11:21
118	20/04/28 05:11:23	20/04/28 05:11:24	20/04/28 05:11:24
13	20/04/28 05:11:26	20/04/28 05:11:26	20/04/28 05:11:26
151	20/04/28 05:11:28	20/04/28 05:11:28	20/04/28 05:11:28
85	20/04/28 05:11:30	20/04/28 05:11:30	20/04/28 05:11:30
74	20/04/28 05:11:32	20/04/28 05:11:32	20/04/28 05:11:32
6	20/04/28 05:11:34	20/04/28 05:11:34	20/04/28 05:11:34
87	20/04/28 05:11:36	20/04/28 05:11:36	20/04/28 05:11:36
94	20/04/28 05:11:38	20/04/28 05:11:38	20/04/28 05:11:38
10	20/04/28 05:11:40	20/04/28 05:14:09	20/04/28 05:11:40
87	20/04/28 05:11:42	20/04/28 05:11:43	20/04/28 05:11:43
157	20/04/28 05:11:45	20/04/28 05:11:45	20/04/28 05:11:45
13	20/04/28 05:11:47	20/04/28 05:11:47	20/04/28 05:11:47
76	20/04/28 05:11:49	20/04/28 05:11:49	20/04/28 05:11:49
143	20/04/28 05:11:51	20/04/28 05:11:51	20/04/28 05:11:51
94	20/04/28 05:11:53	20/04/28 05:11:53	20/04/28 05:11:53
125	20/04/28 05:11:55	20/04/28 05:11:55	20/04/28 05:11:55
23	20/04/28 05:11:57	20/04/28 05:11:57	20/04/28 05:11:57
6	20/04/28 05:11:59	20/04/28 05:12:00	20/04/28 05:12:00
32	20/04/28 05:12:02	20/04/28 05:12:02	20/04/28 05:12:02
87	20/04/28 05:12:04	20/04/28 05:12:04	20/04/28 05:12:04
101	20/04/28 05:12:06	20/04/28 05:12:10	20/04/28 05:12:08
101	20/04/28 05:12:12	20/04/28 05:12:12	20/04/28 05:12:12
101	20/04/28 05:12:14	20/04/28 05:12:14	20/04/28 05:12:14
21	20/04/28 05:12:16	20/04/28 05:12:16	20/04/28 05:12:16
100	20/04/28 05:12:18	20/04/28 05:12:18	20/04/28 05:12:18
20	20/04/28 05:12:20	20/04/28 05:12:21	20/04/28 05:12:21
142	20/04/28 05:12:23	20/04/28 05:12:23	20/04/28 05:12:23
147	20/04/28 05:12:25	20/04/28 05:12:25	20/04/28 05:12:25
25	20/04/28 05:12:27	20/04/28 05:12:27	20/04/28 05:12:27
20	20/04/28 05:12:29	20/04/28 05:12:29	20/04/28 05:12:29
147	20/04/28 05:12:31	20/04/28 05:12:31	20/04/28 05:12:31
21	20/04/28 05:12:33	20/04/28 05:12:33	20/04/28 05:12:33
62	20/04/28 05:12:35	20/04/28 05:12:35	20/04/28 05:12:35
95	20/04/28 05:12:37	20/04/28 05:12:37	20/04/28 05:12:37
118	20/04/28 05:12:39	20/04/28 05:12:39	20/04/28 05:12:39
133	20/04/28 05:12:41	20/04/28 05:12:41	20/04/28 05:12:41
100	20/04/28 05:12:43	20/04/28 05:12:43	20/04/28 05:12:43
135	20/04/28 05:12:45	20/04/28 05:12:45	20/04/28 05:12:45
89	20/04/28 05:12:47	20/04/28 05:12:47	20/04/28 05:12:47
45	20/04/28 05:12:49	20/04/28 05:12:49	20/04/28 05:12:49
40	20/04/28 05:12:51	20/04/28 05:12:51	20/04/28 05:12:51
40	20/04/28 05:12:53	20/04/28 05:12:53	20/04/28 05:12:53
40	20/04/28 05:12:55	20/04/28 05:12:55	20/04/28 05:12:55
108	20/04/28 05:12:57	20/04/28 05:12:57	20/04/28 05:12:57
135	20/04/28 05:12:59	20/04/28 05:12:59	20/04/28 05:12:59
135	20/04/28 05:13:01	20/04/28 05:13:01	20/04/28 05:13:01
40	20/04/28 05:13:03	20/04/28 05:13:03	20/04/28 05:13:03
40	20/04/28 05:13:05	20/04/28 05:13:05	20/04/28 05:13:05
151	20/04/28 05:13:07	20/04/28 05:13:07	20/04/28 05:13:07
34	20/04/28 05:13:09	20/04/28 05:13:09	20/04/28 05:13:09
97	20/04/28 05:13:11	20/04/28 05:13:11	20/04/28 05:13:11
45	20/04/28 05:13:13	20/04/28 05:13:13	20/04/28 05:13:13
