stationId	t_start	t_end	t_max	timeStamp
110	20/04/28 05:17:35	20/04/28 05:17:35	20/04/28 05:17:35
75	20/04/28 05:17:37	20/04/28 05:17:37	20/04/28 05:17:37
135	20/04/28 05:17:39	20/04/28 05:17:39	20/04/28 05:17:39
64	20/04/28 05:17:41	20/04/28 05:17:42	20/04/28 05:17:42
135	20/04/28 05:17:44	20/04/28 05:17:45	20/04/28 05:17:45
135	20/04/28 05:17:47	20/04/28 05:17:49	20/04/28 05:17:49
70	20/04/28 05:17:51	20/04/28 05:17:51	20/04/28 05:17:51
135	20/04/28 05:17:53	20/04/28 05:17:54	20/04/28 05:17:54
55	20/04/28 05:17:56	20/04/28 05:17:57	20/04/28 05:17:57
135	20/04/28 05:17:59	20/04/28 05:17:59	20/04/28 05:17:59
63	20/04/28 05:18:01	20/04/28 05:18:01	20/04/28 05:18:01
63	20/04/28 05:18:03	20/04/28 05:18:03	20/04/28 05:18:03
70	20/04/28 05:18:05	20/04/28 05:18:05	20/04/28 05:18:05
108	20/04/28 05:18:07	20/04/28 05:18:07	20/04/28 05:18:07
85	20/04/28 05:18:09	20/04/28 05:18:09	20/04/28 05:18:09
13	20/04/28 05:18:11	20/04/28 05:18:11	20/04/28 05:18:11
130	20/04/28 05:18:13	20/04/28 05:18:13	20/04/28 05:18:13
150	20/04/28 05:18:15	20/04/28 05:18:15	20/04/28 05:18:15
129	20/04/28 05:18:17	20/04/28 05:18:17	20/04/28 05:18:17
134	20/04/28 05:18:19	20/04/28 05:18:19	20/04/28 05:18:19
136	20/04/28 05:18:21	20/04/28 05:18:21	20/04/28 05:18:21
71	20/04/28 05:18:23	20/04/28 05:18:23	20/04/28 05:18:23
92	20/04/28 05:18:25	20/04/28 05:18:25	20/04/28 05:18:25
62	20/04/28 05:18:27	20/04/28 05:18:27	20/04/28 05:18:27
118	20/04/28 05:18:29	20/04/28 05:18:29	20/04/28 05:18:29
2	20/04/28 05:18:31	20/04/28 05:18:31	20/04/28 05:18:31
118	20/04/28 05:18:33	20/04/28 05:18:33	20/04/28 05:18:33
118	20/04/28 05:18:35	20/04/28 05:18:35	20/04/28 05:18:35
74	20/04/28 05:18:37	20/04/28 05:18:37	20/04/28 05:18:37
129	20/04/28 05:18:39	20/04/28 05:18:39	20/04/28 05:18:39
130	20/04/28 05:18:41	20/04/28 05:18:41	20/04/28 05:18:41
33	20/04/28 05:18:43	20/04/28 05:18:43	20/04/28 05:18:43
52	20/04/28 05:18:45	20/04/28 05:18:45	20/04/28 05:18:45
152	20/04/28 05:18:47	20/04/28 05:18:47	20/04/28 05:18:47
