stationId	t_start	t_end	t_max	timeStamp
24	20/04/28 05:12:46	20/04/28 05:12:46	20/04/28 05:12:46
24	20/04/28 05:12:48	20/04/28 05:12:48	20/04/28 05:12:48
84	20/04/28 05:12:50	20/04/28 05:12:52	20/04/28 05:12:52
47	20/04/28 05:12:54	20/04/28 05:12:55	20/04/28 05:12:55
114	20/04/28 05:12:57	20/04/28 05:12:57	20/04/28 05:12:57
49	20/04/28 05:12:59	20/04/28 05:12:59	20/04/28 05:12:59
49	20/04/28 05:13:01	20/04/28 05:13:01	20/04/28 05:13:01
84	20/04/28 05:13:03	20/04/28 05:13:03	20/04/28 05:13:03
111	20/04/28 05:13:05	20/04/28 05:13:06	20/04/28 05:13:05
160	20/04/28 05:13:08	20/04/28 05:13:08	20/04/28 05:13:08
46	20/04/28 05:13:10	20/04/28 05:13:10	20/04/28 05:13:10
85	20/04/28 05:13:12	20/04/28 05:13:12	20/04/28 05:13:12
159	20/04/28 05:13:14	20/04/28 05:13:14	20/04/28 05:13:14
85	20/04/28 05:13:16	20/04/28 05:13:17	20/04/28 05:13:17
85	20/04/28 05:13:19	20/04/28 05:13:19	20/04/28 05:13:19
76	20/04/28 05:13:21	20/04/28 05:13:21	20/04/28 05:13:21
56	20/04/28 05:13:23	20/04/28 05:13:23	20/04/28 05:13:23
76	20/04/28 05:13:25	20/04/28 05:13:27	20/04/28 05:13:26
76	20/04/28 05:13:29	20/04/28 05:13:31	20/04/28 05:13:31
85	20/04/28 05:13:33	20/04/28 05:13:34	20/04/28 05:13:34
85	20/04/28 05:13:36	20/04/28 05:13:37	20/04/28 05:13:37
85	20/04/28 05:13:39	20/04/28 05:13:39	20/04/28 05:13:39
78	20/04/28 05:13:41	20/04/28 05:13:42	20/04/28 05:13:42
29	20/04/28 05:13:44	20/04/28 05:13:44	20/04/28 05:13:44
56	20/04/28 05:13:46	20/04/28 05:13:47	20/04/28 05:13:47
76	20/04/28 05:13:49	20/04/28 05:13:49	20/04/28 05:13:49
159	20/04/28 05:13:51	20/04/28 05:13:52	20/04/28 05:13:51
70	20/04/28 05:13:54	20/04/28 05:13:54	20/04/28 05:13:54
140	20/04/28 05:13:56	20/04/28 05:13:56	20/04/28 05:13:56
140	20/04/28 05:13:58	20/04/28 05:13:58	20/04/28 05:13:58
85	20/04/28 05:14:00	20/04/28 05:14:00	20/04/28 05:14:00
37	20/04/28 05:14:02	20/04/28 05:14:02	20/04/28 05:14:02
85	20/04/28 05:14:04	20/04/28 05:14:04	20/04/28 05:14:04
29	20/04/28 05:14:06	20/04/28 05:14:06	20/04/28 05:14:06
160	20/04/28 05:14:08	20/04/28 05:14:08	20/04/28 05:17:17
40	20/04/28 05:14:10	20/04/28 05:14:10	20/04/28 05:14:10
160	20/04/28 05:10:48	20/04/28 05:14:47	20/04/28 05:14:12
43	20/04/28 05:14:14	20/04/28 05:14:14	20/04/28 05:14:14
78	20/04/28 05:14:16	20/04/28 05:14:16	20/04/28 05:14:16
126	20/04/28 05:14:18	20/04/28 05:14:18	20/04/28 05:14:18
33	20/04/28 05:14:20	20/04/28 05:14:20	20/04/28 05:14:20
162	20/04/28 05:14:22	20/04/28 05:14:22	20/04/28 05:14:22
43	20/04/28 05:14:24	20/04/28 05:14:24	20/04/28 05:14:24
85	20/04/28 05:14:26	20/04/28 05:14:26	20/04/28 05:14:26
126	20/04/28 05:14:28	20/04/28 05:14:28	20/04/28 05:14:28
43	20/04/28 05:11:00	20/04/28 05:11:02	20/04/28 05:11:00
162	20/04/28 05:14:32	20/04/28 05:14:32	20/04/28 05:14:32
