floorId	partitionId	location_x	location_y	timeStamp
1	93	344.9096447584029	294.6911359916093	20/04/28 05:14:01
3	77	344.7301279798078	297.37843376747077	20/04/28 05:14:02
1	93	344.7301279798078	297.37843376747077	20/04/28 05:14:03
3	77	344.7301279798078	297.37843376747077	20/04/28 05:14:04
1	93	344.7301279798078	297.37843376747077	20/04/28 05:14:05
3	77	344.7301279798078	297.37843376747077	20/04/28 05:14:06
3	77	344.7301279798077	297.37843376747077	20/04/28 05:14:07
3	77	344.7301279798078	297.37843376747077	20/04/28 05:14:08
3	77	344.7301279798078	297.37843376747077	20/04/28 05:14:09
3	77	344.7301279798078	297.37843376747077	20/04/28 05:14:10
3	77	344.7301279798078	297.37843376747077	20/04/28 05:14:11
1	93	344.7301279798078	297.37843376747077	20/04/28 05:14:12
3	77	344.7301279798078	297.37843376747077	20/04/28 05:14:13
3	NULL	341.30497758665337	296.19351549065414	20/04/28 05:14:14
3	89	337.4950877232548	298.20130931449154	20/04/28 05:14:15
3	89	337.4950877232548	298.20130931449154	20/04/28 05:14:16
3	89	337.4950877232548	298.20130931449154	20/04/28 05:14:17
3	NULL	341.30497758665337	296.19351549065414	20/04/28 05:14:18
3	NULL	341.30497758665337	296.19351549065414	20/04/28 05:14:19
3	NULL	336.58020655049194	299.66025721778027	20/04/28 05:14:20
1	93	337.4950877232548	298.20130931449154	20/04/28 05:14:21
1	NULL	336.58020655049194	299.66025721778027	20/04/28 05:14:22
1	93	337.4950877232548	298.20130931449154	20/04/28 05:14:23
1	NULL	336.58020655049194	299.66025721778027	20/04/28 05:14:24
1	NULL	336.58020655049194	299.66025721778027	20/04/28 05:14:25
1	93	338.6476181345684	296.0905864151589	20/04/28 05:14:26
3	NULL	341.30497758665337	296.19351549065414	20/04/28 05:14:27
3	89	337.4950877232548	298.20130931449154	20/04/28 05:14:28
1	93	338.6476181345684	296.0905864151589	20/04/28 05:14:29
3	89	338.6476181345684	296.0905864151589	20/04/28 05:14:30
3	89	337.4950877232548	298.20130931449154	20/04/28 05:14:31
3	89	337.4950877232548	298.20130931449154	20/04/28 05:14:32
1	93	341.30497758665337	296.19351549065414	20/04/28 05:14:33
1	93	337.4950877232548	298.20130931449154	20/04/28 05:14:34
3	89	338.6476181345684	296.0905864151589	20/04/28 05:14:35
3	89	338.6476181345684	296.0905864151589	20/04/28 05:14:36
3	NULL	341.30497758665337	296.19351549065414	20/04/28 05:14:37
3	89	338.6476181345684	296.0905864151589	20/04/28 05:14:38
3	89	339.62746316962483	294.4150370605242	20/04/28 05:14:39
1	97	340.7799935809384	292.30431416119154	20/04/28 05:14:40
3	100	340.7799935809384	292.30431416119154	20/04/28 05:14:41
3	100	340.7799935809384	292.30431416119154	20/04/28 05:14:42
3	89	338.6155418383897	292.8962367039085	20/04/28 05:14:43
3	89	337.93056117792	295.64954416556157	20/04/28 05:14:44
3	89	338.6476181345684	296.0905864151589	20/04/28 05:14:45
3	77	341.74045104131864	293.64175034172416	20/04/28 05:14:46
3	89	338.6476181345684	296.0905864151589	20/04/28 05:14:47
3	89	337.4950877232548	298.20130931449154	20/04/28 05:14:48
3	100	340.7799935809384	292.30431416119154	20/04/28 05:14:49
3	89	338.6155418383897	292.8962367039085	20/04/28 05:14:50
1	93	341.74045104131864	293.64175034172416	20/04/28 05:14:51
3	100	340.7799935809384	292.30431416119154	20/04/28 05:14:52
3	77	341.74045104131864	293.64175034172416	20/04/28 05:14:53
1	83	342.55544985905226	291.2309163740584	20/04/28 05:14:54
1	97	340.06293662429005	291.86327191159415	20/04/28 05:14:55
1	97	340.7799935809384	292.30431416119154	20/04/28 05:14:56
1	93	341.74045104131864	293.64175034172416	20/04/28 05:14:57
1	97	340.7799935809384	292.30431416119154	20/04/28 05:14:58
1	93	341.74045104131864	293.64175034172416	20/04/28 05:14:59
1	97	340.7799935809384	292.30431416119154	20/04/28 05:15:00
1	97	340.7799935809384	292.30431416119154	20/04/28 05:15:01
1	97	340.7799935809384	292.30431416119154	20/04/28 05:15:02
1	97	340.7799935809384	292.30431416119154	20/04/28 05:15:03
1	97	340.7799935809384	292.30431416119154	20/04/28 05:15:04
1	97	340.7799935809384	292.30431416119154	20/04/28 05:15:05
1	97	340.7799935809384	292.30431416119154	20/04/28 05:15:06
1	97	340.7799935809384	292.30431416119154	20/04/28 05:15:07
1	83	342.55544985905226	291.2309163740584	20/04/28 05:15:08
1	97	340.7799935809384	292.30431416119154	20/04/28 05:15:09
1	93	341.74045104131864	293.64175034172416	20/04/28 05:15:10
1	93	341.74045104131864	293.64175034172416	20/04/28 05:15:11
1	83	342.55544985905226	291.2309163740584	20/04/28 05:15:12
1	93	341.74045104131864	293.64175034172416	20/04/28 05:15:13
1	83	342.55544985905226	291.2309163740584	20/04/28 05:15:14
1	83	342.55544985905226	291.2309163740584	20/04/28 05:15:15
1	93	341.74045104131864	293.64175034172416	20/04/28 05:15:16
1	93	341.74045104131864	293.64175034172416	20/04/28 05:15:17
1	93	343.7903016985783	295.0700232299748	20/04/28 05:15:18
1	83	344.22577515324355	292.51825808104485	20/04/28 05:15:19
1	93	345.165601434473	294.82666861854074	20/04/28 05:15:20
1	83	344.22577515324355	292.51825808104485	20/04/28 05:15:21
1	83	344.22577515324355	292.51825808104485	20/04/28 05:15:22
1	82	346.05498604687926	292.08927636913313	20/04/28 05:15:23
1	83	344.22577515324355	292.51825808104485	20/04/28 05:15:24
1	93	341.30497758665337	296.19351549065414	20/04/28 05:15:25
1	93	345.875469268284	294.7765741449946	20/04/28 05:15:26
1	93	341.74045104131864	293.64175034172416	20/04/28 05:15:27
1	83	344.22577515324355	292.51825808104485	20/04/28 05:15:28
1	83	344.22577515324355	292.51825808104485	20/04/28 05:15:29
1	82	345.34511821306813	292.1393708426793	20/04/28 05:15:30
1	82	345.34511821306813	292.1393708426793	20/04/28 05:15:31
1	83	344.22577515324355	292.51825808104485	20/04/28 05:15:32
1	83	344.22577515324355	292.51825808104485	20/04/28 05:15:33
1	83	344.22577515324355	292.51825808104485	20/04/28 05:15:34
1	82	345.34511821306813	292.1393708426793	20/04/28 05:15:35
1	83	343.2895913836919	291.76684736212025	20/04/28 05:15:36
1	83	344.22577515324355	292.51825808104485	20/04/28 05:15:37
1	83	344.22577515324355	292.51825808104485	20/04/28 05:15:38
1	83	344.22577515324355	292.51825808104485	20/04/28 05:15:39
1	93	342.11997640438705	293.7826815229884	20/04/28 05:15:40
1	83	344.22577515324355	292.51825808104485	20/04/28 05:15:41
1	83	344.22577515324355	292.51825808104485	20/04/28 05:15:42
1	83	342.55544985905226	291.2309163740584	20/04/28 05:15:43
1	93	343.7903016985783	295.0700232299748	20/04/28 05:15:44
1	82	346.05498604687926	292.08927636913313	20/04/28 05:15:45
1	83	344.22577515324355	292.51825808104485	20/04/28 05:15:46
