stationId	t_start	t_end	t_max	timeStamp
121	20/04/28 05:15:23	20/04/28 05:15:23	20/04/28 05:15:23
13	20/04/28 05:15:25	20/04/28 05:15:26	20/04/28 05:15:26
55	20/04/28 05:15:28	20/04/28 05:15:28	20/04/28 05:15:28
53	20/04/28 05:15:30	20/04/28 05:15:30	20/04/28 05:15:30
53	20/04/28 05:15:32	20/04/28 05:15:32	20/04/28 05:15:32
48	20/04/28 05:15:34	20/04/28 05:15:35	20/04/28 05:15:35
129	20/04/28 05:15:37	20/04/28 05:15:37	20/04/28 05:15:37
161	20/04/28 05:15:39	20/04/28 05:15:39	20/04/28 05:15:39
84	20/04/28 05:15:41	20/04/28 05:15:41	20/04/28 05:15:41
57	20/04/28 05:15:43	20/04/28 05:15:43	20/04/28 05:15:43
57	20/04/28 05:15:45	20/04/28 05:15:45	20/04/28 05:15:45
52	20/04/28 05:15:47	20/04/28 05:15:47	20/04/28 05:15:47
49	20/04/28 05:15:49	20/04/28 05:15:49	20/04/28 05:15:49
49	20/04/28 05:15:51	20/04/28 05:15:51	20/04/28 05:15:51
35	20/04/28 05:15:53	20/04/28 05:15:53	20/04/28 05:15:53
35	20/04/28 05:15:55	20/04/28 05:15:55	20/04/28 05:15:55
48	20/04/28 05:15:57	20/04/28 05:15:58	20/04/28 05:15:58
107	20/04/28 05:16:00	20/04/28 05:16:00	20/04/28 05:16:00
114	20/04/28 05:16:02	20/04/28 05:16:02	20/04/28 05:16:02
49	20/04/28 05:16:04	20/04/28 05:16:04	20/04/28 05:16:04
9	20/04/28 05:16:06	20/04/28 05:16:06	20/04/28 05:16:06
86	20/04/28 05:16:08	20/04/28 05:16:08	20/04/28 05:16:08
83	20/04/28 05:16:10	20/04/28 05:16:10	20/04/28 05:16:10
57	20/04/28 05:16:12	20/04/28 05:16:12	20/04/28 05:16:12
86	20/04/28 05:16:14	20/04/28 05:16:15	20/04/28 05:16:14
153	20/04/28 05:16:17	20/04/28 05:16:17	20/04/28 05:16:17
54	20/04/28 05:16:19	20/04/28 05:16:19	20/04/28 05:16:19
54	20/04/28 05:16:21	20/04/28 05:16:22	20/04/28 05:16:21
55	20/04/28 05:16:24	20/04/28 05:16:24	20/04/28 05:16:24
54	20/04/28 05:16:26	20/04/28 05:16:26	20/04/28 05:16:26
135	20/04/28 05:16:28	20/04/28 05:16:28	20/04/28 05:16:28
83	20/04/28 05:16:30	20/04/28 05:16:30	20/04/28 05:16:30
3	20/04/28 05:16:32	20/04/28 05:16:32	20/04/28 05:16:32
13	20/04/28 05:16:34	20/04/28 05:16:35	20/04/28 05:16:35
1	20/04/28 05:16:37	20/04/28 05:16:37	20/04/28 05:16:37
13	20/04/28 05:16:39	20/04/28 05:16:39	20/04/28 05:16:39
12	20/04/28 05:16:41	20/04/28 05:16:41	20/04/28 05:16:41
12	20/04/28 05:16:43	20/04/28 05:16:43	20/04/28 05:16:43
83	20/04/28 05:16:45	20/04/28 05:16:45	20/04/28 05:16:45
4	20/04/28 05:16:47	20/04/28 05:16:48	20/04/28 05:16:48
13	20/04/28 05:16:50	20/04/28 05:16:50	20/04/28 05:16:50
114	20/04/28 05:16:52	20/04/28 05:16:52	20/04/28 05:16:52
86	20/04/28 05:16:54	20/04/28 05:16:54	20/04/28 05:16:54
12	20/04/28 05:16:56	20/04/28 05:16:56	20/04/28 05:16:56
12	20/04/28 05:16:58	20/04/28 05:16:58	20/04/28 05:16:58
12	20/04/28 05:17:00	20/04/28 05:17:00	20/04/28 05:17:00
114	20/04/28 05:17:02	20/04/28 05:17:02	20/04/28 05:17:02
128	20/04/28 05:17:04	20/04/28 05:17:04	20/04/28 05:17:04
128	20/04/28 05:17:06	20/04/28 05:17:06	20/04/28 05:17:06
130	20/04/28 05:17:08	20/04/28 05:17:08	20/04/28 05:17:08
3	20/04/28 05:17:10	20/04/28 05:17:10	20/04/28 05:17:10
13	20/04/28 05:17:12	20/04/28 05:17:12	20/04/28 05:17:12
12	20/04/28 05:17:14	20/04/28 05:17:14	20/04/28 05:17:14
12	20/04/28 05:17:16	20/04/28 05:17:16	20/04/28 05:17:16
4	20/04/28 05:17:18	20/04/28 05:17:19	20/04/28 05:17:19
4	20/04/28 05:17:21	20/04/28 05:17:23	20/04/28 05:17:22
13	20/04/28 05:17:25	20/04/28 05:17:25	20/04/28 05:17:25
12	20/04/28 05:17:27	20/04/28 05:17:27	20/04/28 05:17:27
128	20/04/28 05:17:29	20/04/28 05:17:29	20/04/28 05:17:29
55	20/04/28 05:17:31	20/04/28 05:17:31	20/04/28 05:17:31
13	20/04/28 05:17:33	20/04/28 05:17:34	20/04/28 05:17:33
130	20/04/28 05:17:36	20/04/28 05:17:36	20/04/28 05:17:36
55	20/04/28 05:17:38	20/04/28 05:17:38	20/04/28 05:17:38
3	20/04/28 05:17:40	20/04/28 05:17:40	20/04/28 05:17:40
3	20/04/28 05:17:42	20/04/28 05:17:42	20/04/28 05:17:42
13	20/04/28 05:17:44	20/04/28 05:17:44	20/04/28 05:17:44
13	20/04/28 05:17:46	20/04/28 05:17:46	20/04/28 05:17:46
13	20/04/28 05:17:48	20/04/28 05:17:48	20/04/28 05:17:48
128	20/04/28 05:17:50	20/04/28 05:17:50	20/04/28 05:17:50
55	20/04/28 05:17:52	20/04/28 05:17:52	20/04/28 05:17:52
12	20/04/28 05:17:54	20/04/28 05:17:54	20/04/28 05:17:54
114	20/04/28 05:17:56	20/04/28 05:17:56	20/04/28 05:17:56
1	20/04/28 05:17:58	20/04/28 05:17:58	20/04/28 05:17:58
