floorId	partitionId	location_x	location_y	timeStamp
1	39	323.36502376698564	281.4434161789529	20/04/28 05:15:05
1	39	323.5294349782099	281.3012782103576	20/04/28 05:15:05
1	39	323.68120963537325	281.20940021227074	20/04/28 05:15:05
1	39	323.7333841620249	280.98527247019376	20/04/28 05:15:05
1	39	323.74720762176855	280.97537751003324	20/04/28 05:15:05
1	39	323.770296595888	281.0162204764285	20/04/28 05:15:06
1	39	323.5866108892069	280.8630730614304	20/04/28 05:15:06
1	39	323.6418191013135	280.883595283775	20/04/28 05:15:06
1	39	323.6494630560071	280.8639305270475	20/04/28 05:15:06
1	39	323.6494630560071	280.8639305270475	20/04/28 05:15:06
1	39	323.5999480600062	280.7930483471845	20/04/28 05:15:06
1	39	323.4888286085671	280.83608425362365	20/04/28 05:15:06
1	39	323.3167923704492	280.9078344961917	20/04/28 05:15:06
1	39	323.2233893774549	280.73113778360033	20/04/28 05:15:06
1	39	323.23653602804603	280.6418738562209	20/04/28 05:15:06
1	39	323.4425859814578	280.8565147429305	20/04/28 05:15:07
1	39	323.2816155987649	280.6811915721704	20/04/28 05:15:07
1	39	323.19713683621694	280.6142771370803	20/04/28 05:15:07
1	39	323.28451786333875	280.65517446327755	20/04/28 05:15:07
1	39	323.3311183879775	280.8951852239013	20/04/28 05:15:07
1	39	323.3808067920337	280.91925313167326	20/04/28 05:15:07
1	39	323.1679309374885	281.09986778606634	20/04/28 05:15:07
1	39	323.2017986507079	281.09061446637816	20/04/28 05:15:07
1	39	322.97347005764885	281.01588635352135	20/04/28 05:15:07
1	39	322.9839363133846	281.27986833504275	20/04/28 05:15:08
1	39	322.99941722890713	281.2849418212928	20/04/28 05:15:08
1	39	323.03860359673973	281.20975152534146	20/04/28 05:15:08
1	39	322.8406947547783	281.00401182770645	20/04/28 05:15:08
1	39	322.8036267032335	281.04339459402576	20/04/28 05:15:08
1	39	322.863343900781	281.0380833537445	20/04/28 05:15:08
1	39	322.71701395082044	281.03014164068765	20/04/28 05:15:08
1	39	322.5373090108243	280.88120180910136	20/04/28 05:15:08
1	39	322.53309833356326	281.0835731526827	20/04/28 05:15:08
1	39	322.51864492576493	281.11908436532934	20/04/28 05:15:08
1	39	322.65074675745774	281.0608936365107	20/04/28 05:15:09
1	39	322.838959761241	280.91749647518947	20/04/28 05:15:09
1	39	322.62316302465666	280.8508648927311	20/04/28 05:15:09
1	39	322.63276470433823	280.85163705760175	20/04/28 05:15:09
1	39	322.533465152613	281.12701953085934	20/04/28 05:15:09
1	39	322.44174316059673	281.2792658579752	20/04/28 05:15:09
1	39	322.50720253757066	281.31192115047673	20/04/28 05:15:09
1	39	322.5885940113815	281.18242092918547	20/04/28 05:15:09
1	39	322.53419740030176	281.07792295008187	20/04/28 05:15:09
1	39	322.48051449431284	281.1400231358528	20/04/28 05:15:09
1	39	322.44870211757564	281.1764081535429	20/04/28 05:15:10
1	39	322.46673492401914	281.1844503511718	20/04/28 05:15:10
1	39	322.5065518529815	281.10299418801714	20/04/28 05:15:10
1	39	322.484856835476	281.10540603124946	20/04/28 05:15:10
1	39	322.47976232412924	281.1491488643393	20/04/28 05:15:10
1	39	322.4805221456456	281.1277707114125	20/04/28 05:15:10
1	39	322.5373108953487	281.02553992261164	20/04/28 05:15:10
1	39	322.4931117046662	280.7558487609823	20/04/28 05:15:10
1	39	322.4809726121863	280.61010787994655	20/04/28 05:15:10
1	39	322.5074786717151	280.3758761304783	20/04/28 05:15:11
1	39	322.4888187705486	280.4064220004283	20/04/28 05:15:11
1	39	322.6592548659126	280.4972698672744	20/04/28 05:15:11
1	39	322.7245610641506	280.4253640555777	20/04/28 05:15:11
1	39	322.6438795842253	280.37258646208164	20/04/28 05:15:11
1	39	322.77019838472773	280.56098828428964	20/04/28 05:15:11
1	39	323.0530323235031	280.5769982046463	20/04/28 05:15:11
1	39	322.9905991874916	280.3766380515202	20/04/28 05:15:11
1	39	323.05111895386653	280.18313571044155	20/04/28 05:15:11
1	39	323.24151457135224	280.39885705989866	20/04/28 05:15:11
1	39	323.14789326910704	280.39113745334276	20/04/28 05:15:12
1	39	323.1481463988486	280.55194161555187	20/04/28 05:15:12
1	39	322.9914592094779	280.7872769689268	20/04/28 05:15:12
1	39	323.2385303013524	280.8821958047264	20/04/28 05:15:12
1	39	323.12937774088437	280.84614970211123	20/04/28 05:15:12
1	39	322.99380441234575	280.8278259104124	20/04/28 05:15:12
1	39	323.23317903704566	280.79921490028494	20/04/28 05:15:12
1	39	323.237936866588	280.7113861008144	20/04/28 05:15:12
1	39	323.12519277555316	280.791237457004	20/04/28 05:15:12
1	39	323.13256940985605	280.82509035921123	20/04/28 05:15:12
1	39	323.1199335911728	280.805288499914	20/04/28 05:15:13
1	39	323.34387141157515	280.8753187999854	20/04/28 05:15:13
1	39	323.35626781848254	280.7998453972327	20/04/28 05:15:13
1	39	323.2697004128401	280.79346643532534	20/04/28 05:15:13
1	39	323.28107045846394	280.7440694606278	20/04/28 05:15:13
1	39	323.16709536977345	280.76238866609475	20/04/28 05:15:13
1	39	323.17426853756626	280.74305423824006	20/04/28 05:15:13
1	39	323.16602322387973	280.7881281187486	20/04/28 05:15:13
1	39	323.2329769443981	280.7934311494805	20/04/28 05:15:13
1	39	323.2616685379392	280.8188920091178	20/04/28 05:15:14
1	39	323.2932483058384	280.8020019447998	20/04/28 05:15:14
1	39	323.29085706955175	280.76279334012526	20/04/28 05:15:14
1	39	323.3503067247635	280.55824478784723	20/04/28 05:15:14
1	39	323.50506586908796	280.30525695552745	20/04/28 05:15:14
1	39	323.506731181189	280.5509365078445	20/04/28 05:15:14
1	39	323.705143289598	280.6510424127719	20/04/28 05:15:14
1	39	323.7565722523363	280.58217893601034	20/04/28 05:15:14
1	39	324.00033748635843	280.48624938764897	20/04/28 05:15:14
1	39	324.00033300664035	280.4710495004947	20/04/28 05:15:14
1	39	323.8839213031729	280.39545757112757	20/04/28 05:15:15
1	39	323.68234727705436	280.4999908193149	20/04/28 05:15:15
1	39	323.6712030573842	280.4442044114358	20/04/28 05:15:15
1	39	323.6835364986455	280.5326781482323	20/04/28 05:15:15
1	39	323.7641729886601	280.74975079462075	20/04/28 05:15:15
1	39	323.7517532023529	280.70651980880206	20/04/28 05:15:15
1	39	323.74956350209044	280.7172922157656	20/04/28 05:15:15
1	39	323.6932856812535	280.52964258558467	20/04/28 05:15:15
1	39	323.61752547179077	280.6594381401252	20/04/28 05:15:15
1	39	323.62852148189535	280.65973103681375	20/04/28 05:15:15
1	39	323.64494110169665	280.68924568589324	20/04/28 05:15:16
1	39	323.6466717285113	280.7049912817614	20/04/28 05:15:16
1	39	323.66736688553607	280.72309582499423	20/04/28 05:15:16
1	39	323.6979525913818	280.70244036163854	20/04/28 05:15:16
1	39	323.9094550238343	280.50697266882685	20/04/28 05:15:16
1	39	323.650966828238	280.63340203703115	20/04/28 05:15:16
1	39	323.56487716703634	280.8873165163647	20/04/28 05:15:16
1	39	323.76368457387923	280.78516477584617	20/04/28 05:15:16
1	39	323.8385341742161	280.68574602641235	20/04/28 05:15:16
1	39	323.8363285790409	280.69117177912665	20/04/28 05:15:17
1	39	323.7100069739204	280.8683164302544	20/04/28 05:15:17
1	39	323.4684166067893	280.96625904888447	20/04/28 05:15:17
1	39	323.7103076106395	280.97660961757697	20/04/28 05:15:17
1	39	323.4972845022632	281.0128470404848	20/04/28 05:15:17
1	39	323.57674371025144	281.06854653940997	20/04/28 05:15:17
1	39	323.5982660758053	281.0402148619074	20/04/28 05:15:17
1	39	323.48805831635997	280.99467495048304	20/04/28 05:15:17
1	39	323.431822433488	281.1204768860895	20/04/28 05:15:17
1	39	323.3997227250199	281.31918142124636	20/04/28 05:15:17
1	39	323.44956611112445	281.121636613957	20/04/28 05:15:18
1	39	323.3777736261446	281.1980945680576	20/04/28 05:15:18
1	39	323.40730091104587	281.4837952913167	20/04/28 05:15:18
1	39	323.1168570974009	281.4981961650134	20/04/28 05:15:18
1	39	323.1346395753513	281.41219033415547	20/04/28 05:15:18
1	39	322.97212020052734	281.37172551276745	20/04/28 05:15:18
1	39	323.04995812933123	281.1340778377975	20/04/28 05:15:18
1	39	323.09385024075675	281.11519412164756	20/04/28 05:15:18
1	39	323.2369876564274	281.3504525145645	20/04/28 05:15:18
1	39	323.12127352334596	281.5507618651004	20/04/28 05:15:18
1	39	323.1124605997352	281.59221645424077	20/04/28 05:15:19
1	39	323.3193280651186	281.7911252430289	20/04/28 05:15:19
1	39	323.3197760495989	281.7911222329321	20/04/28 05:15:19
1	39	323.533087237751	281.8162856308382	20/04/28 05:15:19
1	39	323.27985723149675	281.71241678970085	20/04/28 05:15:19
1	39	323.32294121701705	281.6002358489356	20/04/28 05:15:19
1	39	323.49863925288184	281.4822488293652	20/04/28 05:15:19
1	39	323.332286595713	281.70968044471437	20/04/28 05:15:19
1	39	323.2439778510759	281.9351521018665	20/04/28 05:15:19
1	39	322.95158577540144	281.9170699981648	20/04/28 05:15:20
1	39	323.1544698811869	281.94610465051	20/04/28 05:15:20
1	39	323.2551244512856	281.8099346861353	20/04/28 05:15:20
1	39	323.36180737631	281.9014147478805	20/04/28 05:15:20
1	39	323.0623527049614	281.8919252638614	20/04/28 05:15:20
1	39	323.0916415174214	281.67666350450395	20/04/28 05:15:20
1	39	323.0917362603166	281.73252836444163	20/04/28 05:15:20
1	39	323.136757365249	281.7624617205094	20/04/28 05:15:20
1	39	323.33339361171545	281.83491141127917	20/04/28 05:15:20
1	39	323.37173054644353	281.581277411522	20/04/28 05:15:20
1	39	323.39201392300936	281.58269556371954	20/04/28 05:15:21
1	39	323.38641764553233	281.58144436583837	20/04/28 05:15:21
1	39	323.33803459132196	281.55156113660786	20/04/28 05:15:21
1	39	323.40789870151417	281.59881559305916	20/04/28 05:15:21
1	39	323.4166394671484	281.61998773451205	20/04/28 05:15:21
1	39	323.57211307830966	281.59503231275824	20/04/28 05:15:21
1	39	323.6261003707482	281.61379567468776	20/04/28 05:15:21
1	39	323.62890057666345	281.6104472104937	20/04/28 05:15:21
1	39	323.83915170390304	281.4747349250502	20/04/28 05:15:21
1	39	323.85197460055	281.4532145079539	20/04/28 05:15:22
1	39	323.5656096672349	281.5303512281703	20/04/28 05:15:22
1	39	323.5310310933018	281.53623852101805	20/04/28 05:15:22
1	39	323.3972765833308	281.3716590445295	20/04/28 05:15:22
1	39	323.51066397632263	281.3179727539966	20/04/28 05:15:22
1	39	323.52547552150355	281.12645050995684	20/04/28 05:15:22
1	39	323.51705713321223	281.12419151583515	20/04/28 05:15:22
1	39	323.47627825023693	280.93154682124225	20/04/28 05:15:22
1	39	323.2689549686233	281.12776891911517	20/04/28 05:15:22
1	39	323.20546849518644	281.3951836924767	20/04/28 05:15:22
1	39	323.1323695390836	281.6585376397551	20/04/28 05:15:23
1	39	323.1594098112376	281.62411400076974	20/04/28 05:15:23
1	39	323.27897333343424	281.4558468075187	20/04/28 05:15:23
1	39	323.1760334230413	281.3464526991938	20/04/28 05:15:23
1	39	323.1106056306379	281.203812666989	20/04/28 05:15:23
1	39	323.0754677930113	281.0875650440608	20/04/28 05:15:23
1	39	323.0244059471668	281.0427662234356	20/04/28 05:15:23
1	39	322.9357839522493	281.23974704532253	20/04/28 05:15:23
1	39	323.02940399550175	281.1194390646142	20/04/28 05:15:23
1	39	323.05098819500375	281.10639434109265	20/04/28 05:15:23
1	39	323.13854068352816	281.02933524999565	20/04/28 05:15:24
1	39	323.29050271335154	280.94561867169176	20/04/28 05:15:24
1	39	323.38794666653695	281.1536483459225	20/04/28 05:15:24
1	39	323.19452518623774	281.21682263208663	20/04/28 05:15:24
1	39	323.03199770256396	281.46784680827056	20/04/28 05:15:24
1	39	322.81943962790893	281.28334100343926	20/04/28 05:15:24
1	39	322.810086459414	281.2533730601781	20/04/28 05:15:24
1	39	322.8807503520915	281.45826961604735	20/04/28 05:15:24
1	39	322.8852097793727	281.4756437203236	20/04/28 05:15:24
1	39	322.8742034319255	281.57011085736497	20/04/28 05:15:25
1	39	322.8754175181141	281.5714141642935	20/04/28 05:15:25
1	39	322.8811505238621	281.67979411518587	20/04/28 05:15:25
1	39	322.8834413675605	281.69123313661777	20/04/28 05:15:25
1	39	322.7764162996209	281.92856763677173	20/04/28 05:15:25
1	39	322.69595273274905	281.6597227588563	20/04/28 05:15:25
1	39	322.75176396721093	281.6510970583048	20/04/28 05:15:25
1	39	322.75176396721093	281.6510970583048	20/04/28 05:15:25
1	39	322.7372364701189	281.8620480359738	20/04/28 05:15:25
1	39	322.7379330989552	281.62100903474	20/04/28 05:15:25
1	39	322.67791810906164	281.57695071887343	20/04/28 05:15:26
1	39	322.58144321207186	281.6904666403466	20/04/28 05:15:26
1	39	322.44190045946266	281.7337673805145	20/04/28 05:15:26
1	39	322.44190045946266	281.7337673805145	20/04/28 05:15:26
1	39	322.50433134041754	281.53818321492554	20/04/28 05:15:26
1	39	322.536527777605	281.51198973867605	20/04/28 05:15:26
1	39	322.5345334763168	281.7877821951405	20/04/28 05:15:26
1	39	322.8208495103458	281.8686298962356	20/04/28 05:15:26
1	39	322.74739217710123	281.6120812595202	20/04/28 05:15:26
1	39	322.956260325477	281.73579671835915	20/04/28 05:15:26
1	39	322.9136622508345	281.89307795382376	20/04/28 05:15:27
1	39	322.9136622508345	281.89307795382376	20/04/28 05:15:27
1	39	322.74488364485177	281.7490673193343	20/04/28 05:15:27
1	39	322.74488364485177	281.7490673193343	20/04/28 05:15:27
1	39	322.49997845966504	281.6851385501272	20/04/28 05:15:27
1	39	322.55899716865514	281.73125695032337	20/04/28 05:15:27
1	39	322.4587732077618	281.557768766299	20/04/28 05:15:27
1	39	322.55580568176686	281.7140991824705	20/04/28 05:15:27
1	39	322.55580568176686	281.7140991824705	20/04/28 05:15:27
1	39	322.47893155243406	281.5804214162505	20/04/28 05:15:28
1	39	322.57326814786194	281.600539665894	20/04/28 05:15:28
1	39	322.616433018377	281.3986962896428	20/04/28 05:15:28
1	39	322.82458050409514	281.2970018288891	20/04/28 05:15:28
1	39	322.65565902245436	281.2204057775545	20/04/28 05:15:28
1	39	322.4714406032515	281.25770330640256	20/04/28 05:15:28
1	39	322.538257492427	281.2501163345097	20/04/28 05:15:28
1	39	322.4983563492186	281.192488674581	20/04/28 05:15:28
1	39	322.6209209488901	281.30403051356643	20/04/28 05:15:28
1	39	322.6209209488901	281.30403051356643	20/04/28 05:15:28
1	39	322.6209209488901	281.30403051356643	20/04/28 05:15:29
1	39	322.49390956609307	281.1403052774816	20/04/28 05:15:29
1	39	322.35797363054525	280.9650757614347	20/04/28 05:15:29
1	39	322.2582510273773	280.83652738736686	20/04/28 05:15:29
1	4	322.2352133333333	281.04057668953806	20/04/28 05:15:29
1	4	322.2352133333333	281.2394258728832	20/04/28 05:15:29
1	4	322.2352133333333	281.435098680891	20/04/28 05:15:29
1	39	322.1238059443307	281.596723948757	20/04/28 05:15:29
1	39	321.94380523292523	281.7742795764359	20/04/28 05:15:29
1	39	321.7776338064529	281.9381937726589	20/04/28 05:15:30
1	39	321.5670977351295	282.1458699757194	20/04/28 05:15:30
1	39	321.3983413932782	282.3123339744905	20/04/28 05:15:30
1	39	321.1906306599032	282.51722321827225	20/04/28 05:15:30
1	39	321.0112290557782	282.6941878767911	20/04/28 05:15:30
1	39	320.82933251083597	282.8736135854878	20/04/28 05:15:30
1	39	320.6942610019117	283.00685031750584	20/04/28 05:15:30
1	39	320.53517039868194	283.1637798745821	20/04/28 05:15:30
1	39	320.53517039868194	283.1637798745821	20/04/28 05:15:30
1	39	320.3230616226284	283.373007419153	20/04/28 05:15:30
1	39	320.1132787819381	283.5799406232731	20/04/28 05:15:31
1	39	319.99286036418005	283.6987233079758	20/04/28 05:15:31
1	39	319.7905172609949	283.89831783408636	20/04/28 05:15:31
1	39	319.6402487478553	284.04654513809277	20/04/28 05:15:31
1	39	319.517651140725	284.1674774106154	20/04/28 05:15:31
1	39	319.3190268934159	284.363403596839	20/04/28 05:15:31
1	39	319.13668651338736	284.5432671116796	20/04/28 05:15:31
1	39	318.9971376489891	284.6809203799175	20/04/28 05:15:31
1	39	318.7928372009721	284.8824456627873	20/04/28 05:15:31
1	4	318.590093311859	285.08243553065205	20/04/28 05:15:31
1	4	318.3517585488367	285.0463634734486	20/04/28 05:15:32
1	4	318.351880904469	285.0365234642102	20/04/28 05:15:32
1	4	318.56389483532797	285.122285296645	20/04/28 05:15:32
1	4	318.782069727645	285.0203580282583	20/04/28 05:15:32
1	4	318.99414126350547	284.897921375246	20/04/28 05:15:32
1	4	318.7788423727574	284.9452224096316	20/04/28 05:15:32
1	4	318.8375445887424	285.03206387910825	20/04/28 05:15:32
1	4	318.8303355146804	285.0070994779357	20/04/28 05:15:32
1	4	318.71532615473603	285.16307804052224	20/04/28 05:15:32
1	4	318.74264493990137	285.2128531627058	20/04/28 05:15:33
1	4	318.58746568526783	285.4504295499412	20/04/28 05:15:33
1	4	318.41260412717804	285.33671742431846	20/04/28 05:15:33
1	4	318.3492815319525	285.28970457158437	20/04/28 05:15:33
1	4	318.31021603342117	285.3011228675359	20/04/28 05:15:33
1	4	318.28928206448694	285.275413309519	20/04/28 05:15:33
1	4	318.3137243680975	285.56736933603395	20/04/28 05:15:33
1	4	318.32085803889345	285.34397155521185	20/04/28 05:15:33
1	4	318.22703590841746	285.5964604343262	20/04/28 05:15:33
1	4	318.38788364243436	285.6852734684603	20/04/28 05:15:33
1	4	318.3782732048669	285.7518727259657	20/04/28 05:15:34
1	4	318.3060227606724	285.8618026236318	20/04/28 05:15:34
1	4	318.3913808041365	285.8903920782629	20/04/28 05:15:34
1	4	318.57645190924916	285.8337609469397	20/04/28 05:15:34
1	4	318.57901627663523	285.8339973365487	20/04/28 05:15:34
1	4	318.5030396557885	285.93269670448353	20/04/28 05:15:34
1	4	318.5765692236595	285.71169439651965	20/04/28 05:15:34
1	4	318.64749761519334	285.66727853346964	20/04/28 05:15:34
1	4	318.6973511865273	285.9221311468992	20/04/28 05:15:34
1	4	318.66474697283456	285.90053121481566	20/04/28 05:15:34
1	4	318.7500966486359	286.02529921662796	20/04/28 05:15:35
1	4	318.7296660852499	286.02134111527954	20/04/28 05:15:35
1	4	318.6330541993687	286.26553706046525	20/04/28 05:15:35
1	4	318.76789219825844	286.2261002986922	20/04/28 05:15:35
1	4	318.8301938275526	286.2423352285698	20/04/28 05:15:35
1	4	318.89100623303165	286.308677818355	20/04/28 05:15:35
1	4	318.9936280514464	286.51111131869897	20/04/28 05:15:35
1	4	318.7287318528686	286.45474573968403	20/04/28 05:15:35
1	4	318.67898460080426	286.4874304263661	20/04/28 05:15:35
1	4	318.6621560276722	286.49160369110973	20/04/28 05:15:36
1	4	318.7281436820121	286.4755351787682	20/04/28 05:15:36
1	4	318.91205508309	286.42160677480666	20/04/28 05:15:36
1	4	318.6391763365303	286.48753030810315	20/04/28 05:15:36
1	4	318.84596818662357	286.3195885098079	20/04/28 05:15:36
1	4	319.00170043268105	286.28792116448506	20/04/28 05:15:36
1	4	318.8476283769224	286.14481293681365	20/04/28 05:15:36
1	4	318.7388850355539	286.03745962397005	20/04/28 05:15:36
1	4	318.7943213082692	286.14804649516424	20/04/28 05:15:36
1	4	318.5484393221312	286.0168262395582	20/04/28 05:15:36
1	4	318.543636413616	286.0194465007691	20/04/28 05:15:37
1	4	318.6163454041515	286.04920505670754	20/04/28 05:15:37
1	4	318.8123283696809	286.08389801250485	20/04/28 05:15:37
1	4	318.957553277168	286.0197278496232	20/04/28 05:15:37
1	4	318.94110690654924	285.98400622877205	20/04/28 05:15:37
1	4	318.89866834089946	285.9804979625148	20/04/28 05:15:37
1	4	318.76499732396786	286.0016400395674	20/04/28 05:15:37
1	4	318.8749085791315	285.7734413043271	20/04/28 05:15:37
1	4	318.8650951866922	285.781957294595	20/04/28 05:15:37
1	4	318.8662657993634	285.66834156700287	20/04/28 05:15:37
1	4	318.89736675588	285.60508592288386	20/04/28 05:15:38
1	4	318.86080380842077	285.48992769494197	20/04/28 05:15:38
1	4	319.0319519891146	285.5184345808212	20/04/28 05:15:38
1	4	318.97753963506216	285.7272675451873	20/04/28 05:15:38
1	4	318.8302860282072	285.8031363171405	20/04/28 05:15:38
1	4	318.61137296385493	285.7763672202247	20/04/28 05:15:38
1	4	318.5246727423433	285.92380582043546	20/04/28 05:15:38
1	4	318.25350412344267	285.996740823744	20/04/28 05:15:38
1	4	318.18287045481117	286.0235347576882	20/04/28 05:15:38
1	4	318.16116151501296	286.02114331490213	20/04/28 05:15:39
1	4	317.93391797957145	286.20413290760456	20/04/28 05:15:39
1	4	317.8574024621559	285.9946368183087	20/04/28 05:15:39
1	4	317.7406070661647	286.183477121448	20/04/28 05:15:39
1	4	317.6707063461259	286.24568880161036	20/04/28 05:15:39
1	4	317.70947056623373	286.3225982113783	20/04/28 05:15:39
1	4	317.81950001697146	286.49118428395934	20/04/28 05:15:39
1	4	317.8295683009377	286.5672375526831	20/04/28 05:15:39
1	4	317.9029349401297	286.4744532077737	20/04/28 05:15:39
1	4	317.82928406316654	286.612812707223	20/04/28 05:15:39
1	4	317.8374201335864	286.5636612159919	20/04/28 05:15:40
1	4	317.80438957327135	286.699452697568	20/04/28 05:15:40
1	4	317.8818161536273	286.94742510092556	20/04/28 05:15:40
1	4	317.71287841315007	287.1292000028021	20/04/28 05:15:40
1	4	317.66441917298556	286.9784235832584	20/04/28 05:15:40
1	4	317.9480275188304	287.034976714504	20/04/28 05:15:40
1	4	317.852138491898	286.84822775210114	20/04/28 05:15:40
1	4	317.9344048126845	286.91562541336236	20/04/28 05:15:40
1	4	317.8042164015315	286.8663906459987	20/04/28 05:15:40
1	4	317.8258292576056	286.84707072359095	20/04/28 05:15:40
1	4	317.8317496991983	286.6007792383636	20/04/28 05:15:41
1	4	317.6222397372242	286.5445163530651	20/04/28 05:15:41
1	4	317.40884078384477	286.66497795987283	20/04/28 05:15:41
1	4	317.35632066102846	286.6988617300178	20/04/28 05:15:41
1	4	317.3633821167319	286.58558735457484	20/04/28 05:15:41
1	4	317.4258318237524	286.8695200670582	20/04/28 05:15:41
1	4	317.62060977181505	286.72176229688154	20/04/28 05:15:41
1	4	317.68666898061554	286.5751655521045	20/04/28 05:15:41
1	4	317.5732106295083	286.617333860462	20/04/28 05:15:41
1	4	317.6854936590621	286.63344631236066	20/04/28 05:15:42
1	4	317.69356844658444	286.58235581372764	20/04/28 05:15:42
1	4	317.61068737417355	286.7979290894641	20/04/28 05:15:42
1	4	317.6807886508536	286.5358659113694	20/04/28 05:15:42
1	4	317.7398223399992	286.5066327507667	20/04/28 05:15:42
1	4	317.98653040518235	286.55860549212053	20/04/28 05:15:42
1	4	318.10461801190087	286.7429291903159	20/04/28 05:15:42
1	4	318.11877002412405	286.75134940209347	20/04/28 05:15:42
1	4	318.11639873824663	286.7565953069006	20/04/28 05:15:42
1	4	318.2057838364666	286.9905726776575	20/04/28 05:15:42
1	4	318.2002506659828	286.9767619307634	20/04/28 05:15:43
1	4	318.3041927803579	286.81380923228795	20/04/28 05:15:43
1	4	318.4056482652333	286.81883135161627	20/04/28 05:15:43
1	4	318.35426165184657	286.5916345302015	20/04/28 05:15:43
1	4	318.4054862948159	286.58894819737833	20/04/28 05:15:43
1	4	318.41400295417355	286.6683501448091	20/04/28 05:15:43
1	4	318.41610359554335	286.89558241648115	20/04/28 05:15:43
1	4	318.29092909053225	286.8568235544514	20/04/28 05:15:43
1	4	318.4399360126609	286.8941215148924	20/04/28 05:15:43
1	4	318.5122595845734	287.0049268531567	20/04/28 05:15:43
1	4	318.5200402404514	287.00885064535225	20/04/28 05:15:44
1	4	318.75545476874896	286.9370666425943	20/04/28 05:15:44
1	4	318.71220027568734	286.89321986770443	20/04/28 05:15:44
1	4	318.61579362078146	286.9441774988874	20/04/28 05:15:44
1	4	318.64659296376664	286.94170971501126	20/04/28 05:15:44
1	4	318.63641270932095	286.95003652906723	20/04/28 05:15:44
1	4	318.6970837334405	287.19174694514095	20/04/28 05:15:44
1	4	318.501977108608	287.4061190626341	20/04/28 05:15:44
1	4	318.47248282543575	287.54837070455255	20/04/28 05:15:44
1	4	318.44461669510736	287.4914390350018	20/04/28 05:15:45
1	4	318.4325572479232	287.1983165844022	20/04/28 05:15:45
1	4	318.48208765521304	287.3068886166708	20/04/28 05:15:45
1	4	318.28099598981447	287.3337368759186	20/04/28 05:15:45
1	4	318.3323372377375	287.2956404555288	20/04/28 05:15:45
1	4	318.2684461519927	287.4682778199852	20/04/28 05:15:45
1	4	318.2697145048036	287.66363799642835	20/04/28 05:15:45
1	4	318.33794654930824	287.60204829805576	20/04/28 05:15:45
1	4	318.3163831752306	287.4938558245281	20/04/28 05:15:45
1	4	318.2748882217492	287.58918218139	20/04/28 05:15:45
1	4	318.17074163034283	287.3571399841268	20/04/28 05:15:46
1	4	318.3514030984288	287.1827642016161	20/04/28 05:15:46
1	4	318.349167869531	287.18240802824164	20/04/28 05:15:46
1	4	318.3442197332252	287.1628653247159	20/04/28 05:15:46
1	4	318.3448269106236	287.06363876094315	20/04/28 05:15:46
1	4	318.17685144988417	286.93440614951896	20/04/28 05:15:46
1	4	318.2075074139138	286.79555204103826	20/04/28 05:15:46
1	4	317.9516947197322	286.74147109150766	20/04/28 05:15:46
1	4	317.7477033378015	286.7101326261959	20/04/28 05:15:46
1	4	317.7171353567527	286.8301806195997	20/04/28 05:15:46
1	4	317.9017570824254	286.74381585880224	20/04/28 05:15:47
1	4	317.7986090694413	286.58094857123234	20/04/28 05:15:47
1	4	317.8283801413493	286.5341160766349	20/04/28 05:15:47
1	4	318.02841648089907	286.5299672077374	20/04/28 05:15:47
1	4	318.07131344576754	286.4286352249277	20/04/28 05:15:47
1	4	318.0842855858221	286.4701288785904	20/04/28 05:15:47
1	4	317.92802967426	286.5622719642266	20/04/28 05:15:47
1	4	317.8968136554146	286.82298031555564	20/04/28 05:15:47
1	4	317.89133706454203	286.84342320892273	20/04/28 05:15:47
1	4	317.825499686542	287.053317460793	20/04/28 05:15:48
1	4	317.825499686542	287.053317460793	20/04/28 05:15:48
1	4	317.825499686542	287.053317460793	20/04/28 05:15:48
1	4	317.6187050985636	287.0431300894668	20/04/28 05:15:48
1	4	317.48873758545597	287.1351761194644	20/04/28 05:15:48
1	4	317.3085474589143	287.0436905462791	20/04/28 05:15:48
1	4	317.50552150361364	286.89989762814145	20/04/28 05:15:48
1	4	317.5815433166569	286.90710824206303	20/04/28 05:15:48
1	4	317.6896088666013	286.80161233446313	20/04/28 05:15:48
1	4	317.7639911781226	286.7924967267267	20/04/28 05:15:48
1	4	317.8827354226299	286.5667395860283	20/04/28 05:15:49
1	4	317.6405162925584	286.563670035151	20/04/28 05:15:49
1	4	317.69988993107006	286.7937345520441	20/04/28 05:15:49
1	4	317.7841876077755	286.77611775274113	20/04/28 05:15:49
1	4	317.8576499005674	286.67070025906133	20/04/28 05:15:49
1	4	317.90975757029037	286.9460589187381	20/04/28 05:15:49
1	4	317.875627187781	286.914097277002	20/04/28 05:15:49
1	4	318.02556091310646	287.0971191976115	20/04/28 05:15:49
1	4	318.05610219914087	287.368151173687	20/04/28 05:15:49
1	4	318.11349581227995	287.3486344841561	20/04/28 05:15:49
1	4	317.992000554972	287.4804252879101	20/04/28 05:15:50
1	4	318.21480764395926	287.5583167147801	20/04/28 05:15:50
1	4	318.4188385096922	287.75860811740336	20/04/28 05:15:50
1	4	318.2922820200108	287.65544555375004	20/04/28 05:15:50
1	4	318.0600753081562	287.5483147900194	20/04/28 05:15:50
1	4	317.9749828774679	287.5148783696985	20/04/28 05:15:50
1	4	317.92168965761977	287.5295987075646	20/04/28 05:15:50
1	4	317.6442723252475	287.6411539685885	20/04/28 05:15:50
1	4	317.63755386389766	287.63715013535113	20/04/28 05:15:50
1	4	317.63726381170335	287.6362319496317	20/04/28 05:15:51
1	4	317.8596108204828	287.6510124579411	20/04/28 05:15:51
1	4	317.622512114016	287.6588859251809	20/04/28 05:15:51
1	4	317.8365546568918	287.59564630472084	20/04/28 05:15:51
1	4	317.94458953468126	287.7732856467031	20/04/28 05:15:51
1	4	318.01052940370107	287.7990172987781	20/04/28 05:15:51
1	4	318.0818709821948	287.7715205391515	20/04/28 05:15:51
1	4	317.90085821648114	287.73484529516503	20/04/28 05:15:51
1	4	318.0075239107869	288.012904985389	20/04/28 05:15:51
1	4	318.067600843376	288.0900052255669	20/04/28 05:15:51
1	4	318.10524897642466	288.09198818234535	20/04/28 05:15:52
1	4	318.06849252883535	287.86656224749044	20/04/28 05:15:52
1	4	318.2365754329506	287.88989444882066	20/04/28 05:15:52
1	4	317.97506623803037	287.9420766468264	20/04/28 05:15:52
1	4	317.9892905008879	287.6504867115662	20/04/28 05:15:52
1	4	317.9862779668228	287.70735981868035	20/04/28 05:15:52
1	4	317.97798076553374	287.606393463533	20/04/28 05:15:52
1	4	318.10101072962743	287.56673474744485	20/04/28 05:15:52
1	4	318.3461232747337	287.55528973296265	20/04/28 05:15:52
1	4	318.2655363109756	287.7077919334686	20/04/28 05:15:52
1	4	318.21599905498084	287.65940572247877	20/04/28 05:15:53
1	4	318.37258736247327	287.80974143118897	20/04/28 05:15:53
1	4	318.29678102736284	287.9259275759101	20/04/28 05:15:53
1	4	318.19691967062704	287.88380550001534	20/04/28 05:15:53
1	4	318.02490628743556	287.93232429710696	20/04/28 05:15:53
1	4	318.11008020108216	287.9509541056215	20/04/28 05:15:53
1	4	318.12435231364515	287.8950821724255	20/04/28 05:15:53
1	4	318.00010134655616	288.05264332977765	20/04/28 05:15:53
1	4	318.0125723437491	288.1175068880152	20/04/28 05:15:53
1	4	318.17045053624975	288.0551287781749	20/04/28 05:15:54
1	4	318.30828928035845	287.9347806517415	20/04/28 05:15:54
1	4	318.2660533490794	287.95475288713385	20/04/28 05:15:54
1	4	318.26276249933795	287.96926271560164	20/04/28 05:15:54
1	4	318.2169971581454	287.85716759653894	20/04/28 05:15:54
1	4	318.33702859339314	287.9592075282334	20/04/28 05:15:54
1	4	318.33702859339314	287.9592075282334	20/04/28 05:15:54
1	4	318.33702859339314	287.9592075282334	20/04/28 05:15:54
1	4	318.11975963863205	287.7757677301964	20/04/28 05:15:54
1	4	318.1937787229492	287.9206228055235	20/04/28 05:15:54
1	4	318.4070129187277	288.03614967741026	20/04/28 05:15:55
1	4	318.3930541254072	288.02088986025547	20/04/28 05:15:55
1	4	318.3433483191085	287.9329256286396	20/04/28 05:15:55
1	4	318.0969097003047	287.80370672906986	20/04/28 05:15:55
1	4	318.06200200892596	287.80223333439	20/04/28 05:15:55
1	4	318.1106698894482	287.7169225941683	20/04/28 05:15:55
1	4	318.2841228287642	287.5549364768072	20/04/28 05:15:55
1	4	318.1030003963714	287.3321298274557	20/04/28 05:15:55
1	4	318.1049538343036	287.32556676993056	20/04/28 05:15:55
1	4	318.12375669201924	287.35294941964185	20/04/28 05:15:55
1	4	317.9257238854898	287.4780118148693	20/04/28 05:15:56
1	4	317.9304186128498	287.44280471697476	20/04/28 05:15:56
1	4	318.02776802223264	287.4425196524076	20/04/28 05:15:56
1	4	318.02776802223264	287.4425196524076	20/04/28 05:15:56
1	4	317.9192271399127	287.6147916226554	20/04/28 05:15:56
1	4	317.97138461268923	287.8081134208456	20/04/28 05:15:56
1	4	318.0567781524789	287.666915821037	20/04/28 05:15:56
1	4	317.883428939802	287.4383216950556	20/04/28 05:15:56
1	4	317.79349403171375	287.6340869735851	20/04/28 05:15:56
1	4	317.7815477269961	287.48025402734254	20/04/28 05:15:57
1	4	317.68131666253504	287.6841727773602	20/04/28 05:15:57
1	4	317.689632494077	287.6719369875393	20/04/28 05:15:57
1	4	317.45396350414643	287.7229038509055	20/04/28 05:15:57
1	4	317.45396350414643	287.7229038509055	20/04/28 05:15:57
1	4	317.33902649425704	287.49222764430675	20/04/28 05:15:57
1	4	317.18713074304907	287.4033049622135	20/04/28 05:15:57
1	4	317.3953490818779	287.59396254557345	20/04/28 05:15:57
1	4	317.4017862103978	287.4656601606112	20/04/28 05:15:57
1	4	317.52236453720576	287.73412188630124	20/04/28 05:15:57
1	4	317.63024327114886	287.7218430982892	20/04/28 05:15:58
1	4	317.6958058045415	287.67279600072675	20/04/28 05:15:58
1	4	317.61593290976435	287.95641784637075	20/04/28 05:15:58
1	4	317.7439645542359	287.7475304055675	20/04/28 05:15:58
1	4	317.85075272734116	287.5119054608857	20/04/28 05:15:58
1	4	317.8413347177533	287.5176575943786	20/04/28 05:15:58
1	4	318.0023238951747	287.71456914183585	20/04/28 05:15:58
1	4	317.932249484245	287.6596678532968	20/04/28 05:15:58
1	4	318.0258200981143	287.8704618959932	20/04/28 05:15:58
1	4	317.901419796835	288.1244893212791	20/04/28 05:15:58
1	4	317.79286134029627	288.1781836234489	20/04/28 05:15:59
1	4	317.8912499879198	288.15144650505675	20/04/28 05:15:59
1	4	317.84905566133307	288.09552001856105	20/04/28 05:15:59
1	4	317.7916112624097	288.07027038905255	20/04/28 05:15:59
1	4	317.737977705349	288.1913172276607	20/04/28 05:15:59
1	4	317.5387600293316	288.03720517808597	20/04/28 05:15:59
1	4	317.4529278052376	287.9176815108206	20/04/28 05:15:59
1	4	317.49035033350754	287.8940596562511	20/04/28 05:15:59
1	4	317.5187601903819	287.9696859163488	20/04/28 05:15:59
1	4	317.5191387972842	287.9699822563547	20/04/28 05:15:59
1	4	317.6428756831718	288.199229024498	20/04/28 05:16:00
1	4	317.51114050213164	288.197224736411	20/04/28 05:16:00
1	4	317.362034525572	288.3446437220981	20/04/28 05:16:00
1	4	317.3630704371181	288.34001649062935	20/04/28 05:16:00
1	4	317.5116563060485	288.28618072270535	20/04/28 05:16:00
1	4	317.7546137999205	288.3553607494397	20/04/28 05:16:00
1	4	317.72283413721834	288.36919911270047	20/04/28 05:16:00
1	4	317.75564860829354	288.38167707805434	20/04/28 05:16:00
1	4	317.9769100581626	288.47347180174523	20/04/28 05:16:00
1	4	317.97423148821923	288.56243891163166	20/04/28 05:16:01
1	4	317.9154724045807	288.70291265440153	20/04/28 05:16:01
1	4	317.9193559187325	288.698515814518	20/04/28 05:16:01
1	4	317.9025904486986	288.407434259554	20/04/28 05:16:01
1	4	318.08928898006246	288.3878930291789	20/04/28 05:16:01
1	4	318.1538361525265	288.17392989645066	20/04/28 05:16:01
1	4	318.36857908460024	288.31677132490637	20/04/28 05:16:01
1	4	318.10152243433015	288.32584041973365	20/04/28 05:16:01
1	4	317.93908195739533	288.2074152424223	20/04/28 05:16:01
1	4	317.98084956674114	288.0607786262087	20/04/28 05:16:01
1	4	318.02762794904436	288.10104475981746	20/04/28 05:16:02
1	4	317.81112127187504	288.0890924786943	20/04/28 05:16:02
1	4	317.8730937950421	287.983793595294	20/04/28 05:16:02
1	4	317.6804411089051	288.034222176883	20/04/28 05:16:02
1	4	317.5486289144639	287.9743897666185	20/04/28 05:16:02
1	4	317.2769899044778	288.00395227601217	20/04/28 05:16:02
1	4	317.2364700463251	287.9352102291097	20/04/28 05:16:02
1	4	317.30472687691673	287.9235312409751	20/04/28 05:16:02
1	4	317.0480239299122	287.9757692784266	20/04/28 05:16:02
1	4	316.96014771698003	287.7915741698911	20/04/28 05:16:02
1	4	316.9521134814867	287.81332522862704	20/04/28 05:16:03
1	4	316.97007183349746	287.8680717739767	20/04/28 05:16:03
1	4	317.1767934695142	287.95194901214455	20/04/28 05:16:03
1	4	317.16247555384876	288.2147795299089	20/04/28 05:16:03
1	4	317.0885754604174	288.1402995883845	20/04/28 05:16:03
1	4	317.269946781224	288.26809484209	20/04/28 05:16:03
1	4	317.5238983777029	288.36922979088104	20/04/28 05:16:03
1	4	317.80614122022484	288.44571424748364	20/04/28 05:16:03
1	4	317.84818034265686	288.433129134437	20/04/28 05:16:03
1	4	317.82242506477115	288.5414056752916	20/04/28 05:16:04
1	4	317.92470571713324	288.6120842001867	20/04/28 05:16:04
1	4	318.0312842621182	288.714223163848	20/04/28 05:16:04
1	4	317.9976973707064	288.7105411531872	20/04/28 05:16:04
1	4	318.25061561182724	288.63839802391914	20/04/28 05:16:04
1	4	318.3986807188822	288.5843132291803	20/04/28 05:16:04
1	4	318.50209568262846	288.47170386834705	20/04/28 05:16:04
1	4	318.3405883496379	288.6203570957398	20/04/28 05:16:04
1	4	318.3405883496379	288.6203570957398	20/04/28 05:16:04
1	4	318.69653136418816	288.70116619075804	20/04/28 05:16:04
1	4	318.9846314140062	288.66352800042233	20/04/28 05:16:05
1	4	318.8753276314366	288.62497093731037	20/04/28 05:16:05
1	4	318.8753276314366	288.62497093731037	20/04/28 05:16:05
1	4	318.97714666993403	288.59958623581826	20/04/28 05:16:05
1	4	319.01704984718094	288.37555982137644	20/04/28 05:16:05
1	4	319.0029212821207	288.3213921474831	20/04/28 05:16:05
1	4	318.83382189317973	288.433341290967	20/04/28 05:16:05
1	4	318.83382189317973	288.433341290967	20/04/28 05:16:05
1	4	318.69266843466187	288.3125815672108	20/04/28 05:16:05
1	4	318.5544213488786	288.3213910703449	20/04/28 05:16:06
1	4	318.5544213488786	288.3213910703449	20/04/28 05:16:06
1	4	318.6260421082529	288.29082409307915	20/04/28 05:16:06
1	4	318.647916192927	288.31086905925963	20/04/28 05:16:06
1	4	318.58972687599	288.3133471847218	20/04/28 05:16:06
1	4	318.735761557421	288.38549161731015	20/04/28 05:16:06
1	4	318.7332886344906	288.3551142150664	20/04/28 05:16:06
1	4	318.79297068194234	288.3977220806015	20/04/28 05:16:06
1	4	318.90701976052776	288.2040405110043	20/04/28 05:16:06
1	4	318.8632135782398	288.21929465389326	20/04/28 05:16:06
1	4	318.9664264657939	288.0115164497028	20/04/28 05:16:07
1	4	319.1871275661261	288.02426072612667	20/04/28 05:16:07
1	4	319.00565550618796	287.8712088285432	20/04/28 05:16:07
1	4	318.9222343844723	287.77533521112707	20/04/28 05:16:07
1	4	318.8996024856137	287.805801919895	20/04/28 05:16:07
1	4	319.1415281318396	287.77263257084576	20/04/28 05:16:07
1	4	319.17014048284597	287.7645758271662	20/04/28 05:16:07
1	4	319.2942603112241	287.84157300825115	20/04/28 05:16:07
1	4	319.3872200241064	287.7493154378524	20/04/28 05:16:07
1	4	319.36150311885814	287.72472010482585	20/04/28 05:16:08
1	4	319.4740969450159	287.45197719034223	20/04/28 05:16:08
1	4	319.3607784595984	287.51369700831964	20/04/28 05:16:08
1	4	319.35203925747436	287.37159957157724	20/04/28 05:16:08
1	4	319.3546449876098	287.36980793469485	20/04/28 05:16:08
1	4	319.2004475879141	287.4262061452115	20/04/28 05:16:08
1	4	319.18731294351613	287.4722432442476	20/04/28 05:16:08
1	4	319.12760888036536	287.50912799580306	20/04/28 05:16:08
1	4	318.9758587070903	287.7281011113413	20/04/28 05:16:08
1	4	319.0256259719942	287.710387176385	20/04/28 05:16:08
1	4	319.02657579698	287.710006813263	20/04/28 05:16:09
1	4	319.1103361187343	287.57855693543104	20/04/28 05:16:09
1	4	319.2441977541376	287.4267796836335	20/04/28 05:16:09
1	4	319.19297012217504	287.30725480204757	20/04/28 05:16:09
1	4	319.1695812388376	287.2247566175946	20/04/28 05:16:09
1	4	319.27623557890666	287.07226925341377	20/04/28 05:16:09
1	4	319.2535019783669	287.107130397253	20/04/28 05:16:09
1	4	319.42912660035506	286.877680330376	20/04/28 05:16:09
1	4	319.4303174594919	286.91110136450106	20/04/28 05:16:09
1	4	319.6196529973092	286.8281168352089	20/04/28 05:16:09
1	4	319.3871779649423	286.9700520447031	20/04/28 05:16:10
1	4	319.5238089159773	286.79804193840846	20/04/28 05:16:10
1	4	319.7175169696722	286.7193511298167	20/04/28 05:16:10
1	4	319.47281611141733	286.5584513061063	20/04/28 05:16:10
1	4	319.4270517659456	286.36456402293305	20/04/28 05:16:10
1	4	319.57843032874024	286.3116282412961	20/04/28 05:16:10
1	4	319.5598863984851	286.07876973449436	20/04/28 05:16:10
1	4	319.5696419101588	286.0707296417029	20/04/28 05:16:10
1	4	319.8435515715561	286.06299837722685	20/04/28 05:16:10
1	4	319.8002828901426	286.13821915074124	20/04/28 05:16:10
1	4	319.68548592317353	286.12339212156866	20/04/28 05:16:11
1	4	319.6957660192767	286.1134490715333	20/04/28 05:16:11
1	4	319.7488511267641	286.0438523653303	20/04/28 05:16:11
1	4	319.75744939033757	285.9925325986659	20/04/28 05:16:11
1	4	319.9811254684531	285.8179486156881	20/04/28 05:16:11
1	4	320.005143679118	286.0895187156261	20/04/28 05:16:11
1	4	319.8131027979226	286.2280027619666	20/04/28 05:16:11
1	4	319.8131027979226	286.2280027619666	20/04/28 05:16:11
1	4	319.8131027979226	286.2280027619666	20/04/28 05:16:11
1	4	319.8186027913248	285.93960474146974	20/04/28 05:16:12
1	4	319.82363467746615	285.6757524244898	20/04/28 05:16:12
1	4	319.82747140556984	285.47456949400566	20/04/28 05:16:12
1	4	319.8331270537881	285.1780095472021	20/04/28 05:16:12
1	4	319.8362089593574	285.01640654142244	20/04/28 05:16:12
1	4	319.8398509987131	284.825432323102	20/04/28 05:16:12
1	4	319.84393639120475	284.6112104102019	20/04/28 05:16:12
1	4	319.8477841311127	284.40945006401853	20/04/28 05:16:12
1	4	319.8517390500776	284.20206966966316	20/04/28 05:16:12
1	4	319.8571301520078	283.9193814896444	20/04/28 05:16:12
1	4	319.8619753722566	283.66531719784473	20/04/28 05:16:13
1	4	319.8658816997292	283.4604847502179	20/04/28 05:16:13
1	4	319.8688783238403	283.30335356866533	20/04/28 05:16:13
1	4	319.8737952236656	283.0455306818178	20/04/28 05:16:13
1	4	319.8737952236656	283.0455306818178	20/04/28 05:16:13
1	4	319.87772615299116	282.83940820978586	20/04/28 05:16:13
1	4	319.88221691459256	282.60393033524014	20/04/28 05:16:13
1	4	319.8873985931531	282.33222349299007	20/04/28 05:16:13
1	4	319.8909362730627	282.14672147353616	20/04/28 05:16:13
1	4	319.8940477428015	281.9835682389984	20/04/28 05:16:14
1	4	319.89721164450475	281.8176656784769	20/04/28 05:16:14
1	4	319.90177271006337	281.57850134094593	20/04/28 05:16:14
1	4	319.9067862996569	281.3156084229675	20/04/28 05:16:14
1	4	319.9103028902509	281.1312122442749	20/04/28 05:16:14
1	4	319.9138837947005	280.94344369996116	20/04/28 05:16:14
1	4	319.9138837947005	280.94344369996116	20/04/28 05:16:14
1	4	319.9204284799248	280.60026614947327	20/04/28 05:16:14
1	4	319.9242595527138	280.3993797614473	20/04/28 05:16:14
1	4	319.92894231864597	280.15383393501793	20/04/28 05:16:14
1	4	319.9336304899937	279.9080046698595	20/04/28 05:16:15
1	4	319.9369237365734	279.735319772777	20/04/28 05:16:15
1	4	319.9369237365734	279.735319772777	20/04/28 05:16:15
1	4	319.94091734573226	279.52591061683296	20/04/28 05:16:15
1	4	319.9482912964501	279.1392496456728	20/04/28 05:16:15
1	4	319.9482912964501	279.1392496456728	20/04/28 05:16:15
1	4	320.1229598192186	278.9334455623412	20/04/28 05:16:15
1	4	320.25464778354643	278.82226341019714	20/04/28 05:16:15
1	4	320.07164671988215	278.77040603496573	20/04/28 05:16:15
1	4	320.0814166589684	278.8365202841976	20/04/28 05:16:15
1	4	319.8629082044121	278.8131313598019	20/04/28 05:16:16
1	4	319.8602183228001	278.56358566812486	20/04/28 05:16:16
1	4	319.6836997680378	278.670960153349	20/04/28 05:16:16
1	4	319.6315500898513	278.4759384679281	20/04/28 05:16:16
1	4	319.7640066246175	278.6107816763253	20/04/28 05:16:16
1	4	319.7266190036169	278.46431525475896	20/04/28 05:16:16
1	4	319.49920306847906	278.31243266834576	20/04/28 05:16:16
1	4	319.7081213552135	278.34269298502295	20/04/28 05:16:16
1	4	319.47957288628845	278.52918753080075	20/04/28 05:16:16
1	4	319.45727342772153	278.5685812638087	20/04/28 05:16:17
1	4	319.42132820999296	278.4142818730154	20/04/28 05:16:17
1	4	319.45805934681914	278.15512590063673	20/04/28 05:16:17
1	4	319.2890720924067	278.1596183045067	20/04/28 05:16:17
1	4	319.2876914872725	278.16747706674226	20/04/28 05:16:17
1	4	319.10538585626267	278.1154194676243	20/04/28 05:16:17
1	4	319.14213061499163	278.10975721413655	20/04/28 05:16:17
1	4	319.2476076080336	278.0054554000618	20/04/28 05:16:17
1	4	318.9968001136737	278.0026007389649	20/04/28 05:16:17
1	4	319.16497219018936	277.85193634285855	20/04/28 05:16:17
1	4	319.0394943166396	277.6030500133488	20/04/28 05:16:18
1	4	319.073886225632	277.60058926926155	20/04/28 05:16:18
1	4	318.8645436038405	277.69871572179693	20/04/28 05:16:18
1	4	319.0627585020378	277.79242156297425	20/04/28 05:16:18
1	4	319.03003121479117	277.8471599355225	20/04/28 05:16:18
1	4	319.2753582207465	277.9351371431221	20/04/28 05:16:18
1	4	319.1483887495839	277.9028221594465	20/04/28 05:16:18
1	4	319.14510236090837	277.8789445095012	20/04/28 05:16:18
1	4	319.126378863431	277.85288638055397	20/04/28 05:16:18
1	4	319.18717737316877	277.93753871996626	20/04/28 05:16:18
1	4	319.0409873329021	278.17948453745885	20/04/28 05:16:19
1	4	319.1163966284747	277.9295505167094	20/04/28 05:16:19
1	4	318.80653293398933	278.00739826971113	20/04/28 05:16:19
1	4	318.737003207576	278.09943693299783	20/04/28 05:16:19
1	4	318.66532349922164	278.0969626146166	20/04/28 05:16:19
1	4	318.84605481426183	278.1254831601932	20/04/28 05:16:19
1	4	318.918643990511	278.1175847970859	20/04/28 05:16:19
1	4	318.8325644678876	278.04843920849885	20/04/28 05:16:19
1	4	318.8284486788965	278.08269283380656	20/04/28 05:16:19
1	4	318.79036036367864	278.2546874629203	20/04/28 05:16:20
1	4	319.0432767949796	278.22786909183725	20/04/28 05:16:20
1	4	319.0844038866251	278.1625171259229	20/04/28 05:16:20
1	4	319.133804976868	277.9694397423253	20/04/28 05:16:20
1	4	319.1348890933776	278.0286311173412	20/04/28 05:16:20
1	4	319.0864413709886	278.20480203192903	20/04/28 05:16:20
1	4	319.00410103184	278.20655879235466	20/04/28 05:16:20
1	4	319.08804969983106	278.25228416808704	20/04/28 05:16:20
1	4	319.1035266467065	277.9640491887148	20/04/28 05:16:20
1	4	319.1035266467065	277.9640491887148	20/04/28 05:16:20
1	4	319.2969877250288	278.43343320531454	20/04/28 05:16:21
1	4	319.2405753807356	278.4682316816267	20/04/28 05:16:21
1	4	319.22714306519947	278.48462424212016	20/04/28 05:16:21
1	4	319.181257822118	278.5013505248577	20/04/28 05:16:21
1	4	319.18822848150626	278.3735206000464	20/04/28 05:16:21
1	4	319.1143381135933	278.4085907355523	20/04/28 05:16:21
1	4	319.17532046381655	278.5036367437312	20/04/28 05:16:21
1	4	319.0497502617731	278.2516508313938	20/04/28 05:16:21
1	4	319.1785051920034	278.23640569856224	20/04/28 05:16:21
1	4	319.3170925502821	278.19136080440745	20/04/28 05:16:21
1	4	319.2611621513495	278.1444589012811	20/04/28 05:16:22
1	4	319.20932026065776	278.4336635856941	20/04/28 05:16:22
1	4	319.1537774522807	278.3759313297423	20/04/28 05:16:22
1	4	319.2395905016361	278.5056114925102	20/04/28 05:16:22
1	4	319.120677593665	278.46273875700325	20/04/28 05:16:22
1	4	319.0299002575282	278.5572962401636	20/04/28 05:16:22
1	4	318.89679617386344	278.5141484614918	20/04/28 05:16:22
1	4	318.96407387940286	278.5942369407877	20/04/28 05:16:22
1	4	318.97105716878815	278.79069946550084	20/04/28 05:16:22
1	4	318.93224154932045	278.87771870595066	20/04/28 05:16:23
1	4	318.99720763655563	279.0275373334658	20/04/28 05:16:23
1	4	319.0163517978383	279.0675779980815	20/04/28 05:16:23
1	4	319.0163517978383	279.0675779980815	20/04/28 05:16:23
1	4	319.3068394819963	279.0243303857003	20/04/28 05:16:23
1	4	319.36623746667595	278.81333435913535	20/04/28 05:16:23
1	4	319.5474814083916	278.7330794918053	20/04/28 05:16:23
1	4	319.5640096414215	278.5676546918198	20/04/28 05:16:23
1	4	319.57179045773563	278.35127835591703	20/04/28 05:16:23
1	4	319.36313136241074	278.4166557064186	20/04/28 05:16:23
1	4	319.31664805577	278.4000276750368	20/04/28 05:16:24
1	4	319.42803127947263	278.38182430792386	20/04/28 05:16:24
1	4	319.3692138430038	278.39157863591447	20/04/28 05:16:24
1	4	319.44757504570475	278.406329337063	20/04/28 05:16:24
1	4	319.46685578042315	278.37014766068427	20/04/28 05:16:24
1	4	319.4754770193439	278.17626707173025	20/04/28 05:16:24
1	4	319.4066647800106	277.90581992948194	20/04/28 05:16:24
1	4	319.6304050942775	278.07563344603057	20/04/28 05:16:24
1	4	319.81298400513674	277.971177491073	20/04/28 05:16:24
1	4	319.63138794119203	278.1281339919425	20/04/28 05:16:24
1	4	319.6076379612227	278.1099637807238	20/04/28 05:16:25
1	4	319.61846964025074	278.0801990929612	20/04/28 05:16:25
1	4	319.58530374300693	277.79146868037094	20/04/28 05:16:25
1	4	319.60098330068814	278.001351463464	20/04/28 05:16:25
1	4	319.51414362230105	278.0038160475582	20/04/28 05:16:25
1	4	319.2955777437587	278.07103133683023	20/04/28 05:16:25
1	4	319.3797783454996	278.34022621753894	20/04/28 05:16:25
1	4	319.3210136240072	278.12375262246303	20/04/28 05:16:25
1	4	319.52287720746347	278.1452707013269	20/04/28 05:16:25
1	4	319.3853454657642	278.071997481879	20/04/28 05:16:26
1	4	319.4838806330538	278.27686326414585	20/04/28 05:16:26
1	4	319.4963702136376	278.42505199882885	20/04/28 05:16:26
1	4	319.52211605819014	278.4361801266125	20/04/28 05:16:26
1	4	319.534120043544	278.4084448515273	20/04/28 05:16:26
1	4	319.5843988716448	278.45509687940984	20/04/28 05:16:26
1	4	319.6437855170949	278.3054504640508	20/04/28 05:16:26
1	4	319.59614875494947	278.284223953389	20/04/28 05:16:26
1	4	319.58098831135106	278.3033770305676	20/04/28 05:16:26
1	4	319.83151435179474	278.25420106618424	20/04/28 05:16:26
1	4	319.77388879474785	278.30752193665893	20/04/28 05:16:27
1	4	319.8253791104663	278.33841752448734	20/04/28 05:16:27
1	4	320.01622550152024	278.5228195457947	20/04/28 05:16:27
1	4	320.15546171082553	278.32646686446077	20/04/28 05:16:27
1	4	320.0800404073218	278.29630599970795	20/04/28 05:16:27
1	4	320.10228634561497	278.2981694640665	20/04/28 05:16:27
1	4	320.0379580621841	278.4731863263227	20/04/28 05:16:27
1	4	319.78494356238383	278.6040927778692	20/04/28 05:16:27
1	4	320.0193288859519	278.52842163487827	20/04/28 05:16:27
1	4	320.1734448046227	278.6547748441967	20/04/28 05:16:27
1	4	320.11292559273153	278.38331702021634	20/04/28 05:16:28
1	4	320.10710680603444	278.3669879347813	20/04/28 05:16:28
1	4	320.1913760128753	278.5103233818163	20/04/28 05:16:28
1	4	320.1804508756045	278.5970797375609	20/04/28 05:16:28
1	4	320.1811283513126	278.76299828566783	20/04/28 05:16:28
1	4	320.2353041076938	278.7260725257135	20/04/28 05:16:28
1	4	320.30110086064974	278.708619046366	20/04/28 05:16:28
1	4	320.4273244107731	278.45836075703033	20/04/28 05:16:28
1	4	320.5149847454639	278.4652834897446	20/04/28 05:16:28
1	4	320.5672163186054	278.5385595038475	20/04/28 05:16:28
1	4	320.796910815238	278.5855039433414	20/04/28 05:16:29
1	4	321.00649636750825	278.658769008499	20/04/28 05:16:29
1	4	320.93495016648137	278.7623128850118	20/04/28 05:16:29
1	4	320.9594019142678	278.8446403794163	20/04/28 05:16:29
1	4	321.1206012812358	278.65820338892837	20/04/28 05:16:29
1	4	320.9730211829986	278.58266357913135	20/04/28 05:16:29
1	4	320.9730211829986	278.58266357913135	20/04/28 05:16:29
1	4	321.0571220792475	278.80416580081027	20/04/28 05:16:29
1	4	321.0064185816538	278.73433246948116	20/04/28 05:16:29
1	4	321.1305348765685	278.9286591115523	20/04/28 05:16:30
1	4	321.1020767395507	278.9674532523601	20/04/28 05:16:30
1	4	321.11682151640326	279.04601071822964	20/04/28 05:16:30
1	4	321.20140821402157	278.98922855865175	20/04/28 05:16:30
1	4	321.1240497012118	279.15859769495677	20/04/28 05:16:30
1	4	320.9551435691085	279.2217354012515	20/04/28 05:16:30
1	4	320.9465477859925	279.21998106341334	20/04/28 05:16:30
1	4	320.9465477859925	279.21998106341334	20/04/28 05:16:30
1	4	320.9490591997406	279.2281578559484	20/04/28 05:16:30
1	4	321.0065575343464	279.3393135531258	20/04/28 05:16:30
1	4	320.8594270646721	279.15231413971804	20/04/28 05:16:31
1	4	320.8566639584741	279.1654827496922	20/04/28 05:16:31
1	4	320.8452005279554	278.9941823189635	20/04/28 05:16:31
1	4	320.84320869706113	278.9586527585771	20/04/28 05:16:31
1	4	320.8304245353538	278.96749422049476	20/04/28 05:16:31
1	4	320.88297301437484	278.84090995453187	20/04/28 05:16:31
1	4	320.8943554184633	278.88929990247874	20/04/28 05:16:31
1	4	321.0098484495824	278.94622704189374	20/04/28 05:16:31
1	4	320.9100424127908	279.08003421664455	20/04/28 05:16:31
1	4	320.92706763022943	279.18345054945166	20/04/28 05:16:32
1	4	320.92706763022943	279.18345054945166	20/04/28 05:16:32
