stationId	t_start	t_end	t_max	timeStamp
34	20/04/28 05:11:37	20/04/28 05:11:37	20/04/28 05:11:37
29	20/04/28 05:11:39	20/04/28 05:11:39	20/04/28 05:11:39
110	20/04/28 05:11:41	20/04/28 05:11:41	20/04/28 05:11:41
55	20/04/28 05:11:43	20/04/28 05:11:43	20/04/28 05:11:43
33	20/04/28 05:11:45	20/04/28 05:11:45	20/04/28 05:11:45
55	20/04/28 05:11:47	20/04/28 05:11:48	20/04/28 05:11:48
45	20/04/28 05:11:50	20/04/28 05:11:50	20/04/28 05:11:50
55	20/04/28 05:11:52	20/04/28 05:11:53	20/04/28 05:11:52
135	20/04/28 05:11:55	20/04/28 05:11:55	20/04/28 05:11:55
55	20/04/28 05:11:57	20/04/28 05:11:57	20/04/28 05:11:57
29	20/04/28 05:11:59	20/04/28 05:11:59	20/04/28 05:11:59
135	20/04/28 05:12:01	20/04/28 05:12:01	20/04/28 05:12:01
135	20/04/28 05:12:03	20/04/28 05:12:03	20/04/28 05:12:03
55	20/04/28 05:12:05	20/04/28 05:12:06	20/04/28 05:12:05
33	20/04/28 05:12:08	20/04/28 05:12:08	20/04/28 05:12:08
83	20/04/28 05:12:10	20/04/28 05:12:10	20/04/28 05:12:10
108	20/04/28 05:12:12	20/04/28 05:12:12	20/04/28 05:12:12
111	20/04/28 05:12:14	20/04/28 05:12:14	20/04/28 05:12:14
89	20/04/28 05:12:16	20/04/28 05:12:16	20/04/28 05:12:16
30	20/04/28 05:12:18	20/04/28 05:12:18	20/04/28 05:12:18
44	20/04/28 05:12:20	20/04/28 05:12:20	20/04/28 05:12:20
35	20/04/28 05:12:22	20/04/28 05:12:22	20/04/28 05:12:22
32	20/04/28 05:12:24	20/04/28 05:12:24	20/04/28 05:12:24
109	20/04/28 05:12:26	20/04/28 05:12:26	20/04/28 05:12:26
5	20/04/28 05:12:28	20/04/28 05:12:28	20/04/28 05:12:28
10	20/04/28 05:12:30	20/04/28 05:12:31	20/04/28 05:12:31
62	20/04/28 05:12:33	20/04/28 05:12:33	20/04/28 05:12:33
28	20/04/28 05:12:35	20/04/28 05:12:35	20/04/28 05:12:35
11	20/04/28 05:12:37	20/04/28 05:12:37	20/04/28 05:12:37
23	20/04/28 05:12:39	20/04/28 05:12:39	20/04/28 05:12:39
67	20/04/28 05:12:41	20/04/28 05:12:41	20/04/28 05:12:41
66	20/04/28 05:12:43	20/04/28 05:12:44	20/04/28 05:12:44
117	20/04/28 05:12:46	20/04/28 05:12:46	20/04/28 05:12:46
68	20/04/28 05:12:48	20/04/28 05:12:48	20/04/28 05:12:48
100	20/04/28 05:12:50	20/04/28 05:12:50	20/04/28 05:12:50
67	20/04/28 05:12:52	20/04/28 05:12:52	20/04/28 05:12:52
125	20/04/28 05:12:54	20/04/28 05:12:54	20/04/28 05:12:54
98	20/04/28 05:12:56	20/04/28 05:12:56	20/04/28 05:12:56
95	20/04/28 05:12:58	20/04/28 05:12:58	20/04/28 05:12:58
6	20/04/28 05:13:00	20/04/28 05:13:00	20/04/28 05:13:00
87	20/04/28 05:13:02	20/04/28 05:13:02	20/04/28 05:13:02
91	20/04/28 05:13:04	20/04/28 05:13:04	20/04/28 05:13:04
142	20/04/28 05:13:06	20/04/28 05:13:06	20/04/28 05:13:06
108	20/04/28 05:13:08	20/04/28 05:13:08	20/04/28 05:13:08
126	20/04/28 05:13:10	20/04/28 05:13:10	20/04/28 05:13:10
151	20/04/28 05:13:12	20/04/28 05:13:12	20/04/28 05:13:12
11	20/04/28 05:13:14	20/04/28 05:13:14	20/04/28 05:13:14
11	20/04/28 05:13:16	20/04/28 05:13:16	20/04/28 05:13:16
79	20/04/28 05:13:18	20/04/28 05:13:18	20/04/28 05:13:18
89	20/04/28 05:13:20	20/04/28 05:13:21	20/04/28 05:13:21
39	20/04/28 05:13:23	20/04/28 05:13:23	20/04/28 05:13:23
79	20/04/28 05:13:25	20/04/28 05:13:25	20/04/28 05:13:25
151	20/04/28 05:13:27	20/04/28 05:13:27	20/04/28 05:13:27
12	20/04/28 05:13:29	20/04/28 05:13:29	20/04/28 05:13:29
79	20/04/28 05:13:31	20/04/28 05:13:31	20/04/28 05:13:31
53	20/04/28 05:13:33	20/04/28 05:13:33	20/04/28 05:13:33
89	20/04/28 05:13:35	20/04/28 05:13:35	20/04/28 05:13:35
89	20/04/28 05:13:37	20/04/28 05:13:37	20/04/28 05:13:37
79	20/04/28 05:13:39	20/04/28 05:13:39	20/04/28 05:13:39
12	20/04/28 05:13:41	20/04/28 05:13:42	20/04/28 05:13:41
12	20/04/28 05:13:44	20/04/28 05:13:44	20/04/28 05:13:44
98	20/04/28 05:13:46	20/04/28 05:13:47	20/04/28 05:13:47
30	20/04/28 05:13:49	20/04/28 05:13:50	20/04/28 05:13:50
88	20/04/28 05:13:52	20/04/28 05:13:52	20/04/28 05:13:52
126	20/04/28 05:13:54	20/04/28 05:13:54	20/04/28 05:13:54
135	20/04/28 05:13:56	20/04/28 05:13:56	20/04/28 05:13:56
100	20/04/28 05:13:58	20/04/28 05:13:59	20/04/28 05:13:59
40	20/04/28 05:14:01	20/04/28 05:14:01	20/04/28 05:14:01
70	20/04/28 05:14:03	20/04/28 05:14:03	20/04/28 05:14:03
45	20/04/28 05:12:40	20/04/28 05:14:05	20/04/28 05:12:40
130	20/04/28 05:14:07	20/04/28 05:14:07	20/04/28 05:14:07
131	20/04/28 05:14:09	20/04/28 05:14:10	20/04/28 05:14:10
108	20/04/28 05:14:12	20/04/28 05:14:12	20/04/28 05:14:12
70	20/04/28 05:14:14	20/04/28 05:14:14	20/04/28 05:14:14
2	20/04/28 05:14:16	20/04/28 05:14:16	20/04/28 05:14:16
131	20/04/28 05:14:18	20/04/28 05:14:18	20/04/28 05:14:18
90	20/04/28 05:14:20	20/04/28 05:14:21	20/04/28 05:14:20
26	20/04/28 05:14:23	20/04/28 05:14:23	20/04/28 05:14:23
90	20/04/28 05:14:25	20/04/28 05:14:25	20/04/28 05:14:25
130	20/04/28 05:14:27	20/04/28 05:14:27	20/04/28 05:14:27
75	20/04/28 05:14:29	20/04/28 05:14:29	20/04/28 05:14:29
96	20/04/28 05:14:31	20/04/28 05:14:31	20/04/28 05:14:31
23	20/04/28 05:14:33	20/04/28 05:14:33	20/04/28 05:14:33
108	20/04/28 05:14:35	20/04/28 05:14:35	20/04/28 05:14:35
79	20/04/28 05:14:37	20/04/28 05:14:37	20/04/28 05:14:37
28	20/04/28 05:14:39	20/04/28 05:14:39	20/04/28 05:14:39
152	20/04/28 05:14:41	20/04/28 05:14:41	20/04/28 05:14:41
158	20/04/28 05:14:43	20/04/28 05:14:43	20/04/28 05:14:43
28	20/04/28 05:14:45	20/04/28 05:14:45	20/04/28 05:14:45
150	20/04/28 05:14:47	20/04/28 05:14:47	20/04/28 05:14:47
152	20/04/28 05:14:49	20/04/28 05:14:49	20/04/28 05:14:49
152	20/04/28 05:14:51	20/04/28 05:14:51	20/04/28 05:14:51
152	20/04/28 05:14:53	20/04/28 05:14:54	20/04/28 05:14:54
57	20/04/28 05:14:56	20/04/28 05:14:56	20/04/28 05:14:56
106	20/04/28 05:14:58	20/04/28 05:14:58	20/04/28 05:14:58
133	20/04/28 05:15:00	20/04/28 05:15:00	20/04/28 05:15:00
133	20/04/28 05:15:02	20/04/28 05:15:02	20/04/28 05:15:02
107	20/04/28 05:15:04	20/04/28 05:12:55	20/04/28 05:15:04
