floorId	partitionId	location_x	location_y	timeStamp
3	68	357.80003138449274	255.68897868820252	20/04/28 05:13:21
3	42	352.0898782617341	257.6816897320676	20/04/28 05:13:22
3	42	352.20974435218506	259.0612514241787	20/04/28 05:13:23
3	54	356.6246500946648	261.0341852858323	20/04/28 05:13:24
3	54	359.5685583521681	263.2279362811352	20/04/28 05:13:25
3	54	358.23287936641947	263.0061707425011	20/04/28 05:13:26
3	54	359.5685583521681	263.2279362811352	20/04/28 05:13:27
3	34	362.2167196060361	259.70189758364177	20/04/28 05:13:28
3	34	361.2642468288334	255.55936173685845	20/04/28 05:13:29
3	17	361.9057312824121	254.45903554354518	20/04/28 05:13:30
3	17	363.0633788732786	253.76883669815368	20/04/28 05:13:31
3	17	362.3945272480641	251.57317905073432	20/04/28 05:13:32
3	17	362.3945272480641	251.57317905073432	20/04/28 05:13:33
3	30	363.12031496140963	247.33199182958694	20/04/28 05:13:34
3	30	363.12031496140963	247.33199182958694	20/04/28 05:13:35
3	30	363.12031496140963	247.33199182958694	20/04/28 05:13:36
3	30	363.12031496140963	247.33199182958694	20/04/28 05:13:37
3	30	363.12031496140963	247.33199182958694	20/04/28 05:13:38
3	30	363.12031496140963	247.33199182958694	20/04/28 05:13:39
3	30	363.12031496140963	247.33199182958694	20/04/28 05:13:40
3	23	366.2602386887034	244.5685484047918	20/04/28 05:13:41
3	30	363.12031496140963	247.33199182958694	20/04/28 05:13:42
3	30	363.12031496140963	247.33199182958694	20/04/28 05:13:43
3	30	361.5359815708335	246.73539932578205	20/04/28 05:13:44
3	30	363.12031496140963	247.33199182958694	20/04/28 05:13:45
3	30	363.12031496140963	247.33199182958694	20/04/28 05:13:46
3	23	366.2602386887034	244.5685484047918	20/04/28 05:13:47
3	23	366.2602386887034	244.5685484047918	20/04/28 05:13:48
3	23	364.04513168379253	243.80216821811885	20/04/28 05:13:49
3	23	364.04513168379253	243.80216821811885	20/04/28 05:13:50
3	23	366.2602386887034	244.5685484047918	20/04/28 05:13:51
3	23	366.2602386887034	244.5685484047918	20/04/28 05:13:52
3	23	366.2602386887035	244.5685484047918	20/04/28 05:13:53
3	23	366.2602386887034	244.5685484047918	20/04/28 05:13:54
3	23	364.04513168379253	243.80216821811885	20/04/28 05:13:55
3	23	366.2602386887034	244.5685484047918	20/04/28 05:13:56
3	23	366.2602386887034	244.5685484047918	20/04/28 05:13:57
3	23	366.2602386887034	244.5685484047918	20/04/28 05:13:59
3	23	366.2602386887034	244.5685484047918	20/04/28 05:14:00
3	23	366.2602386887034	244.5685484047918	20/04/28 05:14:01
3	23	366.2602386887035	244.5685484047918	20/04/28 05:14:02
3	23	366.2602386887034	244.5685484047918	20/04/28 05:14:03
3	23	366.2602386887034	244.5685484047918	20/04/28 05:14:04
3	23	364.04513168379253	243.80216821811885	20/04/28 05:14:05
3	23	366.2602386887034	244.5685484047918	20/04/28 05:14:06
3	23	366.2602386887035	244.5685484047918	20/04/28 05:14:07
3	23	366.2602386887035	244.5685484047918	20/04/28 05:14:08
3	23	366.2602386887034	244.5685484047918	20/04/28 05:14:09
3	23	366.2602386887034	244.5685484047918	20/04/28 05:14:10
3	23	366.2602386887034	244.5685484047918	20/04/28 05:14:11
3	23	366.2602386887034	244.5685484047918	20/04/28 05:14:12
3	NULL	366.79190435951654	246.6278485991508	20/04/28 05:14:13
3	23	366.2602386887034	244.5685484047918	20/04/28 05:14:14
3	23	366.2602386887034	244.5685484047918	20/04/28 05:14:15
3	23	366.2602386887034	244.5685484047918	20/04/28 05:14:16
3	23	366.2602386887034	244.5685484047918	20/04/28 05:14:17
3	23	366.2602386887034	244.5685484047918	20/04/28 05:14:18
3	23	366.2602386887034	244.5685484047918	20/04/28 05:14:19
3	23	364.04513168379253	243.80216821811885	20/04/28 05:14:20
3	23	366.2602386887034	244.5685484047918	20/04/28 05:14:21
3	23	366.2602386887034	244.5685484047918	20/04/28 05:14:22
3	23	366.2602386887034	244.5685484047918	20/04/28 05:14:23
3	23	366.2602386887035	244.5685484047918	20/04/28 05:14:24
3	23	364.04513168379253	243.80216821811885	20/04/28 05:14:25
3	30	363.7510885757444	247.501779512455	20/04/28 05:14:26
3	30	363.7510885757444	247.501779512455	20/04/28 05:14:27
3	30	363.12031496140963	247.33199182958694	20/04/28 05:14:28
3	17	362.3945272480641	251.57317905073432	20/04/28 05:14:29
3	30	363.12031496140963	247.33199182958694	20/04/28 05:14:30
3	30	363.7510885757444	247.501779512455	20/04/28 05:14:31
3	30	361.5359815708335	246.73539932578205	20/04/28 05:14:32
3	30	363.12031496140963	247.33199182958694	20/04/28 05:14:33
3	17	362.3945272480641	251.57317905073432	20/04/28 05:14:34
3	17	362.3945272480641	251.57317905073432	20/04/28 05:14:35
3	17	362.3945272480641	251.57317905073432	20/04/28 05:14:36
3	30	363.12031496140963	247.33199182958694	20/04/28 05:14:37
3	17	362.3945272480641	251.57317905073432	20/04/28 05:14:38
3	17	362.3945272480641	251.57317905073432	20/04/28 05:14:39
3	17	362.3945272480641	251.57317905073432	20/04/28 05:14:40
3	17	362.3945272480641	251.57317905073432	20/04/28 05:14:41
3	17	362.3945272480641	251.57317905073432	20/04/28 05:14:42
3	17	362.3945272480641	251.57317905073432	20/04/28 05:14:43
3	17	362.3945272480641	251.57317905073432	20/04/28 05:14:44
3	17	362.3945272480641	251.57317905073432	20/04/28 05:14:45
3	17	362.3945272480641	251.57317905073432	20/04/28 05:14:46
3	17	362.3945272480641	251.57317905073432	20/04/28 05:14:47
3	17	362.3945272480641	251.57317905073432	20/04/28 05:14:48
3	17	362.3945272480641	251.57317905073432	20/04/28 05:14:49
3	17	362.3945272480641	251.57317905073432	20/04/28 05:14:50
3	17	362.3945272480641	251.57317905073432	20/04/28 05:14:51
3	17	362.3945272480641	251.57317905073432	20/04/28 05:14:52
3	17	362.3945272480641	251.57317905073432	20/04/28 05:14:53
3	17	362.3945272480641	251.57317905073432	20/04/28 05:14:54
3	17	362.3945272480641	251.57317905073432	20/04/28 05:14:55
3	17	362.3945272480641	251.57317905073432	20/04/28 05:14:56
3	17	359.96968039487183	251.3655491305634	20/04/28 05:14:57
3	17	359.96968039487183	251.3655491305634	20/04/28 05:14:58
3	17	362.3945272480641	251.57317905073432	20/04/28 05:14:59
3	17	359.96968039487183	251.3655491305634	20/04/28 05:15:00
3	17	359.96968039487183	251.3655491305634	20/04/28 05:15:01
3	17	359.96968039487183	251.3655491305634	20/04/28 05:15:02
3	17	359.96968039487183	251.3655491305634	20/04/28 05:15:03
3	17	359.96968039487183	251.3655491305634	20/04/28 05:15:04
3	17	362.3945272480641	251.57317905073432	20/04/28 05:15:05
3	17	359.96968039487183	251.3655491305634	20/04/28 05:15:06
3	30	361.5359815708335	246.73539932578205	20/04/28 05:15:07
3	30	361.5359815708335	246.73539932578205	20/04/28 05:15:08
3	30	363.12031496140963	247.33199182958694	20/04/28 05:15:09
3	30	363.7510885757444	247.501779512455	20/04/28 05:15:10
