floorId	partitionId	location_x	location_y	timeStamp
1	39	323.0934417610824	276.80430912710955	20/04/28 05:17:06
1	39	323.0934417610824	276.80430912710955	20/04/28 05:17:07
1	39	323.3383314215366	280.8639124713207	20/04/28 05:17:08
1	59	328.5945802458779	282.23375842854654	20/04/28 05:17:09
1	59	326.0592927928086	283.41059588634107	20/04/28 05:17:10
1	59	326.0592927928086	283.41059588634107	20/04/28 05:17:11
1	59	326.0592927928086	283.41059588634107	20/04/28 05:17:12
1	59	326.0592927928086	283.41059588634107	20/04/28 05:17:13
1	39	325.8736188746059	279.6870750135261	20/04/28 05:17:14
1	39	325.1681104108905	280.1535421165315	20/04/28 05:17:15
1	39	325.81440313235436	279.3509925421299	20/04/28 05:17:16
1	39	325.1681104108905	280.1535421165315	20/04/28 05:17:17
1	59	328.5945802458779	282.23375842854654	20/04/28 05:17:18
1	59	327.4971270661714	282.632451151298	20/04/28 05:17:19
1	39	328.5632049091355	280.29920674728515	20/04/28 05:17:20
1	59	328.5945802458779	282.23375842854654	20/04/28 05:17:21
1	59	328.5945802458779	282.23375842854654	20/04/28 05:17:22
1	39	329.2687133728509	279.8327396442798	20/04/28 05:17:23
1	39	328.5632049091355	280.29920674728515	20/04/28 05:17:24
1	59	328.5945802458779	282.23375842854654	20/04/28 05:17:25
1	39	327.9142846197566	278.81130765682735	20/04/28 05:17:26
1	39	329.2687133728509	279.8327396442798	20/04/28 05:17:27
1	39	329.26871337285087	279.8327396442798	20/04/28 05:17:28
1	29	332.7456299918409	278.40940910115313	20/04/28 05:17:29
1	29	331.69286809267174	275.97981690209605	20/04/28 05:17:30
1	9	331.2124740764311	280.36793404834106	20/04/28 05:17:31
1	29	332.7456299918409	278.40940910115313	20/04/28 05:17:32
1	39	329.26871337285087	279.8327396442798	20/04/28 05:17:33
1	39	328.2159514736818	277.4031474452227	20/04/28 05:17:34
1	9	331.2124740764311	280.36793404834106	20/04/28 05:17:35
1	39	328.4322969629075	277.4851681619245	20/04/28 05:17:36
1	39	326.48853625932736	276.94997375786323	20/04/28 05:17:37
1	29	329.96545287831736	275.52664321473657	20/04/28 05:17:38
1	39	328.56320490913555	280.29920674728515	20/04/28 05:17:39
1	39	326.4885362593274	276.9499737578632	20/04/28 05:17:40
1	9	331.2124740764311	280.36793404834106	20/04/28 05:17:41
1	39	328.2159514736818	277.4031474452227	20/04/28 05:17:42
1	39	326.4885362593274	276.9499737578632	20/04/28 05:17:43
1	29	332.7456299918409	278.40940910115313	20/04/28 05:17:44
1	39	326.48853625932736	276.94997375786323	20/04/28 05:17:45
1	39	329.26871337285087	279.8327396442798	20/04/28 05:17:46
1	9	331.2124740764311	280.36793404834106	20/04/28 05:17:47
1	9	331.2124740764311	280.36793404834106	20/04/28 05:17:48
1	39	328.56320490913555	280.29920674728515	20/04/28 05:17:49
1	39	329.26871337285087	279.8327396442798	20/04/28 05:17:50
1	9	331.2124740764311	280.36793404834106	20/04/28 05:17:51
1	9	331.2124740764311	280.36793404834106	20/04/28 05:17:52
1	9	331.2124740764311	280.36793404834106	20/04/28 05:17:53
1	9	331.2124740764311	280.36793404834106	20/04/28 05:17:54
1	9	331.2124740764311	280.36793404834106	20/04/28 05:17:55
1	9	331.2124740764311	280.36793404834106	20/04/28 05:17:56
1	9	331.2124740764311	280.36793404834106	20/04/28 05:17:57
1	9	331.2124740764311	280.36793404834106	20/04/28 05:17:58
1	9	331.2124740764311	280.36793404834106	20/04/28 05:17:59
1	9	331.2124740764311	280.36793404834106	20/04/28 05:18:00
1	9	331.2124740764311	280.36793404834106	20/04/28 05:18:01
1	9	331.2124740764311	280.36793404834106	20/04/28 05:18:02
1	39	328.54583400380113	278.9886275361597	20/04/28 05:18:03
1	29	332.7456299918409	278.40940910115313	20/04/28 05:18:04
1	9	331.2124740764311	280.36793404834106	20/04/28 05:18:05
1	29	332.7456299918409	278.40940910115313	20/04/28 05:18:06
1	9	331.2124740764311	280.36793404834106	20/04/28 05:18:07
1	9	331.2124740764311	280.36793404834106	20/04/28 05:18:08
1	9	331.2124740764311	280.36793404834106	20/04/28 05:18:09
1	39	329.26871337285087	279.8327396442798	20/04/28 05:18:10
1	9	331.2124740764311	280.36793404834106	20/04/28 05:18:11
1	9	331.2124740764311	280.36793404834106	20/04/28 05:18:12
1	9	331.2124740764311	280.36793404834106	20/04/28 05:18:13
1	9	331.2124740764311	280.36793404834106	20/04/28 05:18:14
1	9	331.2124740764311	280.36793404834106	20/04/28 05:18:15
1	59	328.5945802458779	282.23375842854654	20/04/28 05:18:16
1	9	331.2124740764311	280.36793404834106	20/04/28 05:18:17
1	9	331.2124740764311	280.36793404834106	20/04/28 05:18:18
1	9	331.2124740764311	280.36793404834106	20/04/28 05:18:19
1	59	328.5945802458779	282.23375842854654	20/04/28 05:18:20
1	39	329.26871337285087	279.8327396442798	20/04/28 05:18:21
1	39	328.56320490913555	280.29920674728515	20/04/28 05:18:22
