floorId	partitionId	location_x	location_y	timeStamp
19	919	339.4283961345864	266.50357036667367	21/02/24 15:39:27
19	919	340.2475697813879	268.6028650417705	21/02/24 15:39:28
19	NULL	337.73701806888556	270.34580290420837	21/02/24 15:39:29
19	950	335.24432386191205	269.68948620372345	21/02/24 15:39:30
19	909	333.79691834538926	273.32229963118385	21/02/24 15:39:31
19	955	331.14052623366666	274.53372397223194	21/02/24 15:39:32
19	955	331.14052623366666	274.53372397223194	21/02/24 15:39:33
19	955	327.5892974082492	276.18391471006385	21/02/24 15:39:34
19	955	328.92321811554416	278.4499778858854	21/02/24 15:39:35
19	955	328.92321811554416	278.4499778858854	21/02/24 15:39:36
19	955	323.9884222877308	280.17133116751256	21/02/24 15:39:37
19	955	323.9884222877308	280.17133116751256	21/02/24 15:39:38
19	NULL	322.7688919024709	282.9508947625264	21/02/24 15:39:39
19	897	319.01521359261704	283.59757186890573	21/02/24 15:39:40
19	897	319.01521359261704	283.59757186890573	21/02/24 15:39:41
19	897	319.01521359261704	283.59757186890573	21/02/24 15:39:42
19	897	319.01521359261704	283.59757186890573	21/02/24 15:39:43
19	980	311.1000485048991	283.6794021053163	21/02/24 15:39:44
19	929	308.3310848497639	283.2611879608152	21/02/24 15:39:45
19	929	307.5917897278964	285.09780219467183	21/02/24 15:39:46
19	929	307.5917897278964	285.09780219467183	21/02/24 15:39:47
19	980	310.36738320623186	287.58936639951213	21/02/24 15:39:48
19	980	310.36738320623186	287.58936639951213	21/02/24 15:39:49
19	980	310.36738320623186	287.58936639951213	21/02/24 15:39:50
19	980	310.36738320623186	287.58936639951213	21/02/24 15:39:51
19	980	310.36738320623186	287.58936639951213	21/02/24 15:39:52
19	980	310.36738320623186	287.58936639951213	21/02/24 15:39:53
19	980	310.36738320623186	287.58936639951213	21/02/24 15:39:54
19	980	310.36738320623186	287.58936639951213	21/02/24 15:39:55
19	980	310.36738320623186	287.58936639951213	21/02/24 15:39:56
19	980	310.36738320623186	287.58936639951213	21/02/24 15:39:57
19	980	310.36738320623186	287.58936639951213	21/02/24 15:39:58
19	980	310.36738320623186	287.58936639951213	21/02/24 15:39:59
19	980	310.36738320623186	287.58936639951213	21/02/24 15:40:00
19	980	310.36738320623186	287.58936639951213	21/02/24 15:40:01
19	980	310.36738320623186	287.58936639951213	21/02/24 15:40:02
19	980	310.36738320623186	287.58936639951213	21/02/24 15:40:03
19	980	310.36738320623186	287.58936639951213	21/02/24 15:40:04
19	980	310.36738320623186	287.58936639951213	21/02/24 15:40:05
19	980	310.36738320623186	287.58936639951213	21/02/24 15:40:06
19	980	310.36738320623186	287.58936639951213	21/02/24 15:40:07
19	929	307.5917897278964	285.09780219467183	21/02/24 15:40:08
19	980	310.36738320623186	287.58936639951213	21/02/24 15:40:09
19	980	310.36738320623186	287.58936639951213	21/02/24 15:40:10
19	929	307.5917897278964	285.09780219467183	21/02/24 15:40:11
19	980	310.36738320623186	287.58936639951213	21/02/24 15:40:12
19	980	310.36738320623186	287.58936639951213	21/02/24 15:40:13
19	980	310.36738320623186	287.58936639951213	21/02/24 15:40:14
19	929	307.5917897278964	285.09780219467183	21/02/24 15:40:15
19	929	307.59178972789636	285.09780219467183	21/02/24 15:40:16
19	929	307.59178972789636	285.0978021946719	21/02/24 15:40:17
19	929	307.59178972789636	285.0978021946719	21/02/24 15:40:18
19	980	309.8797585242773	283.4992197770171	21/02/24 15:40:19
19	975	315.07586920053365	286.03778962296946	21/02/24 15:40:20
19	897	319.01521359261704	283.59757186890573	21/02/24 15:40:21
19	897	319.01521359261704	283.59757186890573	21/02/24 15:40:22
19	897	319.01521359261704	283.59757186890573	21/02/24 15:40:23
19	NULL	322.7688919024709	282.9508947625264	21/02/24 15:40:24
19	NULL	322.7688919024709	282.9508947625264	21/02/24 15:40:25
19	955	323.9884222877308	280.17133116751256	21/02/24 15:40:26
19	955	328.92321811554416	278.4499778858854	21/02/24 15:40:27
19	955	328.92321811554416	278.4499778858854	21/02/24 15:40:28
19	955	328.92321811554416	278.4499778858854	21/02/24 15:40:29
19	955	328.92321811554416	278.4499778858854	21/02/24 15:40:30
19	955	328.92321811554416	278.4499778858854	21/02/24 15:40:31
19	955	331.5796102272668	277.2385535448373	21/02/24 15:40:32
19	915	336.5415648801153	280.3558442180772	21/02/24 15:40:33
19	964	344.3155484927012	283.53998029232963	21/02/24 15:40:34
19	964	349.72234002988336	284.71465847817086	21/02/24 15:40:35
19	964	349.72234002988336	284.71465847817086	21/02/24 15:40:36
19	968	355.71807547868275	279.11092240486005	21/02/24 15:40:37
19	964	355.482293890607	282.3613173869535	21/02/24 15:40:38
19	964	355.482293890607	282.3613173869535	21/02/24 15:40:39
19	964	355.482293890607	282.3613173869535	21/02/24 15:40:40
19	964	355.482293890607	282.36131738695343	21/02/24 15:40:41
19	945	357.72180770228624	278.62087605071156	21/02/24 15:40:42
19	NULL	360.5547106147949	283.12207921272073	21/02/24 15:40:43
19	987	363.64647505929315	279.84759664761776	21/02/24 15:40:44
19	987	363.64647505929315	279.84759664761776	21/02/24 15:40:45
19	987	360.4804147429043	276.7888416553232	21/02/24 15:40:46
19	NULL	358.3760696072213	273.7359113686968	21/02/24 15:40:47
19	987	360.4804147429043	276.7888416553232	21/02/24 15:40:48
19	904	359.54493697186035	271.3830711551945	21/02/24 15:40:49
19	NULL	358.3760696072213	273.7359113686968	21/02/24 15:40:50
19	NULL	358.3760696072213	273.7359113686968	21/02/24 15:40:51
19	NULL	358.3760696072213	273.7359113686968	21/02/24 15:40:52
19	NULL	358.3760696072213	273.7359113686968	21/02/24 15:40:53
19	NULL	358.3760696072213	273.7359113686968	21/02/24 15:40:54
19	NULL	358.3760696072213	273.7359113686968	21/02/24 15:40:55
19	NULL	358.3760696072213	273.7359113686968	21/02/24 15:40:56
19	NULL	358.3760696072213	273.7359113686968	21/02/24 15:40:57
19	NULL	358.3760696072213	273.7359113686968	21/02/24 15:40:58
19	NULL	358.3760696072213	273.7359113686968	21/02/24 15:40:59
19	NULL	358.3760696072213	273.7359113686968	21/02/24 15:41:00
19	904	359.54493697186035	271.3830711551945	21/02/24 15:41:01
19	904	359.54493697186035	271.3830711551945	21/02/24 15:41:02
19	904	359.54493697186035	271.3830711551945	21/02/24 15:41:03
19	NULL	358.3760696072213	273.7359113686968	21/02/24 15:41:04
19	NULL	358.3760696072213	273.7359113686968	21/02/24 15:41:05
19	904	359.54493697186035	271.3830711551945	21/02/24 15:41:06
19	NULL	358.3760696072213	273.7359113686968	21/02/24 15:41:07
19	904	359.54493697186035	271.3830711551945	21/02/24 15:41:08
19	904	359.54493697186035	271.3830711551945	21/02/24 15:41:09
19	904	359.54493697186035	271.3830711551945	21/02/24 15:41:10
19	NULL	358.3760696072213	273.7359113686968	21/02/24 15:41:11
19	904	359.54493697186035	271.3830711551945	21/02/24 15:41:12
19	NULL	358.3760696072213	273.7359113686968	21/02/24 15:41:13
19	904	359.54493697186035	271.3830711551945	21/02/24 15:41:14
19	904	359.54493697186035	271.3830711551945	21/02/24 15:41:15
19	NULL	364.30073696422824	274.96263196560295	21/02/24 15:41:16
19	NULL	364.30073696422824	274.96263196560295	21/02/24 15:41:17
19	987	363.64647505929315	279.84759664761776	21/02/24 15:41:18
19	NULL	361.8602798513784	283.01660848074425	21/02/24 15:41:19
19	NULL	361.8602798513784	283.01660848074425	21/02/24 15:41:20
19	990	357.82242061436585	282.16385269148645	21/02/24 15:41:21
19	990	357.82242061436585	282.16385269148645	21/02/24 15:41:22
19	964	355.482293890607	282.3613173869535	21/02/24 15:41:23
19	964	355.482293890607	282.3613173869535	21/02/24 15:41:24
19	964	355.482293890607	282.36131738695343	21/02/24 15:41:25
19	904	353.3309852064064	273.01348317021734	21/02/24 15:41:26
19	904	352.1597258472866	270.85810765218207	21/02/24 15:41:27
19	904	345.5840669454654	272.03626967984314	21/02/24 15:41:28
19	964	343.936005738331	275.14366390624144	21/02/24 15:41:29
19	919	341.8507959684553	269.41861351939014	21/02/24 15:41:30
19	919	340.2475697813879	268.6028650417705	21/02/24 15:41:31
19	919	340.2475697813879	268.6028650417705	21/02/24 15:41:32
19	919	340.2475697813879	268.60286504177043	21/02/24 15:41:33
19	919	340.2475697813879	268.6028650417705	21/02/24 15:41:34
19	919	340.2475697813879	268.6028650417705	21/02/24 15:41:35
19	919	340.2475697813879	268.6028650417705	21/02/24 15:41:36
19	919	340.2475697813879	268.6028650417705	21/02/24 15:41:37
19	919	340.2475697813879	268.6028650417705	21/02/24 15:41:38
19	919	340.2475697813879	268.6028650417705	21/02/24 15:41:39
19	919	340.2475697813879	268.6028650417705	21/02/24 15:41:40
19	919	340.2475697813879	268.6028650417705	21/02/24 15:41:41
19	919	340.2475697813879	268.60286504177043	21/02/24 15:41:42
19	919	340.2475697813879	268.60286504177043	21/02/24 15:41:43
19	919	340.2475697813879	268.60286504177043	21/02/24 15:41:44
19	919	340.2475697813879	268.60286504177043	21/02/24 15:41:45
19	919	340.2475697813879	268.6028650417705	21/02/24 15:41:46
19	919	340.2475697813879	268.6028650417705	21/02/24 15:41:47
19	919	340.2475697813879	268.6028650417705	21/02/24 15:41:48
19	919	340.2475697813879	268.6028650417705	21/02/24 15:41:49
19	919	340.2475697813879	268.6028650417705	21/02/24 15:41:50
19	919	340.2475697813879	268.60286504177043	21/02/24 15:41:51
19	919	340.2475697813879	268.6028650417705	21/02/24 15:41:52
19	919	340.2475697813879	268.6028650417705	21/02/24 15:41:53
19	919	340.2475697813879	268.60286504177043	21/02/24 15:41:54
19	919	340.2475697813879	268.6028650417705	21/02/24 15:41:55
19	919	340.2475697813879	268.6028650417705	21/02/24 15:41:56
19	919	340.2475697813879	268.6028650417705	21/02/24 15:41:57
19	919	340.2475697813879	268.6028650417705	21/02/24 15:41:58
19	919	340.2475697813879	268.6028650417705	21/02/24 15:41:59
19	950	335.24432386191205	269.68948620372345	21/02/24 15:42:00
19	950	335.24432386191205	269.68948620372345	21/02/24 15:42:01
19	909	333.79691834538926	273.32229963118385	21/02/24 15:42:02
19	955	331.14052623366666	274.53372397223194	21/02/24 15:42:03
19	955	331.14052623366666	274.53372397223194	21/02/24 15:42:04
19	955	327.5892974082492	276.18391471006385	21/02/24 15:42:05
19	955	328.92321811554416	278.4499778858854	21/02/24 15:42:06
19	955	328.92321811554416	278.4499778858854	21/02/24 15:42:07
19	955	327.03491767926494	278.4361492594608	21/02/24 15:42:08
19	NULL	322.7688919024709	282.9508947625264	21/02/24 15:42:09
19	NULL	322.7688919024709	282.9508947625264	21/02/24 15:42:10
19	897	319.01521359261704	283.59757186890573	21/02/24 15:42:11
19	897	319.01521359261704	283.59757186890573	21/02/24 15:42:12
19	897	319.01521359261704	283.59757186890573	21/02/24 15:42:13
19	897	319.01521359261704	283.59757186890573	21/02/24 15:42:14
19	975	315.07586920053365	286.03778962296946	21/02/24 15:42:15
19	975	315.07586920053365	286.03778962296946	21/02/24 15:42:16
19	975	315.07586920053365	286.03778962296946	21/02/24 15:42:17
19	897	319.01521359261704	283.59757186890573	21/02/24 15:42:18
19	897	319.01521359261704	283.59757186890573	21/02/24 15:42:19
19	897	319.01521359261704	283.59757186890573	21/02/24 15:42:20
19	NULL	322.7688919024709	282.9508947625264	21/02/24 15:42:21
19	NULL	322.7688919024709	282.9508947625264	21/02/24 15:42:22
19	NULL	322.7688919024709	282.9508947625264	21/02/24 15:42:23
19	955	323.9884222877308	280.17133116751256	21/02/24 15:42:24
19	955	323.9884222877308	280.17133116751256	21/02/24 15:42:25
19	955	323.9884222877308	280.17133116751256	21/02/24 15:42:26
19	955	323.9884222877308	280.17133116751256	21/02/24 15:42:27
19	955	323.9884222877308	280.17133116751256	21/02/24 15:42:28
19	955	323.9884222877308	280.17133116751256	21/02/24 15:42:29
19	955	323.9884222877308	280.17133116751256	21/02/24 15:42:30
19	955	323.9884222877308	280.17133116751256	21/02/24 15:42:31
19	NULL	326.2665356724085	280.50725420525265	21/02/24 15:42:32
19	955	323.9884222877308	280.17133116751256	21/02/24 15:42:33
19	NULL	326.2665356724085	280.50725420525265	21/02/24 15:42:34
19	NULL	326.2665356724085	280.50725420525265	21/02/24 15:42:35
19	NULL	326.2665356724085	280.50725420525265	21/02/24 15:42:36
19	955	325.8767227240101	280.18515979393715	21/02/24 15:42:37
19	955	323.9884222877308	280.17133116751256	21/02/24 15:42:38
19	955	327.03491767926494	278.4361492594608	21/02/24 15:42:39
19	955	325.87672272401005	280.1851597939371	21/02/24 15:42:40
19	955	328.92321811554416	278.4499778858854	21/02/24 15:42:41
19	NULL	326.2665356724085	280.50725420525265	21/02/24 15:42:42
19	NULL	326.26653567240857	280.50725420525265	21/02/24 15:42:44
19	NULL	326.2665356724085	280.50725420525265	21/02/24 15:42:45
19	955	328.92321811554416	278.4499778858854	21/02/24 15:42:46
19	NULL	326.2665356724085	280.50725420525265	21/02/24 15:42:47
19	NULL	326.26653567240857	280.50725420525265	21/02/24 15:42:48
19	NULL	326.26653567240857	280.50725420525265	21/02/24 15:42:49
19	NULL	326.26653567240857	280.50725420525265	21/02/24 15:42:50
19	955	327.03491767926494	278.4361492594608	21/02/24 15:42:51
19	NULL	326.2665356724085	280.50725420525265	21/02/24 15:42:52
19	955	323.9884222877308	280.17133116751256	21/02/24 15:42:53
