stationId	t_start	t_end	t_max	timeStamp
89	20/04/28 05:11:53	20/04/28 05:15:29	20/04/28 05:15:29
78	20/04/28 05:15:31	20/04/28 05:15:31	20/04/28 05:15:31
18	20/04/28 05:15:33	20/04/28 05:15:33	20/04/28 05:15:33
13	20/04/28 05:15:35	20/04/28 05:15:35	20/04/28 05:15:35
74	20/04/28 05:15:37	20/04/28 05:15:37	20/04/28 05:15:37
96	20/04/28 05:15:39	20/04/28 05:15:39	20/04/28 05:15:39
74	20/04/28 05:15:41	20/04/28 05:15:41	20/04/28 05:15:41
24	20/04/28 05:15:43	20/04/28 05:15:44	20/04/28 05:15:44
74	20/04/28 05:15:46	20/04/28 05:15:47	20/04/28 05:15:47
101	20/04/28 05:15:49	20/04/28 05:15:49	20/04/28 05:15:49
18	20/04/28 05:15:51	20/04/28 05:15:51	20/04/28 05:15:51
18	20/04/28 05:15:53	20/04/28 05:15:53	20/04/28 05:15:53
90	20/04/28 05:15:55	20/04/28 05:15:55	20/04/28 05:15:55
71	20/04/28 05:15:57	20/04/28 05:15:57	20/04/28 05:15:57
96	20/04/28 05:15:59	20/04/28 05:15:59	20/04/28 05:15:59
74	20/04/28 05:16:01	20/04/28 05:16:01	20/04/28 05:16:01
18	20/04/28 05:16:03	20/04/28 05:16:03	20/04/28 05:16:03
18	20/04/28 05:16:05	20/04/28 05:16:05	20/04/28 05:16:05
91	20/04/28 05:16:07	20/04/28 05:16:08	20/04/28 05:16:08
90	20/04/28 05:16:10	20/04/28 05:16:10	20/04/28 05:16:10
90	20/04/28 05:16:12	20/04/28 05:16:12	20/04/28 05:16:12
134	20/04/28 05:16:14	20/04/28 05:16:14	20/04/28 05:16:14
68	20/04/28 05:16:16	20/04/28 05:16:16	20/04/28 05:16:16
18	20/04/28 05:16:18	20/04/28 05:16:18	20/04/28 05:16:18
18	20/04/28 05:16:20	20/04/28 05:16:20	20/04/28 05:16:20
71	20/04/28 05:16:22	20/04/28 05:16:22	20/04/28 05:16:22
90	20/04/28 05:16:24	20/04/28 05:16:24	20/04/28 05:16:24
14	20/04/28 05:16:26	20/04/28 05:16:26	20/04/28 05:16:26
83	20/04/28 05:16:28	20/04/28 05:16:28	20/04/28 05:16:28
13	20/04/28 05:16:30	20/04/28 05:16:30	20/04/28 05:16:30
7	20/04/28 05:16:32	20/04/28 05:16:32	20/04/28 05:16:32
10	20/04/28 05:16:34	20/04/28 05:16:34	20/04/28 05:16:34
67	20/04/28 05:16:36	20/04/28 05:16:36	20/04/28 05:16:36
65	20/04/28 05:16:38	20/04/28 05:16:38	20/04/28 05:16:38
65	20/04/28 05:16:40	20/04/28 05:16:40	20/04/28 05:16:40
101	20/04/28 05:16:42	20/04/28 05:16:42	20/04/28 05:16:42
103	20/04/28 05:16:44	20/04/28 05:16:44	20/04/28 05:16:44
117	20/04/28 05:16:46	20/04/28 05:16:48	20/04/28 05:16:47
74	20/04/28 05:16:50	20/04/28 05:16:50	20/04/28 05:16:50
97	20/04/28 05:16:52	20/04/28 05:16:52	20/04/28 05:16:52
94	20/04/28 05:16:54	20/04/28 05:16:54	20/04/28 05:16:54
87	20/04/28 05:16:56	20/04/28 05:16:56	20/04/28 05:16:56
94	20/04/28 05:16:58	20/04/28 05:16:59	20/04/28 05:16:58
97	20/04/28 05:17:01	20/04/28 05:17:01	20/04/28 05:17:01
74	20/04/28 05:17:03	20/04/28 05:17:03	20/04/28 05:17:03
97	20/04/28 05:17:05	20/04/28 05:17:05	20/04/28 05:17:05
87	20/04/28 05:17:07	20/04/28 05:17:07	20/04/28 05:17:07
131	20/04/28 05:17:09	20/04/28 05:17:09	20/04/28 05:17:09
87	20/04/28 05:17:11	20/04/28 05:17:12	20/04/28 05:17:12
74	20/04/28 05:17:14	20/04/28 05:17:14	20/04/28 05:17:14
147	20/04/28 05:17:16	20/04/28 05:17:16	20/04/28 05:10:33
74	20/04/28 05:17:18	20/04/28 05:17:18	20/04/28 05:17:18
94	20/04/28 05:17:20	20/04/28 05:17:20	20/04/28 05:17:20
94	20/04/28 05:17:22	20/04/28 05:17:22	20/04/28 05:17:22
142	20/04/28 05:17:24	20/04/28 05:17:24	20/04/28 05:17:24
91	20/04/28 05:17:26	20/04/28 05:17:26	20/04/28 05:17:26
87	20/04/28 05:17:28	20/04/28 05:17:28	20/04/28 05:17:28
97	20/04/28 05:17:30	20/04/28 05:17:30	20/04/28 05:17:30
94	20/04/28 05:17:32	20/04/28 05:17:32	20/04/28 05:17:32
26	20/04/28 05:17:34	20/04/28 05:17:34	20/04/28 05:17:34
147	20/04/28 05:17:36	20/04/28 05:17:36	20/04/28 05:17:36
41	20/04/28 05:17:38	20/04/28 05:17:38	20/04/28 05:17:38
151	20/04/28 05:17:40	20/04/28 05:17:40	20/04/28 05:17:40
152	20/04/28 05:17:42	20/04/28 05:17:42	20/04/28 05:17:42
25	20/04/28 05:17:44	20/04/28 05:17:44	20/04/28 05:17:44
14	20/04/28 05:15:27	20/04/28 05:15:27	20/04/28 05:17:46
14	20/04/28 05:17:48	20/04/28 05:17:48	20/04/28 05:17:48
151	20/04/28 05:17:50	20/04/28 05:17:51	20/04/28 05:17:51
150	20/04/28 05:17:53	20/04/28 05:17:53	20/04/28 05:17:53
5	20/04/28 05:17:55	20/04/28 05:17:55	20/04/28 05:17:55
18	20/04/28 05:17:57	20/04/28 05:17:57	20/04/28 05:17:57
83	20/04/28 05:17:59	20/04/28 05:17:59	20/04/28 05:17:59
91	20/04/28 05:18:01	20/04/28 05:18:01	20/04/28 05:18:01
12	20/04/28 05:18:03	20/04/28 05:18:03	20/04/28 05:18:03
91	20/04/28 05:18:05	20/04/28 05:18:05	20/04/28 05:18:05
18	20/04/28 05:18:07	20/04/28 05:18:07	20/04/28 05:14:12
71	20/04/28 05:18:09	20/04/28 05:18:09	20/04/28 05:18:09
14	20/04/28 05:18:11	20/04/28 05:18:11	20/04/28 05:18:11
74	20/04/28 05:18:13	20/04/28 05:18:13	20/04/28 05:18:13
71	20/04/28 05:18:15	20/04/28 05:18:15	20/04/28 05:18:15
150	20/04/28 05:18:17	20/04/28 05:18:17	20/04/28 05:18:17
94	20/04/28 05:18:19	20/04/28 05:18:19	20/04/28 05:18:19
150	20/04/28 05:18:21	20/04/28 05:18:21	20/04/28 05:18:21
83	20/04/28 05:18:23	20/04/28 05:18:23	20/04/28 05:18:23
2	20/04/28 05:18:25	20/04/28 05:18:25	20/04/28 05:18:25
109	20/04/28 05:18:27	20/04/28 05:18:27	20/04/28 05:18:27
6	20/04/28 05:18:29	20/04/28 05:18:30	20/04/28 05:18:29
91	20/04/28 05:18:32	20/04/28 05:18:32	20/04/28 05:18:32
151	20/04/28 05:18:34	20/04/28 05:18:34	20/04/28 05:18:34
151	20/04/28 05:18:36	20/04/28 05:18:36	20/04/28 05:18:36
74	20/04/28 05:18:38	20/04/28 05:18:38	20/04/28 05:18:38
85	20/04/28 05:18:40	20/04/28 05:18:40	20/04/28 05:18:40
74	20/04/28 05:18:42	20/04/28 05:18:42	20/04/28 05:18:42
