stationId	t_start	t_end	t_max	timeStamp
70	20/04/28 05:11:21	20/04/28 05:11:21	20/04/28 05:11:21
75	20/04/28 05:11:23	20/04/28 05:11:23	20/04/28 05:11:23
155	20/04/28 05:11:25	20/04/28 05:11:25	20/04/28 05:11:25
61	20/04/28 05:11:27	20/04/28 05:11:27	20/04/28 05:11:27
1	20/04/28 05:11:29	20/04/28 05:11:29	20/04/28 05:11:29
109	20/04/28 05:11:31	20/04/28 05:11:31	20/04/28 05:11:31
89	20/04/28 05:11:33	20/04/28 05:11:34	20/04/28 05:11:34
11	20/04/28 05:11:36	20/04/28 05:11:36	20/04/28 05:11:36
128	20/04/28 05:11:38	20/04/28 05:11:38	20/04/28 05:11:38
64	20/04/28 05:11:40	20/04/28 05:11:40	20/04/28 05:11:40
33	20/04/28 05:11:42	20/04/28 05:11:42	20/04/28 05:11:42
133	20/04/28 05:11:44	20/04/28 05:11:44	20/04/28 05:11:44
10	20/04/28 05:11:46	20/04/28 05:11:47	20/04/28 05:11:47
10	20/04/28 05:11:49	20/04/28 05:11:00	20/04/28 05:11:49
39	20/04/28 05:11:51	20/04/28 05:11:51	20/04/28 05:09:24
42	20/04/28 05:11:53	20/04/28 05:11:53	20/04/28 05:11:53
19	20/04/28 05:11:55	20/04/28 05:11:55	20/04/28 05:11:55
65	20/04/28 05:11:57	20/04/28 05:11:57	20/04/28 05:11:57
74	20/04/28 05:11:59	20/04/28 05:11:59	20/04/28 05:11:59
117	20/04/28 05:12:01	20/04/28 05:12:01	20/04/28 05:12:01
118	20/04/28 05:12:03	20/04/28 05:12:03	20/04/28 05:12:03
68	20/04/28 05:12:05	20/04/28 05:12:05	20/04/28 05:12:05
101	20/04/28 05:12:07	20/04/28 05:12:07	20/04/28 05:12:07
6	20/04/28 05:12:09	20/04/28 05:12:09	20/04/28 05:12:09
147	20/04/28 05:12:11	20/04/28 05:12:11	20/04/28 05:12:11
32	20/04/28 05:12:13	20/04/28 05:12:13	20/04/28 05:12:13
32	20/04/28 05:12:15	20/04/28 05:12:15	20/04/28 05:12:15
101	20/04/28 05:12:17	20/04/28 05:12:17	20/04/28 05:12:17
41	20/04/28 05:12:19	20/04/28 05:12:19	20/04/28 05:12:19
117	20/04/28 05:12:21	20/04/28 05:12:21	20/04/28 05:12:21
118	20/04/28 05:12:23	20/04/28 05:12:23	20/04/28 05:12:23
66	20/04/28 05:12:25	20/04/28 05:12:25	20/04/28 05:12:25
117	20/04/28 05:12:27	20/04/28 05:12:27	20/04/28 05:12:27
65	20/04/28 05:12:29	20/04/28 05:12:29	20/04/28 05:12:29
16	20/04/28 05:12:31	20/04/28 05:12:31	20/04/28 05:12:31
28	20/04/28 05:12:33	20/04/28 05:12:33	20/04/28 05:12:33
119	20/04/28 05:12:35	20/04/28 05:12:35	20/04/28 05:12:35
147	20/04/28 05:12:37	20/04/28 05:12:37	20/04/28 05:12:37
151	20/04/28 05:12:39	20/04/28 05:12:39	20/04/28 05:12:39
14	20/04/28 05:12:41	20/04/28 05:12:41	20/04/28 05:12:41
33	20/04/28 05:12:43	20/04/28 05:12:43	20/04/28 05:12:43
34	20/04/28 05:12:45	20/04/28 05:12:45	20/04/28 05:12:45
43	20/04/28 05:12:47	20/04/28 05:12:47	20/04/28 05:12:47
12	20/04/28 05:12:49	20/04/28 05:12:50	20/04/28 05:12:50
14	20/04/28 05:12:52	20/04/28 05:12:52	20/04/28 05:12:52
155	20/04/28 05:12:54	20/04/28 05:12:54	20/04/28 05:12:54
63	20/04/28 05:12:57	20/04/28 05:12:57	20/04/28 05:12:57
18	20/04/28 05:12:59	20/04/28 05:13:00	20/04/28 05:12:59
155	20/04/28 05:13:02	20/04/28 05:13:02	20/04/28 05:13:02
75	20/04/28 05:13:04	20/04/28 05:13:04	20/04/28 05:13:04
61	20/04/28 05:13:06	20/04/28 05:13:07	20/04/28 05:13:07
61	20/04/28 05:13:09	20/04/28 05:13:09	20/04/28 05:13:09
33	20/04/28 05:13:11	20/04/28 05:13:11	20/04/28 05:13:11
75	20/04/28 05:13:13	20/04/28 05:13:13	20/04/28 05:13:13
33	20/04/28 05:13:15	20/04/28 05:13:15	20/04/28 05:13:15
111	20/04/28 05:13:17	20/04/28 05:13:17	20/04/28 05:13:17
33	20/04/28 05:13:19	20/04/28 05:13:19	20/04/28 05:13:19
155	20/04/28 05:13:21	20/04/28 05:13:21	20/04/28 05:13:21
61	20/04/28 05:13:23	20/04/28 05:13:23	20/04/28 05:13:23
111	20/04/28 05:13:25	20/04/28 05:13:25	20/04/28 05:13:25
29	20/04/28 05:13:27	20/04/28 05:13:27	20/04/28 05:13:27
29	20/04/28 05:13:29	20/04/28 05:13:30	20/04/28 05:13:30
61	20/04/28 05:13:32	20/04/28 05:13:32	20/04/28 05:13:32
61	20/04/28 05:13:34	20/04/28 05:13:34	20/04/28 05:13:34
61	20/04/28 05:13:36	20/04/28 05:13:36	20/04/28 05:13:36
29	20/04/28 05:13:38	20/04/28 05:13:38	20/04/28 05:13:38
83	20/04/28 05:13:40	20/04/28 05:13:40	20/04/28 05:13:40
64	20/04/28 05:13:42	20/04/28 05:13:42	20/04/28 05:13:42
111	20/04/28 05:13:44	20/04/28 05:13:44	20/04/28 05:13:44
133	20/04/28 05:13:46	20/04/28 05:13:46	20/04/28 05:13:46
12	20/04/28 05:13:48	20/04/28 05:13:49	20/04/28 05:13:49
128	20/04/28 05:13:51	20/04/28 05:13:51	20/04/28 05:13:51
45	20/04/28 05:13:53	20/04/28 05:13:53	20/04/28 05:13:53
64	20/04/28 05:13:55	20/04/28 05:13:55	20/04/28 05:13:55
2	20/04/28 05:13:57	20/04/28 05:13:57	20/04/28 05:13:57
12	20/04/28 05:13:59	20/04/28 05:13:59	20/04/28 05:13:59
1	20/04/28 05:14:01	20/04/28 05:14:01	20/04/28 05:14:01
41	20/04/28 05:14:03	20/04/28 05:14:03	20/04/28 05:14:03
120	20/04/28 05:14:05	20/04/28 05:14:05	20/04/28 05:14:05
19	20/04/28 05:14:07	20/04/28 05:14:07	20/04/28 05:14:07
6	20/04/28 05:14:09	20/04/28 05:14:09	20/04/28 05:14:09
25	20/04/28 05:14:11	20/04/28 05:14:11	20/04/28 05:14:11
117	20/04/28 05:14:13	20/04/28 05:14:13	20/04/28 05:14:13
91	20/04/28 05:14:15	20/04/28 05:14:15	20/04/28 05:14:15
105	20/04/28 05:14:17	20/04/28 05:14:17	20/04/28 05:14:17
103	20/04/28 05:14:19	20/04/28 05:14:19	20/04/28 05:14:19
101	20/04/28 05:14:21	20/04/28 05:14:21	20/04/28 05:14:21
67	20/04/28 05:14:23	20/04/28 05:14:23	20/04/28 05:14:23
65	20/04/28 05:14:25	20/04/28 05:14:25	20/04/28 05:14:25
94	20/04/28 05:14:27	20/04/28 05:14:27	20/04/28 05:14:27
143	20/04/28 05:14:29	20/04/28 05:14:29	20/04/28 05:14:29
157	20/04/28 05:14:31	20/04/28 05:14:31	20/04/28 05:14:31
151	20/04/28 05:14:33	20/04/28 05:14:33	20/04/28 05:14:33
83	20/04/28 05:14:35	20/04/28 05:14:35	20/04/28 05:14:35
133	20/04/28 05:14:37	20/04/28 05:14:37	20/04/28 05:14:37
6	20/04/28 05:14:39	20/04/28 05:14:39	20/04/28 05:14:39
152	20/04/28 05:14:41	20/04/28 05:14:41	20/04/28 05:14:41
133	20/04/28 05:14:43	20/04/28 05:14:43	20/04/28 05:14:43
133	20/04/28 05:14:45	20/04/28 05:14:45	20/04/28 05:14:45
10	20/04/28 05:14:47	20/04/28 05:14:47	20/04/28 05:14:47
83	20/04/28 05:14:49	20/04/28 05:14:50	20/04/28 05:14:50
151	20/04/28 05:14:52	20/04/28 05:14:52	20/04/28 05:14:52
151	20/04/28 05:14:54	20/04/28 05:14:55	20/04/28 05:14:55
151	20/04/28 05:14:57	20/04/28 05:14:58	20/04/28 05:14:58
151	20/04/28 05:15:00	20/04/28 05:15:00	20/04/28 05:15:00
10	20/04/28 05:15:02	20/04/28 05:15:02	20/04/28 05:15:02
109	20/04/28 05:15:04	20/04/28 05:15:03	20/04/28 05:13:03
142	20/04/28 05:15:06	20/04/28 05:15:06	20/04/28 05:15:06
83	20/04/28 05:15:08	20/04/28 05:15:08	20/04/28 05:15:08
83	20/04/28 05:15:10	20/04/28 05:15:10	20/04/28 05:15:10
128	20/04/28 05:15:12	20/04/28 05:15:12	20/04/28 05:15:12
130	20/04/28 05:15:14	20/04/28 05:15:14	20/04/28 05:15:14
151	20/04/28 05:15:16	20/04/28 05:15:18	20/04/28 05:15:18
68	20/04/28 05:15:20	20/04/28 05:15:20	20/04/28 05:15:20
71	20/04/28 05:15:22	20/04/28 05:15:22	20/04/28 05:15:22
151	20/04/28 05:15:24	20/04/28 05:15:24	20/04/28 05:15:24
133	20/04/28 05:15:26	20/04/28 05:15:26	20/04/28 05:15:26
5	20/04/28 05:15:28	20/04/28 05:15:28	20/04/28 05:15:28
