floorId	partitionId	location_x	location_y	timeStamp
3	42	346.21524043817794	259.90702006537566	20/04/28 05:09:19
3	42	346.3947695074542	260.1088796575185	20/04/28 05:09:19
3	42	346.370202245151	260.0480577275964	20/04/28 05:09:19
3	42	346.6473643719178	260.0090271442218	20/04/28 05:09:19
3	42	346.5360036154465	260.0742243160398	20/04/28 05:09:20
3	42	346.54746598869514	260.0604684967267	20/04/28 05:09:20
3	42	346.54746598869514	260.0604684967267	20/04/28 05:09:20
3	42	346.54746598869514	260.0604684967267	20/04/28 05:09:20
3	42	346.322490740179	259.91200940633524	20/04/28 05:09:20
3	42	346.322490740179	259.91200940633524	20/04/28 05:09:20
3	42	346.14392647680273	259.7941764967503	20/04/28 05:09:20
3	42	345.9438658777751	259.6621583536404	20/04/28 05:09:20
3	42	345.75115396575796	259.5349895412739	20/04/28 05:09:20
3	42	345.3155149927493	259.2475154031254	20/04/28 05:09:20
3	42	345.3155149927493	259.2475154031254	20/04/28 05:09:21
3	42	345.1739239667087	259.15408079166383	20/04/28 05:09:21
3	42	344.96123312295435	259.01372806661243	20/04/28 05:09:21
3	42	344.80094278576024	258.90795395228065	20/04/28 05:09:21
3	42	344.59526558750827	258.77222946717336	20/04/28 05:09:21
3	42	344.4615985739374	258.68402383841664	20/04/28 05:09:21
3	42	344.267670990554	258.55605281573395	20/04/28 05:09:21
3	42	344.02949366206974	258.3988817946023	20/04/28 05:09:21
3	42	343.81331568821366	258.25622794457655	20/04/28 05:09:21
3	42	343.66316445470096	258.157144531199	20/04/28 05:09:22
3	42	343.4305239791893	258.00362722824906	20/04/28 05:09:22
3	42	343.29877476617105	257.91668713837925	20/04/28 05:09:22
3	42	343.0837625237016	257.77480254373796	20/04/28 05:09:22
3	42	342.91324788500793	257.662281507198	20/04/28 05:09:22
3	42	342.75266107408413	257.5563117525879	20/04/28 05:09:22
3	42	342.5587089451579	257.42832453252794	20/04/28 05:09:22
3	42	342.4266817302335	257.3412009917657	20/04/28 05:09:22
3	42	342.2237618966125	257.207296066133	20/04/28 05:09:22
3	42	342.0807366204922	257.1129150062793	20/04/28 05:09:22
3	42	341.90551393610195	256.99728717383067	20/04/28 05:09:23
3	42	341.7407962854021	256.8885915161723	20/04/28 05:09:23
3	42	341.5229235766531	256.74481932622996	20/04/28 05:09:23
3	42	341.3334032957224	256.6197566417646	20/04/28 05:09:23
3	42	341.11084441858833	256.4728920925496	20/04/28 05:09:23
3	42	340.97711987638644	256.38464850118015	20/04/28 05:09:23
3	42	341.0246970775616	256.3972154837896	20/04/28 05:09:23
3	42	341.0169555260974	256.2142961700793	20/04/28 05:09:23
3	42	340.9172019454192	256.20954065559994	20/04/28 05:09:23
3	42	340.79329000660914	256.11415252019435	20/04/28 05:09:23
3	42	340.5662968496804	256.0273403502216	20/04/28 05:09:24
3	42	340.72289490160074	255.8088720851338	20/04/28 05:09:24
3	42	340.71005610553664	255.8323972837238	20/04/28 05:09:24
3	42	340.56019883306897	255.65713981167366	20/04/28 05:09:24
3	42	340.6821851156204	255.66671982775074	20/04/28 05:09:24
3	42	340.8566037197116	255.72073140210898	20/04/28 05:09:24
3	42	340.9148108328804	255.57716312726717	20/04/28 05:09:24
3	42	340.7618152216725	255.51452663616132	20/04/28 05:09:24
3	42	340.49371350202824	255.40494887334475	20/04/28 05:09:24
3	42	340.4246075465331	255.17207404900785	20/04/28 05:09:25
3	42	340.3265962350415	255.3535741088707	20/04/28 05:09:25
3	42	340.35672476915005	255.32878752163185	20/04/28 05:09:25
3	42	340.5733551077299	255.47057411750248	20/04/28 05:09:25
3	42	340.82946540491656	255.6254431643532	20/04/28 05:09:25
3	42	340.82912860288053	255.62520464188123	20/04/28 05:09:25
3	42	340.8110774345226	255.60491403381022	20/04/28 05:09:25
3	42	340.8090782976064	255.47325622235542	20/04/28 05:09:25
3	42	340.73425738400414	255.58366622269932	20/04/28 05:09:25
3	42	340.5031819399752	255.67792048409422	20/04/28 05:09:25
3	42	340.5518530330693	255.8221106253367	20/04/28 05:09:26
3	42	340.4761316887086	256.0088415389137	20/04/28 05:09:26
3	42	340.46607373866965	255.86471420702821	20/04/28 05:09:26
3	42	340.6847400222186	255.93724756298815	20/04/28 05:09:26
3	42	340.81349785948663	256.03464199564047	20/04/28 05:09:26
3	42	340.8114449391997	256.013604830441	20/04/28 05:09:26
3	42	340.79309344487524	255.98604679061188	20/04/28 05:09:26
3	42	341.0638602307168	255.99256063891545	20/04/28 05:09:26
3	42	341.0839243802525	256.24055655150033	20/04/28 05:09:26
3	42	341.0725126056406	256.2791087167462	20/04/28 05:09:26
3	42	341.13032814077906	256.21530278674425	20/04/28 05:09:27
3	42	341.3383577767473	256.23830191540605	20/04/28 05:09:27
3	42	341.19193218110655	256.0275887623025	20/04/28 05:09:27
3	42	341.3360074743537	256.0762206528833	20/04/28 05:09:27
3	42	341.340858926751	255.9451362063128	20/04/28 05:09:27
3	42	341.40101149683704	255.88822661312005	20/04/28 05:09:27
3	42	341.529614396692	255.63373875076363	20/04/28 05:09:27
3	42	341.7866519849441	255.71284996357673	20/04/28 05:09:27
3	42	341.79908985444285	255.74132081987582	20/04/28 05:09:27
3	42	341.8145672026577	255.82897904487038	20/04/28 05:09:28
3	42	341.66547574215554	255.77772148891526	20/04/28 05:09:28
3	42	341.43226199852256	255.82609588908778	20/04/28 05:09:28
3	42	341.51844292697433	255.54712423015755	20/04/28 05:09:28
3	42	341.55301555512665	255.55256148228656	20/04/28 05:09:28
3	42	341.2877214952687	255.5285685695297	20/04/28 05:09:28
3	42	341.1919122676069	255.5143972272421	20/04/28 05:09:28
3	42	341.27907772951545	255.4146006120158	20/04/28 05:09:28
3	42	341.2370714065937	255.403319751461	20/04/28 05:09:28
3	42	341.17831294275646	255.36122024836982	20/04/28 05:09:28
3	42	341.2031522095739	255.65502110304342	20/04/28 05:09:29
3	42	341.01718286086754	255.4628543029234	20/04/28 05:09:29
3	42	340.92272320307166	255.34000613870606	20/04/28 05:09:29
3	42	340.88497447662144	255.13843020391298	20/04/28 05:09:29
3	42	340.7998643109721	255.3097726995058	20/04/28 05:09:29
3	42	340.53209460688885	255.3464554805854	20/04/28 05:09:29
3	42	340.6479384232846	255.09375395956067	20/04/28 05:09:29
3	42	340.39716137391724	255.03507281198466	20/04/28 05:09:29
3	42	340.3887989404457	255.01262283794898	20/04/28 05:09:29
3	42	340.46136801896176	255.0856198578019	20/04/28 05:09:29
3	42	340.44226427804966	255.08681554887127	20/04/28 05:09:30
3	42	340.51380212802206	255.11718429334746	20/04/28 05:09:30
3	42	340.75624733518606	255.13279638118595	20/04/28 05:09:30
3	42	340.8445647239702	255.1366601106178	20/04/28 05:09:30
3	42	340.7579514598954	255.08413864826488	20/04/28 05:09:30
3	42	340.77375024402704	255.08110214619387	20/04/28 05:09:30
3	42	341.0303499928783	255.18728046381875	20/04/28 05:09:30
3	42	340.8249176982545	255.10516230094862	20/04/28 05:09:30
3	42	340.75842546141405	255.14073373467488	20/04/28 05:09:30
3	42	340.7223893919673	255.10839224003115	20/04/28 05:09:31
3	42	341.0144527992956	255.07243531808913	20/04/28 05:09:31
3	42	340.9659320400611	255.0344230531461	20/04/28 05:09:31
3	42	340.80152841838094	255.1646544046144	20/04/28 05:09:31
3	42	340.84754696851263	255.38136549256365	20/04/28 05:09:31
3	42	340.8311187510687	255.3821057289374	20/04/28 05:09:31
3	42	340.7052163306913	255.56783105648552	20/04/28 05:09:31
3	42	340.67808473657504	255.31368023350623	20/04/28 05:09:31
3	42	340.78188008405056	255.4385898289946	20/04/28 05:09:31
3	42	340.9713984295227	255.42993730099252	20/04/28 05:09:31
3	42	340.8004119977409	255.59052441704299	20/04/28 05:09:32
3	42	340.69000683744895	255.38526853090488	20/04/28 05:09:32
3	42	340.6916431096456	255.36910462449885	20/04/28 05:09:32
3	42	340.9557395448702	255.435039936905	20/04/28 05:09:32
3	42	341.0003238635285	255.41204131433847	20/04/28 05:09:32
3	42	340.76356144526585	255.51043672042488	20/04/28 05:09:32
3	42	340.69268662043	255.47003299937543	20/04/28 05:09:32
3	42	340.67984032137724	255.54586542330708	20/04/28 05:09:32
3	42	340.5821155196612	255.28365613465274	20/04/28 05:09:32
3	42	340.62120305350385	255.3674926310425	20/04/28 05:09:33
3	42	340.6873419339448	255.3980351021516	20/04/28 05:09:33
3	42	340.7547297556862	255.53415409794928	20/04/28 05:09:33
3	42	340.85478353777097	255.46982825569526	20/04/28 05:09:33
3	42	340.8188433526341	255.45582020280017	20/04/28 05:09:33
3	42	340.8118247925004	255.4534049423028	20/04/28 05:09:33
3	42	340.9825993229641	255.4950899686418	20/04/28 05:09:33
3	42	341.1674593273731	255.26827714945912	20/04/28 05:09:33
3	42	341.2861941718771	255.20885973516758	20/04/28 05:09:33
3	42	341.1738120867851	255.3211295627193	20/04/28 05:09:33
3	42	341.1524407108861	255.33948199032307	20/04/28 05:09:34
3	42	341.2364046703436	255.09178543177	20/04/28 05:09:34
3	42	341.5090116433196	255.09961138945843	20/04/28 05:09:34
3	42	341.5797774249809	255.19042945941086	20/04/28 05:09:34
3	42	341.53818279725203	255.0911097805908	20/04/28 05:09:34
3	42	341.69754573499756	255.18067295408218	20/04/28 05:09:34
3	42	341.6795672175887	255.18113357238713	20/04/28 05:09:34
3	42	341.5705456256988	255.35151028787624	20/04/28 05:09:34
3	42	341.6317949258038	255.46852172290596	20/04/28 05:09:34
3	42	341.5984757111474	255.64635365023082	20/04/28 05:09:34
3	42	341.3989310596447	255.83097977617416	20/04/28 05:09:35
3	42	341.5405667143984	255.8845458220819	20/04/28 05:09:35
3	42	341.5375140102195	255.88180391446681	20/04/28 05:09:35
3	42	341.6406894208415	255.9250249024302	20/04/28 05:09:35
3	42	341.7589656744765	255.89766174403374	20/04/28 05:09:35
3	42	341.75890841376236	255.78428089903787	20/04/28 05:09:35
3	42	341.9116167732973	255.65093140240438	20/04/28 05:09:35
3	42	341.92871630692406	255.6075014203796	20/04/28 05:09:35
3	42	341.72752628047454	255.6963949334079	20/04/28 05:09:35
3	42	341.6042340839603	255.86305020188266	20/04/28 05:09:36
3	42	341.5908781015643	256.0831405915334	20/04/28 05:09:36
3	42	341.78183159512173	256.06118256710533	20/04/28 05:09:36
3	42	341.71109304087673	255.89071697084802	20/04/28 05:09:36
3	42	341.8432057607247	256.10966535456697	20/04/28 05:09:36
3	42	341.7999243466907	255.99413498112887	20/04/28 05:09:36
3	42	341.9368335850355	256.0873820253059	20/04/28 05:09:36
3	42	342.0188571458369	256.1179847674044	20/04/28 05:09:36
3	42	341.8423534096357	255.9463605035122	20/04/28 05:09:36
3	42	341.8288375943282	255.8939566642318	20/04/28 05:09:36
3	42	341.76988259380477	255.88365108849686	20/04/28 05:09:37
3	42	341.73982260710113	255.98965313066364	20/04/28 05:09:37
3	42	341.74134242088024	255.98125286085937	20/04/28 05:09:37
3	42	341.65237077926366	256.0109410972711	20/04/28 05:09:37
3	42	341.63792665077864	256.0068258281715	20/04/28 05:09:37
3	42	341.6671184561038	256.1019588136667	20/04/28 05:09:37
3	42	341.81693150800817	256.26284412713403	20/04/28 05:09:37
3	42	341.9095057156473	256.1309275721268	20/04/28 05:09:37
3	42	341.77315728672494	256.32297651321153	20/04/28 05:09:37
3	42	341.6925387111934	256.1208343430326	20/04/28 05:09:38
3	42	341.6857912869223	256.1049433932122	20/04/28 05:09:38
3	42	341.65177286265896	256.12218316772606	20/04/28 05:09:38
3	42	341.82437424444083	256.1325983923014	20/04/28 05:09:38
3	42	341.85963601040515	256.2994240405808	20/04/28 05:09:38
3	42	342.0811085502695	256.2142587829094	20/04/28 05:09:38
3	42	342.08058943318616	256.2117785607139	20/04/28 05:09:38
3	42	342.0719687531072	256.21522100399756	20/04/28 05:09:38
3	42	342.00890755872183	256.30205376412863	20/04/28 05:09:38
3	42	341.99390913775756	256.377097480831	20/04/28 05:09:38
3	42	342.19042281873055	256.3640668144197	20/04/28 05:09:39
3	42	342.05863664179935	256.400804446276	20/04/28 05:09:39
3	42	342.28836809471386	256.4022416215928	20/04/28 05:09:39
3	42	342.0139233179408	256.4190111488998	20/04/28 05:09:39
3	42	342.01836148915453	256.4076112727911	20/04/28 05:09:39
3	42	342.10635747047627	256.5010091936981	20/04/28 05:09:39
3	42	342.175263744274	256.67670256996956	20/04/28 05:09:39
3	42	342.29662592517593	256.58237130567534	20/04/28 05:09:39
3	42	342.2948947702708	256.5828235005778	20/04/28 05:09:39
3	42	342.4018834170042	256.6287756121349	20/04/28 05:09:39
3	42	342.16857311486757	256.805065782419	20/04/28 05:09:40
3	42	342.1575851587019	256.7228199666303	20/04/28 05:09:40
3	42	342.2314099529494	256.89923184366006	20/04/28 05:09:40
3	42	342.38080908993936	256.67154871716394	20/04/28 05:09:40
3	42	342.37684325537066	256.6065328333906	20/04/28 05:09:40
3	42	342.4719858599188	256.59591144285747	20/04/28 05:09:40
3	42	342.25872906164665	256.69281706781584	20/04/28 05:09:40
3	42	342.4348561210112	256.863268923378	20/04/28 05:09:40
3	42	342.4348561210112	256.863268923378	20/04/28 05:09:40
3	42	342.4348561210112	256.863268923378	20/04/28 05:09:41
3	42	342.63449895118606	257.0170950395323	20/04/28 05:09:41
3	42	342.9247922009121	257.0823336355952	20/04/28 05:09:41
3	42	342.97971139345407	256.90449432349243	20/04/28 05:09:41
3	42	342.7382528486807	256.94767791209057	20/04/28 05:09:41
3	42	342.8359666216234	257.03073050965384	20/04/28 05:09:41
3	42	342.6507390111435	256.9674564350873	20/04/28 05:09:41
3	42	342.5702326555682	257.15954588853845	20/04/28 05:09:41
3	42	342.5294647786128	257.1736083314046	20/04/28 05:09:41
3	42	342.4321692888538	257.13797127096205	20/04/28 05:09:41
3	42	342.55320285220665	257.3134597423044	20/04/28 05:09:42
3	42	342.67901345628997	257.3694091867576	20/04/28 05:09:42
3	42	342.67780818417765	257.3179760109182	20/04/28 05:09:42
3	42	342.4920725340807	257.5146784536118	20/04/28 05:09:42
3	42	342.56826755875454	257.3989564391772	20/04/28 05:09:42
3	42	342.4117662627176	257.2247044198419	20/04/28 05:09:42
3	42	342.4331636413316	257.33034930626627	20/04/28 05:09:42
3	42	342.4868565670708	257.1553500362202	20/04/28 05:09:42
3	42	342.3895244208109	257.20747906129384	20/04/28 05:09:42
3	42	342.4413017229915	257.35012874168257	20/04/28 05:09:43
3	42	342.374435195836	257.0789609295129	20/04/28 05:09:43
3	42	342.4572579314668	257.03785200540057	20/04/28 05:09:43
3	42	342.58321542210064	257.02003627022907	20/04/28 05:09:43
3	42	342.51817481420215	257.0748009998622	20/04/28 05:09:43
3	42	342.40229358019644	257.12057030421306	20/04/28 05:09:43
3	42	342.24109382010596	257.3077751957661	20/04/28 05:09:43
3	42	342.2193513708063	257.365673681414	20/04/28 05:09:43
3	42	342.16548679027363	257.0843441053484	20/04/28 05:09:43
3	42	342.1109129211656	257.13029815773154	20/04/28 05:09:43
3	42	342.0563406605597	257.11599974555253	20/04/28 05:09:44
3	42	342.34652206685774	257.0950596519462	20/04/28 05:09:44
3	42	342.4049123636392	257.26022292124134	20/04/28 05:09:44
3	42	342.39344145675847	257.26233308302943	20/04/28 05:09:44
3	42	342.4200637784485	257.2879509814263	20/04/28 05:09:44
3	42	342.45745562681685	257.14621679361323	20/04/28 05:09:44
3	42	342.307292493036	257.1641732192185	20/04/28 05:09:44
3	42	342.50948082260766	256.959609531584	20/04/28 05:09:44
3	42	342.7443626926559	256.80617234736974	20/04/28 05:09:44
3	42	342.7830674191528	256.82963874329596	20/04/28 05:09:45
3	42	342.76562122092054	257.0706090741032	20/04/28 05:09:45
3	42	342.7055748700633	256.8413111585675	20/04/28 05:09:45
3	42	342.6567560995784	256.6979304464286	20/04/28 05:09:45
3	42	342.5595351553685	256.74457965900655	20/04/28 05:09:45
3	42	342.8057781766008	256.6590173588688	20/04/28 05:09:45
3	42	342.8372997607165	256.94345319269013	20/04/28 05:09:45
3	42	343.11488049914584	256.9053664538418	20/04/28 05:09:45
3	42	343.1380408168223	257.0743127906553	20/04/28 05:09:45
3	42	343.4193238307308	256.976126678703	20/04/28 05:09:45
3	42	343.26499733902034	257.10930502456966	20/04/28 05:09:46
3	42	343.25965855392957	256.99781913187155	20/04/28 05:09:46
3	42	343.12435942171317	256.96533230541434	20/04/28 05:09:46
3	42	343.09974762657396	256.9421577174026	20/04/28 05:09:46
3	42	343.10704646396755	256.72405989965387	20/04/28 05:09:46
3	42	343.11978940394374	256.65571600296386	20/04/28 05:09:46
3	42	343.2765809216409	256.6160749686808	20/04/28 05:09:46
3	42	343.43200645142304	256.7429788016785	20/04/28 05:09:46
3	42	343.23892681798213	256.55634802485105	20/04/28 05:09:46
3	42	343.1725478468656	256.32758393584214	20/04/28 05:09:46
3	42	343.173452429266	256.2355238071687	20/04/28 05:09:47
3	42	343.1725059128682	256.21569022950524	20/04/28 05:09:47
3	42	343.17418676829317	256.21508308649567	20/04/28 05:09:47
3	42	343.1765776885661	256.2121518159373	20/04/28 05:09:47
3	42	343.092761462199	256.1903930342878	20/04/28 05:09:47
3	42	343.0145531496827	256.1259190398745	20/04/28 05:09:47
3	42	343.0856122371106	256.1201752301803	20/04/28 05:09:47
3	42	343.02976685266816	255.94435945668178	20/04/28 05:09:47
3	42	343.10491736112004	256.19496393188496	20/04/28 05:09:47
3	42	343.16144963163646	256.2756898711492	20/04/28 05:09:48
3	42	343.38544239865894	256.10397219543177	20/04/28 05:09:48
3	42	343.24240989391535	256.04730806500436	20/04/28 05:09:48
3	42	343.1417293968152	256.0837260160619	20/04/28 05:09:48
3	42	343.216931699499	255.86186667146188	20/04/28 05:09:48
3	42	343.1523558106409	256.00111163477214	20/04/28 05:09:48
3	42	342.9832615778218	256.09465174106265	20/04/28 05:09:48
3	42	343.0663387300111	256.12832895732885	20/04/28 05:09:48
3	42	342.99718490378825	256.13029946563046	20/04/28 05:09:48
3	42	343.11204158321755	256.1921157740372	20/04/28 05:09:48
3	42	343.23166901579054	256.247816222782	20/04/28 05:09:49
3	42	343.40665436804954	256.3955515900016	20/04/28 05:09:49
3	42	343.44480137173986	256.3626956347221	20/04/28 05:09:49
3	42	343.4368814073955	256.3747107027411	20/04/28 05:09:49
3	42	343.2989020718006	256.4253633938776	20/04/28 05:09:49
3	42	343.3519437442933	256.3869152743553	20/04/28 05:09:49
3	42	343.388925161834	256.0993920690946	20/04/28 05:09:49
3	42	343.5690424805111	256.3260281856042	20/04/28 05:09:49
3	42	343.5788124271055	256.35216503198325	20/04/28 05:09:49
3	42	343.80002663028546	256.27112975016615	20/04/28 05:09:49
3	42	343.75110280371683	256.0169773285196	20/04/28 05:09:50
3	42	343.76574079972613	256.02715413287757	20/04/28 05:09:50
3	42	343.77865970670524	256.2495419957316	20/04/28 05:09:50
3	42	343.69005736354285	256.32530498413826	20/04/28 05:09:50
3	42	343.43916791766924	256.3871403782686	20/04/28 05:09:50
3	42	343.3659177835022	256.4309391405296	20/04/28 05:09:50
3	42	343.43448617095345	256.509350137352	20/04/28 05:09:50
3	42	343.6317155190317	256.4682038167784	20/04/28 05:09:50
3	42	343.61850445294425	256.4636249115723	20/04/28 05:09:50
3	42	343.52474334158364	256.20872114297424	20/04/28 05:09:51
3	42	343.72084398119154	256.39251137975253	20/04/28 05:09:51
3	42	343.839719466002	256.3073805969233	20/04/28 05:09:51
3	42	343.7511895154041	256.37343801681607	20/04/28 05:09:51
3	42	343.7604281913303	256.47267630792317	20/04/28 05:09:51
3	42	343.5520764151662	256.6181731504218	20/04/28 05:09:51
3	42	343.4020297026554	256.52270302393873	20/04/28 05:09:51
3	42	343.40916318534585	256.53052106754535	20/04/28 05:09:51
3	42	343.19191367363254	256.5533452050982	20/04/28 05:09:51
3	42	343.42501556527037	256.5694032356844	20/04/28 05:09:51
3	42	343.4012831460897	256.62285313839465	20/04/28 05:09:52
3	42	343.432773747575	256.67732321470606	20/04/28 05:09:52
3	42	343.64658357564736	256.7022289095599	20/04/28 05:09:52
3	42	343.62822955091303	256.73251723862967	20/04/28 05:09:52
3	42	343.7587515193649	256.8934476737462	20/04/28 05:09:52
3	42	343.87555974164263	257.0128659544828	20/04/28 05:09:52
3	42	343.9400954791058	256.7501161817714	20/04/28 05:09:52
3	42	344.0549694542934	256.8199797232485	20/04/28 05:09:52
3	42	344.00650300747304	256.7816057902924	20/04/28 05:09:52
3	42	343.86968944650056	256.6311736609233	20/04/28 05:09:53
3	42	343.8702791788534	256.8168909886261	20/04/28 05:09:53
3	42	343.79626959433926	256.883310837974	20/04/28 05:09:53
3	42	343.5160061833042	256.9335564661479	20/04/28 05:09:53
3	42	343.32568601560723	256.9629744102544	20/04/28 05:09:53
3	42	343.37243135582304	257.015327834976	20/04/28 05:09:53
3	42	343.2689164289721	256.880470252858	20/04/28 05:09:53
3	42	343.3869725730957	256.7143062347251	20/04/28 05:09:53
3	42	343.3869725730957	256.7143062347251	20/04/28 05:09:53
3	42	343.42592544969034	256.7290460732312	20/04/28 05:09:53
3	42	343.40683594942567	256.715318710276	20/04/28 05:09:54
3	42	343.7156011661114	256.6415730057302	20/04/28 05:09:54
3	42	343.7321055822753	256.441783304139	20/04/28 05:09:54
3	42	343.7942239541734	256.31970363928883	20/04/28 05:09:54
3	42	343.7675247719464	256.41615083360915	20/04/28 05:09:54
3	42	343.73668217140624	256.713053272547	20/04/28 05:09:54
3	42	343.749742583611	256.523714382478	20/04/28 05:09:54
3	42	343.54463274421676	256.40366978498787	20/04/28 05:09:54
3	42	343.69314350008995	256.3425994308432	20/04/28 05:09:54
3	42	343.6484596474162	256.3333109599689	20/04/28 05:09:54
3	42	343.51901507035905	256.5300135791187	20/04/28 05:09:55
3	42	343.5431910222871	256.76674668215844	20/04/28 05:09:55
3	42	343.53222024979146	256.79189497502364	20/04/28 05:09:55
3	42	343.6045390763142	257.0522314497076	20/04/28 05:09:55
3	42	343.6561305319525	257.28283859964995	20/04/28 05:09:55
3	42	343.7853760834946	257.2443069602105	20/04/28 05:09:55
3	42	343.78735296582533	257.235523340236	20/04/28 05:09:55
3	42	343.8276639051016	257.0057585513819	20/04/28 05:09:55
3	42	343.7939673044572	257.21623960136696	20/04/28 05:09:55
3	42	343.9372900755462	257.3657329279894	20/04/28 05:09:56
3	42	343.93758853762114	257.59776703299207	20/04/28 05:09:56
3	42	343.78772636708675	257.7527691811631	20/04/28 05:09:56
3	42	343.73269007224104	257.539086351881	20/04/28 05:09:56
3	42	343.79820232480427	257.60283210734644	20/04/28 05:09:56
3	42	343.8268855917521	257.4353394039885	20/04/28 05:09:56
3	42	344.0210401289313	257.53008811773907	20/04/28 05:09:56
3	42	343.96754141920695	257.60178571174697	20/04/28 05:09:56
3	42	343.8767710824809	257.62422547477064	20/04/28 05:09:56
3	42	343.9740712945131	257.5622886526986	20/04/28 05:09:56
3	42	343.8299298324702	257.4116255396559	20/04/28 05:09:57
3	42	343.8299298324702	257.4116255396559	20/04/28 05:09:57
3	42	343.8514004522741	257.4233104091574	20/04/28 05:09:57
3	42	343.76552585605145	257.2869624829613	20/04/28 05:09:57
3	42	343.46676036624046	257.2663062884717	20/04/28 05:09:57
3	42	343.39802822601223	257.0601629419923	20/04/28 05:09:57
3	42	343.67326296404735	257.0874008980061	20/04/28 05:09:57
3	42	343.67613938464126	257.0738094515374	20/04/28 05:09:57
3	42	343.9067138604035	257.07055419724435	20/04/28 05:09:57
3	42	344.0486320472228	256.81440792428833	20/04/28 05:09:58
3	42	344.05017833641386	256.8091999292003	20/04/28 05:09:58
3	42	343.88598402026446	257.00241329568075	20/04/28 05:09:58
3	42	343.7512538992189	257.215276374514	20/04/28 05:09:58
3	42	343.99038966335036	257.3270912161525	20/04/28 05:09:58
3	42	344.1576283381324	257.2606590250676	20/04/28 05:09:58
3	42	344.04189556826515	257.0778081123238	20/04/28 05:09:58
3	42	343.8576658845008	257.16348678060353	20/04/28 05:09:58
3	42	343.7913659140575	257.21015672040687	20/04/28 05:09:58
3	42	343.91729375030246	257.14765140970957	20/04/28 05:09:58
3	42	343.95335493921226	257.31083873544884	20/04/28 05:09:59
3	42	344.1886037573014	257.4368811611198	20/04/28 05:09:59
3	42	344.3837238598312	257.44330470325207	20/04/28 05:09:59
3	42	344.32921876876105	257.5807242015794	20/04/28 05:09:59
3	42	344.41391077538646	257.5377172909992	20/04/28 05:09:59
3	42	344.4507218727613	257.4498074233711	20/04/28 05:09:59
3	42	344.7027418482381	257.4735140573699	20/04/28 05:09:59
3	42	344.4653273556387	257.6015075510219	20/04/28 05:09:59
3	42	344.31819069379424	257.81542464907596	20/04/28 05:09:59
3	42	344.32132716364345	257.81810466980704	20/04/28 05:10:00
3	42	344.14652943421453	257.8167942066242	20/04/28 05:10:00
3	42	344.07069602942863	257.7164234780958	20/04/28 05:10:00
3	42	344.2169373033202	257.6093634129889	20/04/28 05:10:00
3	42	344.2568025772219	257.5072114332671	20/04/28 05:10:00
3	42	344.29146266510526	257.76808256681943	20/04/28 05:10:00
3	42	344.3069793165498	257.7761640677051	20/04/28 05:10:00
3	42	344.31285408272134	257.8133441791072	20/04/28 05:10:00
3	42	344.3127929147078	257.800375421593	20/04/28 05:10:00
3	42	344.35966344247123	257.8001237512191	20/04/28 05:10:00
3	42	344.35031839127737	257.91200267600254	20/04/28 05:10:01
3	42	344.3922211842614	257.83561324285654	20/04/28 05:10:01
3	42	344.3645354073766	257.8196197018571	20/04/28 05:10:01
3	42	344.2096291954148	257.9808372167116	20/04/28 05:10:01
3	42	344.2577846659115	257.9991476484177	20/04/28 05:10:01
3	42	344.09343147408555	258.1755721179856	20/04/28 05:10:01
3	42	344.12165317324826	258.15487189679334	20/04/28 05:10:01
3	42	343.89145286510757	258.01693296119095	20/04/28 05:10:01
3	42	343.7986368966728	257.86483660887467	20/04/28 05:10:01
3	42	343.99878424473854	257.8461236612998	20/04/28 05:10:01
3	42	343.85669900588965	257.9786555824186	20/04/28 05:10:02
3	42	343.87377278833935	257.9568292321646	20/04/28 05:10:02
3	42	344.09547667998874	257.96436104819037	20/04/28 05:10:02
3	42	344.07610242692334	258.05135638358473	20/04/28 05:10:02
3	42	343.79482425079163	258.06437745049243	20/04/28 05:10:02
3	42	343.93178622145984	258.22903328736123	20/04/28 05:10:02
3	42	344.0450893638922	257.96324559695626	20/04/28 05:10:02
3	42	343.8613780124422	258.14142145512534	20/04/28 05:10:02
3	42	343.88263638079127	258.1242378242976	20/04/28 05:10:02
3	42	343.9807800228137	258.13806250055023	20/04/28 05:10:03
3	42	343.9531180744478	258.07558776891915	20/04/28 05:10:03
3	42	343.9396277530037	258.0292983447533	20/04/28 05:10:03
3	42	344.1562869051582	257.9413487083882	20/04/28 05:10:03
3	42	344.1562869051582	257.9413487083882	20/04/28 05:10:03
3	42	344.0274489893699	257.9101514535586	20/04/28 05:10:03
3	42	344.01476921222934	257.9198572777325	20/04/28 05:10:03
3	42	344.0224961258943	257.978421640898	20/04/28 05:10:03
3	42	344.1926724060742	258.10597332034564	20/04/28 05:10:03
3	42	344.19960434834456	258.1076675302122	20/04/28 05:10:03
3	42	344.19960434834456	258.1076675302122	20/04/28 05:10:04
3	42	344.15197790368455	258.02918663875255	20/04/28 05:10:04
3	42	344.15360192085717	258.02703311413376	20/04/28 05:10:04
3	42	344.0617697896345	258.00390741034465	20/04/28 05:10:04
3	42	343.9568548902389	258.14542886490005	20/04/28 05:10:04
3	42	344.03460345781417	258.1374712907039	20/04/28 05:10:04
3	42	343.8304535694503	258.27714677827765	20/04/28 05:10:04
3	42	343.8304535694503	258.27714677827765	20/04/28 05:10:04
3	42	343.554454385331	258.30307474769893	20/04/28 05:10:04
3	42	343.39583000375376	258.5023465072079	20/04/28 05:10:05
3	42	343.39583000375376	258.5023465072079	20/04/28 05:10:05
3	42	343.0183058447034	258.71761225139966	20/04/28 05:10:05
3	42	343.0183058447034	258.71761225139966	20/04/28 05:10:05
3	42	343.04928330637506	258.696793023496	20/04/28 05:10:05
3	42	342.9945151276831	258.70000520722147	20/04/28 05:10:05
3	42	342.86203452364487	258.5878196582969	20/04/28 05:10:05
3	42	342.8220985500415	258.6886939572008	20/04/28 05:10:05
3	42	343.01942124339774	258.5743327655454	20/04/28 05:10:05
3	42	343.01962714113847	258.57418137805763	20/04/28 05:10:05
3	42	343.0221444224846	258.5697614159457	20/04/28 05:10:06
3	42	343.0991481943724	258.66025396281486	20/04/28 05:10:06
3	42	342.9320230454492	258.5807892653744	20/04/28 05:10:06
3	42	343.10515855623953	258.59744283889734	20/04/28 05:10:06
3	42	343.34002069123466	258.69269397092575	20/04/28 05:10:06
3	42	343.05260893826954	258.7160270676636	20/04/28 05:10:06
3	42	342.92520048136356	258.6927400601003	20/04/28 05:10:06
3	42	342.8852775114646	258.5627724780076	20/04/28 05:10:06
3	42	342.7591147694195	258.4549912558926	20/04/28 05:10:06
3	42	342.71776020873085	258.3607885437812	20/04/28 05:10:07
3	42	342.8024321784759	258.39586972609527	20/04/28 05:10:07
3	42	342.79411661144957	258.39806475797633	20/04/28 05:10:07
3	42	342.7498119837055	258.42843654350054	20/04/28 05:10:07
3	42	342.68480995455667	258.68000793125265	20/04/28 05:10:07
3	42	342.8318564623022	258.65042428772756	20/04/28 05:10:07
3	42	342.79690513263137	258.843460492311	20/04/28 05:10:07
3	42	342.79859300290593	258.84332585497333	20/04/28 05:10:07
3	42	342.8094916563764	258.84700242353057	20/04/28 05:10:07
3	42	342.8770590309263	258.9311242803054	20/04/28 05:10:07
3	42	342.85756154427787	258.6941348801125	20/04/28 05:10:08
3	42	342.8039272736036	258.7400516774826	20/04/28 05:10:08
3	42	342.7936763948242	258.7824071059605	20/04/28 05:10:08
3	42	342.69028699329226	258.8530853153595	20/04/28 05:10:08
3	42	342.49982495207155	258.721900860228	20/04/28 05:10:08
3	42	342.4071746625159	258.997677362535	20/04/28 05:10:08
3	42	342.20025483588864	259.01134884195466	20/04/28 05:10:08
3	42	342.1987700766595	258.97596399741593	20/04/28 05:10:08
3	42	342.1840636462999	259.0188797026494	20/04/28 05:10:08
3	42	342.17768367124586	259.1540925460683	20/04/28 05:10:08
3	42	342.23142323161227	259.20834239986556	20/04/28 05:10:09
3	42	342.2709937993442	259.27052499383126	20/04/28 05:10:09
3	42	342.48157493700074	259.213333923205	20/04/28 05:10:09
3	42	342.6045890721729	259.2585787076068	20/04/28 05:10:09
3	42	342.65820712691516	259.1074195817721	20/04/28 05:10:09
3	42	342.80716695292205	259.02337471600543	20/04/28 05:10:09
3	42	342.85805812682196	258.76263710759224	20/04/28 05:10:09
3	42	342.89188793615904	258.83489606827624	20/04/28 05:10:09
3	42	342.88919933105876	258.833457034629	20/04/28 05:10:09
3	42	342.9103223025472	258.6123481947299	20/04/28 05:10:10
3	42	343.08244196328513	258.6761579287052	20/04/28 05:10:10
3	42	342.95850368777633	258.80193659356337	20/04/28 05:10:10
3	42	342.8379599636681	258.9053242579892	20/04/28 05:10:10
3	42	342.8379599636681	258.9053242579892	20/04/28 05:10:10
3	42	342.8379599636681	258.9053242579892	20/04/28 05:10:10
3	42	342.864714443719	259.02336471270644	20/04/28 05:10:10
3	42	342.84248476009446	259.27194994570044	20/04/28 05:10:10
3	42	342.89471297427383	259.3085223899769	20/04/28 05:10:10
3	42	342.8431093117196	259.37869098332163	20/04/28 05:10:10
3	42	342.94261378658956	259.62258572338067	20/04/28 05:10:11
3	42	342.9253849092273	259.32495094211185	20/04/28 05:10:11
3	42	342.9161636421748	259.30932308257815	20/04/28 05:10:11
3	42	342.7232544901237	259.26284016310444	20/04/28 05:10:11
3	42	342.67287237190743	259.06476307659267	20/04/28 05:10:11
3	42	342.72223560180095	259.16580464940625	20/04/28 05:10:11
3	42	342.471544249537	259.19162952410994	20/04/28 05:10:11
3	42	342.5352229489271	259.2539674330847	20/04/28 05:10:11
3	42	342.6742584414753	259.19122842884127	20/04/28 05:10:11
3	42	342.75122089863595	259.2345890435677	20/04/28 05:10:12
3	42	342.86835308213887	259.3207976445287	20/04/28 05:10:12
3	42	342.84756168742985	259.36809517564905	20/04/28 05:10:12
3	42	342.8312318110277	259.3410602116488	20/04/28 05:10:12
3	42	343.03727369803767	259.4732832826434	20/04/28 05:10:12
3	42	343.29274468314793	259.4165141994944	20/04/28 05:10:12
3	42	343.3040358743691	259.4166387959835	20/04/28 05:10:12
3	42	343.31212069522036	259.45874685051444	20/04/28 05:10:12
3	42	343.1661147656311	259.62985769637794	20/04/28 05:10:12
3	42	343.1654269123579	259.5381534217514	20/04/28 05:10:12
3	42	343.2779498642831	259.5659019666566	20/04/28 05:10:13
3	42	343.44444623888586	259.48642261395884	20/04/28 05:10:13
3	42	343.4631061128077	259.47306058074753	20/04/28 05:10:13
3	42	343.3024656748909	259.40534543712	20/04/28 05:10:13
3	42	343.47926548897465	259.3016055047215	20/04/28 05:10:13
3	42	343.3062818718976	259.15052918553334	20/04/28 05:10:13
3	42	343.3444553369008	259.05411852894645	20/04/28 05:10:13
3	42	343.4793881527061	258.83251919374067	20/04/28 05:10:13
3	42	343.5589790266487	258.5559461993079	20/04/28 05:10:13
3	42	343.65724426171244	258.61169167675445	20/04/28 05:10:14
3	42	343.5281323759914	258.55371001201763	20/04/28 05:10:14
3	42	343.5153988705049	258.5367241660547	20/04/28 05:10:14
3	42	343.65726887417566	258.4847486818033	20/04/28 05:10:14
3	42	343.67227330841746	258.3934335791053	20/04/28 05:10:14
3	42	343.64154698139805	258.3910280719122	20/04/28 05:10:14
3	42	343.6566754681284	258.46694029704423	20/04/28 05:10:14
3	42	343.68562011792693	258.4721001012691	20/04/28 05:10:14
3	42	343.95200927590645	258.4422028753939	20/04/28 05:10:14
3	42	343.9194449650745	258.6536924490334	20/04/28 05:10:14
3	42	344.0218592221678	258.60484114557323	20/04/28 05:10:15
3	42	344.11651268024355	258.40377691403955	20/04/28 05:10:15
3	42	343.89474260039736	258.4164443404804	20/04/28 05:10:15
3	42	344.18640471284766	258.4304605627076	20/04/28 05:10:15
3	42	344.21243254140444	258.5900800438973	20/04/28 05:10:15
3	42	344.316869383352	258.5265286008294	20/04/28 05:10:15
3	42	344.1403122794212	258.35606021722634	20/04/28 05:10:15
3	42	344.08497798975816	258.5647264044218	20/04/28 05:10:15
3	42	344.19890416019837	258.7104745872505	20/04/28 05:10:15
3	42	344.4702110422835	258.79052807137117	20/04/28 05:10:16
3	42	344.5420884266072	258.5192774532686	20/04/28 05:10:16
3	42	344.61982338227523	258.5175440693675	20/04/28 05:10:16
3	42	344.6919020474511	258.5456061437743	20/04/28 05:10:16
3	42	344.73339490854056	258.5761210432945	20/04/28 05:10:16
3	42	344.64847870540973	258.573974380475	20/04/28 05:10:16
3	42	344.63703374517195	258.55891753184767	20/04/28 05:10:16
3	42	344.75203392447884	258.45127799499045	20/04/28 05:10:16
3	42	344.70596088701984	258.46744365351833	20/04/28 05:10:16
3	42	344.7344232709448	258.3941360077838	20/04/28 05:10:16
3	42	344.7267488894688	258.58686137320205	20/04/28 05:10:17
3	42	344.8423993300893	258.552380626023	20/04/28 05:10:17
3	42	344.9414615929773	258.6738324340212	20/04/28 05:10:17
3	42	344.70438816615626	258.63850127114733	20/04/28 05:10:17
3	42	344.7093924795588	258.6635091464279	20/04/28 05:10:17
3	42	344.57076604088934	258.65644985812867	20/04/28 05:10:17
3	42	344.5542656003343	258.5190173091888	20/04/28 05:10:17
3	42	344.5038963016732	258.50247845077274	20/04/28 05:10:17
3	42	344.4941158642406	258.52451655553944	20/04/28 05:10:17
3	42	344.50841718734966	258.5775210141058	20/04/28 05:10:17
3	42	344.2365848015135	258.59979299800176	20/04/28 05:10:18
3	42	344.11423190705824	258.76618810766774	20/04/28 05:10:18
3	42	344.0975016521424	258.7576622654671	20/04/28 05:10:18
3	42	344.14072205458194	258.74135318212586	20/04/28 05:10:18
3	42	344.42741324463293	258.7337363427377	20/04/28 05:10:18
3	42	344.51506083589373	258.7352676877341	20/04/28 05:10:18
3	42	344.5107453912903	258.7389265640769	20/04/28 05:10:18
3	42	344.63722613565255	258.86016649280805	20/04/28 05:10:18
3	42	344.5428102904744	258.7672146795538	20/04/28 05:10:18
3	42	344.3559145023455	258.9071652647719	20/04/28 05:10:19
3	42	344.3771667541985	258.9347826038957	20/04/28 05:10:19
3	42	344.30160629322614	258.89353809667415	20/04/28 05:10:19
3	42	344.234510320207	258.87338327155226	20/04/28 05:10:19
3	42	344.4072511976819	258.9169210524425	20/04/28 05:10:19
3	42	344.39128483369905	258.9514402528049	20/04/28 05:10:19
3	42	344.6177688035264	258.9823488622649	20/04/28 05:10:19
3	42	344.63434294121964	258.9761375621222	20/04/28 05:10:19
3	42	344.35125439392885	259.0548604775612	20/04/28 05:10:19
3	42	344.3530728729687	259.05361395849275	20/04/28 05:10:19
3	42	344.4872412701645	259.0251391439651	20/04/28 05:10:20
3	42	344.49472597860847	259.0067649897616	20/04/28 05:10:20
3	42	344.5160082822442	258.99001563780996	20/04/28 05:10:20
3	42	344.4458722663005	258.8242494213982	20/04/28 05:10:20
3	42	344.34700455400736	258.58453624052316	20/04/28 05:10:20
3	42	344.42080502282596	258.72525122133965	20/04/28 05:10:20
3	42	344.29389189097327	258.80169978410106	20/04/28 05:10:20
3	42	344.4885110080287	258.9044486043726	20/04/28 05:10:20
3	42	344.3387024374062	258.7436757185453	20/04/28 05:10:20
3	42	344.4641543230842	258.7087957923274	20/04/28 05:10:21
3	42	344.3592647008313	258.43172715383184	20/04/28 05:10:21
3	42	344.2493921579284	258.29237417540344	20/04/28 05:10:21
3	42	344.2718426656632	258.3402483448838	20/04/28 05:10:21
3	42	344.20055858229904	258.33395286599335	20/04/28 05:10:21
3	42	344.24530654893925	258.60207577707325	20/04/28 05:10:21
3	42	344.4627792352821	258.5524776330416	20/04/28 05:10:21
3	42	344.24150083127574	258.433409340285	20/04/28 05:10:21
3	42	344.3172324668244	258.25875795882814	20/04/28 05:10:21
3	42	344.11059057823405	258.1483153158841	20/04/28 05:10:21
3	42	343.997944301724	257.9216869725836	20/04/28 05:10:22
3	42	344.05649553028366	258.09414882103914	20/04/28 05:10:22
3	42	344.0812095234483	258.0346557448875	20/04/28 05:10:22
3	42	344.06940782009906	257.9249381503632	20/04/28 05:10:22
3	42	343.8895480595438	257.9122734487151	20/04/28 05:10:22
3	42	343.76290357664334	257.86528398236237	20/04/28 05:10:22
3	42	343.7428782765957	257.802006478791	20/04/28 05:10:22
3	42	343.60773055040556	257.7489383698171	20/04/28 05:10:22
3	42	343.5753453051552	257.7146240535907	20/04/28 05:10:22
3	42	343.2979824931398	257.77567383112375	20/04/28 05:10:22
3	42	343.30665130388394	257.6350950240636	20/04/28 05:10:23
3	42	343.1297776826406	257.73985419197004	20/04/28 05:10:23
3	42	343.1325776445047	257.7988942009049	20/04/28 05:10:23
3	42	343.0720769605645	257.9166798611463	20/04/28 05:10:23
3	42	343.29303387016546	258.0742182205067	20/04/28 05:10:23
3	42	343.29207831520085	258.0600268233945	20/04/28 05:10:23
3	42	343.2221127897591	257.8084433612944	20/04/28 05:10:23
3	42	343.2961165997613	257.91765504550887	20/04/28 05:10:23
3	42	343.14117392585393	257.98479496559077	20/04/28 05:10:23
3	42	342.88557135025627	258.09030812137013	20/04/28 05:10:24
3	42	342.63205988583076	258.23003701266117	20/04/28 05:10:24
3	42	342.78041375768106	258.4662156308872	20/04/28 05:10:24
3	42	342.8035263577125	258.5404612814648	20/04/28 05:10:24
3	42	342.8717101568673	258.43454360967115	20/04/28 05:10:24
3	42	342.96803985769975	258.3677763607163	20/04/28 05:10:24
3	42	342.9538176416767	258.3410454051916	20/04/28 05:10:24
3	42	342.93337459308754	258.2328728134716	20/04/28 05:10:24
3	42	342.9217281912611	258.2159698062533	20/04/28 05:10:24
3	42	342.7593419483653	258.2562300711735	20/04/28 05:10:24
3	42	342.72984934534423	258.3939482235246	20/04/28 05:10:25
3	42	342.7233920241587	258.3014654245912	20/04/28 05:10:25
3	42	342.472194963007	258.41327768914215	20/04/28 05:10:25
3	42	342.30550156686843	258.336940007861	20/04/28 05:10:25
3	42	342.30429059206483	258.318621347856	20/04/28 05:10:25
3	42	342.5121606968353	258.1275672062687	20/04/28 05:10:25
3	42	342.5016145317761	258.1246837799584	20/04/28 05:10:25
3	42	342.7020689352946	258.2622689415026	20/04/28 05:10:25
3	42	342.6654902721427	258.46968402441746	20/04/28 05:10:25
3	42	342.72199929527716	258.58087845904384	20/04/28 05:10:25
3	42	343.0198839922989	258.5901532911219	20/04/28 05:10:26
3	42	342.9016870704	258.8476877634128	20/04/28 05:10:26
3	42	342.698799597783	258.7408940541219	20/04/28 05:10:26
3	42	342.7550943295094	258.87687905598125	20/04/28 05:10:26
3	42	342.7196587186985	258.824412809753	20/04/28 05:10:26
3	42	342.96713372202356	258.953543070075	20/04/28 05:10:26
3	42	343.12172991834797	258.91275277000443	20/04/28 05:10:26
3	42	343.14103348204463	258.96694966109914	20/04/28 05:10:26
3	42	343.1165152199658	259.12766960951495	20/04/28 05:10:26
3	42	342.9820966141523	259.1854731590019	20/04/28 05:10:27
3	42	343.10805246970347	259.2520164171481	20/04/28 05:10:27
3	42	343.23485580417196	259.38564795544056	20/04/28 05:10:27
3	42	343.23485580417196	259.38564795544056	20/04/28 05:10:27
3	42	343.23485580417196	259.38564795544056	20/04/28 05:10:27
3	42	343.4392460925245	259.41572279787374	20/04/28 05:10:27
3	42	343.68444279769005	259.451802067258	20/04/28 05:10:27
3	42	343.9413667437141	259.48960693194243	20/04/28 05:10:27
3	42	344.1495936745761	259.52024631401144	20/04/28 05:10:27
3	42	344.32076300163794	259.54543288516544	20/04/28 05:10:27
3	42	344.4800153915096	259.56886594830706	20/04/28 05:10:28
3	42	344.74718033724736	259.60817771654956	20/04/28 05:10:28
3	42	344.9064020557474	259.6316062665772	20/04/28 05:10:28
3	42	345.06503959175495	259.654948857548	20/04/28 05:10:28
3	42	345.21405077322987	259.6768749864251	20/04/28 05:10:28
3	42	345.3986099703152	259.70403179909306	20/04/28 05:10:28
3	42	345.67754027663165	259.74507477173097	20/04/28 05:10:28
3	42	345.84684450919167	259.7699869050743	20/04/28 05:10:28
3	42	346.1106678823029	259.80880698033553	20/04/28 05:10:28
3	42	346.328556585595	259.8408680360359	20/04/28 05:10:29
3	42	346.62404551510326	259.88434751379066	20/04/28 05:10:29
3	42	346.79693060285973	259.90978654915403	20/04/28 05:10:29
3	42	346.9559963288754	259.9331921457947	20/04/28 05:10:29
3	42	347.2095183276069	259.97049643371685	20/04/28 05:10:29
3	42	347.3964037337903	259.99799553452704	20/04/28 05:10:29
3	42	347.58603707415233	260.0258989778728	20/04/28 05:10:29
3	42	347.74992161612187	260.0500136352604	20/04/28 05:10:29
3	42	347.93012190442613	260.07652905984764	20/04/28 05:10:29
3	42	348.10809313398136	260.10271649140157	20/04/28 05:10:29
3	42	348.27216974637236	260.1268594108348	20/04/28 05:10:30
3	42	348.4918154057688	260.1591789924095	20/04/28 05:10:30
3	42	348.6441111848637	260.18158843072695	20/04/28 05:10:30
3	42	348.92400052113106	260.2227725190456	20/04/28 05:10:30
3	42	349.0893786833076	260.24710695396146	20/04/28 05:10:30
3	42	349.2544063262794	260.2713898120146	20/04/28 05:10:30
3	42	349.41431391287097	260.2949192835437	20/04/28 05:10:30
3	42	349.63479408375923	260.3273616586319	20/04/28 05:10:30
3	42	349.8727210990697	260.3623712354261	20/04/28 05:10:30
3	42	350.1037927470653	260.3963720847828	20/04/28 05:10:30
3	42	350.2538130416831	260.418446698791	20/04/28 05:10:31
3	42	350.43715181878684	260.4454239337552	20/04/28 05:10:31
3	42	350.6094620159735	260.4707783773141	20/04/28 05:10:31
3	42	350.8405694848874	260.5047844975106	20/04/28 05:10:31
3	42	351.07688202973986	260.53955651436485	20/04/28 05:10:31
3	42	351.3282159116538	260.5765388336209	20/04/28 05:10:31
3	47	351.32535982256337	260.5911558800385	20/04/28 05:10:31
3	47	351.05025939367926	260.60019890556487	20/04/28 05:10:31
3	47	351.05025939367926	260.60019890556487	20/04/28 05:10:31
3	47	350.8501672576024	260.60677627914987	20/04/28 05:10:32
3	47	350.5868615410036	260.61543159214267	20/04/28 05:10:32
3	47	350.3419165016349	260.62348335801073	20/04/28 05:10:32
3	47	350.0973007357348	260.631524300092	20/04/28 05:10:32
3	47	349.85780228660855	260.6393970271458	20/04/28 05:10:32
3	47	349.69905357891366	260.6446153709404	20/04/28 05:10:32
3	47	349.5418997954221	260.64978128682594	20/04/28 05:10:32
3	47	349.33681948655664	260.65652263025294	20/04/28 05:10:32
3	47	349.11005236588863	260.66397685658427	20/04/28 05:10:32
3	47	348.92242207932594	260.6701445876845	20/04/28 05:10:32
3	47	348.6558933436132	260.6789058468739	20/04/28 05:10:33
3	47	348.366016920213	260.6884345848222	20/04/28 05:10:33
3	47	348.1525048790492	260.6954530938309	20/04/28 05:10:33
3	47	347.96660013070135	260.70156410351416	20/04/28 05:10:33
3	47	347.7553669787392	260.70850770150474	20/04/28 05:10:33
3	47	347.506484217176	260.7166889070922	20/04/28 05:10:33
3	47	347.2559726510716	260.7249236542939	20/04/28 05:10:33
3	47	347.0962439247706	260.7301742129902	20/04/28 05:10:33
3	47	346.88102971202636	260.73724867531433	20/04/28 05:10:33
3	47	346.6707722053375	260.7441602021622	20/04/28 05:10:34
3	47	346.4426223092738	260.7516598827055	20/04/28 05:10:34
3	47	346.2317498132936	260.75859162531196	20/04/28 05:10:34
3	47	346.0417189035949	260.76483826903467	20/04/28 05:10:34
3	47	345.8147333355451	260.77229967610816	20/04/28 05:10:34
3	47	345.5376618340244	260.78140749419134	20/04/28 05:10:34
3	47	345.35088817352346	260.7875470665156	20/04/28 05:10:34
3	47	345.1058226031851	260.79560279444445	20/04/28 05:10:34
3	47	344.8399293336932	260.8043431647632	20/04/28 05:10:34
3	47	344.6480678578239	260.8106499823529	20/04/28 05:10:34
3	47	344.4037593448787	260.81868082449967	20/04/28 05:10:35
3	47	344.2295198028379	260.8244083787342	20/04/28 05:10:35
3	47	343.9841914733084	260.83247274401083	20/04/28 05:10:35
3	47	343.7751541632398	260.8393441608915	20/04/28 05:10:35
3	47	343.50431905115295	260.8482469780989	20/04/28 05:10:35
3	47	343.3148512322935	260.8544751120547	20/04/28 05:10:35
3	47	343.06847493182005	260.86257392594354	20/04/28 05:10:35
3	47	342.82851539826873	260.8704618096375	20/04/28 05:10:35
3	47	342.62071131879406	260.87729268810176	20/04/28 05:10:35
3	47	342.41434621729644	260.88407626487833	20/04/28 05:10:36
3	47	342.15385940642966	260.89263891557835	20/04/28 05:10:36
3	47	341.88505109399136	260.90147510838597	20/04/28 05:10:36
3	47	341.4250088969007	260.9165974887776	20/04/28 05:10:36
3	47	341.4250088969007	260.9165974887776	20/04/28 05:10:36
3	47	340.9796619991407	260.9312368093373	20/04/28 05:10:36
3	47	340.81344214327925	260.9367007426566	20/04/28 05:10:36
3	47	340.81344214327925	260.9367007426566	20/04/28 05:10:36
3	47	340.5503602651625	260.9453486976925	20/04/28 05:10:36
3	47	340.36713996715247	260.95137146486366	20/04/28 05:10:36
3	47	339.9023790166046	260.96664895881923	20/04/28 05:10:37
3	47	339.9023790166046	260.96664895881923	20/04/28 05:10:37
3	47	339.6691764873692	260.97431472812843	20/04/28 05:10:37
3	47	339.42791526154264	260.98224540069236	20/04/28 05:10:37
3	47	339.1866255698035	260.9901770089799	20/04/28 05:10:37
3	47	338.9658695680053	260.9974336394674	20/04/28 05:10:37
3	47	338.7988276189954	261.0029245964063	20/04/28 05:10:37
3	47	338.60212526072144	261.009390542149	20/04/28 05:10:37
3	47	338.35744523781386	261.0174335964689	20/04/28 05:10:37
3	47	338.35744523781386	261.0174335964689	20/04/28 05:10:37
3	47	338.11701305468455	261.0253370169696	20/04/28 05:10:38
3	47	337.61374549722854	261.04188028950153	20/04/28 05:10:38
3	47	337.61374549722854	261.04188028950153	20/04/28 05:10:38
3	47	337.4504183167695	261.0472491355918	20/04/28 05:10:38
3	47	336.93920093498366	261.06405373255944	20/04/28 05:10:38
3	47	336.71528608840714	261.0714141997224	20/04/28 05:10:38
3	47	336.71528608840714	261.0714141997224	20/04/28 05:10:38
3	47	336.431469720824	261.08074373318505	20/04/28 05:10:38
3	47	336.2453306192574	261.08686244646276	20/04/28 05:10:38
3	47	336.0003190334151	261.09491639982815	20/04/28 05:10:39
3	47	335.79861964439306	261.1015466065893	20/04/28 05:10:39
3	47	335.542330670351	261.1099712671534	20/04/28 05:10:39
3	47	335.32825077313277	261.11700844256995	20/04/28 05:10:39
3	47	335.1691597569273	261.12223803863566	20/04/28 05:10:39
3	47	334.89648293462824	261.13120139603393	20/04/28 05:10:39
3	47	334.6402496144218	261.1396242271605	20/04/28 05:10:39
3	47	334.4263329584705	261.1466560365551	20/04/28 05:10:39
3	47	334.1517369130978	261.1556824821256	20/04/28 05:10:39
3	47	333.9516852216832	261.16225852622483	20/04/28 05:10:39
3	47	333.72932960942677	261.16956773866673	20/04/28 05:10:40
3	47	333.4706295567012	261.17807165554524	20/04/28 05:10:40
3	47	333.2437095979069	261.18553090592934	20/04/28 05:10:40
3	47	333.021292698131	261.19284213299767	20/04/28 05:10:40
3	47	332.7650596339902	261.2012649557069	20/04/28 05:10:40
3	47	332.36851283670865	261.21430013280485	20/04/28 05:10:40
3	47	332.36851283670865	261.21430013280485	20/04/28 05:10:40
3	47	332.18897212457426	261.2202019456426	20/04/28 05:10:40
3	47	332.00069855690396	261.2263908225022	20/04/28 05:10:40
3	47	331.8062510071268	261.2327826488011	20/04/28 05:10:41
3	47	331.6158175693819	261.23904252431487	20/04/28 05:10:41
3	47	331.36521685925436	261.2472802018343	20/04/28 05:10:41
3	47	331.14155871375743	261.2546322307901	20/04/28 05:10:41
3	47	330.9501593385685	261.26092385833346	20/04/28 05:10:41
3	47	330.7572529336353	261.2672650245435	20/04/28 05:10:41
3	47	330.54686206775176	261.27418093513813	20/04/28 05:10:41
3	47	330.2518436607415	261.2838786989554	20/04/28 05:10:41
3	47	330.0884789753369	261.2892487778979	20/04/28 05:10:41
3	47	329.92834601362233	261.29451262450937	20/04/28 05:10:41
3	47	329.7659524895953	261.2998507797025	20/04/28 05:10:42
3	47	329.4750510277861	261.3094132124311	20/04/28 05:10:42
3	47	329.29919831939606	261.31519379422554	20/04/28 05:10:42
3	47	329.1443214587835	261.3202848637293	20/04/28 05:10:42
3	47	328.9228641094706	261.3275645487191	20/04/28 05:10:42
3	47	328.63153436500545	261.33714105983717	20/04/28 05:10:42
3	47	328.4465094622068	261.3432231474799	20/04/28 05:10:42
3	47	328.18866469624083	261.35169894960757	20/04/28 05:10:42
3	47	327.89440235091024	261.36137186037354	20/04/28 05:10:42
3	47	327.73153807975626	261.3667254898366	20/04/28 05:10:43
3	47	327.507234201446	261.3740987451436	20/04/28 05:10:43
3	47	327.24568440331694	261.3826963380681	20/04/28 05:10:43
3	47	327.0147725996919	261.390286807276	20/04/28 05:10:43
3	47	326.80337981103986	261.3972356527999	20/04/28 05:10:43
3	47	326.6099228652301	261.40359491623803	20/04/28 05:10:43
3	47	326.6099228652301	261.40359491623803	20/04/28 05:10:43
3	47	326.42712523617314	261.4096037895518	20/04/28 05:10:43
3	47	326.24942651342644	261.4154450530217	20/04/28 05:10:43
3	47	325.9883767324048	261.42402620952157	20/04/28 05:10:43
3	47	325.7663650024598	261.4313241179588	20/04/28 05:10:44
3	47	325.60243196624964	261.43671287957244	20/04/28 05:10:44
3	47	325.37957704757184	261.44403850507746	20/04/28 05:10:44
3	47	325.2039681757672	261.44981107154285	20/04/28 05:10:44
3	47	325.0091694353685	261.45621444208314	20/04/28 05:10:44
3	47	324.8350882151362	261.4619367920068	20/04/28 05:10:44
3	47	324.5950828248184	261.46982618309175	20/04/28 05:10:44
3	47	324.4402297540568	261.4749164705821	20/04/28 05:10:44
3	47	324.28049986704093	261.4801670674331	20/04/28 05:10:44
3	47	324.1115744792469	261.48571993625296	20/04/28 05:10:44
3	47	323.8210307187831	261.49527061072143	20/04/28 05:10:45
3	47	323.61446658238236	261.5020607301185	20/04/28 05:10:45
3	47	323.3736081722148	261.509978161437	20/04/28 05:10:45
3	47	323.08214140001604	261.519559176893	20/04/28 05:10:45
3	47	322.78526995720995	261.52931785319254	20/04/28 05:10:45
3	47	322.57380400015376	261.53626910388806	20/04/28 05:10:45
3	47	322.41527450661977	261.54148024173514	20/04/28 05:10:45
3	47	322.23567316506535	261.5473840475665	20/04/28 05:10:45
3	47	321.97107258823485	261.5560819248482	20/04/28 05:10:45
3	47	321.97107258823485	261.5560819248482	20/04/28 05:10:46
3	47	321.79251727146755	261.5619513460408	20/04/28 05:10:46
3	47	321.6224982978235	261.5675401629135	20/04/28 05:10:46
3	47	321.33403126962475	261.5770225716109	20/04/28 05:10:46
3	47	320.99127372519064	261.58828960320454	20/04/28 05:10:46
3	47	320.99127372519064	261.58828960320454	20/04/28 05:10:46
3	47	320.6220098030347	261.60042794514595	20/04/28 05:10:46
3	47	320.6220098030347	261.60042794514595	20/04/28 05:10:46
3	47	320.406985642594	261.6074961601231	20/04/28 05:10:46
3	47	320.13216164923926	261.6165300987369	20/04/28 05:10:46
3	47	319.9117757301545	261.6237745639674	20/04/28 05:10:47
3	47	319.70809562351445	261.6304698803325	20/04/28 05:10:47
3	47	319.4170425687631	261.64003729618247	20/04/28 05:10:47
3	47	319.2611645165781	261.64516127657987	20/04/28 05:10:47
3	47	319.040786343876	261.6524054871734	20/04/28 05:10:47
3	47	318.8671888717347	261.658111935463	20/04/28 05:10:47
3	47	318.61736312558446	261.6663241385801	20/04/28 05:10:47
3	47	318.43256922902424	261.67239863264933	20/04/28 05:10:47
3	47	318.1332676358053	261.6822371921839	20/04/28 05:10:47
3	47	317.9809609027163	261.6872437771636	20/04/28 05:10:48
3	47	317.81052840447876	261.6928461873028	20/04/28 05:10:48
3	47	317.54913206192026	261.701438735878	20/04/28 05:10:48
3	47	317.33833695528347	261.70836793456334	20/04/28 05:10:48
3	47	317.1122420825956	261.7158000629442	20/04/28 05:10:48
3	47	316.91038405937206	261.72243548428514	20/04/28 05:10:48
3	47	316.65266921960665	261.73090701551456	20/04/28 05:10:48
3	47	316.37881975515444	261.7399089196827	20/04/28 05:10:48
3	47	316.0990365292252	261.74910587682376	20/04/28 05:10:48
3	47	315.8061653885794	261.7587330562925	20/04/28 05:10:48
3	47	315.5890051869381	261.76587148662765	20/04/28 05:10:49
3	47	315.33172615952896	261.7743286919534	20/04/28 05:10:49
3	47	315.1617060913012	261.7799175448069	20/04/28 05:10:49
3	47	315.0013933059559	261.78518730253126	20/04/28 05:10:49
3	47	314.8473758350645	261.79025012241283	20/04/28 05:10:49
3	47	314.59554874895065	261.7985281130259	20/04/28 05:10:49
3	47	314.3252680492753	261.8074127057412	20/04/28 05:10:49
3	47	314.09567660014955	261.81495977261966	20/04/28 05:10:49
3	47	313.91487781058925	261.82090294063204	20/04/28 05:10:49
3	47	313.75803351509506	261.82605868311333	20/04/28 05:10:49
3	47	313.6079910770175	261.8309908368111	20/04/28 05:10:50
3	47	313.38119715283426	261.8384459442202	20/04/28 05:10:50
3	47	313.222643465398	261.8436578773626	20/04/28 05:10:50
3	47	313.0704818746634	261.8486596912628	20/04/28 05:10:50
3	47	312.7718624987944	261.85847582513657	20/04/28 05:10:50
3	47	312.5269012630941	261.86652812340594	20/04/28 05:10:50
3	47	312.2666302013746	261.87508368205937	20/04/28 05:10:50
3	47	312.051704541568	261.8821486591508	20/04/28 05:10:50
3	47	311.8679468672635	261.8881890908075	20/04/28 05:10:50
3	47	311.6052036592885	261.8968259131717	20/04/28 05:10:51
3	47	311.4265418652899	261.90269883445455	20/04/28 05:10:51
3	47	311.4265418652899	261.90269883445455	20/04/28 05:10:51
3	47	311.23472958731907	261.9090040348245	20/04/28 05:10:51
3	47	310.9561229660499	261.9181623149412	20/04/28 05:10:51
3	47	310.733568482823	261.9254780646148	20/04/28 05:10:51
3	47	310.5068609094176	261.9329303335249	20/04/28 05:10:51
3	47	310.29471114218563	261.93990406224015	20/04/28 05:10:51
3	47	310.0456522961254	261.94809105602866	20/04/28 05:10:51
3	47	309.825616357099	261.95532401681106	20/04/28 05:10:51
3	47	309.6372676471217	261.96151536372787	20/04/28 05:10:52
3	47	309.3432343209249	261.97118074623995	20/04/28 05:10:52
3	47	309.14253018691187	261.97777823725255	20/04/28 05:10:52
3	47	308.88790436447533	261.9861482271552	20/04/28 05:10:52
3	47	308.64133731320203	261.99425331135177	20/04/28 05:10:52
3	47	308.42239397001794	262.00145035662456	20/04/28 05:10:52
3	47	308.20080230885077	262.0087344566767	20/04/28 05:10:52
3	47	308.0136353994758	262.0148869557696	20/04/28 05:10:52
3	47	307.815703441121	262.02139332058755	20/04/28 05:10:52
3	47	307.606149053318	262.0282817347051	20/04/28 05:10:52
3	47	307.4354118550703	262.0338941608591	20/04/28 05:10:53
3	47	307.1661592323241	262.0427449589128	20/04/28 05:10:53
3	47	307.0108516202236	262.0478501879608	20/04/28 05:10:53
3	47	306.8343425759142	262.05365234464887	20/04/28 05:10:53
3	47	306.6741805602141	262.05891714631497	20/04/28 05:10:53
3	47	306.46556022253026	262.06577485659426	20/04/28 05:10:53
3	47	306.26149352637196	262.07248288082354	20/04/28 05:10:53
3	47	306.0185011368646	262.0804704597232	20/04/28 05:10:53
3	47	305.7477211676579	262.08937146428906	20/04/28 05:10:53
3	47	305.51043743941665	262.21873380549584	20/04/28 05:10:54
3	47	305.3878608972425	262.32437318496744	20/04/28 05:10:54
3	47	305.19107699240465	262.49396623457005	20/04/28 05:10:54
3	47	305.0144178269353	262.6462153051273	20/04/28 05:10:54
3	47	304.78771340933434	262.84159456427466	20/04/28 05:10:54
3	47	304.5842416021779	263.01695140716413	20/04/28 05:10:54
3	47	304.374244900068	263.19793155971604	20/04/28 05:10:54
3	47	304.22723800188703	263.32462560105887	20/04/28 05:10:54
3	47	304.02172854284913	263.50173854080435	20/04/28 05:10:54
3	47	303.8499992439178	263.6497389351246	20/04/28 05:10:54
3	47	303.6497724173275	263.8222991765818	20/04/28 05:10:55
3	47	303.4436290946764	263.9999583950653	20/04/28 05:10:55
3	47	303.25728419209474	264.16055486423676	20/04/28 05:10:55
3	47	303.1396693151842	264.26191816257324	20/04/28 05:10:55
3	47	303.007370778778	264.3759361879071	20/04/28 05:10:55
3	47	302.7939319176907	264.55988287493585	20/04/28 05:10:55
3	47	302.5798454584754	264.7443876774342	20/04/28 05:10:55
1	56	302.4188884485448	264.8813335476131	20/04/28 05:10:55
1	56	302.6160609919705	264.699406458164	20/04/28 05:10:55
1	56	302.74669449101754	264.5788735895745	20/04/28 05:10:56
1	56	302.8664800384935	264.46834990492886	20/04/28 05:10:56
1	56	303.050603587437	264.29846285688274	20/04/28 05:10:56
1	56	303.2709380463206	264.0951647398448	20/04/28 05:10:56
1	56	303.39262051941756	263.98289080056867	20/04/28 05:10:56
1	56	303.55320260821213	263.83472497826665	20/04/28 05:10:56
1	56	303.7264259463422	263.6748953327028	20/04/28 05:10:56
1	56	303.91773709436393	263.49837643339737	20/04/28 05:10:56
1	56	304.1264450093903	263.3058058915458	20/04/28 05:10:56
1	56	304.3371813443674	263.1113637679242	20/04/28 05:10:56
1	56	304.51968095229313	262.9429750971759	20/04/28 05:10:57
1	56	304.7076751048675	262.7695167220032	20/04/28 05:10:57
1	56	304.7076751048675	262.7695167220032	20/04/28 05:10:57
1	56	304.8617703422431	262.6273361853694	20/04/28 05:10:57
1	56	305.0515196405263	262.45225837300313	20/04/28 05:10:57
1	56	305.2059221359277	262.3097943356477	20/04/28 05:10:57
1	56	305.3897015749875	262.1402247907819	20/04/28 05:10:57
1	56	305.5711352538886	261.97281963103177	20/04/28 05:10:57
1	56	305.8043063415504	261.9151458235814	20/04/28 05:10:57
1	56	305.8043063415504	261.9151458235814	20/04/28 05:10:57
1	56	306.09167992487164	261.9573642721138	20/04/28 05:10:58
1	56	306.2500244305313	261.98062688131165	20/04/28 05:10:58
1	56	306.4046919292538	262.003349296361	20/04/28 05:10:58
1	56	306.5929828470397	262.03101137416854	20/04/28 05:10:58
1	56	306.77375087914663	262.05756825449	20/04/28 05:10:58
1	56	306.9752544904892	262.0871714272877	20/04/28 05:10:58
1	56	307.1923013564632	262.1190580810098	20/04/28 05:10:58
1	56	307.4566378915977	262.1578921250957	20/04/28 05:10:58
1	56	307.7301589650064	262.1980754823367	20/04/28 05:10:58
1	56	307.9268325365732	262.2269690673452	20/04/28 05:10:59
1	56	308.07840936500907	262.2492374277702	20/04/28 05:10:59
1	56	308.23735443974476	262.27258826739734	20/04/28 05:10:59
1	56	308.5165384088084	262.3136035684308	20/04/28 05:10:59
1	56	308.5165384088084	262.3136035684308	20/04/28 05:10:59
1	56	308.7566798369711	262.3488830760606	20/04/28 05:10:59
1	56	308.9314790090045	262.37456306293586	20/04/28 05:10:59
1	56	309.16600120792623	262.4090170418662	20/04/28 05:10:59
1	56	309.38224707954544	262.44078602040554	20/04/28 05:10:59
1	56	309.61516945977024	262.47500496776985	20/04/28 05:10:59
1	56	309.8998797169814	262.51683214339886	20/04/28 05:11:00
1	56	310.17368078848045	262.5570566355446	20/04/28 05:11:00
1	56	310.3353484703955	262.5808074571386	20/04/28 05:11:00
1	56	310.58476532209784	262.61744963000297	20/04/28 05:11:00
1	56	310.58476532209784	262.61744963000297	20/04/28 05:11:00
1	56	310.73769748886184	262.6399171050466	20/04/28 05:11:00
1	56	310.9177461854991	262.66636830680443	20/04/28 05:11:00
1	56	311.2057115606963	262.7086736962956	20/04/28 05:11:00
1	56	311.4072225678605	262.73827795562363	20/04/28 05:11:00
1	56	311.5707970899846	262.7623089137364	20/04/28 05:11:01
1	56	311.85052119738725	262.8034035672364	20/04/28 05:11:01
1	56	312.1081757252833	262.8412559484448	20/04/28 05:11:01
1	56	312.3673991838329	262.87933882341434	20/04/28 05:11:01
1	56	312.64264228651007	262.9197751663446	20/04/28 05:11:01
1	56	312.91814113879315	262.96024908180135	20/04/28 05:11:01
1	56	312.91814113879315	262.96024908180135	20/04/28 05:11:01
1	56	312.91814113879315	262.96024908180135	20/04/28 05:11:01
1	56	313.1411221368866	262.99300752703806	20/04/28 05:11:01
1	56	313.30165273539615	263.01659129814436	20/04/28 05:11:01
1	56	313.5771052401936	263.0570584046282	20/04/28 05:11:02
1	56	313.8093393737215	263.0911762407233	20/04/28 05:11:02
1	56	314.00538495929186	263.11997756744495	20/04/28 05:11:02
1	56	314.15436934452595	263.14186506847216	20/04/28 05:11:02
1	56	314.41780292184205	263.1805664577825	20/04/28 05:11:02
1	56	314.67319965190444	263.2180871428047	20/04/28 05:11:02
1	56	314.85530178433476	263.2448400176403	20/04/28 05:11:02
1	56	315.13157862932263	263.28542822907576	20/04/28 05:11:02
1	56	315.3562044624294	263.3184283192875	20/04/28 05:11:02
1	56	315.56236825530414	263.3487161257662	20/04/28 05:11:02
1	56	315.8513670352016	263.3911733341638	20/04/28 05:11:03
1	56	316.0074545196576	263.4141043612711	20/04/28 05:11:03
1	56	316.2399289469132	263.44825749924837	20/04/28 05:11:03
1	56	316.42606522860456	263.4756030365026	20/04/28 05:11:03
1	56	316.6133252150284	263.50311365876524	20/04/28 05:11:03
1	56	316.7930084914721	263.52951117613964	20/04/28 05:11:03
1	56	316.94992060751815	263.5525633510085	20/04/28 05:11:03
1	56	317.15420324374605	263.58257479417586	20/04/28 05:11:03
1	56	317.41195785442534	263.6204418786837	20/04/28 05:11:03
1	56	317.60518544734384	263.6488292102275	20/04/28 05:11:04
1	56	317.81489809060434	263.6796383831994	20/04/28 05:11:04
1	56	317.9929099096691	263.7057903444705	20/04/28 05:11:04
1	56	318.2176163593193	263.7388022781695	20/04/28 05:11:04
1	56	318.51224640460856	263.782086783514	20/04/28 05:11:04
1	56	318.66991642101704	263.80525030256786	20/04/28 05:11:04
1	56	318.66991642101704	263.80525030256786	20/04/28 05:11:04
1	56	318.9178733826519	263.84167800097373	20/04/28 05:11:04
1	56	319.10873456800033	263.8697176803254	20/04/28 05:11:04
1	56	319.38633580534787	263.91050046006467	20/04/28 05:11:04
1	56	319.67102023410047	263.9523238411993	20/04/28 05:11:05
1	56	319.82512942795836	263.9749642349128	20/04/28 05:11:05
1	56	320.0895279285476	264.0138073824289	20/04/28 05:11:05
1	56	320.3343641569936	264.04977660962805	20/04/28 05:11:05
1	56	320.50666537103484	264.0750896180577	20/04/28 05:11:05
1	56	320.80285095287064	264.1186026494166	20/04/28 05:11:05
1	56	321.02728769203674	264.1515749595773	20/04/28 05:11:05
1	56	321.20354078289307	264.1774685436674	20/04/28 05:11:05
1	56	321.3959743309941	264.2057392209945	20/04/28 05:11:05
1	56	321.5598933284577	264.22982078645333	20/04/28 05:11:06
1	56	321.8465943388205	264.271940426367	20/04/28 05:11:06
1	56	322.0979812351422	264.30887202119703	20/04/28 05:11:06
1	56	322.3106760311098	264.34011930632636	20/04/28 05:11:06
1	56	322.5280506828544	264.372054115507	20/04/28 05:11:06
1	56	322.766119243774	264.407029095358	20/04/28 05:11:06
1	56	323.0383219337371	264.447018767073	20/04/28 05:11:06
1	56	323.2822195567718	264.48285010245974	20/04/28 05:11:06
1	56	323.4514076104137	264.5077057522116	20/04/28 05:11:06
1	56	323.6696877079239	264.53977358167555	20/04/28 05:11:06
1	56	323.9315421669246	264.5782429805414	20/04/28 05:11:07
1	56	324.08477334790354	264.60075438417476	20/04/28 05:11:07
1	56	324.374917291332	264.64337983012234	20/04/28 05:11:07
1	56	324.61290856706813	264.6783434559007	20/04/28 05:11:07
1	56	324.9046371922989	264.7212017096323	20/04/28 05:11:07
1	56	325.1378131218662	264.7554579062794	20/04/28 05:11:07
1	56	325.3393981961026	264.78507304690294	20/04/28 05:11:07
1	56	325.55262204893023	264.8163980565035	20/04/28 05:11:07
1	56	325.7346095221942	264.8431340866032	20/04/28 05:11:07
1	56	325.9737816106137	264.8782711871976	20/04/28 05:11:07
1	56	326.14616886601976	264.90359683608256	20/04/28 05:11:08
1	56	326.14616886601976	264.90359683608256	20/04/28 05:11:08
1	56	326.4045243905854	264.9415522016763	20/04/28 05:11:08
1	56	326.68796642275265	264.9831930606191	20/04/28 05:11:08
1	56	326.84982103696314	265.0069713446938	20/04/28 05:11:08
1	56	327.09617386563446	265.04316337771877	20/04/28 05:11:08
1	56	327.2523501594349	265.06610745192904	20/04/28 05:11:08
1	56	327.5333008758632	265.10738230824876	20/04/28 05:11:08
1	56	327.69648932424707	265.13135654773714	20/04/28 05:11:08
1	56	327.8563891533794	265.1548476516464	20/04/28 05:11:09
1	56	328.1479640792215	265.1976833251893	20/04/28 05:11:09
1	56	328.4285645236677	265.23890672257016	20/04/28 05:11:09
1	56	328.60320267648353	265.26456305389064	20/04/28 05:11:09
1	56	328.8653350452886	265.30307328086826	20/04/28 05:11:09
1	56	329.15327633119455	265.3453751313685	20/04/28 05:11:09
1	56	329.425652806004	265.3853903340544	20/04/28 05:11:09
1	56	329.6998718082361	265.4256762249792	20/04/28 05:11:09
1	56	329.9905869361672	265.468385584428	20/04/28 05:11:09
1	56	330.14945802703915	265.49172555498393	20/04/28 05:11:09
1	56	330.4355516539174	265.53375596335417	20/04/28 05:11:10
1	56	330.65414496135656	265.5658698069197	20/04/28 05:11:10
1	56	330.87083537799475	265.5977040941794	20/04/28 05:11:10
1	56	331.0991381870749	265.6312443739906	20/04/28 05:11:10
1	56	331.2483818825133	265.6531699706367	20/04/28 05:11:10
1	56	331.523232931617	265.6935487164371	20/04/28 05:11:10
1	56	331.7808532349574	265.731396069669	20/04/28 05:11:10
1	56	331.933415565502	265.7538092115648	20/04/28 05:11:10
1	56	332.22933498067397	265.7972831400129	20/04/28 05:11:10
1	56	332.50355568640236	265.8375692812007	20/04/28 05:11:10
1	56	332.7586043824423	265.8750388360657	20/04/28 05:11:11
1	56	332.9825513064261	265.907939186804	20/04/28 05:11:11
1	56	333.2053875443915	265.94067636513114	20/04/28 05:11:11
1	56	333.47566490666935	265.9803831843068	20/04/28 05:11:11
1	56	333.76373547740525	266.02270402821927	20/04/28 05:11:11
1	56	333.9266676841307	266.04664062289305	20/04/28 05:11:11
1	56	334.10501249255697	266.0728415040894	20/04/28 05:11:11
1	56	334.3631817308501	266.11076950211054	20/04/28 05:11:11
1	56	334.5378121740232	266.1364247007968	20/04/28 05:11:11
1	56	334.5378121740232	266.1364247007968	20/04/28 05:11:12
1	56	334.80413741884786	266.17555090895956	20/04/28 05:11:12
1	56	335.0118477228889	266.2060659155216	20/04/28 05:11:12
1	56	335.0118477228889	266.2060659155216	20/04/28 05:11:12
1	56	335.2990249429955	266.248255516064	20/04/28 05:11:12
1	56	335.5142664192556	266.2798769374991	20/04/28 05:11:12
1	56	335.80315287716775	266.3223176445193	20/04/28 05:11:12
1	56	335.97146303151044	266.34704432087716	20/04/28 05:11:12
1	56	336.19380698815655	266.37970917747833	20/04/28 05:11:12
1	56	336.41130017774793	266.41166140121715	20/04/28 05:11:12
1	56	336.5866980448813	266.43742934321335	20/04/28 05:11:13
1	56	337.1299082901971	266.5172331077734	20/04/28 05:11:13
1	56	337.4229861585766	266.5602895806724	20/04/28 05:11:13
1	56	337.4229861585766	266.5602895806724	20/04/28 05:11:13
1	56	337.69750268139944	266.60061918075655	20/04/28 05:11:13
1	56	337.96194162919664	266.6394682704276	20/04/28 05:11:13
1	56	338.411376109107	266.70549530826275	20/04/28 05:11:13
1	56	338.60771666269386	266.73433996914156	20/04/28 05:11:13
1	56	338.60771666269386	266.73433996914156	20/04/28 05:11:13
1	56	338.90234360682086	266.7776240188901	20/04/28 05:11:14
1	56	339.1511925972759	266.8141827664773	20/04/28 05:11:14
1	56	339.4090653932099	266.85206721374357	20/04/28 05:11:14
1	56	339.6645250951537	266.88959715005143	20/04/28 05:11:14
1	56	340.14274090686143	266.95985249294216	20/04/28 05:11:14
1	56	340.4205583800175	267.0006670401816	20/04/28 05:11:14
1	56	340.69236476150354	267.04059848967296	20/04/28 05:11:14
1	56	340.85047874446286	267.0638272324637	20/04/28 05:11:14
1	56	341.04350936665344	267.0921856267669	20/04/28 05:11:14
1	56	341.31874986138746	267.1326215865606	20/04/28 05:11:14
1	56	341.56562784420055	267.1688907707032	20/04/28 05:11:15
1	56	341.751375780512	267.19617925560334	20/04/28 05:11:15
1	56	342.0467152614026	267.2395679851082	20/04/28 05:11:15
1	56	342.20512477490223	267.26284014469724	20/04/28 05:11:15
1	56	342.37790016585393	267.28822281510924	20/04/28 05:11:15
1	56	342.5864396327569	267.3188596351282	20/04/28 05:11:15
1	56	342.8418986013279	267.3563894636953	20/04/28 05:11:15
1	56	343.09103772717924	267.39299083547274	20/04/28 05:11:15
1	56	343.3356320523829	267.4289245243337	20/04/28 05:11:15
1	56	343.54782893231567	267.46009865993324	20/04/28 05:11:15
1	56	343.7228342936598	267.4858089383639	20/04/28 05:11:16
1	56	343.9094017738404	267.5132178235815	20/04/28 05:11:16
1	56	344.0608468002641	267.53546682079156	20/04/28 05:11:16
1	56	344.2184292823442	267.5586174800568	20/04/28 05:11:16
1	56	344.4773743147124	267.5966594510529	20/04/28 05:11:16
1	56	344.7677000812385	267.63931160888194	20/04/28 05:11:16
1	56	344.91643572500624	267.66116256695807	20/04/28 05:11:16
1	56	345.18793305451396	267.70104861319805	20/04/28 05:11:16
1	56	345.4692949262779	267.7423838729139	20/04/28 05:11:16
1	56	345.7563499293779	267.78455551838766	20/04/28 05:11:17
1	56	345.7563499293779	267.78455551838766	20/04/28 05:11:17
1	56	345.96128480598395	267.8146627830864	20/04/28 05:11:17
1	56	346.2288468841035	267.8539706961304	20/04/28 05:11:17
1	56	346.8073218578658	267.9389552504684	20/04/28 05:11:17
1	56	346.8073218578658	267.9389552504684	20/04/28 05:11:17
1	56	347.2206509852959	267.9996780012922	20/04/28 05:11:17
1	56	347.3974257722966	268.02564822848063	20/04/28 05:11:17
1	56	347.54774340844205	268.0477315992337	20/04/28 05:11:17
1	56	347.54774340844205	268.0477315992337	20/04/28 05:11:17
1	56	347.70484888180124	268.07081218049143	20/04/28 05:11:18
1	56	348.12805895735727	268.13298655499995	20/04/28 05:11:18
1	56	348.12805895735727	268.13298655499995	20/04/28 05:11:18
1	56	348.292678438868	268.15717102953397	20/04/28 05:11:18
1	56	348.5516343198361	268.19521459431286	20/04/28 05:11:18
1	56	349.00418582777354	268.2616995590243	20/04/28 05:11:18
1	56	349.00418582777354	268.2616995590243	20/04/28 05:11:18
1	56	349.1688382136142	268.2858888675787	20/04/28 05:11:18
1	56	349.44458426619804	268.3263990995718	20/04/28 05:11:18
1	56	349.6073060545745	268.3503047813964	20/04/28 05:11:19
1	56	349.8189103560677	268.38139186048204	20/04/28 05:11:19
1	56	350.07268940166233	268.4186748892532	20/04/28 05:11:19
1	56	350.51307385864993	268.48337237576857	20/04/28 05:11:19
1	56	350.76006990808577	268.5196589052411	20/04/28 05:11:19
1	56	350.9860731210413	268.5528613482216	20/04/28 05:11:19
1	56	350.9860731210413	268.5528613482216	20/04/28 05:11:19
1	56	351.277886572898	268.5957320639495	20/04/28 05:11:19
1	56	351.51148433788103	268.6300502330179	20/04/28 05:11:19
1	56	351.7832667262464	268.66997815764694	20/04/28 05:11:19
1	56	352.0776361244709	268.71322437097257	20/04/28 05:11:20
1	56	352.27874572958444	268.74276965977305	20/04/28 05:11:20
1	56	352.47550066216957	268.77167519764066	20/04/28 05:11:20
1	56	352.6995126303403	268.80458510410995	20/04/28 05:11:20
1	56	352.92665353440566	268.8379546868568	20/04/28 05:11:20
1	56	353.2067258767835	268.87910050003615	20/04/28 05:11:20
1	78	353.3825281540459	269.02889326419336	20/04/28 05:11:20
1	78	353.5731970556195	269.2395575892932	20/04/28 05:11:20
1	78	353.741868363735	269.4259174360988	20/04/28 05:11:20
1	78	353.8521058173742	269.5477154775201	20/04/28 05:11:20
1	78	354.04636793407667	269.7623498377637	20/04/28 05:11:21
1	78	354.1655771495502	269.89406050854507	20/04/28 05:11:21
1	78	354.1655771495502	269.89406050854507	20/04/28 05:11:21
1	78	354.33784051428734	270.0843891104947	20/04/28 05:11:21
1	78	354.4656569182061	270.22560960448203	20/04/28 05:11:21
1	78	354.6246475422834	270.40127355514215	20/04/28 05:11:21
1	78	354.7668186113467	270.55835408618714	20/04/28 05:11:21
1	78	354.8077219632666	270.56145866797715	20/04/28 05:11:21
1	78	354.69039008041005	270.4889078798008	20/04/28 05:11:21
1	78	354.8125995948947	270.2636757994177	20/04/28 05:11:22
1	78	354.65497719722134	270.0184067673641	20/04/28 05:11:22
1	78	354.81972488456887	270.0132929169532	20/04/28 05:11:22
1	78	354.88441084808716	269.80265298404726	20/04/28 05:11:22
1	78	354.87313447954307	269.73176233136394	20/04/28 05:11:22
1	78	354.89903531528745	269.8621128781871	20/04/28 05:11:22
1	78	354.83675716736013	269.87367836454473	20/04/28 05:11:22
1	78	354.85891950293654	269.78719441552556	20/04/28 05:11:22
1	78	354.80450245700007	269.796161881175	20/04/28 05:11:22
1	78	354.61264784542465	269.74939593879327	20/04/28 05:11:22
1	78	354.73589014495406	269.7393947878059	20/04/28 05:11:23
1	78	354.71710314004224	269.7420325021059	20/04/28 05:11:23
1	78	354.6624323994521	269.67570180902646	20/04/28 05:11:23
1	78	354.8875050169433	269.75319321437223	20/04/28 05:11:23
1	78	354.7711963930778	269.71001473762357	20/04/28 05:11:23
1	78	354.58960226713475	269.776776560092	20/04/28 05:11:23
1	78	354.58960226713475	269.776776560092	20/04/28 05:11:23
1	78	354.58960226713475	269.776776560092	20/04/28 05:11:23
1	78	354.2983229461102	269.71309833297664	20/04/28 05:11:23
1	78	354.2586260021453	269.6828256500091	20/04/28 05:11:24
1	78	354.26896722977943	269.68438276924337	20/04/28 05:11:24
1	78	354.41029109941866	269.93619471129614	20/04/28 05:11:24
1	78	354.4436418409111	269.87421500898614	20/04/28 05:11:24
1	78	354.31987281500676	269.8656669070622	20/04/28 05:11:24
1	78	354.1848951000887	269.99826238701803	20/04/28 05:11:24
1	78	354.12412889543407	269.9880582203629	20/04/28 05:11:24
1	78	354.12677192213874	270.0212606623314	20/04/28 05:11:24
1	78	354.07524579187543	269.8276315574723	20/04/28 05:11:24
1	78	354.05332450256293	270.08083786789894	20/04/28 05:11:24
1	78	353.8745816125608	270.1346498980112	20/04/28 05:11:25
1	78	353.8537339093367	270.13004224150876	20/04/28 05:11:25
1	78	354.0700652567678	269.98992255563417	20/04/28 05:11:25
1	78	354.0461887068301	269.858441673262	20/04/28 05:11:25
1	78	354.13047332671437	270.1062631042865	20/04/28 05:11:25
1	78	354.02403024853	269.9551676305866	20/04/28 05:11:25
1	78	353.9440833247362	269.75044763041893	20/04/28 05:11:25
1	78	353.96362446204165	269.7632276725933	20/04/28 05:11:25
1	78	354.08309742929083	269.8507033773621	20/04/28 05:11:25
1	78	354.17115707975125	269.5916198722971	20/04/28 05:11:25
1	78	354.24065800676124	269.7184466846397	20/04/28 05:11:26
1	78	354.3115280079857	269.4809440984582	20/04/28 05:11:26
1	78	354.1650330974618	269.4872871451192	20/04/28 05:11:26
1	78	354.34017481351367	269.2919637707938	20/04/28 05:11:26
1	78	354.2235007555669	269.52432876758627	20/04/28 05:11:26
1	78	354.0263140337769	269.52303556702617	20/04/28 05:11:26
1	78	354.06849100524346	269.43784879858185	20/04/28 05:11:26
1	78	353.9402524069319	269.52078259870376	20/04/28 05:11:26
1	78	353.93864630942744	269.50441021448216	20/04/28 05:11:26
1	78	353.8599236375973	269.51360432487195	20/04/28 05:11:27
1	78	353.7862164781758	269.51957756476685	20/04/28 05:11:27
1	78	353.75166785047725	269.5450201785138	20/04/28 05:11:27
1	78	353.5806330131001	269.620197260909	20/04/28 05:11:27
1	78	353.65668586880304	269.65016062957653	20/04/28 05:11:27
1	78	353.6550755624369	269.6571743398093	20/04/28 05:11:27
1	78	353.6606337080147	269.7474284750008	20/04/28 05:11:27
1	78	353.6605574235983	269.7426987551571	20/04/28 05:11:27
1	78	353.7385556039255	269.68420899960097	20/04/28 05:11:27
1	78	353.6063944883792	269.74961354708233	20/04/28 05:11:27
1	78	353.4185164789225	269.9117455730946	20/04/28 05:11:28
1	78	353.36344066284033	269.8776566919443	20/04/28 05:11:28
1	78	353.3519438914708	269.9195680835875	20/04/28 05:11:28
1	78	353.23150208271875	269.7927199630383	20/04/28 05:11:28
1	78	353.23046409389224	269.82067561442824	20/04/28 05:11:28
1	78	352.9665177678434	269.791824835423	20/04/28 05:11:28
1	78	352.91892710676245	269.68553155978356	20/04/28 05:11:28
1	78	352.9179973003857	269.70611396006495	20/04/28 05:11:28
1	78	352.68362789354046	269.8309815360015	20/04/28 05:11:28
1	78	352.8445647415816	269.8137587497886	20/04/28 05:11:29
1	78	353.0203169987097	269.8661970743972	20/04/28 05:11:29
1	78	353.162680577188	269.84029440630366	20/04/28 05:11:29
1	78	353.1147937936271	269.6150739314433	20/04/28 05:11:29
1	78	353.04485736558917	269.6408676158194	20/04/28 05:11:29
1	78	353.20840945633864	269.8558874106938	20/04/28 05:11:29
1	78	353.3293766815834	269.7042350582888	20/04/28 05:11:29
1	78	353.32214772075355	269.73217161603174	20/04/28 05:11:29
1	78	353.11393290172737	269.5773378462013	20/04/28 05:11:29
1	78	353.11440639623413	269.53658825078844	20/04/28 05:11:29
1	78	353.3631267770867	269.4998591197156	20/04/28 05:11:30
1	78	353.37216678552556	269.54152515492694	20/04/28 05:11:30
1	78	353.3880413245098	269.34330476559717	20/04/28 05:11:30
1	78	353.41190452840885	269.3108819243098	20/04/28 05:11:30
1	78	353.1813831509371	269.2064784180053	20/04/28 05:11:30
1	78	353.16473806749366	269.19128615797126	20/04/28 05:11:30
1	78	353.23513146303526	269.25202473301107	20/04/28 05:11:30
1	78	353.1152504849809	269.1626656822951	20/04/28 05:11:30
1	78	353.0969621767323	268.904540342053	20/04/28 05:11:30
1	78	353.0977840685127	268.8972699597673	20/04/28 05:11:30
1	78	353.04444317940937	268.8958903273726	20/04/28 05:11:31
1	78	353.2837894360962	269.0229728754757	20/04/28 05:11:31
1	78	353.3722213716964	269.0873266158308	20/04/28 05:11:31
1	78	353.2998038558005	268.9622706107107	20/04/28 05:11:31
1	78	353.3327000789093	269.0906765562663	20/04/28 05:11:31
1	78	353.46334880285576	269.09874333312234	20/04/28 05:11:31
1	78	353.4494166224704	269.09670862203626	20/04/28 05:11:31
1	78	353.46492833750006	269.0848779068389	20/04/28 05:11:31
1	78	353.46492833750006	269.0848779068389	20/04/28 05:11:31
