stationId	t_start	t_end	t_max	timeStamp
108	20/04/28 05:13:59	20/04/28 05:13:59	20/04/28 05:08:49
63	20/04/28 05:14:01	20/04/28 05:14:01	20/04/28 05:14:01
37	20/04/28 05:14:03	20/04/28 05:14:03	20/04/28 05:14:03
70	20/04/28 05:14:05	20/04/28 05:14:05	20/04/28 05:14:05
70	20/04/28 05:14:07	20/04/28 05:14:07	20/04/28 05:14:07
108	20/04/28 05:14:09	20/04/28 05:14:09	20/04/28 05:14:09
159	20/04/28 05:14:11	20/04/28 05:14:11	20/04/28 05:14:11
70	20/04/28 05:14:13	20/04/28 05:14:13	20/04/28 05:14:13
140	20/04/28 05:14:15	20/04/28 05:14:17	20/04/28 05:14:16
160	20/04/28 05:14:19	20/04/28 05:14:19	20/04/28 05:14:19
160	20/04/28 05:14:21	20/04/28 05:14:21	20/04/28 05:14:21
13	20/04/28 05:14:23	20/04/28 05:14:23	20/04/28 05:14:23
160	20/04/28 05:14:25	20/04/28 05:14:25	20/04/28 05:14:25
13	20/04/28 05:14:27	20/04/28 05:14:27	20/04/28 05:14:27
70	20/04/28 05:14:29	20/04/28 05:14:30	20/04/28 05:14:30
70	20/04/28 05:14:32	20/04/28 05:14:33	20/04/28 05:14:33
160	20/04/28 05:14:35	20/04/28 05:14:35	20/04/28 05:14:35
77	20/04/28 05:14:37	20/04/28 05:14:37	20/04/28 05:14:37
77	20/04/28 05:14:39	20/04/28 05:14:40	20/04/28 05:14:40
70	20/04/28 05:14:42	20/04/28 05:14:42	20/04/28 05:14:42
129	20/04/28 05:14:44	20/04/28 05:14:44	20/04/28 05:14:44
70	20/04/28 05:14:46	20/04/28 05:14:46	20/04/28 05:14:46
70	20/04/28 05:14:48	20/04/28 05:14:48	20/04/28 05:14:48
70	20/04/28 05:14:50	20/04/28 05:14:50	20/04/28 05:14:50
2	20/04/28 05:14:52	20/04/28 05:14:52	20/04/28 05:14:52
70	20/04/28 05:14:54	20/04/28 05:14:55	20/04/28 05:14:55
77	20/04/28 05:14:57	20/04/28 05:14:57	20/04/28 05:14:57
77	20/04/28 05:14:59	20/04/28 05:15:00	20/04/28 05:15:00
77	20/04/28 05:15:02	20/04/28 05:15:03	20/04/28 05:15:02
160	20/04/28 05:15:05	20/04/28 05:15:05	20/04/28 05:15:05
77	20/04/28 05:15:07	20/04/28 05:15:08	20/04/28 05:15:07
77	20/04/28 05:15:10	20/04/28 05:15:12	20/04/28 05:15:10
77	20/04/28 05:15:14	20/04/28 05:15:14	20/04/28 05:15:14
162	20/04/28 05:15:16	20/04/28 05:15:16	20/04/28 05:15:16
2	20/04/28 05:15:18	20/04/28 05:15:18	20/04/28 05:15:18
2	20/04/28 05:15:20	20/04/28 05:15:21	20/04/28 05:15:21
2	20/04/28 05:15:23	20/04/28 05:15:23	20/04/28 05:15:23
70	20/04/28 05:15:25	20/04/28 05:15:25	20/04/28 05:15:25
70	20/04/28 05:15:27	20/04/28 05:15:27	20/04/28 05:15:27
77	20/04/28 05:15:29	20/04/28 05:15:30	20/04/28 05:15:30
77	20/04/28 05:15:32	20/04/28 05:15:32	20/04/28 05:15:32
77	20/04/28 05:15:34	20/04/28 05:15:34	20/04/28 05:15:34
63	20/04/28 05:15:36	20/04/28 05:15:36	20/04/28 05:15:36
70	20/04/28 05:15:38	20/04/28 05:15:39	20/04/28 05:15:39
112	20/04/28 05:15:41	20/04/28 05:15:41	20/04/28 05:15:41
112	20/04/28 05:15:43	20/04/28 05:15:43	20/04/28 05:15:43
51	20/04/28 05:15:45	20/04/28 05:15:45	20/04/28 05:15:45
112	20/04/28 05:15:47	20/04/28 05:15:47	20/04/28 05:15:47
112	20/04/28 05:15:49	20/04/28 05:15:49	20/04/28 05:15:49
109	20/04/28 05:15:51	20/04/28 05:15:51	20/04/28 05:15:51
109	20/04/28 05:15:53	20/04/28 05:15:53	20/04/28 05:15:53
109	20/04/28 05:15:55	20/04/28 05:15:55	20/04/28 05:15:55
129	20/04/28 05:15:57	20/04/28 05:15:57	20/04/28 05:15:57
