floorId	partitionId	location_x	location_y	timeStamp
1	97	336.8473754345931	292.59814324291045	20/04/28 05:09:30
1	97	336.94839119001574	292.78387356856217	20/04/28 05:09:30
1	97	337.0062723976281	292.90634868771446	20/04/28 05:09:30
1	97	337.0062723976281	292.90634868771446	20/04/28 05:09:30
1	97	337.1134007919607	293.0710750482835	20/04/28 05:09:30
1	97	336.92475275265156	293.03482784764196	20/04/28 05:09:30
1	97	337.123973724038	292.96024226023343	20/04/28 05:09:30
1	97	337.24822040411254	293.0924626776832	20/04/28 05:09:31
1	97	337.2380506225882	293.10508021239167	20/04/28 05:09:31
1	97	337.46494260977767	293.1855024405873	20/04/28 05:09:31
1	97	337.46494260977767	293.1855024405873	20/04/28 05:09:31
1	97	337.4206174781509	293.2343960620087	20/04/28 05:09:31
1	97	337.0055687746519	292.9532794419654	20/04/28 05:09:31
1	97	337.0055687746519	292.9532794419654	20/04/28 05:09:31
1	97	337.0176251731175	292.84665847643544	20/04/28 05:09:31
1	97	336.97616313946475	292.64278389472577	20/04/28 05:09:31
1	97	337.2570644464568	292.68692376540696	20/04/28 05:09:31
1	97	337.2570644464568	292.68692376540696	20/04/28 05:09:32
1	97	337.08815852310346	292.4671440476805	20/04/28 05:09:32
1	97	337.08129204275457	292.48213179028846	20/04/28 05:09:32
1	97	336.91952310169864	292.5822201410843	20/04/28 05:09:32
1	97	336.8948856145466	292.3969555907591	20/04/28 05:09:32
1	97	336.894577486604	292.39624421993557	20/04/28 05:09:32
1	97	337.0763413528747	292.3228385007991	20/04/28 05:09:32
1	97	337.0763413528747	292.3228385007991	20/04/28 05:09:32
1	97	337.03999503566934	292.11607867098274	20/04/28 05:09:32
1	97	336.74390339881717	292.12759238869063	20/04/28 05:09:33
1	97	336.4111179113689	292.0725788840807	20/04/28 05:09:33
1	97	336.4111179113689	292.0725788840807	20/04/28 05:09:33
1	97	336.29274521870684	292.2585494680038	20/04/28 05:09:33
1	97	336.67871631128537	292.18703091276075	20/04/28 05:09:33
1	97	336.56470806591574	291.9155486242176	20/04/28 05:09:33
1	97	336.4537557388634	291.9551889216409	20/04/28 05:09:33
1	97	336.3550024248369	291.71052333072265	20/04/28 05:09:33
1	97	336.08867407289955	291.62758858664864	20/04/28 05:09:33
1	97	335.9082120698806	291.53316250917527	20/04/28 05:09:33
1	97	336.1053661946248	291.7362167205187	20/04/28 05:09:34
1	97	336.1053661946248	291.7362167205187	20/04/28 05:09:34
1	97	335.99570867860587	291.83374667300484	20/04/28 05:09:34
1	97	335.99570867860587	291.83374667300484	20/04/28 05:09:34
1	97	335.9503369501937	291.7887979367472	20/04/28 05:09:34
1	97	335.9503369501937	291.7887979367472	20/04/28 05:09:34
1	97	336.04575643070734	291.7016599331852	20/04/28 05:09:34
1	97	336.2109082390818	291.94938636279176	20/04/28 05:09:34
1	97	335.9455762169699	291.8275539374762	20/04/28 05:09:34
1	97	335.97066596059653	292.0396894787784	20/04/28 05:09:34
1	97	336.06445404774877	292.06543026106687	20/04/28 05:09:35
1	97	335.99530026083755	292.11030235174354	20/04/28 05:09:35
1	97	335.99530026083755	292.11030235174354	20/04/28 05:09:35
1	97	335.94874709810676	292.0591446795981	20/04/28 05:09:35
1	97	335.975034311368	292.08018229499964	20/04/28 05:09:35
1	97	336.2139336196904	291.93404248304097	20/04/28 05:09:35
1	97	336.147790371525	291.8055224438439	20/04/28 05:09:35
1	97	336.1421943245306	291.6427720289976	20/04/28 05:09:35
1	97	336.0188591155013	291.7188157092176	20/04/28 05:09:35
1	97	336.29787257920185	291.79008226191394	20/04/28 05:09:36
1	97	336.1403970351599	291.60955594900963	20/04/28 05:09:36
1	97	335.9604914714954	291.7865839300777	20/04/28 05:09:36
1	97	335.95352029977903	291.62403150182246	20/04/28 05:09:36
1	97	336.18129295132866	291.6414394601127	20/04/28 05:09:36
1	97	336.11872610519833	291.67297707937075	20/04/28 05:09:36
1	97	336.1750354860563	291.9002932319075	20/04/28 05:09:36
1	97	336.1585095503667	292.0257550280767	20/04/28 05:09:36
1	97	336.3936515906567	292.0449163128315	20/04/28 05:09:36
1	97	336.47779134783616	292.16724330696576	20/04/28 05:09:36
1	97	336.5593081019818	292.1757112124866	20/04/28 05:09:37
1	97	336.5593081019818	292.1757112124866	20/04/28 05:09:37
1	97	336.6229690223117	292.4154671059504	20/04/28 05:09:37
1	97	336.6936489446479	292.5127659107589	20/04/28 05:09:37
1	97	336.99018432192486	292.47231984952293	20/04/28 05:09:37
1	97	336.7862032857149	292.4099263527128	20/04/28 05:09:37
1	97	336.7684706603136	292.22899148548754	20/04/28 05:09:37
1	97	336.77296279138176	292.23200062351833	20/04/28 05:09:37
1	97	336.5874671949219	292.1201891715981	20/04/28 05:09:37
1	97	336.57420368785546	292.10473680603826	20/04/28 05:09:38
1	97	336.5041040018289	291.9892949500245	20/04/28 05:09:38
1	97	336.35764385553574	291.99171827624923	20/04/28 05:09:38
1	97	336.3746751548501	291.85736846994604	20/04/28 05:09:38
1	97	336.36754941409646	292.01777771600877	20/04/28 05:09:38
1	97	336.63471939924864	292.0467054198334	20/04/28 05:09:38
1	97	336.6526628947104	291.8280947446007	20/04/28 05:09:38
1	97	336.58540347440197	291.68371743308927	20/04/28 05:09:38
1	97	336.59722745523527	291.6027938073322	20/04/28 05:09:38
1	97	336.5719322529914	291.7672892559886	20/04/28 05:09:38
1	97	336.50920083251305	291.6774823854187	20/04/28 05:09:39
1	97	336.68738812705965	291.7414038857315	20/04/28 05:09:39
1	97	336.6750642208271	291.90969005395675	20/04/28 05:09:39
1	97	336.7396465681952	292.13079171251934	20/04/28 05:09:39
1	97	336.6930399647006	291.8760360357759	20/04/28 05:09:39
1	97	336.815992301712	291.6557344297051	20/04/28 05:09:39
1	97	336.66761111059526	291.8638910918161	20/04/28 05:09:39
1	97	336.632482960456	291.9132229230163	20/04/28 05:09:39
1	97	336.7296476081697	291.83473036858766	20/04/28 05:09:39
1	97	336.7226812348253	291.8987339684195	20/04/28 05:09:39
1	97	336.7226812348253	291.8987339684195	20/04/28 05:09:40
1	97	336.9290978330707	291.9425929392977	20/04/28 05:09:40
1	97	336.98772281114515	292.03672258684026	20/04/28 05:09:40
1	97	336.98772281114515	292.03672258684026	20/04/28 05:09:40
1	97	336.9848467569126	292.26572259482066	20/04/28 05:09:40
1	97	336.98236227137517	292.2688311933531	20/04/28 05:09:40
1	97	336.84372585755676	292.3627554587536	20/04/28 05:09:40
1	97	337.0683925593276	292.43512233179496	20/04/28 05:09:40
1	97	337.0683925593276	292.43512233179496	20/04/28 05:09:40
1	97	336.8864843371655	292.6704776336835	20/04/28 05:09:41
1	97	336.8786309830393	292.67075845784007	20/04/28 05:09:41
1	97	336.63708284513956	292.5374171301432	20/04/28 05:09:41
1	97	336.6602159864161	292.5826025899976	20/04/28 05:09:41
1	97	336.70697961410673	292.623173674392	20/04/28 05:09:41
1	97	336.9862403538378	292.6642004015996	20/04/28 05:09:41
1	97	337.07922745190467	292.4621439492772	20/04/28 05:09:41
1	97	336.976190674254	292.56565740880956	20/04/28 05:09:41
1	97	337.07113090242194	292.7565162987476	20/04/28 05:09:41
1	97	337.07381569192967	292.75645590687475	20/04/28 05:09:41
1	97	337.07537397518297	292.7099601595969	20/04/28 05:09:42
1	97	337.0906169648599	292.9197228533996	20/04/28 05:09:42
1	97	337.0761620434056	292.88166071548784	20/04/28 05:09:42
1	97	337.15162169770076	292.81707286745797	20/04/28 05:09:42
1	97	337.05601011013056	292.67539486102993	20/04/28 05:09:42
1	97	337.10939641148315	292.8309473629081	20/04/28 05:09:42
1	97	337.12266257327093	292.82151349911777	20/04/28 05:09:42
1	97	337.2701307953029	293.02625222721525	20/04/28 05:09:42
1	97	337.4766371333752	293.23669267260294	20/04/28 05:09:42
1	97	337.60407168769507	293.2770462773141	20/04/28 05:09:43
1	97	337.5821294562704	293.4034416762209	20/04/28 05:09:43
1	97	337.6387784096143	293.40957725638634	20/04/28 05:09:43
1	97	337.68926448071795	293.42211750308235	20/04/28 05:09:43
1	97	337.7960222132336	293.4816116375819	20/04/28 05:09:43
1	97	337.6643847587708	293.3245728787085	20/04/28 05:09:43
1	97	337.79690619755274	293.25634163566275	20/04/28 05:09:43
1	97	337.7168511350884	293.3856804436498	20/04/28 05:09:43
1	97	337.6592255006458	293.32520934853585	20/04/28 05:09:43
1	97	337.8065511095852	293.2610516637375	20/04/28 05:09:43
1	97	337.9362950942299	293.2246763319578	20/04/28 05:09:44
1	97	337.8862960850564	293.3556811464989	20/04/28 05:09:44
1	97	338.09501950103584	293.4799860419725	20/04/28 05:09:44
1	97	337.9838798917782	293.4692891836005	20/04/28 05:09:44
1	97	338.2290179226748	293.33710510974197	20/04/28 05:09:44
1	97	338.3177630057684	293.4391789240293	20/04/28 05:09:44
1	97	338.246438409174	293.3284153664325	20/04/28 05:09:44
1	97	338.0147393142956	293.3312479102069	20/04/28 05:09:44
1	97	338.04739674616235	293.3549297792371	20/04/28 05:09:44
1	97	337.77130471563373	293.36954405332034	20/04/28 05:09:44
1	97	337.803371133766	293.38844031567953	20/04/28 05:09:45
1	97	338.006200535725	293.3136548675324	20/04/28 05:09:45
1	97	337.90974820296583	293.26434614166067	20/04/28 05:09:45
1	97	337.8582728239752	293.42652254892243	20/04/28 05:09:45
1	97	337.59524926852345	293.2941715080636	20/04/28 05:09:45
1	97	337.45699935487244	293.25211978309545	20/04/28 05:09:45
1	97	337.2475669261873	293.2697382632542	20/04/28 05:09:45
1	97	337.02337860501825	293.21725681402796	20/04/28 05:09:45
1	97	337.0606184074455	293.15955497806857	20/04/28 05:09:45
1	97	337.0976862144328	293.14566852504333	20/04/28 05:09:46
1	97	337.15124264424816	293.0717871620472	20/04/28 05:09:46
1	97	337.18264980619335	292.86928474690404	20/04/28 05:09:46
1	97	336.93820237040006	292.8820424813671	20/04/28 05:09:46
1	97	337.00321503970866	292.80058144093164	20/04/28 05:09:46
1	97	336.9881154127838	292.7989804073039	20/04/28 05:09:46
1	97	337.1512304811731	292.767361643369	20/04/28 05:09:46
1	97	337.1515196731206	292.73479738895287	20/04/28 05:09:46
1	97	336.96094105965665	292.9149142532973	20/04/28 05:09:46
1	97	337.0118327926293	292.89778831270706	20/04/28 05:09:46
1	97	337.01098424615867	292.8966475717984	20/04/28 05:09:47
1	97	337.0481318466671	292.9250305453462	20/04/28 05:09:47
1	97	337.0394797914707	292.8239630842068	20/04/28 05:09:47
1	97	337.0223586752217	292.7705255049617	20/04/28 05:09:47
1	97	337.0046037571641	292.79687145458024	20/04/28 05:09:47
1	97	337.2123750485367	292.71983105388244	20/04/28 05:09:47
1	97	337.19487590441673	292.7025440979001	20/04/28 05:09:47
1	97	337.3561103862011	292.52279443334214	20/04/28 05:09:47
1	97	337.3808928719735	292.30094237182067	20/04/28 05:09:47
1	97	337.58272843949317	292.2155480012887	20/04/28 05:09:48
1	97	337.60920022063397	292.27523543601995	20/04/28 05:09:48
1	97	337.67463871257934	292.31416842628073	20/04/28 05:09:48
1	97	337.68015063779404	292.2138652191412	20/04/28 05:09:48
1	97	337.56842099988086	292.1650292216769	20/04/28 05:09:48
1	97	337.59250254580314	292.1801235076304	20/04/28 05:09:48
1	97	337.77005835498636	292.07802282594577	20/04/28 05:09:48
1	97	337.9314438741091	292.3197925406035	20/04/28 05:09:48
1	97	337.8623782185672	292.18285983815076	20/04/28 05:09:48
1	97	338.10016067019376	292.2512690319701	20/04/28 05:09:48
1	97	337.9341503514852	292.4890816284997	20/04/28 05:09:49
1	97	337.71776725819876	292.315193205194	20/04/28 05:09:49
1	97	337.59714579590326	292.3900853604148	20/04/28 05:09:49
1	97	337.5897184217211	292.3721719197801	20/04/28 05:09:49
1	97	337.55930431990197	292.14777960913403	20/04/28 05:09:49
1	97	337.5236560772119	292.2987240510448	20/04/28 05:09:49
1	97	337.3987385958149	292.09748816731303	20/04/28 05:09:49
1	97	337.448996556198	292.154866282938	20/04/28 05:09:49
1	97	337.32689768505895	292.1558454961921	20/04/28 05:09:49
1	97	337.32042752022016	292.3964269779174	20/04/28 05:09:49
1	97	337.5950284720027	292.40473485989867	20/04/28 05:09:50
1	97	337.802376961268	292.3807738749571	20/04/28 05:09:50
1	97	337.80185082496536	292.3787134476942	20/04/28 05:09:50
1	97	337.7073764559004	292.30524493649153	20/04/28 05:09:50
1	97	337.73895764691935	292.16136090474726	20/04/28 05:09:50
1	97	337.5264107353861	292.17462031953124	20/04/28 05:09:50
1	97	337.8126423590171	292.1629566636834	20/04/28 05:09:50
1	97	337.8113318064679	291.90985411992574	20/04/28 05:09:50
1	97	337.8371648677826	292.13847689672906	20/04/28 05:09:50
1	97	338.06063804606384	292.10332566250435	20/04/28 05:09:51
1	97	338.0700796106603	292.1125262307715	20/04/28 05:09:51
1	97	338.0380528869251	292.174644333031	20/04/28 05:09:51
1	97	338.01394101844676	292.197955287625	20/04/28 05:09:51
1	97	338.19629972473723	292.0533000493563	20/04/28 05:09:51
1	97	338.3065519595079	292.16695286544376	20/04/28 05:09:51
1	97	338.3065519595079	292.16695286544376	20/04/28 05:09:51
1	97	338.51751531059926	291.96539218853434	20/04/28 05:09:51
1	97	338.69937165796966	291.9340920562928	20/04/28 05:09:51
1	97	338.630465843902	291.8375731167122	20/04/28 05:09:51
1	97	338.54417732140234	291.745271332532	20/04/28 05:09:52
1	97	338.54417732140234	291.745271332532	20/04/28 05:09:52
1	97	338.37205471117323	291.9014393469365	20/04/28 05:09:52
1	97	338.37205471117323	291.9014393469365	20/04/28 05:09:52
1	97	338.37205471117323	291.9014393469365	20/04/28 05:09:52
1	97	338.57271792455293	291.90030906875114	20/04/28 05:09:52
1	97	338.60720952596336	291.9070786726455	20/04/28 05:09:52
1	97	338.60165778004296	291.9802066504019	20/04/28 05:09:52
1	97	338.4870889977379	291.8387749230608	20/04/28 05:09:52
1	97	338.497965884458	291.63235655350917	20/04/28 05:09:52
1	97	338.42129421780015	291.54655037430155	20/04/28 05:09:53
1	97	338.30853617872083	291.3170081342407	20/04/28 05:09:53
1	97	338.24863890657707	291.3499636163576	20/04/28 05:09:53
1	97	338.07331152011824	291.5111280557473	20/04/28 05:09:53
1	97	338.18898183389064	291.4262241378773	20/04/28 05:09:53
1	97	338.1323869042157	291.27831020629253	20/04/28 05:09:53
1	97	337.9404278046827	291.23579521518104	20/04/28 05:09:53
1	97	337.9404278046827	291.23579521518104	20/04/28 05:09:53
1	97	337.893095494391	291.09264487283076	20/04/28 05:09:53
1	97	337.893095494391	291.09264487283076	20/04/28 05:09:54
1	97	338.14056161226296	291.1505478087292	20/04/28 05:09:54
1	97	338.33145392895585	291.0843983470846	20/04/28 05:09:54
1	97	338.4087234296319	290.9705605870907	20/04/28 05:09:54
1	97	338.30954969067903	291.0177348053315	20/04/28 05:09:54
1	97	338.4440470420069	291.1862962826637	20/04/28 05:09:54
1	97	338.7180547510306	291.06956082007434	20/04/28 05:09:54
1	97	338.9522561878129	290.90947813885646	20/04/28 05:09:54
1	97	338.9518885015042	290.9100311442539	20/04/28 05:09:54
1	97	338.9408512649251	290.81303713629353	20/04/28 05:09:54
1	97	338.7438942822215	290.754766776354	20/04/28 05:09:55
1	97	338.580746526238	290.8227640883884	20/04/28 05:09:55
1	97	338.5902023260287	290.9576490492853	20/04/28 05:09:55
1	97	338.45669883702647	290.9219041697835	20/04/28 05:09:55
1	97	338.2199117515398	290.98425752712154	20/04/28 05:09:55
1	97	338.12183072069666	290.88691511692696	20/04/28 05:09:55
1	97	338.02267527981354	290.84247081259934	20/04/28 05:09:55
1	97	337.7287981080646	290.8376794049641	20/04/28 05:09:55
1	97	337.8611210341348	290.87424292551145	20/04/28 05:09:55
1	97	337.6746531530864	290.7712631284653	20/04/28 05:09:56
1	97	337.53517901188064	290.8460216408648	20/04/28 05:09:56
1	97	337.25818595528744	290.75559239944937	20/04/28 05:09:56
1	97	337.1000697466802	290.81842268007756	20/04/28 05:09:56
1	97	337.3349608495463	290.65213480863133	20/04/28 05:09:56
1	97	337.60009040162663	290.7076077803022	20/04/28 05:09:56
1	97	337.67125727300095	290.6933766299075	20/04/28 05:09:56
1	97	337.6962118804232	290.6794282215196	20/04/28 05:09:56
1	97	337.8173085162105	290.6921694181971	20/04/28 05:09:56
1	97	337.7850010475205	290.72090499321325	20/04/28 05:09:56
1	97	337.7961313942015	290.7551393468647	20/04/28 05:09:57
1	97	338.0133780070771	290.8050646299045	20/04/28 05:09:57
1	97	337.962235936546	290.78393470065913	20/04/28 05:09:57
1	97	338.00831878472025	290.66180217224513	20/04/28 05:09:57
1	97	337.99485493251814	290.5854544912927	20/04/28 05:09:57
1	97	337.80721819498166	290.6495610074543	20/04/28 05:09:57
1	97	337.8981350677903	290.6946653616793	20/04/28 05:09:57
1	97	337.7374998655269	290.8235279610628	20/04/28 05:09:57
1	97	337.60520898797495	290.6218052644571	20/04/28 05:09:57
1	97	337.69867552586675	290.85759302906695	20/04/28 05:09:58
1	97	337.69867552586675	290.85759302906695	20/04/28 05:09:58
1	97	337.9135862901381	290.9802095851526	20/04/28 05:09:58
1	97	337.7148690224477	291.0080326493836	20/04/28 05:09:58
1	97	337.6948495541805	290.92807158169876	20/04/28 05:09:58
1	97	337.91171701316546	290.72594721333166	20/04/28 05:09:58
1	97	337.96408955363546	290.7180592350084	20/04/28 05:09:58
1	97	338.05632312132116	290.70298916260305	20/04/28 05:09:58
1	97	338.2209933700495	290.8593979052423	20/04/28 05:09:58
1	97	338.27167959298436	290.8368044308612	20/04/28 05:09:58
1	97	338.27208290824285	290.58882416991594	20/04/28 05:09:59
1	97	338.28939597180903	290.5790925870687	20/04/28 05:09:59
1	97	338.18439833009415	290.3631121619052	20/04/28 05:09:59
1	97	338.2886940465427	290.53716073653874	20/04/28 05:09:59
1	97	338.2886940465427	290.53716073653874	20/04/28 05:09:59
1	97	338.2886940465427	290.53716073653874	20/04/28 05:09:59
1	97	338.06068977231524	290.6815319925979	20/04/28 05:09:59
1	97	337.97320585482606	290.74297269486016	20/04/28 05:09:59
1	97	337.8667642670823	290.6738722158872	20/04/28 05:09:59
1	97	337.94072335620564	290.8445307989691	20/04/28 05:09:59
1	97	337.94300956906824	290.6237159199299	20/04/28 05:10:00
1	97	337.70056961059413	290.65764627737724	20/04/28 05:10:00
1	97	337.7759621005671	290.73062462008875	20/04/28 05:10:00
1	97	337.575006074263	290.54529096582354	20/04/28 05:10:00
1	97	337.72509133920585	290.7705267712855	20/04/28 05:10:00
1	97	337.72509133920585	290.7705267712855	20/04/28 05:10:00
1	97	337.8048803859184	290.7633326364493	20/04/28 05:10:00
1	97	337.87900727436903	290.5194236909134	20/04/28 05:10:00
1	97	338.0645231976045	290.52026084498095	20/04/28 05:10:00
1	97	338.2455480782754	290.3708930303871	20/04/28 05:10:01
1	97	338.29901098940604	290.4690698683828	20/04/28 05:10:01
1	97	338.1517713461047	290.4273000327294	20/04/28 05:10:01
1	97	337.9957630483752	290.5262733261742	20/04/28 05:10:01
1	97	338.2818685430213	290.47956527336885	20/04/28 05:10:01
1	97	338.27529908023945	290.6947907132727	20/04/28 05:10:01
1	97	338.3099433906033	290.6515822426902	20/04/28 05:10:01
1	97	338.2614056087481	290.6371309293659	20/04/28 05:10:01
1	97	338.2614056087481	290.6371309293659	20/04/28 05:10:01
1	97	338.45972931169626	290.7205633199105	20/04/28 05:10:01
1	97	338.50222117085383	290.8433273158119	20/04/28 05:10:02
1	97	338.4585557305014	290.73804521721314	20/04/28 05:10:02
1	97	338.4709905581914	290.891348085396	20/04/28 05:10:02
1	97	338.4497438645447	290.9268181771579	20/04/28 05:10:02
1	97	338.598179875171	290.79051208056546	20/04/28 05:10:02
1	97	338.5323110574816	290.81159197180443	20/04/28 05:10:02
1	97	338.497434428244	290.806015619081	20/04/28 05:10:02
1	97	338.63694657661193	290.758706478119	20/04/28 05:10:02
1	97	338.64172634491064	290.7622260120297	20/04/28 05:10:02
1	97	338.5313569267421	290.6979818508731	20/04/28 05:10:03
1	97	338.4757591799675	290.65443542981006	20/04/28 05:10:03
1	97	338.210116365247	290.7567075115651	20/04/28 05:10:03
1	97	338.0802775226523	290.9736395845286	20/04/28 05:10:03
1	97	338.04869910499747	290.87336920119685	20/04/28 05:10:03
1	97	338.01933106476355	291.0631262425594	20/04/28 05:10:03
1	97	337.9903494244454	290.7785271987957	20/04/28 05:10:03
1	97	337.94330892841515	290.7040435491329	20/04/28 05:10:03
1	97	337.98576873693037	290.67593521510474	20/04/28 05:10:03
1	97	338.1225414010614	290.87991086858074	20/04/28 05:10:03
1	97	338.1606810401574	291.1494520112907	20/04/28 05:10:04
1	97	338.0827673240243	291.1139147102612	20/04/28 05:10:04
1	97	338.1834770629631	291.0498660597029	20/04/28 05:10:04
1	97	338.20617247676364	291.05843285595597	20/04/28 05:10:04
1	97	338.06644459255324	291.25087972615967	20/04/28 05:10:04
1	97	338.21204010262795	291.0412021353308	20/04/28 05:10:04
1	97	338.16605304675466	290.97057540876136	20/04/28 05:10:04
1	97	338.2366333475938	290.9910293887795	20/04/28 05:10:04
1	97	338.1839106892186	291.0467484005758	20/04/28 05:10:04
1	97	338.1558020370898	290.9399600289841	20/04/28 05:10:05
1	97	338.10719336100095	290.9639032123634	20/04/28 05:10:05
1	97	338.16740110155786	290.8787039142402	20/04/28 05:10:05
1	97	338.26245419373436	290.93745179591144	20/04/28 05:10:05
1	97	338.26135599312363	290.95170515151966	20/04/28 05:10:05
1	97	338.3441422511085	290.81783519468047	20/04/28 05:10:05
1	97	338.52057105820313	290.9023754663926	20/04/28 05:10:05
1	97	338.38888179274824	291.12747813737803	20/04/28 05:10:05
1	97	338.4601234196546	291.082686796675	20/04/28 05:10:05
1	97	338.4033222104621	291.21063130728214	20/04/28 05:10:05
1	97	338.4076353406865	291.2087853974215	20/04/28 05:10:06
1	97	338.6166119490603	291.40002053441225	20/04/28 05:10:06
1	97	338.47647262626407	291.15535425288	20/04/28 05:10:06
1	97	338.4649736521291	291.15628217964417	20/04/28 05:10:06
1	97	338.3432840248952	291.40355183113246	20/04/28 05:10:06
1	97	338.5364181533928	291.52376623951955	20/04/28 05:10:06
1	97	338.4413851133715	291.4818847281903	20/04/28 05:10:06
1	97	338.63484848589576	291.3425550145813	20/04/28 05:10:06
1	97	338.3666750995641	291.3821156863479	20/04/28 05:10:06
1	97	338.3152899625672	291.4233263274736	20/04/28 05:10:07
1	97	338.2356537314917	291.35283507982194	20/04/28 05:10:07
1	97	338.41428059444286	291.198710140396	20/04/28 05:10:07
1	97	338.11976865007694	291.2312983317485	20/04/28 05:10:07
1	97	338.17501547677136	291.36103790061287	20/04/28 05:10:07
1	97	338.1807182196626	291.36003449615896	20/04/28 05:10:07
1	97	338.187789914493	291.40284545125184	20/04/28 05:10:07
1	97	338.1375695788487	291.38827992606923	20/04/28 05:10:07
1	97	337.8957317935595	291.2755075367692	20/04/28 05:10:07
1	97	337.8907833228069	291.2996374906747	20/04/28 05:10:07
1	97	337.8682402207837	291.22293506876576	20/04/28 05:10:08
1	97	337.70877426728117	291.4279668359955	20/04/28 05:10:08
1	97	337.68441117416387	291.15723559705884	20/04/28 05:10:08
1	97	337.6792611430217	291.1322470784964	20/04/28 05:10:08
1	97	337.5021650650294	291.1575616070586	20/04/28 05:10:08
1	97	337.4190028370007	291.2657385425126	20/04/28 05:10:08
1	97	337.4147695549905	291.495849166088	20/04/28 05:10:08
1	97	337.4861132181761	291.5124360396845	20/04/28 05:10:08
1	97	337.75827195840054	291.57980411050437	20/04/28 05:10:08
1	97	337.8141937345434	291.56164459386014	20/04/28 05:10:09
1	97	337.9464468290982	291.74541552611765	20/04/28 05:10:09
1	97	337.99022934077226	291.67725343534727	20/04/28 05:10:09
1	97	338.06235216402644	291.5675489686641	20/04/28 05:10:09
1	97	338.2107294271672	291.78568342291544	20/04/28 05:10:09
1	97	338.3312842903751	291.705306859953	20/04/28 05:10:09
1	97	338.18532353770706	291.6951300923485	20/04/28 05:10:09
1	97	338.17877357791394	291.6340105673089	20/04/28 05:10:09
1	97	338.16547246974625	291.6807110832987	20/04/28 05:10:09
1	97	338.1426812788174	291.690896896026	20/04/28 05:10:09
1	97	338.17854685336414	291.512500528119	20/04/28 05:10:10
1	97	338.3697553491993	291.5087615716097	20/04/28 05:10:10
1	97	338.4031223038448	291.47073364177675	20/04/28 05:10:10
1	97	338.573942302517	291.53137317020963	20/04/28 05:10:10
1	97	338.42993684325927	291.33759970197724	20/04/28 05:10:10
1	97	338.5478884247447	291.319808222819	20/04/28 05:10:10
1	97	338.3886584768852	291.4139377743626	20/04/28 05:10:10
1	97	338.3646335378755	291.22559911127854	20/04/28 05:10:10
1	97	338.38165435287004	291.2272376456694	20/04/28 05:10:10
1	97	338.37088273389264	291.2208645118317	20/04/28 05:10:10
1	97	338.2112970803699	291.136496287795	20/04/28 05:10:11
1	97	338.20615499799356	291.02316060478364	20/04/28 05:10:11
1	97	338.19265079853693	290.9933531008502	20/04/28 05:10:11
1	97	338.38470196726774	291.1202625505538	20/04/28 05:10:11
1	97	338.5010282057745	291.0942985957841	20/04/28 05:10:11
1	97	338.2367098750736	291.02300367789877	20/04/28 05:10:11
1	97	338.13509916705624	291.0562951225799	20/04/28 05:10:11
1	97	338.13043916813723	291.09457213623756	20/04/28 05:10:11
1	97	337.9994980915003	290.94957493809545	20/04/28 05:10:11
1	97	337.7603233175724	290.7787283699777	20/04/28 05:10:12
1	97	337.6874121685829	290.8929129358549	20/04/28 05:10:12
1	97	337.72214623796214	290.9823059222172	20/04/28 05:10:12
1	97	337.61665981248274	290.86559895768534	20/04/28 05:10:12
1	97	337.428795748514	291.03977093370025	20/04/28 05:10:12
1	97	337.5061948738734	291.09147972115386	20/04/28 05:10:12
1	97	337.6202319850322	291.00536231182423	20/04/28 05:10:12
1	97	337.78822265870696	290.8471852421648	20/04/28 05:10:12
1	97	337.89213967316465	290.7788524910536	20/04/28 05:10:12
1	97	338.1205834690515	290.8109768696922	20/04/28 05:10:12
1	97	338.1253400275041	290.8174051254587	20/04/28 05:10:13
1	97	338.1156360722333	290.8276050613441	20/04/28 05:10:13
1	97	338.21561663689	290.70484824394583	20/04/28 05:10:13
1	97	338.21956077155977	290.719322268521	20/04/28 05:10:13
1	97	338.28800332178486	290.70052763703256	20/04/28 05:10:13
1	97	338.3060900949117	290.68530385684005	20/04/28 05:10:13
1	97	338.05680437970244	290.6145025326372	20/04/28 05:10:13
1	97	337.81219886360645	290.466403614368	20/04/28 05:10:13
1	97	337.8033320672987	290.76337138179616	20/04/28 05:10:13
1	97	337.92493099682815	290.74228774931277	20/04/28 05:10:14
1	97	337.830472453926	290.5704295905989	20/04/28 05:10:14
1	97	337.71025900736225	290.4166671900886	20/04/28 05:10:14
1	97	337.7074417810779	290.41003809895716	20/04/28 05:10:14
1	97	337.5069491941557	290.3664836377612	20/04/28 05:10:14
1	97	337.57285237182646	290.6479329677174	20/04/28 05:10:14
1	97	337.56614670349467	290.6415873454951	20/04/28 05:10:14
1	97	337.8548660691294	290.6986485310061	20/04/28 05:10:14
1	97	338.11091478240894	290.76589994233007	20/04/28 05:10:14
1	97	338.1666995875103	290.81405566435683	20/04/28 05:10:14
1	97	338.07922128689506	290.5898694363681	20/04/28 05:10:15
1	97	338.074944619704	290.35406349192493	20/04/28 05:10:15
1	97	337.8782617869068	290.380698780131	20/04/28 05:10:15
1	97	338.11588591557205	290.310145749166	20/04/28 05:10:15
1	97	338.1129251317416	290.31647668368726	20/04/28 05:10:15
1	97	338.01366391742204	290.05741636733444	20/04/28 05:10:15
1	97	338.0698524241756	289.93675696595534	20/04/28 05:10:15
1	97	338.0370448960219	289.8994077919792	20/04/28 05:10:15
1	97	337.8918539111965	289.8544457435067	20/04/28 05:10:15
1	97	337.69380323517163	289.8816882308882	20/04/28 05:10:16
1	97	337.70164059449576	289.90574990817015	20/04/28 05:10:16
1	97	337.8909395475903	289.8134130260259	20/04/28 05:10:16
1	97	337.79386638830476	289.6608850895526	20/04/28 05:10:16
1	97	337.7872082604734	289.6511906241038	20/04/28 05:10:16
1	97	337.5149786990503	289.651585795842	20/04/28 05:10:16
1	97	337.5173737963943	289.655255083139	20/04/28 05:10:16
1	97	337.49883343513363	289.6487038941918	20/04/28 05:10:16
1	97	337.3334375528893	289.64035329340095	20/04/28 05:10:16
1	97	337.3116403152276	289.78412276363673	20/04/28 05:10:16
1	97	337.3945251230573	289.5165129291384	20/04/28 05:10:17
1	97	337.35465916622053	289.64849410492553	20/04/28 05:10:17
1	97	337.3627738261955	289.6510116013803	20/04/28 05:10:17
1	97	337.36314362554157	289.65132091454984	20/04/28 05:10:17
1	97	337.43486127360825	289.6874134738368	20/04/28 05:10:17
1	97	337.3692261073142	289.7375585887223	20/04/28 05:10:17
1	97	337.45165535675665	289.7718284617058	20/04/28 05:10:17
1	97	337.53988858731253	289.6812659022197	20/04/28 05:10:17
1	97	337.587341881392	289.69919694811864	20/04/28 05:10:17
1	97	337.59358281601374	289.56067755716384	20/04/28 05:10:17
1	97	337.41808171064173	289.5895175024556	20/04/28 05:10:18
1	97	337.4342043046786	289.3824898385679	20/04/28 05:10:18
1	97	337.4012156675484	289.5434567993993	20/04/28 05:10:18
1	97	337.411557200653	289.5526575246827	20/04/28 05:10:18
1	97	337.4013590330118	289.53183312354497	20/04/28 05:10:18
1	97	337.33172711908884	289.5975525506698	20/04/28 05:10:18
1	97	337.32099067916715	289.6068276627974	20/04/28 05:10:18
1	97	337.32237598339793	289.4760780336066	20/04/28 05:10:18
1	97	337.52897609063547	289.27243016258853	20/04/28 05:10:18
1	97	337.2602489131652	289.3391689434763	20/04/28 05:10:19
1	97	337.32046974198056	289.26751563295	20/04/28 05:10:19
1	97	337.4029082754999	289.5037512878369	20/04/28 05:10:19
1	97	337.4062495946517	289.49198232239945	20/04/28 05:10:19
1	97	337.4904312637071	289.51366533436084	20/04/28 05:10:19
1	97	337.35513567252514	289.7204243186644	20/04/28 05:10:19
1	97	337.3251676441508	289.87059145379084	20/04/28 05:10:19
1	97	337.16603359144403	290.0360239769927	20/04/28 05:10:19
1	97	337.4301739158953	290.08813006164416	20/04/28 05:10:19
1	97	337.4764563062747	289.81831097651417	20/04/28 05:10:19
1	97	337.4962754973126	289.92339758075747	20/04/28 05:10:20
1	97	337.61399116827147	289.9677422820829	20/04/28 05:10:20
1	97	337.6564260155885	289.8558176070421	20/04/28 05:10:20
1	97	337.7251320104603	289.8108217627125	20/04/28 05:10:20
1	97	337.8663041529308	289.90825783285004	20/04/28 05:10:20
1	97	337.88263655094	290.053028423402	20/04/28 05:10:20
1	97	337.89546969723705	289.9979994353955	20/04/28 05:10:20
1	97	337.9420473215823	289.8093126659279	20/04/28 05:10:20
1	97	337.97687706806306	290.01458250314806	20/04/28 05:10:20
1	97	338.21320205544265	290.16757151578423	20/04/28 05:10:21
1	97	338.07236734037093	290.28614850873464	20/04/28 05:10:21
1	97	337.87111343570604	290.1622387264275	20/04/28 05:10:21
1	97	338.0078771409023	290.1811200481007	20/04/28 05:10:21
1	97	337.83356447569236	290.3042210909042	20/04/28 05:10:21
1	97	337.7031319001363	290.5615009718413	20/04/28 05:10:21
1	97	337.52531042903263	290.4486396829134	20/04/28 05:10:21
1	97	337.4740053340473	290.52307927837415	20/04/28 05:10:21
1	97	337.27108340132315	290.4467363086832	20/04/28 05:10:21
1	97	337.39067729366997	290.26567783426697	20/04/28 05:10:21
1	97	337.30824464761884	290.27200653393874	20/04/28 05:10:22
1	97	337.5368357350725	290.12394764813905	20/04/28 05:10:22
1	97	337.3329620953993	290.2259429364618	20/04/28 05:10:22
1	97	337.3169249540261	290.2292148567821	20/04/28 05:10:22
1	97	337.4506145159077	290.4547602183646	20/04/28 05:10:22
1	97	337.49369623291335	290.33603993758874	20/04/28 05:10:22
1	97	337.3360361326157	290.1918192145599	20/04/28 05:10:22
1	97	337.37253203851463	290.06033896864216	20/04/28 05:10:22
1	97	337.42679720515923	289.7793007894919	20/04/28 05:10:22
1	97	337.53630701896475	289.75201093810216	20/04/28 05:10:23
1	97	337.4148218172268	289.76303374210784	20/04/28 05:10:23
1	97	337.6900396539072	289.7654544509061	20/04/28 05:10:23
1	97	337.63443462752343	289.78494482731116	20/04/28 05:10:23
1	97	337.50796546636354	289.8005487654589	20/04/28 05:10:23
1	97	337.2661001363322	289.7124900181518	20/04/28 05:10:23
1	97	337.0594053241725	289.81674922571005	20/04/28 05:10:23
1	97	337.1905709775346	290.0825083447538	20/04/28 05:10:23
1	97	337.22735962475423	290.0828428266848	20/04/28 05:10:23
1	97	337.18210196218365	290.0780255915043	20/04/28 05:10:23
1	97	336.9320226295787	290.1350506902403	20/04/28 05:10:24
1	97	337.1379702749419	290.01043618984266	20/04/28 05:10:24
1	97	337.23055744844754	290.0157639970973	20/04/28 05:10:24
1	97	337.2610827652986	290.00526788904597	20/04/28 05:10:24
1	97	337.26193751568445	290.09898512485705	20/04/28 05:10:24
1	97	337.2570808289029	290.0629037508271	20/04/28 05:10:24
1	97	337.24510787737086	289.85044064267566	20/04/28 05:10:24
1	97	337.23798877225386	289.8477816861576	20/04/28 05:10:24
1	97	337.22779354196234	289.84010726817576	20/04/28 05:10:24
1	97	337.22176562616687	289.84075142669985	20/04/28 05:10:25
1	97	337.2824694607023	289.6579802734167	20/04/28 05:10:25
1	97	337.3015780511523	289.6753739824286	20/04/28 05:10:25
1	97	337.2421485688977	289.70150151888527	20/04/28 05:10:25
1	97	337.1583429421802	289.67153698141897	20/04/28 05:10:25
1	97	337.35916336683	289.80258152786	20/04/28 05:10:25
1	97	337.22807926152393	289.79227168832506	20/04/28 05:10:25
1	97	337.08965197973396	289.73549990152924	20/04/28 05:10:25
1	97	337.0521329731789	289.7705431108484	20/04/28 05:10:25
1	97	336.92675530331763	289.8646897547923	20/04/28 05:10:25
1	97	336.7714526856135	289.68631831149776	20/04/28 05:10:26
1	97	336.8975864675739	289.7636248938154	20/04/28 05:10:26
1	97	336.88780231415944	289.51331390612023	20/04/28 05:10:26
1	97	336.75764521844457	289.55561662119766	20/04/28 05:10:26
1	97	336.6537993740358	289.39913574331416	20/04/28 05:10:26
1	97	336.81479932323265	289.2654696387468	20/04/28 05:10:26
1	97	336.85704507586615	289.07721578178405	20/04/28 05:10:26
1	97	336.6935866154193	289.2371410108482	20/04/28 05:10:26
1	97	336.86397881001074	289.27410276927327	20/04/28 05:10:26
1	97	337.1307785051804	289.39684268453345	20/04/28 05:10:27
1	97	337.1963228146341	289.4095211745241	20/04/28 05:10:27
1	97	337.17669603719855	289.5402936333747	20/04/28 05:10:27
1	97	337.1010871813491	289.7560860537693	20/04/28 05:10:27
1	97	337.1386230593782	289.7666639981677	20/04/28 05:10:27
1	97	337.1337985644465	289.8663370295679	20/04/28 05:10:27
1	97	337.0191179585658	289.7513407661637	20/04/28 05:10:27
1	97	336.79595575655514	289.6216905073664	20/04/28 05:10:27
1	97	336.95037888735624	289.578546701279	20/04/28 05:10:27
1	97	337.0543936454438	289.45485831624563	20/04/28 05:10:27
1	97	336.8496355285835	289.47163568091855	20/04/28 05:10:28
1	97	336.9496598789021	289.4939567025319	20/04/28 05:10:28
1	97	336.9585387909394	289.28853822215723	20/04/28 05:10:28
1	97	336.7594693349014	289.19341186369564	20/04/28 05:10:28
1	97	336.52458682265876	289.28036559276836	20/04/28 05:10:28
1	97	336.535105131529	289.5034756698328	20/04/28 05:10:28
1	97	336.57819415325895	289.4444129796358	20/04/28 05:10:28
1	97	336.33124725355503	289.39551995005985	20/04/28 05:10:28
1	97	336.36916815245974	289.26221109298933	20/04/28 05:10:28
1	97	336.3077963556491	289.1844057727159	20/04/28 05:10:28
1	97	336.2822292367849	289.1800708031296	20/04/28 05:10:29
1	97	336.2822292367849	289.1800708031296	20/04/28 05:10:29
1	97	336.2822292367849	289.1800708031296	20/04/28 05:10:29
1	97	336.5172460698795	289.01275919639085	20/04/28 05:10:29
1	97	336.7587578441357	288.84082375472457	20/04/28 05:10:29
1	97	336.9237466085533	288.7233660607157	20/04/28 05:10:29
1	97	337.1398470322351	288.56952129722777	20/04/28 05:10:29
1	97	337.3472128315396	288.4218948289129	20/04/28 05:10:29
1	97	337.5573977823148	288.27226136920086	20/04/28 05:10:29
1	97	337.7128428781213	288.16159793970695	20/04/28 05:10:30
1	97	337.89814854519153	288.029676372698	20/04/28 05:10:30
1	97	338.132658915905	287.86272532325904	20/04/28 05:10:30
1	97	338.3609586803839	287.70019568693436	20/04/28 05:10:30
1	97	338.59782961375885	287.53156412156596	20/04/28 05:10:30
1	97	338.7489529873272	287.423977383567	20/04/28 05:10:30
1	97	338.9251460914036	287.29854317125483	20/04/28 05:10:30
1	97	339.0706162691626	287.1949810184807	20/04/28 05:10:30
1	97	339.21827609586813	287.08986002552217	20/04/28 05:10:30
1	97	339.42991449084457	286.93919183956774	20/04/28 05:10:30
1	97	339.62725610768774	286.79870171996356	20/04/28 05:10:31
1	97	339.85740127212006	286.6348583188876	20/04/28 05:10:31
1	97	339.9998890355229	286.5334193865284	20/04/28 05:10:31
1	97	340.1601143821446	286.419352832952	20/04/28 05:10:31
1	97	340.38578002467926	286.25869846304556	20/04/28 05:10:31
1	97	340.5786765071094	286.1213728937037	20/04/28 05:10:31
1	97	340.72457580780156	286.01750524261064	20/04/28 05:10:31
1	97	340.8854445530748	285.9029806449837	20/04/28 05:10:31
1	97	341.0671769049448	285.7736029685534	20/04/28 05:10:31
1	97	341.2271190277281	285.6597380457914	20/04/28 05:10:31
1	9	341.24329666666665	285.4973248803363	20/04/28 05:10:32
1	9	341.24329666666665	285.33793110807693	20/04/28 05:10:32
1	9	341.24329666666665	285.0940799153089	20/04/28 05:10:32
1	9	341.24329666666665	284.86175638876136	20/04/28 05:10:32
1	9	341.24329666666665	284.6228433690636	20/04/28 05:10:32
1	83	341.2271074470851	284.4069757614385	20/04/28 05:10:32
1	83	341.07390430118863	284.2948542640042	20/04/28 05:10:32
1	83	340.9382528199386	284.1955779265769	20/04/28 05:10:32
1	83	340.77542519296196	284.07641276679203	20/04/28 05:10:32
1	83	340.553783503856	283.9142046219722	20/04/28 05:10:33
1	83	340.364113413327	283.77539484463915	20/04/28 05:10:33
1	83	340.223537310149	283.6725144298829	20/04/28 05:10:33
1	83	340.07421333572023	283.56323189839287	20/04/28 05:10:33
1	83	339.92006275378003	283.4504170212807	20/04/28 05:10:33
1	83	339.7063558864805	283.2940159641522	20/04/28 05:10:33
1	83	339.482227664756	283.1299880540856	20/04/28 05:10:33
1	83	339.33624112074506	283.0231480161478	20/04/28 05:10:33
1	83	339.13416423549904	282.87525834431324	20/04/28 05:10:33
1	83	338.9580944437798	282.74640192569996	20/04/28 05:10:33
1	83	338.74360273569846	282.5894264839974	20/04/28 05:10:34
1	83	338.51956602985587	282.4254655496945	20/04/28 05:10:34
1	83	338.2884152068045	282.25629815915534	20/04/28 05:10:34
1	83	338.1051243989432	282.12215705047834	20/04/28 05:10:34
1	83	337.95052637365285	282.0090147126072	20/04/28 05:10:34
1	83	337.80715882550794	281.9040913829495	20/04/28 05:10:34
1	83	337.6462946237122	281.7863631530011	20/04/28 05:10:34
1	83	337.45375231840063	281.6454513494956	20/04/28 05:10:34
1	83	337.32710377270166	281.5527637972358	20/04/28 05:10:34
1	83	337.1905720247323	281.4528432379022	20/04/28 05:10:34
1	83	337.00481336617054	281.31689603631264	20/04/28 05:10:35
1	83	336.80387509125103	281.1698396547742	20/04/28 05:10:35
1	83	336.6743669163837	281.0750592871052	20/04/28 05:10:35
1	83	336.4868015873457	280.9377898763797	20/04/28 05:10:35
1	83	336.2555400559319	280.768541464088	20/04/28 05:10:35
1	83	336.0282374678295	280.6021903986474	20/04/28 05:10:35
1	83	335.85814205761596	280.4777063223691	20/04/28 05:10:35
1	83	335.7083140518653	280.368054916296	20/04/28 05:10:35
1	83	335.56794408638996	280.2653253631148	20/04/28 05:10:35
1	83	335.3419437656976	280.0999273601666	20/04/28 05:10:36
1	83	335.1373231176885	279.95017603928795	20/04/28 05:10:36
1	83	334.98707144667213	279.8402145744121	20/04/28 05:10:36
1	83	334.8619639642769	279.74865484706896	20/04/28 05:10:36
1	83	334.66426725388857	279.6039707997743	20/04/28 05:10:36
1	83	334.42856476393683	279.43147227849556	20/04/28 05:10:36
1	83	334.2145667891311	279.27485817476594	20/04/28 05:10:36
1	9	334.16213009104433	279.236482454244	20/04/28 05:10:36
1	9	334.1356010247535	279.3478167916034	20/04/28 05:10:36
1	9	334.1557505419607	279.4371851632117	20/04/28 05:10:36
1	9	334.356139380603	279.2959020935144	20/04/28 05:10:37
1	9	334.48360764267227	279.22373178139725	20/04/28 05:10:37
1	9	334.37323828703506	279.4164121321854	20/04/28 05:10:37
1	9	334.31474056826823	279.57616710628565	20/04/28 05:10:37
1	9	334.45336178728564	279.50844140535287	20/04/28 05:10:37
1	9	334.31697449530407	279.54216846376977	20/04/28 05:10:37
1	9	334.2852426565233	279.5520584027625	20/04/28 05:10:37
1	9	334.0529820180252	279.53939448304936	20/04/28 05:10:37
1	9	334.04311935069785	279.602118804728	20/04/28 05:10:37
1	9	334.05464189403654	279.47826554383124	20/04/28 05:10:38
1	9	334.1373550844695	279.5020603675793	20/04/28 05:10:38
1	9	334.2897766090634	279.6434128117358	20/04/28 05:10:38
1	9	334.3306719832426	279.5963126453931	20/04/28 05:10:38
1	9	334.20120395754316	279.5105712135963	20/04/28 05:10:38
1	9	334.1386054057058	279.6512145419616	20/04/28 05:10:38
1	9	334.066732845598	279.87699345944054	20/04/28 05:10:38
1	9	334.2510123156529	279.7361758283205	20/04/28 05:10:38
1	9	334.3167744735451	279.6438768033332	20/04/28 05:10:38
1	9	334.3489872445631	279.9123613862613	20/04/28 05:10:38
1	9	334.44619865192135	279.8590569520801	20/04/28 05:10:39
1	9	334.5729115586429	280.09929490789216	20/04/28 05:10:39
1	9	334.60564513521547	280.0820369069345	20/04/28 05:10:39
1	9	334.49151152345434	280.0188313715369	20/04/28 05:10:39
1	9	334.50557525084764	280.22951896324463	20/04/28 05:10:39
1	9	334.50762766427846	280.1855580958972	20/04/28 05:10:39
1	9	334.66161301851895	280.2156490108087	20/04/28 05:10:39
1	9	334.7022778504935	280.23133688522717	20/04/28 05:10:39
1	9	334.78640330960746	280.4096347897919	20/04/28 05:10:39
1	9	334.85579401422086	280.4053551804518	20/04/28 05:10:39
1	9	334.9633561581894	280.4230668916824	20/04/28 05:10:40
1	9	334.80361187868584	280.40604642984624	20/04/28 05:10:40
1	9	334.81923659297223	280.4176565380457	20/04/28 05:10:40
1	9	335.0020023337205	280.2764484501208	20/04/28 05:10:40
1	9	335.0834204173504	280.2151123534245	20/04/28 05:10:40
1	9	334.95532681245504	280.1704573313877	20/04/28 05:10:40
1	9	334.88860960255937	279.95472277471623	20/04/28 05:10:40
1	9	334.9085681337202	279.9327881415426	20/04/28 05:10:40
1	9	334.9685029762553	279.8189474607066	20/04/28 05:10:40
1	9	335.05739663769805	279.6476936483516	20/04/28 05:10:41
1	9	335.1048169702901	279.7693791639903	20/04/28 05:10:41
1	9	334.99910352570674	279.7518882561018	20/04/28 05:10:41
1	9	335.10815990920577	279.89251782425254	20/04/28 05:10:41
1	9	335.1804298864256	279.8639349224675	20/04/28 05:10:41
1	9	335.36871325803213	280.0850877033987	20/04/28 05:10:41
1	9	335.28981764211	280.2072460849123	20/04/28 05:10:41
1	9	335.53804142018055	280.1271796458535	20/04/28 05:10:41
1	9	335.59352274567715	280.296089701233	20/04/28 05:10:41
1	9	335.7187012655949	280.2127198656049	20/04/28 05:10:41
1	9	335.72644934154073	280.1396408006279	20/04/28 05:10:42
1	9	335.76126382310485	280.24524740021417	20/04/28 05:10:42
1	9	335.7584884965393	280.2396541450932	20/04/28 05:10:42
1	9	335.5152802438426	280.3278907211234	20/04/28 05:10:42
1	9	335.30182450853096	280.13476232782625	20/04/28 05:10:42
1	9	335.2761893689413	280.2600760279405	20/04/28 05:10:42
1	9	335.4318301360648	280.2735450486518	20/04/28 05:10:42
1	9	335.52430258635025	280.219596715791	20/04/28 05:10:42
1	9	335.5585122000012	280.30837841563346	20/04/28 05:10:42
1	9	335.2600152410617	280.31330867582324	20/04/28 05:10:43
1	9	335.3050502725775	280.37868451479096	20/04/28 05:10:43
1	9	335.2674847020434	280.24049561646467	20/04/28 05:10:43
1	9	335.2548314880885	280.33630828794395	20/04/28 05:10:43
1	9	334.994949676692	280.33274251669053	20/04/28 05:10:43
1	9	334.9386986992653	280.3029758837669	20/04/28 05:10:43
1	9	334.7889400114183	280.4998188095899	20/04/28 05:10:43
1	9	334.5739389713596	280.46498232488415	20/04/28 05:10:43
1	9	334.60040581913887	280.26175281177495	20/04/28 05:10:43
1	9	334.79763124898307	280.39317710790664	20/04/28 05:10:43
1	9	334.7464071671725	280.4933857830913	20/04/28 05:10:44
1	9	334.90361906716447	280.5174721060199	20/04/28 05:10:44
1	9	334.96924766619156	280.78251071822626	20/04/28 05:10:44
1	9	334.9695050222744	280.74244787646666	20/04/28 05:10:44
1	9	335.1494751542567	280.7062088203747	20/04/28 05:10:44
1	9	334.9251017900153	280.6320638681987	20/04/28 05:10:44
1	9	334.7290546360424	280.4412410975272	20/04/28 05:10:44
1	9	334.8015639088715	280.6379567687854	20/04/28 05:10:44
1	9	334.665985017815	280.6662104561242	20/04/28 05:10:44
1	9	334.5254962676223	280.8660959781313	20/04/28 05:10:45
1	9	334.8032294432096	280.9481328142314	20/04/28 05:10:45
1	9	334.96675545874984	280.7577897015122	20/04/28 05:10:45
1	9	334.9147444163576	280.7696551176264	20/04/28 05:10:45
1	9	334.92819018568076	280.97071860735775	20/04/28 05:10:45
1	9	334.838752002441	280.95491251385846	20/04/28 05:10:45
1	9	334.86350561726874	281.1005513728974	20/04/28 05:10:45
1	9	334.89496455004473	281.21054473318327	20/04/28 05:10:45
1	9	334.9235130601194	280.96281406883514	20/04/28 05:10:45
1	9	334.88509104821884	281.03043351850147	20/04/28 05:10:45
1	9	334.72639345835836	281.2591075340818	20/04/28 05:10:46
1	9	334.9667858044822	281.1605226569053	20/04/28 05:10:46
1	9	334.9910264307721	281.1439570335514	20/04/28 05:10:46
1	9	334.900331141964	280.9631507879807	20/04/28 05:10:46
1	9	335.03019727580204	280.76175636297825	20/04/28 05:10:46
1	9	335.2421405586107	280.7090665948869	20/04/28 05:10:46
1	9	335.24979060893725	280.82720927611064	20/04/28 05:10:46
1	9	335.1129238849612	281.081606079223	20/04/28 05:10:46
1	9	335.24413021862426	281.1657763532773	20/04/28 05:10:46
1	9	335.0395028777109	281.08643454079845	20/04/28 05:10:46
1	9	335.05449439532964	280.93408146664166	20/04/28 05:10:47
1	9	335.0133165732667	280.9695653233884	20/04/28 05:10:47
1	9	334.96738754119093	281.20517032771323	20/04/28 05:10:47
1	9	335.0814386151022	281.2302408179524	20/04/28 05:10:47
1	9	335.0546465031201	281.2919572127912	20/04/28 05:10:47
1	9	335.28867055811105	281.26015362406105	20/04/28 05:10:47
1	9	335.2215199064566	281.35694812730856	20/04/28 05:10:47
1	9	335.09343426259096	281.3219134997947	20/04/28 05:10:47
1	9	335.1384777717436	281.3753843072901	20/04/28 05:10:47
1	9	334.84213522400535	281.34560569982614	20/04/28 05:10:48
1	9	334.6863830648602	281.39724750394515	20/04/28 05:10:48
1	9	334.6164053713285	281.3223996542767	20/04/28 05:10:48
1	9	334.59905151062475	281.4544590621094	20/04/28 05:10:48
1	9	334.76042460194674	281.54177461076574	20/04/28 05:10:48
1	9	334.4672029086815	281.52628925611765	20/04/28 05:10:48
1	9	334.5651162642293	281.5953751760906	20/04/28 05:10:48
1	9	334.7126452244999	281.54782501798564	20/04/28 05:10:48
1	9	334.78016866559915	281.2841536238991	20/04/28 05:10:48
1	9	334.64180156624144	281.2345034069547	20/04/28 05:10:48
1	9	334.6649854761609	281.3183251581824	20/04/28 05:10:49
1	9	334.77111239447737	281.15685862367553	20/04/28 05:10:49
1	9	334.573835740332	281.19429559343547	20/04/28 05:10:49
1	9	334.5705155763017	281.31458438081063	20/04/28 05:10:49
1	9	334.4744531384167	281.3524945979385	20/04/28 05:10:49
1	9	334.2943239731139	281.3349058738473	20/04/28 05:10:49
1	9	334.13576478296534	281.1711735687406	20/04/28 05:10:49
1	9	334.28410484968265	281.3572362138623	20/04/28 05:10:49
1	9	334.2295144838312	281.5826886787984	20/04/28 05:10:49
1	9	334.3542770081807	281.62826789806616	20/04/28 05:10:50
1	9	334.34068678283535	281.6557990037747	20/04/28 05:10:50
1	9	334.2239894942631	281.5240252772139	20/04/28 05:10:50
1	9	334.3411776574155	281.5405284664806	20/04/28 05:10:50
1	9	334.35692028822865	281.4741822405261	20/04/28 05:10:50
1	9	334.26029034137616	281.7479366744234	20/04/28 05:10:50
1	9	334.27557792407583	282.0172346052619	20/04/28 05:10:50
1	9	334.4364114385845	281.8511245201816	20/04/28 05:10:50
1	9	334.46904049129574	281.7666174042778	20/04/28 05:10:50
1	9	334.34295737693924	281.76197041999785	20/04/28 05:10:50
1	9	334.6037868824999	281.6660614006245	20/04/28 05:10:51
1	9	334.64471330140157	281.85730961448917	20/04/28 05:10:51
1	9	334.4568893140924	282.01792886582206	20/04/28 05:10:51
1	9	334.46768246262656	282.0109195232833	20/04/28 05:10:51
1	9	334.4521056456736	282.0228474135703	20/04/28 05:10:51
1	9	334.4414951971905	281.96931250716295	20/04/28 05:10:51
1	9	334.3217033011231	281.75667952948737	20/04/28 05:10:51
1	9	334.28633632159085	282.0228458099119	20/04/28 05:10:51
1	9	334.24587154224014	281.8915719355083	20/04/28 05:10:51
1	9	334.24602757618027	281.99604333624217	20/04/28 05:10:52
1	9	334.29820722162225	282.1779288782599	20/04/28 05:10:52
1	9	334.31739142535343	282.4372823908913	20/04/28 05:10:52
1	9	334.28358834057514	282.5005054284016	20/04/28 05:10:52
1	9	334.34763096119013	282.4837922339586	20/04/28 05:10:52
1	9	334.41319780426767	282.5507302508449	20/04/28 05:10:52
1	9	334.4876040459169	282.50720827859266	20/04/28 05:10:52
1	9	334.2499441811071	282.45680817378366	20/04/28 05:10:52
1	9	334.35647826497785	282.3244739105037	20/04/28 05:10:52
1	9	334.54563062652437	282.3716824419507	20/04/28 05:10:52
1	9	334.64608503999045	282.1018093457905	20/04/28 05:10:53
1	9	334.68100835662796	281.89332821593206	20/04/28 05:10:53
1	9	334.4512961453222	282.01108240538093	20/04/28 05:10:53
1	9	334.25033936382545	282.1364649044757	20/04/28 05:10:53
1	9	334.2115065344082	282.0011077227611	20/04/28 05:10:53
1	9	333.94847521520666	281.998929104444	20/04/28 05:10:53
1	9	334.0610550200342	282.03910281204753	20/04/28 05:10:53
1	9	333.9548134039249	281.9664085029962	20/04/28 05:10:53
1	9	334.0364884713725	281.90661681224515	20/04/28 05:10:53
1	9	334.0735438506761	281.85666878164056	20/04/28 05:10:54
1	9	334.3503414791847	281.81471365832465	20/04/28 05:10:54
1	9	334.34113911174853	281.8165081808927	20/04/28 05:10:54
1	9	334.47787266051506	281.8589604027831	20/04/28 05:10:54
1	9	334.4866196435415	281.69990005761764	20/04/28 05:10:54
1	9	334.50586004873674	281.7329673492125	20/04/28 05:10:54
1	9	334.52162849231195	281.7025000031989	20/04/28 05:10:54
1	9	334.6143823755481	281.9281262283091	20/04/28 05:10:54
1	9	334.77094265875934	282.102482113726	20/04/28 05:10:54
1	9	334.723977915487	282.05238662566023	20/04/28 05:10:54
1	9	334.6809324417608	282.2373189395562	20/04/28 05:10:55
1	9	334.88808744497686	282.4089088312927	20/04/28 05:10:55
1	9	335.0029066592012	282.6448895191777	20/04/28 05:10:55
1	9	334.9893636167243	282.7514865719986	20/04/28 05:10:55
1	9	334.9973607202359	283.0086460856658	20/04/28 05:10:55
1	9	334.9620503805779	283.11195057402176	20/04/28 05:10:55
1	9	334.97365241455765	283.1805948395386	20/04/28 05:10:55
1	9	334.9471453856679	283.11515500512246	20/04/28 05:10:55
1	9	334.8302936184194	282.99411364675393	20/04/28 05:10:55
1	9	334.75470133473067	283.2135742813704	20/04/28 05:10:55
1	9	334.61601527117125	283.07326655192924	20/04/28 05:10:56
1	9	334.5736254370605	283.00869633962577	20/04/28 05:10:56
1	9	334.8478374077619	283.0177772886773	20/04/28 05:10:56
1	9	334.9771421046378	282.76047804750414	20/04/28 05:10:56
1	9	334.73700075450205	282.803507738817	20/04/28 05:10:56
1	9	334.5739726237359	282.8154232258218	20/04/28 05:10:56
1	9	334.43834383754063	282.636174995473	20/04/28 05:10:56
1	9	334.453967009882	282.6185133238618	20/04/28 05:10:56
1	9	334.2024965525533	282.7440843346109	20/04/28 05:10:56
1	9	334.3095938926675	282.75529859557514	20/04/28 05:10:57
1	9	334.38096995301964	282.8453900502425	20/04/28 05:10:57
1	9	334.4293161785506	282.801045748983	20/04/28 05:10:57
1	9	334.2698424889725	282.89272162206106	20/04/28 05:10:57
1	9	334.2710232814381	282.87439122723214	20/04/28 05:10:57
1	9	334.3081905334134	282.830362518998	20/04/28 05:10:57
1	9	334.2672031928659	282.78275831673886	20/04/28 05:10:57
1	9	334.29038469090955	282.9431650975767	20/04/28 05:10:57
1	9	334.2905812593567	282.94396879805026	20/04/28 05:10:57
1	9	334.3124918255703	283.04602860052375	20/04/28 05:10:57
1	9	334.2455157896068	282.95722868368085	20/04/28 05:10:58
1	9	334.27261675562903	282.9721851733317	20/04/28 05:10:58
1	9	334.23132976741704	282.8733000138731	20/04/28 05:10:58
1	9	334.4050636061272	283.00010038920266	20/04/28 05:10:58
1	9	334.4969740561864	282.8243193090731	20/04/28 05:10:58
1	9	334.7392924857765	283.000960144576	20/04/28 05:10:58
1	9	334.7700704483507	282.89485466649614	20/04/28 05:10:58
1	9	334.65473889311636	283.0348696045828	20/04/28 05:10:58
1	9	334.8159659824836	283.05213752107557	20/04/28 05:10:58
1	9	334.6179044379177	283.26256347550793	20/04/28 05:10:59
1	9	334.5030308668893	283.22432334315744	20/04/28 05:10:59
1	9	334.47207579869865	283.4369497719022	20/04/28 05:10:59
1	9	334.5667689383002	283.6589463499492	20/04/28 05:10:59
1	9	334.62465793498274	283.80068366937047	20/04/28 05:10:59
1	9	334.5611025936573	283.7586976668583	20/04/28 05:10:59
1	9	334.4996978363162	283.8628255140577	20/04/28 05:10:59
1	9	334.4412354076523	283.816232002832	20/04/28 05:10:59
1	9	334.46278472320085	283.8146836750767	20/04/28 05:10:59
1	9	334.2279834691993	283.745243262906	20/04/28 05:10:59
1	9	334.4039648253476	283.89419874902694	20/04/28 05:11:00
1	9	334.5482487054644	283.8197804969544	20/04/28 05:11:00
1	9	334.5336069860856	283.7472893121424	20/04/28 05:11:00
1	9	334.41627044608106	283.68637615804977	20/04/28 05:11:00
1	9	334.3499578678082	283.80696260373963	20/04/28 05:11:00
1	9	334.4127261694067	283.5716571551148	20/04/28 05:11:00
1	9	334.3047420224226	283.2970531515935	20/04/28 05:11:00
1	9	334.0835136099014	283.26649253116915	20/04/28 05:11:00
1	9	333.98964738670736	283.4527696482225	20/04/28 05:11:00
1	9	334.0117211717111	283.1838950002289	20/04/28 05:11:01
1	9	333.9330693302849	283.39926032252754	20/04/28 05:11:01
1	9	333.80056715054883	283.38639926912396	20/04/28 05:11:01
1	9	333.80047885302895	283.41500652891443	20/04/28 05:11:01
1	9	333.82104323510134	283.40091017215195	20/04/28 05:11:01
1	9	333.7733112615602	283.39347090710476	20/04/28 05:11:01
1	9	333.80352339629974	283.36294300283237	20/04/28 05:11:01
1	9	333.6926130606898	283.18618417225764	20/04/28 05:11:01
1	9	333.7222220302833	283.20607753121783	20/04/28 05:11:01
1	9	333.74776136237995	283.1753360332182	20/04/28 05:11:01
1	9	333.55870098649046	283.07148779531366	20/04/28 05:11:02
1	9	333.54935238902874	282.94222428085317	20/04/28 05:11:02
1	9	333.61867710526917	282.9772991913835	20/04/28 05:11:02
1	9	333.625139294073	282.8271257365463	20/04/28 05:11:02
1	9	333.60366628506176	282.82777026204946	20/04/28 05:11:02
1	9	333.6281815890466	282.79470995894974	20/04/28 05:11:02
1	9	333.52940133014357	282.8608125730893	20/04/28 05:11:02
1	9	333.62287319106815	282.7690220229714	20/04/28 05:11:02
1	9	333.65029036263223	282.7226799230402	20/04/28 05:11:02
1	9	333.66940971935287	282.5306351258261	20/04/28 05:11:03
1	9	333.73194733011354	282.35039524807496	20/04/28 05:11:03
1	9	333.857792567231	282.33492911883184	20/04/28 05:11:03
1	9	333.63906651036444	282.51758420590795	20/04/28 05:11:03
1	9	333.6072137868843	282.7990910819976	20/04/28 05:11:03
1	9	333.6395304599051	282.66556380312676	20/04/28 05:11:03
1	9	333.6742571158695	282.82739895841746	20/04/28 05:11:03
1	9	333.67044807475077	282.8366355009037	20/04/28 05:11:03
1	9	333.6223878488834	282.84568203257015	20/04/28 05:11:03
1	9	333.4349056572225	282.6981503940797	20/04/28 05:11:03
1	9	333.39311407228047	282.62971811822734	20/04/28 05:11:04
1	9	333.4469574160415	282.37175099496653	20/04/28 05:11:04
1	9	333.5013136536817	282.3505707482733	20/04/28 05:11:04
1	9	333.40073681116706	282.2241893855337	20/04/28 05:11:04
1	9	333.2397022216769	282.4596392550207	20/04/28 05:11:04
1	9	333.2105644509678	282.7191137626834	20/04/28 05:11:04
1	9	333.34620372893534	282.6146254259119	20/04/28 05:11:04
1	9	333.63447800900707	282.6778604529724	20/04/28 05:11:04
1	9	333.90709654806165	282.7022415659938	20/04/28 05:11:04
1	9	334.15241833234546	282.674570801267	20/04/28 05:11:04
1	9	334.17466667544574	282.79715519072846	20/04/28 05:11:05
1	9	334.22213312021745	282.5592851121067	20/04/28 05:11:05
1	9	334.08897592830004	282.5868265555517	20/04/28 05:11:05
1	9	334.0889375819134	282.6324177901215	20/04/28 05:11:05
1	9	334.0246448909526	282.43501848485687	20/04/28 05:11:05
1	9	333.95726743583805	282.6626465059516	20/04/28 05:11:05
1	9	334.001648917045	282.70576027084036	20/04/28 05:11:05
1	9	334.00304106678794	282.9555130963024	20/04/28 05:11:05
1	9	334.19971510935653	282.90995665147057	20/04/28 05:11:05
1	9	334.298623713979	283.0750687757097	20/04/28 05:11:06
1	9	334.47253002841336	283.0087324045385	20/04/28 05:11:06
1	9	334.3351486159789	283.2217724741467	20/04/28 05:11:06
1	9	334.2943731355189	283.28789442618654	20/04/28 05:11:06
1	9	334.1460114139315	283.44988730346665	20/04/28 05:11:06
1	9	333.95624591351765	283.3065281177196	20/04/28 05:11:06
1	9	333.74879242818724	283.22868699015316	20/04/28 05:11:06
1	9	333.63658279823215	283.1311874182754	20/04/28 05:11:06
1	9	333.7956169051939	283.12996051575954	20/04/28 05:11:06
1	9	333.9137300548546	282.8866945287044	20/04/28 05:11:06
1	9	333.62381061749124	282.93839136313056	20/04/28 05:11:07
1	9	333.5667733221267	283.1573462006633	20/04/28 05:11:07
1	9	333.5667733221267	283.1573462006633	20/04/28 05:11:07
1	9	333.5667733221267	283.1573462006633	20/04/28 05:11:07
1	9	333.77855698031107	283.1684057718859	20/04/28 05:11:07
1	9	334.00276282910426	283.18011404331014	20/04/28 05:11:07
1	9	334.22149506961995	283.1915364770021	20/04/28 05:11:07
1	9	334.4773014502669	283.2048949623083	20/04/28 05:11:07
1	9	334.7409781325792	283.21866444326236	20/04/28 05:11:07
1	9	334.94169752318385	283.2291462264895	20/04/28 05:11:08
1	9	335.1554507347504	283.2403086499155	20/04/28 05:11:08
1	9	335.1554507347504	283.2403086499155	20/04/28 05:11:08
1	9	335.41115444741945	283.2536617737891	20/04/28 05:11:08
1	9	335.6279595442501	283.2649835699577	20/04/28 05:11:08
1	9	335.90586220930834	283.2794959470858	20/04/28 05:11:08
1	9	336.141886499157	283.2918213902584	20/04/28 05:11:08
1	9	336.141886499157	283.2918213902584	20/04/28 05:11:08
1	9	336.34040172932504	283.30218806984846	20/04/28 05:11:08
1	9	336.34040172932504	283.30218806984846	20/04/28 05:11:08
1	9	336.56865936855814	283.3141079301428	20/04/28 05:11:09
1	9	336.7674415274396	283.3244885490384	20/04/28 05:11:09
1	9	336.95139263763605	283.3340946745635	20/04/28 05:11:09
1	9	337.1910071719699	283.3466076041783	20/04/28 05:11:09
1	9	337.4815106093082	283.3617780072357	20/04/28 05:11:09
1	9	337.66494618217837	283.3713572108452	20/04/28 05:11:09
1	9	337.9399906195935	283.3857203282407	20/04/28 05:11:09
1	9	338.1799158181102	283.39824948107446	20/04/28 05:11:09
1	9	338.3960944823026	283.40953856425455	20/04/28 05:11:09
1	9	338.6764875567564	283.42418099324937	20/04/28 05:11:10
1	9	338.6764875567564	283.42418099324937	20/04/28 05:11:10
1	9	338.90433183784177	283.4360792675351	20/04/28 05:11:10
1	9	339.15719506350604	283.44928405811135	20/04/28 05:11:10
1	9	339.3638790184965	283.4600773173287	20/04/28 05:11:10
1	9	339.61094922967425	283.47297959043567	20/04/28 05:11:10
1	9	339.8128009342948	283.4835205043229	20/04/28 05:11:10
1	9	340.07152036531454	283.4970311122638	20/04/28 05:11:10
1	9	340.3423241674329	283.51117277910697	20/04/28 05:11:10
1	9	340.54266757077534	283.52163492787344	20/04/28 05:11:10
1	9	340.8214257786709	283.53619198237203	20/04/28 05:11:11
1	9	340.9795109192966	283.5444473590473	20/04/28 05:11:11
1	9	341.16387314175233	283.5540749532983	20/04/28 05:11:11
1	83	341.24329666666665	283.73633237347985	20/04/28 05:11:11
1	83	341.24329666666665	283.9716318788298	20/04/28 05:11:11
1	83	341.24329666666665	284.1233638424687	20/04/28 05:11:11
1	83	341.24329666666665	284.4089450791369	20/04/28 05:11:11
1	83	341.24329666666665	284.64426696494564	20/04/28 05:11:11
1	83	341.24329666666665	284.91221622623186	20/04/28 05:11:11
1	83	341.24329666666665	285.1622259041916	20/04/28 05:11:12
1	83	341.24329666666665	285.3869927280304	20/04/28 05:11:12
1	83	341.24329666666665	285.64834712548367	20/04/28 05:11:12
1	83	341.24329666666665	285.85898897976966	20/04/28 05:11:12
1	97	341.20081212221737	286.05833121499506	20/04/28 05:11:12
1	97	341.10166627861713	286.18366845321384	20/04/28 05:11:12
1	97	340.9793828981169	286.3382554801168	20/04/28 05:11:12
1	97	340.759612446538	286.616082774159	20/04/28 05:11:12
1	97	340.6089667531619	286.80652459674747	20/04/28 05:11:12
1	97	340.45287426933135	287.00385209046374	20/04/28 05:11:12
1	97	340.3122435418465	287.1816332898725	20/04/28 05:11:13
1	97	340.1598344215324	287.3743043845533	20/04/28 05:11:13
1	97	340.1598344215324	287.3743043845533	20/04/28 05:11:13
1	97	340.0206423338704	287.55026689811865	20/04/28 05:11:13
1	97	339.83463258623783	287.78541491041483	20/04/28 05:11:13
1	97	339.672435829167	287.9904592455184	20/04/28 05:11:13
1	97	339.50921175589923	288.1968022833233	20/04/28 05:11:13
1	97	339.33198804790516	288.4208432446007	20/04/28 05:11:13
1	97	339.16739531884684	288.62891649650857	20/04/28 05:11:13
1	97	339.01829597568485	288.81740346896805	20/04/28 05:11:13
1	97	338.90572762540324	288.95970904248276	20/04/28 05:11:14
1	97	338.7992505246955	289.09431423874355	20/04/28 05:11:14
1	97	338.69282206072575	289.228857949881	20/04/28 05:11:14
1	97	338.552111095995	289.40674058283895	20/04/28 05:11:14
1	97	338.37074508105877	289.6360181258341	20/04/28 05:11:14
1	97	338.2195121816938	289.82720227683734	20/04/28 05:11:14
1	97	338.0572943551581	290.0322732473342	20/04/28 05:11:14
1	97	337.93555045691215	290.1861782767538	20/04/28 05:11:14
1	97	337.7630634835927	290.4042311983845	20/04/28 05:11:14
1	97	337.6101554322756	290.5975330268582	20/04/28 05:11:15
1	97	337.51628698465595	290.7161987374245	20/04/28 05:11:15
1	97	337.3589875184066	290.915052062557	20/04/28 05:11:15
1	97	337.20074048930167	291.1151032685793	20/04/28 05:11:15
1	97	336.9021849022267	291.49252839685425	20/04/28 05:11:15
1	97	336.9021849022267	291.49252839685425	20/04/28 05:11:15
1	97	336.6679817312633	291.7886011071635	20/04/28 05:11:15
1	97	336.5495111700417	291.93836808089173	20/04/28 05:11:15
1	97	336.42555880631346	292.09506498694685	20/04/28 05:11:15
1	97	336.3300028129452	292.215864042854	20/04/28 05:11:15
1	97	336.3300028129452	292.215864042854	20/04/28 05:11:16
1	97	336.0245098887788	292.6020591471568	20/04/28 05:11:16
1	97	335.8816858499455	292.782613065794	20/04/28 05:11:16
1	97	335.7068976128335	293.00357517693476	20/04/28 05:11:16
1	97	335.575506488043	293.1696759443466	20/04/28 05:11:16
1	97	335.5981842220128	293.39539305344715	20/04/28 05:11:16
1	97	335.5226966661896	293.283707368563	20/04/28 05:11:16
1	97	335.51760547037685	293.3101284236733	20/04/28 05:11:16
1	97	335.52649474683403	293.06002013745564	20/04/28 05:11:16
1	97	335.68056384180124	293.14960326362865	20/04/28 05:11:17
1	97	335.7327937665531	293.20388977652135	20/04/28 05:11:17
1	97	335.65689013100007	293.29030839350173	20/04/28 05:11:17
1	97	335.83738235004097	293.2566428925395	20/04/28 05:11:17
1	97	335.858419999561	293.39148859076624	20/04/28 05:11:17
1	97	335.80180467635074	293.30984636003456	20/04/28 05:11:17
1	97	335.7695076138588	293.4321697634806	20/04/28 05:11:17
1	97	335.8620108248928	293.4906818459329	20/04/28 05:11:17
1	97	335.8620108248928	293.4906818459329	20/04/28 05:11:17
1	97	335.74734935280566	293.4757268894266	20/04/28 05:11:17
1	97	335.74516542323744	293.4330515661504	20/04/28 05:11:18
1	97	335.74516542323744	293.4330515661504	20/04/28 05:11:18
1	97	335.9591231660127	293.40766587300874	20/04/28 05:11:18
1	97	335.89204897601513	293.4838295144452	20/04/28 05:11:18
1	97	335.8654187370406	293.18672374606444	20/04/28 05:11:18
1	97	335.8654187370406	293.18672374606444	20/04/28 05:11:18
1	97	335.94245128146713	293.27312803451883	20/04/28 05:11:18
1	97	335.94647927980293	293.2750014841975	20/04/28 05:11:18
1	97	335.9932811632474	293.22976988385545	20/04/28 05:11:18
1	97	335.9270748164349	293.26812843725855	20/04/28 05:11:19
1	97	336.11201300859005	293.1553702051555	20/04/28 05:11:19
1	97	336.06400746952306	293.0988862641399	20/04/28 05:11:19
1	97	335.9964956528295	293.0692766650755	20/04/28 05:11:19
1	97	336.2263438235446	293.06314059438665	20/04/28 05:11:19
1	97	336.0852440375279	292.93945031598497	20/04/28 05:11:19
1	97	335.85123030812133	292.9992932225251	20/04/28 05:11:19
1	97	336.0249048540152	292.9256349275067	20/04/28 05:11:19
1	97	335.76191118617464	293.00187000337166	20/04/28 05:11:19
1	97	335.753628247189	292.996084987054	20/04/28 05:11:19
1	97	335.7028431154935	292.93470654578573	20/04/28 05:11:20
1	97	335.7049410299366	292.9303389595461	20/04/28 05:11:20
1	97	335.71299367400184	292.9629338819544	20/04/28 05:11:20
1	97	335.6978449653978	293.2175850876311	20/04/28 05:11:20
1	97	335.6375021215086	293.0075318546456	20/04/28 05:11:20
1	97	335.7142188749964	292.833393470307	20/04/28 05:11:20
1	97	335.64877126424057	293.04818704014434	20/04/28 05:11:20
1	97	335.67475680514576	293.0654864405564	20/04/28 05:11:20
1	97	335.67450138580614	293.065017420831	20/04/28 05:11:20
1	97	335.70057831975083	293.08715679605916	20/04/28 05:11:21
1	97	335.91426724591923	293.0770633510172	20/04/28 05:11:21
1	97	335.81856876389554	293.3603019609187	20/04/28 05:11:21
1	97	335.56771581000726	293.30730145175676	20/04/28 05:11:21
1	97	335.6515432240424	293.0399624261317	20/04/28 05:11:21
1	97	335.64087841914034	293.03475201239354	20/04/28 05:11:21
1	97	335.59880384002366	292.8240432495258	20/04/28 05:11:21
1	97	335.7006812990817	292.63472483109825	20/04/28 05:11:21
1	97	335.83130044078763	292.79790193617777	20/04/28 05:11:21
1	97	335.9945422870143	292.5766886437582	20/04/28 05:11:21
1	97	336.11400505025625	292.3802751652632	20/04/28 05:11:22
1	97	336.1566271631476	292.33899049028076	20/04/28 05:11:22
1	97	336.1464597275162	292.48856027908647	20/04/28 05:11:22
1	97	336.28583240261713	292.4598135645574	20/04/28 05:11:22
1	97	336.1160398731216	292.52411972139566	20/04/28 05:11:22
1	97	336.35833224800524	292.5549569796737	20/04/28 05:11:22
1	97	336.3110070631343	292.56651846768364	20/04/28 05:11:22
1	97	336.3617019850816	292.5075537609404	20/04/28 05:11:22
1	97	336.29570717768786	292.557290395883	20/04/28 05:11:22
1	97	336.45892234972837	292.4893734070893	20/04/28 05:11:23
1	97	336.409263160744	292.42689062015546	20/04/28 05:11:23
1	97	336.584793081239	292.32989917933776	20/04/28 05:11:23
1	97	336.6948562544951	292.1830643954555	20/04/28 05:11:23
1	97	336.776210579728	292.05895328351295	20/04/28 05:11:23
1	97	336.7020793348893	292.10410382495587	20/04/28 05:11:23
1	97	336.65210004264554	291.98780356086877	20/04/28 05:11:23
1	97	336.4746060022238	291.9286755918171	20/04/28 05:11:23
1	97	336.3837242494383	291.9171482371486	20/04/28 05:11:23
1	97	336.4775122503994	291.90517811777136	20/04/28 05:11:23
1	97	336.44818426230074	291.88386848859875	20/04/28 05:11:24
1	97	336.55601446646756	291.6062502390167	20/04/28 05:11:24
1	97	336.461038192113	291.76672932899913	20/04/28 05:11:24
1	97	336.4456209762054	291.7605665403885	20/04/28 05:11:24
1	97	336.4738771120639	291.9445231133245	20/04/28 05:11:24
1	97	336.44856105377653	291.8879786974983	20/04/28 05:11:24
1	97	336.3554097205166	292.0971899438589	20/04/28 05:11:24
1	97	336.6252805827858	292.1883017919467	20/04/28 05:11:24
1	97	336.7452975339083	292.2423238730105	20/04/28 05:11:24
1	97	336.62645476323524	292.2038935079862	20/04/28 05:11:24
1	97	336.77710714241255	292.27333546060106	20/04/28 05:11:25
1	97	336.81997173012974	292.0948706757863	20/04/28 05:11:25
1	97	336.84733760546794	292.10051338084264	20/04/28 05:11:25
1	97	336.87842069974226	292.2859534737504	20/04/28 05:11:25
1	97	336.89774328668994	292.2164700828922	20/04/28 05:11:25
1	97	336.80290074240463	291.9727881389857	20/04/28 05:11:25
1	97	336.74471683654554	292.0108465072676	20/04/28 05:11:25
1	97	336.83101376009404	291.93399397440754	20/04/28 05:11:25
1	97	337.0656935752166	292.07556177618915	20/04/28 05:11:25
1	97	337.142054027511	292.05961347618876	20/04/28 05:11:26
1	97	337.2273606824505	292.07537171437076	20/04/28 05:11:26
1	97	337.1002715330707	292.28012902540166	20/04/28 05:11:26
1	97	337.3896329458044	292.25832448348007	20/04/28 05:11:26
1	97	337.3558568912149	292.4742302691202	20/04/28 05:11:26
1	97	337.31878995800747	292.52981943654993	20/04/28 05:11:26
1	97	337.28673343242804	292.53422763556154	20/04/28 05:11:26
1	97	337.2552170076044	292.48319033160277	20/04/28 05:11:26
1	97	337.48511136194384	292.4224124663829	20/04/28 05:11:26
1	97	337.58034822486525	292.50689448391114	20/04/28 05:11:26
1	97	337.5128928059782	292.50755782279083	20/04/28 05:11:27
1	97	337.47732261970526	292.41331871747934	20/04/28 05:11:27
1	97	337.3434194796222	292.6420365843215	20/04/28 05:11:27
1	97	337.4598488348819	292.91696038638673	20/04/28 05:11:27
1	97	337.2920484171719	292.984409613785	20/04/28 05:11:27
1	97	337.35486325958044	292.98836623375036	20/04/28 05:11:27
1	97	337.6153729106425	292.9374683548672	20/04/28 05:11:27
1	97	337.63801049525773	292.99546033738545	20/04/28 05:11:27
1	97	337.67560923550883	293.02662886444233	20/04/28 05:11:27
1	97	337.738297675167	292.9244313438742	20/04/28 05:11:27
1	97	337.64178038739544	292.8820493161915	20/04/28 05:11:28
1	97	337.68048684363123	292.8431828318195	20/04/28 05:11:28
1	97	337.57190711965745	292.61179102726686	20/04/28 05:11:28
1	97	337.7806163429015	292.44964415970804	20/04/28 05:11:28
1	97	337.81434887185634	292.26940602485985	20/04/28 05:11:28
1	97	337.83269221868704	292.21943663365255	20/04/28 05:11:28
1	97	337.7857595195855	292.3386577574351	20/04/28 05:11:28
1	97	337.6272388706119	292.4614411492504	20/04/28 05:11:28
1	97	337.6239952991093	292.32532475197735	20/04/28 05:11:28
1	97	337.85570309179207	292.40984864789635	20/04/28 05:11:29
1	97	337.67071749702046	292.35635439847294	20/04/28 05:11:29
1	97	337.8651857849724	292.15515550503255	20/04/28 05:11:29
1	97	338.0007833007065	292.25343205230354	20/04/28 05:11:29
1	97	337.9942778407932	292.25823532828093	20/04/28 05:11:29
1	97	338.19412953593286	292.3964626886608	20/04/28 05:11:29
1	97	337.98142340130624	292.22863371571975	20/04/28 05:11:29
1	97	338.05645451175366	292.14422724973025	20/04/28 05:11:29
1	97	338.1029756119197	292.1238829647483	20/04/28 05:11:29
1	97	338.0816686752869	292.1212042133984	20/04/28 05:11:29
1	97	337.8412090720652	292.14640334832455	20/04/28 05:11:30
1	97	338.02112715095404	292.1268931961774	20/04/28 05:11:30
1	97	337.7811205082871	291.95325721162715	20/04/28 05:11:30
1	97	337.805408506975	291.949807374008	20/04/28 05:11:30
1	97	337.792510938807	292.09574603203527	20/04/28 05:11:30
1	97	337.77183936614006	292.06625031034963	20/04/28 05:11:30
1	97	337.74987692273936	292.1627992811963	20/04/28 05:11:30
1	97	337.74273703563324	292.1096007785363	20/04/28 05:11:30
1	97	337.8273577330834	292.01651030248865	20/04/28 05:11:30
1	97	337.60419479197327	292.0134129768682	20/04/28 05:11:31
1	97	337.6436558466683	292.01636194103463	20/04/28 05:11:31
1	97	337.8044793170089	291.96576857166644	20/04/28 05:11:31
1	97	337.899786395703	291.8563388301548	20/04/28 05:11:31
1	97	338.1176146674591	291.84028186553917	20/04/28 05:11:31
1	97	337.96534397866014	291.65759767618437	20/04/28 05:11:31
1	97	337.8762207481424	291.87679913188475	20/04/28 05:11:31
1	97	337.851719351452	292.05452160615096	20/04/28 05:11:31
1	97	338.0225452803377	292.2106863223078	20/04/28 05:11:31
1	97	337.75318829009785	292.2090808214918	20/04/28 05:11:31
1	97	337.8542897700067	292.13314905076675	20/04/28 05:11:32
1	97	337.84855578430336	292.1514578833988	20/04/28 05:11:32
1	97	337.81888041043004	291.93168376182075	20/04/28 05:11:32
1	97	337.8460315060525	292.0514059880126	20/04/28 05:11:32
1	97	337.7437879740223	292.02133111013876	20/04/28 05:11:32
1	97	337.8368780076991	291.63714892720566	20/04/28 05:11:32
1	97	337.8387677670962	291.6369421255119	20/04/28 05:11:32
1	97	337.74152147632344	291.70111921683383	20/04/28 05:11:32
1	97	337.5420099975016	291.70970320064373	20/04/28 05:11:32
1	97	337.6895934036456	291.8893163118419	20/04/28 05:11:33
1	97	337.70102834098657	291.8646299588308	20/04/28 05:11:33
1	97	337.9994733747798	291.83749586794806	20/04/28 05:11:33
1	97	337.82396443254896	291.61347130104616	20/04/28 05:11:33
1	97	337.99560437106044	291.82602304057855	20/04/28 05:11:33
1	97	337.97572366219646	291.7875011670738	20/04/28 05:11:33
1	97	338.0314071165765	291.56309114568563	20/04/28 05:11:33
1	97	338.0056098415626	291.5524830276131	20/04/28 05:11:33
1	97	337.90776057729175	291.53867904180305	20/04/28 05:11:33
1	97	337.95363477723834	291.575967758623	20/04/28 05:11:33
1	97	337.77300468970543	291.4617493780007	20/04/28 05:11:34
1	97	337.76822805500524	291.4587294927118	20/04/28 05:11:34
1	97	337.7380462395768	291.37562498029394	20/04/28 05:11:34
1	97	337.98808113801425	291.24581472541803	20/04/28 05:11:34
1	97	337.963560519821	291.21564173110534	20/04/28 05:11:34
1	97	337.86337249703416	291.341550147274	20/04/28 05:11:34
1	97	338.06262560317737	291.27197788714915	20/04/28 05:11:34
1	97	337.96576365359357	291.392906782153	20/04/28 05:11:34
1	97	337.96576365359357	291.392906782153	20/04/28 05:11:34
1	97	337.9971604809394	291.25056108950105	20/04/28 05:11:35
1	97	337.7353803847808	291.13416117788177	20/04/28 05:11:35
1	97	337.59008421414245	291.3734776127972	20/04/28 05:11:35
1	97	337.6137589903932	291.22299969825133	20/04/28 05:11:35
1	97	337.63959125348003	291.07033435863383	20/04/28 05:11:35
1	97	337.8393561797003	291.1402528656177	20/04/28 05:11:35
1	97	337.6626047199199	291.1500784788152	20/04/28 05:11:35
1	97	337.6478954888808	291.19094122637824	20/04/28 05:11:35
1	97	337.58613058759255	291.2033959552006	20/04/28 05:11:35
1	97	337.58979733266585	291.2569131384366	20/04/28 05:11:35
1	97	337.57961233451334	291.28575889791745	20/04/28 05:11:36
1	97	337.60301325599653	291.35400338791675	20/04/28 05:11:36
1	97	337.5681629253835	291.589428296609	20/04/28 05:11:36
1	97	337.38677486705166	291.52610129161434	20/04/28 05:11:36
1	97	337.46253264195644	291.61940102102847	20/04/28 05:11:36
1	97	337.4357835018386	291.60397321041694	20/04/28 05:11:36
1	97	337.19955558590215	291.76202333915677	20/04/28 05:11:36
1	97	337.2414231642377	291.8306893891674	20/04/28 05:11:36
1	97	337.19185247020084	291.82068620234736	20/04/28 05:11:36
1	97	336.9679238667294	291.85318187716825	20/04/28 05:11:36
1	97	337.11099955684256	291.8960064799998	20/04/28 05:11:37
1	97	336.96419320932324	291.9750061136713	20/04/28 05:11:37
1	97	336.8975610631931	291.87535228830933	20/04/28 05:11:37
1	97	336.8713174350564	291.8362968529484	20/04/28 05:11:37
1	97	336.81259348777985	291.66169464238885	20/04/28 05:11:37
1	97	336.79705596711585	291.64865761381844	20/04/28 05:11:37
1	97	336.8098944896356	291.65896341365044	20/04/28 05:11:37
1	97	336.8110662794041	291.5942470403736	20/04/28 05:11:37
1	97	336.67196312943616	291.58143547270606	20/04/28 05:11:37
1	97	336.8861926663874	291.6627185821318	20/04/28 05:11:38
1	97	337.0391631362044	291.83093650094156	20/04/28 05:11:38
1	97	337.0198580098659	291.8704806295612	20/04/28 05:11:38
1	97	337.22342586971763	291.73342098728483	20/04/28 05:11:38
1	97	337.2828548055048	291.8516058249044	20/04/28 05:11:38
1	97	337.4728876704579	291.8744803607212	20/04/28 05:11:38
1	97	337.6172050111928	291.8386680095037	20/04/28 05:11:38
1	97	337.5330561887211	291.58567254986946	20/04/28 05:11:38
1	97	337.67113133172654	291.84559611472196	20/04/28 05:11:38
1	97	337.5757881550328	292.11952856917657	20/04/28 05:11:38
1	97	337.33644071385345	292.17458858889097	20/04/28 05:11:39
1	97	337.20284352231823	291.9862713470311	20/04/28 05:11:39
1	97	337.3955322694687	292.07585389063	20/04/28 05:11:39
1	97	337.39190456165875	292.0757856926614	20/04/28 05:11:39
1	97	337.3969268659393	292.05794340579297	20/04/28 05:11:39
1	97	337.32002983152984	291.8053855489016	20/04/28 05:11:39
1	97	337.5040123372171	291.79721397198796	20/04/28 05:11:39
1	97	337.6263067485857	291.9178405148598	20/04/28 05:11:39
1	97	337.6263067485857	291.9178405148598	20/04/28 05:11:39
1	97	337.7133049472386	292.02363815311804	20/04/28 05:11:40
1	97	337.90003518322214	291.9419851962159	20/04/28 05:11:40
1	97	337.69957003971	291.9769659306281	20/04/28 05:11:40
1	97	337.69957003971	291.9769659306281	20/04/28 05:11:40
1	97	337.525744818568	291.9523409219259	20/04/28 05:11:40
1	97	337.3908045513395	291.82352358533853	20/04/28 05:11:40
1	97	337.3941249362922	291.57277173885234	20/04/28 05:11:40
1	97	337.3477077691471	291.6738226298742	20/04/28 05:11:40
1	97	337.333141456312	291.50795060461485	20/04/28 05:11:40
1	97	337.3432565191828	291.49764008303015	20/04/28 05:11:40
1	97	337.34380052843187	291.4763731186302	20/04/28 05:11:41
1	97	337.13406713178125	291.4884804926146	20/04/28 05:11:41
1	97	337.1900530187792	291.467620667735	20/04/28 05:11:41
1	97	337.2843713500778	291.250114535244	20/04/28 05:11:41
1	97	337.30820380738544	291.15391937146063	20/04/28 05:11:41
1	97	337.33010884156215	291.12852585132134	20/04/28 05:11:41
1	97	337.2209180355325	291.16384065844113	20/04/28 05:11:41
1	97	337.0201580954609	291.016492124187	20/04/28 05:11:41
1	97	337.0218455369882	291.2712009866765	20/04/28 05:11:41
1	97	337.02981463590146	291.2424421982302	20/04/28 05:11:41
1	97	336.7325309162466	291.2124178513132	20/04/28 05:11:42
1	97	336.9713806030286	291.18976615363465	20/04/28 05:11:42
1	97	336.8376322720643	291.17708154361213	20/04/28 05:11:42
1	97	336.64755933002647	290.9613590740175	20/04/28 05:11:42
1	97	336.633614093018	290.87354484129685	20/04/28 05:11:42
1	97	336.4446441191993	290.97783310097236	20/04/28 05:11:42
1	97	336.44701895394735	290.97917104364586	20/04/28 05:11:42
1	97	336.2801801131792	290.9783120353741	20/04/28 05:11:42
1	97	336.19905585079243	290.8430459388292	20/04/28 05:11:42
1	97	336.28805950548144	290.6124468543037	20/04/28 05:11:43
1	97	336.0611150820588	290.7153532116755	20/04/28 05:11:43
1	97	336.3029189317398	290.8079677224206	20/04/28 05:11:43
1	97	336.1389381786092	290.73027482006034	20/04/28 05:11:43
1	97	336.15130618325725	290.73789906777	20/04/28 05:11:43
1	97	336.03758121285694	290.475251353249	20/04/28 05:11:43
1	97	335.9972047336998	290.5414743049749	20/04/28 05:11:43
1	97	335.8373103291885	290.55442474553433	20/04/28 05:11:43
1	97	335.72489379430465	290.50041065230056	20/04/28 05:11:43
1	97	335.79610714149703	290.63805823832956	20/04/28 05:11:43
1	97	335.79704116498124	290.6530186928564	20/04/28 05:11:44
1	97	335.7500971217875	290.63192529462185	20/04/28 05:11:44
1	97	335.6548184196719	290.5044571368962	20/04/28 05:11:44
1	97	335.9286031884617	290.4582154456404	20/04/28 05:11:44
1	97	335.8928228690485	290.24187482280024	20/04/28 05:11:44
1	97	336.0134952235759	290.2875615079729	20/04/28 05:11:44
1	97	335.7932327052816	290.4659943562639	20/04/28 05:11:44
1	97	335.53686845368145	290.59162848813617	20/04/28 05:11:44
1	97	335.53686845368145	290.59162848813617	20/04/28 05:11:44
