floorId	partitionId	location_x	location_y	timeStamp
1	98	303.28594423312194	264.61216223098285	20/04/28 05:11:44
1	98	305.14384176673207	266.22087392439636	20/04/28 05:11:45
1	98	303.28594423312194	264.61216223098285	20/04/28 05:11:46
1	98	303.28594423312194	264.61216223098285	20/04/28 05:11:47
1	98	303.28594423312194	264.61216223098285	20/04/28 05:11:48
1	56	307.159840217744	263.3357311024059	20/04/28 05:11:49
1	56	307.159840217744	263.3357311024059	20/04/28 05:11:50
1	98	303.28594423312194	264.61216223098285	20/04/28 05:11:51
1	98	303.28594423312194	264.61216223098285	20/04/28 05:11:52
1	98	303.28594423312194	264.61216223098285	20/04/28 05:11:53
1	98	303.28594423312194	264.61216223098285	20/04/28 05:11:54
1	98	303.28594423312194	264.61216223098285	20/04/28 05:11:55
1	98	303.28594423312194	264.61216223098285	20/04/28 05:11:56
1	98	303.28594423312194	264.61216223098285	20/04/28 05:11:57
1	98	303.28594423312194	264.61216223098285	20/04/28 05:11:58
1	98	303.28594423312194	264.61216223098285	20/04/28 05:11:59
1	98	303.28594423312194	264.61216223098285	20/04/28 05:12:00
1	98	303.28594423312194	264.61216223098285	20/04/28 05:12:01
1	98	303.28594423312194	264.61216223098285	20/04/28 05:12:02
1	98	303.28594423312194	264.61216223098285	20/04/28 05:12:03
1	98	303.28594423312194	264.61216223098285	20/04/28 05:12:04
1	98	303.28594423312194	264.61216223098285	20/04/28 05:12:05
1	98	303.28594423312194	264.61216223098285	20/04/28 05:12:06
1	98	303.28594423312194	264.61216223098285	20/04/28 05:12:07
1	98	303.28594423312194	264.61216223098285	20/04/28 05:12:08
1	98	303.28594423312194	264.61216223098285	20/04/28 05:12:09
1	98	303.28594423312194	264.61216223098285	20/04/28 05:12:10
1	98	303.28594423312194	264.61216223098285	20/04/28 05:12:11
1	98	303.28594423312194	264.61216223098285	20/04/28 05:12:12
1	98	303.28594423312194	264.61216223098285	20/04/28 05:12:13
1	98	303.28594423312194	264.61216223098285	20/04/28 05:12:14
1	98	303.28594423312194	264.61216223098285	20/04/28 05:12:15
1	98	303.28594423312194	264.61216223098285	20/04/28 05:12:16
1	98	303.28594423312194	264.61216223098285	20/04/28 05:12:17
1	98	303.28594423312194	264.61216223098285	20/04/28 05:12:18
1	98	303.28594423312194	264.61216223098285	20/04/28 05:12:19
1	98	303.28594423312194	264.61216223098285	20/04/28 05:12:20
1	98	303.28594423312194	264.61216223098285	20/04/28 05:12:21
1	98	303.28594423312194	264.61216223098285	20/04/28 05:12:22
1	98	303.28594423312194	264.61216223098285	20/04/28 05:12:23
1	98	303.28594423312194	264.61216223098285	20/04/28 05:12:24
1	98	303.28594423312194	264.61216223098285	20/04/28 05:12:25
1	98	303.28594423312194	264.61216223098285	20/04/28 05:12:26
1	98	303.28594423312194	264.61216223098285	20/04/28 05:12:27
1	98	303.28594423312194	264.61216223098285	20/04/28 05:12:28
1	98	303.28594423312194	264.61216223098285	20/04/28 05:12:29
1	98	303.4235469930243	265.77780366757264	20/04/28 05:12:30
1	98	305.14384176673207	266.22087392439636	20/04/28 05:12:31
1	98	305.14384176673207	266.22087392439636	20/04/28 05:12:32
1	98	305.14384176673207	266.22087392439636	20/04/28 05:12:33
1	98	303.4235469930243	265.77780366757264	20/04/28 05:12:34
1	98	305.14384176673207	266.22087392439636	20/04/28 05:12:35
1	98	303.4235469930243	265.77780366757264	20/04/28 05:12:36
1	98	305.14384176673207	266.22087392439636	20/04/28 05:12:37
1	98	305.14384176673207	266.22087392439636	20/04/28 05:12:38
1	98	305.14384176673207	266.22087392439636	20/04/28 05:12:39
1	98	305.14384176673207	266.22087392439636	20/04/28 05:12:40
1	98	305.14384176673207	266.22087392439636	20/04/28 05:12:41
1	98	305.14384176673207	266.22087392439636	20/04/28 05:12:42
1	98	305.14384176673207	266.22087392439636	20/04/28 05:12:43
1	98	305.14384176673207	266.22087392439636	20/04/28 05:12:44
1	98	305.14384176673207	266.22087392439636	20/04/28 05:12:45
1	98	305.14384176673207	266.22087392439636	20/04/28 05:12:46
1	98	305.14384176673207	266.22087392439636	20/04/28 05:12:47
1	98	305.14384176673207	266.22087392439636	20/04/28 05:12:48
1	98	305.14384176673207	266.22087392439636	20/04/28 05:12:49
1	98	305.14384176673207	266.22087392439636	20/04/28 05:12:50
1	98	303.28594423312194	264.61216223098285	20/04/28 05:12:51
1	98	303.28594423312194	264.61216223098285	20/04/28 05:12:52
1	98	303.28594423312194	264.61216223098285	20/04/28 05:12:53
1	98	303.28594423312194	264.61216223098285	20/04/28 05:12:54
1	98	303.28594423312194	264.61216223098285	20/04/28 05:12:55
1	98	303.28594423312194	264.61216223098285	20/04/28 05:12:56
1	98	303.28594423312194	264.61216223098285	20/04/28 05:12:57
1	98	303.28594423312194	264.61216223098285	20/04/28 05:12:58
1	98	303.28594423312194	264.61216223098285	20/04/28 05:12:59
1	98	303.28594423312194	264.61216223098285	20/04/28 05:13:00
1	98	303.28594423312194	264.61216223098285	20/04/28 05:13:01
1	98	303.28594423312194	264.61216223098285	20/04/28 05:13:02
1	98	305.14384176673207	266.22087392439636	20/04/28 05:13:03
1	98	303.28594423312194	264.61216223098285	20/04/28 05:13:04
1	98	303.28594423312194	264.61216223098285	20/04/28 05:13:05
1	98	303.28594423312194	264.61216223098285	20/04/28 05:13:06
1	98	303.4235469930243	265.77780366757264	20/04/28 05:13:07
1	98	303.28594423312194	264.61216223098285	20/04/28 05:13:08
1	98	303.28594423312194	264.61216223098285	20/04/28 05:13:09
1	98	303.28594423312194	264.61216223098285	20/04/28 05:13:10
1	98	303.28594423312194	264.61216223098285	20/04/28 05:13:11
1	98	303.4235469930243	265.77780366757264	20/04/28 05:13:12
1	98	303.28594423312194	264.61216223098285	20/04/28 05:13:13
1	98	304.06212905874577	266.91905155497903	20/04/28 05:13:14
1	98	303.4235469930243	265.77780366757264	20/04/28 05:13:15
1	98	303.28594423312194	264.61216223098285	20/04/28 05:13:16
1	98	303.28594423312194	264.61216223098285	20/04/28 05:13:17
1	98	303.28594423312194	264.61216223098285	20/04/28 05:13:18
1	98	303.28594423312194	264.61216223098285	20/04/28 05:13:19
1	98	303.28594423312194	264.61216223098285	20/04/28 05:13:20
1	98	303.28594423312194	264.61216223098285	20/04/28 05:13:21
