floorId	partitionId	location_x	location_y	timeStamp
3	89	337.4950877232548	298.20130931449154	20/04/28 05:15:11
3	89	338.6476181345684	296.0905864151589	20/04/28 05:15:12
1	93	337.4950877232548	298.20130931449154	20/04/28 05:15:13
3	89	337.93056117792	295.64954416556157	20/04/28 05:15:14
3	89	338.6476181345684	296.0905864151589	20/04/28 05:15:15
3	89	337.4950877232548	298.20130931449154	20/04/28 05:15:16
3	89	338.6476181345684	296.0905864151589	20/04/28 05:15:17
3	89	338.6476181345684	296.0905864151589	20/04/28 05:15:18
3	NULL	341.30497758665337	296.19351549065414	20/04/28 05:15:19
1	97	340.7799935809384	292.30431416119154	20/04/28 05:15:20
3	NULL	341.30497758665337	296.19351549065414	20/04/28 05:15:21
1	93	341.30497758665337	296.19351549065414	20/04/28 05:15:22
1	93	341.30497758665337	296.19351549065414	20/04/28 05:15:23
1	93	341.30497758665337	296.19351549065414	20/04/28 05:15:24
1	93	341.30497758665337	296.19351549065414	20/04/28 05:15:25
3	NULL	341.30497758665337	296.19351549065414	20/04/28 05:15:26
3	NULL	341.30497758665337	296.19351549065414	20/04/28 05:15:27
1	93	343.0804338647672	295.120117703521	20/04/28 05:15:28
3	NULL	341.30497758665337	296.19351549065414	20/04/28 05:15:29
1	93	341.947826955428	295.9212000594536	20/04/28 05:15:30
1	93	343.0804338647672	295.120117703521	20/04/28 05:15:31
1	93	341.30497758665337	296.19351549065414	20/04/28 05:15:32
1	93	341.30497758665337	296.19351549065414	20/04/28 05:15:33
1	93	343.7903016985783	295.0700232299748	20/04/28 05:15:34
1	93	344.7301279798078	297.37843376747077	20/04/28 05:15:35
1	93	341.30497758665337	296.19351549065414	20/04/28 05:15:36
1	93	343.0804338647672	295.120117703521	20/04/28 05:15:37
1	93	343.0804338647672	295.120117703521	20/04/28 05:15:38
1	93	343.0804338647672	295.120117703521	20/04/28 05:15:39
1	93	341.30497758665337	296.19351549065414	20/04/28 05:15:40
3	NULL	341.30497758665337	296.19351549065414	20/04/28 05:15:41
1	93	339.987600958017	297.56895377695577	20/04/28 05:15:42
1	93	344.7301279798078	297.37843376747077	20/04/28 05:15:43
3	77	344.7301279798078	297.37843376747077	20/04/28 05:15:44
3	NULL	341.30497758665337	296.19351549065414	20/04/28 05:15:45
3	89	339.987600958017	297.56895377695577	20/04/28 05:15:46
1	93	344.7301279798078	297.37843376747077	20/04/28 05:15:47
1	93	344.7301279798078	297.37843376747077	20/04/28 05:15:48
1	93	343.0804338647672	295.120117703521	20/04/28 05:15:49
1	93	344.7301279798078	297.37843376747077	20/04/28 05:15:50
1	93	344.7301279798078	297.37843376747077	20/04/28 05:15:51
1	93	344.7301279798078	297.37843376747077	20/04/28 05:15:52
1	93	343.7903016985783	295.0700232299748	20/04/28 05:15:53
1	93	343.0804338647672	295.120117703521	20/04/28 05:15:54
1	93	344.7301279798078	297.37843376747077	20/04/28 05:15:55
1	93	343.0804338647672	295.120117703521	20/04/28 05:15:56
3	NULL	341.30497758665337	296.19351549065414	20/04/28 05:15:57
1	93	343.0804338647672	295.120117703521	20/04/28 05:15:58
1	93	343.0804338647672	295.120117703521	20/04/28 05:15:59
1	93	344.7301279798078	297.37843376747077	20/04/28 05:16:00
1	93	341.30497758665337	296.19351549065414	20/04/28 05:16:01
1	93	341.30497758665337	296.19351549065414	20/04/28 05:16:02
3	77	343.0804338647672	295.120117703521	20/04/28 05:16:03
