floorId	partitionId	location_x	location_y	timeStamp
1	98	304.06212905874577	266.91905155497903	20/04/28 05:13:43
1	98	303.4235469930243	265.77780366757264	20/04/28 05:13:44
3	47	302.3157990937455	265.96754816044853	20/04/28 05:13:45
3	47	302.8570592601016	265.6207358146814	20/04/28 05:13:46
3	47	305.42047124180004	265.2616066172563	20/04/28 05:13:47
1	4	319.1296127585476	288.01612088858127	20/04/28 05:13:48
3	20	308.1866193271433	264.1749199815553	20/04/28 05:13:49
1	81	313.37765885306834	261.0920988121665	20/04/28 05:13:50
1	81	312.6019130172586	265.6450929868838	20/04/28 05:13:51
1	81	315.0919378015828	261.7557595783303	20/04/28 05:13:52
3	54	321.27015631552865	262.1152944981856	20/04/28 05:13:53
3	54	324.01518066743233	262.76750572012435	20/04/28 05:13:54
3	54	324.01518066743233	262.76750572012435	20/04/28 05:13:55
3	54	324.6837666112415	261.38954335341236	20/04/28 05:13:56
3	54	327.3540763805351	261.1072377077433	20/04/28 05:13:57
3	54	327.3540763805351	261.1072377077433	20/04/28 05:13:58
3	54	334.4407240787428	261.4032786809491	20/04/28 05:13:59
3	54	334.4407240787428	261.4032786809491	20/04/28 05:14:00
3	54	334.4407240787428	261.4032786809491	20/04/28 05:14:01
3	99	336.4851608994322	259.3906255409665	20/04/28 05:14:02
3	99	338.72849302958224	257.33962041953436	20/04/28 05:14:03
3	99	338.72849302958224	257.3396204195344	20/04/28 05:14:04
3	42	343.1917987024697	259.9647561276533	20/04/28 05:14:05
3	42	346.14765802480184	258.0553042304112	20/04/28 05:14:06
3	54	350.37914153837863	260.97432627346046	20/04/28 05:14:07
3	54	350.37914153837863	260.97432627346046	20/04/28 05:14:08
3	42	352.20974435218506	259.0612514241787	20/04/28 05:14:09
3	NULL	354.1150536168531	260.46320239372614	20/04/28 05:14:10
3	54	354.93110780732565	263.85962413987545	20/04/28 05:14:11
3	54	359.56855835216805	263.2279362811352	20/04/28 05:14:12
3	34	362.2167196060361	259.70189758364177	20/04/28 05:14:13
3	34	362.2167196060361	259.70189758364177	20/04/28 05:14:14
3	34	361.2642468288334	255.55936173685845	20/04/28 05:14:15
3	17	363.0633788732786	253.76883669815365	20/04/28 05:14:16
3	17	361.9057312824121	254.45903554354518	20/04/28 05:14:17
3	17	362.3945272480641	251.57317905073432	20/04/28 05:14:18
3	30	365.53445097535786	248.80973562593917	20/04/28 05:14:19
3	NULL	366.79190435951654	246.6278485991508	20/04/28 05:14:20
3	23	366.2602386887035	244.5685484047918	20/04/28 05:14:21
3	6	370.63064515039724	245.89555531802912	20/04/28 05:14:22
3	6	371.6459156222339	242.1946659303275	20/04/28 05:14:23
3	6	371.6459156222339	242.1946659303275	20/04/28 05:14:24
3	6	374.6648195618352	245.76470510583655	20/04/28 05:14:25
3	6	374.6648195618352	245.76470510583655	20/04/28 05:14:26
3	6	371.6459156222339	242.1946659303275	20/04/28 05:14:27
3	6	371.6459156222339	242.1946659303275	20/04/28 05:14:28
3	6	374.6648195618352	245.76470510583655	20/04/28 05:14:29
3	6	374.6648195618352	245.76470510583655	20/04/28 05:14:30
3	6	371.6459156222339	242.1946659303275	20/04/28 05:14:31
3	6	371.6459156222339	242.1946659303275	20/04/28 05:14:32
3	6	371.6459156222339	242.1946659303275	20/04/28 05:14:33
3	6	371.6459156222339	242.1946659303275	20/04/28 05:14:34
3	6	371.6459156222339	242.1946659303275	20/04/28 05:14:35
3	6	371.6459156222339	242.1946659303275	20/04/28 05:14:36
3	6	371.6459156222339	242.1946659303275	20/04/28 05:14:37
3	6	371.6459156222339	242.1946659303275	20/04/28 05:14:38
3	6	371.6459156222339	242.1946659303275	20/04/28 05:14:39
3	6	371.6459156222339	242.1946659303275	20/04/28 05:14:40
3	6	371.6459156222339	242.1946659303275	20/04/28 05:14:41
3	6	374.6648195618352	245.76470510583655	20/04/28 05:14:42
3	6	371.6459156222339	242.1946659303275	20/04/28 05:14:43
3	6	371.6459156222339	242.1946659303275	20/04/28 05:14:44
3	6	371.6459156222339	242.1946659303275	20/04/28 05:14:45
3	6	374.6648195618352	245.76470510583655	20/04/28 05:14:46
3	6	371.6459156222339	242.1946659303275	20/04/28 05:14:47
3	6	371.6459156222339	242.1946659303275	20/04/28 05:14:48
3	6	371.6459156222339	242.1946659303275	20/04/28 05:14:49
3	6	371.6459156222339	242.1946659303275	20/04/28 05:14:50
3	6	370.63064515039724	245.89555531802912	20/04/28 05:14:51
3	6	370.63064515039724	245.89555531802912	20/04/28 05:14:52
3	57	367.9225813006245	252.20998711858013	20/04/28 05:14:53
3	57	367.9225813006244	252.20998711858013	20/04/28 05:14:54
3	17	363.0633788732786	253.76883669815368	20/04/28 05:14:55
3	17	363.0633788732786	253.76883669815365	20/04/28 05:14:56
3	34	361.2642468288334	255.55936173685845	20/04/28 05:14:57
3	34	362.2167196060361	259.70189758364177	20/04/28 05:14:58
3	34	362.2167196060361	259.70189758364177	20/04/28 05:14:59
3	54	366.62676773698104	260.59873223846915	20/04/28 05:15:00
3	54	368.9169651830857	261.65782172430613	20/04/28 05:15:01
3	54	372.48785670166836	262.3595943162643	20/04/28 05:15:02
3	54	372.48785670166836	262.3595943162643	20/04/28 05:15:03
3	54	372.48785670166836	262.3595943162643	20/04/28 05:15:04
3	NULL	378.7058029092993	264.8528273199328	20/04/28 05:15:05
3	46	374.77284073484725	264.6119154739458	20/04/28 05:15:06
3	15	381.6109766893215	266.7378605480671	20/04/28 05:15:07
1	33	381.6109766893215	266.73786054806715	20/04/28 05:15:08
1	33	381.6109766893215	266.7378605480671	20/04/28 05:15:09
1	86	377.91614244309534	266.0609018455502	20/04/28 05:15:10
1	74	374.7544496259107	264.45130263293123	20/04/28 05:15:11
1	69	372.48785670166836	262.3595943162643	20/04/28 05:15:12
1	69	372.48785670166836	262.3595943162643	20/04/28 05:15:13
1	13	368.31727752533806	266.1301521552222	20/04/28 05:15:14
1	13	368.31727752533806	266.1301521552222	20/04/28 05:15:15
1	13	368.31727752533806	266.1301521552222	20/04/28 05:15:16
3	46	364.70031867043167	266.8771548784566	20/04/28 05:15:17
1	13	364.70031867043167	266.8771548784566	20/04/28 05:15:18
1	13	368.31727752533806	266.1301521552222	20/04/28 05:15:19
1	13	368.31727752533806	266.1301521552222	20/04/28 05:15:20
3	46	368.31727752533806	266.1301521552222	20/04/28 05:15:21
1	13	364.70031867043167	266.8771548784566	20/04/28 05:15:22
3	46	364.70031867043167	266.8771548784566	20/04/28 05:15:23
3	46	364.70031867043167	266.8771548784566	20/04/28 05:15:24
3	46	364.70031867043167	266.8771548784566	20/04/28 05:15:25
3	46	364.70031867043167	266.8771548784566	20/04/28 05:15:26
3	46	364.70031867043167	266.8771548784566	20/04/28 05:15:27
3	46	364.70031867043167	266.8771548784566	20/04/28 05:15:28
3	46	364.70031867043167	266.8771548784566	20/04/28 05:15:29
3	46	364.70031867043167	266.8771548784566	20/04/28 05:15:30
3	46	364.70031867043167	266.8771548784566	20/04/28 05:15:31
1	13	364.70031867043167	266.8771548784566	20/04/28 05:15:32
3	46	368.31727752533806	266.1301521552222	20/04/28 05:15:33
1	13	368.31727752533806	266.1301521552222	20/04/28 05:15:34
1	13	368.31727752533806	266.1301521552222	20/04/28 05:15:35
1	13	368.31727752533806	266.1301521552222	20/04/28 05:15:36
1	13	368.31727752533806	266.1301521552222	20/04/28 05:15:37
1	69	365.05818197202217	263.8299504857794	20/04/28 05:15:38
3	54	364.18549555378036	263.2925259814757	20/04/28 05:15:39
3	54	358.87237025214637	261.21107622709695	20/04/28 05:15:40
1	64	356.02694011127693	259.70882448523747	20/04/28 05:15:41
1	64	354.49328963180795	262.3471616487957	20/04/28 05:15:42
1	41	352.7251685521831	260.56227788261185	20/04/28 05:15:43
1	41	352.7251685521831	260.56227788261185	20/04/28 05:15:44
1	41	352.7251685521831	260.56227788261185	20/04/28 05:15:45
1	64	354.3333978239378	262.53426333928064	20/04/28 05:15:46
1	64	354.49328963180795	262.3471616487957	20/04/28 05:15:47
1	64	354.49328963180795	262.3471616487957	20/04/28 05:15:48
1	41	351.96649871797985	262.24337644403926	20/04/28 05:15:49
1	41	351.1038521390131	261.25919659269	20/04/28 05:15:50
1	41	351.1038521390131	261.25919659269	20/04/28 05:15:51
1	41	351.1038521390131	261.25919659269	20/04/28 05:15:52
1	64	354.3333978239378	262.53426333928064	20/04/28 05:15:53
1	64	354.49328963180795	262.3471616487957	20/04/28 05:15:54
1	41	351.96649871797985	262.24337644403926	20/04/28 05:15:55
1	41	351.96649871797985	262.24337644403926	20/04/28 05:15:56
1	64	354.3333978239378	262.53426333928064	20/04/28 05:15:57
1	64	354.3333978239378	262.53426333928064	20/04/28 05:15:58
1	64	354.3333978239378	262.53426333928064	20/04/28 05:15:59
1	41	352.5027950101314	264.44733818856236	20/04/28 05:16:00
1	64	354.3333978239378	262.53426333928064	20/04/28 05:16:01
1	64	354.49328963180795	262.3471616487957	20/04/28 05:16:02
1	41	352.7251685521831	260.56227788261185	20/04/28 05:16:03
1	41	352.7251685521831	260.56227788261185	20/04/28 05:16:04
1	41	352.7251685521831	260.56227788261185	20/04/28 05:16:05
1	69	353.6772354413353	258.9507399026464	20/04/28 05:16:06
1	69	357.91989747494364	257.0685403803136	20/04/28 05:16:07
3	34	360.3447443281359	257.2761703004846	20/04/28 05:16:08
3	34	360.34474432813596	257.2761703004846	20/04/28 05:16:09
3	17	363.0633788732786	253.76883669815365	20/04/28 05:16:10
3	57	370.51908075392413	258.76896591843035	20/04/28 05:16:12
3	57	372.11918762795403	254.90991466941398	20/04/28 05:16:13
3	57	374.0879635756983	258.5005430672479	20/04/28 05:16:14
3	57	374.0879635756983	258.5005430672479	20/04/28 05:16:15
3	57	372.1191876279541	254.90991466941398	20/04/28 05:16:16
3	57	372.11918762795403	254.90991466941398	20/04/28 05:16:17
3	57	372.1191876279541	254.90991466941398	20/04/28 05:16:18
3	57	374.26377240687106	258.09781787279195	20/04/28 05:16:19
3	57	374.26377240687106	258.09781787279195	20/04/28 05:16:20
3	57	374.0879635756983	258.5005430672479	20/04/28 05:16:21
3	57	374.0879635756983	258.5005430672479	20/04/28 05:16:22
3	57	374.0879635756983	258.5005430672479	20/04/28 05:16:23
3	57	374.08796357569827	258.50054306724786	20/04/28 05:16:24
3	54	372.48785670166836	262.3595943162643	20/04/28 05:16:25
3	54	372.48785670166836	262.35959431626424	20/04/28 05:16:26
1	69	372.48785670166836	262.3595943162643	20/04/28 05:16:27
3	54	372.48785670166836	262.35959431626424	20/04/28 05:16:28
3	54	372.48785670166836	262.35959431626424	20/04/28 05:16:29
3	54	372.48785670166836	262.35959431626424	20/04/28 05:16:30
3	57	374.26377240687106	258.09781787279195	20/04/28 05:16:31
3	54	372.48785670166836	262.35959431626424	20/04/28 05:16:32
3	54	372.48785670166836	262.35959431626424	20/04/28 05:16:33
1	69	374.08796357569827	258.50054306724786	20/04/28 05:16:34
3	54	376.18075636557654	261.96517202151136	20/04/28 05:16:35
3	54	372.48785670166836	262.35959431626424	20/04/28 05:16:36
3	54	372.48785670166836	262.35959431626424	20/04/28 05:16:37
1	69	372.48785670166836	262.35959431626424	20/04/28 05:16:38
1	69	372.48785670166836	262.3595943162643	20/04/28 05:16:39
1	69	372.48785670166836	262.3595943162643	20/04/28 05:16:40
1	69	372.48785670166836	262.3595943162643	20/04/28 05:16:41
3	54	372.48785670166836	262.35959431626424	20/04/28 05:16:42
3	54	376.18075636557654	261.96517202151136	20/04/28 05:16:43
1	33	379.51825801393375	263.17204603967434	20/04/28 05:16:44
1	33	380.6150632356726	267.4744509522458	20/04/28 05:16:45
1	33	381.6109766893215	266.73786054806715	20/04/28 05:16:46
3	15	380.97239583354167	266.94453563659977	20/04/28 05:16:47
3	46	374.77284073484725	264.6119154739458	20/04/28 05:16:48
3	54	376.35656519674916	261.5624468270555	20/04/28 05:16:49
3	54	372.48785670166836	262.3595943162643	20/04/28 05:16:50
3	54	372.48785670166836	262.3595943162643	20/04/28 05:16:51
3	54	372.48785670166836	262.3595943162643	20/04/28 05:16:52
3	54	368.9169651830857	261.65782172430613	20/04/28 05:16:53
3	57	365.8336784609425	258.95489486040736	20/04/28 05:16:54
3	54	364.361304384953	262.8898007870198	20/04/28 05:16:55
3	46	361.61703194828846	264.17422801455785	20/04/28 05:16:56
3	54	359.56855835216805	263.2279362811352	20/04/28 05:16:57
3	54	358.23287936641947	263.00617074250107	20/04/28 05:16:58
3	54	354.93110780732565	263.85962413987545	20/04/28 05:16:59
3	54	352.9059324522066	261.07811147821695	20/04/28 05:17:00
3	54	350.37914153837863	260.97432627346046	20/04/28 05:17:01
3	54	350.37914153837863	260.97432627346046	20/04/28 05:17:02
3	54	350.3791415383785	260.97432627346046	20/04/28 05:17:03
3	54	345.98250818917177	261.859258749847	20/04/28 05:17:04
3	42	343.19179870246967	259.9647561276533	20/04/28 05:17:05
3	54	339.37751996608864	260.69732910032604	20/04/28 05:17:06
3	NULL	337.70753542622793	260.45953294809686	20/04/28 05:17:07
3	54	334.4407240787428	261.4032786809491	20/04/28 05:17:08
3	54	334.4407240787428	261.4032786809491	20/04/28 05:17:09
3	54	334.4407240787428	261.4032786809491	20/04/28 05:17:10
3	54	334.4407240787428	261.4032786809491	20/04/28 05:17:11
3	54	327.3540763805351	261.10723770774325	20/04/28 05:17:12
3	54	327.3540763805351	261.10723770774325	20/04/28 05:17:13
3	54	324.0151806674323	262.76750572012435	20/04/28 05:17:14
3	18	323.5974156050991	264.28862562276623	20/04/28 05:17:15
3	54	321.27015631552865	262.1152944981856	20/04/28 05:17:16
3	54	318.718225726321	262.2630310087092	20/04/28 05:17:17
1	81	314.966663003447	265.07112173294576	20/04/28 05:17:18
1	81	312.6019130172586	265.6450929868838	20/04/28 05:17:19
3	51	312.6019130172586	265.6450929868838	20/04/28 05:17:20
3	47	305.42047124180004	265.2616066172563	20/04/28 05:17:21
3	47	305.42047124180004	265.2616066172563	20/04/28 05:17:22
3	47	302.8570592601016	265.6207358146814	20/04/28 05:17:23
3	47	302.3157990937455	265.96754816044853	20/04/28 05:17:24
1	98	303.28594423312194	264.61216223098285	20/04/28 05:17:25
1	98	303.28594423312194	264.61216223098285	20/04/28 05:17:26
1	56	307.159840217744	263.3357311024059	20/04/28 05:17:27
1	56	307.159840217744	263.3357311024059	20/04/28 05:17:28
1	81	311.65911721261057	263.4112042347413	20/04/28 05:17:29
1	81	314.50318194109644	265.02915212402996	20/04/28 05:17:30
1	81	314.50318194109644	265.02915212402996	20/04/28 05:17:31
1	81	316.8584991431141	264.5437756453438	20/04/28 05:17:32
1	56	319.89662212153377	266.1573209564685	20/04/28 05:17:33
1	56	319.89662212153377	266.1573209564685	20/04/28 05:17:34
1	72	322.34915620924	265.0152899264337	20/04/28 05:17:35
1	72	322.34915620924	265.0152899264337	20/04/28 05:17:36
1	37	325.93617404217133	264.20930050997885	20/04/28 05:17:37
1	37	326.6418503961265	263.9569908021342	20/04/28 05:17:38
1	NULL	331.9249996219656	268.73042370731713	20/04/28 05:17:39
1	NULL	331.9249996219656	268.73042370731713	20/04/28 05:17:40
1	29	332.3707929514742	270.8583422158162	20/04/28 05:17:41
1	29	332.97104916960257	272.8319216137393	20/04/28 05:17:42
1	29	333.41684249911117	274.9598401222384	20/04/28 05:17:43
1	29	333.41684249911117	274.9598401222384	20/04/28 05:17:44
1	29	332.11202638116566	272.3894277766605	20/04/28 05:17:45
1	29	332.11202638116566	272.3894277766605	20/04/28 05:17:46
1	29	332.3707929514742	270.8583422158162	20/04/28 05:17:47
1	29	333.41684249911117	274.9598401222384	20/04/28 05:17:48
1	29	333.41684249911117	274.9598401222384	20/04/28 05:17:49
1	29	331.53643314824757	274.0223057673639	20/04/28 05:17:50
1	29	332.11202638116566	272.3894277766605	20/04/28 05:17:51
1	29	333.41684249911117	274.9598401222384	20/04/28 05:17:52
1	29	333.41684249911117	274.9598401222384	20/04/28 05:17:53
1	29	333.41684249911117	274.9598401222384	20/04/28 05:17:54
1	29	333.41684249911117	274.9598401222384	20/04/28 05:17:55
1	29	333.41684249911117	274.9598401222384	20/04/28 05:17:56
1	29	333.41684249911117	274.9598401222384	20/04/28 05:17:57
1	29	333.41684249911117	274.9598401222384	20/04/28 05:17:58
1	29	333.41684249911117	274.9598401222384	20/04/28 05:17:59
1	29	333.41684249911117	274.9598401222384	20/04/28 05:18:00
1	29	333.41684249911117	274.9598401222384	20/04/28 05:18:01
1	29	333.41684249911117	274.9598401222384	20/04/28 05:18:02
1	29	333.41684249911117	274.9598401222384	20/04/28 05:18:03
1	29	333.41684249911117	274.9598401222384	20/04/28 05:18:04
1	29	333.41684249911117	274.9598401222384	20/04/28 05:18:05
1	29	333.41684249911117	274.9598401222384	20/04/28 05:18:06
1	29	333.41684249911117	274.9598401222384	20/04/28 05:18:07
1	29	332.11202638116566	272.3894277766605	20/04/28 05:18:08
1	29	333.41684249911117	274.9598401222384	20/04/28 05:18:09
1	29	333.41684249911117	274.9598401222384	20/04/28 05:18:10
1	29	332.11202638116566	272.3894277766605	20/04/28 05:18:11
1	29	333.41684249911117	274.9598401222384	20/04/28 05:18:12
1	29	332.11202638116566	272.3894277766605	20/04/28 05:18:13
1	29	332.11202638116566	272.3894277766605	20/04/28 05:18:14
1	29	332.11202638116566	272.3894277766605	20/04/28 05:18:15
1	29	332.3707929514742	270.8583422158162	20/04/28 05:18:16
1	29	332.11202638116566	272.3894277766605	20/04/28 05:18:17
1	29	332.3707929514742	270.8583422158162	20/04/28 05:18:18
1	29	332.11202638116566	272.3894277766605	20/04/28 05:18:19
1	29	332.11202638116566	272.3894277766605	20/04/28 05:18:20
1	29	332.11202638116566	272.3894277766605	20/04/28 05:18:21
1	NULL	331.9249996219656	268.73042370731713	20/04/28 05:18:22
1	NULL	331.9249996219656	268.73042370731713	20/04/28 05:18:23
1	NULL	331.9249996219656	268.73042370731713	20/04/28 05:18:24
1	NULL	331.9249996219656	268.73042370731713	20/04/28 05:18:25
1	29	332.3707929514742	270.8583422158162	20/04/28 05:18:26
1	NULL	331.9249996219656	268.73042370731713	20/04/28 05:18:27
1	NULL	331.9249996219656	268.73042370731713	20/04/28 05:18:28
1	NULL	331.9249996219656	268.7304237073172	20/04/28 05:18:29
1	NULL	329.62199117469305	269.91012801066097	20/04/28 05:18:30
1	NULL	322.44855271074147	266.00958444594494	20/04/28 05:18:31
1	72	322.34915620924	265.0152899264337	20/04/28 05:18:32
1	72	322.34915620924	265.0152899264337	20/04/28 05:18:33
1	56	319.89662212153377	266.1573209564685	20/04/28 05:18:34
1	81	317.4633882763735	263.938062910165	20/04/28 05:18:35
1	81	314.50318194109644	265.02915212402996	20/04/28 05:18:36
1	81	314.50318194109644	265.02915212402996	20/04/28 05:18:37
1	81	311.65911721261057	263.4112042347413	20/04/28 05:18:38
1	56	307.159840217744	263.3357311024059	20/04/28 05:18:39
1	56	307.159840217744	263.3357311024059	20/04/28 05:18:40
1	98	305.14384176673207	266.22087392439636	20/04/28 05:18:41
1	98	303.28594423312194	264.61216223098285	20/04/28 05:18:42
3	47	302.3157990937455	265.96754816044853	20/04/28 05:18:43
3	47	303.2859442331219	264.61216223098285	20/04/28 05:18:44
3	47	305.42047124180004	265.2616066172563	20/04/28 05:18:45
3	20	308.1866193271433	264.17491998155526	20/04/28 05:18:46
3	NULL	309.29436722642214	263.9851754886794	20/04/28 05:18:47
1	81	313.37765885306834	261.0920988121665	20/04/28 05:18:48
