floorId	partitionId	location_x	location_y	timeStamp
19	919	343.3678839583733	267.22308063374385	21/02/24 15:40:45
19	919	343.3678839583733	267.22308063374385	21/02/24 15:40:46
19	919	340.2475697813879	268.60286504177043	21/02/24 15:40:47
19	NULL	337.73701806888556	270.34580290420837	21/02/24 15:40:48
19	919	341.8507959684553	269.41861351939014	21/02/24 15:40:49
19	919	341.8507959684553	269.41861351939014	21/02/24 15:40:50
19	919	341.8507959684553	269.41861351939014	21/02/24 15:40:51
19	904	347.25758750563756	270.59329170523137	21/02/24 15:40:52
19	904	352.1597258472866	270.85810765218207	21/02/24 15:40:53
19	945	354.54681611956306	276.9555468868248	21/02/24 15:40:54
19	964	355.482293890607	282.3613173869535	21/02/24 15:40:55
19	964	355.482293890607	282.3613173869535	21/02/24 15:40:56
19	964	355.482293890607	282.3613173869535	21/02/24 15:40:57
19	990	357.82242061436574	282.16385269148645	21/02/24 15:40:58
19	918	358.31519680311567	286.86252054896266	21/02/24 15:40:59
19	918	358.31519680311567	286.86252054896266	21/02/24 15:41:00
19	918	358.31519680311567	286.86252054896266	21/02/24 15:41:01
19	918	358.31519680311567	286.86252054896266	21/02/24 15:41:02
19	918	358.31519680311567	286.86252054896266	21/02/24 15:41:03
19	918	358.31519680311567	286.86252054896266	21/02/24 15:41:04
19	918	358.31519680311567	286.86252054896266	21/02/24 15:41:05
19	918	358.31519680311567	286.86252054896266	21/02/24 15:41:06
19	918	358.31519680311567	286.86252054896266	21/02/24 15:41:07
19	918	358.31519680311567	286.86252054896266	21/02/24 15:41:08
19	918	358.31519680311567	286.86252054896266	21/02/24 15:41:09
19	959	362.3530560401282	287.71527633822046	21/02/24 15:41:10
19	959	362.3530560401282	287.71527633822046	21/02/24 15:41:11
19	959	362.3530560401282	287.71527633822046	21/02/24 15:41:12
19	959	362.3530560401282	287.71527633822046	21/02/24 15:41:13
19	959	362.3530560401282	287.71527633822046	21/02/24 15:41:14
19	959	362.3530560401282	287.71527633822046	21/02/24 15:41:15
19	959	362.3530560401282	287.71527633822046	21/02/24 15:41:16
19	959	362.3530560401282	287.71527633822046	21/02/24 15:41:17
19	959	362.3530560401282	287.71527633822046	21/02/24 15:41:18
19	918	358.31519680311567	286.86252054896266	21/02/24 15:41:19
19	918	358.31519680311567	286.86252054896266	21/02/24 15:41:20
19	918	358.31519680311567	286.86252054896266	21/02/24 15:41:21
19	918	358.31519680311567	286.86252054896266	21/02/24 15:41:22
19	918	358.31519680311567	286.86252054896266	21/02/24 15:41:23
19	918	358.31519680311567	286.86252054896266	21/02/24 15:41:24
19	NULL	360.5547106147949	283.12207921272073	21/02/24 15:41:25
19	NULL	360.5547106147949	283.12207921272073	21/02/24 15:41:26
19	958	364.8238741505902	287.1482151372541	21/02/24 15:41:27
19	958	365.44482048462646	284.4407937731175	21/02/24 15:41:28
19	910	371.49991506597235	283.64243362381774	21/02/24 15:41:29
19	990	373.5702263177357	281.590961967497	21/02/24 15:41:30
19	990	373.5702263177357	281.590961967497	21/02/24 15:41:31
19	990	373.5702263177357	281.590961967497	21/02/24 15:41:32
19	990	373.5702263177357	281.590961967497	21/02/24 15:41:33
19	937	374.6323604046247	279.0631299285737	21/02/24 15:41:34
19	937	374.6323604046247	279.06312992857363	21/02/24 15:41:35
19	937	374.6323604046247	279.06312992857363	21/02/24 15:41:36
19	937	374.6323604046247	279.06312992857363	21/02/24 15:41:37
19	937	374.6323604046247	279.0631299285737	21/02/24 15:41:38
19	937	374.6323604046247	279.0631299285737	21/02/24 15:41:39
19	937	374.6323604046247	279.0631299285737	21/02/24 15:41:40
19	990	373.5702263177357	281.590961967497	21/02/24 15:41:41
19	990	373.5702263177357	281.590961967497	21/02/24 15:41:42
19	910	371.49991506597235	283.64243362381774	21/02/24 15:41:43
19	958	365.44482048462646	284.4407937731175	21/02/24 15:41:44
19	990	363.0255287252569	282.5550180117545	21/02/24 15:41:45
19	NULL	360.5547106147949	283.12207921272073	21/02/24 15:41:46
19	990	357.82242061436585	282.16385269148645	21/02/24 15:41:47
19	990	357.82242061436574	282.16385269148645	21/02/24 15:41:48
19	964	355.482293890607	282.3613173869535	21/02/24 15:41:49
19	964	355.482293890607	282.3613173869535	21/02/24 15:41:50
19	968	355.71807547868275	279.11092240486005	21/02/24 15:41:51
19	968	355.71807547868275	279.11092240486005	21/02/24 15:41:52
19	904	347.25758750563756	270.59329170523137	21/02/24 15:41:53
19	904	347.25758750563756	270.59329170523137	21/02/24 15:41:54
19	919	341.8507959684553	269.41861351939014	21/02/24 15:41:55
19	919	341.8507959684553	269.41861351939014	21/02/24 15:41:56
19	NULL	337.73701806888556	270.34580290420837	21/02/24 15:41:57
19	NULL	337.73701806888556	270.34580290420837	21/02/24 15:41:58
19	909	333.79691834538926	273.32229963118385	21/02/24 15:41:59
19	909	333.4071053969908	273.0002052198683	21/02/24 15:42:00
19	955	331.14052623366666	274.53372397223194	21/02/24 15:42:01
19	909	329.0152670680587	273.689476616074	21/02/24 15:42:02
19	909	329.0152670680587	273.689476616074	21/02/24 15:42:03
19	909	326.737153683381	273.3535535783339	21/02/24 15:42:04
19	909	326.737153683381	273.3535535783339	21/02/24 15:42:05
19	909	322.2597600934958	270.06265729575637	21/02/24 15:42:06
19	900	321.3196420966728	268.8413887464654	21/02/24 15:42:07
19	938	316.2262659388113	269.2456724805139	21/02/24 15:42:08
19	938	316.22626593881137	269.245672480514	21/02/24 15:42:09
19	938	311.03091485791697	269.6668485578745	21/02/24 15:42:10
19	938	311.03091485791697	269.6668485578745	21/02/24 15:42:11
19	938	311.03091485791697	269.6668485578745	21/02/24 15:42:12
19	938	311.03091485791697	269.6668485578745	21/02/24 15:42:13
19	938	311.03091485791697	269.6668485578745	21/02/24 15:42:14
19	938	311.03091485791697	269.6668485578745	21/02/24 15:42:15
19	938	311.0309148579169	269.6668485578745	21/02/24 15:42:16
19	938	311.0309148579169	269.6668485578745	21/02/24 15:42:17
19	938	311.0309148579169	269.6668485578745	21/02/24 15:42:18
19	938	311.03091485791697	269.6668485578745	21/02/24 15:42:19
19	938	311.03091485791697	269.6668485578745	21/02/24 15:42:20
19	938	311.03091485791697	269.6668485578745	21/02/24 15:42:21
19	938	311.0309148579169	269.6668485578745	21/02/24 15:42:22
19	938	311.0309148579169	269.6668485578745	21/02/24 15:42:23
19	938	311.0309148579169	269.6668485578745	21/02/24 15:42:24
19	938	314.87005734593555	275.0493764128986	21/02/24 15:42:25
19	911	321.43497119517593	280.6848315867048	21/02/24 15:42:26
19	911	320.2347439778769	280.8180082738919	21/02/24 15:42:27
19	897	319.01521359261704	283.59757186890573	21/02/24 15:42:28
19	897	319.01521359261704	283.59757186890573	21/02/24 15:42:29
19	NULL	322.7688919024709	282.9508947625264	21/02/24 15:42:30
19	NULL	322.7688919024709	282.9508947625264	21/02/24 15:42:31
19	897	319.01521359261704	283.59757186890573	21/02/24 15:42:32
19	911	321.43497119517593	280.68483158670483	21/02/24 15:42:33
19	NULL	322.7688919024709	282.9508947625264	21/02/24 15:42:34
19	NULL	322.7688919024709	282.9508947625264	21/02/24 15:42:35
19	NULL	322.7688919024709	282.9508947625264	21/02/24 15:42:36
19	911	321.43497119517593	280.68483158670483	21/02/24 15:42:37
19	NULL	322.7688919024709	282.9508947625264	21/02/24 15:42:38
19	NULL	322.7688919024709	282.9508947625264	21/02/24 15:42:39
19	NULL	322.7688919024709	282.9508947625264	21/02/24 15:42:40
19	NULL	322.7688919024709	282.9508947625264	21/02/24 15:42:41
19	NULL	322.7688919024709	282.9508947625264	21/02/24 15:42:42
19	NULL	322.7688919024709	282.9508947625264	21/02/24 15:42:43
19	NULL	322.7688919024709	282.9508947625264	21/02/24 15:42:44
19	911	321.43497119517593	280.68483158670483	21/02/24 15:42:45
19	NULL	322.7688919024709	282.9508947625264	21/02/24 15:42:46
19	911	321.43497119517593	280.68483158670483	21/02/24 15:42:47
19	NULL	322.7688919024709	282.9508947625264	21/02/24 15:42:48
19	955	323.9884222877308	280.17133116751256	21/02/24 15:42:49
19	897	319.01521359261704	283.59757186890573	21/02/24 15:42:50
19	897	319.01521359261704	283.59757186890573	21/02/24 15:42:51
19	897	319.01521359261704	283.59757186890573	21/02/24 15:42:52
19	897	319.01521359261704	283.59757186890573	21/02/24 15:42:53
19	980	311.1000485048991	283.6794021053163	21/02/24 15:42:54
19	980	311.1000485048991	283.6794021053163	21/02/24 15:42:55
19	980	311.1000485048991	283.6794021053163	21/02/24 15:42:56
