floorId	partitionId	location_x	location_y	timeStamp
1	98	305.14384176673207	266.22087392439636	20/04/28 05:13:40
1	98	303.28594423312194	264.61216223098285	20/04/28 05:13:41
1	98	303.28594423312194	264.61216223098285	20/04/28 05:13:42
1	98	305.14384176673207	266.22087392439636	20/04/28 05:13:43
1	98	305.14384176673207	266.22087392439636	20/04/28 05:13:44
1	98	303.28594423312194	264.61216223098285	20/04/28 05:13:45
1	98	303.28594423312194	264.61216223098285	20/04/28 05:13:46
3	47	302.8570592601016	265.6207358146814	20/04/28 05:13:47
3	47	302.8570592601016	265.6207358146814	20/04/28 05:13:48
3	47	305.42047124180004	265.2616066172563	20/04/28 05:13:49
3	NULL	309.29436722642214	263.9851754886793	20/04/28 05:13:50
3	51	312.6019130172586	265.6450929868838	20/04/28 05:13:51
3	54	313.37765885306834	261.0920988121665	20/04/28 05:13:52
1	81	317.401082185018	264.06942104952105	20/04/28 05:13:53
3	54	318.067754688647	263.500663028811	20/04/28 05:13:54
3	54	322.7046151802177	263.62552816314786	20/04/28 05:13:55
3	18	322.99113575264545	265.5352298501222	20/04/28 05:13:56
3	54	324.0151806674323	262.76750572012435	20/04/28 05:13:57
3	54	324.0151806674323	262.76750572012435	20/04/28 05:13:58
3	54	327.3540763805351	261.1072377077433	20/04/28 05:13:59
3	54	330.94846886566233	260.9378969311428	20/04/28 05:14:00
3	54	334.4407240787428	261.4032786809491	20/04/28 05:14:01
3	54	334.4407240787428	261.4032786809491	20/04/28 05:14:02
3	54	334.4407240787428	261.4032786809491	20/04/28 05:14:03
3	NULL	337.70753542622793	260.45953294809686	20/04/28 05:14:04
3	99	339.59375125487367	258.8166372045796	20/04/28 05:14:05
3	99	339.59375125487367	258.8166372045796	20/04/28 05:14:06
3	54	344.0544452814365	260.94893597900256	20/04/28 05:14:07
3	42	347.1868785189775	260.3528128347792	20/04/28 05:14:08
3	54	350.37914153837863	260.97432627346046	20/04/28 05:14:09
3	54	350.37914153837863	260.97432627346046	20/04/28 05:14:10
3	54	350.37914153837863	260.97432627346046	20/04/28 05:14:11
3	54	354.93110780732565	263.85962413987545	20/04/28 05:14:12
3	54	354.93110780732565	263.85962413987545	20/04/28 05:14:13
3	54	357.6965830742679	260.80220899797797	20/04/28 05:14:14
3	54	359.5685583521681	263.2279362811352	20/04/28 05:14:15
3	34	362.2167196060361	259.70189758364177	20/04/28 05:14:16
3	57	365.8336784609425	258.95489486040736	20/04/28 05:14:17
3	57	365.8336784609425	258.95489486040736	20/04/28 05:14:18
3	57	365.8336784609425	258.9548948604074	20/04/28 05:14:19
3	54	372.48785670166836	262.3595943162643	20/04/28 05:14:20
3	54	372.48785670166836	262.3595943162643	20/04/28 05:14:21
3	57	374.26377240687094	258.097817872792	20/04/28 05:14:22
3	57	374.26377240687094	258.097817872792	20/04/28 05:14:23
3	15	379.8755906118027	262.6421307240284	20/04/28 05:14:24
3	15	379.8755906118027	262.6421307240284	20/04/28 05:14:25
3	15	380.97239583354167	266.94453563659977	20/04/28 05:14:26
1	33	381.6109766893215	266.73786054806715	20/04/28 05:14:27
1	33	381.6109766893215	266.73786054806715	20/04/28 05:14:28
1	69	376.18075636557654	261.96517202151136	20/04/28 05:14:29
1	69	372.48785670166836	262.3595943162643	20/04/28 05:14:30
1	69	372.48785670166836	262.3595943162643	20/04/28 05:14:31
1	69	372.48785670166836	262.3595943162643	20/04/28 05:14:32
1	69	368.9169651830857	261.65782172430613	20/04/28 05:14:33
1	13	368.31727752533806	266.1301521552222	20/04/28 05:14:34
3	54	364.18549555378036	263.2925259814757	20/04/28 05:14:35
1	64	359.7450566703883	261.7485007314006	20/04/28 05:14:36
1	64	357.6965830742679	260.8022089979779	20/04/28 05:14:37
1	64	356.02694011127693	259.70882448523747	20/04/28 05:14:38
1	41	352.7251685521831	260.56227788261185	20/04/28 05:14:39
1	41	352.7251685521831	260.56227788261185	20/04/28 05:14:40
1	41	351.1038521390131	261.25919659269	20/04/28 05:14:41
1	41	351.1038521390131	261.25919659268993	20/04/28 05:14:42
1	22	346.48253983850464	261.2777688197779	20/04/28 05:14:43
1	22	343.1917987024697	259.9647561276533	20/04/28 05:14:44
1	NULL	341.7564158159603	259.49985762417106	20/04/28 05:14:45
1	69	340.1854692097293	258.18142547541174	20/04/28 05:14:46
1	69	338.1583683683643	258.3517387010974	20/04/28 05:14:47
1	69	338.1583683683643	258.3517387010974	20/04/28 05:14:48
1	69	335.2486733223834	258.8873750560347	20/04/28 05:14:49
1	5	333.1227839393323	261.62465248411826	20/04/28 05:14:50
1	37	329.2127636639186	262.6803906369539	20/04/28 05:14:51
3	54	333.7145018941879	260.9894407549504	20/04/28 05:14:52
1	53	336.6241969401687	260.453804400013	20/04/28 05:14:53
1	69	338.1583683683643	258.3517387010974	20/04/28 05:14:54
1	53	336.6241969401687	260.453804400013	20/04/28 05:14:55
1	69	336.9186578622442	259.125171208264	20/04/28 05:14:56
1	69	335.24867332238347	258.8873750560348	20/04/28 05:14:57
1	5	333.7145018941879	260.98944075495035	20/04/28 05:14:58
1	53	336.6241969401687	260.453804400013	20/04/28 05:14:59
1	69	338.1583683683643	258.3517387010974	20/04/28 05:15:00
1	69	336.9186578622442	259.125171208264	20/04/28 05:15:01
1	69	335.24867332238347	258.8873750560348	20/04/28 05:15:02
1	5	334.954212400308	260.21600824778375	20/04/28 05:15:03
1	5	334.95421240030805	260.2160082477838	20/04/28 05:15:04
1	69	335.24867332238347	258.8873750560348	20/04/28 05:15:05
1	69	338.1583683683643	258.3517387010974	20/04/28 05:15:06
1	69	335.2486733223834	258.8873750560347	20/04/28 05:15:07
1	5	333.7145018941879	260.98944075495035	20/04/28 05:15:08
1	69	338.1583683683643	258.3517387010974	20/04/28 05:15:09
1	5	334.95421240030805	260.2160082477838	20/04/28 05:15:10
1	69	338.1583683683643	258.3517387010974	20/04/28 05:15:11
1	69	338.1583683683643	258.3517387010974	20/04/28 05:15:12
1	69	338.1583683683643	258.3517387010974	20/04/28 05:15:13
1	69	338.1583683683643	258.3517387010974	20/04/28 05:15:14
1	69	338.1583683683643	258.3517387010974	20/04/28 05:15:15
1	69	338.1583683683643	258.3517387010974	20/04/28 05:15:16
1	69	338.1583683683643	258.3517387010974	20/04/28 05:15:17
1	69	335.24867332238347	258.8873750560348	20/04/28 05:15:18
1	5	333.7145018941879	260.98944075495035	20/04/28 05:15:19
1	69	336.9186578622442	259.125171208264	20/04/28 05:15:20
1	53	336.6241969401687	260.453804400013	20/04/28 05:15:21
1	5	334.95421240030805	260.2160082477838	20/04/28 05:15:22
1	NULL	336.27215253971855	259.99463444461463	20/04/28 05:15:23
1	69	335.24867332238347	258.8873750560348	20/04/28 05:15:24
1	69	338.1583683683643	258.3517387010974	20/04/28 05:15:25
1	69	335.2486733223834	258.8873750560347	20/04/28 05:15:26
1	69	336.9186578622441	259.12517120826396	20/04/28 05:15:27
1	69	336.9186578622441	259.12517120826396	20/04/28 05:15:28
1	69	338.1583683683643	258.3517387010974	20/04/28 05:15:29
1	69	338.1583683683643	258.3517387010974	20/04/28 05:15:30
1	69	338.1583683683643	258.3517387010974	20/04/28 05:15:31
1	69	338.1583683683643	258.3517387010974	20/04/28 05:15:32
1	69	335.24867332238347	258.8873750560348	20/04/28 05:15:33
1	5	332.9065526505472	263.50534437986465	20/04/28 05:15:34
1	5	333.7145018941879	260.98944075495035	20/04/28 05:15:35
1	69	335.24867332238347	258.8873750560348	20/04/28 05:15:36
1	5	333.7145018941879	260.9894407549504	20/04/28 05:15:37
1	5	333.7145018941879	260.98944075495035	20/04/28 05:15:38
1	5	333.7145018941879	260.98944075495035	20/04/28 05:15:39
1	5	334.954212400308	260.21600824778375	20/04/28 05:15:40
1	69	335.2486733223834	258.8873750560347	20/04/28 05:15:41
1	5	332.68569016492285	261.23830391509114	20/04/28 05:15:42
1	5	333.1227839393323	261.62465248411826	20/04/28 05:15:43
1	5	333.1227839393323	261.62465248411826	20/04/28 05:15:44
1	5	333.1227839393323	261.62465248411826	20/04/28 05:15:45
1	5	333.1227839393323	261.62465248411826	20/04/28 05:15:46
1	5	333.7145018941879	260.9894407549504	20/04/28 05:15:47
1	5	333.1227839393323	261.62465248411826	20/04/28 05:15:48
1	5	332.9065526505472	263.50534437986465	20/04/28 05:15:49
1	37	329.2127636639186	262.6803906369539	20/04/28 05:15:50
1	37	329.2127636639186	262.6803906369539	20/04/28 05:15:51
1	37	329.2127636639186	262.6803906369539	20/04/28 05:15:52
1	37	329.2127636639186	262.6803906369539	20/04/28 05:15:53
1	37	329.2127636639186	262.6803906369539	20/04/28 05:15:54
1	37	329.2127636639186	262.6803906369539	20/04/28 05:15:55
3	54	329.2127636639186	262.6803906369539	20/04/28 05:15:56
1	37	329.2127636639186	262.68039063695386	20/04/28 05:15:57
1	37	329.2127636639186	262.68039063695386	20/04/28 05:15:58
1	37	329.2127636639186	262.6803906369539	20/04/28 05:15:59
1	37	329.2127636639186	262.68039063695386	20/04/28 05:16:00
1	37	329.2127636639186	262.6803906369539	20/04/28 05:16:01
1	37	329.2127636639186	262.6803906369539	20/04/28 05:16:02
1	37	329.2127636639186	262.6803906369539	20/04/28 05:16:03
1	37	329.2127636639186	262.68039063695386	20/04/28 05:16:04
1	37	329.2127636639186	262.68039063695386	20/04/28 05:16:05
3	54	329.2127636639186	262.6803906369539	20/04/28 05:16:06
1	37	329.2127636639186	262.68039063695386	20/04/28 05:16:07
1	37	329.2127636639186	262.6803906369539	20/04/28 05:16:08
1	37	329.2127636639186	262.6803906369539	20/04/28 05:16:09
1	37	329.2127636639186	262.6803906369539	20/04/28 05:16:10
3	54	329.2127636639186	262.68039063695386	20/04/28 05:16:11
1	37	329.2127636639186	262.68039063695386	20/04/28 05:16:12
1	37	329.2127636639186	262.6803906369539	20/04/28 05:16:13
3	54	333.1227839393323	261.62465248411826	20/04/28 05:16:14
1	5	333.1227839393323	261.62465248411826	20/04/28 05:16:15
3	54	329.2127636639186	262.6803906369539	20/04/28 05:16:16
1	53	336.6891485424181	264.16018759355455	20/04/28 05:16:17
1	37	329.2127636639186	262.6803906369539	20/04/28 05:16:18
3	54	329.2127636639186	262.6803906369539	20/04/28 05:16:19
1	37	329.2127636639186	262.68039063695386	20/04/28 05:16:20
1	37	329.2127636639186	262.6803906369539	20/04/28 05:16:21
1	37	329.2127636639186	262.6803906369539	20/04/28 05:16:22
3	54	329.2127636639186	262.6803906369539	20/04/28 05:16:23
1	37	329.2127636639186	262.6803906369539	20/04/28 05:16:24
1	37	329.2127636639186	262.68039063695386	20/04/28 05:16:25
1	37	329.2127636639186	262.6803906369539	20/04/28 05:16:26
1	37	329.2127636639186	262.6803906369539	20/04/28 05:16:27
1	37	329.2127636639186	262.68039063695386	20/04/28 05:16:28
1	37	329.2127636639186	262.68039063695386	20/04/28 05:16:29
1	37	329.2127636639186	262.6803906369539	20/04/28 05:16:30
1	37	329.2127636639186	262.68039063695386	20/04/28 05:16:31
1	37	329.2127636639186	262.68039063695386	20/04/28 05:16:32
1	37	329.2127636639186	262.6803906369539	20/04/28 05:16:33
1	37	329.2127636639186	262.6803906369539	20/04/28 05:16:34
1	37	329.2127636639186	262.68039063695386	20/04/28 05:16:35
1	37	329.2127636639186	262.6803906369539	20/04/28 05:16:36
1	37	329.2127636639186	262.6803906369539	20/04/28 05:16:37
3	54	333.1227839393323	261.62465248411826	20/04/28 05:16:38
1	69	335.2486733223834	258.8873750560347	20/04/28 05:16:39
1	69	335.24867332238347	258.8873750560348	20/04/28 05:16:40
1	69	338.96309468293356	257.1125180682814	20/04/28 05:16:41
1	69	337.12628586448284	254.53049372428976	20/04/28 05:16:42
1	69	338.96309468293356	257.1125180682814	20/04/28 05:16:43
1	69	339.9642191804853	253.31104947279744	20/04/28 05:16:44
3	84	341.3996020669947	253.77594797627964	20/04/28 05:16:45
3	42	348.33725310857477	255.1732629908851	20/04/28 05:16:46
3	84	350.5809920295289	253.3295702043023	20/04/28 05:16:47
3	84	349.54162343838044	253.66681707581725	20/04/28 05:16:48
3	84	352.59148945562407	251.42723323601328	20/04/28 05:16:49
3	84	353.48659353828134	247.53235318655084	20/04/28 05:16:50
3	23	361.39171706234237	243.1777661478346	20/04/28 05:16:51
3	23	362.7432195844349	240.9347338855629	20/04/28 05:16:52
3	23	362.7432195844349	240.9347338855629	20/04/28 05:16:53
3	23	360.23406947147583	243.86796499322614	20/04/28 05:16:54
3	23	361.39171706234237	243.1777661478346	20/04/28 05:16:55
3	23	361.39171706234237	243.1777661478346	20/04/28 05:16:56
3	23	360.23406947147583	243.86796499322614	20/04/28 05:16:57
3	23	361.39171706234237	243.1777661478346	20/04/28 05:16:58
3	23	360.23406947147583	243.86796499322614	20/04/28 05:16:59
3	23	360.23406947147583	243.86796499322614	20/04/28 05:17:00
3	23	361.39171706234237	243.1777661478346	20/04/28 05:17:01
3	23	361.39171706234237	243.1777661478346	20/04/28 05:17:02
3	23	361.39171706234237	243.1777661478346	20/04/28 05:17:03
3	23	361.39171706234237	243.1777661478346	20/04/28 05:17:04
3	23	361.39171706234237	243.1777661478346	20/04/28 05:17:05
3	23	361.39171706234237	243.1777661478346	20/04/28 05:17:06
3	23	360.23406947147583	243.86796499322614	20/04/28 05:17:07
3	23	361.39171706234237	243.1777661478346	20/04/28 05:17:08
3	23	361.39171706234237	243.1777661478346	20/04/28 05:17:09
3	23	362.7432195844349	240.9347338855629	20/04/28 05:17:10
3	23	361.39171706234237	243.1777661478346	20/04/28 05:17:11
3	23	362.7432195844349	240.9347338855629	20/04/28 05:17:12
3	23	362.7432195844349	240.9347338855629	20/04/28 05:17:13
3	23	361.39171706234237	243.1777661478346	20/04/28 05:17:14
3	23	361.39171706234237	243.1777661478346	20/04/28 05:17:15
3	23	362.7432195844349	240.9347338855629	20/04/28 05:17:16
3	23	361.39171706234237	243.1777661478346	20/04/28 05:17:17
3	23	361.39171706234237	243.1777661478346	20/04/28 05:17:18
3	23	362.7432195844349	240.9347338855629	20/04/28 05:17:19
3	23	361.39171706234237	243.1777661478346	20/04/28 05:17:20
3	23	362.7432195844349	240.9347338855629	20/04/28 05:17:21
