floorId	partitionId	location_x	location_y	timeStamp
1	98	304.1742681664166	266.36788011202594	20/04/28 05:17:35
1	98	304.28232111343453	266.2708046715723	20/04/28 05:17:35
1	98	304.3965243275659	266.0548177264983	20/04/28 05:17:35
1	98	304.3613049084673	266.0526368856486	20/04/28 05:17:35
1	98	304.3480742408922	265.9403087314579	20/04/28 05:17:35
1	98	304.29061049671486	265.84068568664514	20/04/28 05:17:35
1	98	304.2542209333012	265.5958599047483	20/04/28 05:17:36
1	98	304.1471294290923	265.5407944701691	20/04/28 05:17:36
1	98	303.9938164567293	265.6994144222513	20/04/28 05:17:36
1	98	303.808735815016	265.7572795598481	20/04/28 05:17:36
1	98	303.5696377508414	265.82740371341004	20/04/28 05:17:36
1	98	303.53075113738174	265.8577266888193	20/04/28 05:17:36
1	98	303.62009411110165	266.04101064453243	20/04/28 05:17:36
1	98	303.8232125057404	266.1588960307094	20/04/28 05:17:36
1	98	303.82947737461495	266.1495276762197	20/04/28 05:17:36
1	98	303.872403584625	266.1878479648688	20/04/28 05:17:37
1	98	303.58871365437113	266.28205561120365	20/04/28 05:17:37
1	98	303.6208531818057	266.3010786720902	20/04/28 05:17:37
1	98	303.45322334607505	266.4924116762641	20/04/28 05:17:37
1	98	303.561550363233	266.2418336287085	20/04/28 05:17:37
1	98	303.49342459352516	266.40961007355423	20/04/28 05:17:37
1	98	303.58964174471004	266.26296847519615	20/04/28 05:17:37
1	98	303.44854121258436	266.37447409900597	20/04/28 05:17:37
1	98	303.5847278885194	266.13737603456724	20/04/28 05:17:37
1	98	303.5866367165581	266.16801440977906	20/04/28 05:17:37
1	98	303.5582894135266	266.18803012386377	20/04/28 05:17:38
1	98	303.76070393073746	265.96871715729964	20/04/28 05:17:38
1	98	303.81620131266567	265.89959187459027	20/04/28 05:17:38
1	98	303.79712135017934	265.9361320468537	20/04/28 05:17:38
1	98	303.8066091385784	265.9088437598336	20/04/28 05:17:38
1	98	303.5471357068971	265.92524684168757	20/04/28 05:17:38
1	98	303.569611691443	265.6427928352225	20/04/28 05:17:38
1	98	303.5872303668513	265.85353442293285	20/04/28 05:17:38
1	98	303.6940261101797	265.7977882395238	20/04/28 05:17:38
1	98	303.60563548930287	265.76193438316216	20/04/28 05:17:38
1	98	303.6770724462309	265.98448612232863	20/04/28 05:17:39
1	98	303.80839432070314	265.90034132676	20/04/28 05:17:39
1	98	303.83477187201476	266.0441330475173	20/04/28 05:17:39
1	98	303.99455016753825	266.27194852483467	20/04/28 05:17:39
1	98	304.1056026892572	266.4514730123744	20/04/28 05:17:39
1	98	304.0710099359959	266.4148633863274	20/04/28 05:17:39
1	98	304.1024636882475	266.2894843127746	20/04/28 05:17:39
1	98	304.1421307563531	266.2125748958601	20/04/28 05:17:39
1	98	304.13626497823304	266.21795033041377	20/04/28 05:17:39
1	98	304.20238119492046	266.19757872696306	20/04/28 05:17:40
1	98	304.2024530854761	266.2014756231577	20/04/28 05:17:40
1	98	303.97052707635254	266.3766576300781	20/04/28 05:17:40
1	98	304.10915719598876	266.13465558871684	20/04/28 05:17:40
1	98	304.0822700727827	266.11839906917555	20/04/28 05:17:40
1	98	304.0459785455244	266.2656298213392	20/04/28 05:17:40
1	98	304.1944386680423	266.1575035980686	20/04/28 05:17:40
1	98	304.45416527707835	266.03385086870367	20/04/28 05:17:40
1	98	304.4572084038287	266.01577085488395	20/04/28 05:17:40
1	98	304.4857320445296	266.1245648332616	20/04/28 05:17:40
1	98	304.5568790382336	266.2747201632561	20/04/28 05:17:41
1	98	304.4950275039346	266.33407123283166	20/04/28 05:17:41
1	98	304.5616199137648	266.0974040312718	20/04/28 05:17:41
1	98	304.6957292581726	266.2468621768937	20/04/28 05:17:41
1	98	304.60662796745487	266.2942151343001	20/04/28 05:17:41
1	98	304.8311137325973	266.11837022836954	20/04/28 05:17:41
1	98	304.89578136448785	266.0676963839393	20/04/28 05:17:41
1	98	305.10478450026824	266.2690436157389	20/04/28 05:17:41
1	98	304.9908287332291	266.0592770435856	20/04/28 05:17:41
1	98	305.2467924048247	265.9180797211872	20/04/28 05:17:41
1	98	305.20150111515954	265.83773908139926	20/04/28 05:17:42
1	98	305.05673877516693	265.5901329777017	20/04/28 05:17:42
1	98	305.135824140655	265.6034146652318	20/04/28 05:17:42
1	98	305.049576284674	265.62544380456086	20/04/28 05:17:42
1	98	304.995480465853	265.6222740105967	20/04/28 05:17:42
1	98	304.9795092712511	265.6616257098855	20/04/28 05:17:42
1	98	304.8896741330988	265.5710970254684	20/04/28 05:17:42
1	98	305.16114124504185	265.6555304723479	20/04/28 05:17:42
1	98	305.16114124504185	265.6555304723479	20/04/28 05:17:42
1	98	305.19971006621773	265.72672177971145	20/04/28 05:17:43
1	98	305.2377184899783	265.6796612524476	20/04/28 05:17:43
1	98	305.2377184899783	265.6796612524476	20/04/28 05:17:43
1	98	305.34826108601766	265.60238426315505	20/04/28 05:17:43
1	98	305.3547880238152	265.3969647236869	20/04/28 05:17:43
1	98	305.2288850284247	265.2330314379149	20/04/28 05:17:43
1	98	305.2116091965529	265.26690289271284	20/04/28 05:17:43
1	98	305.20539786943357	265.44456090822314	20/04/28 05:17:43
1	98	304.99098783218517	265.34228158573677	20/04/28 05:17:43
1	98	304.9333047249492	265.43386772994853	20/04/28 05:17:43
1	98	304.9323636790227	265.3942387763902	20/04/28 05:17:44
1	98	304.9517585771799	265.39591590060496	20/04/28 05:17:44
1	98	304.7074570064216	265.42900721659674	20/04/28 05:17:44
1	98	304.6883315026291	265.47836172437735	20/04/28 05:17:44
1	98	304.5534724705026	265.3547759790967	20/04/28 05:17:44
1	98	304.57618163785463	265.47160605640033	20/04/28 05:17:44
1	98	304.62916818248675	265.4306289602642	20/04/28 05:17:44
1	98	304.49269703996976	265.5563079944086	20/04/28 05:17:44
1	98	304.58791974961514	265.78048141007065	20/04/28 05:17:44
1	98	304.47444817948536	266.028123938942	20/04/28 05:17:45
1	98	304.483665652957	266.04182757640683	20/04/28 05:17:45
1	98	304.5027910985215	266.04389176705905	20/04/28 05:17:45
1	98	304.281862486872	266.1256727504453	20/04/28 05:17:45
1	98	304.38346055336996	266.1068059454582	20/04/28 05:17:45
1	98	304.44207255843236	266.1326944795481	20/04/28 05:17:45
1	98	304.42144800409056	266.1489999867688	20/04/28 05:17:45
1	98	304.55480056202714	266.113117987328	20/04/28 05:17:45
1	98	304.55480056202714	266.113117987328	20/04/28 05:17:45
1	98	304.55480056202714	266.113117987328	20/04/28 05:17:45
1	98	304.40819692170186	266.0315256140862	20/04/28 05:17:46
1	98	304.24572273012893	265.94110047285807	20/04/28 05:17:46
1	98	304.10825754044845	265.8645941116294	20/04/28 05:17:46
1	98	303.9695948036269	265.78742125458183	20/04/28 05:17:46
1	98	303.9695948036269	265.78742125458183	20/04/28 05:17:46
1	98	303.7288888481888	265.65345616262334	20/04/28 05:17:46
1	98	303.48111522812115	265.5155575562643	20/04/28 05:17:46
1	98	303.28771175790035	265.4079187002748	20/04/28 05:17:46
1	98	302.8793945176886	265.18066941375986	20/04/28 05:17:46
1	98	302.68632691546367	265.073217485372	20/04/28 05:17:46
1	98	302.5448132804317	264.994457958646	20/04/28 05:17:47
1	98	302.39198135946253	264.909399230832	20/04/28 05:17:47
3	47	302.5767294295	264.72865393618247	20/04/28 05:17:47
3	47	302.70995948050773	264.60070578759104	20/04/28 05:17:47
3	47	302.8350752710033	264.48055020983384	20/04/28 05:17:47
3	47	303.00607151105305	264.31633311192707	20/04/28 05:17:47
3	47	303.2203199407751	264.11057855644793	20/04/28 05:17:47
3	47	303.2203199407751	264.11057855644793	20/04/28 05:17:47
3	47	303.5203285064287	263.8224638237236	20/04/28 05:17:47
3	47	303.6959629748686	263.6537923798883	20/04/28 05:17:48
3	47	303.81996782276707	263.53470370143356	20/04/28 05:17:48
3	47	304.03459652457684	263.32858394974517	20/04/28 05:17:48
3	47	304.1990434584377	263.1706565109288	20/04/28 05:17:48
3	47	304.3323362857889	263.0426480747606	20/04/28 05:17:48
3	47	304.5197290935592	262.86268445069686	20/04/28 05:17:48
3	47	304.71122106945217	262.67878416993966	20/04/28 05:17:48
3	47	304.8897864924439	262.50729796918074	20/04/28 05:17:48
3	47	305.0647755851785	262.3392463151452	20/04/28 05:17:48
3	47	305.27314168056085	262.13914088899134	20/04/28 05:17:48
3	47	305.4302871329668	261.9882254645596	20/04/28 05:17:49
3	47	305.57188547584735	261.85224078484094	20/04/28 05:17:49
3	15	305.7221550733962	261.77004995920646	20/04/28 05:17:49
3	15	305.96066377875553	261.7686914624175	20/04/28 05:17:49
3	15	306.1511592558316	261.7676064391538	20/04/28 05:17:49
3	15	306.31694305733697	261.7666621685383	20/04/28 05:17:49
3	15	306.6059189035956	261.76501622123993	20/04/28 05:17:49
3	15	306.8415531236764	261.763674096931	20/04/28 05:17:49
3	15	307.1373789867143	261.76198913333855	20/04/28 05:17:49
3	15	307.4200545002414	261.76037907144644	20/04/28 05:17:49
3	15	307.6676830003093	261.75896863017266	20/04/28 05:17:50
3	15	307.88838034728667	261.757711583237	20/04/28 05:17:50
3	15	308.07560842472736	261.7566451704131	20/04/28 05:17:50
3	15	308.31774198908124	261.75526602716894	20/04/28 05:17:50
3	15	308.58170138813176	261.7537625684357	20/04/28 05:17:50
3	15	308.8395810656368	261.75229373855257	20/04/28 05:17:50
3	15	309.0503330176428	261.7510933385519	20/04/28 05:17:50
3	15	309.23008123634474	261.7500695294731	20/04/28 05:17:50
3	15	309.52583920865817	261.7483849525723	20/04/28 05:17:50
3	15	309.8033962157167	261.7468040446458	20/04/28 05:17:51
3	15	309.8033962157167	261.7468040446458	20/04/28 05:17:51
3	15	310.05248085704153	261.74538530948934	20/04/28 05:17:51
3	15	310.24543864527993	261.74428626140497	20/04/28 05:17:51
3	15	310.4256867795838	261.74325960490916	20/04/28 05:17:51
3	15	310.6904190713057	261.7417517439374	20/04/28 05:17:51
3	15	310.86888842045096	261.74073521903796	20/04/28 05:17:51
3	15	311.1591573929221	261.7390819063572	20/04/28 05:17:51
3	15	311.37886659457934	261.73783048769513	20/04/28 05:17:51
3	15	311.54427962138345	261.7368883289365	20/04/28 05:17:51
3	15	311.74860803016963	261.73572451612387	20/04/28 05:17:52
3	15	311.96860751112223	261.73447144409033	20/04/28 05:17:52
3	15	312.15857638591467	261.7333894202455	20/04/28 05:17:52
3	15	312.43404890142705	261.73182038515637	20/04/28 05:17:52
3	15	312.6225726831665	261.73074659226586	20/04/28 05:17:52
3	15	312.87316720488866	261.72931925713954	20/04/28 05:17:52
3	15	313.13970302691723	261.7278011236281	20/04/28 05:17:52
3	15	313.36385156559606	261.7265244194106	20/04/28 05:17:52
3	15	313.5763923352726	261.72531383067053	20/04/28 05:17:52
3	15	313.80651799832395	261.72400308197547	20/04/28 05:17:52
3	15	314.0658940437502	261.7225257290868	20/04/28 05:17:53
3	15	314.2621089528819	261.7214081291082	20/04/28 05:17:53
3	15	314.52198216556553	261.7199279444566	20/04/28 05:17:53
3	15	314.72089095196696	261.71879500070423	20/04/28 05:17:53
3	15	314.8880436821265	261.7178429329512	20/04/28 05:17:53
3	15	315.04287411759543	261.7169610504677	20/04/28 05:17:53
3	15	315.2213500953645	261.715944487813	20/04/28 05:17:53
3	15	315.43615125042277	261.7147210243802	20/04/28 05:17:53
3	15	315.72521128945544	261.713074597537	20/04/28 05:17:53
3	15	315.9879704016624	261.71157797539206	20/04/28 05:17:54
3	15	316.27404351429584	261.7099485614705	20/04/28 05:17:54
3	15	316.53317751738564	261.70847258720545	20/04/28 05:17:54
3	15	316.8225830660595	261.70682419241	20/04/28 05:17:54
3	15	317.0215501781539	261.70569091644643	20/04/28 05:17:54
3	15	317.2916275962896	261.7041526107282	20/04/28 05:17:54
3	15	317.4676993341987	261.7031497421318	20/04/28 05:17:54
3	15	317.7195609043512	261.7017151901569	20/04/28 05:17:54
3	15	317.87467241383564	261.7008317067333	20/04/28 05:17:54
3	15	318.0938794920421	261.6995831480637	20/04/28 05:17:54
3	15	318.301310042967	261.6984016660841	20/04/28 05:17:55
3	15	318.5310699460901	261.6970930006828	20/04/28 05:17:55
3	15	318.8246294654783	261.69542094572006	20/04/28 05:17:55
3	15	319.0143809831866	261.6943401598967	20/04/28 05:17:55
3	15	319.30995196801547	261.69265664803834	20/04/28 05:17:55
3	15	319.56581290375175	261.6911993164953	20/04/28 05:17:55
3	15	319.7970524258089	261.6898822234872	20/04/28 05:17:55
3	15	320.0739447024443	261.6883051017292	20/04/28 05:17:55
3	15	320.34343287536325	261.6867701522312	20/04/28 05:17:55
3	15	320.5138079009234	261.68579973094285	20/04/28 05:17:56
3	15	320.8010766183588	261.684163507101	20/04/28 05:17:56
3	15	321.07506976002026	261.6826028982227	20/04/28 05:17:56
3	15	321.28140878082843	261.6814276333753	20/04/28 05:17:56
3	15	321.57108346940106	261.6797777056141	20/04/28 05:17:56
3	15	321.853921805458	261.6781667163181	20/04/28 05:17:56
3	15	322.05220399516327	261.67703734153235	20/04/28 05:17:56
3	15	322.27635296499864	261.6757606348591	20/04/28 05:17:56
3	15	322.4742719037659	261.67463332907636	20/04/28 05:17:56
3	15	322.7024380342728	261.6733337414778	20/04/28 05:17:56
3	15	322.99334480532764	261.6716767960268	20/04/28 05:17:57
3	15	323.54311846827363	261.6685453977215	20/04/28 05:17:57
3	15	323.54311846827363	261.6685453977215	20/04/28 05:17:57
3	15	323.76200776085403	261.6672986490938	20/04/28 05:17:57
3	15	324.2526931888584	261.6645038052858	20/04/28 05:17:57
3	15	324.4368528322536	261.66345486963445	20/04/28 05:17:57
3	15	324.66357163078646	261.6621635257427	20/04/28 05:17:57
3	15	324.9188882984328	261.6607092942393	20/04/28 05:17:57
3	15	325.16647963480773	261.6592990646423	20/04/28 05:17:57
3	15	325.3728447917148	261.65812365092904	20/04/28 05:17:58
3	15	325.65809954545296	261.65649889821236	20/04/28 05:17:58
3	15	325.834497778685	261.6554941699654	20/04/28 05:17:58
3	15	326.07907534002265	261.6541011062144	20/04/28 05:17:58
3	15	326.3135370128154	261.65276566049494	20/04/28 05:17:58
3	15	326.59275709903903	261.6511752800098	20/04/28 05:17:58
3	15	326.8724455997248	261.64958223153167	20/04/28 05:17:58
3	15	326.8724455997248	261.64958223153167	20/04/28 05:17:58
3	15	327.12757403803784	261.64812907214406	20/04/28 05:17:58
3	15	327.33916460607554	261.6469238955581	20/04/28 05:17:58
3	15	327.54080243621894	261.6457754077309	20/04/28 05:17:59
3	15	327.828820645087	261.6441349149392	20/04/28 05:17:59
3	15	328.0091048095697	261.6431080532228	20/04/28 05:17:59
3	15	328.1612922988403	261.64224122442016	20/04/28 05:17:59
3	15	328.3421516228434	261.6412110867129	20/04/28 05:17:59
3	15	328.603018076528	261.63972524476367	20/04/28 05:17:59
3	15	328.8442552100232	261.6383512074063	20/04/28 05:17:59
3	15	329.13119912905654	261.63671683354966	20/04/28 05:17:59
3	15	329.13119912905654	261.63671683354966	20/04/28 05:17:59
3	15	329.28862218908404	261.6358201840071	20/04/28 05:17:59
3	15	329.5674951611901	261.63423178061294	20/04/28 05:18:00
3	15	329.7734725862372	261.633058575341	20/04/28 05:18:00
3	15	330.10866913078564	261.6311493644015	20/04/28 05:18:00
3	15	330.3796719527629	261.6296057877723	20/04/28 05:18:00
3	15	330.54818244961916	261.62864598645797	20/04/28 05:18:00
3	15	330.8130697709254	261.6271372424694	20/04/28 05:18:00
3	15	330.99455354812216	261.6261035480045	20/04/28 05:18:00
3	15	330.99455354812216	261.6261035480045	20/04/28 05:18:00
3	15	331.35912886238987	261.62402700160334	20/04/28 05:18:00
3	15	331.35912886238987	261.62402700160334	20/04/28 05:18:00
3	15	331.6312902128491	261.6224768262329	20/04/28 05:18:01
3	15	331.7998978336179	261.62151647172067	20/04/28 05:18:01
3	15	332.00383432675477	261.6203548911794	20/04/28 05:18:01
3	15	332.19165890820574	261.6192850807907	20/04/28 05:18:01
3	15	332.39728190565	261.6181138942659	20/04/28 05:18:01
3	15	332.56479326855583	261.61715978381415	20/04/28 05:18:01
3	15	332.83699299589773	261.61560938985684	20/04/28 05:18:01
3	15	332.99718769377904	261.6146969536321	20/04/28 05:18:01
3	15	333.25397070465493	261.6132343701377	20/04/28 05:18:01
3	15	333.41207781046177	261.61233382441037	20/04/28 05:18:02
3	15	333.62462805778233	261.61112318168756	20/04/28 05:18:02
3	15	333.8688210365844	261.60973230844	20/04/28 05:18:02
3	15	334.3549623109297	261.6069633472016	20/04/28 05:18:02
3	15	334.3549623109297	261.6069633472016	20/04/28 05:18:02
3	15	334.5372908546597	261.6059248411193	20/04/28 05:18:02
3	15	334.7610083804184	261.6046505918632	20/04/28 05:18:02
3	15	335.23742848066235	261.60193700044357	20/04/28 05:18:02
3	15	335.52845605062566	261.6002793669467	20/04/28 05:18:02
3	15	335.6873657292073	261.59937424992904	20/04/28 05:18:02
3	15	335.970965374316	261.5977589243725	20/04/28 05:18:03
3	15	336.2005272629746	261.59645138682106	20/04/28 05:18:03
3	15	336.4717757307407	261.5949064110437	20/04/28 05:18:03
3	15	336.7515896589102	261.5933126481563	20/04/28 05:18:03
3	15	337.03866782001745	261.5916775096843	20/04/28 05:18:03
3	15	337.26161491425717	261.5904076486485	20/04/28 05:18:03
3	15	337.46901868592795	261.5892263191981	20/04/28 05:18:03
3	15	337.62405009161836	261.5883432920293	20/04/28 05:18:03
3	15	337.8908779258652	261.58682349527606	20/04/28 05:18:03
3	15	338.10585846359464	261.58559901011625	20/04/28 05:18:04
3	15	338.26102427644844	261.5847152173918	20/04/28 05:18:04
3	15	338.511148187572	261.5832905627672	20/04/28 05:18:04
3	15	338.511148187572	261.5832905627672	20/04/28 05:18:04
3	15	338.99536815976535	261.5805325448727	20/04/28 05:18:04
3	15	338.99536815976535	261.5805325448727	20/04/28 05:18:04
3	15	338.99536815976535	261.5805325448727	20/04/28 05:18:04
3	15	339.4766272309456	261.5777913916646	20/04/28 05:18:04
3	15	339.7595088611582	261.576180155774	20/04/28 05:18:04
3	15	339.7595088611582	261.576180155774	20/04/28 05:18:04
3	15	339.9557762470509	261.57506225689855	20/04/28 05:18:05
3	15	340.21260941283094	261.5735993877321	20/04/28 05:18:05
3	15	340.5054202414736	261.57193159715865	20/04/28 05:18:05
3	15	340.8287024204421	261.5700902480079	20/04/28 05:18:05
3	15	340.9849460508481	261.56920031625515	20/04/28 05:18:05
3	15	341.23881629540966	261.56775432328175	20/04/28 05:18:05
3	15	341.40607234241884	261.5668016670571	20/04/28 05:18:05
3	15	341.6446516385775	261.56544276819744	20/04/28 05:18:05
3	15	341.8159697651716	261.5644669751985	20/04/28 05:18:05
3	15	342.10736416813694	261.56280725229595	20/04/28 05:18:05
3	15	342.3018767000999	261.56169934870945	20/04/28 05:18:06
3	15	342.53410221652774	261.5603766396792	20/04/28 05:18:06
3	15	342.8035233580816	261.55884207197806	20/04/28 05:18:06
3	15	343.0756275521194	261.55729222215894	20/04/28 05:18:06
3	15	343.2768017731146	261.5561463749546	20/04/28 05:18:06
3	15	343.49815852911223	261.55488557216006	20/04/28 05:18:06
3	15	343.7265027200799	261.55358497036553	20/04/28 05:18:06
3	15	343.87840574346217	261.55271976182235	20/04/28 05:18:06
3	15	344.0763355329916	261.55159239423585	20/04/28 05:18:06
3	15	344.37519314557835	261.5498901624182	20/04/28 05:18:07
3	15	344.52854698009094	261.54901669035166	20/04/28 05:18:07
3	15	344.8051447781968	261.54744124588314	20/04/28 05:18:07
3	15	344.8051447781968	261.54744124588314	20/04/28 05:18:07
3	15	345.27161700006604	261.54478431554344	20/04/28 05:18:07
3	15	345.27161700006604	261.54478431554344	20/04/28 05:18:07
3	15	345.7716663081754	261.5419361369901	20/04/28 05:18:07
3	15	345.9834881730895	261.54072964298445	20/04/28 05:18:07
3	15	346.2393333664454	261.53927240110676	20/04/28 05:18:07
3	15	346.5010345375888	261.5377818047777	20/04/28 05:18:07
3	15	346.7357777934182	261.5364447552189	20/04/28 05:18:08
3	15	346.88944817903683	261.53556948014204	20/04/28 05:18:08
3	15	347.1482224884425	261.5340955546186	20/04/28 05:18:08
3	15	347.35518971521543	261.53291671163856	20/04/28 05:18:08
3	15	347.5586391618935	261.53175790521425	20/04/28 05:18:08
3	15	347.7374164899862	261.5307396261297	20/04/28 05:18:08
3	15	347.9654379785618	261.52944086238193	20/04/28 05:18:08
3	15	348.2200813271719	261.527990465966	20/04/28 05:18:08
3	15	348.42118106234864	261.52684504301766	20/04/28 05:18:08
3	15	348.65718034040987	261.5255008394132	20/04/28 05:18:08
3	15	348.94847087644223	261.52384170811547	20/04/28 05:18:09
3	15	349.20758319721716	261.52236585734846	20/04/28 05:18:09
3	15	349.4145280267068	261.52118714193875	20/04/28 05:18:09
3	15	349.62744649505663	261.5199744019043	20/04/28 05:18:09
3	15	349.8187906694499	261.51888454463426	20/04/28 05:18:09
3	15	350.00136203356254	261.5178446554968	20/04/28 05:18:09
3	15	350.2952824791695	261.51617054477214	20/04/28 05:18:09
3	15	350.57654592757154	261.5145685257141	20/04/28 05:18:09
3	15	350.81995317429335	261.5131821278357	20/04/28 05:18:09
3	15	350.9760795400825	261.51229286399825	20/04/28 05:18:10
3	15	351.1511911592574	261.5112954640417	20/04/28 05:18:10
3	15	351.3306211094083	261.51027346775544	20/04/28 05:18:10
3	15	351.5814040682714	261.50884505932976	20/04/28 05:18:10
3	15	351.84620417875027	261.50733681207623	20/04/28 05:18:10
3	15	352.06572324757974	261.5060864763718	20/04/28 05:18:10
3	15	352.29906754137653	261.50475739501456	20/04/28 05:18:10
3	15	352.51832651571783	261.50350854075515	20/04/28 05:18:10
3	15	352.76186544064524	261.5021213928647	20/04/28 05:18:10
3	15	352.9409559311538	261.5011013300711	20/04/28 05:18:10
3	15	353.1166027569104	261.5001008816874	20/04/28 05:18:11
3	15	353.3156859756169	261.4989669444043	20/04/28 05:18:11
3	15	353.5681074000894	261.4975292036137	20/04/28 05:18:11
3	15	353.83913660038206	261.495985476739	20/04/28 05:18:11
3	15	354.02531868914406	261.49492502165265	20/04/28 05:18:11
3	15	354.2228078127515	261.4938001640091	20/04/28 05:18:11
3	15	354.46544846281154	261.4924181325085	20/04/28 05:18:11
3	15	354.685173723311	261.4911666223785	20/04/28 05:18:11
3	15	354.9672256888553	261.4895601120881	20/04/28 05:18:11
3	15	355.12600188786257	261.4886557553428	20/04/28 05:18:11
3	15	355.281518489789	261.48776996459554	20/04/28 05:18:12
3	15	355.488084113871	261.48659340906227	20/04/28 05:18:12
3	15	355.6986300481125	261.4853941824967	20/04/28 05:18:12
3	15	355.96889700014157	261.4838547972322	20/04/28 05:18:12
3	15	356.18477393488945	261.4826252063784	20/04/28 05:18:12
3	15	356.4175475439722	261.4812993755245	20/04/28 05:18:12
3	15	356.60858015509984	261.4802112928551	20/04/28 05:18:12
3	15	356.78193121297585	261.4792239206955	20/04/28 05:18:12
3	15	356.9989702740573	261.47798771060786	20/04/28 05:18:12
3	15	357.2534242451599	261.4765383928475	20/04/28 05:18:13
3	15	357.49490572880535	261.47516296372163	20/04/28 05:18:13
3	15	357.68957846443953	261.4740541476478	20/04/28 05:18:13
3	15	357.68957846443953	261.4740541476478	20/04/28 05:18:13
3	15	357.9793500701245	261.4724036678665	20/04/28 05:18:13
3	15	358.1612749521324	261.4713674609588	20/04/28 05:18:13
3	15	358.44007661140546	261.46977946374795	20/04/28 05:18:13
3	15	358.8090719965592	261.4676777415273	20/04/28 05:18:13
3	15	358.9810486476764	261.46669819770744	20/04/28 05:18:13
3	15	359.16890178737935	261.46562822465677	20/04/28 05:18:13
3	15	359.36524969638253	261.46450986713813	20/04/28 05:18:14
3	15	359.5976919582676	261.46318592357005	20/04/28 05:18:14
3	15	359.87891895458085	261.4615841121356	20/04/28 05:18:14
3	15	360.1104787770998	261.46026519476163	20/04/28 05:18:14
3	15	360.3260122642014	261.45903756011535	20/04/28 05:18:14
3	15	360.56996689609804	261.45764804444303	20/04/28 05:18:14
3	15	360.72677415131096	261.4567549023987	20/04/28 05:18:14
3	15	360.95818304853924	261.4554368446643	20/04/28 05:18:14
3	15	361.2528929131451	261.4537582375705	20/04/28 05:18:14
3	15	361.4622701266552	261.4525656677991	20/04/28 05:18:14
3	15	361.6365374670484	261.45157307668177	20/04/28 05:18:15
3	15	361.82451239705057	261.4505024099385	20/04/28 05:18:15
3	15	362.07668224738404	261.4490661020627	20/04/28 05:18:15
3	15	362.34849917288864	261.4475178884664	20/04/28 05:18:15
3	15	362.52254375228716	261.4465265661501	20/04/28 05:18:15
3	15	362.8065766319154	261.44490877297835	20/04/28 05:18:15
3	15	363.0671917887995	261.4434243623643	20/04/28 05:18:15
3	15	363.2222225059781	261.44254133911716	20/04/28 05:18:15
3	15	363.4631022616204	261.4411693373109	20/04/28 05:18:15
3	15	363.7255127514793	261.43967470084755	20/04/28 05:18:16
3	15	363.93753916124706	261.43846704179623	20/04/28 05:18:16
3	15	364.09101647317567	261.43759286642756	20/04/28 05:18:16
3	15	364.34759792448585	261.4361314309752	20/04/28 05:18:16
3	15	364.6276972594744	261.43453604246895	20/04/28 05:18:16
3	15	364.6276972594744	261.43453604246895	20/04/28 05:18:16
3	15	364.89974230169014	261.4329865295665	20/04/28 05:18:16
3	15	365.12015660079845	261.4317310948136	20/04/28 05:18:16
3	15	365.41520359279724	261.43005056751116	20/04/28 05:18:16
3	15	365.79849025305356	261.4278674451114	20/04/28 05:18:16
3	15	365.99946241155584	261.42672274881375	20/04/28 05:18:17
3	15	366.2116568634564	261.42551413262885	20/04/28 05:18:17
3	15	366.50872301883413	261.42382210458493	20/04/28 05:18:17
3	15	366.77093160938404	261.42232861809873	20/04/28 05:18:17
3	15	366.9815508512935	261.42112897398766	20/04/28 05:18:17
3	15	367.2345067155622	261.41968818913733	20/04/28 05:18:17
3	15	367.4162043611151	261.418653276522	20/04/28 05:18:17
3	15	367.6874123851994	261.41710853110357	20/04/28 05:18:17
3	15	367.96269664872045	261.4155405682593	20/04/28 05:18:17
3	15	368.18322615185	261.4142844773279	20/04/28 05:18:17
3	15	368.37658015725543	261.41318317247163	20/04/28 05:18:18
3	15	368.582101124017	261.41201256709275	20/04/28 05:18:18
3	15	368.7625985404649	261.41098449073684	20/04/28 05:18:18
3	15	369.04963496953434	261.409349589962	20/04/28 05:18:18
3	15	369.29851581826125	261.4079320155665	20/04/28 05:18:18
3	15	369.4766829236254	261.40691721218576	20/04/28 05:18:18
3	15	369.74315467777126	261.40539944359193	20/04/28 05:18:18
3	15	370.034446747744	261.4037403035572	20/04/28 05:18:18
3	15	370.2735295511994	261.40237853682294	20/04/28 05:18:18
3	15	370.43305950777574	261.4014698868287	20/04/28 05:18:19
3	15	370.64033878047115	261.40028926649893	20/04/28 05:18:19
3	15	370.8584708489742	261.3990468308646	20/04/28 05:18:19
3	15	371.08128369873583	261.3977777344579	20/04/28 05:18:19
3	15	371.28242429628125	261.3966320787659	20/04/28 05:18:19
3	15	371.48854748423867	261.39545804325826	20/04/28 05:18:19
3	15	371.70337632193645	261.3942344221508	20/04/28 05:18:19
3	15	371.91116647297525	261.39305089196256	20/04/28 05:18:19
3	15	372.09186082897827	261.39202169387926	20/04/28 05:18:19
3	15	372.2794563788771	261.3909531880074	20/04/28 05:18:19
3	15	372.49886392727916	261.3897034875006	20/04/28 05:18:20
3	15	372.7393230222579	261.3883338816914	20/04/28 05:18:20
3	15	372.93279702188426	261.3872318933726	20/04/28 05:18:20
3	15	373.1577883005007	261.38595038908085	20/04/28 05:18:20
3	15	373.3775628939444	261.38469859796055	20/04/28 05:18:20
3	15	373.5432073176992	261.38375512121223	20/04/28 05:18:20
3	15	373.8152509677171	261.38220561623945	20/04/28 05:18:20
3	15	374.0669949310411	261.380771734129	20/04/28 05:18:20
3	15	374.3201456759537	261.3793298392784	20/04/28 05:18:20
3	15	374.3201456759537	261.3793298392784	20/04/28 05:18:20
3	15	374.84068146150395	261.376364973941	20/04/28 05:18:21
3	15	375.0046814453829	261.3754308635858	20/04/28 05:18:21
3	15	375.0046814453829	261.3754308635858	20/04/28 05:18:21
3	15	375.46009670533044	261.3728369114391	20/04/28 05:18:21
3	15	375.7014772728476	261.3714620571109	20/04/28 05:18:21
3	15	375.98200294740985	261.3698642402617	20/04/28 05:18:21
3	15	376.2494399433317	261.36834097384815	20/04/28 05:18:21
3	15	376.4391815987514	261.36726024419835	20/04/28 05:18:21
3	15	376.70651044174423	261.3657375938018	20/04/28 05:18:21
3	15	376.8914783290594	261.36468405455844	20/04/28 05:18:22
3	15	377.1737188109176	261.3630764705177	20/04/28 05:18:22
3	15	377.40778736902814	261.36174326389903	20/04/28 05:18:22
3	15	377.6608290534078	261.3603019902349	20/04/28 05:18:22
3	15	377.9151351988367	261.3588535144594	20/04/28 05:18:22
3	15	378.1237272581623	261.35766541676554	20/04/28 05:18:22
3	15	378.32656638240906	261.35651008661296	20/04/28 05:18:22
3	15	378.5691604531914	261.35961628527434	20/04/28 05:18:22
3	15	378.70791638301256	261.51156410796114	20/04/28 05:18:22
3	15	378.8894163549296	261.71031976176306	20/04/28 05:18:22
3	15	379.08283201218563	261.92212395659254	20/04/28 05:18:23
3	15	379.19608801606466	262.04614750800255	20/04/28 05:18:23
3	15	379.34237725315353	262.20634484938324	20/04/28 05:18:23
3	15	379.44483395223983	262.3185423775602	20/04/28 05:18:23
3	15	379.5801809279874	262.46675714790257	20/04/28 05:18:23
3	15	379.68912812893075	262.5860622470972	20/04/28 05:18:23
3	15	379.8115593722522	262.720133352206	20/04/28 05:18:23
3	15	380.00191972590585	262.928591767647	20/04/28 05:18:23
3	15	380.16350396226494	263.10553824429064	20/04/28 05:18:23
3	15	380.36529349889497	263.32651244533145	20/04/28 05:18:23
3	15	380.5476291318954	263.5261832087239	20/04/28 05:18:24
3	15	380.6689465141817	263.65903455508595	20/04/28 05:18:24
3	15	380.8259517238413	263.8309666648632	20/04/28 05:18:24
3	15	380.9957270767989	264.0168830092028	20/04/28 05:18:24
3	15	380.9957270767989	264.0168830092028	20/04/28 05:18:24
3	15	381.1620857349862	264.19905782457266	20/04/28 05:18:24
3	15	381.4701712853197	264.53643388219234	20/04/28 05:18:24
3	15	381.62670334752727	264.7078478611392	20/04/28 05:18:24
3	15	381.813298533961	264.91218314496444	20/04/28 05:18:24
1	33	381.69868735272837	264.83923022445657	20/04/28 05:18:25
1	33	381.45744262493224	264.6705414624038	20/04/28 05:18:25
1	33	381.32517993572077	264.57805766177245	20/04/28 05:18:25
1	33	381.0880221434085	264.41222666201634	20/04/28 05:18:25
1	33	380.94238333444036	264.3103896991276	20/04/28 05:18:25
1	33	380.7651635315881	264.1864699375332	20/04/28 05:18:25
1	33	380.5581792199134	264.04173754226093	20/04/28 05:18:25
1	33	380.35617643964923	263.90048844950235	20/04/28 05:18:25
1	33	380.1599486895114	263.7632775079263	20/04/28 05:18:25
1	33	379.92802992527663	263.60110986350577	20/04/28 05:18:25
1	33	379.76108877812726	263.4843773831504	20/04/28 05:18:26
1	33	379.6224425510222	263.387429936351	20/04/28 05:18:26
1	33	379.39524323084254	263.2285623316142	20/04/28 05:18:26
1	33	379.1751190787163	263.07464199080795	20/04/28 05:18:26
1	33	378.99258955678323	262.9470094436669	20/04/28 05:18:26
1	33	378.7772634061801	262.7964440733284	20/04/28 05:18:26
1	37	378.5445598870003	262.64665492124954	20/04/28 05:18:26
1	37	378.2500101084401	262.62622280548015	20/04/28 05:18:26
1	37	378.07438444671646	262.61404013174007	20/04/28 05:18:26
1	37	377.8574674948489	262.5989931936824	20/04/28 05:18:27
1	37	377.58748579940846	262.5802652989143	20/04/28 05:18:27
1	37	377.30669745396244	262.5607877762732	20/04/28 05:18:27
1	37	377.0563182502549	262.54341965295833	20/04/28 05:18:27
1	37	376.81935801928915	262.5269823672286	20/04/28 05:18:27
1	37	376.6668074404769	262.5164003491323	20/04/28 05:18:27
1	37	376.46157475845797	262.50216391704544	20/04/28 05:18:27
1	37	376.2978281065896	262.49080525785996	20/04/28 05:18:27
1	37	376.12956357282246	262.47913320551413	20/04/28 05:18:27
1	37	375.9353994060557	262.4656645661791	20/04/28 05:18:27
1	37	375.666291920094	262.4469973129411	20/04/28 05:18:28
1	37	375.451688869179	262.4321108838893	20/04/28 05:18:28
1	37	375.22044757125735	262.4160703049662	20/04/28 05:18:28
1	37	375.00834129977864	262.40135707070255	20/04/28 05:18:28
1	37	374.76460537117447	262.384449773285	20/04/28 05:18:28
1	37	374.507653550596	262.36662572544196	20/04/28 05:18:28
1	37	374.24422412255024	262.3483523436143	20/04/28 05:18:28
1	37	374.06904460019894	262.3362006173472	20/04/28 05:18:28
1	37	373.9108464520803	262.3252268427524	20/04/28 05:18:28
1	37	373.72168119991306	262.3121049645058	20/04/28 05:18:28
1	37	373.42745596504676	262.29169536144843	20/04/28 05:18:29
1	37	373.2215681683346	262.2774134858399	20/04/28 05:18:29
1	37	372.9759953394955	262.26037876765685	20/04/28 05:18:29
1	37	372.728307519313	262.24319733828565	20/04/28 05:18:29
1	37	372.5463604672448	262.23057616691716	20/04/28 05:18:29
1	37	372.25119790062024	262.210101543709	20/04/28 05:18:29
1	37	372.0948069138995	262.1992531269776	20/04/28 05:18:29
1	37	371.9429405951312	262.18871857413666	20/04/28 05:18:29
1	37	371.6607337304758	262.1691426526821	20/04/28 05:18:29
1	37	371.5041383538761	262.1582800579816	20/04/28 05:18:30
1	37	371.2502281910259	262.14066700164955	20/04/28 05:18:30
1	37	371.082042098478	262.1290003905574	20/04/28 05:18:30
1	37	370.8336990940969	262.1117735128431	20/04/28 05:18:30
1	37	370.59436125204667	262.09517129870915	20/04/28 05:18:30
1	37	370.36279426012635	262.0791081272805	20/04/28 05:18:30
1	37	370.21176558247026	262.0686316793217	20/04/28 05:18:30
1	37	369.9534792321188	262.0507150587836	20/04/28 05:18:30
1	37	369.68435422426757	262.0320465900999	20/04/28 05:18:30
1	37	369.53382980072416	262.0216051208753	20/04/28 05:18:30
1	37	369.36920773137797	262.01018573636406	20/04/28 05:18:31
1	37	369.11461816465186	261.9925255516359	20/04/28 05:18:31
1	37	368.8420896419262	261.9736209903967	20/04/28 05:18:31
1	37	368.66585191955113	261.9613958596765	20/04/28 05:18:31
1	37	368.394547884583	261.94257623781743	20/04/28 05:18:31
1	37	368.10511757876606	261.92249924592653	20/04/28 05:18:31
1	37	367.87077835807605	261.9062437725398	20/04/28 05:18:31
1	37	367.6649643450567	261.8919670151051	20/04/28 05:18:31
1	37	367.50209431761755	261.8806691649683	20/04/28 05:18:31
1	37	367.3163912061167	261.8677874459887	20/04/28 05:18:31
1	37	367.1411905146344	261.8556342512766	20/04/28 05:18:32
1	37	366.9157496345067	261.8399960315352	20/04/28 05:18:32
1	37	366.6623922298632	261.82242131853417	20/04/28 05:18:32
1	37	366.4278590769065	261.8061523925944	20/04/28 05:18:32
1	37	366.1414512459848	261.78628506155366	20/04/28 05:18:32
1	37	365.8840442974583	261.76842944272465	20/04/28 05:18:32
1	37	365.588714905556	261.74794324730146	20/04/28 05:18:32
1	37	365.3248340955059	261.72963855433375	20/04/28 05:18:32
1	37	365.17430200434427	261.71919655322733	20/04/28 05:18:32
1	37	365.0241027412741	261.708777639499	20/04/28 05:18:33
1	37	364.74700478985187	261.68955610943846	20/04/28 05:18:33
1	37	364.58897367351733	261.67859392138354	20/04/28 05:18:33
1	37	364.41947196709816	261.66683604974094	20/04/28 05:18:33
1	37	364.21024886294623	261.65232281294084	20/04/28 05:18:33
1	37	363.9260648348069	261.6326097410413	20/04/28 05:18:33
1	37	363.68518643835074	261.61590066284475	20/04/28 05:18:33
1	37	363.4454131128855	261.5992682404126	20/04/28 05:18:33
1	37	363.22363296131954	261.58388395543943	20/04/28 05:18:33
1	37	363.0427716179749	261.5713380967276	20/04/28 05:18:33
1	37	362.8387393669064	261.5571849352657	20/04/28 05:18:34
1	37	362.6184385021055	261.5419032643858	20/04/28 05:18:34
1	37	362.335149740071	261.52225229465716	20/04/28 05:18:34
1	37	362.15121079619445	261.50949295118	20/04/28 05:18:34
1	37	361.9090046900621	261.49269177338	20/04/28 05:18:34
1	37	361.6176456671088	261.4724809916353	20/04/28 05:18:34
1	37	361.4559678235765	261.46126584004855	20/04/28 05:18:34
1	37	361.19415482091665	261.44310458524666	20/04/28 05:18:34
1	37	360.93955272122633	261.4254435311409	20/04/28 05:18:34
1	37	360.76606042251353	261.4134088429815	20/04/28 05:18:34
1	37	360.52962255287537	261.3970077920341	20/04/28 05:18:35
1	37	360.237857555984	261.3767688489832	20/04/28 05:18:35
1	37	360.0169844168977	261.361447480995	20/04/28 05:18:35
1	37	359.75873637437445	261.3435335177667	20/04/28 05:18:35
1	37	359.48226976414287	261.32435578212477	20/04/28 05:18:35
1	37	359.25674509285636	261.3087117500189	20/04/28 05:18:35
1	37	359.07801940756826	261.2963140360888	20/04/28 05:18:35
1	37	358.80585469488034	261.27743471136085	20/04/28 05:18:35
1	37	358.65530027557776	261.26699116141214	20/04/28 05:18:35
1	37	358.4812008990589	261.254914361919	20/04/28 05:18:36
1	37	358.2930251208456	261.24186112078525	20/04/28 05:18:36
1	37	357.99797477624276	261.22139428211307	20/04/28 05:18:36
1	37	357.79282417641485	261.2071635438442	20/04/28 05:18:36
1	37	357.5037274891695	261.18710969416486	20/04/28 05:18:36
1	37	357.2060402105815	261.1664599385653	20/04/28 05:18:36
1	37	356.9206974971583	261.14666649182396	20/04/28 05:18:36
1	37	356.62836840145565	261.12638841877515	20/04/28 05:18:36
1	37	356.4744317582866	261.11571025317016	20/04/28 05:18:36
1	37	356.19817020947977	261.09654674208065	20/04/28 05:18:36
1	37	355.9159839068378	261.076972246957	20/04/28 05:18:37
1	37	355.7229503468723	261.06358203473593	20/04/28 05:18:37
1	37	355.51206255111697	261.04895332281404	20/04/28 05:18:37
1	37	355.2184772433014	261.02858810975295	20/04/28 05:18:37
1	37	354.96475951139246	261.01098840183107	20/04/28 05:18:37
1	37	354.75429872640893	260.9963893104832	20/04/28 05:18:37
1	37	354.5038915804622	260.97901924889135	20/04/28 05:18:37
1	37	354.26550095264304	260.96248274042836	20/04/28 05:18:37
1	37	354.1079453879104	260.9515535400926	20/04/28 05:18:37
1	37	353.86876531762243	260.93496227015606	20/04/28 05:18:37
1	37	353.6128636262886	260.9172110669181	20/04/28 05:18:38
1	37	353.4584154687686	260.906497418956	20/04/28 05:18:38
1	37	353.24005655958234	260.8913504562471	20/04/28 05:18:38
1	37	352.98781433868044	260.87385310050445	20/04/28 05:18:38
1	37	352.8237707283184	260.8624738421172	20/04/28 05:18:38
1	37	352.6001421754875	260.84696133858347	20/04/28 05:18:38
1	37	352.3484099329394	260.82949935865	20/04/28 05:18:38
1	37	352.124103034701	260.8139398001432	20/04/28 05:18:38
1	37	351.90318650048	260.7986154219527	20/04/28 05:18:38
1	37	351.64170230295287	260.7804769754672	20/04/28 05:18:39
1	37	351.3701197356224	260.7616380325769	20/04/28 05:18:39
1	37	351.1913048875144	260.74923413366486	20/04/28 05:18:39
1	37	350.91341427226513	260.7299576186739	20/04/28 05:18:39
1	37	350.72446532184074	260.71685074469	20/04/28 05:18:39
1	37	350.49876129378833	260.70119427109387	20/04/28 05:18:39
1	37	350.2818087043096	260.6861448609522	20/04/28 05:18:39
1	37	349.98729911423186	260.6657155329484	20/04/28 05:18:39
1	37	349.79401338446905	260.6523078283954	20/04/28 05:18:39
1	37	349.5582206630617	260.63595152962336	20/04/28 05:18:39
1	37	349.30483488058	260.618374848129	20/04/28 05:18:40
1	37	349.1343037671936	260.6065455693293	20/04/28 05:18:40
1	37	348.8774710374428	260.5887297824926	20/04/28 05:18:40
1	37	348.62359136004	260.571118840853	20/04/28 05:18:40
1	37	348.4451377918463	260.55874000294443	20/04/28 05:18:40
1	37	348.2954436146138	260.5483561256448	20/04/28 05:18:40
1	37	348.02855759822415	260.5298429696996	20/04/28 05:18:40
1	37	348.02855759822415	260.5298429696996	20/04/28 05:18:40
1	37	347.8596278212216	260.51812477124264	20/04/28 05:18:40
1	37	347.6395837860548	260.50286091593483	20/04/28 05:18:41
1	37	347.3634850404073	260.483708698057	20/04/28 05:18:41
1	37	347.16346261463053	260.4698336872527	20/04/28 05:18:41
1	37	346.9011646816328	260.45163879415423	20/04/28 05:18:41
1	37	346.62428707448845	260.43243254877603	20/04/28 05:18:41
1	37	346.44362403393126	260.41990044578836	20/04/28 05:18:41
1	37	346.16123607697597	260.4003119624543	20/04/28 05:18:41
1	37	345.9490360313183	260.3855922233313	20/04/28 05:18:41
1	37	345.78420901989244	260.37415862254625	20/04/28 05:18:41
1	37	345.5813938612248	260.3600898874688	20/04/28 05:18:41
1	37	345.3898952510883	260.3468061505361	20/04/28 05:18:42
1	37	345.2025431377288	260.3338100447895	20/04/28 05:18:42
1	37	344.9233269980866	260.31444158178226	20/04/28 05:18:42
1	37	344.6963880152243	260.298699442735	20/04/28 05:18:42
1	37	344.53956472734933	260.28782103845015	20/04/28 05:18:42
1	37	344.3599973604741	260.2753649393611	20/04/28 05:18:42
1	37	344.19809479276773	260.2641341992706	20/04/28 05:18:42
1	37	343.89948407588844	260.24342038727224	20/04/28 05:18:42
1	37	343.73301405863805	260.2318728156488	20/04/28 05:18:42
1	37	343.73301405863805	260.2318728156488	20/04/28 05:18:42
1	37	343.52634978253445	260.21753707778004	20/04/28 05:18:43
1	37	343.3669971640472	260.20648322072066	20/04/28 05:18:43
1	37	343.1232047501565	260.18957200507265	20/04/28 05:18:43
1	37	342.848170744126	260.1704936452817	20/04/28 05:18:43
1	37	342.6584950930871	260.15733636205573	20/04/28 05:18:43
1	37	342.39745281831944	260.1392285705482	20/04/28 05:18:43
1	37	342.19637956491965	260.12528066669415	20/04/28 05:18:43
1	37	341.96162126296935	260.10899612278206	20/04/28 05:18:43
1	37	341.66593986397777	260.08848550958595	20/04/28 05:18:43
1	37	341.36890684646363	260.0678811382948	20/04/28 05:18:43
1	37	341.06989622230475	260.04713958581783	20/04/28 05:18:44
1	37	340.9110551091749	260.03612121049173	20/04/28 05:18:44
1	37	340.69852495137656	260.02137857238876	20/04/28 05:18:44
1	37	340.5406386288269	260.0104264282843	20/04/28 05:18:44
1	37	340.3261545910505	259.9955482548497	20/04/28 05:18:44
1	37	340.1205717708494	259.98128753463095	20/04/28 05:18:44
1	37	340.1205717708494	259.98128753463095	20/04/28 05:18:44
1	37	339.96377563948346	259.9704110141191	20/04/28 05:18:44
1	37	339.6794439933505	259.9506877023615	20/04/28 05:18:44
1	37	339.4255427624266	259.93307526561284	20/04/28 05:18:45
1	37	339.2723257467553	259.9224470186071	20/04/28 05:18:45
1	37	339.0328700564317	259.90583662965946	20/04/28 05:18:45
1	37	338.86932314483647	259.8944918259126	20/04/28 05:18:45
1	37	338.7086563068999	259.88334680503	20/04/28 05:18:45
1	37	338.5585929901468	259.87293732152733	20/04/28 05:18:45
1	37	338.3030892477277	259.8552137229216	20/04/28 05:18:45
1	37	338.1220644090786	259.8426565229858	20/04/28 05:18:45
1	37	337.89940313709144	259.8272111170893	20/04/28 05:18:45
1	37	337.72177492915273	259.8148895321733	20/04/28 05:18:45
1	37	337.5410761682012	259.8023549513592	20/04/28 05:18:46
1	37	337.25216955530516	259.7823142866197	20/04/28 05:18:46
1	37	337.02554476502985	259.76659394225635	20/04/28 05:18:46
1	37	336.7851526394909	259.74991859534873	20/04/28 05:18:46
1	37	336.5721096340162	259.7351403823995	20/04/28 05:18:46
1	37	336.27716238172553	259.7146806949602	20/04/28 05:18:46
1	37	336.0003312992408	259.6954776768709	20/04/28 05:18:46
1	37	335.70358300477034	259.6748930560417	20/04/28 05:18:46
1	37	335.48879198274744	259.6599935879462	20/04/28 05:18:46
1	37	335.32960316745425	259.64895109346816	20/04/28 05:18:46
1	37	335.1115264468454	259.63382370541217	20/04/28 05:18:47
1	37	334.8533569555697	259.61591519106986	20/04/28 05:18:47
1	37	334.67795543306255	259.6037480652567	20/04/28 05:18:47
1	37	334.4044232041981	259.5847738796568	20/04/28 05:18:47
1	37	334.17770671486153	259.56904717437936	20/04/28 05:18:47
1	37	333.9452908901535	259.5529251217325	20/04/28 05:18:47
1	37	333.7095518845013	259.5365725490761	20/04/28 05:18:47
1	37	333.42881861457363	259.51709884687364	20/04/28 05:18:47
1	37	333.21446363895757	259.5022296261296	20/04/28 05:18:47
1	37	332.92637302602947	259.482245565085	20/04/28 05:18:48
1	37	332.72500470295176	259.4682771930512	20/04/28 05:18:48
1	37	332.4891009173021	259.4519131900552	20/04/28 05:18:48
1	37	332.2112594958108	259.4326400875013	20/04/28 05:18:48
1	37	331.94367593917565	259.4140785450894	20/04/28 05:18:48
1	37	331.7599442966597	259.40133358154293	20/04/28 05:18:48
1	37	331.5065694610194	259.38375765940117	20/04/28 05:18:48
1	37	331.25675390166754	259.3664286345599	20/04/28 05:18:48
1	37	331.0627710468713	259.35297257234237	20/04/28 05:18:48
1	37	331.0627710468713	259.35297257234237	20/04/28 05:18:48
1	37	330.9050064849287	259.3420288744395	20/04/28 05:18:49
