deviceId	device_location_x	device_location_y	rssi_measurement	timeStamp
64	355.46634984848305	285.2501123182773	-72	21/02/24 15:38:41
63	357.8525041421261	284.81168444961594	-68	21/02/24 15:38:41
71	355.13152078843456	277.03571032779917	-62	21/02/24 15:38:41
67	371.3904859622165	276.17892239365233	-67	21/02/24 15:38:41
68	376.468705051432	275.2257723625666	-68	21/02/24 15:38:41
66	375.6890666864942	274.8721929901928	-69	21/02/24 15:38:41
48	359.71539802123624	270.3627156374419	-51	21/02/24 15:38:41
70	354.00615228730356	275.4057508623367	-61	21/02/24 15:38:41
72	351.7036384177675	279.76339408968084	-67	21/02/24 15:38:41
74	352.9593013884277	269.63778806869993	-56	21/02/24 15:38:41
86	350.1628416731088	269.22923203576335	-61	21/02/24 15:38:41
75	345.422303169174	268.92405221690683	-68	21/02/24 15:38:41
91	363.0126439033423	266.55258353919857	-46	21/02/24 15:38:41
58	344.13983712780936	263.8974009792962	-69	21/02/24 15:38:41

64	355.46634984848305	285.2501123182773	-70	21/02/24 15:38:42
63	357.8525041421261	284.81168444961594	-71	21/02/24 15:38:42
71	355.13152078843456	277.03571032779917	-64	21/02/24 15:38:42
67	371.3904859622165	276.17892239365233	-66	21/02/24 15:38:42
68	376.468705051432	275.2257723625666	-71	21/02/24 15:38:42
66	375.6890666864942	274.8721929901928	-71	21/02/24 15:38:42
48	359.71539802123624	270.3627156374419	-50	21/02/24 15:38:42
70	354.00615228730356	275.4057508623367	-64	21/02/24 15:38:42
72	351.7036384177675	279.76339408968084	-69	21/02/24 15:38:42
74	352.9593013884277	269.63778806869993	-57	21/02/24 15:38:42
86	350.1628416731088	269.22923203576335	-60	21/02/24 15:38:42
75	345.422303169174	268.92405221690683	-67	21/02/24 15:38:42
91	363.0126439033423	266.55258353919857	-48	21/02/24 15:38:42
58	344.13983712780936	263.8974009792962	-66	21/02/24 15:38:42

64	355.46634984848305	285.2501123182773	-69	21/02/24 15:38:43
63	357.8525041421261	284.81168444961594	-70	21/02/24 15:38:43
71	355.13152078843456	277.03571032779917	-66	21/02/24 15:38:43
67	371.3904859622165	276.17892239365233	-66	21/02/24 15:38:43
68	376.468705051432	275.2257723625666	-70	21/02/24 15:38:43
66	375.6890666864942	274.8721929901928	-69	21/02/24 15:38:43
48	359.71539802123624	270.3627156374419	-51	21/02/24 15:38:43
70	354.00615228730356	275.4057508623367	-63	21/02/24 15:38:43
72	351.7036384177675	279.76339408968084	-66	21/02/24 15:38:43
74	352.9593013884277	269.63778806869993	-60	21/02/24 15:38:43
86	350.1628416731088	269.22923203576335	-61	21/02/24 15:38:43
75	345.422303169174	268.92405221690683	-65	21/02/24 15:38:43
91	363.0126439033423	266.55258353919857	-48	21/02/24 15:38:43
58	344.13983712780936	263.8974009792962	-65	21/02/24 15:38:43

64	355.46634984848305	285.2501123182773	-72	21/02/24 15:38:44
63	357.8525041421261	284.81168444961594	-72	21/02/24 15:38:44
71	355.13152078843456	277.03571032779917	-65	21/02/24 15:38:44
67	371.3904859622165	276.17892239365233	-66	21/02/24 15:38:44
68	376.468705051432	275.2257723625666	-68	21/02/24 15:38:44
66	375.6890666864942	274.8721929901928	-70	21/02/24 15:38:44
48	359.71539802123624	270.3627156374419	-51	21/02/24 15:38:44
70	354.00615228730356	275.4057508623367	-63	21/02/24 15:38:44
72	351.7036384177675	279.76339408968084	-67	21/02/24 15:38:44
74	352.9593013884277	269.63778806869993	-58	21/02/24 15:38:44
86	350.1628416731088	269.22923203576335	-62	21/02/24 15:38:44
75	345.422303169174	268.92405221690683	-69	21/02/24 15:38:44
91	363.0126439033423	266.55258353919857	-47	21/02/24 15:38:44
58	344.13983712780936	263.8974009792962	-66	21/02/24 15:38:44

64	355.46634984848305	285.2501123182773	-69	21/02/24 15:38:45
63	357.8525041421261	284.81168444961594	-70	21/02/24 15:38:45
71	355.13152078843456	277.03571032779917	-65	21/02/24 15:38:45
67	371.3904859622165	276.17892239365233	-69	21/02/24 15:38:45
68	376.468705051432	275.2257723625666	-69	21/02/24 15:38:45
66	375.6890666864942	274.8721929901928	-70	21/02/24 15:38:45
48	359.71539802123624	270.3627156374419	-53	21/02/24 15:38:45
70	354.00615228730356	275.4057508623367	-64	21/02/24 15:38:45
72	351.7036384177675	279.76339408968084	-67	21/02/24 15:38:45
74	352.9593013884277	269.63778806869993	-58	21/02/24 15:38:45
86	350.1628416731088	269.22923203576335	-63	21/02/24 15:38:45
75	345.422303169174	268.92405221690683	-67	21/02/24 15:38:45
91	363.0126439033423	266.55258353919857	-49	21/02/24 15:38:45
58	344.13983712780936	263.8974009792962	-65	21/02/24 15:38:45

64	355.46634984848305	285.2501123182773	-71	21/02/24 15:38:46
63	357.8525041421261	284.81168444961594	-72	21/02/24 15:38:46
71	355.13152078843456	277.03571032779917	-65	21/02/24 15:38:46
67	371.3904859622165	276.17892239365233	-66	21/02/24 15:38:46
68	376.468705051432	275.2257723625666	-70	21/02/24 15:38:46
66	375.6890666864942	274.8721929901928	-68	21/02/24 15:38:46
48	359.71539802123624	270.3627156374419	-52	21/02/24 15:38:46
70	354.00615228730356	275.4057508623367	-62	21/02/24 15:38:46
72	351.7036384177675	279.76339408968084	-66	21/02/24 15:38:46
74	352.9593013884277	269.63778806869993	-57	21/02/24 15:38:46
86	350.1628416731088	269.22923203576335	-62	21/02/24 15:38:46
75	345.422303169174	268.92405221690683	-65	21/02/24 15:38:46
91	363.0126439033423	266.55258353919857	-50	21/02/24 15:38:46
58	344.13983712780936	263.8974009792962	-67	21/02/24 15:38:46

64	355.46634984848305	285.2501123182773	-71	21/02/24 15:38:47
63	357.8525041421261	284.81168444961594	-71	21/02/24 15:38:47
71	355.13152078843456	277.03571032779917	-65	21/02/24 15:38:47
67	371.3904859622165	276.17892239365233	-68	21/02/24 15:38:47
68	376.468705051432	275.2257723625666	-70	21/02/24 15:38:47
66	375.6890666864942	274.8721929901928	-71	21/02/24 15:38:47
48	359.71539802123624	270.3627156374419	-51	21/02/24 15:38:47
70	354.00615228730356	275.4057508623367	-64	21/02/24 15:38:47
72	351.7036384177675	279.76339408968084	-65	21/02/24 15:38:47
74	352.9593013884277	269.63778806869993	-57	21/02/24 15:38:47
86	350.1628416731088	269.22923203576335	-62	21/02/24 15:38:47
75	345.422303169174	268.92405221690683	-67	21/02/24 15:38:47
91	363.0126439033423	266.55258353919857	-47	21/02/24 15:38:47
58	344.13983712780936	263.8974009792962	-67	21/02/24 15:38:47

64	355.46634984848305	285.2501123182773	-71	21/02/24 15:38:48
63	357.8525041421261	284.81168444961594	-71	21/02/24 15:38:48
71	355.13152078843456	277.03571032779917	-63	21/02/24 15:38:48
67	371.3904859622165	276.17892239365233	-69	21/02/24 15:38:48
68	376.468705051432	275.2257723625666	-70	21/02/24 15:38:48
66	375.6890666864942	274.8721929901928	-67	21/02/24 15:38:48
48	359.71539802123624	270.3627156374419	-49	21/02/24 15:38:48
70	354.00615228730356	275.4057508623367	-61	21/02/24 15:38:48
72	351.7036384177675	279.76339408968084	-69	21/02/24 15:38:48
74	352.9593013884277	269.63778806869993	-58	21/02/24 15:38:48
86	350.1628416731088	269.22923203576335	-63	21/02/24 15:38:48
75	345.422303169174	268.92405221690683	-65	21/02/24 15:38:48
91	363.0126439033423	266.55258353919857	-46	21/02/24 15:38:48
58	344.13983712780936	263.8974009792962	-68	21/02/24 15:38:48

64	355.46634984848305	285.2501123182773	-68	21/02/24 15:38:49
63	357.8525041421261	284.81168444961594	-69	21/02/24 15:38:49
71	355.13152078843456	277.03571032779917	-63	21/02/24 15:38:49
67	371.3904859622165	276.17892239365233	-69	21/02/24 15:38:49
68	376.468705051432	275.2257723625666	-69	21/02/24 15:38:49
66	375.6890666864942	274.8721929901928	-70	21/02/24 15:38:49
48	359.71539802123624	270.3627156374419	-52	21/02/24 15:38:49
70	354.00615228730356	275.4057508623367	-63	21/02/24 15:38:49
72	351.7036384177675	279.76339408968084	-69	21/02/24 15:38:49
74	352.9593013884277	269.63778806869993	-61	21/02/24 15:38:49
86	350.1628416731088	269.22923203576335	-61	21/02/24 15:38:49
75	345.422303169174	268.92405221690683	-68	21/02/24 15:38:49
91	363.0126439033423	266.55258353919857	-46	21/02/24 15:38:49
58	344.13983712780936	263.8974009792962	-66	21/02/24 15:38:49

64	355.46634984848305	285.2501123182773	-70	21/02/24 15:38:50
63	357.8525041421261	284.81168444961594	-70	21/02/24 15:38:50
71	355.13152078843456	277.03571032779917	-64	21/02/24 15:38:50
67	371.3904859622165	276.17892239365233	-69	21/02/24 15:38:50
68	376.468705051432	275.2257723625666	-69	21/02/24 15:38:50
66	375.6890666864942	274.8721929901928	-67	21/02/24 15:38:50
48	359.71539802123624	270.3627156374419	-53	21/02/24 15:38:50
70	354.00615228730356	275.4057508623367	-63	21/02/24 15:38:50
72	351.7036384177675	279.76339408968084	-69	21/02/24 15:38:50
74	352.9593013884277	269.63778806869993	-60	21/02/24 15:38:50
86	350.1628416731088	269.22923203576335	-63	21/02/24 15:38:50
75	345.422303169174	268.92405221690683	-66	21/02/24 15:38:50
91	363.0126439033423	266.55258353919857	-45	21/02/24 15:38:50
58	344.13983712780936	263.8974009792962	-67	21/02/24 15:38:50

63	357.8525041421261	284.81168444961594	-68	21/02/24 15:38:51
71	355.13152078843456	277.03571032779917	-62	21/02/24 15:38:51
67	371.3904859622165	276.17892239365233	-66	21/02/24 15:38:51
68	376.468705051432	275.2257723625666	-70	21/02/24 15:38:51
66	375.6890666864942	274.8721929901928	-69	21/02/24 15:38:51
48	359.71539802123624	270.3627156374419	-53	21/02/24 15:38:51
70	354.00615228730356	275.4057508623367	-62	21/02/24 15:38:51
72	351.7036384177675	279.76339408968084	-66	21/02/24 15:38:51
74	352.9593013884277	269.63778806869993	-60	21/02/24 15:38:51
86	350.1628416731088	269.22923203576335	-64	21/02/24 15:38:51
75	345.422303169174	268.92405221690683	-65	21/02/24 15:38:51
91	363.0126439033423	266.55258353919857	-45	21/02/24 15:38:51
58	344.13983712780936	263.8974009792962	-69	21/02/24 15:38:51

64	355.46634984848305	285.2501123182773	-72	21/02/24 15:38:52
63	357.8525041421261	284.81168444961594	-71	21/02/24 15:38:52
71	355.13152078843456	277.03571032779917	-66	21/02/24 15:38:52
67	371.3904859622165	276.17892239365233	-67	21/02/24 15:38:52
68	376.468705051432	275.2257723625666	-68	21/02/24 15:38:52
66	375.6890666864942	274.8721929901928	-68	21/02/24 15:38:52
48	359.71539802123624	270.3627156374419	-51	21/02/24 15:38:52
70	354.00615228730356	275.4057508623367	-65	21/02/24 15:38:52
72	351.7036384177675	279.76339408968084	-70	21/02/24 15:38:52
74	352.9593013884277	269.63778806869993	-60	21/02/24 15:38:52
86	350.1628416731088	269.22923203576335	-61	21/02/24 15:38:52
75	345.422303169174	268.92405221690683	-69	21/02/24 15:38:52
91	363.0126439033423	266.55258353919857	-46	21/02/24 15:38:52
58	344.13983712780936	263.8974009792962	-68	21/02/24 15:38:52

63	357.8525041421261	284.81168444961594	-72	21/02/24 15:38:54
71	355.13152078843456	277.03571032779917	-64	21/02/24 15:38:54
67	371.3904859622165	276.17892239365233	-68	21/02/24 15:38:54
68	376.468705051432	275.2257723625666	-72	21/02/24 15:38:54
66	375.6890666864942	274.8721929901928	-71	21/02/24 15:38:54
48	359.71539802123624	270.3627156374419	-53	21/02/24 15:38:54
70	354.00615228730356	275.4057508623367	-65	21/02/24 15:38:54
72	351.7036384177675	279.76339408968084	-68	21/02/24 15:38:54
74	352.9593013884277	269.63778806869993	-59	21/02/24 15:38:54
86	350.1628416731088	269.22923203576335	-64	21/02/24 15:38:54
75	345.422303169174	268.92405221690683	-65	21/02/24 15:38:54
91	363.0126439033423	266.55258353919857	-48	21/02/24 15:38:54
58	344.13983712780936	263.8974009792962	-69	21/02/24 15:38:54

63	357.8525041421261	284.81168444961594	-71	21/02/24 15:38:55
71	355.13152078843456	277.03571032779917	-65	21/02/24 15:38:55
67	371.3904859622165	276.17892239365233	-67	21/02/24 15:38:55
68	376.468705051432	275.2257723625666	-69	21/02/24 15:38:55
66	375.6890666864942	274.8721929901928	-68	21/02/24 15:38:55
48	359.71539802123624	270.3627156374419	-55	21/02/24 15:38:55
70	354.00615228730356	275.4057508623367	-65	21/02/24 15:38:55
72	351.7036384177675	279.76339408968084	-67	21/02/24 15:38:55
74	352.9593013884277	269.63778806869993	-58	21/02/24 15:38:55
86	350.1628416731088	269.22923203576335	-61	21/02/24 15:38:55
75	345.422303169174	268.92405221690683	-65	21/02/24 15:38:55
91	363.0126439033423	266.55258353919857	-47	21/02/24 15:38:55
58	344.13983712780936	263.8974009792962	-66	21/02/24 15:38:55

63	357.8525041421261	284.81168444961594	-69	21/02/24 15:38:56
71	355.13152078843456	277.03571032779917	-66	21/02/24 15:38:56
67	371.3904859622165	276.17892239365233	-66	21/02/24 15:38:56
66	375.6890666864942	274.8721929901928	-70	21/02/24 15:38:56
48	359.71539802123624	270.3627156374419	-51	21/02/24 15:38:56
70	354.00615228730356	275.4057508623367	-64	21/02/24 15:38:56
72	351.7036384177675	279.76339408968084	-69	21/02/24 15:38:56
74	352.9593013884277	269.63778806869993	-57	21/02/24 15:38:56
86	350.1628416731088	269.22923203576335	-59	21/02/24 15:38:56
75	345.422303169174	268.92405221690683	-68	21/02/24 15:38:56
91	363.0126439033423	266.55258353919857	-51	21/02/24 15:38:56
58	344.13983712780936	263.8974009792962	-67	21/02/24 15:38:56

64	355.46634984848305	285.2501123182773	-70	21/02/24 15:38:57
63	357.8525041421261	284.81168444961594	-72	21/02/24 15:38:57
71	355.13152078843456	277.03571032779917	-64	21/02/24 15:38:57
67	371.3904859622165	276.17892239365233	-67	21/02/24 15:38:57
66	375.6890666864942	274.8721929901928	-70	21/02/24 15:38:57
48	359.71539802123624	270.3627156374419	-52	21/02/24 15:38:57
70	354.00615228730356	275.4057508623367	-63	21/02/24 15:38:57
72	351.7036384177675	279.76339408968084	-69	21/02/24 15:38:57
74	352.9593013884277	269.63778806869993	-55	21/02/24 15:38:57
86	350.1628416731088	269.22923203576335	-60	21/02/24 15:38:57
75	345.422303169174	268.92405221690683	-65	21/02/24 15:38:57
91	363.0126439033423	266.55258353919857	-53	21/02/24 15:38:57
58	344.13983712780936	263.8974009792962	-66	21/02/24 15:38:57

64	355.46634984848305	285.2501123182773	-68	21/02/24 15:38:58
63	357.8525041421261	284.81168444961594	-69	21/02/24 15:38:58
71	355.13152078843456	277.03571032779917	-64	21/02/24 15:38:58
67	371.3904859622165	276.17892239365233	-70	21/02/24 15:38:58
66	375.6890666864942	274.8721929901928	-70	21/02/24 15:38:58
48	359.71539802123624	270.3627156374419	-50	21/02/24 15:38:58
70	354.00615228730356	275.4057508623367	-63	21/02/24 15:38:58
72	351.7036384177675	279.76339408968084	-68	21/02/24 15:38:58
74	352.9593013884277	269.63778806869993	-58	21/02/24 15:38:58
86	350.1628416731088	269.22923203576335	-62	21/02/24 15:38:58
75	345.422303169174	268.92405221690683	-66	21/02/24 15:38:58
91	363.0126439033423	266.55258353919857	-49	21/02/24 15:38:58
58	344.13983712780936	263.8974009792962	-65	21/02/24 15:38:58

63	357.8525041421261	284.81168444961594	-69	21/02/24 15:38:59
71	355.13152078843456	277.03571032779917	-63	21/02/24 15:38:59
67	371.3904859622165	276.17892239365233	-67	21/02/24 15:38:59
68	376.468705051432	275.2257723625666	-71	21/02/24 15:38:59
66	375.6890666864942	274.8721929901928	-71	21/02/24 15:38:59
48	359.71539802123624	270.3627156374419	-52	21/02/24 15:38:59
70	354.00615228730356	275.4057508623367	-63	21/02/24 15:38:59
72	351.7036384177675	279.76339408968084	-66	21/02/24 15:38:59
74	352.9593013884277	269.63778806869993	-58	21/02/24 15:38:59
86	350.1628416731088	269.22923203576335	-60	21/02/24 15:38:59
75	345.422303169174	268.92405221690683	-67	21/02/24 15:38:59
91	363.0126439033423	266.55258353919857	-51	21/02/24 15:38:59
58	344.13983712780936	263.8974009792962	-67	21/02/24 15:38:59

64	355.46634984848305	285.2501123182773	-71	21/02/24 15:39:00
63	357.8525041421261	284.81168444961594	-69	21/02/24 15:39:00
71	355.13152078843456	277.03571032779917	-64	21/02/24 15:39:00
67	371.3904859622165	276.17892239365233	-69	21/02/24 15:39:00
66	375.6890666864942	274.8721929901928	-72	21/02/24 15:39:00
48	359.71539802123624	270.3627156374419	-53	21/02/24 15:39:00
70	354.00615228730356	275.4057508623367	-64	21/02/24 15:39:00
72	351.7036384177675	279.76339408968084	-66	21/02/24 15:39:00
74	352.9593013884277	269.63778806869993	-56	21/02/24 15:39:00
86	350.1628416731088	269.22923203576335	-62	21/02/24 15:39:00
75	345.422303169174	268.92405221690683	-67	21/02/24 15:39:00
91	363.0126439033423	266.55258353919857	-51	21/02/24 15:39:00
58	344.13983712780936	263.8974009792962	-65	21/02/24 15:39:00

63	357.8525041421261	284.81168444961594	-71	21/02/24 15:39:01
71	355.13152078843456	277.03571032779917	-63	21/02/24 15:39:01
67	371.3904859622165	276.17892239365233	-69	21/02/24 15:39:01
66	375.6890666864942	274.8721929901928	-72	21/02/24 15:39:01
48	359.71539802123624	270.3627156374419	-52	21/02/24 15:39:01
70	354.00615228730356	275.4057508623367	-63	21/02/24 15:39:01
72	351.7036384177675	279.76339408968084	-69	21/02/24 15:39:01
74	352.9593013884277	269.63778806869993	-59	21/02/24 15:39:01
86	350.1628416731088	269.22923203576335	-62	21/02/24 15:39:01
75	345.422303169174	268.92405221690683	-66	21/02/24 15:39:01
91	363.0126439033423	266.55258353919857	-52	21/02/24 15:39:01
58	344.13983712780936	263.8974009792962	-67	21/02/24 15:39:01

63	357.8525041421261	284.81168444961594	-72	21/02/24 15:39:02
71	355.13152078843456	277.03571032779917	-65	21/02/24 15:39:02
67	371.3904859622165	276.17892239365233	-68	21/02/24 15:39:02
66	375.6890666864942	274.8721929901928	-68	21/02/24 15:39:02
48	359.71539802123624	270.3627156374419	-51	21/02/24 15:39:02
70	354.00615228730356	275.4057508623367	-65	21/02/24 15:39:02
72	351.7036384177675	279.76339408968084	-67	21/02/24 15:39:02
74	352.9593013884277	269.63778806869993	-58	21/02/24 15:39:02
86	350.1628416731088	269.22923203576335	-59	21/02/24 15:39:02
75	345.422303169174	268.92405221690683	-64	21/02/24 15:39:02
91	363.0126439033423	266.55258353919857	-51	21/02/24 15:39:02
58	344.13983712780936	263.8974009792962	-67	21/02/24 15:39:02

63	357.8525041421261	284.81168444961594	-71	21/02/24 15:39:03
71	355.13152078843456	277.03571032779917	-66	21/02/24 15:39:03
67	371.3904859622165	276.17892239365233	-67	21/02/24 15:39:03
66	375.6890666864942	274.8721929901928	-69	21/02/24 15:39:03
48	359.71539802123624	270.3627156374419	-52	21/02/24 15:39:03
70	354.00615228730356	275.4057508623367	-61	21/02/24 15:39:03
72	351.7036384177675	279.76339408968084	-69	21/02/24 15:39:03
74	352.9593013884277	269.63778806869993	-57	21/02/24 15:39:03
86	350.1628416731088	269.22923203576335	-61	21/02/24 15:39:03
75	345.422303169174	268.92405221690683	-67	21/02/24 15:39:03
91	363.0126439033423	266.55258353919857	-50	21/02/24 15:39:03
58	344.13983712780936	263.8974009792962	-66	21/02/24 15:39:03

63	357.8525041421261	284.81168444961594	-72	21/02/24 15:39:04
71	355.13152078843456	277.03571032779917	-63	21/02/24 15:39:04
67	371.3904859622165	276.17892239365233	-67	21/02/24 15:39:04
66	375.6890666864942	274.8721929901928	-72	21/02/24 15:39:04
48	359.71539802123624	270.3627156374419	-52	21/02/24 15:39:04
70	354.00615228730356	275.4057508623367	-65	21/02/24 15:39:04
72	351.7036384177675	279.76339408968084	-70	21/02/24 15:39:04
74	352.9593013884277	269.63778806869993	-56	21/02/24 15:39:04
86	350.1628416731088	269.22923203576335	-58	21/02/24 15:39:04
75	345.422303169174	268.92405221690683	-65	21/02/24 15:39:04
91	363.0126439033423	266.55258353919857	-54	21/02/24 15:39:04
58	344.13983712780936	263.8974009792962	-65	21/02/24 15:39:04

63	357.8525041421261	284.81168444961594	-69	21/02/24 15:39:05
71	355.13152078843456	277.03571032779917	-64	21/02/24 15:39:05
67	371.3904859622165	276.17892239365233	-70	21/02/24 15:39:05
48	359.71539802123624	270.3627156374419	-55	21/02/24 15:39:05
70	354.00615228730356	275.4057508623367	-63	21/02/24 15:39:05
72	351.7036384177675	279.76339408968084	-66	21/02/24 15:39:05
74	352.9593013884277	269.63778806869993	-55	21/02/24 15:39:05
86	350.1628416731088	269.22923203576335	-62	21/02/24 15:39:05
75	345.422303169174	268.92405221690683	-67	21/02/24 15:39:05
91	363.0126439033423	266.55258353919857	-54	21/02/24 15:39:05
58	344.13983712780936	263.8974009792962	-67	21/02/24 15:39:05

71	355.13152078843456	277.03571032779917	-65	21/02/24 15:39:06
67	371.3904859622165	276.17892239365233	-70	21/02/24 15:39:06
48	359.71539802123624	270.3627156374419	-54	21/02/24 15:39:06
70	354.00615228730356	275.4057508623367	-65	21/02/24 15:39:06
72	351.7036384177675	279.76339408968084	-68	21/02/24 15:39:06
74	352.9593013884277	269.63778806869993	-60	21/02/24 15:39:06
86	350.1628416731088	269.22923203576335	-62	21/02/24 15:39:06
75	345.422303169174	268.92405221690683	-66	21/02/24 15:39:06
91	363.0126439033423	266.55258353919857	-54	21/02/24 15:39:06
58	344.13983712780936	263.8974009792962	-66	21/02/24 15:39:06

71	355.13152078843456	277.03571032779917	-64	21/02/24 15:39:07
67	371.3904859622165	276.17892239365233	-69	21/02/24 15:39:07
48	359.71539802123624	270.3627156374419	-55	21/02/24 15:39:07
70	354.00615228730356	275.4057508623367	-65	21/02/24 15:39:07
72	351.7036384177675	279.76339408968084	-69	21/02/24 15:39:07
74	352.9593013884277	269.63778806869993	-58	21/02/24 15:39:07
86	350.1628416731088	269.22923203576335	-63	21/02/24 15:39:07
75	345.422303169174	268.92405221690683	-67	21/02/24 15:39:07
91	363.0126439033423	266.55258353919857	-53	21/02/24 15:39:07
58	344.13983712780936	263.8974009792962	-68	21/02/24 15:39:07

71	355.13152078843456	277.03571032779917	-64	21/02/24 15:39:08
67	371.3904859622165	276.17892239365233	-69	21/02/24 15:39:08
48	359.71539802123624	270.3627156374419	-55	21/02/24 15:39:08
70	354.00615228730356	275.4057508623367	-63	21/02/24 15:39:08
72	351.7036384177675	279.76339408968084	-68	21/02/24 15:39:08
74	352.9593013884277	269.63778806869993	-59	21/02/24 15:39:08
86	350.1628416731088	269.22923203576335	-60	21/02/24 15:39:08
75	345.422303169174	268.92405221690683	-67	21/02/24 15:39:08
91	363.0126439033423	266.55258353919857	-52	21/02/24 15:39:08
58	344.13983712780936	263.8974009792962	-65	21/02/24 15:39:08

71	355.13152078843456	277.03571032779917	-65	21/02/24 15:39:09
67	371.3904859622165	276.17892239365233	-67	21/02/24 15:39:09
48	359.71539802123624	270.3627156374419	-54	21/02/24 15:39:09
70	354.00615228730356	275.4057508623367	-64	21/02/24 15:39:09
72	351.7036384177675	279.76339408968084	-67	21/02/24 15:39:09
74	352.9593013884277	269.63778806869993	-57	21/02/24 15:39:09
86	350.1628416731088	269.22923203576335	-61	21/02/24 15:39:09
75	345.422303169174	268.92405221690683	-65	21/02/24 15:39:09
91	363.0126439033423	266.55258353919857	-53	21/02/24 15:39:09
58	344.13983712780936	263.8974009792962	-64	21/02/24 15:39:09

71	355.13152078843456	277.03571032779917	-65	21/02/24 15:39:10
67	371.3904859622165	276.17892239365233	-67	21/02/24 15:39:10
48	359.71539802123624	270.3627156374419	-54	21/02/24 15:39:10
70	354.00615228730356	275.4057508623367	-65	21/02/24 15:39:10
72	351.7036384177675	279.76339408968084	-69	21/02/24 15:39:10
74	352.9593013884277	269.63778806869993	-56	21/02/24 15:39:10
86	350.1628416731088	269.22923203576335	-61	21/02/24 15:39:10
75	345.422303169174	268.92405221690683	-66	21/02/24 15:39:10
91	363.0126439033423	266.55258353919857	-53	21/02/24 15:39:10
58	344.13983712780936	263.8974009792962	-66	21/02/24 15:39:10

71	355.13152078843456	277.03571032779917	-66	21/02/24 15:39:11
67	371.3904859622165	276.17892239365233	-71	21/02/24 15:39:11
48	359.71539802123624	270.3627156374419	-58	21/02/24 15:39:11
70	354.00615228730356	275.4057508623367	-65	21/02/24 15:39:11
72	351.7036384177675	279.76339408968084	-70	21/02/24 15:39:11
74	352.9593013884277	269.63778806869993	-57	21/02/24 15:39:11
86	350.1628416731088	269.22923203576335	-62	21/02/24 15:39:11
75	345.422303169174	268.92405221690683	-65	21/02/24 15:39:11
91	363.0126439033423	266.55258353919857	-51	21/02/24 15:39:11
58	344.13983712780936	263.8974009792962	-66	21/02/24 15:39:11

71	355.13152078843456	277.03571032779917	-65	21/02/24 15:39:12
67	371.3904859622165	276.17892239365233	-67	21/02/24 15:39:12
66	375.6890666864942	274.8721929901928	-71	21/02/24 15:39:12
48	359.71539802123624	270.3627156374419	-56	21/02/24 15:39:12
70	354.00615228730356	275.4057508623367	-63	21/02/24 15:39:12
72	351.7036384177675	279.76339408968084	-68	21/02/24 15:39:12
74	352.9593013884277	269.63778806869993	-58	21/02/24 15:39:12
86	350.1628416731088	269.22923203576335	-63	21/02/24 15:39:12
75	345.422303169174	268.92405221690683	-65	21/02/24 15:39:12
91	363.0126439033423	266.55258353919857	-52	21/02/24 15:39:12
58	344.13983712780936	263.8974009792962	-67	21/02/24 15:39:12

71	355.13152078843456	277.03571032779917	-65	21/02/24 15:39:13
67	371.3904859622165	276.17892239365233	-70	21/02/24 15:39:13
48	359.71539802123624	270.3627156374419	-55	21/02/24 15:39:13
70	354.00615228730356	275.4057508623367	-65	21/02/24 15:39:13
72	351.7036384177675	279.76339408968084	-69	21/02/24 15:39:13
74	352.9593013884277	269.63778806869993	-61	21/02/24 15:39:13
86	350.1628416731088	269.22923203576335	-63	21/02/24 15:39:13
75	345.422303169174	268.92405221690683	-65	21/02/24 15:39:13
91	363.0126439033423	266.55258353919857	-53	21/02/24 15:39:13
58	344.13983712780936	263.8974009792962	-68	21/02/24 15:39:13

71	355.13152078843456	277.03571032779917	-67	21/02/24 15:39:14
67	371.3904859622165	276.17892239365233	-70	21/02/24 15:39:14
48	359.71539802123624	270.3627156374419	-55	21/02/24 15:39:14
70	354.00615228730356	275.4057508623367	-65	21/02/24 15:39:14
72	351.7036384177675	279.76339408968084	-69	21/02/24 15:39:14
74	352.9593013884277	269.63778806869993	-60	21/02/24 15:39:14
86	350.1628416731088	269.22923203576335	-60	21/02/24 15:39:14
75	345.422303169174	268.92405221690683	-67	21/02/24 15:39:14
91	363.0126439033423	266.55258353919857	-52	21/02/24 15:39:14
58	344.13983712780936	263.8974009792962	-65	21/02/24 15:39:14

71	355.13152078843456	277.03571032779917	-64	21/02/24 15:39:15
67	371.3904859622165	276.17892239365233	-71	21/02/24 15:39:15
48	359.71539802123624	270.3627156374419	-56	21/02/24 15:39:15
70	354.00615228730356	275.4057508623367	-63	21/02/24 15:39:15
72	351.7036384177675	279.76339408968084	-68	21/02/24 15:39:15
74	352.9593013884277	269.63778806869993	-58	21/02/24 15:39:15
86	350.1628416731088	269.22923203576335	-59	21/02/24 15:39:15
75	345.422303169174	268.92405221690683	-66	21/02/24 15:39:15
91	363.0126439033423	266.55258353919857	-55	21/02/24 15:39:15
58	344.13983712780936	263.8974009792962	-66	21/02/24 15:39:15

71	355.13152078843456	277.03571032779917	-64	21/02/24 15:39:16
67	371.3904859622165	276.17892239365233	-71	21/02/24 15:39:16
48	359.71539802123624	270.3627156374419	-56	21/02/24 15:39:16
70	354.00615228730356	275.4057508623367	-62	21/02/24 15:39:16
72	351.7036384177675	279.76339408968084	-67	21/02/24 15:39:16
74	352.9593013884277	269.63778806869993	-55	21/02/24 15:39:16
86	350.1628416731088	269.22923203576335	-62	21/02/24 15:39:16
75	345.422303169174	268.92405221690683	-64	21/02/24 15:39:16
91	363.0126439033423	266.55258353919857	-54	21/02/24 15:39:16
58	344.13983712780936	263.8974009792962	-64	21/02/24 15:39:16

71	355.13152078843456	277.03571032779917	-65	21/02/24 15:39:17
67	371.3904859622165	276.17892239365233	-68	21/02/24 15:39:17
48	359.71539802123624	270.3627156374419	-57	21/02/24 15:39:17
70	354.00615228730356	275.4057508623367	-64	21/02/24 15:39:17
72	351.7036384177675	279.76339408968084	-66	21/02/24 15:39:17
74	352.9593013884277	269.63778806869993	-58	21/02/24 15:39:17
86	350.1628416731088	269.22923203576335	-62	21/02/24 15:39:17
75	345.422303169174	268.92405221690683	-67	21/02/24 15:39:17
91	363.0126439033423	266.55258353919857	-55	21/02/24 15:39:17
58	344.13983712780936	263.8974009792962	-65	21/02/24 15:39:17

71	355.13152078843456	277.03571032779917	-65	21/02/24 15:39:18
67	371.3904859622165	276.17892239365233	-68	21/02/24 15:39:18
48	359.71539802123624	270.3627156374419	-56	21/02/24 15:39:18
70	354.00615228730356	275.4057508623367	-64	21/02/24 15:39:18
72	351.7036384177675	279.76339408968084	-69	21/02/24 15:39:18
74	352.9593013884277	269.63778806869993	-57	21/02/24 15:39:18
86	350.1628416731088	269.22923203576335	-59	21/02/24 15:39:18
75	345.422303169174	268.92405221690683	-65	21/02/24 15:39:18
91	363.0126439033423	266.55258353919857	-54	21/02/24 15:39:18
58	344.13983712780936	263.8974009792962	-67	21/02/24 15:39:18

71	355.13152078843456	277.03571032779917	-65	21/02/24 15:39:19
67	371.3904859622165	276.17892239365233	-70	21/02/24 15:39:19
48	359.71539802123624	270.3627156374419	-56	21/02/24 15:39:19
70	354.00615228730356	275.4057508623367	-62	21/02/24 15:39:19
72	351.7036384177675	279.76339408968084	-70	21/02/24 15:39:19
74	352.9593013884277	269.63778806869993	-59	21/02/24 15:39:19
86	350.1628416731088	269.22923203576335	-60	21/02/24 15:39:19
75	345.422303169174	268.92405221690683	-65	21/02/24 15:39:19
91	363.0126439033423	266.55258353919857	-53	21/02/24 15:39:19
58	344.13983712780936	263.8974009792962	-67	21/02/24 15:39:19

71	355.13152078843456	277.03571032779917	-66	21/02/24 15:39:20
67	371.3904859622165	276.17892239365233	-70	21/02/24 15:39:20
48	359.71539802123624	270.3627156374419	-54	21/02/24 15:39:20
70	354.00615228730356	275.4057508623367	-64	21/02/24 15:39:20
72	351.7036384177675	279.76339408968084	-69	21/02/24 15:39:20
74	352.9593013884277	269.63778806869993	-58	21/02/24 15:39:20
86	350.1628416731088	269.22923203576335	-60	21/02/24 15:39:20
75	345.422303169174	268.92405221690683	-64	21/02/24 15:39:20
91	363.0126439033423	266.55258353919857	-54	21/02/24 15:39:20
58	344.13983712780936	263.8974009792962	-66	21/02/24 15:39:20

63	357.8525041421261	284.81168444961594	-69	21/02/24 15:39:21
71	355.13152078843456	277.03571032779917	-63	21/02/24 15:39:21
67	371.3904859622165	276.17892239365233	-68	21/02/24 15:39:21
66	375.6890666864942	274.8721929901928	-70	21/02/24 15:39:21
48	359.71539802123624	270.3627156374419	-56	21/02/24 15:39:21
70	354.00615228730356	275.4057508623367	-65	21/02/24 15:39:21
72	351.7036384177675	279.76339408968084	-67	21/02/24 15:39:21
74	352.9593013884277	269.63778806869993	-57	21/02/24 15:39:21
86	350.1628416731088	269.22923203576335	-62	21/02/24 15:39:21
75	345.422303169174	268.92405221690683	-67	21/02/24 15:39:21
91	363.0126439033423	266.55258353919857	-52	21/02/24 15:39:21
58	344.13983712780936	263.8974009792962	-68	21/02/24 15:39:21

71	355.13152078843456	277.03571032779917	-65	21/02/24 15:39:22
67	371.3904859622165	276.17892239365233	-69	21/02/24 15:39:22
48	359.71539802123624	270.3627156374419	-56	21/02/24 15:39:22
70	354.00615228730356	275.4057508623367	-63	21/02/24 15:39:22
72	351.7036384177675	279.76339408968084	-69	21/02/24 15:39:22
74	352.9593013884277	269.63778806869993	-60	21/02/24 15:39:22
86	350.1628416731088	269.22923203576335	-63	21/02/24 15:39:22
75	345.422303169174	268.92405221690683	-65	21/02/24 15:39:22
91	363.0126439033423	266.55258353919857	-54	21/02/24 15:39:22
58	344.13983712780936	263.8974009792962	-68	21/02/24 15:39:22

71	355.13152078843456	277.03571032779917	-66	21/02/24 15:39:23
67	371.3904859622165	276.17892239365233	-69	21/02/24 15:39:23
48	359.71539802123624	270.3627156374419	-55	21/02/24 15:39:23
70	354.00615228730356	275.4057508623367	-64	21/02/24 15:39:23
72	351.7036384177675	279.76339408968084	-69	21/02/24 15:39:23
74	352.9593013884277	269.63778806869993	-57	21/02/24 15:39:23
86	350.1628416731088	269.22923203576335	-62	21/02/24 15:39:23
75	345.422303169174	268.92405221690683	-65	21/02/24 15:39:23
91	363.0126439033423	266.55258353919857	-54	21/02/24 15:39:23
58	344.13983712780936	263.8974009792962	-67	21/02/24 15:39:23

71	355.13152078843456	277.03571032779917	-66	21/02/24 15:39:24
67	371.3904859622165	276.17892239365233	-67	21/02/24 15:39:24
48	359.71539802123624	270.3627156374419	-53	21/02/24 15:39:24
70	354.00615228730356	275.4057508623367	-62	21/02/24 15:39:24
72	351.7036384177675	279.76339408968084	-69	21/02/24 15:39:24
74	352.9593013884277	269.63778806869993	-59	21/02/24 15:39:24
86	350.1628416731088	269.22923203576335	-59	21/02/24 15:39:24
75	345.422303169174	268.92405221690683	-66	21/02/24 15:39:24
91	363.0126439033423	266.55258353919857	-51	21/02/24 15:39:24
58	344.13983712780936	263.8974009792962	-64	21/02/24 15:39:24

63	357.8525041421261	284.81168444961594	-71	21/02/24 15:39:25
71	355.13152078843456	277.03571032779917	-64	21/02/24 15:39:25
67	371.3904859622165	276.17892239365233	-69	21/02/24 15:39:25
48	359.71539802123624	270.3627156374419	-55	21/02/24 15:39:25
70	354.00615228730356	275.4057508623367	-62	21/02/24 15:39:25
72	351.7036384177675	279.76339408968084	-67	21/02/24 15:39:25
74	352.9593013884277	269.63778806869993	-55	21/02/24 15:39:25
86	350.1628416731088	269.22923203576335	-62	21/02/24 15:39:25
75	345.422303169174	268.92405221690683	-64	21/02/24 15:39:25
91	363.0126439033423	266.55258353919857	-51	21/02/24 15:39:25
58	344.13983712780936	263.8974009792962	-67	21/02/24 15:39:25

71	355.13152078843456	277.03571032779917	-64	21/02/24 15:39:26
67	371.3904859622165	276.17892239365233	-68	21/02/24 15:39:26
66	375.6890666864942	274.8721929901928	-68	21/02/24 15:39:26
48	359.71539802123624	270.3627156374419	-54	21/02/24 15:39:26
70	354.00615228730356	275.4057508623367	-63	21/02/24 15:39:26
72	351.7036384177675	279.76339408968084	-68	21/02/24 15:39:26
74	352.9593013884277	269.63778806869993	-58	21/02/24 15:39:26
86	350.1628416731088	269.22923203576335	-63	21/02/24 15:39:26
75	345.422303169174	268.92405221690683	-65	21/02/24 15:39:26
91	363.0126439033423	266.55258353919857	-51	21/02/24 15:39:26
58	344.13983712780936	263.8974009792962	-65	21/02/24 15:39:26

71	355.13152078843456	277.03571032779917	-63	21/02/24 15:39:27
67	371.3904859622165	276.17892239365233	-69	21/02/24 15:39:27
66	375.6890666864942	274.8721929901928	-69	21/02/24 15:39:27
48	359.71539802123624	270.3627156374419	-52	21/02/24 15:39:27
70	354.00615228730356	275.4057508623367	-62	21/02/24 15:39:27
72	351.7036384177675	279.76339408968084	-68	21/02/24 15:39:27
74	352.9593013884277	269.63778806869993	-58	21/02/24 15:39:27
86	350.1628416731088	269.22923203576335	-60	21/02/24 15:39:27
75	345.422303169174	268.92405221690683	-66	21/02/24 15:39:27
91	363.0126439033423	266.55258353919857	-49	21/02/24 15:39:27
58	344.13983712780936	263.8974009792962	-66	21/02/24 15:39:27

71	355.13152078843456	277.03571032779917	-64	21/02/24 15:39:28
67	371.3904859622165	276.17892239365233	-67	21/02/24 15:39:28
66	375.6890666864942	274.8721929901928	-72	21/02/24 15:39:28
48	359.71539802123624	270.3627156374419	-56	21/02/24 15:39:28
70	354.00615228730356	275.4057508623367	-65	21/02/24 15:39:28
72	351.7036384177675	279.76339408968084	-69	21/02/24 15:39:28
74	352.9593013884277	269.63778806869993	-57	21/02/24 15:39:28
86	350.1628416731088	269.22923203576335	-63	21/02/24 15:39:28
75	345.422303169174	268.92405221690683	-68	21/02/24 15:39:28
91	363.0126439033423	266.55258353919857	-52	21/02/24 15:39:28
58	344.13983712780936	263.8974009792962	-65	21/02/24 15:39:28

63	357.8525041421261	284.81168444961594	-70	21/02/24 15:39:29
71	355.13152078843456	277.03571032779917	-64	21/02/24 15:39:29
67	371.3904859622165	276.17892239365233	-69	21/02/24 15:39:29
66	375.6890666864942	274.8721929901928	-71	21/02/24 15:39:29
48	359.71539802123624	270.3627156374419	-54	21/02/24 15:39:29
70	354.00615228730356	275.4057508623367	-61	21/02/24 15:39:29
72	351.7036384177675	279.76339408968084	-69	21/02/24 15:39:29
74	352.9593013884277	269.63778806869993	-57	21/02/24 15:39:29
86	350.1628416731088	269.22923203576335	-60	21/02/24 15:39:29
75	345.422303169174	268.92405221690683	-66	21/02/24 15:39:29
91	363.0126439033423	266.55258353919857	-52	21/02/24 15:39:29
58	344.13983712780936	263.8974009792962	-67	21/02/24 15:39:29

64	355.46634984848305	285.2501123182773	-71	21/02/24 15:39:30
63	357.8525041421261	284.81168444961594	-69	21/02/24 15:39:30
71	355.13152078843456	277.03571032779917	-63	21/02/24 15:39:30
67	371.3904859622165	276.17892239365233	-67	21/02/24 15:39:30
68	376.468705051432	275.2257723625666	-72	21/02/24 15:39:30
66	375.6890666864942	274.8721929901928	-71	21/02/24 15:39:30
48	359.71539802123624	270.3627156374419	-51	21/02/24 15:39:30
70	354.00615228730356	275.4057508623367	-63	21/02/24 15:39:30
72	351.7036384177675	279.76339408968084	-68	21/02/24 15:39:30
74	352.9593013884277	269.63778806869993	-57	21/02/24 15:39:30
86	350.1628416731088	269.22923203576335	-62	21/02/24 15:39:30
75	345.422303169174	268.92405221690683	-67	21/02/24 15:39:30
91	363.0126439033423	266.55258353919857	-50	21/02/24 15:39:30
58	344.13983712780936	263.8974009792962	-66	21/02/24 15:39:30

64	355.46634984848305	285.2501123182773	-70	21/02/24 15:39:31
63	357.8525041421261	284.81168444961594	-69	21/02/24 15:39:31
71	355.13152078843456	277.03571032779917	-63	21/02/24 15:39:31
67	371.3904859622165	276.17892239365233	-67	21/02/24 15:39:31
68	376.468705051432	275.2257723625666	-70	21/02/24 15:39:31
66	375.6890666864942	274.8721929901928	-70	21/02/24 15:39:31
48	359.71539802123624	270.3627156374419	-50	21/02/24 15:39:31
70	354.00615228730356	275.4057508623367	-61	21/02/24 15:39:31
72	351.7036384177675	279.76339408968084	-69	21/02/24 15:39:31
74	352.9593013884277	269.63778806869993	-58	21/02/24 15:39:31
86	350.1628416731088	269.22923203576335	-61	21/02/24 15:39:31
75	345.422303169174	268.92405221690683	-65	21/02/24 15:39:31
91	363.0126439033423	266.55258353919857	-49	21/02/24 15:39:31
58	344.13983712780936	263.8974009792962	-67	21/02/24 15:39:31

64	355.46634984848305	285.2501123182773	-72	21/02/24 15:39:32
63	357.8525041421261	284.81168444961594	-71	21/02/24 15:39:32
71	355.13152078843456	277.03571032779917	-63	21/02/24 15:39:32
67	371.3904859622165	276.17892239365233	-69	21/02/24 15:39:32
68	376.468705051432	275.2257723625666	-70	21/02/24 15:39:32
66	375.6890666864942	274.8721929901928	-69	21/02/24 15:39:32
48	359.71539802123624	270.3627156374419	-51	21/02/24 15:39:32
70	354.00615228730356	275.4057508623367	-64	21/02/24 15:39:32
72	351.7036384177675	279.76339408968084	-66	21/02/24 15:39:32
74	352.9593013884277	269.63778806869993	-58	21/02/24 15:39:32
86	350.1628416731088	269.22923203576335	-62	21/02/24 15:39:32
75	345.422303169174	268.92405221690683	-66	21/02/24 15:39:32
91	363.0126439033423	266.55258353919857	-48	21/02/24 15:39:32
58	344.13983712780936	263.8974009792962	-69	21/02/24 15:39:32

64	355.46634984848305	285.2501123182773	-70	21/02/24 15:39:33
63	357.8525041421261	284.81168444961594	-72	21/02/24 15:39:33
71	355.13152078843456	277.03571032779917	-63	21/02/24 15:39:33
67	371.3904859622165	276.17892239365233	-66	21/02/24 15:39:33
68	376.468705051432	275.2257723625666	-71	21/02/24 15:39:33
66	375.6890666864942	274.8721929901928	-70	21/02/24 15:39:33
48	359.71539802123624	270.3627156374419	-52	21/02/24 15:39:33
70	354.00615228730356	275.4057508623367	-64	21/02/24 15:39:33
72	351.7036384177675	279.76339408968084	-67	21/02/24 15:39:33
74	352.9593013884277	269.63778806869993	-57	21/02/24 15:39:33
86	350.1628416731088	269.22923203576335	-62	21/02/24 15:39:33
75	345.422303169174	268.92405221690683	-65	21/02/24 15:39:33
91	363.0126439033423	266.55258353919857	-48	21/02/24 15:39:33
58	344.13983712780936	263.8974009792962	-65	21/02/24 15:39:33

64	355.46634984848305	285.2501123182773	-72	21/02/24 15:39:34
63	357.8525041421261	284.81168444961594	-68	21/02/24 15:39:34
71	355.13152078843456	277.03571032779917	-64	21/02/24 15:39:34
67	371.3904859622165	276.17892239365233	-68	21/02/24 15:39:34
68	376.468705051432	275.2257723625666	-68	21/02/24 15:39:34
66	375.6890666864942	274.8721929901928	-68	21/02/24 15:39:34
48	359.71539802123624	270.3627156374419	-48	21/02/24 15:39:34
70	354.00615228730356	275.4057508623367	-63	21/02/24 15:39:34
72	351.7036384177675	279.76339408968084	-68	21/02/24 15:39:34
74	352.9593013884277	269.63778806869993	-59	21/02/24 15:39:34
86	350.1628416731088	269.22923203576335	-62	21/02/24 15:39:34
75	345.422303169174	268.92405221690683	-67	21/02/24 15:39:34
91	363.0126439033423	266.55258353919857	-47	21/02/24 15:39:34
58	344.13983712780936	263.8974009792962	-69	21/02/24 15:39:34

64	355.46634984848305	285.2501123182773	-69	21/02/24 15:39:35
63	357.8525041421261	284.81168444961594	-70	21/02/24 15:39:35
71	355.13152078843456	277.03571032779917	-64	21/02/24 15:39:35
67	371.3904859622165	276.17892239365233	-66	21/02/24 15:39:35
68	376.468705051432	275.2257723625666	-70	21/02/24 15:39:35
66	375.6890666864942	274.8721929901928	-68	21/02/24 15:39:35
48	359.71539802123624	270.3627156374419	-46	21/02/24 15:39:35
70	354.00615228730356	275.4057508623367	-61	21/02/24 15:39:35
72	351.7036384177675	279.76339408968084	-69	21/02/24 15:39:35
74	352.9593013884277	269.63778806869993	-59	21/02/24 15:39:35
86	350.1628416731088	269.22923203576335	-61	21/02/24 15:39:35
75	345.422303169174	268.92405221690683	-68	21/02/24 15:39:35
91	363.0126439033423	266.55258353919857	-48	21/02/24 15:39:35
58	344.13983712780936	263.8974009792962	-68	21/02/24 15:39:35

64	355.46634984848305	285.2501123182773	-71	21/02/24 15:39:36
63	357.8525041421261	284.81168444961594	-71	21/02/24 15:39:36
71	355.13152078843456	277.03571032779917	-65	21/02/24 15:39:36
67	371.3904859622165	276.17892239365233	-66	21/02/24 15:39:36
68	376.468705051432	275.2257723625666	-71	21/02/24 15:39:36
66	375.6890666864942	274.8721929901928	-69	21/02/24 15:39:36
48	359.71539802123624	270.3627156374419	-51	21/02/24 15:39:36
70	354.00615228730356	275.4057508623367	-61	21/02/24 15:39:36
72	351.7036384177675	279.76339408968084	-68	21/02/24 15:39:36
74	352.9593013884277	269.63778806869993	-57	21/02/24 15:39:36
86	350.1628416731088	269.22923203576335	-64	21/02/24 15:39:36
75	345.422303169174	268.92405221690683	-67	21/02/24 15:39:36
91	363.0126439033423	266.55258353919857	-43	21/02/24 15:39:36
58	344.13983712780936	263.8974009792962	-69	21/02/24 15:39:36

64	355.46634984848305	285.2501123182773	-68	21/02/24 15:39:37
63	357.8525041421261	284.81168444961594	-68	21/02/24 15:39:37
71	355.13152078843456	277.03571032779917	-63	21/02/24 15:39:37
67	371.3904859622165	276.17892239365233	-67	21/02/24 15:39:37
68	376.468705051432	275.2257723625666	-71	21/02/24 15:39:37
66	375.6890666864942	274.8721929901928	-71	21/02/24 15:39:37
48	359.71539802123624	270.3627156374419	-51	21/02/24 15:39:37
70	354.00615228730356	275.4057508623367	-63	21/02/24 15:39:37
72	351.7036384177675	279.76339408968084	-69	21/02/24 15:39:37
74	352.9593013884277	269.63778806869993	-59	21/02/24 15:39:37
86	350.1628416731088	269.22923203576335	-61	21/02/24 15:39:37
75	345.422303169174	268.92405221690683	-69	21/02/24 15:39:37
91	363.0126439033423	266.55258353919857	-43	21/02/24 15:39:37
58	344.13983712780936	263.8974009792962	-69	21/02/24 15:39:37

64	355.46634984848305	285.2501123182773	-68	21/02/24 15:39:38
63	357.8525041421261	284.81168444961594	-70	21/02/24 15:39:38
71	355.13152078843456	277.03571032779917	-62	21/02/24 15:39:38
67	371.3904859622165	276.17892239365233	-67	21/02/24 15:39:38
68	376.468705051432	275.2257723625666	-70	21/02/24 15:39:38
66	375.6890666864942	274.8721929901928	-70	21/02/24 15:39:38
48	359.71539802123624	270.3627156374419	-49	21/02/24 15:39:38
70	354.00615228730356	275.4057508623367	-61	21/02/24 15:39:38
72	351.7036384177675	279.76339408968084	-67	21/02/24 15:39:38
74	352.9593013884277	269.63778806869993	-59	21/02/24 15:39:38
86	350.1628416731088	269.22923203576335	-64	21/02/24 15:39:38
75	345.422303169174	268.92405221690683	-66	21/02/24 15:39:38
91	363.0126439033423	266.55258353919857	-44	21/02/24 15:39:38
58	344.13983712780936	263.8974009792962	-66	21/02/24 15:39:38

64	355.46634984848305	285.2501123182773	-72	21/02/24 15:39:39
63	357.8525041421261	284.81168444961594	-68	21/02/24 15:39:39
71	355.13152078843456	277.03571032779917	-62	21/02/24 15:39:39
67	371.3904859622165	276.17892239365233	-67	21/02/24 15:39:39
68	376.468705051432	275.2257723625666	-69	21/02/24 15:39:39
66	375.6890666864942	274.8721929901928	-68	21/02/24 15:39:39
48	359.71539802123624	270.3627156374419	-48	21/02/24 15:39:39
70	354.00615228730356	275.4057508623367	-64	21/02/24 15:39:39
72	351.7036384177675	279.76339408968084	-67	21/02/24 15:39:39
74	352.9593013884277	269.63778806869993	-57	21/02/24 15:39:39
86	350.1628416731088	269.22923203576335	-64	21/02/24 15:39:39
75	345.422303169174	268.92405221690683	-67	21/02/24 15:39:39
91	363.0126439033423	266.55258353919857	-42	21/02/24 15:39:39
58	344.13983712780936	263.8974009792962	-66	21/02/24 15:39:39

64	355.46634984848305	285.2501123182773	-68	21/02/24 15:39:40
63	357.8525041421261	284.81168444961594	-68	21/02/24 15:39:40
71	355.13152078843456	277.03571032779917	-61	21/02/24 15:39:40
67	371.3904859622165	276.17892239365233	-66	21/02/24 15:39:40
68	376.468705051432	275.2257723625666	-71	21/02/24 15:39:40
66	375.6890666864942	274.8721929901928	-69	21/02/24 15:39:40
48	359.71539802123624	270.3627156374419	-46	21/02/24 15:39:40
70	354.00615228730356	275.4057508623367	-63	21/02/24 15:39:40
72	351.7036384177675	279.76339408968084	-67	21/02/24 15:39:40
74	352.9593013884277	269.63778806869993	-59	21/02/24 15:39:40
86	350.1628416731088	269.22923203576335	-61	21/02/24 15:39:40
75	345.422303169174	268.92405221690683	-67	21/02/24 15:39:40
91	363.0126439033423	266.55258353919857	-43	21/02/24 15:39:40
58	344.13983712780936	263.8974009792962	-70	21/02/24 15:39:40

64	355.46634984848305	285.2501123182773	-70	21/02/24 15:39:41
63	357.8525041421261	284.81168444961594	-69	21/02/24 15:39:41
71	355.13152078843456	277.03571032779917	-62	21/02/24 15:39:41
67	371.3904859622165	276.17892239365233	-65	21/02/24 15:39:41
68	376.468705051432	275.2257723625666	-70	21/02/24 15:39:41
66	375.6890666864942	274.8721929901928	-68	21/02/24 15:39:41
48	359.71539802123624	270.3627156374419	-50	21/02/24 15:39:41
70	354.00615228730356	275.4057508623367	-62	21/02/24 15:39:41
72	351.7036384177675	279.76339408968084	-69	21/02/24 15:39:41
74	352.9593013884277	269.63778806869993	-60	21/02/24 15:39:41
86	350.1628416731088	269.22923203576335	-61	21/02/24 15:39:41
75	345.422303169174	268.92405221690683	-68	21/02/24 15:39:41
91	363.0126439033423	266.55258353919857	-44	21/02/24 15:39:41
58	344.13983712780936	263.8974009792962	-67	21/02/24 15:39:41

64	355.46634984848305	285.2501123182773	-71	21/02/24 15:39:42
63	357.8525041421261	284.81168444961594	-67	21/02/24 15:39:42
71	355.13152078843456	277.03571032779917	-62	21/02/24 15:39:42
67	371.3904859622165	276.17892239365233	-65	21/02/24 15:39:42
68	376.468705051432	275.2257723625666	-68	21/02/24 15:39:42
66	375.6890666864942	274.8721929901928	-70	21/02/24 15:39:42
48	359.71539802123624	270.3627156374419	-47	21/02/24 15:39:42
70	354.00615228730356	275.4057508623367	-63	21/02/24 15:39:42
72	351.7036384177675	279.76339408968084	-69	21/02/24 15:39:42
74	352.9593013884277	269.63778806869993	-57	21/02/24 15:39:42
86	350.1628416731088	269.22923203576335	-64	21/02/24 15:39:42
75	345.422303169174	268.92405221690683	-67	21/02/24 15:39:42
91	363.0126439033423	266.55258353919857	-47	21/02/24 15:39:42
58	344.13983712780936	263.8974009792962	-69	21/02/24 15:39:42

64	355.46634984848305	285.2501123182773	-70	21/02/24 15:39:43
63	357.8525041421261	284.81168444961594	-70	21/02/24 15:39:43
71	355.13152078843456	277.03571032779917	-63	21/02/24 15:39:43
67	371.3904859622165	276.17892239365233	-66	21/02/24 15:39:43
68	376.468705051432	275.2257723625666	-68	21/02/24 15:39:43
66	375.6890666864942	274.8721929901928	-70	21/02/24 15:39:43
48	359.71539802123624	270.3627156374419	-44	21/02/24 15:39:43
70	354.00615228730356	275.4057508623367	-60	21/02/24 15:39:43
72	351.7036384177675	279.76339408968084	-66	21/02/24 15:39:43
74	352.9593013884277	269.63778806869993	-56	21/02/24 15:39:43
86	350.1628416731088	269.22923203576335	-61	21/02/24 15:39:43
75	345.422303169174	268.92405221690683	-68	21/02/24 15:39:43
91	363.0126439033423	266.55258353919857	-45	21/02/24 15:39:43
58	344.13983712780936	263.8974009792962	-66	21/02/24 15:39:43

64	355.46634984848305	285.2501123182773	-68	21/02/24 15:39:44
63	357.8525041421261	284.81168444961594	-69	21/02/24 15:39:44
51	371.82875941078663	284.0102094476785	-69	21/02/24 15:39:44
71	355.13152078843456	277.03571032779917	-62	21/02/24 15:39:44
67	371.3904859622165	276.17892239365233	-66	21/02/24 15:39:44
68	376.468705051432	275.2257723625666	-68	21/02/24 15:39:44
66	375.6890666864942	274.8721929901928	-70	21/02/24 15:39:44
48	359.71539802123624	270.3627156374419	-43	21/02/24 15:39:44
70	354.00615228730356	275.4057508623367	-62	21/02/24 15:39:44
72	351.7036384177675	279.76339408968084	-65	21/02/24 15:39:44
74	352.9593013884277	269.63778806869993	-58	21/02/24 15:39:44
86	350.1628416731088	269.22923203576335	-60	21/02/24 15:39:44
75	345.422303169174	268.92405221690683	-66	21/02/24 15:39:44
91	363.0126439033423	266.55258353919857	-47	21/02/24 15:39:44
58	344.13983712780936	263.8974009792962	-68	21/02/24 15:39:44

64	355.46634984848305	285.2501123182773	-71	21/02/24 15:39:45
63	357.8525041421261	284.81168444961594	-67	21/02/24 15:39:45
71	355.13152078843456	277.03571032779917	-63	21/02/24 15:39:45
67	371.3904859622165	276.17892239365233	-66	21/02/24 15:39:45
68	376.468705051432	275.2257723625666	-69	21/02/24 15:39:45
66	375.6890666864942	274.8721929901928	-67	21/02/24 15:39:45
48	359.71539802123624	270.3627156374419	-44	21/02/24 15:39:45
70	354.00615228730356	275.4057508623367	-63	21/02/24 15:39:45
72	351.7036384177675	279.76339408968084	-65	21/02/24 15:39:45
74	352.9593013884277	269.63778806869993	-58	21/02/24 15:39:45
86	350.1628416731088	269.22923203576335	-63	21/02/24 15:39:45
75	345.422303169174	268.92405221690683	-67	21/02/24 15:39:45
91	363.0126439033423	266.55258353919857	-46	21/02/24 15:39:45
58	344.13983712780936	263.8974009792962	-67	21/02/24 15:39:45

64	355.46634984848305	285.2501123182773	-71	21/02/24 15:39:46
63	357.8525041421261	284.81168444961594	-67	21/02/24 15:39:46
71	355.13152078843456	277.03571032779917	-62	21/02/24 15:39:46
67	371.3904859622165	276.17892239365233	-64	21/02/24 15:39:46
68	376.468705051432	275.2257723625666	-68	21/02/24 15:39:46
66	375.6890666864942	274.8721929901928	-68	21/02/24 15:39:46
48	359.71539802123624	270.3627156374419	-46	21/02/24 15:39:46
70	354.00615228730356	275.4057508623367	-61	21/02/24 15:39:46
72	351.7036384177675	279.76339408968084	-66	21/02/24 15:39:46
74	352.9593013884277	269.63778806869993	-58	21/02/24 15:39:46
86	350.1628416731088	269.22923203576335	-61	21/02/24 15:39:46
75	345.422303169174	268.92405221690683	-65	21/02/24 15:39:46
91	363.0126439033423	266.55258353919857	-46	21/02/24 15:39:46
58	344.13983712780936	263.8974009792962	-66	21/02/24 15:39:46

64	355.46634984848305	285.2501123182773	-69	21/02/24 15:39:47
63	357.8525041421261	284.81168444961594	-68	21/02/24 15:39:47
71	355.13152078843456	277.03571032779917	-62	21/02/24 15:39:47
67	371.3904859622165	276.17892239365233	-65	21/02/24 15:39:47
68	376.468705051432	275.2257723625666	-68	21/02/24 15:39:47
66	375.6890666864942	274.8721929901928	-68	21/02/24 15:39:47
48	359.71539802123624	270.3627156374419	-48	21/02/24 15:39:47
70	354.00615228730356	275.4057508623367	-63	21/02/24 15:39:47
72	351.7036384177675	279.76339408968084	-68	21/02/24 15:39:47
74	352.9593013884277	269.63778806869993	-59	21/02/24 15:39:47
86	350.1628416731088	269.22923203576335	-61	21/02/24 15:39:47
75	345.422303169174	268.92405221690683	-66	21/02/24 15:39:47
91	363.0126439033423	266.55258353919857	-47	21/02/24 15:39:47
58	344.13983712780936	263.8974009792962	-68	21/02/24 15:39:47

64	355.46634984848305	285.2501123182773	-68	21/02/24 15:39:48
63	357.8525041421261	284.81168444961594	-70	21/02/24 15:39:48
71	355.13152078843456	277.03571032779917	-64	21/02/24 15:39:48
67	371.3904859622165	276.17892239365233	-66	21/02/24 15:39:48
68	376.468705051432	275.2257723625666	-69	21/02/24 15:39:48
66	375.6890666864942	274.8721929901928	-69	21/02/24 15:39:48
48	359.71539802123624	270.3627156374419	-47	21/02/24 15:39:48
70	354.00615228730356	275.4057508623367	-63	21/02/24 15:39:48
72	351.7036384177675	279.76339408968084	-68	21/02/24 15:39:48
74	352.9593013884277	269.63778806869993	-56	21/02/24 15:39:48
86	350.1628416731088	269.22923203576335	-59	21/02/24 15:39:48
75	345.422303169174	268.92405221690683	-68	21/02/24 15:39:48
91	363.0126439033423	266.55258353919857	-47	21/02/24 15:39:48
58	344.13983712780936	263.8974009792962	-68	21/02/24 15:39:48

64	355.46634984848305	285.2501123182773	-68	21/02/24 15:39:49
63	357.8525041421261	284.81168444961594	-68	21/02/24 15:39:49
71	355.13152078843456	277.03571032779917	-61	21/02/24 15:39:49
67	371.3904859622165	276.17892239365233	-66	21/02/24 15:39:49
68	376.468705051432	275.2257723625666	-70	21/02/24 15:39:49
66	375.6890666864942	274.8721929901928	-69	21/02/24 15:39:49
48	359.71539802123624	270.3627156374419	-50	21/02/24 15:39:49
70	354.00615228730356	275.4057508623367	-62	21/02/24 15:39:49
72	351.7036384177675	279.76339408968084	-68	21/02/24 15:39:49
74	352.9593013884277	269.63778806869993	-58	21/02/24 15:39:49
86	350.1628416731088	269.22923203576335	-62	21/02/24 15:39:49
75	345.422303169174	268.92405221690683	-66	21/02/24 15:39:49
91	363.0126439033423	266.55258353919857	-48	21/02/24 15:39:49
58	344.13983712780936	263.8974009792962	-69	21/02/24 15:39:49

64	355.46634984848305	285.2501123182773	-69	21/02/24 15:39:50
63	357.8525041421261	284.81168444961594	-70	21/02/24 15:39:50
71	355.13152078843456	277.03571032779917	-61	21/02/24 15:39:50
67	371.3904859622165	276.17892239365233	-67	21/02/24 15:39:50
68	376.468705051432	275.2257723625666	-69	21/02/24 15:39:50
66	375.6890666864942	274.8721929901928	-70	21/02/24 15:39:50
48	359.71539802123624	270.3627156374419	-46	21/02/24 15:39:50
70	354.00615228730356	275.4057508623367	-63	21/02/24 15:39:50
72	351.7036384177675	279.76339408968084	-66	21/02/24 15:39:50
74	352.9593013884277	269.63778806869993	-57	21/02/24 15:39:50
86	350.1628416731088	269.22923203576335	-62	21/02/24 15:39:50
75	345.422303169174	268.92405221690683	-66	21/02/24 15:39:50
91	363.0126439033423	266.55258353919857	-48	21/02/24 15:39:50
58	344.13983712780936	263.8974009792962	-67	21/02/24 15:39:50

64	355.46634984848305	285.2501123182773	-70	21/02/24 15:39:51
63	357.8525041421261	284.81168444961594	-68	21/02/24 15:39:51
71	355.13152078843456	277.03571032779917	-62	21/02/24 15:39:51
67	371.3904859622165	276.17892239365233	-66	21/02/24 15:39:51
68	376.468705051432	275.2257723625666	-71	21/02/24 15:39:51
66	375.6890666864942	274.8721929901928	-70	21/02/24 15:39:51
48	359.71539802123624	270.3627156374419	-47	21/02/24 15:39:51
70	354.00615228730356	275.4057508623367	-62	21/02/24 15:39:51
72	351.7036384177675	279.76339408968084	-67	21/02/24 15:39:51
74	352.9593013884277	269.63778806869993	-57	21/02/24 15:39:51
86	350.1628416731088	269.22923203576335	-60	21/02/24 15:39:51
75	345.422303169174	268.92405221690683	-65	21/02/24 15:39:51
91	363.0126439033423	266.55258353919857	-50	21/02/24 15:39:51
58	344.13983712780936	263.8974009792962	-69	21/02/24 15:39:51

64	355.46634984848305	285.2501123182773	-69	21/02/24 15:39:52
63	357.8525041421261	284.81168444961594	-71	21/02/24 15:39:52
71	355.13152078843456	277.03571032779917	-64	21/02/24 15:39:52
67	371.3904859622165	276.17892239365233	-66	21/02/24 15:39:52
68	376.468705051432	275.2257723625666	-69	21/02/24 15:39:52
66	375.6890666864942	274.8721929901928	-70	21/02/24 15:39:52
48	359.71539802123624	270.3627156374419	-50	21/02/24 15:39:52
70	354.00615228730356	275.4057508623367	-63	21/02/24 15:39:52
72	351.7036384177675	279.76339408968084	-68	21/02/24 15:39:52
74	352.9593013884277	269.63778806869993	-57	21/02/24 15:39:52
86	350.1628416731088	269.22923203576335	-59	21/02/24 15:39:52
75	345.422303169174	268.92405221690683	-64	21/02/24 15:39:52
91	363.0126439033423	266.55258353919857	-51	21/02/24 15:39:52
58	344.13983712780936	263.8974009792962	-67	21/02/24 15:39:52

64	355.46634984848305	285.2501123182773	-69	21/02/24 15:39:53
63	357.8525041421261	284.81168444961594	-69	21/02/24 15:39:53
71	355.13152078843456	277.03571032779917	-63	21/02/24 15:39:53
67	371.3904859622165	276.17892239365233	-66	21/02/24 15:39:53
68	376.468705051432	275.2257723625666	-68	21/02/24 15:39:53
66	375.6890666864942	274.8721929901928	-68	21/02/24 15:39:53
48	359.71539802123624	270.3627156374419	-51	21/02/24 15:39:53
70	354.00615228730356	275.4057508623367	-60	21/02/24 15:39:53
72	351.7036384177675	279.76339408968084	-68	21/02/24 15:39:53
74	352.9593013884277	269.63778806869993	-56	21/02/24 15:39:53
86	350.1628416731088	269.22923203576335	-62	21/02/24 15:39:53
75	345.422303169174	268.92405221690683	-66	21/02/24 15:39:53
91	363.0126439033423	266.55258353919857	-48	21/02/24 15:39:53
58	344.13983712780936	263.8974009792962	-67	21/02/24 15:39:53

64	355.46634984848305	285.2501123182773	-70	21/02/24 15:39:54
63	357.8525041421261	284.81168444961594	-67	21/02/24 15:39:54
71	355.13152078843456	277.03571032779917	-61	21/02/24 15:39:54
67	371.3904859622165	276.17892239365233	-68	21/02/24 15:39:54
68	376.468705051432	275.2257723625666	-71	21/02/24 15:39:54
66	375.6890666864942	274.8721929901928	-68	21/02/24 15:39:54
48	359.71539802123624	270.3627156374419	-49	21/02/24 15:39:54
70	354.00615228730356	275.4057508623367	-61	21/02/24 15:39:54
72	351.7036384177675	279.76339408968084	-67	21/02/24 15:39:54
74	352.9593013884277	269.63778806869993	-56	21/02/24 15:39:54
86	350.1628416731088	269.22923203576335	-58	21/02/24 15:39:54
75	345.422303169174	268.92405221690683	-64	21/02/24 15:39:54
91	363.0126439033423	266.55258353919857	-52	21/02/24 15:39:54
58	344.13983712780936	263.8974009792962	-67	21/02/24 15:39:54

64	355.46634984848305	285.2501123182773	-72	21/02/24 15:39:55
63	357.8525041421261	284.81168444961594	-71	21/02/24 15:39:55
71	355.13152078843456	277.03571032779917	-63	21/02/24 15:39:55
67	371.3904859622165	276.17892239365233	-68	21/02/24 15:39:55
68	376.468705051432	275.2257723625666	-71	21/02/24 15:39:55
66	375.6890666864942	274.8721929901928	-68	21/02/24 15:39:55
48	359.71539802123624	270.3627156374419	-50	21/02/24 15:39:55
70	354.00615228730356	275.4057508623367	-61	21/02/24 15:39:55
72	351.7036384177675	279.76339408968084	-68	21/02/24 15:39:55
74	352.9593013884277	269.63778806869993	-55	21/02/24 15:39:55
86	350.1628416731088	269.22923203576335	-58	21/02/24 15:39:55
75	345.422303169174	268.92405221690683	-66	21/02/24 15:39:55
91	363.0126439033423	266.55258353919857	-53	21/02/24 15:39:55
58	344.13983712780936	263.8974009792962	-66	21/02/24 15:39:55

64	355.46634984848305	285.2501123182773	-69	21/02/24 15:39:56
63	357.8525041421261	284.81168444961594	-68	21/02/24 15:39:56
71	355.13152078843456	277.03571032779917	-62	21/02/24 15:39:56
67	371.3904859622165	276.17892239365233	-68	21/02/24 15:39:56
68	376.468705051432	275.2257723625666	-70	21/02/24 15:39:56
66	375.6890666864942	274.8721929901928	-70	21/02/24 15:39:56
48	359.71539802123624	270.3627156374419	-50	21/02/24 15:39:56
70	354.00615228730356	275.4057508623367	-63	21/02/24 15:39:56
72	351.7036384177675	279.76339408968084	-69	21/02/24 15:39:56
74	352.9593013884277	269.63778806869993	-56	21/02/24 15:39:56
86	350.1628416731088	269.22923203576335	-60	21/02/24 15:39:56
75	345.422303169174	268.92405221690683	-65	21/02/24 15:39:56
91	363.0126439033423	266.55258353919857	-50	21/02/24 15:39:56
58	344.13983712780936	263.8974009792962	-65	21/02/24 15:39:56

64	355.46634984848305	285.2501123182773	-70	21/02/24 15:39:57
63	357.8525041421261	284.81168444961594	-71	21/02/24 15:39:57
71	355.13152078843456	277.03571032779917	-62	21/02/24 15:39:57
67	371.3904859622165	276.17892239365233	-68	21/02/24 15:39:57
68	376.468705051432	275.2257723625666	-72	21/02/24 15:39:57
66	375.6890666864942	274.8721929901928	-72	21/02/24 15:39:57
48	359.71539802123624	270.3627156374419	-51	21/02/24 15:39:57
70	354.00615228730356	275.4057508623367	-60	21/02/24 15:39:57
72	351.7036384177675	279.76339408968084	-67	21/02/24 15:39:57
74	352.9593013884277	269.63778806869993	-56	21/02/24 15:39:57
86	350.1628416731088	269.22923203576335	-58	21/02/24 15:39:57
75	345.422303169174	268.92405221690683	-65	21/02/24 15:39:57
91	363.0126439033423	266.55258353919857	-50	21/02/24 15:39:57
58	344.13983712780936	263.8974009792962	-67	21/02/24 15:39:57

64	355.46634984848305	285.2501123182773	-71	21/02/24 15:39:58
63	357.8525041421261	284.81168444961594	-68	21/02/24 15:39:58
71	355.13152078843456	277.03571032779917	-61	21/02/24 15:39:58
67	371.3904859622165	276.17892239365233	-69	21/02/24 15:39:58
66	375.6890666864942	274.8721929901928	-69	21/02/24 15:39:58
48	359.71539802123624	270.3627156374419	-50	21/02/24 15:39:58
70	354.00615228730356	275.4057508623367	-62	21/02/24 15:39:58
72	351.7036384177675	279.76339408968084	-65	21/02/24 15:39:58
74	352.9593013884277	269.63778806869993	-55	21/02/24 15:39:58
86	350.1628416731088	269.22923203576335	-58	21/02/24 15:39:58
75	345.422303169174	268.92405221690683	-66	21/02/24 15:39:58
91	363.0126439033423	266.55258353919857	-54	21/02/24 15:39:58
58	344.13983712780936	263.8974009792962	-64	21/02/24 15:39:58

64	355.46634984848305	285.2501123182773	-70	21/02/24 15:39:59
63	357.8525041421261	284.81168444961594	-70	21/02/24 15:39:59
71	355.13152078843456	277.03571032779917	-63	21/02/24 15:39:59
67	371.3904859622165	276.17892239365233	-69	21/02/24 15:39:59
66	375.6890666864942	274.8721929901928	-68	21/02/24 15:39:59
48	359.71539802123624	270.3627156374419	-52	21/02/24 15:39:59
70	354.00615228730356	275.4057508623367	-64	21/02/24 15:39:59
72	351.7036384177675	279.76339408968084	-66	21/02/24 15:39:59
74	352.9593013884277	269.63778806869993	-56	21/02/24 15:39:59
86	350.1628416731088	269.22923203576335	-59	21/02/24 15:39:59
75	345.422303169174	268.92405221690683	-67	21/02/24 15:39:59
91	363.0126439033423	266.55258353919857	-52	21/02/24 15:39:59
58	344.13983712780936	263.8974009792962	-65	21/02/24 15:39:59

63	357.8525041421261	284.81168444961594	-71	21/02/24 15:40:00
71	355.13152078843456	277.03571032779917	-65	21/02/24 15:40:00
67	371.3904859622165	276.17892239365233	-68	21/02/24 15:40:00
66	375.6890666864942	274.8721929901928	-68	21/02/24 15:40:00
48	359.71539802123624	270.3627156374419	-51	21/02/24 15:40:00
70	354.00615228730356	275.4057508623367	-62	21/02/24 15:40:00
72	351.7036384177675	279.76339408968084	-69	21/02/24 15:40:00
74	352.9593013884277	269.63778806869993	-59	21/02/24 15:40:00
86	350.1628416731088	269.22923203576335	-62	21/02/24 15:40:00
75	345.422303169174	268.92405221690683	-64	21/02/24 15:40:00
91	363.0126439033423	266.55258353919857	-50	21/02/24 15:40:00
58	344.13983712780936	263.8974009792962	-67	21/02/24 15:40:00

63	357.8525041421261	284.81168444961594	-68	21/02/24 15:40:01
71	355.13152078843456	277.03571032779917	-62	21/02/24 15:40:01
67	371.3904859622165	276.17892239365233	-68	21/02/24 15:40:01
66	375.6890666864942	274.8721929901928	-69	21/02/24 15:40:01
48	359.71539802123624	270.3627156374419	-54	21/02/24 15:40:01
70	354.00615228730356	275.4057508623367	-62	21/02/24 15:40:01
72	351.7036384177675	279.76339408968084	-67	21/02/24 15:40:01
74	352.9593013884277	269.63778806869993	-59	21/02/24 15:40:01
86	350.1628416731088	269.22923203576335	-63	21/02/24 15:40:01
75	345.422303169174	268.92405221690683	-66	21/02/24 15:40:01
91	363.0126439033423	266.55258353919857	-50	21/02/24 15:40:01
58	344.13983712780936	263.8974009792962	-65	21/02/24 15:40:01

71	355.13152078843456	277.03571032779917	-65	21/02/24 15:40:02
67	371.3904859622165	276.17892239365233	-66	21/02/24 15:40:02
66	375.6890666864942	274.8721929901928	-69	21/02/24 15:40:02
48	359.71539802123624	270.3627156374419	-55	21/02/24 15:40:02
70	354.00615228730356	275.4057508623367	-66	21/02/24 15:40:02
72	351.7036384177675	279.76339408968084	-70	21/02/24 15:40:02
74	352.9593013884277	269.63778806869993	-61	21/02/24 15:40:02
86	350.1628416731088	269.22923203576335	-63	21/02/24 15:40:02
75	345.422303169174	268.92405221690683	-65	21/02/24 15:40:02
91	363.0126439033423	266.55258353919857	-50	21/02/24 15:40:02
58	344.13983712780936	263.8974009792962	-67	21/02/24 15:40:02

71	355.13152078843456	277.03571032779917	-66	21/02/24 15:40:03
67	371.3904859622165	276.17892239365233	-67	21/02/24 15:40:03
66	375.6890666864942	274.8721929901928	-70	21/02/24 15:40:03
48	359.71539802123624	270.3627156374419	-57	21/02/24 15:40:03
70	354.00615228730356	275.4057508623367	-64	21/02/24 15:40:03
72	351.7036384177675	279.76339408968084	-67	21/02/24 15:40:03
74	352.9593013884277	269.63778806869993	-59	21/02/24 15:40:03
86	350.1628416731088	269.22923203576335	-61	21/02/24 15:40:03
75	345.422303169174	268.92405221690683	-67	21/02/24 15:40:03
91	363.0126439033423	266.55258353919857	-50	21/02/24 15:40:03
58	344.13983712780936	263.8974009792962	-65	21/02/24 15:40:03

71	355.13152078843456	277.03571032779917	-67	21/02/24 15:40:04
67	371.3904859622165	276.17892239365233	-69	21/02/24 15:40:04
66	375.6890666864942	274.8721929901928	-72	21/02/24 15:40:04
48	359.71539802123624	270.3627156374419	-57	21/02/24 15:40:04
70	354.00615228730356	275.4057508623367	-66	21/02/24 15:40:04
72	351.7036384177675	279.76339408968084	-68	21/02/24 15:40:04
74	352.9593013884277	269.63778806869993	-60	21/02/24 15:40:04
86	350.1628416731088	269.22923203576335	-63	21/02/24 15:40:04
75	345.422303169174	268.92405221690683	-65	21/02/24 15:40:04
91	363.0126439033423	266.55258353919857	-51	21/02/24 15:40:04
58	344.13983712780936	263.8974009792962	-67	21/02/24 15:40:04

71	355.13152078843456	277.03571032779917	-66	21/02/24 15:40:05
67	371.3904859622165	276.17892239365233	-68	21/02/24 15:40:05
66	375.6890666864942	274.8721929901928	-72	21/02/24 15:40:05
48	359.71539802123624	270.3627156374419	-57	21/02/24 15:40:05
70	354.00615228730356	275.4057508623367	-64	21/02/24 15:40:05
72	351.7036384177675	279.76339408968084	-70	21/02/24 15:40:05
74	352.9593013884277	269.63778806869993	-58	21/02/24 15:40:05
86	350.1628416731088	269.22923203576335	-62	21/02/24 15:40:05
75	345.422303169174	268.92405221690683	-66	21/02/24 15:40:05
91	363.0126439033423	266.55258353919857	-52	21/02/24 15:40:05
58	344.13983712780936	263.8974009792962	-68	21/02/24 15:40:05

71	355.13152078843456	277.03571032779917	-64	21/02/24 15:40:06
67	371.3904859622165	276.17892239365233	-70	21/02/24 15:40:06
66	375.6890666864942	274.8721929901928	-68	21/02/24 15:40:06
48	359.71539802123624	270.3627156374419	-57	21/02/24 15:40:06
70	354.00615228730356	275.4057508623367	-63	21/02/24 15:40:06
72	351.7036384177675	279.76339408968084	-67	21/02/24 15:40:06
74	352.9593013884277	269.63778806869993	-57	21/02/24 15:40:06
86	350.1628416731088	269.22923203576335	-63	21/02/24 15:40:06
75	345.422303169174	268.92405221690683	-65	21/02/24 15:40:06
91	363.0126439033423	266.55258353919857	-51	21/02/24 15:40:06
58	344.13983712780936	263.8974009792962	-67	21/02/24 15:40:06

71	355.13152078843456	277.03571032779917	-66	21/02/24 15:40:07
67	371.3904859622165	276.17892239365233	-68	21/02/24 15:40:07
66	375.6890666864942	274.8721929901928	-69	21/02/24 15:40:07
48	359.71539802123624	270.3627156374419	-57	21/02/24 15:40:07
70	354.00615228730356	275.4057508623367	-65	21/02/24 15:40:07
72	351.7036384177675	279.76339408968084	-67	21/02/24 15:40:07
74	352.9593013884277	269.63778806869993	-58	21/02/24 15:40:07
86	350.1628416731088	269.22923203576335	-63	21/02/24 15:40:07
75	345.422303169174	268.92405221690683	-66	21/02/24 15:40:07
91	363.0126439033423	266.55258353919857	-51	21/02/24 15:40:07
58	344.13983712780936	263.8974009792962	-65	21/02/24 15:40:07

71	355.13152078843456	277.03571032779917	-66	21/02/24 15:40:08
67	371.3904859622165	276.17892239365233	-69	21/02/24 15:40:08
68	376.468705051432	275.2257723625666	-71	21/02/24 15:40:08
66	375.6890666864942	274.8721929901928	-70	21/02/24 15:40:08
48	359.71539802123624	270.3627156374419	-55	21/02/24 15:40:08
70	354.00615228730356	275.4057508623367	-64	21/02/24 15:40:08
72	351.7036384177675	279.76339408968084	-70	21/02/24 15:40:08
74	352.9593013884277	269.63778806869993	-62	21/02/24 15:40:08
86	350.1628416731088	269.22923203576335	-65	21/02/24 15:40:08
75	345.422303169174	268.92405221690683	-65	21/02/24 15:40:08
91	363.0126439033423	266.55258353919857	-49	21/02/24 15:40:08
58	344.13983712780936	263.8974009792962	-67	21/02/24 15:40:08

71	355.13152078843456	277.03571032779917	-64	21/02/24 15:40:09
67	371.3904859622165	276.17892239365233	-69	21/02/24 15:40:09
66	375.6890666864942	274.8721929901928	-70	21/02/24 15:40:09
48	359.71539802123624	270.3627156374419	-54	21/02/24 15:40:09
70	354.00615228730356	275.4057508623367	-64	21/02/24 15:40:09
72	351.7036384177675	279.76339408968084	-70	21/02/24 15:40:09
74	352.9593013884277	269.63778806869993	-60	21/02/24 15:40:09
86	350.1628416731088	269.22923203576335	-63	21/02/24 15:40:09
75	345.422303169174	268.92405221690683	-67	21/02/24 15:40:09
91	363.0126439033423	266.55258353919857	-49	21/02/24 15:40:09
58	344.13983712780936	263.8974009792962	-67	21/02/24 15:40:09

71	355.13152078843456	277.03571032779917	-65	21/02/24 15:40:10
67	371.3904859622165	276.17892239365233	-68	21/02/24 15:40:10
66	375.6890666864942	274.8721929901928	-71	21/02/24 15:40:10
48	359.71539802123624	270.3627156374419	-54	21/02/24 15:40:10
70	354.00615228730356	275.4057508623367	-65	21/02/24 15:40:10
72	351.7036384177675	279.76339408968084	-70	21/02/24 15:40:10
74	352.9593013884277	269.63778806869993	-58	21/02/24 15:40:10
86	350.1628416731088	269.22923203576335	-62	21/02/24 15:40:10
75	345.422303169174	268.92405221690683	-68	21/02/24 15:40:10
91	363.0126439033423	266.55258353919857	-53	21/02/24 15:40:10
58	344.13983712780936	263.8974009792962	-65	21/02/24 15:40:10

71	355.13152078843456	277.03571032779917	-66	21/02/24 15:40:11
67	371.3904859622165	276.17892239365233	-68	21/02/24 15:40:11
66	375.6890666864942	274.8721929901928	-69	21/02/24 15:40:11
48	359.71539802123624	270.3627156374419	-54	21/02/24 15:40:11
70	354.00615228730356	275.4057508623367	-64	21/02/24 15:40:11
72	351.7036384177675	279.76339408968084	-68	21/02/24 15:40:11
74	352.9593013884277	269.63778806869993	-58	21/02/24 15:40:11
86	350.1628416731088	269.22923203576335	-61	21/02/24 15:40:11
75	345.422303169174	268.92405221690683	-65	21/02/24 15:40:11
91	363.0126439033423	266.55258353919857	-50	21/02/24 15:40:11
58	344.13983712780936	263.8974009792962	-68	21/02/24 15:40:11

71	355.13152078843456	277.03571032779917	-64	21/02/24 15:40:12
67	371.3904859622165	276.17892239365233	-67	21/02/24 15:40:12
66	375.6890666864942	274.8721929901928	-69	21/02/24 15:40:12
48	359.71539802123624	270.3627156374419	-56	21/02/24 15:40:12
70	354.00615228730356	275.4057508623367	-65	21/02/24 15:40:12
72	351.7036384177675	279.76339408968084	-69	21/02/24 15:40:12
74	352.9593013884277	269.63778806869993	-59	21/02/24 15:40:12
86	350.1628416731088	269.22923203576335	-64	21/02/24 15:40:12
75	345.422303169174	268.92405221690683	-66	21/02/24 15:40:12
91	363.0126439033423	266.55258353919857	-52	21/02/24 15:40:12
58	344.13983712780936	263.8974009792962	-68	21/02/24 15:40:12

71	355.13152078843456	277.03571032779917	-67	21/02/24 15:40:13
67	371.3904859622165	276.17892239365233	-67	21/02/24 15:40:13
68	376.468705051432	275.2257723625666	-70	21/02/24 15:40:13
66	375.6890666864942	274.8721929901928	-68	21/02/24 15:40:13
48	359.71539802123624	270.3627156374419	-55	21/02/24 15:40:13
70	354.00615228730356	275.4057508623367	-66	21/02/24 15:40:13
72	351.7036384177675	279.76339408968084	-69	21/02/24 15:40:13
74	352.9593013884277	269.63778806869993	-60	21/02/24 15:40:13
86	350.1628416731088	269.22923203576335	-63	21/02/24 15:40:13
75	345.422303169174	268.92405221690683	-69	21/02/24 15:40:13
91	363.0126439033423	266.55258353919857	-49	21/02/24 15:40:13
58	344.13983712780936	263.8974009792962	-66	21/02/24 15:40:13

71	355.13152078843456	277.03571032779917	-68	21/02/24 15:40:14
67	371.3904859622165	276.17892239365233	-69	21/02/24 15:40:14
66	375.6890666864942	274.8721929901928	-71	21/02/24 15:40:14
48	359.71539802123624	270.3627156374419	-55	21/02/24 15:40:14
70	354.00615228730356	275.4057508623367	-64	21/02/24 15:40:14
72	351.7036384177675	279.76339408968084	-71	21/02/24 15:40:14
74	352.9593013884277	269.63778806869993	-59	21/02/24 15:40:14
86	350.1628416731088	269.22923203576335	-65	21/02/24 15:40:14
75	345.422303169174	268.92405221690683	-66	21/02/24 15:40:14
91	363.0126439033423	266.55258353919857	-50	21/02/24 15:40:14
58	344.13983712780936	263.8974009792962	-67	21/02/24 15:40:14

71	355.13152078843456	277.03571032779917	-65	21/02/24 15:40:15
67	371.3904859622165	276.17892239365233	-70	21/02/24 15:40:15
66	375.6890666864942	274.8721929901928	-68	21/02/24 15:40:15
48	359.71539802123624	270.3627156374419	-56	21/02/24 15:40:15
70	354.00615228730356	275.4057508623367	-66	21/02/24 15:40:15
72	351.7036384177675	279.76339408968084	-69	21/02/24 15:40:15
74	352.9593013884277	269.63778806869993	-60	21/02/24 15:40:15
86	350.1628416731088	269.22923203576335	-61	21/02/24 15:40:15
75	345.422303169174	268.92405221690683	-69	21/02/24 15:40:15
91	363.0126439033423	266.55258353919857	-50	21/02/24 15:40:15
58	344.13983712780936	263.8974009792962	-66	21/02/24 15:40:15

71	355.13152078843456	277.03571032779917	-66	21/02/24 15:40:16
67	371.3904859622165	276.17892239365233	-68	21/02/24 15:40:16
68	376.468705051432	275.2257723625666	-70	21/02/24 15:40:16
66	375.6890666864942	274.8721929901928	-70	21/02/24 15:40:16
48	359.71539802123624	270.3627156374419	-57	21/02/24 15:40:16
70	354.00615228730356	275.4057508623367	-67	21/02/24 15:40:16
72	351.7036384177675	279.76339408968084	-71	21/02/24 15:40:16
74	352.9593013884277	269.63778806869993	-59	21/02/24 15:40:16
86	350.1628416731088	269.22923203576335	-62	21/02/24 15:40:16
75	345.422303169174	268.92405221690683	-69	21/02/24 15:40:16
91	363.0126439033423	266.55258353919857	-47	21/02/24 15:40:16
58	344.13983712780936	263.8974009792962	-70	21/02/24 15:40:16

71	355.13152078843456	277.03571032779917	-64	21/02/24 15:40:17
67	371.3904859622165	276.17892239365233	-68	21/02/24 15:40:17
68	376.468705051432	275.2257723625666	-70	21/02/24 15:40:17
66	375.6890666864942	274.8721929901928	-69	21/02/24 15:40:17
48	359.71539802123624	270.3627156374419	-55	21/02/24 15:40:17
70	354.00615228730356	275.4057508623367	-66	21/02/24 15:40:17
72	351.7036384177675	279.76339408968084	-67	21/02/24 15:40:17
74	352.9593013884277	269.63778806869993	-60	21/02/24 15:40:17
86	350.1628416731088	269.22923203576335	-65	21/02/24 15:40:17
75	345.422303169174	268.92405221690683	-66	21/02/24 15:40:17
91	363.0126439033423	266.55258353919857	-49	21/02/24 15:40:17
58	344.13983712780936	263.8974009792962	-68	21/02/24 15:40:17

71	355.13152078843456	277.03571032779917	-65	21/02/24 15:40:18
67	371.3904859622165	276.17892239365233	-67	21/02/24 15:40:18
68	376.468705051432	275.2257723625666	-72	21/02/24 15:40:18
66	375.6890666864942	274.8721929901928	-71	21/02/24 15:40:18
48	359.71539802123624	270.3627156374419	-55	21/02/24 15:40:18
70	354.00615228730356	275.4057508623367	-64	21/02/24 15:40:18
72	351.7036384177675	279.76339408968084	-69	21/02/24 15:40:18
74	352.9593013884277	269.63778806869993	-61	21/02/24 15:40:18
86	350.1628416731088	269.22923203576335	-63	21/02/24 15:40:18
75	345.422303169174	268.92405221690683	-69	21/02/24 15:40:18
91	363.0126439033423	266.55258353919857	-50	21/02/24 15:40:18
58	344.13983712780936	263.8974009792962	-68	21/02/24 15:40:18

71	355.13152078843456	277.03571032779917	-66	21/02/24 15:40:19
67	371.3904859622165	276.17892239365233	-70	21/02/24 15:40:19
68	376.468705051432	275.2257723625666	-72	21/02/24 15:40:19
66	375.6890666864942	274.8721929901928	-70	21/02/24 15:40:19
48	359.71539802123624	270.3627156374419	-57	21/02/24 15:40:19
70	354.00615228730356	275.4057508623367	-67	21/02/24 15:40:19
72	351.7036384177675	279.76339408968084	-68	21/02/24 15:40:19
74	352.9593013884277	269.63778806869993	-61	21/02/24 15:40:19
86	350.1628416731088	269.22923203576335	-62	21/02/24 15:40:19
75	345.422303169174	268.92405221690683	-67	21/02/24 15:40:19
91	363.0126439033423	266.55258353919857	-47	21/02/24 15:40:19
58	344.13983712780936	263.8974009792962	-68	21/02/24 15:40:19

71	355.13152078843456	277.03571032779917	-66	21/02/24 15:40:20
67	371.3904859622165	276.17892239365233	-68	21/02/24 15:40:20
66	375.6890666864942	274.8721929901928	-70	21/02/24 15:40:20
48	359.71539802123624	270.3627156374419	-57	21/02/24 15:40:20
70	354.00615228730356	275.4057508623367	-66	21/02/24 15:40:20
72	351.7036384177675	279.76339408968084	-71	21/02/24 15:40:20
74	352.9593013884277	269.63778806869993	-59	21/02/24 15:40:20
86	350.1628416731088	269.22923203576335	-63	21/02/24 15:40:20
75	345.422303169174	268.92405221690683	-66	21/02/24 15:40:20
91	363.0126439033423	266.55258353919857	-52	21/02/24 15:40:20
58	344.13983712780936	263.8974009792962	-66	21/02/24 15:40:20

71	355.13152078843456	277.03571032779917	-64	21/02/24 15:40:21
67	371.3904859622165	276.17892239365233	-69	21/02/24 15:40:21
66	375.6890666864942	274.8721929901928	-69	21/02/24 15:40:21
48	359.71539802123624	270.3627156374419	-56	21/02/24 15:40:21
70	354.00615228730356	275.4057508623367	-66	21/02/24 15:40:21
72	351.7036384177675	279.76339408968084	-69	21/02/24 15:40:21
74	352.9593013884277	269.63778806869993	-59	21/02/24 15:40:21
86	350.1628416731088	269.22923203576335	-63	21/02/24 15:40:21
75	345.422303169174	268.92405221690683	-66	21/02/24 15:40:21
91	363.0126439033423	266.55258353919857	-52	21/02/24 15:40:21
58	344.13983712780936	263.8974009792962	-65	21/02/24 15:40:21

71	355.13152078843456	277.03571032779917	-64	21/02/24 15:40:22
67	371.3904859622165	276.17892239365233	-69	21/02/24 15:40:22
66	375.6890666864942	274.8721929901928	-69	21/02/24 15:40:22
48	359.71539802123624	270.3627156374419	-55	21/02/24 15:40:22
70	354.00615228730356	275.4057508623367	-65	21/02/24 15:40:22
72	351.7036384177675	279.76339408968084	-69	21/02/24 15:40:22
74	352.9593013884277	269.63778806869993	-59	21/02/24 15:40:22
86	350.1628416731088	269.22923203576335	-64	21/02/24 15:40:22
75	345.422303169174	268.92405221690683	-67	21/02/24 15:40:22
91	363.0126439033423	266.55258353919857	-52	21/02/24 15:40:22
58	344.13983712780936	263.8974009792962	-66	21/02/24 15:40:22

71	355.13152078843456	277.03571032779917	-65	21/02/24 15:40:23
67	371.3904859622165	276.17892239365233	-69	21/02/24 15:40:23
48	359.71539802123624	270.3627156374419	-57	21/02/24 15:40:23
70	354.00615228730356	275.4057508623367	-65	21/02/24 15:40:23
72	351.7036384177675	279.76339408968084	-70	21/02/24 15:40:23
74	352.9593013884277	269.63778806869993	-58	21/02/24 15:40:23
86	350.1628416731088	269.22923203576335	-60	21/02/24 15:40:23
75	345.422303169174	268.92405221690683	-64	21/02/24 15:40:23
91	363.0126439033423	266.55258353919857	-51	21/02/24 15:40:23
58	344.13983712780936	263.8974009792962	-68	21/02/24 15:40:23

71	355.13152078843456	277.03571032779917	-65	21/02/24 15:40:24
67	371.3904859622165	276.17892239365233	-67	21/02/24 15:40:24
66	375.6890666864942	274.8721929901928	-71	21/02/24 15:40:24
48	359.71539802123624	270.3627156374419	-55	21/02/24 15:40:24
70	354.00615228730356	275.4057508623367	-63	21/02/24 15:40:24
72	351.7036384177675	279.76339408968084	-68	21/02/24 15:40:24
74	352.9593013884277	269.63778806869993	-57	21/02/24 15:40:24
86	350.1628416731088	269.22923203576335	-61	21/02/24 15:40:24
75	345.422303169174	268.92405221690683	-66	21/02/24 15:40:24
91	363.0126439033423	266.55258353919857	-53	21/02/24 15:40:24
58	344.13983712780936	263.8974009792962	-66	21/02/24 15:40:24

63	357.8525041421261	284.81168444961594	-69	21/02/24 15:40:25
71	355.13152078843456	277.03571032779917	-63	21/02/24 15:40:25
67	371.3904859622165	276.17892239365233	-69	21/02/24 15:40:25
48	359.71539802123624	270.3627156374419	-54	21/02/24 15:40:25
70	354.00615228730356	275.4057508623367	-64	21/02/24 15:40:25
72	351.7036384177675	279.76339408968084	-70	21/02/24 15:40:25
74	352.9593013884277	269.63778806869993	-57	21/02/24 15:40:25
86	350.1628416731088	269.22923203576335	-62	21/02/24 15:40:25
75	345.422303169174	268.92405221690683	-67	21/02/24 15:40:25
91	363.0126439033423	266.55258353919857	-51	21/02/24 15:40:25
58	344.13983712780936	263.8974009792962	-65	21/02/24 15:40:25

63	357.8525041421261	284.81168444961594	-70	21/02/24 15:40:26
71	355.13152078843456	277.03571032779917	-64	21/02/24 15:40:26
67	371.3904859622165	276.17892239365233	-67	21/02/24 15:40:26
48	359.71539802123624	270.3627156374419	-54	21/02/24 15:40:26
70	354.00615228730356	275.4057508623367	-65	21/02/24 15:40:26
72	351.7036384177675	279.76339408968084	-69	21/02/24 15:40:26
74	352.9593013884277	269.63778806869993	-57	21/02/24 15:40:26
86	350.1628416731088	269.22923203576335	-61	21/02/24 15:40:26
75	345.422303169174	268.92405221690683	-67	21/02/24 15:40:26
91	363.0126439033423	266.55258353919857	-55	21/02/24 15:40:26
58	344.13983712780936	263.8974009792962	-67	21/02/24 15:40:26

63	357.8525041421261	284.81168444961594	-71	21/02/24 15:40:27
71	355.13152078843456	277.03571032779917	-66	21/02/24 15:40:27
67	371.3904859622165	276.17892239365233	-69	21/02/24 15:40:27
48	359.71539802123624	270.3627156374419	-56	21/02/24 15:40:27
70	354.00615228730356	275.4057508623367	-61	21/02/24 15:40:27
72	351.7036384177675	279.76339408968084	-68	21/02/24 15:40:27
74	352.9593013884277	269.63778806869993	-55	21/02/24 15:40:27
86	350.1628416731088	269.22923203576335	-60	21/02/24 15:40:27
75	345.422303169174	268.92405221690683	-64	21/02/24 15:40:27
91	363.0126439033423	266.55258353919857	-54	21/02/24 15:40:27
58	344.13983712780936	263.8974009792962	-66	21/02/24 15:40:27

71	355.13152078843456	277.03571032779917	-65	21/02/24 15:40:28
67	371.3904859622165	276.17892239365233	-67	21/02/24 15:40:28
48	359.71539802123624	270.3627156374419	-55	21/02/24 15:40:28
70	354.00615228730356	275.4057508623367	-65	21/02/24 15:40:28
72	351.7036384177675	279.76339408968084	-66	21/02/24 15:40:28
74	352.9593013884277	269.63778806869993	-57	21/02/24 15:40:28
86	350.1628416731088	269.22923203576335	-61	21/02/24 15:40:28
75	345.422303169174	268.92405221690683	-66	21/02/24 15:40:28
91	363.0126439033423	266.55258353919857	-54	21/02/24 15:40:28
58	344.13983712780936	263.8974009792962	-65	21/02/24 15:40:28

63	357.8525041421261	284.81168444961594	-69	21/02/24 15:40:29
71	355.13152078843456	277.03571032779917	-64	21/02/24 15:40:29
67	371.3904859622165	276.17892239365233	-69	21/02/24 15:40:29
66	375.6890666864942	274.8721929901928	-71	21/02/24 15:40:29
48	359.71539802123624	270.3627156374419	-52	21/02/24 15:40:29
70	354.00615228730356	275.4057508623367	-64	21/02/24 15:40:29
72	351.7036384177675	279.76339408968084	-68	21/02/24 15:40:29
74	352.9593013884277	269.63778806869993	-57	21/02/24 15:40:29
86	350.1628416731088	269.22923203576335	-59	21/02/24 15:40:29
75	345.422303169174	268.92405221690683	-64	21/02/24 15:40:29
91	363.0126439033423	266.55258353919857	-50	21/02/24 15:40:29
58	344.13983712780936	263.8974009792962	-65	21/02/24 15:40:29

63	357.8525041421261	284.81168444961594	-69	21/02/24 15:40:30
71	355.13152078843456	277.03571032779917	-65	21/02/24 15:40:30
67	371.3904859622165	276.17892239365233	-68	21/02/24 15:40:30
66	375.6890666864942	274.8721929901928	-72	21/02/24 15:40:30
48	359.71539802123624	270.3627156374419	-56	21/02/24 15:40:30
70	354.00615228730356	275.4057508623367	-62	21/02/24 15:40:30
72	351.7036384177675	279.76339408968084	-67	21/02/24 15:40:30
74	352.9593013884277	269.63778806869993	-59	21/02/24 15:40:30
86	350.1628416731088	269.22923203576335	-60	21/02/24 15:40:30
75	345.422303169174	268.92405221690683	-67	21/02/24 15:40:30
91	363.0126439033423	266.55258353919857	-52	21/02/24 15:40:30
58	344.13983712780936	263.8974009792962	-67	21/02/24 15:40:30

71	355.13152078843456	277.03571032779917	-66	21/02/24 15:40:31
67	371.3904859622165	276.17892239365233	-68	21/02/24 15:40:31
66	375.6890666864942	274.8721929901928	-68	21/02/24 15:40:31
48	359.71539802123624	270.3627156374419	-53	21/02/24 15:40:31
70	354.00615228730356	275.4057508623367	-63	21/02/24 15:40:31
72	351.7036384177675	279.76339408968084	-68	21/02/24 15:40:31
74	352.9593013884277	269.63778806869993	-60	21/02/24 15:40:31
86	350.1628416731088	269.22923203576335	-61	21/02/24 15:40:31
75	345.422303169174	268.92405221690683	-66	21/02/24 15:40:31
91	363.0126439033423	266.55258353919857	-51	21/02/24 15:40:31
58	344.13983712780936	263.8974009792962	-65	21/02/24 15:40:31

71	355.13152078843456	277.03571032779917	-65	21/02/24 15:40:32
67	371.3904859622165	276.17892239365233	-66	21/02/24 15:40:32
66	375.6890666864942	274.8721929901928	-71	21/02/24 15:40:32
48	359.71539802123624	270.3627156374419	-57	21/02/24 15:40:32
70	354.00615228730356	275.4057508623367	-65	21/02/24 15:40:32
72	351.7036384177675	279.76339408968084	-70	21/02/24 15:40:32
74	352.9593013884277	269.63778806869993	-61	21/02/24 15:40:32
86	350.1628416731088	269.22923203576335	-63	21/02/24 15:40:32
75	345.422303169174	268.92405221690683	-65	21/02/24 15:40:32
91	363.0126439033423	266.55258353919857	-49	21/02/24 15:40:32
58	344.13983712780936	263.8974009792962	-68	21/02/24 15:40:32

71	355.13152078843456	277.03571032779917	-65	21/02/24 15:40:33
67	371.3904859622165	276.17892239365233	-68	21/02/24 15:40:33
66	375.6890666864942	274.8721929901928	-71	21/02/24 15:40:33
48	359.71539802123624	270.3627156374419	-55	21/02/24 15:40:33
70	354.00615228730356	275.4057508623367	-63	21/02/24 15:40:33
72	351.7036384177675	279.76339408968084	-69	21/02/24 15:40:33
74	352.9593013884277	269.63778806869993	-60	21/02/24 15:40:33
86	350.1628416731088	269.22923203576335	-62	21/02/24 15:40:33
75	345.422303169174	268.92405221690683	-65	21/02/24 15:40:33
91	363.0126439033423	266.55258353919857	-50	21/02/24 15:40:33
58	344.13983712780936	263.8974009792962	-68	21/02/24 15:40:33

71	355.13152078843456	277.03571032779917	-67	21/02/24 15:40:34
67	371.3904859622165	276.17892239365233	-70	21/02/24 15:40:34
66	375.6890666864942	274.8721929901928	-69	21/02/24 15:40:34
48	359.71539802123624	270.3627156374419	-56	21/02/24 15:40:34
70	354.00615228730356	275.4057508623367	-66	21/02/24 15:40:34
72	351.7036384177675	279.76339408968084	-69	21/02/24 15:40:34
74	352.9593013884277	269.63778806869993	-60	21/02/24 15:40:34
86	350.1628416731088	269.22923203576335	-63	21/02/24 15:40:34
75	345.422303169174	268.92405221690683	-68	21/02/24 15:40:34
91	363.0126439033423	266.55258353919857	-48	21/02/24 15:40:34
58	344.13983712780936	263.8974009792962	-68	21/02/24 15:40:34

71	355.13152078843456	277.03571032779917	-64	21/02/24 15:40:35
67	371.3904859622165	276.17892239365233	-67	21/02/24 15:40:35
68	376.468705051432	275.2257723625666	-69	21/02/24 15:40:35
66	375.6890666864942	274.8721929901928	-71	21/02/24 15:40:35
48	359.71539802123624	270.3627156374419	-56	21/02/24 15:40:35
70	354.00615228730356	275.4057508623367	-63	21/02/24 15:40:35
72	351.7036384177675	279.76339408968084	-69	21/02/24 15:40:35
74	352.9593013884277	269.63778806869993	-60	21/02/24 15:40:35
86	350.1628416731088	269.22923203576335	-63	21/02/24 15:40:35
75	345.422303169174	268.92405221690683	-68	21/02/24 15:40:35
91	363.0126439033423	266.55258353919857	-47	21/02/24 15:40:35
58	344.13983712780936	263.8974009792962	-68	21/02/24 15:40:35

71	355.13152078843456	277.03571032779917	-67	21/02/24 15:40:36
67	371.3904859622165	276.17892239365233	-67	21/02/24 15:40:36
68	376.468705051432	275.2257723625666	-71	21/02/24 15:40:36
66	375.6890666864942	274.8721929901928	-68	21/02/24 15:40:36
48	359.71539802123624	270.3627156374419	-54	21/02/24 15:40:36
70	354.00615228730356	275.4057508623367	-64	21/02/24 15:40:36
72	351.7036384177675	279.76339408968084	-68	21/02/24 15:40:36
74	352.9593013884277	269.63778806869993	-59	21/02/24 15:40:36
86	350.1628416731088	269.22923203576335	-64	21/02/24 15:40:36
75	345.422303169174	268.92405221690683	-68	21/02/24 15:40:36
91	363.0126439033423	266.55258353919857	-46	21/02/24 15:40:36
58	344.13983712780936	263.8974009792962	-69	21/02/24 15:40:36

71	355.13152078843456	277.03571032779917	-67	21/02/24 15:40:37
67	371.3904859622165	276.17892239365233	-68	21/02/24 15:40:37
66	375.6890666864942	274.8721929901928	-70	21/02/24 15:40:37
48	359.71539802123624	270.3627156374419	-53	21/02/24 15:40:37
70	354.00615228730356	275.4057508623367	-63	21/02/24 15:40:37
72	351.7036384177675	279.76339408968084	-67	21/02/24 15:40:37
74	352.9593013884277	269.63778806869993	-58	21/02/24 15:40:37
86	350.1628416731088	269.22923203576335	-63	21/02/24 15:40:37
75	345.422303169174	268.92405221690683	-68	21/02/24 15:40:37
91	363.0126439033423	266.55258353919857	-52	21/02/24 15:40:37
58	344.13983712780936	263.8974009792962	-66	21/02/24 15:40:37

71	355.13152078843456	277.03571032779917	-64	21/02/24 15:40:38
67	371.3904859622165	276.17892239365233	-70	21/02/24 15:40:38
66	375.6890666864942	274.8721929901928	-72	21/02/24 15:40:38
48	359.71539802123624	270.3627156374419	-54	21/02/24 15:40:38
70	354.00615228730356	275.4057508623367	-63	21/02/24 15:40:38
72	351.7036384177675	279.76339408968084	-70	21/02/24 15:40:38
74	352.9593013884277	269.63778806869993	-58	21/02/24 15:40:38
86	350.1628416731088	269.22923203576335	-60	21/02/24 15:40:38
75	345.422303169174	268.92405221690683	-66	21/02/24 15:40:38
91	363.0126439033423	266.55258353919857	-54	21/02/24 15:40:38
58	344.13983712780936	263.8974009792962	-68	21/02/24 15:40:38

71	355.13152078843456	277.03571032779917	-66	21/02/24 15:40:39
67	371.3904859622165	276.17892239365233	-69	21/02/24 15:40:39
48	359.71539802123624	270.3627156374419	-56	21/02/24 15:40:39
70	354.00615228730356	275.4057508623367	-65	21/02/24 15:40:39
72	351.7036384177675	279.76339408968084	-67	21/02/24 15:40:39
74	352.9593013884277	269.63778806869993	-57	21/02/24 15:40:39
86	350.1628416731088	269.22923203576335	-63	21/02/24 15:40:39
75	345.422303169174	268.92405221690683	-66	21/02/24 15:40:39
91	363.0126439033423	266.55258353919857	-51	21/02/24 15:40:39
58	344.13983712780936	263.8974009792962	-66	21/02/24 15:40:39

63	357.8525041421261	284.81168444961594	-72	21/02/24 15:40:40
71	355.13152078843456	277.03571032779917	-64	21/02/24 15:40:40
67	371.3904859622165	276.17892239365233	-69	21/02/24 15:40:40
48	359.71539802123624	270.3627156374419	-53	21/02/24 15:40:40
70	354.00615228730356	275.4057508623367	-62	21/02/24 15:40:40
72	351.7036384177675	279.76339408968084	-68	21/02/24 15:40:40
74	352.9593013884277	269.63778806869993	-55	21/02/24 15:40:40
86	350.1628416731088	269.22923203576335	-60	21/02/24 15:40:40
75	345.422303169174	268.92405221690683	-67	21/02/24 15:40:40
91	363.0126439033423	266.55258353919857	-53	21/02/24 15:40:40
58	344.13983712780936	263.8974009792962	-65	21/02/24 15:40:40

71	355.13152078843456	277.03571032779917	-64	21/02/24 15:40:41
67	371.3904859622165	276.17892239365233	-67	21/02/24 15:40:41
48	359.71539802123624	270.3627156374419	-55	21/02/24 15:40:41
70	354.00615228730356	275.4057508623367	-63	21/02/24 15:40:41
72	351.7036384177675	279.76339408968084	-69	21/02/24 15:40:41
74	352.9593013884277	269.63778806869993	-58	21/02/24 15:40:41
86	350.1628416731088	269.22923203576335	-58	21/02/24 15:40:41
75	345.422303169174	268.92405221690683	-65	21/02/24 15:40:41
91	363.0126439033423	266.55258353919857	-56	21/02/24 15:40:41
58	344.13983712780936	263.8974009792962	-67	21/02/24 15:40:41

71	355.13152078843456	277.03571032779917	-63	21/02/24 15:40:42
67	371.3904859622165	276.17892239365233	-70	21/02/24 15:40:42
48	359.71539802123624	270.3627156374419	-57	21/02/24 15:40:42
70	354.00615228730356	275.4057508623367	-62	21/02/24 15:40:42
72	351.7036384177675	279.76339408968084	-70	21/02/24 15:40:42
74	352.9593013884277	269.63778806869993	-56	21/02/24 15:40:42
86	350.1628416731088	269.22923203576335	-61	21/02/24 15:40:42
75	345.422303169174	268.92405221690683	-66	21/02/24 15:40:42
91	363.0126439033423	266.55258353919857	-55	21/02/24 15:40:42
58	344.13983712780936	263.8974009792962	-66	21/02/24 15:40:42

71	355.13152078843456	277.03571032779917	-66	21/02/24 15:40:43
67	371.3904859622165	276.17892239365233	-69	21/02/24 15:40:43
48	359.71539802123624	270.3627156374419	-56	21/02/24 15:40:43
70	354.00615228730356	275.4057508623367	-66	21/02/24 15:40:43
72	351.7036384177675	279.76339408968084	-66	21/02/24 15:40:43
74	352.9593013884277	269.63778806869993	-57	21/02/24 15:40:43
86	350.1628416731088	269.22923203576335	-61	21/02/24 15:40:43
75	345.422303169174	268.92405221690683	-67	21/02/24 15:40:43
91	363.0126439033423	266.55258353919857	-51	21/02/24 15:40:43
58	344.13983712780936	263.8974009792962	-68	21/02/24 15:40:43

63	357.8525041421261	284.81168444961594	-69	21/02/24 15:40:44
71	355.13152078843456	277.03571032779917	-63	21/02/24 15:40:44
67	371.3904859622165	276.17892239365233	-71	21/02/24 15:40:44
48	359.71539802123624	270.3627156374419	-53	21/02/24 15:40:44
70	354.00615228730356	275.4057508623367	-61	21/02/24 15:40:44
72	351.7036384177675	279.76339408968084	-66	21/02/24 15:40:44
74	352.9593013884277	269.63778806869993	-54	21/02/24 15:40:44
86	350.1628416731088	269.22923203576335	-58	21/02/24 15:40:44
75	345.422303169174	268.92405221690683	-64	21/02/24 15:40:44
91	363.0126439033423	266.55258353919857	-53	21/02/24 15:40:44
58	344.13983712780936	263.8974009792962	-65	21/02/24 15:40:44

63	357.8525041421261	284.81168444961594	-69	21/02/24 15:40:45
71	355.13152078843456	277.03571032779917	-64	21/02/24 15:40:45
67	371.3904859622165	276.17892239365233	-70	21/02/24 15:40:45
48	359.71539802123624	270.3627156374419	-57	21/02/24 15:40:45
70	354.00615228730356	275.4057508623367	-62	21/02/24 15:40:45
72	351.7036384177675	279.76339408968084	-67	21/02/24 15:40:45
74	352.9593013884277	269.63778806869993	-57	21/02/24 15:40:45
86	350.1628416731088	269.22923203576335	-60	21/02/24 15:40:45
75	345.422303169174	268.92405221690683	-64	21/02/24 15:40:45
91	363.0126439033423	266.55258353919857	-53	21/02/24 15:40:45
58	344.13983712780936	263.8974009792962	-66	21/02/24 15:40:45

63	357.8525041421261	284.81168444961594	-68	21/02/24 15:40:46
71	355.13152078843456	277.03571032779917	-62	21/02/24 15:40:46
67	371.3904859622165	276.17892239365233	-69	21/02/24 15:40:46
48	359.71539802123624	270.3627156374419	-53	21/02/24 15:40:46
70	354.00615228730356	275.4057508623367	-62	21/02/24 15:40:46
72	351.7036384177675	279.76339408968084	-67	21/02/24 15:40:46
74	352.9593013884277	269.63778806869993	-57	21/02/24 15:40:46
86	350.1628416731088	269.22923203576335	-57	21/02/24 15:40:46
75	345.422303169174	268.92405221690683	-65	21/02/24 15:40:46
91	363.0126439033423	266.55258353919857	-56	21/02/24 15:40:46
58	344.13983712780936	263.8974009792962	-65	21/02/24 15:40:46

63	357.8525041421261	284.81168444961594	-68	21/02/24 15:40:47
71	355.13152078843456	277.03571032779917	-66	21/02/24 15:40:47
67	371.3904859622165	276.17892239365233	-68	21/02/24 15:40:47
48	359.71539802123624	270.3627156374419	-52	21/02/24 15:40:47
70	354.00615228730356	275.4057508623367	-64	21/02/24 15:40:47
72	351.7036384177675	279.76339408968084	-67	21/02/24 15:40:47
74	352.9593013884277	269.63778806869993	-56	21/02/24 15:40:47
86	350.1628416731088	269.22923203576335	-59	21/02/24 15:40:47
75	345.422303169174	268.92405221690683	-64	21/02/24 15:40:47
91	363.0126439033423	266.55258353919857	-53	21/02/24 15:40:47
58	344.13983712780936	263.8974009792962	-63	21/02/24 15:40:47

63	357.8525041421261	284.81168444961594	-69	21/02/24 15:40:48
71	355.13152078843456	277.03571032779917	-62	21/02/24 15:40:48
67	371.3904859622165	276.17892239365233	-71	21/02/24 15:40:48
48	359.71539802123624	270.3627156374419	-52	21/02/24 15:40:48
70	354.00615228730356	275.4057508623367	-61	21/02/24 15:40:48
72	351.7036384177675	279.76339408968084	-66	21/02/24 15:40:48
74	352.9593013884277	269.63778806869993	-56	21/02/24 15:40:48
86	350.1628416731088	269.22923203576335	-61	21/02/24 15:40:48
75	345.422303169174	268.92405221690683	-65	21/02/24 15:40:48
91	363.0126439033423	266.55258353919857	-53	21/02/24 15:40:48
58	344.13983712780936	263.8974009792962	-65	21/02/24 15:40:48

71	355.13152078843456	277.03571032779917	-64	21/02/24 15:40:49
67	371.3904859622165	276.17892239365233	-68	21/02/24 15:40:49
48	359.71539802123624	270.3627156374419	-54	21/02/24 15:40:49
70	354.00615228730356	275.4057508623367	-62	21/02/24 15:40:49
72	351.7036384177675	279.76339408968084	-68	21/02/24 15:40:49
74	352.9593013884277	269.63778806869993	-57	21/02/24 15:40:49
86	350.1628416731088	269.22923203576335	-62	21/02/24 15:40:49
75	345.422303169174	268.92405221690683	-64	21/02/24 15:40:49
91	363.0126439033423	266.55258353919857	-53	21/02/24 15:40:49
58	344.13983712780936	263.8974009792962	-64	21/02/24 15:40:49

63	357.8525041421261	284.81168444961594	-71	21/02/24 15:40:50
71	355.13152078843456	277.03571032779917	-63	21/02/24 15:40:50
67	371.3904859622165	276.17892239365233	-68	21/02/24 15:40:50
48	359.71539802123624	270.3627156374419	-56	21/02/24 15:40:50
70	354.00615228730356	275.4057508623367	-62	21/02/24 15:40:50
72	351.7036384177675	279.76339408968084	-67	21/02/24 15:40:50
74	352.9593013884277	269.63778806869993	-55	21/02/24 15:40:50
86	350.1628416731088	269.22923203576335	-57	21/02/24 15:40:50
75	345.422303169174	268.92405221690683	-64	21/02/24 15:40:50
91	363.0126439033423	266.55258353919857	-53	21/02/24 15:40:50
58	344.13983712780936	263.8974009792962	-65	21/02/24 15:40:50

63	357.8525041421261	284.81168444961594	-71	21/02/24 15:40:51
71	355.13152078843456	277.03571032779917	-64	21/02/24 15:40:51
67	371.3904859622165	276.17892239365233	-68	21/02/24 15:40:51
48	359.71539802123624	270.3627156374419	-56	21/02/24 15:40:51
70	354.00615228730356	275.4057508623367	-63	21/02/24 15:40:51
72	351.7036384177675	279.76339408968084	-68	21/02/24 15:40:51
74	352.9593013884277	269.63778806869993	-56	21/02/24 15:40:51
86	350.1628416731088	269.22923203576335	-58	21/02/24 15:40:51
75	345.422303169174	268.92405221690683	-63	21/02/24 15:40:51
91	363.0126439033423	266.55258353919857	-55	21/02/24 15:40:51
58	344.13983712780936	263.8974009792962	-65	21/02/24 15:40:51

71	355.13152078843456	277.03571032779917	-65	21/02/24 15:40:52
67	371.3904859622165	276.17892239365233	-68	21/02/24 15:40:52
48	359.71539802123624	270.3627156374419	-57	21/02/24 15:40:52
70	354.00615228730356	275.4057508623367	-63	21/02/24 15:40:52
72	351.7036384177675	279.76339408968084	-67	21/02/24 15:40:52
74	352.9593013884277	269.63778806869993	-58	21/02/24 15:40:52
86	350.1628416731088	269.22923203576335	-61	21/02/24 15:40:52
75	345.422303169174	268.92405221690683	-65	21/02/24 15:40:52
91	363.0126439033423	266.55258353919857	-55	21/02/24 15:40:52
58	344.13983712780936	263.8974009792962	-67	21/02/24 15:40:52

63	357.8525041421261	284.81168444961594	-70	21/02/24 15:40:53
71	355.13152078843456	277.03571032779917	-65	21/02/24 15:40:53
67	371.3904859622165	276.17892239365233	-67	21/02/24 15:40:53
48	359.71539802123624	270.3627156374419	-55	21/02/24 15:40:53
70	354.00615228730356	275.4057508623367	-62	21/02/24 15:40:53
72	351.7036384177675	279.76339408968084	-69	21/02/24 15:40:53
74	352.9593013884277	269.63778806869993	-54	21/02/24 15:40:53
86	350.1628416731088	269.22923203576335	-59	21/02/24 15:40:53
75	345.422303169174	268.92405221690683	-63	21/02/24 15:40:53
91	363.0126439033423	266.55258353919857	-53	21/02/24 15:40:53
58	344.13983712780936	263.8974009792962	-65	21/02/24 15:40:53

