floorId	partitionId	location_x	location_y	timeStamp
21	973	363.46190923274304	285.7622191204947	21/02/21 12:29:17
21	973	363.46190923274304	285.7622191204947	21/02/21 12:29:18
21	973	363.46190923274304	285.7622191204947	21/02/21 12:29:19
21	973	363.46190923274304	285.7622191204947	21/02/21 12:29:20
21	973	364.0877499937057	281.4236109242709	21/02/21 12:29:21
21	914	366.7826166561467	279.36632997010173	21/02/21 12:29:22
21	923	368.72145465605416	283.88206217359806	21/02/21 12:29:23
21	902	372.88239338054524	282.4482899204543	21/02/21 12:29:24
21	977	375.52217866734185	286.1127270133508	21/02/21 12:29:25
21	977	377.8855932153854	286.0107205644617	21/02/21 12:29:26
21	977	378.9324607046865	288.30281388912243	21/02/21 12:29:27
21	977	378.9324607046865	288.30281388912243	21/02/21 12:29:28
21	977	378.9324607046865	288.30281388912243	21/02/21 12:29:29
