floorId	partitionId	location_x	location_y	timeStamp
3	68	354.1496423290209	257.0050926698604	20/04/28 05:17:35
3	68	354.1030021594555	257.25443251597727	20/04/28 05:17:35
3	68	354.0578460473892	257.4958385429875	20/04/28 05:17:35
3	68	354.0285881234712	257.65225234498257	20/04/28 05:17:35
3	68	354.0005769824327	257.8020008056161	20/04/28 05:17:35
3	68	353.96572010189317	257.9883468097329	20/04/28 05:17:36
3	68	353.96572010189317	257.9883468097329	20/04/28 05:17:36
3	68	353.9136451509229	258.2667411719849	20/04/28 05:17:36
3	68	353.85873948114755	258.5602686479849	20/04/28 05:17:36
3	68	353.82515034477524	258.73983725102215	20/04/28 05:17:36
3	68	353.7855513071581	258.9515349793507	20/04/28 05:17:36
3	68	353.7408975779738	259.1902552513205	20/04/28 05:17:36
3	68	353.6880270765894	259.4729026516656	20/04/28 05:17:36
3	68	353.63308066404346	259.766647939827	20/04/28 05:17:36
3	68	353.59252428419484	259.98346365050645	20/04/28 05:17:36
3	68	353.5586548705641	260.16453062477893	20/04/28 05:17:37
3	68	353.50848078836424	260.4327628814657	20/04/28 05:17:37
3	8	353.4883199765263	260.5962127408468	20/04/28 05:17:37
3	8	353.6720626334349	260.75633607201763	20/04/28 05:17:37
3	8	353.87057837384725	260.9293334705503	20/04/28 05:17:37
3	8	354.0457630353602	261.0819988997078	20/04/28 05:17:37
3	8	354.1887835833902	261.20663477338974	20/04/28 05:17:37
3	8	354.3196013039583	261.3206364404275	20/04/28 05:17:37
3	8	354.4628115025618	261.44543758592005	20/04/28 05:17:37
3	8	354.6562442673593	261.6140054034213	20/04/28 05:17:38
3	8	354.8444723490904	261.7780375774073	20/04/28 05:17:38
3	8	355.0196163713803	261.9306675913386	20/04/28 05:17:38
3	8	355.144054940681	262.0391101194798	20/04/28 05:17:38
3	8	355.36024107739314	262.2275064611117	20/04/28 05:17:38
3	8	355.48584569915596	262.3369651507023	20/04/28 05:17:38
3	8	355.77902022097965	262.5924533527271	20/04/28 05:17:38
3	8	355.95876801120795	262.7490953400924	20/04/28 05:17:38
3	8	356.11928039105203	262.888974546082	20/04/28 05:17:38
3	8	356.3053669618769	263.05114049114866	20/04/28 05:17:38
3	8	356.5059938097087	263.2259776233509	20/04/28 05:17:39
3	8	356.5059938097087	263.2259776233509	20/04/28 05:17:39
3	8	356.6859488758106	263.3828002421707	20/04/28 05:17:39
3	8	356.9628870392085	263.6241391995891	20/04/28 05:17:39
3	8	357.13606851691753	263.7750589455774	20/04/28 05:17:39
3	8	357.13606851691753	263.7750589455774	20/04/28 05:17:39
3	54	357.3002797609627	263.978255928883	20/04/28 05:17:39
3	54	357.3755280792904	264.21836772660635	20/04/28 05:17:39
3	54	357.45180832183905	264.4617723179139	20/04/28 05:17:39
3	54	357.5209326717389	264.6823429869969	20/04/28 05:17:40
3	54	357.5735145899447	264.85012798457205	20/04/28 05:17:40
3	54	357.640008844234	265.0623062138072	20/04/28 05:17:40
3	54	357.7209555751204	265.3206012229837	20/04/28 05:17:40
3	54	357.7209555751204	265.3206012229837	20/04/28 05:17:40
3	54	357.7844423548993	265.523182824316	20/04/28 05:17:40
3	54	357.83038119727615	265.6697702600698	20/04/28 05:17:40
3	54	357.9010113861263	265.89514594945734	20/04/28 05:17:40
3	54	357.9485262566551	266.0467623740475	20/04/28 05:17:40
3	54	358.02268047547545	266.28338298146355	20/04/28 05:17:40
3	54	358.0814333041604	266.4708588962798	20/04/28 05:17:41
3	54	358.16873219402953	266.74942317321756	20/04/28 05:17:41
3	54	358.2476471401266	267.00123490796096	20/04/28 05:17:41
3	54	358.31858133208186	267.22758064868907	20/04/28 05:17:41
3	54	358.4032095392019	267.4976229752326	20/04/28 05:17:41
3	54	358.4032095392019	267.4976229752326	20/04/28 05:17:41
3	54	358.4754216792226	267.7280465533692	20/04/28 05:17:41
3	54	358.55039087395073	267.9672676884072	20/04/28 05:17:41
3	54	358.6017436950695	268.13113072841963	20/04/28 05:17:41
3	54	358.6565951691981	268.306157710464	20/04/28 05:17:41
3	54	358.8177233447921	268.8203057574316	20/04/28 05:17:42
3	54	358.8971750496772	269.07383024962115	20/04/28 05:17:42
3	54	358.8971750496772	269.07383024962115	20/04/28 05:17:42
3	54	359.0419657729876	269.53584669916296	20/04/28 05:17:42
3	54	359.09057274712717	269.69094794530264	20/04/28 05:17:42
3	54	359.1445113392116	269.86306198851173	20/04/28 05:17:42
3	54	359.1445113392116	269.86306198851173	20/04/28 05:17:42
3	54	359.2067478746637	270.06165415300904	20/04/28 05:17:42
3	54	359.29184899248014	270.3332055024784	20/04/28 05:17:42
3	54	359.3573357672262	270.54216893928105	20/04/28 05:17:43
3	54	359.4336145884894	270.7855689953724	20/04/28 05:17:43
3	54	359.5136174749091	271.040852266922	20/04/28 05:17:43
3	54	359.56212373477797	271.19563214130045	20/04/28 05:17:43
3	54	359.6205908094846	271.3821962363851	20/04/28 05:17:43
3	54	359.6859680212403	271.5908100658191	20/04/28 05:17:43
3	8	359.731289862774	271.7354286976855	20/04/28 05:17:43
3	8	359.7541880262272	271.8095050519738	20/04/28 05:17:43
3	8	359.7568295783357	271.7659477545231	20/04/28 05:17:43
3	8	359.90387950680434	271.7416274034108	20/04/28 05:17:43
3	8	359.9846691346361	271.72594577085425	20/04/28 05:17:44
3	8	360.1163807007519	271.73138608316196	20/04/28 05:17:44
3	8	359.89931753911947	271.9066467318791	20/04/28 05:17:44
3	8	360.02563933438927	272.0284446557031	20/04/28 05:17:44
3	8	359.9895484221546	271.99904309396226	20/04/28 05:17:44
3	8	360.20102072310664	271.9283990250445	20/04/28 05:17:44
3	8	360.0013615445608	271.8634785112016	20/04/28 05:17:44
3	8	360.22597053617625	271.76190114775403	20/04/28 05:17:44
3	8	360.2239762675875	271.8752297169217	20/04/28 05:17:44
3	8	360.18143546576164	271.8117445716023	20/04/28 05:17:45
3	8	360.26728543375623	271.74897653055217	20/04/28 05:17:45
3	8	360.39771413529564	271.945104391884	20/04/28 05:17:45
3	8	360.43959783543914	271.9524908191101	20/04/28 05:17:45
3	8	360.4300774156151	271.9758340350084	20/04/28 05:17:45
3	8	360.32406056286186	271.8136769720104	20/04/28 05:17:45
3	8	360.24542892082235	271.80324731414777	20/04/28 05:17:45
3	8	360.3258675653508	271.802777035636	20/04/28 05:17:45
3	8	360.2440219414872	272.02496705761246	20/04/28 05:17:45
3	8	360.21621550774694	271.92542784606786	20/04/28 05:17:45
3	8	360.43762555734133	271.7632038978459	20/04/28 05:17:46
3	8	360.19134912680084	271.643738461976	20/04/28 05:17:46
3	8	360.17873625678004	271.5576218001183	20/04/28 05:17:46
3	8	360.20558004452033	271.6779995683216	20/04/28 05:17:46
3	8	360.2073273803689	271.66012017768253	20/04/28 05:17:46
3	8	360.16174355851933	271.7067394021322	20/04/28 05:17:46
3	8	360.1633469813678	271.80315934500277	20/04/28 05:17:46
3	8	360.0068766846792	271.81326620850984	20/04/28 05:17:46
3	8	360.0556312900144	271.7509973411783	20/04/28 05:17:46
3	8	360.20174965829113	271.68697314431785	20/04/28 05:17:46
3	8	360.12750809345573	271.66840865081224	20/04/28 05:17:47
3	8	360.1164228888102	271.52016474061236	20/04/28 05:17:47
3	8	360.1343924462287	271.47549885368636	20/04/28 05:17:47
3	8	359.95392273580137	271.5395088790483	20/04/28 05:17:47
3	8	360.06955540180985	271.6353836569986	20/04/28 05:17:47
3	8	360.08461292194283	271.6182096959817	20/04/28 05:17:47
3	8	359.9603421536912	271.55959100067207	20/04/28 05:17:47
3	8	360.0620751647916	271.64724079533306	20/04/28 05:17:47
3	8	360.01695359439304	271.64886573992794	20/04/28 05:17:47
3	8	359.92213475334455	271.688795776243	20/04/28 05:17:48
3	8	359.9534147278635	271.66223172643316	20/04/28 05:17:48
3	8	359.94521785291244	271.6611561438201	20/04/28 05:17:48
3	8	359.908237221511	271.62687643533656	20/04/28 05:17:48
3	8	359.7096544156187	271.59169545747676	20/04/28 05:17:48
3	8	359.70274112774325	271.7413742851677	20/04/28 05:17:48
3	8	359.7206232759249	271.7389085281844	20/04/28 05:17:48
3	8	359.617047213885	271.7200723089369	20/04/28 05:17:48
3	8	359.6212453569576	271.49647467158997	20/04/28 05:17:48
3	8	359.4744400992912	271.41570901110725	20/04/28 05:17:48
3	8	359.48031959263693	271.4323227062096	20/04/28 05:17:49
3	8	359.2943722550424	271.39213584821476	20/04/28 05:17:49
3	8	359.3181619942203	271.3411068157119	20/04/28 05:17:49
3	8	359.3355186182459	271.32602392906887	20/04/28 05:17:49
3	8	359.37108723052006	271.3675795628006	20/04/28 05:17:49
3	8	359.5720661174866	271.2942027959092	20/04/28 05:17:49
3	8	359.33947424679343	271.3382340690484	20/04/28 05:17:49
3	8	359.5820993771069	271.1874957070768	20/04/28 05:17:49
3	8	359.52913510870866	271.1498945527615	20/04/28 05:17:49
3	8	359.76076206956486	271.0151858381069	20/04/28 05:17:49
3	8	359.69393975661285	270.9318217801937	20/04/28 05:17:50
3	8	359.59090874256617	271.0686144399247	20/04/28 05:17:50
3	8	359.53776796792886	271.0104853088832	20/04/28 05:17:50
3	8	359.552080009649	270.92772194438203	20/04/28 05:17:50
3	8	359.3924377834667	271.0298349131849	20/04/28 05:17:50
3	8	359.37458818067523	271.06740222764927	20/04/28 05:17:50
3	8	359.12127845601526	271.15370731992766	20/04/28 05:17:50
3	8	359.0411109806016	271.3227433999635	20/04/28 05:17:50
3	8	359.20499818470785	271.2798821595895	20/04/28 05:17:50
3	8	359.18891790546024	271.36357656164546	20/04/28 05:17:51
3	8	359.18891790546024	271.36357656164546	20/04/28 05:17:51
3	8	359.06811269941005	271.3523772838728	20/04/28 05:17:51
3	8	358.8821620507607	271.38837950058837	20/04/28 05:17:51
3	8	359.06608003652934	271.54220789707597	20/04/28 05:17:51
3	8	359.28614951820407	271.5566418362052	20/04/28 05:17:51
3	8	359.371980154352	271.7301108776181	20/04/28 05:17:51
3	8	359.5181826778547	271.595125803435	20/04/28 05:17:51
3	8	359.5535922764583	271.4397721023828	20/04/28 05:17:51
3	8	359.53825322620537	271.41993316418376	20/04/28 05:17:51
3	8	359.4776176319089	271.44720644728596	20/04/28 05:17:52
3	8	359.6796752774245	271.35056053488955	20/04/28 05:17:52
3	8	359.55383964248887	271.3262752457049	20/04/28 05:17:52
3	8	359.3255221767976	271.4416553148886	20/04/28 05:17:52
3	8	359.08856324096206	271.494923298435	20/04/28 05:17:52
3	8	359.1825846748973	271.44207509111595	20/04/28 05:17:52
3	8	359.0581357035783	271.5353295824625	20/04/28 05:17:52
3	8	359.12662250970897	271.58259029542324	20/04/28 05:17:52
3	8	358.99848836570555	271.82856842417254	20/04/28 05:17:52
3	8	358.98152617709445	271.99853570251366	20/04/28 05:17:52
3	8	358.99305451982616	271.99769790155966	20/04/28 05:17:53
3	8	359.1153135772897	272.0020018814923	20/04/28 05:17:53
3	8	359.1116020567127	272.00014324007185	20/04/28 05:17:53
3	8	359.089412392929	271.92963808878756	20/04/28 05:17:53
3	8	359.1740454442107	271.9770266874598	20/04/28 05:17:53
3	8	359.0764550933482	271.82590311126125	20/04/28 05:17:53
3	8	359.2890058211798	271.7875831719721	20/04/28 05:17:53
3	8	359.33098361635734	271.5913343221217	20/04/28 05:17:53
3	8	359.4755221485152	271.729168047236	20/04/28 05:17:53
3	8	359.55858415815857	271.9271422314221	20/04/28 05:17:54
3	8	359.48075390478533	271.94273430044376	20/04/28 05:17:54
3	8	359.4120272839258	271.96218767104654	20/04/28 05:17:54
3	8	359.46922457733024	271.93458459056376	20/04/28 05:17:54
3	8	359.4811173226827	272.09242082197375	20/04/28 05:17:54
3	8	359.67967803845215	271.99097119232067	20/04/28 05:17:54
3	8	359.7057186578184	272.0032078313087	20/04/28 05:17:54
3	8	359.7057435495826	272.0079696568252	20/04/28 05:17:54
3	8	359.73297264517504	272.08241927979907	20/04/28 05:17:54
3	8	359.7425547245359	272.00919240646124	20/04/28 05:17:54
3	8	359.8863417721041	271.8122306082036	20/04/28 05:17:55
3	8	359.9029353690986	271.51343378238136	20/04/28 05:17:55
3	8	359.9073206484567	271.52521591752713	20/04/28 05:17:55
3	8	359.89598907234597	271.4871907447182	20/04/28 05:17:55
3	8	359.6727838732066	271.33685369434437	20/04/28 05:17:55
3	8	359.57998393018704	271.4348276432423	20/04/28 05:17:55
3	8	359.7143792439042	271.4536871584431	20/04/28 05:17:55
3	8	359.4887758944807	271.2962385961983	20/04/28 05:17:55
3	8	359.5062181105526	271.3187987960447	20/04/28 05:17:55
3	8	359.5276164199852	271.30126101050814	20/04/28 05:17:55
3	8	359.4221641490751	271.17743916479196	20/04/28 05:17:56
3	8	359.59825195979533	271.09255133371454	20/04/28 05:17:56
3	8	359.6547831765555	271.12183352259	20/04/28 05:17:56
3	8	359.49687624494527	270.88088205519205	20/04/28 05:17:56
3	8	359.4327245364662	270.9135444696419	20/04/28 05:17:56
3	8	359.4688238670866	270.6844765819527	20/04/28 05:17:56
3	8	359.49996465011236	270.72790175121514	20/04/28 05:17:56
3	8	359.41028127889484	270.7817939069998	20/04/28 05:17:56
3	8	359.4766580647177	270.7197327415399	20/04/28 05:17:56
3	8	359.4717283236793	270.7192521194083	20/04/28 05:17:57
3	8	359.29882163642105	270.7466077323717	20/04/28 05:17:57
3	8	359.38932783246224	270.6777711352721	20/04/28 05:17:57
3	8	359.34596670014616	270.43912201320103	20/04/28 05:17:57
3	8	359.3370817791705	270.4272975115393	20/04/28 05:17:57
3	8	359.4218356774342	270.5057765301538	20/04/28 05:17:57
3	8	359.3958007238595	270.4165933293351	20/04/28 05:17:57
3	8	359.42474738081	270.56759892602423	20/04/28 05:17:57
3	8	359.5004436715056	270.3006004366736	20/04/28 05:17:57
3	8	359.4198423116004	270.479372272762	20/04/28 05:17:57
3	8	359.32328939750454	270.2855810132169	20/04/28 05:17:58
3	8	359.18620892903806	270.3900777038828	20/04/28 05:17:58
3	8	359.2189506956313	270.3968629247914	20/04/28 05:17:58
3	8	359.3320385210217	270.54445009309643	20/04/28 05:17:58
3	8	359.2603300156182	270.36137509866535	20/04/28 05:17:58
3	8	359.328049539099	270.47341710991134	20/04/28 05:17:58
3	8	359.4934600537182	270.2807592006112	20/04/28 05:17:58
3	8	359.4481502229552	270.31589875020194	20/04/28 05:17:58
3	8	359.4701126597397	270.2484479960424	20/04/28 05:17:58
3	8	359.48996298726695	270.4209114930006	20/04/28 05:17:59
3	8	359.6665986923628	270.3977061291548	20/04/28 05:17:59
3	8	359.7396209950243	270.49318922808135	20/04/28 05:17:59
3	8	359.6252267359876	270.4136661343927	20/04/28 05:17:59
3	8	359.5527086693398	270.19169974850473	20/04/28 05:17:59
3	8	359.534806078201	270.43866423476186	20/04/28 05:17:59
3	8	359.5607992384807	270.67668562519754	20/04/28 05:17:59
3	8	359.5949819732634	270.67081571423074	20/04/28 05:17:59
3	8	359.5764517700685	270.37186673087507	20/04/28 05:17:59
3	8	359.49177806283234	270.1617852296165	20/04/28 05:17:59
3	8	359.50623017938557	270.0673347778246	20/04/28 05:18:00
3	8	359.57508410224335	270.13420674995155	20/04/28 05:18:00
3	8	359.44974667091924	270.39811071638366	20/04/28 05:18:00
3	8	359.69584870070213	270.4342543131913	20/04/28 05:18:00
3	8	359.6527319102405	270.3903347434548	20/04/28 05:18:00
3	8	359.725749860854	270.3179020181005	20/04/28 05:18:00
3	8	359.69017672989634	270.3417187754777	20/04/28 05:18:00
3	8	359.5511348711761	270.25753837161847	20/04/28 05:18:00
3	8	359.64734385668453	270.5298511601771	20/04/28 05:18:00
3	8	359.7217006118235	270.25955488269216	20/04/28 05:18:00
3	8	359.9771804024746	270.33069268223596	20/04/28 05:18:01
3	8	359.82331141532416	270.264614753742	20/04/28 05:18:01
3	8	359.82307484994266	270.26391112086367	20/04/28 05:18:01
3	8	360.0642143211195	270.26806393546036	20/04/28 05:18:01
3	8	360.043251178011	270.2709872522728	20/04/28 05:18:01
3	8	360.1818240264268	270.3135155578004	20/04/28 05:18:01
3	8	360.2237042782514	270.3706320516409	20/04/28 05:18:01
3	8	360.01075626007247	270.2132169652033	20/04/28 05:18:01
3	8	359.82006098073344	270.24008875702884	20/04/28 05:18:01
3	8	359.80210650530563	270.249399653108	20/04/28 05:18:02
3	8	359.7880177842321	270.2215044516383	20/04/28 05:18:02
3	8	359.88797990525364	270.42827055207897	20/04/28 05:18:02
3	8	359.70274533314125	270.2821618866616	20/04/28 05:18:02
3	8	359.6661489123018	269.99682648797256	20/04/28 05:18:02
3	8	359.49817893676567	269.87931528444653	20/04/28 05:18:02
3	8	359.49817893676567	269.87931528444653	20/04/28 05:18:02
3	8	359.49817893676567	269.87931528444653	20/04/28 05:18:02
3	8	359.43839885734695	269.63397548064256	20/04/28 05:18:02
3	8	359.38810724146936	269.4275767054592	20/04/28 05:18:02
3	8	359.33512753697426	269.21014590856504	20/04/28 05:18:03
3	8	359.26634300960364	268.92785149520967	20/04/28 05:18:03
3	8	359.23005977430654	268.77894366645273	20/04/28 05:18:03
3	8	359.16620468459405	268.516879859675	20/04/28 05:18:03
3	8	359.1181060353531	268.31948110606413	20/04/28 05:18:03
3	8	359.05936411210394	268.0784019361274	20/04/28 05:18:03
3	8	358.9976284214133	267.82503622652973	20/04/28 05:18:03
3	8	358.9500930097407	267.629949022115	20/04/28 05:18:03
3	8	358.90363535799406	267.4392849869457	20/04/28 05:18:03
3	8	358.8611940614755	267.26510423204724	20/04/28 05:18:04
3	8	358.8175469702229	267.08597484800083	20/04/28 05:18:04
3	8	358.7583043076993	266.84284062433136	20/04/28 05:18:04
3	8	358.7090067398632	266.6405214615178	20/04/28 05:18:04
3	8	358.67122770769646	266.4854748234101	20/04/28 05:18:04
3	8	358.6125795401755	266.2447804306799	20/04/28 05:18:04
3	8	358.54582595597924	265.97082108821735	20/04/28 05:18:04
3	8	358.5026305180655	265.7935453072876	20/04/28 05:18:04
3	8	358.4560900398182	265.60254134889294	20/04/28 05:18:04
3	8	358.3890871406406	265.3275588079132	20/04/28 05:18:04
3	8	358.35301748022664	265.1795274989006	20/04/28 05:18:05
3	8	358.28536740199223	264.9018889095455	20/04/28 05:18:05
3	8	358.24317764210247	264.72874047089283	20/04/28 05:18:05
3	8	358.19855757312985	264.54561794790686	20/04/28 05:18:05
3	8	358.1602440197022	264.3883776134615	20/04/28 05:18:05
3	8	358.10850456250927	264.1760368404135	20/04/28 05:18:05
3	8	358.04112136542096	263.8994935418083	20/04/28 05:18:05
3	34	358.2107559741524	263.79910936707915	20/04/28 05:18:05
3	34	358.36025655688314	263.71456082531313	20/04/28 05:18:05
3	34	358.5394648181535	263.6132114065612	20/04/28 05:18:05
3	34	358.72315338580574	263.50932819587126	20/04/28 05:18:06
3	34	358.981906765782	263.3629928401528	20/04/28 05:18:06
3	34	359.12518471852076	263.28196344381195	20/04/28 05:18:06
3	34	359.32883260406334	263.1667924428576	20/04/28 05:18:06
3	34	359.5825269288722	263.02331818459646	20/04/28 05:18:06
3	34	359.8065300699269	262.8966354748622	20/04/28 05:18:06
3	34	359.95335673804703	262.8135991384469	20/04/28 05:18:06
3	34	360.1498026785333	262.7025011246426	20/04/28 05:18:06
3	34	360.34785999490975	262.5904918135092	20/04/28 05:18:06
3	34	360.51098911158374	262.49823579227876	20/04/28 05:18:07
3	34	360.64567827154326	262.4220637007841	20/04/28 05:18:07
3	34	360.8336270854235	262.3157711509494	20/04/28 05:18:07
3	34	361.05905175076725	262.18828451253785	20/04/28 05:18:07
3	34	361.22193978690103	262.0961648319675	20/04/28 05:18:07
3	34	361.47032003899034	261.95569589375975	20/04/28 05:18:07
3	34	361.69338431797684	261.8295441479678	20/04/28 05:18:07
3	34	361.8475490124258	261.7423578650157	20/04/28 05:18:07
3	34	362.01299654915306	261.64879068478433	20/04/28 05:18:07
3	34	362.2470577908634	261.5164197180023	20/04/28 05:18:07
3	34	362.48556131484827	261.3815364634313	20/04/28 05:18:08
3	34	362.7403536771823	261.2374412211588	20/04/28 05:18:08
3	34	362.94110340641384	261.12390924317975	20/04/28 05:18:08
3	34	363.1202345767197	261.0226034224427	20/04/28 05:18:08
3	34	363.2820685094863	260.9310798793652	20/04/28 05:18:08
3	34	363.48260151549107	260.817670467014	20/04/28 05:18:08
3	34	363.66020270606754	260.71722991083107	20/04/28 05:18:08
3	34	363.8626589215347	260.6027328468294	20/04/28 05:18:08
3	34	363.91305240371696	260.35960986719283	20/04/28 05:18:08
3	34	363.9427802465622	260.08827321797537	20/04/28 05:18:08
3	34	363.9627594338286	259.90591603332643	20/04/28 05:18:09
3	34	363.98609145183457	259.6929563638953	20/04/28 05:18:09
3	34	364.00569727219835	259.5140070324432	20/04/28 05:18:09
3	34	364.027008737856	259.3194896666334	20/04/28 05:18:09
3	34	364.0482103845131	259.125974658102	20/04/28 05:18:09
3	34	364.0762813487019	258.8697609327083	20/04/28 05:18:09
3	34	364.101205745376	258.64226705390547	20/04/28 05:18:09
3	34	364.13331925051153	258.34915561210084	20/04/28 05:18:09
3	34	364.15585356014714	258.14347691214334	20/04/28 05:18:09
3	34	364.18185948772646	257.90611151412594	20/04/28 05:18:10
3	34	364.20603365573675	257.6854652405408	20/04/28 05:18:10
3	34	364.22917966070474	257.47420337860615	20/04/28 05:18:10
3	34	364.2540587003266	257.2471234898338	20/04/28 05:18:10
3	34	364.2826562116344	256.9861037806475	20/04/28 05:18:10
3	34	364.3045583366482	256.7861952557364	20/04/28 05:18:10
3	34	364.32663785203226	256.5846676254996	20/04/28 05:18:10
3	17	364.33608333333336	256.40764666796684	20/04/28 05:18:10
3	17	364.33608333333336	256.1748551726868	20/04/28 05:18:10
3	17	364.33608333333336	255.89381597963646	20/04/28 05:18:10
3	17	364.33608333333336	255.65633306117476	20/04/28 05:18:11
3	17	364.33608333333336	255.47972520288508	20/04/28 05:18:11
3	17	364.33608333333336	255.2845565204245	20/04/28 05:18:11
3	17	364.33608333333336	255.1197497944547	20/04/28 05:18:11
3	17	364.33608333333336	254.96026156890835	20/04/28 05:18:11
3	17	364.33608333333336	254.7147340835691	20/04/28 05:18:11
3	17	364.33608333333336	254.44955364904868	20/04/28 05:18:11
3	17	364.33608333333336	254.1558442224469	20/04/28 05:18:11
3	17	364.33608333333336	254.00214854940202	20/04/28 05:18:11
3	17	364.33608333333336	253.8465111602531	20/04/28 05:18:11
3	17	364.33608333333336	253.5698821777293	20/04/28 05:18:12
3	17	364.33608333333336	253.28619647334628	20/04/28 05:18:12
3	17	364.33608333333336	253.06901367598925	20/04/28 05:18:12
3	17	364.33608333333336	252.8395948005591	20/04/28 05:18:12
3	17	364.33608333333336	252.5926687930006	20/04/28 05:18:12
3	17	364.33608333333336	252.39727388416267	20/04/28 05:18:12
3	17	364.33608333333336	252.1751175138948	20/04/28 05:18:12
3	17	364.33608333333336	251.87992665895626	20/04/28 05:18:12
3	17	364.33608333333336	251.70514321228885	20/04/28 05:18:12
3	17	364.33608333333336	251.4850190814394	20/04/28 05:18:13
3	17	364.33608333333336	251.27327200146323	20/04/28 05:18:13
3	17	364.33608333333336	251.11586077430275	20/04/28 05:18:13
3	17	364.33608333333336	250.9056478959201	20/04/28 05:18:13
3	17	364.33608333333336	250.6209177142186	20/04/28 05:18:13
3	57	364.17507753722793	250.6686463834372	20/04/28 05:18:13
3	57	363.9415582634259	250.73957686708536	20/04/28 05:18:13
3	57	363.701001847733	250.81264485257523	20/04/28 05:18:13
3	57	363.49063724365107	250.8765422040317	20/04/28 05:18:13
3	57	363.2623627246403	250.94587961577662	20/04/28 05:18:13
3	57	363.04015861061634	251.01337316789213	20/04/28 05:18:14
3	57	362.79089929055914	251.08908462347185	20/04/28 05:18:14
3	57	362.6429428513493	251.1340257609683	20/04/28 05:18:14
3	57	362.4072722683834	251.20560969560142	20/04/28 05:18:14
3	57	362.1935286074784	251.27053342115897	20/04/28 05:18:14
3	57	361.9839976850913	251.3341775453556	20/04/28 05:18:14
3	57	361.8001320454383	251.39002594936323	20/04/28 05:18:14
3	57	361.63798947363904	251.43927606414147	20/04/28 05:18:14
3	57	361.4801909682694	251.4872066872656	20/04/28 05:18:14
3	57	361.21810398422923	251.56681449108063	20/04/28 05:18:14
3	57	360.94013261803633	251.65124710824063	20/04/28 05:18:15
3	57	360.73370887055904	251.71394744130797	20/04/28 05:18:15
3	57	360.49564067259814	251.78625964127193	20/04/28 05:18:15
3	57	360.2457964199439	251.86214876763376	20/04/28 05:18:15
3	57	359.97744180806933	251.94366033667714	20/04/28 05:18:15
3	57	359.74913988134864	252.01300607339707	20/04/28 05:18:15
3	57	359.47550461339563	252.0961216192066	20/04/28 05:18:15
3	57	359.32405434665003	252.14212399191874	20/04/28 05:18:15
3	57	359.0882865237644	252.21373746276282	20/04/28 05:18:15
3	17	358.98040689390876	252.24650544031286	20/04/28 05:18:16
3	17	358.83892981587746	252.3002791407214	20/04/28 05:18:16
3	17	358.67481630334964	252.24786870565512	20/04/28 05:18:16
3	17	358.50907733074064	252.1621637987033	20/04/28 05:18:16
3	17	358.61632395886505	251.99902137390833	20/04/28 05:18:16
3	17	358.66898693781724	252.02850247365683	20/04/28 05:18:16
3	17	358.79288085547114	252.01138695611576	20/04/28 05:18:16
3	17	358.68356114639323	251.7677489007118	20/04/28 05:18:16
3	17	358.7036520154173	251.7710405068396	20/04/28 05:18:16
3	17	358.870301090761	252.0095821234672	20/04/28 05:18:16
3	17	358.7953750523132	252.044683871457	20/04/28 05:18:17
3	17	358.5893764224927	251.99076840272582	20/04/28 05:18:17
3	17	358.5880452203659	251.80321117090796	20/04/28 05:18:17
3	17	358.64624523002396	251.86970762688588	20/04/28 05:18:17
3	17	358.7685074504126	251.66656773846083	20/04/28 05:18:17
3	17	358.74121468489966	251.6980388503815	20/04/28 05:18:17
3	17	358.61436064495894	251.47027358296566	20/04/28 05:18:17
3	17	358.58703519584003	251.4609339594436	20/04/28 05:18:17
3	17	358.66286882272806	251.39975887702948	20/04/28 05:18:17
3	17	358.9289618723723	251.51642346564262	20/04/28 05:18:17
3	17	358.8574694766807	251.4891537160665	20/04/28 05:18:18
3	17	358.5658141257989	251.48381124361782	20/04/28 05:18:18
3	17	358.521289455122	251.61143093745858	20/04/28 05:18:18
3	17	358.54732317715394	251.48631746890118	20/04/28 05:18:18
3	17	358.72976071406276	251.33934490977327	20/04/28 05:18:18
3	17	358.67673455379946	251.2732183378624	20/04/28 05:18:18
3	17	358.84834167578725	251.4634969433494	20/04/28 05:18:18
3	17	358.9206706241127	251.21191027809235	20/04/28 05:18:18
3	17	358.9163003554784	251.21450694921114	20/04/28 05:18:18
3	17	358.77025823665156	251.2218105561606	20/04/28 05:18:19
3	17	358.70275678332143	251.19032459738585	20/04/28 05:18:19
3	17	358.83625920193714	251.32877283424835	20/04/28 05:18:19
3	17	358.8590020781408	251.0591242656654	20/04/28 05:18:19
3	17	358.72736834747286	251.01352599173242	20/04/28 05:18:19
3	17	358.96846670455267	251.09421795819338	20/04/28 05:18:19
3	17	358.8307709885471	250.92495468449314	20/04/28 05:18:19
3	17	358.6685096369473	250.67437693455295	20/04/28 05:18:19
3	17	358.6761190938536	250.59454162106192	20/04/28 05:18:19
3	17	358.6550850947644	250.4773940529324	20/04/28 05:18:19
3	17	358.863697941495	250.4707427238678	20/04/28 05:18:20
3	17	358.9380565992281	250.42644953364623	20/04/28 05:18:20
3	17	358.75026386560427	250.35516017427227	20/04/28 05:18:20
3	17	358.7023706226062	250.35101445288043	20/04/28 05:18:20
3	17	358.7345572352768	250.34018336002057	20/04/28 05:18:20
3	17	358.6957697923897	250.28277022931658	20/04/28 05:18:20
3	17	358.6949573877583	250.45055775234417	20/04/28 05:18:20
3	17	358.7481330376386	250.33971394447687	20/04/28 05:18:20
3	17	358.7405126824914	250.33818853913135	20/04/28 05:18:20
3	17	358.59369830544347	250.5506303257149	20/04/28 05:18:20
3	17	358.6031668422754	250.75670695410884	20/04/28 05:18:21
3	17	358.5836357807895	250.72670456413658	20/04/28 05:18:21
3	17	358.5689707977935	250.73179640342838	20/04/28 05:18:21
3	17	358.6051217298062	250.67415556206467	20/04/28 05:18:21
3	17	358.6375337049676	250.6735080265042	20/04/28 05:18:21
3	17	358.65007669798337	250.59534198636968	20/04/28 05:18:21
3	17	358.6177852369374	250.4707271820958	20/04/28 05:18:21
3	17	358.76791955190845	250.68317403100977	20/04/28 05:18:21
3	17	358.54708873624577	250.8091681810435	20/04/28 05:18:21
3	17	358.7350792290926	250.99146984904323	20/04/28 05:18:22
3	17	358.9444956236594	250.98390499893753	20/04/28 05:18:22
3	17	359.1286058314868	251.1387242152309	20/04/28 05:18:22
3	17	359.12133489492265	251.1635432788078	20/04/28 05:18:22
3	17	359.1135966411098	251.2203463666426	20/04/28 05:18:22
3	17	358.9460217063144	251.20023002375467	20/04/28 05:18:22
3	17	359.0944675283065	251.22768275578136	20/04/28 05:18:22
3	17	359.1263837397616	251.245356608275	20/04/28 05:18:22
3	17	359.105215662672	251.16917237695895	20/04/28 05:18:22
3	17	359.0409298037287	251.09727137016904	20/04/28 05:18:22
3	17	359.1646180879402	251.30338638374081	20/04/28 05:18:23
3	17	359.24785922355454	251.38677164947805	20/04/28 05:18:23
3	17	359.1470042026451	251.30607504669587	20/04/28 05:18:23
3	17	359.3325783782207	251.49540873482925	20/04/28 05:18:23
3	17	359.1129888871933	251.49207725909596	20/04/28 05:18:23
3	17	359.1129888871933	251.49207725909596	20/04/28 05:18:23
3	17	359.08348348198047	251.50062004326983	20/04/28 05:18:23
3	17	358.99829160884593	251.3904972061	20/04/28 05:18:23
3	17	359.2232118125312	251.56606761673348	20/04/28 05:18:23
3	17	359.0290569528893	251.58906918526478	20/04/28 05:18:23
3	17	359.00326093517214	251.52105598397426	20/04/28 05:18:24
3	17	358.9416275446035	251.5503147262523	20/04/28 05:18:24
3	17	358.89075100148864	251.53067194646923	20/04/28 05:18:24
3	17	358.7701982449358	251.31532550249307	20/04/28 05:18:24
3	17	358.79694584991074	251.60920774148428	20/04/28 05:18:24
3	17	358.8973955172427	251.59645640230195	20/04/28 05:18:24
3	17	358.92191701210936	251.6390825560337	20/04/28 05:18:24
3	17	358.8841553387424	251.5869663878899	20/04/28 05:18:24
3	17	358.79321945546974	251.51512766796947	20/04/28 05:18:24
3	17	358.6574680307988	251.32492165025957	20/04/28 05:18:25
3	17	358.5788008916454	251.40012057997762	20/04/28 05:18:25
3	17	358.5801517493064	251.34998188433468	20/04/28 05:18:25
3	17	358.52307850590995	251.21989176041942	20/04/28 05:18:25
3	17	358.6059845783981	250.93308447039672	20/04/28 05:18:25
3	17	358.6735870284719	251.06939729656614	20/04/28 05:18:25
3	17	358.96465062789935	251.10183016037666	20/04/28 05:18:25
3	17	358.95991803420446	251.1561168183073	20/04/28 05:18:25
3	17	358.689456789697	251.1237936836176	20/04/28 05:18:25
3	17	358.74217185401903	251.1641777655995	20/04/28 05:18:25
3	17	358.7463157366694	251.01673348575957	20/04/28 05:18:26
3	17	358.7502959512789	251.07468054996488	20/04/28 05:18:26
3	17	358.67663231087516	251.15972691014474	20/04/28 05:18:26
3	17	358.68697641821456	251.4440342819187	20/04/28 05:18:26
3	17	358.63954182548434	251.37583849111377	20/04/28 05:18:26
3	17	358.64107579214385	251.3738111960503	20/04/28 05:18:26
3	17	358.5645226676186	251.49154375817045	20/04/28 05:18:26
3	17	358.54421217179976	251.56751227616968	20/04/28 05:18:26
3	17	358.78926287664643	251.69915136995974	20/04/28 05:18:26
3	17	358.9486497470155	251.57395512623063	20/04/28 05:18:26
3	17	358.87429987889	251.58808208498047	20/04/28 05:18:27
3	17	358.9179761773724	251.64214910483565	20/04/28 05:18:27
3	17	359.0810639405702	251.72630129835397	20/04/28 05:18:27
3	17	359.251141388018	251.96238814516923	20/04/28 05:18:27
3	17	359.3623716109829	252.19993105166827	20/04/28 05:18:27
3	17	359.16717631232564	252.20569837779473	20/04/28 05:18:27
3	17	359.120411572535	251.96725394320094	20/04/28 05:18:27
3	17	358.82520854804375	251.95917007089895	20/04/28 05:18:27
3	17	358.8516051920473	251.96677714745303	20/04/28 05:18:27
3	17	358.8000518243364	252.17817385244393	20/04/28 05:18:28
3	17	358.85707003737986	252.00654665050325	20/04/28 05:18:28
3	17	358.8474648137276	252.0088483878917	20/04/28 05:18:28
3	17	358.58975787813824	252.0401272866311	20/04/28 05:18:28
3	17	358.6273284980682	252.30464368412873	20/04/28 05:18:28
3	17	358.6135762016889	252.31347010287257	20/04/28 05:18:28
3	17	358.52139992903875	252.51918907799362	20/04/28 05:18:28
3	17	358.61169780115847	252.40583263456043	20/04/28 05:18:28
3	17	358.6167608698523	252.40746728721479	20/04/28 05:18:28
3	17	358.63176025259014	252.39714282374533	20/04/28 05:18:28
3	17	358.7754318715603	252.30521030279806	20/04/28 05:18:29
3	17	358.8372639127795	252.29384161278944	20/04/28 05:18:29
3	17	358.8768222977616	252.3524964018367	20/04/28 05:18:29
3	17	358.81796754786933	252.51125886347424	20/04/28 05:18:29
3	17	358.73240173611333	252.38398381719716	20/04/28 05:18:29
3	17	358.71260104653317	252.51581904591293	20/04/28 05:18:29
3	17	358.6717327806323	252.44011702544225	20/04/28 05:18:29
3	17	358.562970718537	252.71702306538776	20/04/28 05:18:29
3	17	358.52163904455136	252.42058310342372	20/04/28 05:18:29
3	17	358.56588421294015	252.49005815981297	20/04/28 05:18:29
3	17	358.5190159574079	252.4020172562056	20/04/28 05:18:30
3	17	358.7343816437217	252.29214587111642	20/04/28 05:18:30
3	17	358.9204025465143	252.0778353357516	20/04/28 05:18:30
3	17	359.04227996481626	251.824219522923	20/04/28 05:18:30
3	17	359.0460607210159	251.9393233876764	20/04/28 05:18:30
3	17	359.1262584207808	251.97168777570968	20/04/28 05:18:30
3	17	359.27345854004255	251.9743516258233	20/04/28 05:18:30
3	17	359.0358972954684	252.08295307375099	20/04/28 05:18:30
3	17	359.2373593943482	252.09162939285548	20/04/28 05:18:30
3	17	359.25036950493967	252.0875952096886	20/04/28 05:18:30
3	17	359.322412807385	252.24843682897378	20/04/28 05:18:31
3	17	359.27670750910164	252.08306979639994	20/04/28 05:18:31
3	17	359.3028642383415	252.0542190464552	20/04/28 05:18:31
3	17	359.2558513228857	252.29159297476437	20/04/28 05:18:31
3	17	359.0316835069372	252.09917164641877	20/04/28 05:18:31
3	17	359.03338701292495	252.11044021564632	20/04/28 05:18:31
3	17	358.93679983730334	251.89261018999287	20/04/28 05:18:31
3	17	358.89741817418826	251.77312708834825	20/04/28 05:18:31
3	17	358.8881016548319	251.78774940146843	20/04/28 05:18:31
3	17	358.75362060164804	251.811203990059	20/04/28 05:18:32
3	17	358.759547705047	251.70561505533075	20/04/28 05:18:32
3	17	358.7433591762037	251.71188024247647	20/04/28 05:18:32
3	17	358.759491397105	251.8008710128198	20/04/28 05:18:32
3	17	358.62648568452715	251.9082451271979	20/04/28 05:18:32
3	17	358.5328837646716	251.65891839587294	20/04/28 05:18:32
3	17	358.5093103524986	251.3997147243166	20/04/28 05:18:32
3	17	358.5744201046229	251.2008605264909	20/04/28 05:18:32
3	17	358.59121551293345	251.1874022483314	20/04/28 05:18:32
3	17	358.5526842901476	251.17719959002005	20/04/28 05:18:32
3	17	358.61475347886795	251.1368683436438	20/04/28 05:18:33
3	17	358.52865313224424	250.95992557656982	20/04/28 05:18:33
3	17	358.5048747847356	251.01668339323288	20/04/28 05:18:33
3	17	358.59550229351566	251.13087688513696	20/04/28 05:18:33
3	17	358.5754486391897	250.87640775549124	20/04/28 05:18:33
3	17	358.50801099819444	250.66797406542207	20/04/28 05:18:33
3	17	358.65293651999895	250.55391859038878	20/04/28 05:18:33
3	17	358.6159116738393	250.31607518348696	20/04/28 05:18:33
3	17	358.68445946402255	250.26803243652884	20/04/28 05:18:33
3	17	358.65295848428445	250.2683448284212	20/04/28 05:18:34
3	17	358.6153937623433	250.53089764621566	20/04/28 05:18:34
3	17	358.50203630143363	250.50035454574984	20/04/28 05:18:34
3	17	358.61538985561214	250.42374231808202	20/04/28 05:18:34
3	17	358.58939145494503	250.1919895699999	20/04/28 05:18:34
3	17	358.5879171702252	250.19143013002315	20/04/28 05:18:34
3	17	358.6006207742669	250.19459537960864	20/04/28 05:18:34
3	17	358.82951752657675	250.08632105120648	20/04/28 05:18:34
3	17	358.6652210881675	250.0817616259379	20/04/28 05:18:34
3	17	358.86263207303716	250.0410897713064	20/04/28 05:18:34
3	17	358.8476403003223	249.9463335809245	20/04/28 05:18:35
3	17	358.87938786336707	249.95711833892233	20/04/28 05:18:35
3	17	359.09634989735815	250.02686308866708	20/04/28 05:18:35
3	17	358.9651337542454	249.92937352985595	20/04/28 05:18:35
3	17	359.0492327652096	250.0117747341176	20/04/28 05:18:35
3	17	359.1457228380101	249.97151268179414	20/04/28 05:18:35
3	17	359.1457228380101	249.97151268179414	20/04/28 05:18:35
3	17	359.1457228380101	249.97151268179414	20/04/28 05:18:35
3	17	359.1401857455646	249.97378722971644	20/04/28 05:18:35
3	17	359.1654078181391	249.94295797133384	20/04/28 05:18:35
3	17	359.17931727833206	249.93449927827774	20/04/28 05:18:36
3	17	359.20038955261714	250.00776177153733	20/04/28 05:18:36
3	17	359.37159734692466	249.95284734763604	20/04/28 05:18:36
3	17	359.4196068796808	249.96994679699552	20/04/28 05:18:36
3	17	359.39587514475005	250.09339775040522	20/04/28 05:18:36
3	17	359.3475736954743	250.14832924876933	20/04/28 05:18:36
3	17	359.36367641806294	250.2499002174773	20/04/28 05:18:36
3	17	359.33419005114365	250.0548403067488	20/04/28 05:18:36
3	17	359.1865850612695	249.96191585938197	20/04/28 05:18:36
3	17	359.13867265593825	250.00217754986795	20/04/28 05:18:36
3	17	359.1290720200172	250.0180589168836	20/04/28 05:18:37
3	17	359.18346949540097	250.0143771956116	20/04/28 05:18:37
3	17	359.18065054461937	249.96259148484805	20/04/28 05:18:37
3	17	359.38668298605995	249.94346572218345	20/04/28 05:18:37
3	17	359.51441238099613	249.96332416118295	20/04/28 05:18:37
3	17	359.504253952269	250.03637304148577	20/04/28 05:18:37
3	17	359.6234044050938	250.26139713839777	20/04/28 05:18:37
3	17	359.72225475345874	250.2577657864525	20/04/28 05:18:37
3	17	359.7794620907824	250.1560349997832	20/04/28 05:18:37
3	17	359.62139184002183	250.28498513855482	20/04/28 05:18:38
3	17	359.61486055916816	250.15658175703294	20/04/28 05:18:38
3	17	359.5595649412283	250.20721890414129	20/04/28 05:18:38
3	17	359.5624721364132	250.42966641660865	20/04/28 05:18:38
3	17	359.51266847074066	250.60468108700775	20/04/28 05:18:38
3	17	359.325014676856	250.65384176459955	20/04/28 05:18:38
3	17	359.3693375839418	250.586822624653	20/04/28 05:18:38
3	17	359.3801406252498	250.58135077574863	20/04/28 05:18:38
3	17	359.39354089783336	250.58193012824492	20/04/28 05:18:38
3	17	359.4457473296123	250.60084586940968	20/04/28 05:18:38
3	17	359.6139442721967	250.59200057306003	20/04/28 05:18:39
3	17	359.6161670710635	250.7371979761471	20/04/28 05:18:39
3	17	359.6210520926055	250.72140123073405	20/04/28 05:18:39
3	17	359.6596403581183	250.95787636554851	20/04/28 05:18:39
3	17	359.69049956609575	250.92588349863743	20/04/28 05:18:39
3	17	359.6552789625819	251.0968686967001	20/04/28 05:18:39
3	17	359.64548249148413	251.03464003645988	20/04/28 05:18:39
3	17	359.57427131106516	251.18305039074212	20/04/28 05:18:39
3	17	359.56513139315535	251.26192024671505	20/04/28 05:18:39
3	17	359.57775049834305	251.23271831166963	20/04/28 05:18:39
3	17	359.44090847267773	251.19135615889547	20/04/28 05:18:40
3	17	359.4627521479979	251.2943455931541	20/04/28 05:18:40
3	17	359.5019580730975	251.22379561774028	20/04/28 05:18:40
3	17	359.5792602878847	251.35004106459814	20/04/28 05:18:40
3	17	359.5318953787178	251.21574553284813	20/04/28 05:18:40
3	17	359.4535643671677	251.11024852597404	20/04/28 05:18:40
3	17	359.5022803670861	251.0360630007027	20/04/28 05:18:40
3	17	359.65929333914306	250.88508928746572	20/04/28 05:18:40
3	17	359.5006617631314	250.89538319484373	20/04/28 05:18:40
3	17	359.72060534000224	251.01907607317776	20/04/28 05:18:41
3	17	359.74085580360173	251.00989338379352	20/04/28 05:18:41
3	17	359.86653671343015	251.1501479782724	20/04/28 05:18:41
3	17	359.6413283612491	250.99309793490147	20/04/28 05:18:41
3	17	359.4828950091566	251.21611431041913	20/04/28 05:18:41
3	17	359.5715150965622	251.21198188030095	20/04/28 05:18:41
3	17	359.3681492476213	251.29970196652266	20/04/28 05:18:41
3	17	359.356349157933	251.12772007867264	20/04/28 05:18:41
3	17	359.356349157933	251.12772007867264	20/04/28 05:18:41
3	17	359.356349157933	251.12772007867264	20/04/28 05:18:41
3	17	359.56057895490636	251.13023319864294	20/04/28 05:18:42
3	17	359.7584865197784	251.13266852130852	20/04/28 05:18:42
3	17	360.0385772914163	251.13611513743473	20/04/28 05:18:42
3	17	360.20212119529145	251.13812760308343	20/04/28 05:18:42
3	17	360.3818940340761	251.14033977152292	20/04/28 05:18:42
3	17	360.6480980397013	251.143615506076	20/04/28 05:18:42
3	17	360.8184539605456	251.14571179600568	20/04/28 05:18:42
3	17	361.0386045751173	251.14842082727415	20/04/28 05:18:42
3	17	361.3081963132866	251.15173824907578	20/04/28 05:18:42
3	17	361.57126305075167	251.15497537843322	20/04/28 05:18:42
3	17	361.85652132107145	251.15848558246054	20/04/28 05:18:43
3	17	362.1199838962852	251.16172758274166	20/04/28 05:18:43
3	17	362.33173083352926	251.16433320378485	20/04/28 05:18:43
3	17	362.5827600447648	251.1674222071195	20/04/28 05:18:43
3	17	362.8428488360488	251.17062269179468	20/04/28 05:18:43
3	17	363.0263431284562	251.17288065403878	20/04/28 05:18:43
3	17	363.30726291030635	251.17633747142924	20/04/28 05:18:43
3	17	363.5703674620949	251.17957506610531	20/04/28 05:18:43
3	17	363.8281982524609	251.18274776527966	20/04/28 05:18:43
3	17	364.03141932161805	251.185248472497	20/04/28 05:18:44
3	17	364.03141932161805	251.185248472497	20/04/28 05:18:44
3	17	364.2806485008449	251.1883153258004	20/04/28 05:18:44
3	34	364.33608333333336	251.36265726026443	20/04/28 05:18:44
3	34	364.33608333333336	251.52238329327065	20/04/28 05:18:44
3	34	364.33608333333336	251.7783336383781	20/04/28 05:18:44
3	34	364.33608333333336	251.92839815731062	20/04/28 05:18:44
3	34	364.33608333333336	252.14841333543646	20/04/28 05:18:44
3	34	364.33608333333336	252.33833721300473	20/04/28 05:18:44
3	34	364.33608333333336	252.57529023534215	20/04/28 05:18:44
3	34	364.33608333333336	252.73855892463092	20/04/28 05:18:45
3	34	364.33608333333336	252.9087530287639	20/04/28 05:18:45
3	34	364.33608333333336	253.1398101113966	20/04/28 05:18:45
3	34	364.33608333333336	253.37062162426025	20/04/28 05:18:45
3	34	364.33608333333336	253.56206868116362	20/04/28 05:18:45
3	34	364.33608333333336	253.78819850919882	20/04/28 05:18:45
3	34	364.33608333333336	254.07772855812368	20/04/28 05:18:45
3	34	364.33608333333336	254.26460779459097	20/04/28 05:18:45
3	34	364.33608333333336	254.4824608602114	20/04/28 05:18:45
3	34	364.33608333333336	254.4824608602114	20/04/28 05:18:45
3	34	364.33608333333336	254.6380917491948	20/04/28 05:18:46
3	34	364.33608333333336	254.88164220368742	20/04/28 05:18:46
3	34	364.33608333333336	255.10327278342808	20/04/28 05:18:46
3	34	364.33608333333336	255.30558519703078	20/04/28 05:18:46
3	34	364.33608333333336	255.5413217210429	20/04/28 05:18:46
3	34	364.33608333333336	255.76859180553896	20/04/28 05:18:46
3	34	364.33608333333336	255.96209336284954	20/04/28 05:18:46
3	34	364.32588359076715	256.1890162953652	20/04/28 05:18:46
3	34	364.2565808534628	256.35731307275586	20/04/28 05:18:46
3	34	364.19073838422133	256.51720683481796	20/04/28 05:18:47
3	34	364.11273335091215	256.7066365202362	20/04/28 05:18:47
3	34	364.01600759773464	256.9415281447758	20/04/28 05:18:47
3	34	363.9539100181038	257.09232770828714	20/04/28 05:18:47
3	34	363.87434580342796	257.2855437549601	20/04/28 05:18:47
3	34	363.8163180474915	257.426460040567	20/04/28 05:18:47
3	34	363.7156832196741	257.6708445753446	20/04/28 05:18:47
3	34	363.6372274975736	257.86136872649587	20/04/28 05:18:47
3	34	363.55416664043776	258.0630761211386	20/04/28 05:18:47
3	34	363.47085439637084	258.2653939910962	20/04/28 05:18:47
3	34	363.40959186684063	258.4141656947226	20/04/28 05:18:48
3	34	363.40959186684063	258.4141656947226	20/04/28 05:18:48
3	34	363.33672463267845	258.5911185996709	20/04/28 05:18:48
3	34	363.2584363730395	258.7812360801234	20/04/28 05:18:48
3	34	363.17199807560365	258.99114534875304	20/04/28 05:18:48
3	34	363.0668647038273	259.2464542781604	20/04/28 05:18:48
3	34	362.99249282676914	259.42706110155933	20/04/28 05:18:48
3	34	362.89898596175385	259.65413588472217	20/04/28 05:18:48
3	34	362.8393349997359	259.7989940110583	20/04/28 05:18:48
3	34	362.7327959065307	260.05771663515634	20/04/28 05:18:48
3	34	362.63708271609215	260.29014932297144	20/04/28 05:18:49
