floorId	partitionId	location_x	location_y	timeStamp
3	14	328.1643126202112	267.10583198871007	20/04/28 05:17:35
3	14	328.11844861035877	267.0457239049243	20/04/28 05:17:35
3	14	328.0792650428353	267.0032342680673	20/04/28 05:17:35
3	14	328.03593530764425	267.1676459062944	20/04/28 05:17:35
3	14	327.9912313824446	267.0820236438495	20/04/28 05:17:35
3	14	328.1091725825212	266.9392108160492	20/04/28 05:17:36
3	14	328.24169920124183	267.0579427248244	20/04/28 05:17:36
3	14	328.37260395369276	266.84586032646087	20/04/28 05:17:36
3	14	328.267482443724	266.81254758093877	20/04/28 05:17:36
3	14	328.30714008904755	266.8763568659533	20/04/28 05:17:36
3	14	328.25057616064856	266.9223900075567	20/04/28 05:17:36
3	14	328.165742879514	266.95845942279254	20/04/28 05:17:36
3	14	328.05961481038554	267.01905521096853	20/04/28 05:17:36
3	14	327.9185392737547	266.9389348441023	20/04/28 05:17:36
3	14	327.97477700299106	266.66059108064843	20/04/28 05:17:36
3	14	328.13593661547486	266.66381826533177	20/04/28 05:17:37
3	14	328.32388406075495	266.8105246491344	20/04/28 05:17:37
3	14	328.1065811112504	266.7398906906648	20/04/28 05:17:37
3	14	328.1508582081016	266.71083174873814	20/04/28 05:17:37
3	14	328.16559201577485	266.7570557005706	20/04/28 05:17:37
3	14	328.139918808832	266.7858246764058	20/04/28 05:17:37
3	14	328.4024251215669	266.84406554721835	20/04/28 05:17:37
3	14	328.4819184635375	266.88894530017757	20/04/28 05:17:37
3	14	328.5998291868544	266.8333984311676	20/04/28 05:17:37
3	14	328.5737455945486	266.8862372492653	20/04/28 05:17:38
3	14	328.6512393016024	266.95044153985333	20/04/28 05:17:38
3	14	328.8150632213794	267.02779571188415	20/04/28 05:17:38
3	14	328.83985965767823	267.021430138443	20/04/28 05:17:38
3	14	328.91466963895425	267.0915999200046	20/04/28 05:17:38
3	14	328.91918646493036	267.1603109225575	20/04/28 05:17:38
3	14	328.76660960841184	267.36079925413213	20/04/28 05:17:38
3	14	328.75071209189775	267.09165302627497	20/04/28 05:17:38
3	14	328.7186554366559	267.244634258139	20/04/28 05:17:38
3	14	328.7032822569202	267.19246731698155	20/04/28 05:17:38
3	14	328.7304065871161	267.40504875450756	20/04/28 05:17:39
3	14	328.78025810892603	267.39074844646257	20/04/28 05:17:39
3	14	328.6036444818853	267.32208093526714	20/04/28 05:17:39
3	14	328.64229667773526	267.32958383786496	20/04/28 05:17:39
3	14	328.829434325225	267.16066716070725	20/04/28 05:17:39
3	14	328.66604911444136	267.01311341695725	20/04/28 05:17:39
3	14	328.77327993459363	267.21883647559014	20/04/28 05:17:39
3	14	328.6282606682015	267.4349504161469	20/04/28 05:17:39
3	14	328.5004474402415	267.4240307948309	20/04/28 05:17:39
3	14	328.5422310327717	267.662742209947	20/04/28 05:17:39
3	14	328.57485637800346	267.8510039615218	20/04/28 05:17:40
3	14	328.5032819319396	267.59910529317716	20/04/28 05:17:40
3	14	328.40184659738986	267.5189812304378	20/04/28 05:17:40
3	14	328.2786682441099	267.56886761951216	20/04/28 05:17:40
3	14	328.29495251307435	267.5847176994317	20/04/28 05:17:40
3	14	328.1758305200356	267.83432401351826	20/04/28 05:17:40
3	14	328.3421011672532	267.74072432076224	20/04/28 05:17:40
3	14	328.48188092562947	267.88507804387734	20/04/28 05:17:40
3	14	328.51387838038977	267.81784248559245	20/04/28 05:17:40
3	14	328.5433328915676	267.99507702517076	20/04/28 05:17:41
3	14	328.53571171376296	268.0039343167615	20/04/28 05:17:41
3	14	328.670664026755	267.9988808313603	20/04/28 05:17:41
3	14	328.76905046628883	268.0707530717461	20/04/28 05:17:41
3	14	328.80260488796864	268.18986375764916	20/04/28 05:17:41
3	14	328.8322204317328	268.19277691847714	20/04/28 05:17:41
3	14	328.8315470156151	268.1517794545174	20/04/28 05:17:41
3	14	328.938314388692	268.31644624884575	20/04/28 05:17:41
3	14	328.8801979329537	268.37559564722903	20/04/28 05:17:41
3	14	328.862182586605	268.440331557837	20/04/28 05:17:41
3	14	328.8745189329955	268.4301877619865	20/04/28 05:17:42
3	14	328.80691465342244	268.6363449306877	20/04/28 05:17:42
3	14	328.67737904442777	268.6521283994613	20/04/28 05:17:42
3	14	328.70182838697446	268.59763359121763	20/04/28 05:17:42
3	14	328.65229624398376	268.6346546894789	20/04/28 05:17:42
3	14	328.7445004070945	268.45385846106876	20/04/28 05:17:42
3	14	328.81270439926476	268.4505835334744	20/04/28 05:17:42
3	14	328.63795815109717	268.3121665548886	20/04/28 05:17:42
3	14	328.85415326483206	268.3604144987272	20/04/28 05:17:42
3	14	328.8561963379169	268.1213144833891	20/04/28 05:17:42
3	14	328.8313210897996	268.09468795466177	20/04/28 05:17:43
3	14	328.6987484130278	268.25876334890296	20/04/28 05:17:43
3	14	328.5202495930626	268.44640487897146	20/04/28 05:17:43
3	14	328.38368432378866	268.60057639703376	20/04/28 05:17:43
3	14	328.4032021297293	268.65571298683227	20/04/28 05:17:43
3	14	328.4534953052061	268.5895623951962	20/04/28 05:17:43
3	14	328.6259133893337	268.44309947477166	20/04/28 05:17:43
3	14	328.5354568072282	268.17705237245457	20/04/28 05:17:43
3	14	328.5598407144264	268.01547645205915	20/04/28 05:17:43
3	14	328.567330010941	268.03209420376436	20/04/28 05:17:44
3	14	328.8109400728397	267.9772409521127	20/04/28 05:17:44
3	14	328.8915129773974	268.0007246242094	20/04/28 05:17:44
3	14	328.8282897372548	267.8116516163236	20/04/28 05:17:44
3	14	328.7243970780036	267.5568044020088	20/04/28 05:17:44
3	14	328.8749273224473	267.5477281248818	20/04/28 05:17:44
3	14	328.8185751078953	267.6622248172483	20/04/28 05:17:44
3	14	328.7369437229597	267.93241087246963	20/04/28 05:17:44
3	14	328.6116087198116	268.0012150307373	20/04/28 05:17:44
3	14	328.74633243887723	267.99738831070516	20/04/28 05:17:44
3	14	328.6999929208788	268.23747661243885	20/04/28 05:17:45
3	14	328.8416349869266	268.12470762154453	20/04/28 05:17:45
3	14	328.94322003556533	268.29384003655764	20/04/28 05:17:45
3	14	328.9209735856676	268.1643926336667	20/04/28 05:17:45
3	14	328.92797378407005	268.1829133828334	20/04/28 05:17:45
3	14	328.7431334330236	268.2360589490708	20/04/28 05:17:45
3	14	328.97626207980693	268.2263713782478	20/04/28 05:17:45
3	14	329.0068343767179	268.3523823911168	20/04/28 05:17:45
3	14	328.97096434797817	268.3729947763751	20/04/28 05:17:45
3	14	328.89495475041883	268.4967096427069	20/04/28 05:17:46
3	14	329.0257398047128	268.6962870588008	20/04/28 05:17:46
3	14	329.0002469007981	268.60776495664953	20/04/28 05:17:46
3	14	328.93215389849	268.3391181370133	20/04/28 05:17:46
3	14	328.9377943890101	268.3395805741046	20/04/28 05:17:46
3	14	328.77353762375304	268.3419870277677	20/04/28 05:17:46
3	14	328.60621360799155	268.11679652428273	20/04/28 05:17:46
3	14	328.5512253048179	268.1117561475952	20/04/28 05:17:46
3	14	328.4070094988084	268.2724309071663	20/04/28 05:17:46
3	14	328.3849660889649	268.0943277550687	20/04/28 05:17:46
3	14	328.2428685705618	268.13142645884886	20/04/28 05:17:47
3	14	328.3128197016794	268.3783965261408	20/04/28 05:17:47
3	14	328.3997517243218	268.26164527158625	20/04/28 05:17:47
3	14	328.6824838007571	268.16288024143836	20/04/28 05:17:47
3	14	328.79355726262867	268.29046001810656	20/04/28 05:17:47
3	14	328.7990198627	268.43666258928573	20/04/28 05:17:47
3	14	328.9719592862564	268.4438999929393	20/04/28 05:17:47
3	14	328.92903705517506	268.32189648505465	20/04/28 05:17:47
3	14	328.8524003987598	268.328757440206	20/04/28 05:17:47
3	14	328.89160259562107	268.34253297670466	20/04/28 05:17:47
3	14	328.81938574057654	268.11663227475555	20/04/28 05:17:48
3	14	328.8187768174065	268.1169463483715	20/04/28 05:17:48
3	14	328.9566186494305	268.24242091606567	20/04/28 05:17:48
3	14	328.8657317929975	268.331336094022	20/04/28 05:17:48
3	14	328.87296435881467	268.2980918432745	20/04/28 05:17:48
3	14	328.7931765773822	268.3345459658796	20/04/28 05:17:48
3	14	328.84188733119726	268.30926649696653	20/04/28 05:17:48
3	14	328.9794065058217	268.2737135947445	20/04/28 05:17:48
3	14	328.7348739053013	268.3402998050779	20/04/28 05:17:48
3	14	328.66393706078367	268.2147170522504	20/04/28 05:17:49
3	14	328.5042355734492	268.04910848745345	20/04/28 05:17:49
3	14	328.51276698984424	268.069491517533	20/04/28 05:17:49
3	14	328.4687877734213	267.95013236804044	20/04/28 05:17:49
3	14	328.2142396088562	267.8589424517706	20/04/28 05:17:49
3	14	328.19767809597437	267.8487957678713	20/04/28 05:17:49
3	14	328.16791817732883	268.01095025412167	20/04/28 05:17:49
3	14	328.201174845083	267.8138175884815	20/04/28 05:17:49
3	14	328.05570476683135	267.6950035723747	20/04/28 05:17:49
3	14	328.0635898597015	267.71572915230416	20/04/28 05:17:49
3	14	328.05228518725306	267.97381493825117	20/04/28 05:17:50
3	14	327.8476709167214	267.9242829399752	20/04/28 05:17:50
3	14	327.95968512274555	267.7439786777668	20/04/28 05:17:50
3	14	328.203752757706	267.7164027318746	20/04/28 05:17:50
3	14	328.1895284000517	267.68374153642026	20/04/28 05:17:50
3	14	328.11487039465874	267.5413743931774	20/04/28 05:17:50
3	14	327.94316577148226	267.4976386267104	20/04/28 05:17:50
3	14	327.87784392243987	267.51484443702304	20/04/28 05:17:50
3	14	328.13215108716344	267.4264378268956	20/04/28 05:17:50
3	14	328.0454349699672	267.56675392837354	20/04/28 05:17:50
3	14	328.02129206059755	267.77597967952113	20/04/28 05:17:51
3	14	328.07194302133905	267.670588379429	20/04/28 05:17:51
3	14	328.320845046283	267.59525487500326	20/04/28 05:17:51
3	14	328.3173250594212	267.6063307027514	20/04/28 05:17:51
3	14	328.08530400655854	267.4350373219665	20/04/28 05:17:51
3	14	328.3405383380805	267.5579124052472	20/04/28 05:17:51
3	14	328.45842407194664	267.67748961740574	20/04/28 05:17:51
3	14	328.6475770416171	267.8418365404031	20/04/28 05:17:51
3	14	328.42908644436227	267.9221125154231	20/04/28 05:17:51
3	14	328.45736017829233	267.9113411275541	20/04/28 05:17:51
3	14	328.4835574410292	268.16653090102085	20/04/28 05:17:52
3	14	328.25470866584544	268.03975535699067	20/04/28 05:17:52
3	14	328.2382478202733	268.14764727803936	20/04/28 05:17:52
3	14	328.2615114801911	268.23139021359475	20/04/28 05:17:52
3	14	328.36908038171254	268.00924144477256	20/04/28 05:17:52
3	14	328.54732873485204	268.0948275382194	20/04/28 05:17:52
3	14	328.7326359322939	267.97424004397857	20/04/28 05:17:52
3	14	328.8689087255373	267.80825232948126	20/04/28 05:17:52
3	14	328.7219811267479	267.99186469895244	20/04/28 05:17:52
3	14	328.79488663283877	268.1416722973525	20/04/28 05:17:53
3	14	328.7696772741059	268.27897257160106	20/04/28 05:17:53
3	14	328.7113339295091	268.2678299214005	20/04/28 05:17:53
3	14	328.7278809752357	268.01534695491284	20/04/28 05:17:53
3	14	328.7988651447807	267.9432279263258	20/04/28 05:17:53
3	14	328.95321616950633	267.9032340692583	20/04/28 05:17:53
3	14	329.03696171024694	267.62380834358487	20/04/28 05:17:53
3	14	328.86938285204513	267.58781699223954	20/04/28 05:17:53
3	14	328.69385600887693	267.3701712091255	20/04/28 05:17:53
3	14	328.6891668032378	267.3929882363616	20/04/28 05:17:53
3	14	328.9408895217924	267.39648446130224	20/04/28 05:17:54
3	14	329.01263491408054	267.1692111260962	20/04/28 05:17:54
3	14	328.8423629980275	267.01859037305826	20/04/28 05:17:54
3	14	328.8472344648339	267.017549039144	20/04/28 05:17:54
3	14	328.70395040571515	266.9120393698524	20/04/28 05:17:54
3	14	328.69204301694407	266.99926420271083	20/04/28 05:17:54
3	14	328.9141485065046	267.13675169379115	20/04/28 05:17:54
3	14	328.868245924132	267.227706029608	20/04/28 05:17:54
3	14	328.8549870635475	267.3640626421367	20/04/28 05:17:54
3	14	328.9718405943069	267.52653174675584	20/04/28 05:17:54
3	14	328.7857879475375	267.62305842478395	20/04/28 05:17:55
3	14	328.7857879475375	267.62305842478395	20/04/28 05:17:55
3	14	328.8543571460548	267.45520879440136	20/04/28 05:17:55
3	14	328.9299004280148	267.4887962997944	20/04/28 05:17:55
3	14	328.80303390435455	267.465047236279	20/04/28 05:17:55
3	14	328.80303390435455	267.465047236279	20/04/28 05:17:55
3	14	328.7517992728342	267.5559505586988	20/04/28 05:17:55
3	14	328.7380506809804	267.53470274836684	20/04/28 05:17:55
3	14	328.768198214255	267.4470545084955	20/04/28 05:17:55
3	14	328.7850887484772	267.467582452099	20/04/28 05:17:56
3	14	328.8060084255873	267.39734903957736	20/04/28 05:17:56
3	14	328.6115872772412	267.6225229528932	20/04/28 05:17:56
3	14	328.69490207555765	267.7110206114903	20/04/28 05:17:56
3	14	328.6914413489703	267.71017833332104	20/04/28 05:17:56
3	14	328.68059680190686	267.74615738522266	20/04/28 05:17:56
3	14	328.4051062959913	267.6419910472625	20/04/28 05:17:56
3	14	328.39163471232564	267.6525773933705	20/04/28 05:17:56
3	14	328.5001917236762	267.75290916794813	20/04/28 05:17:56
3	14	328.26828841954824	267.6336666359653	20/04/28 05:17:56
3	14	328.13491793078595	267.5190764861841	20/04/28 05:17:57
3	14	328.1491382993234	267.520360949981	20/04/28 05:17:57
3	14	328.30907594821184	267.4802117171332	20/04/28 05:17:57
3	14	328.30907594821184	267.4802117171332	20/04/28 05:17:57
3	14	328.18320731090813	267.60400608379376	20/04/28 05:17:57
3	14	328.18320731090813	267.60400608379376	20/04/28 05:17:57
3	14	328.3192059357558	267.50452060979563	20/04/28 05:17:57
3	14	328.39113084452833	267.28256913014206	20/04/28 05:17:57
3	14	328.39113084452833	267.28256913014206	20/04/28 05:17:57
3	14	328.27532576318066	267.0951415217098	20/04/28 05:17:58
3	14	328.3655175691451	267.1067052534184	20/04/28 05:17:58
3	14	328.2040541470117	267.24391104323195	20/04/28 05:17:58
3	14	328.34042687820624	267.20858138748116	20/04/28 05:17:58
3	14	328.34700286203264	267.2118424249788	20/04/28 05:17:58
3	14	328.1156558437671	267.246180176495	20/04/28 05:17:58
3	14	328.1153607279349	267.2460667324051	20/04/28 05:17:58
3	14	327.93251368517053	267.03021314819637	20/04/28 05:17:58
3	14	327.9466150682945	266.7367007556087	20/04/28 05:17:58
3	14	327.844558415397	266.7357345434935	20/04/28 05:17:58
3	14	327.8162408790228	266.82913416965016	20/04/28 05:17:59
3	14	327.8269841051503	266.827617535882	20/04/28 05:17:59
3	14	328.0864189571705	266.97450587388255	20/04/28 05:17:59
3	14	328.07422907684014	266.9131193637884	20/04/28 05:17:59
3	14	327.81719057676383	267.0581668817398	20/04/28 05:17:59
3	14	327.97705577324996	267.1676354452369	20/04/28 05:17:59
3	14	327.96972221237286	267.05821876784	20/04/28 05:17:59
3	14	328.04010313141134	267.0155558094362	20/04/28 05:17:59
3	14	328.04634199529715	266.9669528362202	20/04/28 05:17:59
3	14	328.10838029494687	266.9615882679106	20/04/28 05:17:59
3	14	328.07925529380145	266.95681436089814	20/04/28 05:18:00
3	14	327.9437037738313	266.80041533195094	20/04/28 05:18:00
3	14	327.77768702226973	267.0698695902092	20/04/28 05:18:00
3	14	327.51132443211407	267.0452432168647	20/04/28 05:18:00
3	14	327.3737828861764	267.1683255682667	20/04/28 05:18:00
3	14	327.3737828861764	267.1683255682667	20/04/28 05:18:00
3	14	327.3737828861764	267.1683255682667	20/04/28 05:18:00
3	14	327.1735473929472	267.363530101287	20/04/28 05:18:00
3	14	327.22122622304084	267.0898722804129	20/04/28 05:18:00
3	14	327.2717581559418	266.85053249225285	20/04/28 05:18:01
3	14	327.236069121487	266.7692319184659	20/04/28 05:18:01
3	14	327.15954837987493	266.77976814038976	20/04/28 05:18:01
3	14	327.1072208237624	266.9380652120615	20/04/28 05:18:01
3	14	327.3651019881982	266.90188170578887	20/04/28 05:18:01
3	14	327.2653222128541	266.7382350043983	20/04/28 05:18:01
3	14	327.2653222128541	266.7382350043983	20/04/28 05:18:01
3	14	327.1143201158975	266.85371046159185	20/04/28 05:18:01
3	14	326.8917328480534	266.6867728050664	20/04/28 05:18:01
3	14	326.8917328480534	266.6867728050664	20/04/28 05:18:01
3	14	326.8784088174227	266.725562877737	20/04/28 05:18:02
3	14	326.7482861581372	266.91903561204225	20/04/28 05:18:02
3	14	326.5882807548373	266.8314811768674	20/04/28 05:18:02
3	14	326.54592651755354	266.755753525169	20/04/28 05:18:02
3	14	326.54592651755354	266.755753525169	20/04/28 05:18:02
3	14	326.5347864593565	266.7478339047383	20/04/28 05:18:02
3	14	326.5438030847856	266.73201488039024	20/04/28 05:18:02
3	14	326.35504281897937	266.9487827051934	20/04/28 05:18:02
3	14	326.354888689671	266.94928610509726	20/04/28 05:18:02
3	14	326.2535532048526	266.6907861104566	20/04/28 05:18:02
3	14	326.3100627567823	266.68570143709553	20/04/28 05:18:03
3	14	326.3912316613047	266.59452651600634	20/04/28 05:18:03
3	14	326.3047442664816	266.6868614213188	20/04/28 05:18:03
3	14	326.24452334512466	266.7849959729871	20/04/28 05:18:03
3	14	326.24452334512466	266.7849959729871	20/04/28 05:18:03
3	14	326.30598785957847	266.8159502461533	20/04/28 05:18:03
3	14	326.3253763022405	266.7882383778103	20/04/28 05:18:03
3	14	326.1562468301772	266.6184278961828	20/04/28 05:18:03
3	14	326.39749429284535	266.63857803304353	20/04/28 05:18:03
3	14	326.1639952945258	266.7085798132219	20/04/28 05:18:04
3	14	326.2700204374885	266.8504358965204	20/04/28 05:18:04
3	14	326.03433723828925	266.87090904038683	20/04/28 05:18:04
3	14	326.180233581186	266.6852182097212	20/04/28 05:18:04
3	14	326.0980960509286	266.7070621694086	20/04/28 05:18:04
3	14	326.1579938298078	266.79389610176247	20/04/28 05:18:04
3	14	326.1027406512803	266.97574314938026	20/04/28 05:18:04
3	14	326.0925990532061	266.9710153533182	20/04/28 05:18:04
3	14	326.1348267624712	266.9917796767001	20/04/28 05:18:04
3	14	325.9415917281888	267.0739551811885	20/04/28 05:18:04
3	14	325.7469730756784	267.08236771358094	20/04/28 05:18:05
3	14	325.7383608853072	267.09062614513493	20/04/28 05:18:05
3	14	325.7358242423815	267.11270894198736	20/04/28 05:18:05
3	14	325.6875349280509	267.1291219544504	20/04/28 05:18:05
3	14	325.738279612363	267.31161202986925	20/04/28 05:18:05
3	14	325.4869222624576	267.2859322085411	20/04/28 05:18:05
3	14	325.21676716372065	267.286045591069	20/04/28 05:18:05
3	14	325.2310954297886	267.44582927921044	20/04/28 05:18:05
3	14	325.2310954297886	267.44582927921044	20/04/28 05:18:05
3	14	325.1646380260597	267.48377794912375	20/04/28 05:18:05
3	14	325.16175655443465	267.46581609885885	20/04/28 05:18:06
3	14	325.1032197552594	267.53517372941093	20/04/28 05:18:06
3	14	325.08790228859294	267.5225592612479	20/04/28 05:18:06
3	14	325.40739736083674	267.7243435681225	20/04/28 05:18:06
3	14	325.21738479521923	267.7820584412035	20/04/28 05:18:06
3	14	325.2431340209999	267.7564149520373	20/04/28 05:18:06
3	14	325.24574533453966	267.7538031890226	20/04/28 05:18:06
3	14	325.4241748500369	267.6555326002593	20/04/28 05:18:06
3	14	325.3929542021155	267.6945655915225	20/04/28 05:18:06
3	14	325.46716773947327	267.6601195598275	20/04/28 05:18:07
3	14	325.51107783496343	267.67763014047716	20/04/28 05:18:07
3	14	325.55573323164896	267.66238550335123	20/04/28 05:18:07
3	14	325.759625896535	267.5369700779675	20/04/28 05:18:07
3	14	325.9630092845002	267.6602822575317	20/04/28 05:18:07
3	14	325.93647974122325	267.6180012550512	20/04/28 05:18:07
3	14	325.9398546611152	267.6167036177091	20/04/28 05:18:07
3	14	326.0983018132199	267.72048683076946	20/04/28 05:18:07
3	14	326.08771905404205	267.74911559708664	20/04/28 05:18:07
3	14	325.9516465810119	267.7381636569875	20/04/28 05:18:07
3	14	325.75625649842	267.7824772447827	20/04/28 05:18:08
3	14	325.7626956749392	267.7815566359387	20/04/28 05:18:08
3	14	325.533231415368	267.80050108376804	20/04/28 05:18:08
3	14	325.6091192489788	267.76327075258354	20/04/28 05:18:08
3	14	325.4216626199056	267.6606294877557	20/04/28 05:18:08
3	14	325.63632052815336	267.79439287580226	20/04/28 05:18:08
3	14	325.4100450692647	267.67220195162867	20/04/28 05:18:08
3	14	325.2489199529705	267.61557533597465	20/04/28 05:18:08
3	14	325.3169425296074	267.5870949900032	20/04/28 05:18:08
3	14	325.2200168719104	267.85362768841736	20/04/28 05:18:09
3	14	325.12404652865445	267.7796544408587	20/04/28 05:18:09
3	14	325.3417454338052	267.9442665007562	20/04/28 05:18:09
3	14	325.312068123848	267.94331578180584	20/04/28 05:18:09
3	14	325.3859361382289	267.7795109662157	20/04/28 05:18:09
3	14	325.2513531566739	267.95318771394653	20/04/28 05:18:09
3	14	325.32520654261987	267.92494220699604	20/04/28 05:18:09
3	14	325.5118553283416	268.0231639713539	20/04/28 05:18:09
3	14	325.5275765439824	268.04194420559736	20/04/28 05:18:09
3	14	325.4276142818468	267.8462162549654	20/04/28 05:18:09
3	14	325.4359539706852	267.84307496517647	20/04/28 05:18:10
3	14	325.2559043696525	267.85766098209484	20/04/28 05:18:10
3	14	325.25202541905253	267.8540470472657	20/04/28 05:18:10
3	14	325.1378209765561	267.7643770487167	20/04/28 05:18:10
3	14	325.096673817855	267.4852721295463	20/04/28 05:18:10
3	14	325.2750475353681	267.41826710783204	20/04/28 05:18:10
3	14	325.22084427383874	267.36589343440926	20/04/28 05:18:10
3	14	325.21218337846483	267.3585743965835	20/04/28 05:18:10
3	14	325.36359857648426	267.4715290992732	20/04/28 05:18:10
3	14	325.28606148269796	267.4915301358385	20/04/28 05:18:10
3	14	325.1635744852002	267.50106768491924	20/04/28 05:18:11
3	14	325.00978152184985	267.52063636613724	20/04/28 05:18:11
3	14	324.8232010972773	267.52492339438083	20/04/28 05:18:11
3	14	324.824789985198	267.2826748731006	20/04/28 05:18:11
3	14	324.8163554431721	267.2581398066573	20/04/28 05:18:11
3	14	324.8673404654099	267.24562624857265	20/04/28 05:18:11
3	14	324.88816306419574	267.28538490666534	20/04/28 05:18:11
3	14	324.9265481782402	267.28721514909864	20/04/28 05:18:11
3	14	324.83406178301095	267.566374837126	20/04/28 05:18:11
3	14	324.6036975845828	267.52091959219075	20/04/28 05:18:11
3	14	324.5902568093835	267.6746862566626	20/04/28 05:18:12
3	14	324.75343037170427	267.7499019347158	20/04/28 05:18:12
3	14	324.7866053826206	267.6125099877697	20/04/28 05:18:12
3	14	324.8009797531985	267.6346772817158	20/04/28 05:18:12
3	14	324.8679655282939	267.7065899644122	20/04/28 05:18:12
3	14	325.0681109816621	267.70696064285295	20/04/28 05:18:12
3	14	325.2008630975059	267.46735238851795	20/04/28 05:18:12
3	14	325.04216263676113	267.3809484846002	20/04/28 05:18:12
3	14	325.11245650542367	267.52015398196204	20/04/28 05:18:12
3	14	325.1690595600663	267.33877250657355	20/04/28 05:18:13
3	14	324.93732834779615	267.489836613967	20/04/28 05:18:13
3	14	324.79455646742053	267.36731456788635	20/04/28 05:18:13
3	14	324.5298659440555	267.46706496859287	20/04/28 05:18:13
3	14	324.5071624926331	267.7051914535503	20/04/28 05:18:13
3	14	324.43043815653596	267.523068067576	20/04/28 05:18:13
3	14	324.41476674990815	267.37498381944374	20/04/28 05:18:13
3	14	324.3860021902472	267.3916660468051	20/04/28 05:18:13
3	14	324.3442283174898	267.3849696053339	20/04/28 05:18:13
3	14	324.28420438642263	267.24575044528837	20/04/28 05:18:13
3	14	324.2644229829188	267.2591933330451	20/04/28 05:18:14
3	14	324.45658080270937	267.30500642787155	20/04/28 05:18:14
3	14	324.57855185326287	267.0611885709209	20/04/28 05:18:14
3	14	324.579092168789	267.05216980251515	20/04/28 05:18:14
3	14	324.4812516950984	266.9677592718463	20/04/28 05:18:14
3	14	324.5505808699377	266.9012300560275	20/04/28 05:18:14
3	14	324.7349614060763	266.88259184605016	20/04/28 05:18:14
3	14	324.80047742140056	266.7716307520238	20/04/28 05:18:14
3	14	324.83834235275646	266.7688590080391	20/04/28 05:18:14
3	14	324.85827488131656	266.86949864535916	20/04/28 05:18:14
3	14	324.91914772656276	267.013749910964	20/04/28 05:18:15
3	14	324.88254014815936	267.026977235645	20/04/28 05:18:15
3	14	324.90182477185664	267.09490381243694	20/04/28 05:18:15
3	14	324.68862909904675	267.2954867954204	20/04/28 05:18:15
3	14	324.4240059075576	267.38341265688814	20/04/28 05:18:15
3	14	324.29374625512526	267.352128410859	20/04/28 05:18:15
3	14	324.5731483656699	267.36847089058153	20/04/28 05:18:15
3	14	324.74798783184	267.33806907470984	20/04/28 05:18:15
3	14	324.7274574089918	267.21207518121724	20/04/28 05:18:15
3	14	324.54887975324385	267.15856376255897	20/04/28 05:18:16
3	14	324.5912297870328	267.2837257124516	20/04/28 05:18:16
3	14	324.6624192397273	267.2136669979056	20/04/28 05:18:16
3	14	324.74519666064333	267.32516767983793	20/04/28 05:18:16
3	14	324.5223431862401	267.12562856955526	20/04/28 05:18:16
3	14	324.50751563973336	267.26240635623435	20/04/28 05:18:16
3	14	324.52467795032004	267.342460884494	20/04/28 05:18:16
3	14	324.7686783714423	267.17594938854717	20/04/28 05:18:16
3	14	324.74326466292075	267.1161790491786	20/04/28 05:18:16
3	14	324.6776785890698	267.0369252687537	20/04/28 05:18:16
3	14	324.93081656914313	266.9588157039035	20/04/28 05:18:17
3	14	325.15372045264485	266.7966692849498	20/04/28 05:18:17
3	14	325.31868764867653	266.9278892264032	20/04/28 05:18:17
3	14	325.2984934707533	266.97545266168436	20/04/28 05:18:17
3	14	325.2398859790732	267.21342651598366	20/04/28 05:18:17
3	14	325.088804024953	266.96800192989434	20/04/28 05:18:17
3	14	325.09092359682637	266.96865328287515	20/04/28 05:18:17
3	14	325.3362928303766	266.9656645882478	20/04/28 05:18:17
3	14	325.1998158490238	266.813921846734	20/04/28 05:18:17
3	14	325.15401762382436	266.80008508735796	20/04/28 05:18:17
3	14	324.93802987305105	266.872634038756	20/04/28 05:18:18
3	14	324.80830828501837	266.75798250568664	20/04/28 05:18:18
3	14	324.894659525505	266.92461665101575	20/04/28 05:18:18
3	14	324.75460921443175	266.9053083379354	20/04/28 05:18:18
3	14	324.86121254784575	266.82920821982015	20/04/28 05:18:18
3	14	324.76694593411634	266.55204227264863	20/04/28 05:18:18
3	14	324.6559966418187	266.3261647682281	20/04/28 05:18:18
3	14	324.5870767688929	266.6143028272005	20/04/28 05:18:18
3	14	324.4611027078452	266.3614864323585	20/04/28 05:18:18
3	14	324.43419248612304	266.0968606232634	20/04/28 05:18:19
3	14	324.43419248612304	266.0968606232634	20/04/28 05:18:19
3	14	324.43419248612304	266.0968606232634	20/04/28 05:18:19
3	14	324.6620438831398	266.04235338896325	20/04/28 05:18:19
3	14	324.84490952798524	265.99860776932013	20/04/28 05:18:19
3	14	325.0368522020343	265.95269071792796	20/04/28 05:18:19
3	14	325.3193530377573	265.8851100954505	20/04/28 05:18:19
3	14	325.5928519273222	265.81968294315067	20/04/28 05:18:19
3	14	325.8666923692128	265.75417408376944	20/04/28 05:18:19
3	14	326.04398105185334	265.71176260027636	20/04/28 05:18:19
3	14	326.2436680854968	265.6639929220035	20/04/28 05:18:20
3	14	326.4939734360635	265.6041141915302	20/04/28 05:18:20
3	14	326.6577634604523	265.5649318939789	20/04/28 05:18:20
3	14	326.828592099741	265.52406579972273	20/04/28 05:18:20
3	8	327.1122384286431	265.4785143707963	20/04/28 05:18:20
3	8	327.2858832291704	265.4693986263384	20/04/28 05:18:20
3	8	327.47550296521024	265.4594442536611	20/04/28 05:18:20
3	8	327.72271874782695	265.4464662900627	20/04/28 05:18:20
3	8	327.90752979116417	265.4367643569271	20/04/28 05:18:20
3	8	328.144691388893	265.42431420285646	20/04/28 05:18:20
3	8	328.4052751999459	265.4106344645389	20/04/28 05:18:21
3	8	328.6097250773413	265.39990156132995	20/04/28 05:18:21
3	8	328.7666916463122	265.3916613656729	20/04/28 05:18:21
3	8	329.0401994465252	265.37730316314446	20/04/28 05:18:21
3	8	329.28919345254934	265.364231849039	20/04/28 05:18:21
3	8	329.5629914957412	265.3498584097697	20/04/28 05:18:21
3	8	329.770059643664	265.3389880565192	20/04/28 05:18:21
3	8	330.0503228702099	265.32427521774497	20/04/28 05:18:21
3	8	330.32981048051477	265.3096030961096	20/04/28 05:18:21
3	8	330.5799464462728	265.29647183311374	20/04/28 05:18:22
3	8	330.8251649058627	265.28359872198575	20/04/28 05:18:22
3	8	331.08178636571773	265.27012699324206	20/04/28 05:18:22
3	8	331.3528971292264	265.2558946267535	20/04/28 05:18:22
3	8	331.52140070020914	265.2470487788579	20/04/28 05:18:22
3	8	331.710150005713	265.2371401007382	20/04/28 05:18:22
3	8	331.8941982562057	265.227478211558	20/04/28 05:18:22
3	8	332.1736477101327	265.2128080929989	20/04/28 05:18:22
3	8	332.4449541554021	265.1985654539026	20/04/28 05:18:22
3	8	332.69606204132157	265.18538316849896	20/04/28 05:18:22
3	8	332.8838929110426	265.17552270504433	20/04/28 05:18:23
3	8	333.1443497306098	265.1618496333354	20/04/28 05:18:23
3	8	333.4211626024891	265.14731792610866	20/04/28 05:18:23
3	8	333.68208122736246	265.13362061123695	20/04/28 05:18:23
3	8	333.888409342869	265.12278910709904	20/04/28 05:18:23
3	8	334.1142553370042	265.11093298262466	20/04/28 05:18:23
3	8	334.3257387209762	265.0998308449302	20/04/28 05:18:23
3	8	334.6220640584128	265.08427480153426	20/04/28 05:18:23
3	8	334.86335438011855	265.07160790390094	20/04/28 05:18:23
3	8	335.15822037292105	265.0561284709922	20/04/28 05:18:24
3	8	335.4072739212227	265.0430540311255	20/04/28 05:18:24
3	8	335.5853550514097	265.0337053948829	20/04/28 05:18:24
3	8	335.8689066834485	265.01881992632616	20/04/28 05:18:24
3	8	336.1288284490842	265.0051749430765	20/04/28 05:18:24
3	8	336.28705285724726	264.99686871526296	20/04/28 05:18:24
3	8	336.46881255373256	264.98732696716064	20/04/28 05:18:24
3	8	336.7427172058074	264.972947931298	20/04/28 05:18:24
3	8	336.96263006647683	264.961403275571	20/04/28 05:18:24
3	8	337.1620244916123	264.9509357659171	20/04/28 05:18:24
3	8	337.4494101560236	264.9358490240758	20/04/28 05:18:25
3	8	337.71819893577685	264.92173855361	20/04/28 05:18:25
3	8	337.86942185151514	264.9137998796511	20/04/28 05:18:25
3	8	338.06980133683106	264.90328065778436	20/04/28 05:18:25
3	8	338.32413275643256	264.88992914814133	20/04/28 05:18:25
3	8	338.58247450908334	264.87636711004507	20/04/28 05:18:25
3	8	338.8712870482128	264.8612054622736	20/04/28 05:18:25
3	8	339.0873973473891	264.8498604277201	20/04/28 05:18:25
3	8	339.2942009263175	264.83900396341613	20/04/28 05:18:25
3	8	339.5460992661445	264.8257801819481	20/04/28 05:18:25
3	8	339.72421517694505	264.81642971984496	20/04/28 05:18:26
3	8	339.8918627764315	264.80762880745795	20/04/28 05:18:26
3	8	340.18154471531625	264.79242151924126	20/04/28 05:18:26
3	8	340.4672501213327	264.7774229850866	20/04/28 05:18:26
3	8	340.4672501213327	264.7774229850866	20/04/28 05:18:26
3	8	340.69769528387354	264.76532542036307	20/04/28 05:18:26
3	8	340.9847158682978	264.7502578439437	20/04/28 05:18:26
3	8	341.19115476928044	264.7394205239559	20/04/28 05:18:26
3	8	341.3834577150162	264.72932529215797	20/04/28 05:18:26
3	8	341.5950574846278	264.7182170446246	20/04/28 05:18:27
3	8	341.8238835875528	264.70620447486596	20/04/28 05:18:27
3	8	341.9739824835987	264.698324808008	20/04/28 05:18:27
3	8	342.1238046134386	264.6904596704075	20/04/28 05:18:27
3	8	342.36713592167166	264.6776856281228	20/04/28 05:18:27
3	8	342.6095869879258	264.66495779546204	20/04/28 05:18:27
3	8	342.78634586097695	264.65567857309253	20/04/28 05:18:27
3	8	343.05861528301807	264.6413853810851	20/04/28 05:18:27
3	8	343.28482315860003	264.629510259101	20/04/28 05:18:27
3	8	343.5322849727931	264.61651937970566	20/04/28 05:18:27
3	8	343.83065233487616	264.6008561371607	20/04/28 05:18:28
3	8	344.0230740702092	264.59075466932455	20/04/28 05:18:28
3	8	344.2635729478503	264.5781293197354	20/04/28 05:18:28
3	8	344.50498024095447	264.565456281513	20/04/28 05:18:28
3	8	344.76805428046197	264.55164581491465	20/04/28 05:18:28
3	8	344.92255940228824	264.54353483662027	20/04/28 05:18:28
3	8	345.0772477570032	264.53541423924037	20/04/28 05:18:28
3	8	345.2810566803693	264.52471498387536	20/04/28 05:18:28
3	8	345.465780079509	264.51501765175345	20/04/28 05:18:28
3	8	345.7354814323004	264.50085927439613	20/04/28 05:18:28
3	8	345.9717918321709	264.4884538052348	20/04/28 05:18:29
3	8	346.1970017664941	264.47663107167506	20/04/28 05:18:29
3	8	346.4233029952235	264.46475104897735	20/04/28 05:18:29
3	8	346.6350578925293	264.45363465778286	20/04/28 05:18:29
3	8	346.8836711831533	264.44058332990386	20/04/28 05:18:29
3	8	347.06659225087986	264.4309806138749	20/04/28 05:18:29
3	8	347.2385681062974	264.42195248319575	20/04/28 05:18:29
3	8	347.50055252818146	264.40819921771015	20/04/28 05:18:29
3	8	347.50055252818146	264.40819921771015	20/04/28 05:18:29
3	8	347.7494460711944	264.3951331775613	20/04/28 05:18:30
3	8	347.96236740954913	264.38395555229306	20/04/28 05:18:30
3	8	348.1788025133382	264.3725934666339	20/04/28 05:18:30
3	8	348.4071257925099	264.36060729336293	20/04/28 05:18:30
3	8	348.6475541718007	264.34798564469054	20/04/28 05:18:30
3	8	348.87827561473074	264.33587357621326	20/04/28 05:18:30
3	8	349.10448145228287	264.32399856121856	20/04/28 05:18:30
3	8	349.3439667593515	264.3114264205381	20/04/28 05:18:30
3	8	349.5609423534923	264.3000359610266	20/04/28 05:18:30
3	8	349.75228813283167	264.2899909771154	20/04/28 05:18:30
3	8	350.01521676019814	264.27618814414564	20/04/28 05:18:31
3	8	350.2831416075262	264.2621230271093	20/04/28 05:18:31
3	8	350.4380112663059	264.25399291190035	20/04/28 05:18:31
3	8	350.65245587074503	264.24273532049244	20/04/28 05:18:31
3	8	350.89561603757795	264.2299702625324	20/04/28 05:18:31
3	8	351.1780032347325	264.2151459227328	20/04/28 05:18:31
3	8	351.4265565805981	264.20209774174384	20/04/28 05:18:31
3	8	351.6070477311133	264.1926225878664	20/04/28 05:18:31
3	8	351.820063026623	264.18144003017625	20/04/28 05:18:31
3	8	352.0326183644818	264.1702816186534	20/04/28 05:18:31
3	8	352.3037932364834	264.15604588669333	20/04/28 05:18:32
3	8	352.4680046516454	264.1474253619604	20/04/28 05:18:32
3	8	352.7101415865487	264.13471402009645	20/04/28 05:18:32
3	8	353.00359511946334	264.11930873638977	20/04/28 05:18:32
3	8	353.172264334322	264.1104541927703	20/04/28 05:18:32
3	8	353.33142588302553	264.1020987683574	20/04/28 05:18:32
3	8	353.5905856759302	264.08849378601	20/04/28 05:18:32
3	8	353.86879654694053	264.0738886887204	20/04/28 05:18:32
3	8	354.15112052241676	264.0590676678377	20/04/28 05:18:32
3	8	354.428780894289	264.04449146982665	20/04/28 05:18:33
3	8	354.5826014941875	264.03641642653844	20/04/28 05:18:33
3	8	354.8403691459448	264.0228845267303	20/04/28 05:18:33
3	8	355.0717401196194	264.0107383601616	20/04/28 05:18:33
3	8	355.23002147769165	264.0024291426771	20/04/28 05:18:33
3	8	355.5268027858462	263.98684916241393	20/04/28 05:18:33
3	8	355.68630392924956	263.97847591046747	20/04/28 05:18:33
3	8	355.9197834231507	263.96621905396444	20/04/28 05:18:33
3	8	356.17733353315384	263.95269857433726	20/04/28 05:18:33
3	8	356.3319296935605	263.944582816836	20/04/28 05:18:33
3	8	356.5007013134272	263.93572289731185	20/04/28 05:18:34
3	8	356.7223457302448	263.9240873409457	20/04/28 05:18:34
3	8	356.8929847551102	263.91512938919305	20/04/28 05:18:34
3	8	357.07080879178534	263.9057942494602	20/04/28 05:18:34
3	8	357.26423094468146	263.8956402632024	20/04/28 05:18:34
3	54	357.48782795216835	264.02512348736934	20/04/28 05:18:34
3	54	357.85742956151734	264.24029448761786	20/04/28 05:18:34
3	54	358.0581430569241	264.35714388025474	20/04/28 05:18:34
3	54	358.0581430569241	264.35714388025474	20/04/28 05:18:34
3	54	358.233835816389	264.45942694892716	20/04/28 05:18:34
3	54	358.4433100180979	264.58137656269463	20/04/28 05:18:35
3	8	358.6216821621596	264.6852194889249	20/04/28 05:18:35
3	8	358.4783137565836	264.6451763893164	20/04/28 05:18:35
3	8	358.4783137565836	264.6451763893164	20/04/28 05:18:35
3	8	358.55364351511304	264.6275092340108	20/04/28 05:18:35
3	8	358.3441347074706	264.43416725770254	20/04/28 05:18:35
3	8	358.3441347074706	264.43416725770254	20/04/28 05:18:35
3	8	358.5475181532196	264.2350071726982	20/04/28 05:18:35
3	8	358.5475181532196	264.2350071726982	20/04/28 05:18:35
3	8	358.354392388519	264.2269461420104	20/04/28 05:18:36
3	8	358.50758491699446	264.1900504252112	20/04/28 05:18:36
3	8	358.44731060625287	264.1070500274987	20/04/28 05:18:36
3	8	358.21877489393216	264.1962474840862	20/04/28 05:18:36
3	8	358.1649193036029	264.2572384480022	20/04/28 05:18:36
3	8	358.01960966894205	264.21916293331793	20/04/28 05:18:36
3	8	358.0084839555056	264.1743855444747	20/04/28 05:18:36
3	8	357.983743778783	264.10574472687193	20/04/28 05:18:36
3	8	357.78548604632925	264.13388581647627	20/04/28 05:18:36
3	8	357.79555269383286	264.2512760227622	20/04/28 05:18:36
3	8	357.790341271961	264.2987633334788	20/04/28 05:18:37
3	8	357.68310233817203	264.48352770082937	20/04/28 05:18:37
3	8	357.61008729832855	264.50269887634613	20/04/28 05:18:37
3	8	357.6098602318692	264.5102895867383	20/04/28 05:18:37
3	8	357.5484201987969	264.50695516301283	20/04/28 05:18:37
3	8	357.45165935658576	264.6126621346827	20/04/28 05:18:37
3	8	357.70343737248425	264.69355784622127	20/04/28 05:18:37
3	8	357.74494406734806	264.69887907749455	20/04/28 05:18:37
3	8	357.69262082289066	264.75147679167515	20/04/28 05:18:37
3	8	357.84499094311684	264.61001196889436	20/04/28 05:18:37
3	8	357.8959138475592	264.78636898295235	20/04/28 05:18:38
3	8	357.92825233734703	264.6167628556096	20/04/28 05:18:38
3	8	357.92825233734703	264.6167628556096	20/04/28 05:18:38
3	8	357.85311041909165	264.7273108005531	20/04/28 05:18:38
3	8	357.9425126856241	264.61276689517416	20/04/28 05:18:38
3	8	358.09082910693644	264.7464658277289	20/04/28 05:18:38
3	8	358.09082910693644	264.7464658277289	20/04/28 05:18:38
3	8	358.07506819004226	264.76486634263716	20/04/28 05:18:38
3	8	357.8362353076102	264.89771051971786	20/04/28 05:18:38
3	8	357.83630863860424	264.89770368503815	20/04/28 05:18:39
3	8	357.78712802341266	264.8294535519929	20/04/28 05:18:39
3	8	357.7764339064597	264.79841853814287	20/04/28 05:18:39
3	8	357.7735886449722	264.8023454268294	20/04/28 05:18:39
3	8	357.8643939764724	264.7996019276315	20/04/28 05:18:39
3	8	358.067420196706	265.00308440782806	20/04/28 05:18:39
3	8	358.20950113728946	265.05363071502984	20/04/28 05:18:39
3	8	358.13127657651364	265.0441448643006	20/04/28 05:18:39
3	8	357.93295135100345	265.1581420963947	20/04/28 05:18:39
3	8	357.8481678925523	264.9607028083585	20/04/28 05:18:39
3	8	357.8334720873206	264.8687788793285	20/04/28 05:18:40
3	8	357.8500364410325	264.8965248415488	20/04/28 05:18:40
3	8	357.8766276172952	265.15321790337606	20/04/28 05:18:40
3	8	357.8586687754881	265.1771359289987	20/04/28 05:18:40
3	8	358.02372418756335	265.1019787955715	20/04/28 05:18:40
3	8	358.13916277679505	265.24519714623705	20/04/28 05:18:40
3	8	358.0871152376059	264.95383206977885	20/04/28 05:18:40
3	8	358.08123324519767	264.9426106392266	20/04/28 05:18:40
3	8	357.9535519875981	264.8726679584282	20/04/28 05:18:40
3	8	357.92589301687974	264.92020276381595	20/04/28 05:18:41
3	8	357.7294867720196	264.7216221073381	20/04/28 05:18:41
3	8	357.6321842556022	264.46578559375973	20/04/28 05:18:41
3	8	357.4701946973002	264.44044248228664	20/04/28 05:18:41
3	8	357.2755674951452	264.5429247380429	20/04/28 05:18:41
3	8	357.2691713002529	264.57750717821136	20/04/28 05:18:41
3	8	357.4211437702915	264.5224176822779	20/04/28 05:18:41
3	8	357.31066345147576	264.74622964705685	20/04/28 05:18:41
3	8	357.40045346544423	264.7111822874559	20/04/28 05:18:41
3	8	357.35615639099353	264.92556916680684	20/04/28 05:18:41
3	8	357.22209948731717	264.98919376817486	20/04/28 05:18:42
3	8	357.27705852284106	264.8505576881466	20/04/28 05:18:42
3	8	357.2791557248824	264.8520817519635	20/04/28 05:18:42
3	8	357.31746631322676	264.8810243286127	20/04/28 05:18:42
3	8	357.3145779800966	264.8670767651929	20/04/28 05:18:42
3	8	357.39139647619083	264.8286988176864	20/04/28 05:18:42
3	8	357.3928526051484	264.8246206453175	20/04/28 05:18:42
3	8	357.3855168374688	264.7748035737127	20/04/28 05:18:42
3	8	357.14270523897244	264.6726899063842	20/04/28 05:18:42
3	8	357.2285113984187	264.57263170714737	20/04/28 05:18:42
3	8	357.2285113984187	264.57263170714737	20/04/28 05:18:43
3	8	357.5338564973413	264.4654330717777	20/04/28 05:18:43
3	8	357.5338564973413	264.4654330717777	20/04/28 05:18:43
3	8	357.62186617752945	264.6382318214977	20/04/28 05:18:43
3	8	357.49577592561127	264.839339422206	20/04/28 05:18:43
3	8	357.67491498300745	264.84271409971956	20/04/28 05:18:43
3	8	357.67491498300745	264.84271409971956	20/04/28 05:18:43
3	8	357.79497719481634	264.7116903600851	20/04/28 05:18:43
3	8	357.90069643539965	264.50251180733807	20/04/28 05:18:43
3	8	357.93604677592725	264.48242415363745	20/04/28 05:18:43
3	8	357.82109006055435	264.22222401445	20/04/28 05:18:44
3	8	357.83203765331655	264.2148766748121	20/04/28 05:18:44
3	8	357.805629993043	264.2526055648815	20/04/28 05:18:44
3	8	357.78083924979137	264.27583996616744	20/04/28 05:18:44
3	8	357.66150064900967	264.42470232854254	20/04/28 05:18:44
3	8	357.57179838099506	264.48663686502357	20/04/28 05:18:44
3	8	357.49067089374716	264.31382386351106	20/04/28 05:18:44
3	8	357.40279542623136	264.3832010898917	20/04/28 05:18:44
3	8	357.41688326601826	264.3395130531242	20/04/28 05:18:44
3	8	357.5612016096203	264.2863982075609	20/04/28 05:18:45
3	8	357.5476581945185	264.2793008700605	20/04/28 05:18:45
3	8	357.53272247208264	264.3055354684061	20/04/28 05:18:45
3	8	357.53272247208264	264.3055354684061	20/04/28 05:18:45
3	8	357.75562104351326	264.4368599103874	20/04/28 05:18:45
3	8	357.9070243629812	264.38309705735753	20/04/28 05:18:45
3	8	357.89327994641945	264.5299297482753	20/04/28 05:18:45
3	8	357.89327994641945	264.5299297482753	20/04/28 05:18:45
3	8	357.8873830212989	264.57940550136124	20/04/28 05:18:45
3	8	358.08875640102474	264.54090841806095	20/04/28 05:18:45
3	8	358.14240805015874	264.5425869615553	20/04/28 05:18:46
3	8	358.2812003126905	264.28241747493246	20/04/28 05:18:46
3	8	358.4259141309324	264.21159179436404	20/04/28 05:18:46
3	8	358.26439613134494	264.4285957457388	20/04/28 05:18:46
3	8	358.26439613134494	264.4285957457388	20/04/28 05:18:46
3	8	358.1904130912567	264.54721490194055	20/04/28 05:18:46
3	8	358.42958954085464	264.48141600686495	20/04/28 05:18:46
3	8	358.3653528020183	264.6499527054576	20/04/28 05:18:46
3	8	358.5886062757164	264.5869246513175	20/04/28 05:18:46
3	8	358.5886062757164	264.5869246513175	20/04/28 05:18:47
3	8	358.7783913695216	264.67184020209413	20/04/28 05:18:47
3	8	358.96291527841106	264.5140640968835	20/04/28 05:18:47
3	8	358.79611551666136	264.6862129513841	20/04/28 05:18:47
3	8	358.79611551666136	264.6862129513841	20/04/28 05:18:47
3	8	358.85381928119	264.40199553372537	20/04/28 05:18:47
3	8	358.95576515409937	264.7668461981736	20/04/28 05:18:47
3	8	358.95576515409937	264.7668461981736	20/04/28 05:18:47
3	8	358.7635831891247	264.8145969542062	20/04/28 05:18:47
3	8	358.6872620737768	264.7409564091223	20/04/28 05:18:47
3	8	358.81808221294403	264.884107174658	20/04/28 05:18:48
3	8	358.7025466804299	265.02443478811375	20/04/28 05:18:48
3	8	358.924160157454	265.0664231995719	20/04/28 05:18:48
3	8	358.8744805791469	264.9258738830314	20/04/28 05:18:48
3	8	358.9403918484045	265.1470338491388	20/04/28 05:18:48
3	8	358.88389964859465	265.14457796897665	20/04/28 05:18:48
3	8	358.71419281666664	264.9692372973293	20/04/28 05:18:48
3	8	358.71901703463135	265.0487809238259	20/04/28 05:18:48
3	8	358.5699327672881	264.8492606217166	20/04/28 05:18:48
3	8	358.47746685305145	264.7956711574109	20/04/28 05:18:48
3	8	358.4055780611829	264.8634262161616	20/04/28 05:18:49
