floorId	partitionId	location_x	location_y	timeStamp
3	17	363.19636851782064	252.64559773351434	20/04/28 05:17:35
3	17	363.3021885058299	252.49829999094908	20/04/28 05:17:35
3	17	363.4154737798622	252.5910759540571	20/04/28 05:17:35
3	17	363.52850445711175	252.64000923168484	20/04/28 05:17:35
3	17	363.54777117032893	252.5018127302576	20/04/28 05:17:35
3	17	363.40899646520535	252.4615347655362	20/04/28 05:17:36
3	17	363.487214337713	252.5376187852382	20/04/28 05:17:36
3	17	363.2493849241259	252.59125716506685	20/04/28 05:17:36
3	17	363.45175738523375	252.40560629726207	20/04/28 05:17:36
3	17	363.4173802666203	252.5417337891291	20/04/28 05:17:36
3	17	363.40277720341084	252.4304094157439	20/04/28 05:17:36
3	17	363.326356117382	252.18518998211832	20/04/28 05:17:36
3	17	363.39117054517243	252.17005524540755	20/04/28 05:17:36
3	17	363.39360079275355	252.16663530618445	20/04/28 05:17:36
3	17	363.3827661123293	252.23570766181632	20/04/28 05:17:36
3	17	363.61505850824386	252.18018621543496	20/04/28 05:17:37
3	17	363.5127564494074	252.08403602968616	20/04/28 05:17:37
3	17	363.3606217021897	252.12227514881124	20/04/28 05:17:37
3	17	363.40393461848123	252.18930528942943	20/04/28 05:17:37
3	17	363.28548591313086	252.29149444540462	20/04/28 05:17:37
3	17	363.28035184835386	252.3399652668019	20/04/28 05:17:37
3	17	363.3387346344517	252.42793223620401	20/04/28 05:17:37
3	17	363.26415351488606	252.34337147411566	20/04/28 05:17:37
3	17	362.9870739776796	252.42021522225977	20/04/28 05:17:37
3	17	363.2193944460954	252.28285648969094	20/04/28 05:17:37
3	17	363.22959426371614	252.41806771132184	20/04/28 05:17:38
3	17	363.20291763365697	252.23879997569466	20/04/28 05:17:38
3	17	363.05025600891804	252.26017993760462	20/04/28 05:17:38
3	17	363.0757879701226	252.48993043730025	20/04/28 05:17:38
3	17	363.0771238382471	252.4885782287723	20/04/28 05:17:38
3	17	362.93402357882525	252.32752504955943	20/04/28 05:17:38
3	17	362.9246525598587	252.37457710223018	20/04/28 05:17:38
3	17	362.6627180138772	252.35284583722088	20/04/28 05:17:38
3	17	362.81614616053855	252.50018248537958	20/04/28 05:17:38
3	17	362.849695580568	252.5686292885734	20/04/28 05:17:39
3	17	362.8078352305055	252.6979172029516	20/04/28 05:17:39
3	17	362.84729186595746	252.55287615927517	20/04/28 05:17:39
3	17	363.04269921028805	252.62909220169	20/04/28 05:17:39
3	17	363.15175691942403	252.67571065704763	20/04/28 05:17:39
3	17	363.1181128985434	252.77274569498655	20/04/28 05:17:39
3	17	363.13020832144133	252.75585226976827	20/04/28 05:17:39
3	17	363.01913757306744	252.5641561807111	20/04/28 05:17:39
3	17	362.99190942330796	252.65599258664534	20/04/28 05:17:39
3	17	362.97308456642014	252.6840415991095	20/04/28 05:17:39
3	17	362.7101646644286	252.63053943114082	20/04/28 05:17:40
3	17	362.5757528827157	252.57789044224157	20/04/28 05:17:40
3	17	362.54199224057845	252.68673681330722	20/04/28 05:17:40
3	17	362.4368724662945	252.42539551675492	20/04/28 05:17:40
3	17	362.4040402051691	252.29450609424245	20/04/28 05:17:40
3	17	362.3950094296738	252.2897897782572	20/04/28 05:17:40
3	17	362.309553765012	252.31572367883842	20/04/28 05:17:40
3	17	362.39326433427584	252.33049085167963	20/04/28 05:17:40
3	17	362.3349238455035	252.48624177049442	20/04/28 05:17:40
3	17	362.5105665005598	252.53224400563647	20/04/28 05:17:40
3	17	362.7726440146633	252.5645322426789	20/04/28 05:17:41
3	17	362.93390106485555	252.45614402659942	20/04/28 05:17:41
3	17	362.96812955280905	252.50936995115774	20/04/28 05:17:41
3	17	363.16250903340375	252.30862875261886	20/04/28 05:17:41
3	17	363.17126819158494	252.30751351162408	20/04/28 05:17:41
3	17	363.3808051275976	252.30250685294862	20/04/28 05:17:41
3	17	363.40063409178504	252.19888116442672	20/04/28 05:17:41
3	17	363.39870594863976	252.44061402820756	20/04/28 05:17:41
3	17	363.4055537704439	252.70437379303647	20/04/28 05:17:41
3	17	363.4321459599454	252.7373700413804	20/04/28 05:17:42
3	17	363.2165082467196	252.94499253012512	20/04/28 05:17:42
3	17	363.19602839433026	253.11837281877538	20/04/28 05:17:42
3	17	362.98207823739955	253.13292794218242	20/04/28 05:17:42
3	17	362.8936823277249	253.1140836003604	20/04/28 05:17:42
3	17	363.0963648805921	253.13638399141612	20/04/28 05:17:42
3	17	363.06575415868645	252.9738242787297	20/04/28 05:17:42
3	17	362.9057815757303	252.9263805034003	20/04/28 05:17:42
3	17	362.9559723916409	252.82755790587217	20/04/28 05:17:42
3	17	362.97804364405437	252.86863736746133	20/04/28 05:17:42
3	17	362.7974318951914	252.93828070388457	20/04/28 05:17:43
3	17	362.90313207645227	253.10945079595263	20/04/28 05:17:43
3	17	362.93635615029393	253.19999038276933	20/04/28 05:17:43
3	17	363.00230987200473	253.24708368642752	20/04/28 05:17:43
3	17	362.8114673669727	253.24858772314067	20/04/28 05:17:43
3	17	362.85376343903954	253.23901360412393	20/04/28 05:17:43
3	17	362.67194398464324	253.23248282192773	20/04/28 05:17:43
3	17	362.45523218521816	253.30423076689243	20/04/28 05:17:43
3	17	362.5081107294782	253.35623077460045	20/04/28 05:17:43
3	17	362.5836588374263	253.28643352782086	20/04/28 05:17:44
3	17	362.86425875407787	253.35943955285882	20/04/28 05:17:44
3	17	362.8144711037292	253.3358405802682	20/04/28 05:17:44
3	17	362.8750655054853	253.37402448975928	20/04/28 05:17:44
3	17	362.8600486308179	253.32046496644855	20/04/28 05:17:44
3	17	362.65588703826484	253.37051744008156	20/04/28 05:17:44
3	17	362.6815500022952	253.22839779669502	20/04/28 05:17:44
3	17	362.84255859687255	253.1397214502539	20/04/28 05:17:44
3	17	362.8340728836076	253.07822158598324	20/04/28 05:17:44
3	17	362.6078886541613	253.03843839095666	20/04/28 05:17:44
3	17	362.8106910689699	253.081950484164	20/04/28 05:17:45
3	17	362.83197232232556	253.09785128067907	20/04/28 05:17:45
3	17	362.9027961899152	253.16951885573098	20/04/28 05:17:45
3	17	362.8341646308128	253.25879218142975	20/04/28 05:17:45
3	17	362.7665695770046	253.34814539332606	20/04/28 05:17:45
3	17	362.54157224179465	253.32246416807695	20/04/28 05:17:45
3	17	362.5390535652539	253.27542370864936	20/04/28 05:17:45
3	17	362.5255982661918	253.2792786303235	20/04/28 05:17:45
3	17	362.50973840640967	253.29830970421904	20/04/28 05:17:45
3	17	362.491300853959	253.25086194645505	20/04/28 05:17:45
3	17	362.5027500274661	253.44271157122887	20/04/28 05:17:46
3	17	362.4827698583426	253.46318534339866	20/04/28 05:17:46
3	17	362.46245886228394	253.41349145383302	20/04/28 05:17:46
3	17	362.451508314757	253.35233314705587	20/04/28 05:17:46
3	17	362.51066020210385	253.36176186738643	20/04/28 05:17:46
3	17	362.4311093220251	253.29026986091014	20/04/28 05:17:46
3	17	362.34944540201474	253.2864295578715	20/04/28 05:17:46
3	17	362.3411627172666	253.3358906778516	20/04/28 05:17:46
3	17	362.3217827826449	253.28302538429335	20/04/28 05:17:46
3	17	362.4506469516479	253.26781352771647	20/04/28 05:17:47
3	17	362.6706769889227	253.27556372411954	20/04/28 05:17:47
3	17	362.4778957511744	253.3026929874378	20/04/28 05:17:47
3	17	362.5954806159508	253.4096853709031	20/04/28 05:17:47
3	17	362.37131569468215	253.43779063443313	20/04/28 05:17:47
3	17	362.41353370532227	253.33056250826604	20/04/28 05:17:47
3	17	362.3675476758419	253.3849183594984	20/04/28 05:17:47
3	17	362.3397151447087	253.16062563239404	20/04/28 05:17:47
3	17	362.32506597152576	253.34213912405298	20/04/28 05:17:47
3	17	362.62123833898994	253.31968037703115	20/04/28 05:17:47
3	17	362.5662215246481	253.21164234624175	20/04/28 05:17:48
3	17	362.31598082764435	253.2931437243616	20/04/28 05:17:48
3	17	362.0607876848074	253.3517391702121	20/04/28 05:17:48
3	17	362.2097650931717	253.29828781119835	20/04/28 05:17:48
3	17	362.2248020075111	253.4495576362487	20/04/28 05:17:48
3	17	362.1952688477706	253.4123089530125	20/04/28 05:17:48
3	17	362.23693592739477	253.43648957536456	20/04/28 05:17:48
3	17	362.3320263643722	253.2800913696045	20/04/28 05:17:48
3	17	362.03677365356816	253.2469845693371	20/04/28 05:17:48
3	17	362.01878893305087	253.0502201783378	20/04/28 05:17:48
3	17	362.15527145943355	253.00359462105976	20/04/28 05:17:49
3	17	362.08518639416457	253.0527871349074	20/04/28 05:17:49
3	17	362.1234136360776	253.19060973863873	20/04/28 05:17:49
3	17	362.1075191042776	253.27242602671296	20/04/28 05:17:49
3	17	362.1639183056764	253.41339877151398	20/04/28 05:17:49
3	17	362.1691776968744	253.38558166577488	20/04/28 05:17:49
3	17	362.20739374967445	253.4019827692477	20/04/28 05:17:49
3	17	362.0283599504499	253.29737608501677	20/04/28 05:17:49
3	17	362.08417166545814	253.38251195668465	20/04/28 05:17:49
3	17	362.07142451347227	253.37620697915634	20/04/28 05:17:50
3	17	362.090337470467	253.3725822432496	20/04/28 05:17:50
3	17	361.8430754745493	253.28734852079603	20/04/28 05:17:50
3	17	361.83404561479557	253.29176366252014	20/04/28 05:17:50
3	17	361.8227240676672	253.25698788518173	20/04/28 05:17:50
3	17	361.82291124990945	253.25411377382002	20/04/28 05:17:50
3	17	361.781965449225	253.16194626488277	20/04/28 05:17:50
3	17	361.6920473869651	252.95112062711814	20/04/28 05:17:50
3	17	361.78095409224113	253.16118857687957	20/04/28 05:17:50
3	17	361.61774377407556	253.19980525947244	20/04/28 05:17:50
3	17	361.8180707189419	253.10616900089255	20/04/28 05:17:51
3	17	361.8025094195433	253.0775419964948	20/04/28 05:17:51
3	17	362.0063887475497	252.90783035804282	20/04/28 05:17:51
3	17	361.8718340679499	252.6481659691946	20/04/28 05:17:51
3	17	362.0852488794469	252.57293248226267	20/04/28 05:17:51
3	17	362.0877785014366	252.56472276681504	20/04/28 05:17:51
3	17	362.07855296952124	252.5015561121216	20/04/28 05:17:51
3	17	362.1867030197312	252.68772017647453	20/04/28 05:17:51
3	17	361.92184119963974	252.76849811430287	20/04/28 05:17:51
3	17	362.02032554881566	252.61895703233168	20/04/28 05:17:51
3	17	361.99468849254635	252.62036820806094	20/04/28 05:17:52
3	17	361.981950608374	252.6219475428276	20/04/28 05:17:52
3	17	362.1453367559187	252.655910280281	20/04/28 05:17:52
3	17	362.3449997440257	252.83839588876666	20/04/28 05:17:52
3	17	362.55347640105293	252.9581068296356	20/04/28 05:17:52
3	17	362.5598161162885	252.96105920868564	20/04/28 05:17:52
3	17	362.5656586957526	252.90498851905207	20/04/28 05:17:52
3	17	362.5462439159049	252.99311068915554	20/04/28 05:17:52
3	17	362.60235473547004	252.92363866254175	20/04/28 05:17:52
3	17	362.6400768557709	252.71348725800505	20/04/28 05:17:53
3	17	362.66256603798183	252.70943721941083	20/04/28 05:17:53
3	17	362.57195560000804	252.85965879183337	20/04/28 05:17:53
3	17	362.4832933366579	252.7542704215246	20/04/28 05:17:53
3	17	362.35774763001854	252.63519443592884	20/04/28 05:17:53
3	17	362.4530276821774	252.55579929509653	20/04/28 05:17:53
3	17	362.57275467540285	252.7273933964611	20/04/28 05:17:53
3	17	362.56654219709657	252.70871262331454	20/04/28 05:17:53
3	17	362.3937884830581	252.67728484209954	20/04/28 05:17:53
3	17	362.3651275670728	252.6682185986143	20/04/28 05:17:53
3	17	362.21614966088566	252.6028966658185	20/04/28 05:17:54
3	17	362.0119833656543	252.48065423643573	20/04/28 05:17:54
3	17	362.0943288612479	252.51938068634914	20/04/28 05:17:54
3	17	362.18095956119174	252.25813398587746	20/04/28 05:17:54
3	17	362.1287086696246	252.19992382710006	20/04/28 05:17:54
3	17	362.11228257986266	252.3394708673555	20/04/28 05:17:54
3	17	362.1419474223916	252.3390630008177	20/04/28 05:17:54
3	17	362.1419474223916	252.3390630008177	20/04/28 05:17:54
3	17	362.1020832365352	252.35371348090732	20/04/28 05:17:54
3	17	361.98010537443827	252.2553423776324	20/04/28 05:17:54
3	17	362.21178255743047	252.13270305666842	20/04/28 05:17:55
3	17	362.39256968024563	252.1243180157968	20/04/28 05:17:55
3	17	362.36077829391814	252.10598180448895	20/04/28 05:17:55
3	17	362.3548611043446	252.38345787224029	20/04/28 05:17:55
3	17	362.3548611043446	252.38345787224029	20/04/28 05:17:55
3	17	362.3548611043446	252.38345787224029	20/04/28 05:17:55
3	17	362.09902315246416	252.52522886083105	20/04/28 05:17:55
3	17	361.9265292186448	252.6208152870971	20/04/28 05:17:55
3	17	361.6881219172221	252.75292719059513	20/04/28 05:17:55
3	17	361.51517677151134	252.84876365308702	20/04/28 05:17:56
3	17	361.28433622789925	252.9766824854345	20/04/28 05:17:56
3	17	361.0998253757427	253.0789280112593	20/04/28 05:17:56
3	17	360.90399929207234	253.18744380131213	20/04/28 05:17:56
3	17	360.90399929207234	253.18744380131213	20/04/28 05:17:56
3	17	360.7556950271058	253.26962567504117	20/04/28 05:17:56
3	17	360.56909139013584	253.37303090438033	20/04/28 05:17:56
3	17	360.4797622713934	253.42253207252594	20/04/28 05:17:56
3	17	360.483506765696	253.42314034160506	20/04/28 05:17:56
3	17	360.55251670702097	253.599721288559	20/04/28 05:17:56
3	17	360.5613594943119	253.69120578700048	20/04/28 05:17:57
3	17	360.55740770798377	253.69730850922159	20/04/28 05:17:57
3	17	360.54815424757726	253.70726890152747	20/04/28 05:17:57
3	17	360.4729629035682	253.77324909658472	20/04/28 05:17:57
3	17	360.2434150375382	253.81947195328908	20/04/28 05:17:57
3	17	360.0767529115582	253.88291958279663	20/04/28 05:17:57
3	17	360.0744989666585	253.87175025032084	20/04/28 05:17:57
3	17	359.95964060890486	254.03918071282135	20/04/28 05:17:57
3	17	359.73012769928846	254.0879326113311	20/04/28 05:17:57
3	17	359.7098277416149	254.26266279983636	20/04/28 05:17:58
3	17	359.6924776407967	254.27015839577533	20/04/28 05:17:58
3	17	359.8582794203805	254.48378242432378	20/04/28 05:17:58
3	17	359.9774758946336	254.50592929496298	20/04/28 05:17:58
3	17	359.99822611460127	254.7037186137779	20/04/28 05:17:58
3	17	360.23316612215336	254.55370276986824	20/04/28 05:17:58
3	17	360.4358120632628	254.53646578431574	20/04/28 05:17:58
3	17	360.5348592256775	254.57357137077636	20/04/28 05:17:58
3	17	360.5501222883407	254.58065932910492	20/04/28 05:17:58
3	17	360.7069151982859	254.54273548776956	20/04/28 05:17:58
3	17	360.7845223308755	254.36607807835819	20/04/28 05:17:59
3	17	360.81500802582343	254.4629550981652	20/04/28 05:17:59
3	17	360.66577184443594	254.5510708075105	20/04/28 05:17:59
3	17	360.6448779201715	254.5834295443889	20/04/28 05:17:59
3	17	360.71283162195715	254.7923370217805	20/04/28 05:17:59
3	17	360.772258384471	254.5045477167576	20/04/28 05:17:59
3	17	360.72088523776335	254.68685763657643	20/04/28 05:17:59
3	17	360.45809835509345	254.54768790852242	20/04/28 05:17:59
3	17	360.56370236077055	254.6279336815363	20/04/28 05:17:59
3	17	360.4750876882524	254.70540650923724	20/04/28 05:17:59
3	17	360.7681659193715	254.69549326339936	20/04/28 05:18:00
3	17	360.81866508665803	254.7580163724167	20/04/28 05:18:00
3	17	360.5587956822382	254.77184532985524	20/04/28 05:18:00
3	17	360.54081097576307	254.7820361671804	20/04/28 05:18:00
3	17	360.2955244576473	254.6436761285924	20/04/28 05:18:00
3	17	360.1403479210101	254.73365303497656	20/04/28 05:18:00
3	17	360.0759825494612	254.65889721852906	20/04/28 05:18:00
3	17	360.0135160723042	254.81265828440232	20/04/28 05:18:00
3	17	360.06188027804933	254.56502707761067	20/04/28 05:18:00
3	17	360.0141906983029	254.5089281377268	20/04/28 05:18:01
3	17	360.13388722195805	254.5993653633878	20/04/28 05:18:01
3	17	359.9439178493721	254.42848150645912	20/04/28 05:18:01
3	17	360.0716889340231	254.41218108712565	20/04/28 05:18:01
3	17	360.07112497254803	254.40291294778407	20/04/28 05:18:01
3	17	360.07275923135586	254.40314586820656	20/04/28 05:18:01
3	17	359.934509754015	254.3627786843691	20/04/28 05:18:01
3	17	360.15591491779026	254.42418566641462	20/04/28 05:18:01
3	17	360.0331741706046	254.64576017690572	20/04/28 05:18:01
3	17	359.8279620155487	254.56541985196853	20/04/28 05:18:01
3	17	359.8279620155487	254.56541985196853	20/04/28 05:18:02
3	17	359.8279620155487	254.56541985196853	20/04/28 05:18:02
3	17	359.9587550600637	254.46208459820676	20/04/28 05:18:02
3	17	360.1601471722973	254.30297135865763	20/04/28 05:18:02
3	17	360.5928002367495	253.96114649807913	20/04/28 05:18:02
3	17	360.5928002367495	253.96114649807913	20/04/28 05:18:02
3	17	360.9160846925477	253.70573015387654	20/04/28 05:18:02
3	17	361.0717212905675	253.58276683108954	20/04/28 05:18:02
3	17	361.2999412528406	253.40245779552546	20/04/28 05:18:02
3	17	361.4357724001096	253.29514210359517	20/04/28 05:18:02
3	17	361.56109691594975	253.19612735327007	20/04/28 05:18:03
3	17	361.7938053466962	253.01227212738354	20/04/28 05:18:03
3	17	361.92273744340474	252.9104071468655	20/04/28 05:18:03
3	17	362.0871551524939	252.78050615897538	20/04/28 05:18:03
3	17	362.23664631422247	252.6623981419195	20/04/28 05:18:03
3	17	362.4076705604041	252.52727754782273	20/04/28 05:18:03
3	17	362.5967611621375	252.37788332440252	20/04/28 05:18:03
3	17	362.7505353098363	252.25639146194624	20/04/28 05:18:03
3	17	362.94027832590626	252.1064817875609	20/04/28 05:18:03
3	17	363.0827674699624	251.99390583282312	20/04/28 05:18:04
3	17	363.30545753961917	251.817965782314	20/04/28 05:18:04
3	17	363.4842428671651	251.67671341480968	20/04/28 05:18:04
3	17	363.7157189808173	251.4938318018559	20/04/28 05:18:04
3	17	363.9195394417757	251.3328000043847	20/04/28 05:18:04
3	17	364.1020160738859	251.18863125936755	20/04/28 05:18:04
3	17	364.2438208763189	251.07659598028687	20/04/28 05:18:04
3	34	364.33608333333336	251.096791025835	20/04/28 05:18:04
3	34	364.33608333333336	251.3446434842468	20/04/28 05:18:04
3	34	364.33608333333336	251.56651246647783	20/04/28 05:18:04
3	34	364.33608333333336	251.71921597096144	20/04/28 05:18:05
3	34	364.33608333333336	251.96476040757477	20/04/28 05:18:05
3	34	364.33608333333336	252.2240614660549	20/04/28 05:18:05
3	34	364.33608333333336	252.43496315847824	20/04/28 05:18:05
3	34	364.33608333333336	252.6275683491191	20/04/28 05:18:05
3	34	364.33608333333336	252.8963367064924	20/04/28 05:18:05
3	34	364.33608333333336	252.8963367064924	20/04/28 05:18:05
3	34	364.33608333333336	253.38231487376686	20/04/28 05:18:05
3	34	364.33608333333336	253.61615021479952	20/04/28 05:18:05
3	34	364.33608333333336	253.61615021479952	20/04/28 05:18:05
3	34	364.33608333333336	253.9828779723992	20/04/28 05:18:06
3	34	364.33608333333336	254.2332941028109	20/04/28 05:18:06
3	34	364.33608333333336	254.2332941028109	20/04/28 05:18:06
3	34	364.33608333333336	254.61358096951045	20/04/28 05:18:06
3	34	364.33608333333336	254.80010557238938	20/04/28 05:18:06
3	34	364.33608333333336	255.02103232154738	20/04/28 05:18:06
3	34	364.33608333333336	255.2711128562267	20/04/28 05:18:06
3	34	364.33517173619254	255.5608741904986	20/04/28 05:18:06
3	34	364.302318415413	255.79080952857583	20/04/28 05:18:06
3	34	364.2794873249999	255.9506008181093	20/04/28 05:18:07
3	34	364.25368773726467	256.13116816373525	20/04/28 05:18:07
3	34	364.21230432131733	256.42080432564745	20/04/28 05:18:07
3	34	364.17406786593807	256.68841539466257	20/04/28 05:18:07
3	34	364.1495759166952	256.85983077964397	20/04/28 05:18:07
3	34	364.1495759166952	256.85983077964397	20/04/28 05:18:07
3	34	364.1495759166952	256.85983077964397	20/04/28 05:18:07
3	34	364.1232112803246	257.04435281374367	20/04/28 05:18:07
3	34	364.05201031158873	257.5426774405779	20/04/28 05:18:07
3	34	364.0276443769531	257.71321086870887	20/04/28 05:18:07
3	34	364.0276443769531	257.71321086870887	20/04/28 05:18:08
3	34	363.96948933928115	258.1202290309745	20/04/28 05:18:08
3	34	363.96948933928115	258.1202290309745	20/04/28 05:18:08
3	34	363.93263842266555	258.3781429273302	20/04/28 05:18:08
3	34	363.892942857264	258.6559660829262	20/04/28 05:18:08
3	34	363.8576559438089	258.9029337617635	20/04/28 05:18:08
3	34	363.8153727604593	259.1988672573061	20/04/28 05:18:08
3	34	363.7777905155858	259.46189960763326	20/04/28 05:18:08
3	34	363.7383927966348	259.7376381817418	20/04/28 05:18:08
3	34	363.7165820463617	259.8902882676017	20/04/28 05:18:08
3	34	363.67766097355263	260.16269086868857	20/04/28 05:18:09
3	34	363.63961582233793	260.4289630292856	20/04/28 05:18:09
3	34	363.6175250734279	260.5835727825309	20/04/28 05:18:09
3	15	364.1567093588127	260.63214811817073	20/04/28 05:18:09
3	15	364.4315266083257	260.6544124937247	20/04/28 05:18:09
3	15	364.4315266083257	260.6544124937247	20/04/28 05:18:09
3	15	364.61200241379413	260.6690337779362	20/04/28 05:18:09
3	15	364.8450309894138	260.6879126355464	20/04/28 05:18:09
3	15	365.3355241841067	260.72765004181423	20/04/28 05:18:09
3	15	365.5096399965414	260.7417560698921	20/04/28 05:18:10
3	15	365.5096399965414	260.7417560698921	20/04/28 05:18:10
3	15	365.7756833911635	260.7633096298015	20/04/28 05:18:10
3	15	366.1560229250817	260.7941229147615	20/04/28 05:18:10
3	15	366.4097913632582	260.81468201656935	20/04/28 05:18:10
3	15	366.6555058151408	260.834588623034	20/04/28 05:18:10
3	15	366.92511005365816	260.85643066543827	20/04/28 05:18:10
3	15	367.0758265322249	260.86864099170754	20/04/28 05:18:10
3	15	367.32936157163294	260.88918118466654	20/04/28 05:18:10
3	15	367.51389570420787	260.9041312550768	20/04/28 05:18:10
3	15	367.79035885921104	260.9265289739999	20/04/28 05:18:11
3	15	367.97973321218376	260.94187117585346	20/04/28 05:18:11
3	15	368.208500374252	260.9604047941752	20/04/28 05:18:11
3	15	368.4528954052263	260.98020450748567	20/04/28 05:18:11
3	15	368.7382116581329	261.00331946194217	20/04/28 05:18:11
3	15	368.90052264769304	261.01646911988576	20/04/28 05:18:11
3	15	369.08849133148675	261.0316974411639	20/04/28 05:18:11
3	15	369.2761273502938	261.04689881152024	20/04/28 05:18:11
3	15	369.5479454450532	261.06892020993973	20/04/28 05:18:11
3	15	369.7784859998748	261.08759750003725	20/04/28 05:18:12
3	15	370.0594846847296	261.11036266583693	20/04/28 05:18:12
3	15	370.3539966176614	261.13422261018735	20/04/28 05:18:12
3	15	370.5747127883731	261.15210397580125	20/04/28 05:18:12
3	15	370.7484791875413	261.16618169609205	20/04/28 05:18:12
3	15	370.94475561569993	261.18208307097535	20/04/28 05:18:12
3	15	371.1567129921905	261.19925484108796	20/04/28 05:18:12
3	15	371.31234457120786	261.21186336522334	20/04/28 05:18:12
3	15	371.5155674618351	261.2283275091812	20/04/28 05:18:12
3	15	371.75608265251685	261.2478128964386	20/04/28 05:18:12
3	15	371.9993725898785	261.26752308036447	20/04/28 05:18:13
3	15	372.2600035705541	261.2886381524534	20/04/28 05:18:13
3	15	372.534960446322	261.3109138398569	20/04/28 05:18:13
3	15	372.81114396223506	261.3332889037621	20/04/28 05:18:13
3	15	373.033785751724	261.3513262737742	20/04/28 05:18:13
3	15	373.260008639038	261.36965376715744	20/04/28 05:18:13
3	15	373.4986329953499	261.38898596808247	20/04/28 05:18:13
3	15	373.7547363380729	261.4097342326587	20/04/28 05:18:13
3	15	373.96011329114043	261.42637288842474	20/04/28 05:18:13
3	15	374.16955380314903	261.4433407542477	20/04/28 05:18:13
3	15	374.16955380314903	261.4433407542477	20/04/28 05:18:14
3	15	374.330389352154	261.45637087907363	20/04/28 05:18:14
3	15	374.5293718583154	261.4724914874186	20/04/28 05:18:14
3	15	374.5293718583154	261.4724914874186	20/04/28 05:18:14
3	15	374.6986553993199	261.48620602804044	20/04/28 05:18:14
3	15	374.88882757180954	261.501612865405	20/04/28 05:18:14
3	15	375.1562975469699	261.5232820000278	20/04/28 05:18:14
3	15	375.3661401202977	261.5402824389306	20/04/28 05:18:14
3	15	375.5975974460749	261.5590340014142	20/04/28 05:18:14
3	15	375.8253881823376	261.5774885144	20/04/28 05:18:14
3	15	376.0644337248746	261.596854837813	20/04/28 05:18:15
3	15	376.2762752920043	261.6140172256066	20/04/28 05:18:15
3	15	376.48495865368034	261.6309237507408	20/04/28 05:18:15
3	15	376.77221656963724	261.6541960094256	20/04/28 05:18:15
3	15	376.9519792115808	261.6687595165486	20/04/28 05:18:15
3	15	377.19311908241826	261.6882955123963	20/04/28 05:18:15
3	15	377.40666628892984	261.7055960829125	20/04/28 05:18:15
3	15	377.6872316349145	261.72832614167515	20/04/28 05:18:15
3	15	377.93577511985984	261.7484619428307	20/04/28 05:18:15
3	15	378.1589852002167	261.7665453530435	20/04/28 05:18:16
3	15	378.4232904676374	261.78795809822293	20/04/28 05:18:16
3	15	378.65177750892013	261.8825897117115	20/04/28 05:18:16
3	15	378.78694662493524	262.01222394311446	20/04/28 05:18:16
3	15	378.92167686800997	262.1414372724801	20/04/28 05:18:16
3	15	379.11319487711916	262.32511303098636	20/04/28 05:18:16
3	15	379.2675898086872	262.47318582214155	20/04/28 05:18:16
3	15	379.3880278328379	262.5886921682119	20/04/28 05:18:16
3	15	379.56505485273607	262.7584703123516	20/04/28 05:18:16
3	15	379.75447361136776	262.94013278017286	20/04/28 05:18:16
3	15	379.92783321024064	263.1063936762913	20/04/28 05:18:17
3	15	380.0653557741281	263.23828498693746	20/04/28 05:18:17
3	15	380.19148524670766	263.3592497288633	20/04/28 05:18:17
3	15	380.3506565536132	263.51190331305776	20/04/28 05:18:17
3	15	380.506344379501	263.66121605729074	20/04/28 05:18:17
3	15	380.6168863230945	263.76723154602064	20/04/28 05:18:17
3	15	380.80601821183825	263.94861889065896	20/04/28 05:18:17
3	15	380.9413021901886	264.0783632810315	20/04/28 05:18:17
3	15	381.0673418552974	264.19924189290936	20/04/28 05:18:17
3	15	381.2025336352458	264.32889786020627	20/04/28 05:18:17
3	15	381.3180232520075	264.4396584255284	20/04/28 05:18:18
3	15	381.49117322044634	264.60571827512825	20/04/28 05:18:18
3	15	381.6218464175478	264.7310406858283	20/04/28 05:18:18
3	15	381.81382471274793	264.9151578827	20/04/28 05:18:18
1	33	381.6807446700362	264.7797163039632	20/04/28 05:18:18
1	33	381.52135711591376	264.6185949172692	20/04/28 05:18:18
1	33	381.3329731997943	264.4281617434675	20/04/28 05:18:18
1	33	381.12805562069855	264.2210150519728	20/04/28 05:18:18
1	33	380.92577493632933	264.0165339395897	20/04/28 05:18:18
1	33	380.7197829023068	263.8083011051481	20/04/28 05:18:19
1	33	380.5654626560622	263.65230214897616	20/04/28 05:18:19
1	33	380.5654626560622	263.65230214897616	20/04/28 05:18:19
1	33	380.5654626560622	263.65230214897616	20/04/28 05:18:19
1	33	380.4162857459218	263.50150247859483	20/04/28 05:18:19
1	33	380.24959361188377	263.33299705208856	20/04/28 05:18:19
1	33	380.1087343376831	263.1906054976608	20/04/28 05:18:19
1	33	379.9733690576404	263.0537677015682	20/04/28 05:18:19
1	33	379.9733690576404	263.0537677015682	20/04/28 05:18:19
1	33	379.816550017259	262.8952427691454	20/04/28 05:18:19
1	33	379.61732910234196	262.6938547106699	20/04/28 05:18:20
1	33	379.4158414883386	262.4901752957454	20/04/28 05:18:20
1	33	379.29643751773017	262.369472437689	20/04/28 05:18:20
1	33	379.112787052739	262.1838242059353	20/04/28 05:18:20
1	33	378.97076006324437	262.04025223369854	20/04/28 05:18:20
1	33	378.80248832282126	261.87015001770266	20/04/28 05:18:20
1	33	378.6961805409373	261.7626858099242	20/04/28 05:18:20
1	69	378.4807910308612	261.62677134312213	20/04/28 05:18:20
1	69	378.18218973641194	261.6147582860536	20/04/28 05:18:20
1	69	377.98138619609796	261.60667973973045	20/04/28 05:18:20
1	69	377.81751738345235	261.60008711794796	20/04/28 05:18:21
1	69	377.5866525444535	261.59079917265916	20/04/28 05:18:21
1	69	377.33273926616585	261.58058396341784	20/04/28 05:18:21
1	69	377.10333239756994	261.5713546738749	20/04/28 05:18:21
1	69	376.840189052618	261.560768128944	20/04/28 05:18:21
1	69	376.6051787854837	261.5513134085417	20/04/28 05:18:21
1	69	376.32433239696087	261.54001465078164	20/04/28 05:18:21
1	69	376.05149638048226	261.5290381590609	20/04/28 05:18:21
1	69	375.8851137668677	261.5223444043126	20/04/28 05:18:21
1	69	375.6577060736877	261.5131955437859	20/04/28 05:18:22
1	69	375.40605448282207	261.5030713247063	20/04/28 05:18:22
1	69	375.11155996268764	261.4912234876657	20/04/28 05:18:22
1	69	374.8422034249493	261.480386979185	20/04/28 05:18:22
1	69	374.6180716711957	261.4713699132889	20/04/28 05:18:22
1	69	374.3684642837379	261.46132793475095	20/04/28 05:18:22
1	69	374.3684642837379	261.46132793475095	20/04/28 05:18:22
1	69	374.0764678991974	261.4495806004409	20/04/28 05:18:22
1	69	373.78941836664836	261.43803228340374	20/04/28 05:18:22
1	69	373.5807851339231	261.42963873998076	20/04/28 05:18:22
1	69	373.38249816207724	261.42166143796294	20/04/28 05:18:23
1	69	373.0909177882174	261.4099308402182	20/04/28 05:18:23
1	69	372.88262694776205	261.40155107161115	20/04/28 05:18:23
1	69	372.6478475298652	261.39210563852646	20/04/28 05:18:23
1	69	372.36627238767255	261.3807775622082	20/04/28 05:18:23
1	69	372.13215198118326	261.37135864187417	20/04/28 05:18:23
1	69	371.8891473364296	261.3615822989058	20/04/28 05:18:23
1	69	371.63179446380076	261.3512287110175	20/04/28 05:18:23
1	69	371.38718757173	261.3413879078849	20/04/28 05:18:23
1	69	371.1177371389084	261.3305476219022	20/04/28 05:18:23
1	69	370.9095643787981	261.3221726037968	20/04/28 05:18:24
1	69	370.6307346099016	261.31095497685266	20/04/28 05:18:24
1	69	370.43486819881934	261.30307505664507	20/04/28 05:18:24
1	69	370.1535318422503	261.29175658693396	20/04/28 05:18:24
1	69	369.922218219104	261.28245058656745	20/04/28 05:18:24
1	69	369.62938125263685	261.270669434726	20/04/28 05:18:24
1	69	369.34508892081226	261.25923204289336	20/04/28 05:18:24
1	69	369.1243193340528	261.25035024065727	20/04/28 05:18:24
1	69	368.87886544009535	261.2404753617113	20/04/28 05:18:24
1	69	368.60926250770495	261.2296289405039	20/04/28 05:18:25
1	69	368.34089933592253	261.2188323962235	20/04/28 05:18:25
1	69	368.1497183737064	261.21114097675473	20/04/28 05:18:25
1	69	367.9147393741832	261.2016875142827	20/04/28 05:18:25
1	69	367.74832276921666	261.1949923920251	20/04/28 05:18:25
1	69	367.59747009925314	261.18892342391644	20/04/28 05:18:25
1	69	367.33863826963216	261.1785103359687	20/04/28 05:18:25
1	69	367.1588346788627	261.1712766406124	20/04/28 05:18:25
1	69	367.1588346788627	261.1712766406124	20/04/28 05:18:25
1	69	366.93107449182384	261.16211359887177	20/04/28 05:18:25
1	69	366.70966613995927	261.153206098416	20/04/28 05:18:26
1	69	366.54962138191024	261.1467673225376	20/04/28 05:18:26
1	69	366.38948527041913	261.14032487141014	20/04/28 05:18:26
1	69	366.1995920798679	261.1326852604057	20/04/28 05:18:26
1	69	365.9586764510484	261.122992960836	20/04/28 05:18:26
1	69	365.7048969956448	261.1127831354358	20/04/28 05:18:26
1	69	365.4873237324119	261.1040299247954	20/04/28 05:18:26
1	69	365.25307046775674	261.0946056594318	20/04/28 05:18:26
1	69	365.07957038461103	261.0876255610901	20/04/28 05:18:26
1	69	364.89641494177795	261.0802570170547	20/04/28 05:18:26
1	69	364.6961058306413	261.0721983621588	20/04/28 05:18:27
1	69	364.4146020349392	261.06087315618805	20/04/28 05:18:27
1	69	364.204772309626	261.05243147655796	20/04/28 05:18:27
1	69	363.92275292022117	261.04108552768787	20/04/28 05:18:27
1	69	363.6454051239918	261.029927522127	20/04/28 05:18:27
1	69	363.37431079864524	261.0190211005479	20/04/28 05:18:27
1	69	363.2118425160618	261.0124848236235	20/04/28 05:18:27
1	69	362.96863365724573	261.0027002648997	20/04/28 05:18:27
1	69	362.7218959440355	260.99277373649926	20/04/28 05:18:27
1	69	362.5063070317405	260.98410035847013	20/04/28 05:18:28
1	69	362.2849813080648	260.97519618223686	20/04/28 05:18:28
1	69	362.08131930982216	260.967002637021	20/04/28 05:18:28
1	69	361.9146794283495	260.960298532105	20/04/28 05:18:28
1	69	361.6635114465019	260.9501937691458	20/04/28 05:18:28
1	69	361.37421138355006	260.93855491080603	20/04/28 05:18:28
1	69	361.20867654676243	260.93189526304786	20/04/28 05:18:28
1	69	360.9432915352574	260.9212185334167	20/04/28 05:18:28
1	69	360.7282782956771	260.9125683153313	20/04/28 05:18:28
1	69	360.57106743410117	260.90624355021134	20/04/28 05:18:28
1	69	360.39545554172145	260.8991784914715	20/04/28 05:18:29
1	69	360.103652188273	260.8874389230137	20/04/28 05:18:29
1	69	359.90176508323	260.8793167836949	20/04/28 05:18:29
1	69	359.67505555012787	260.8701960109127	20/04/28 05:18:29
1	69	359.41184014916576	260.8596065670896	20/04/28 05:18:29
1	69	359.2171320928822	260.85177324876406	20/04/28 05:18:29
1	69	359.02086288993115	260.8438771237985	20/04/28 05:18:29
1	69	358.80465037902445	260.8351786577143	20/04/28 05:18:29
1	69	358.5946318264094	260.8267293813551	20/04/28 05:18:29
1	69	358.3845203135339	260.8182763651028	20/04/28 05:18:29
1	69	358.1480861981386	260.80876436172576	20/04/28 05:18:30
1	69	357.93840915481206	260.80032882465923	20/04/28 05:18:30
1	69	357.7140115049939	260.79130106147323	20/04/28 05:18:30
1	69	357.49633858031694	260.7825438413438	20/04/28 05:18:30
1	69	357.3354699929982	260.7760719219117	20/04/28 05:18:30
1	69	357.0664475213829	260.765248853277	20/04/28 05:18:30
1	69	356.90930595750547	260.75892687607933	20/04/28 05:18:30
1	69	356.75867708958714	260.75286691177206	20/04/28 05:18:30
1	69	356.5934599408532	260.74622004495217	20/04/28 05:18:30
1	69	356.2976401601066	260.7343188912259	20/04/28 05:18:31
1	69	356.1228999726842	260.7272889021311	20/04/28 05:18:31
1	69	355.894535911177	260.7181015658593	20/04/28 05:18:31
1	69	355.6277804319931	260.70736970081265	20/04/28 05:18:31
1	69	355.44145428824237	260.6998735960072	20/04/28 05:18:31
1	69	355.2797185826167	260.693366791456	20/04/28 05:18:31
1	69	355.11778441406835	260.6868520025242	20/04/28 05:18:31
1	69	354.8273874726944	260.6751690155643	20/04/28 05:18:31
1	69	354.6218836244795	260.6669013707071	20/04/28 05:18:31
1	69	354.3454067879307	260.65577840480796	20/04/28 05:18:31
1	69	354.18521543831645	260.64933373139036	20/04/28 05:18:32
1	69	354.0228737311958	260.6428025467354	20/04/28 05:18:32
1	69	353.84635150611604	260.6357008643142	20/04/28 05:18:32
1	69	353.689766212287	260.6294012664697	20/04/28 05:18:32
1	69	353.52541208683886	260.6227891200217	20/04/28 05:18:32
1	69	353.25501014943677	260.6119105539678	20/04/28 05:18:32
1	69	353.09839920405415	260.60560992413326	20/04/28 05:18:32
1	69	352.91100260478834	260.5980707537302	20/04/28 05:18:32
1	69	352.63635817882545	260.5870215077156	20/04/28 05:18:32
1	69	352.4330390146074	260.578841755088	20/04/28 05:18:32
1	69	352.17181705566213	260.5683325096202	20/04/28 05:18:33
1	69	351.96038075960763	260.55982619588985	20/04/28 05:18:33
1	69	351.76004327373863	260.5517663994474	20/04/28 05:18:33
1	69	351.5724812454795	260.54422057365474	20/04/28 05:18:33
1	69	351.34924849642823	260.53523967570226	20/04/28 05:18:33
1	69	351.0831225807953	260.5245331386867	20/04/28 05:18:33
1	69	350.8662284292917	260.5158072494549	20/04/28 05:18:33
1	69	350.65437203362984	260.50728403465735	20/04/28 05:18:33
1	69	350.4817935895013	260.50034101486256	20/04/28 05:18:33
1	69	350.275933071416	260.49205902078586	20/04/28 05:18:34
1	69	350.04490807136347	260.48276463204246	20/04/28 05:18:34
1	69	349.83466409215475	260.47430628652455	20/04/28 05:18:34
1	69	349.83466409215475	260.47430628652455	20/04/28 05:18:34
1	69	349.56586457900994	260.4634921877533	20/04/28 05:18:34
1	69	349.35939670434533	260.4551857590563	20/04/28 05:18:34
1	69	349.1939216938025	260.4485285181735	20/04/28 05:18:34
1	69	348.9508788393023	260.4387506379851	20/04/28 05:18:34
1	69	348.6885203516025	260.42819566872095	20/04/28 05:18:34
1	69	348.5245808964701	260.42160020491383	20/04/28 05:18:34
1	69	348.2925493100963	260.41226532010046	20/04/28 05:18:35
1	69	348.02021455111543	260.4013089945178	20/04/28 05:18:35
1	69	347.8606495303224	260.39488951899455	20/04/28 05:18:35
1	69	347.6580696451049	260.3867395083707	20/04/28 05:18:35
1	69	347.4462048308738	260.37821595488487	20/04/28 05:18:35
1	69	347.15730065601065	260.3665930235564	20/04/28 05:18:35
1	69	346.8785034421349	260.3553767063364	20/04/28 05:18:35
1	69	346.57901508099894	260.3433279616037	20/04/28 05:18:35
1	69	346.4014588353218	260.33618467940147	20/04/28 05:18:35
1	69	346.217114395357	260.32876830070944	20/04/28 05:18:35
1	69	345.9486894714254	260.3179692720724	20/04/28 05:18:36
1	69	345.71694492211776	260.3086459350745	20/04/28 05:18:36
1	69	345.48730555897083	260.29940729202116	20/04/28 05:18:36
1	69	345.23924226086154	260.2894274338886	20/04/28 05:18:36
1	69	345.04466599697383	260.2815994177155	20/04/28 05:18:36
1	69	344.79772929683924	260.2716648838532	20/04/28 05:18:36
1	69	344.61744183285674	260.26441172174765	20/04/28 05:18:36
1	69	344.36124794912035	260.25410476125165	20/04/28 05:18:36
1	69	344.1280462767976	260.2447228025992	20/04/28 05:18:36
1	69	343.8794555518507	260.23472172550737	20/04/28 05:18:37
1	69	343.64263679998356	260.22519424778386	20/04/28 05:18:37
1	69	343.45351541623944	260.21758568741245	20/04/28 05:18:37
1	69	343.27671864812095	260.21047295982413	20/04/28 05:18:37
1	69	343.11016880001324	260.20377247704903	20/04/28 05:18:37
1	69	342.8855203259949	260.1947346229308	20/04/28 05:18:37
1	69	342.63792978794606	260.1847737844532	20/04/28 05:18:37
1	69	342.455030454066	260.1774155439615	20/04/28 05:18:37
1	69	342.2890791053434	260.17073913947206	20/04/28 05:18:37
1	69	342.1381552875212	260.16466730900714	20/04/28 05:18:37
1	69	342.1381552875212	260.16466730900714	20/04/28 05:18:38
1	69	341.8970547730355	260.1549675712846	20/04/28 05:18:38
1	69	341.67653011415825	260.1460956227654	20/04/28 05:18:38
1	69	341.50780251100974	260.1393075265202	20/04/28 05:18:38
1	69	341.2993265841992	260.1309203116864	20/04/28 05:18:38
1	69	341.09531453649896	260.1227126835975	20/04/28 05:18:38
1	69	340.87093793388414	260.1136857671636	20/04/28 05:18:38
1	69	340.6213492066906	260.1036445393485	20/04/28 05:18:38
1	69	340.3297701258485	260.0919139936233	20/04/28 05:18:38
1	69	340.1311996101208	260.0839252843246	20/04/28 05:18:38
1	69	339.9361786301669	260.07607937673714	20/04/28 05:18:39
1	69	339.68668881772226	260.0660421283707	20/04/28 05:18:39
1	69	339.4626341595653	260.0570281641149	20/04/28 05:18:39
1	69	339.22462121026535	260.0474526425209	20/04/28 05:18:39
1	69	339.0487324126033	260.04037644357834	20/04/28 05:18:39
1	69	338.82441911552496	260.03135207399544	20/04/28 05:18:39
1	69	338.6512640478146	260.0243858560025	20/04/28 05:18:39
1	69	338.3624114705505	260.01276500050193	20/04/28 05:18:39
1	69	338.12259443217096	260.00311689842863	20/04/28 05:18:39
1	69	337.91473773893387	259.9947545960396	20/04/28 05:18:39
1	69	337.63575939522605	259.98353099176813	20/04/28 05:18:40
1	69	337.4415567386242	259.97571800622524	20/04/28 05:18:40
1	69	337.2120308764895	259.96648392944195	20/04/28 05:18:40
1	69	337.0028832584354	259.9580696917339	20/04/28 05:18:40
1	69	336.72644155563984	259.94694813930414	20/04/28 05:18:40
1	69	336.54021715961403	259.93945612792106	20/04/28 05:18:40
1	69	336.3217775915032	259.93066806488673	20/04/28 05:18:40
1	69	336.09701602155883	259.92162566079554	20/04/28 05:18:40
1	69	335.84389762258587	259.9114424304195	20/04/28 05:18:40
1	69	335.62909103658075	259.90280052623376	20/04/28 05:18:41
1	69	335.4331380382987	259.8949171225283	20/04/28 05:18:41
1	69	335.13699723936423	259.88300305388873	20/04/28 05:18:41
1	69	334.86345064519605	259.8719979748494	20/04/28 05:18:41
1	69	334.5907412872679	259.8610265787409	20/04/28 05:18:41
1	69	334.29459797668494	259.849112409055	20/04/28 05:18:41
1	69	334.05795575078366	259.8395920331644	20/04/28 05:18:41
1	69	333.7843755077543	259.8285856003946	20/04/28 05:18:41
1	69	333.5676510181236	259.8198665368457	20/04/28 05:18:41
1	69	333.30484492981634	259.80929356011893	20/04/28 05:18:41
1	69	333.09172131583847	259.8007193637408	20/04/28 05:18:42
1	69	332.86486062912377	259.7915925098833	20/04/28 05:18:42
1	69	332.6118106108327	259.78141203053696	20/04/28 05:18:42
1	69	332.3931611881279	259.7726155248225	20/04/28 05:18:42
1	69	332.10991250884587	259.7612201202745	20/04/28 05:18:42
1	69	331.9506885556251	259.7548143662732	20/04/28 05:18:42
1	69	331.79615897168554	259.7485974718888	20/04/28 05:18:42
1	69	331.51480020694265	259.7372781006723	20/04/28 05:18:42
1	69	331.32408875529956	259.72960557012806	20/04/28 05:18:42
1	69	331.02507333186156	259.7175758521968	20/04/28 05:18:42
1	69	330.8277767037885	259.70963839279347	20/04/28 05:18:43
1	69	330.6019753382798	259.70055415658805	20/04/28 05:18:43
1	69	330.4193028289778	259.6932050414975	20/04/28 05:18:43
1	69	330.13920776067323	259.6819365101726	20/04/28 05:18:43
1	69	329.8586640849946	259.6706499308818	20/04/28 05:18:43
1	69	329.5610171223046	259.658675267625	20/04/28 05:18:43
1	69	329.32976221244735	259.64937162935837	20/04/28 05:18:43
1	69	329.03001571731915	259.6373124996124	20/04/28 05:18:43
1	69	328.781989504911	259.6273341334782	20/04/28 05:18:43
1	69	328.497325844094	259.6158818026735	20/04/28 05:18:44
1	69	328.3183882923222	259.6086829490145	20/04/28 05:18:44
1	69	328.1439414868871	259.6016647629983	20/04/28 05:18:44
1	69	327.8629672833487	259.5903608631002	20/04/28 05:18:44
1	69	327.6575533250675	259.5820968346135	20/04/28 05:18:44
1	69	327.4591623247674	259.57411534741703	20/04/28 05:18:44
1	69	327.245714032203	259.5655280888638	20/04/28 05:18:44
1	69	327.245714032203	259.5655280888638	20/04/28 05:18:44
1	69	327.0715682066844	259.5585220115993	20/04/28 05:18:44
1	69	326.7842298026222	259.5469620729448	20/04/28 05:18:44
1	69	326.538674280473	259.5370831053853	20/04/28 05:18:45
1	69	326.3637098945331	259.53004409653863	20/04/28 05:18:45
1	69	326.13010413754563	259.5206458811176	20/04/28 05:18:45
1	69	325.9609175183426	259.5138393181539	20/04/28 05:18:45
1	69	325.7934441669122	259.50710168182883	20/04/28 05:18:45
1	69	325.5220095819532	259.49618157123285	20/04/28 05:18:45
1	69	325.28389803474704	259.4866020829371	20/04/28 05:18:45
1	69	325.04149467288966	259.4768499302381	20/04/28 05:18:45
1	69	324.8628644732907	259.4696634416935	20/04/28 05:18:45
1	69	324.6408167185489	259.4607302173598	20/04/28 05:18:45
1	69	324.3659873358103	259.44967353033155	20/04/28 05:18:46
1	69	324.08299148771954	259.4382882974592	20/04/28 05:18:46
1	69	323.85403918524884	259.4290772956093	20/04/28 05:18:46
1	69	323.70216627913766	259.4229672822832	20/04/28 05:18:46
1	69	323.47760257464637	259.41393283853586	20/04/28 05:18:46
1	69	323.24371328649494	259.40452321634564	20/04/28 05:18:46
1	69	323.0701582258365	259.39754090619834	20/04/28 05:18:46
1	69	322.8479901936019	259.38860284296936	20/04/28 05:18:46
1	69	322.60540149586313	259.3788432340049	20/04/28 05:18:46
1	69	322.4441898840886	259.37235751432326	20/04/28 05:18:47
1	69	322.2148347423945	259.3631303058103	20/04/28 05:18:47
1	69	321.98333238396987	259.3538167124168	20/04/28 05:18:47
1	69	321.797745408002	259.3463503451407	20/04/28 05:18:47
1	69	321.61887510240086	259.3391541968687	20/04/28 05:18:47
1	69	321.3281438771589	259.32745776130275	20/04/28 05:18:47
1	69	321.0452886099313	259.3160781841525	20/04/28 05:18:47
1	69	320.7544788440916	259.30437858881226	20/04/28 05:18:47
1	69	320.5820104236357	259.2974399953903	20/04/28 05:18:47
1	69	320.2881497804696	259.28561765991424	20/04/28 05:18:47
1	69	320.01463710695015	259.2746139455398	20/04/28 05:18:48
1	69	319.81296725666385	259.2665005466178	20/04/28 05:18:48
1	69	319.5529740326934	259.25604073450364	20/04/28 05:18:48
1	69	319.3230903526208	259.24679226231285	20/04/28 05:18:48
1	69	319.0260865195848	259.2348434728663	20/04/28 05:18:48
1	69	318.7816572916856	259.22500981735794	20/04/28 05:18:48
1	69	318.4821321575536	259.2129595932073	20/04/28 05:18:48
1	69	318.2686123855932	259.2043694589597	20/04/28 05:18:48
1	69	318.0167617886061	259.1942372336459	20/04/28 05:18:48
1	69	317.785481370774	259.1849325691655	20/04/28 05:18:48
1	69	317.5262752705361	259.174504423901	20/04/28 05:18:49
