floorId	partitionId	location_x	location_y	timeStamp
20	947	351.9516308133513	276.8636062736671	21/02/21 12:33:05
20	947	352.10437329140046	276.61503785855035	21/02/21 12:33:05
20	947	352.1890201886832	276.47728609904743	21/02/21 12:33:05
20	947	352.27777956592575	276.3328418160312	21/02/21 12:33:05
20	947	352.42530863099967	276.0927575489861	21/02/21 12:33:05
20	947	352.51674405109327	275.9439583560669	21/02/21 12:33:05
20	947	352.60624432279553	275.7983083641741	21/02/21 12:33:05
20	947	352.73785682346926	275.58412622493	21/02/21 12:33:05
20	947	352.8435328032238	275.4121523828201	21/02/21 12:33:06
20	947	352.9330153019732	275.2665313140846	21/02/21 12:33:06
20	947	353.0463447448907	275.08210246120854	21/02/21 12:33:06
20	947	353.1689933108664	274.882507953837	21/02/21 12:33:06
20	947	353.31225837329896	274.649362793661	21/02/21 12:33:06
20	947	353.4582485373486	274.4117828868536	21/02/21 12:33:06
20	947	353.4582485373486	274.4117828868536	21/02/21 12:33:06
20	947	353.5895712804642	274.19807229015555	21/02/21 12:33:06
20	947	353.7100396149634	274.0020258244921	21/02/21 12:33:06
20	924	353.8360608249398	273.70159398291014	21/02/21 12:33:07
20	924	353.54115009878774	273.6726886626956	21/02/21 12:33:07
20	924	353.29498545899133	273.6485611315215	21/02/21 12:33:07
20	924	353.29498545899133	273.6485611315215	21/02/21 12:33:07
20	924	353.08932330897767	273.62840340318206	21/02/21 12:33:07
20	924	352.69291795714435	273.58955020927147	21/02/21 12:33:07
20	924	352.4449387360171	273.5652448240901	21/02/21 12:33:07
20	924	352.205817776053	273.54180767072523	21/02/21 12:33:07
20	924	351.9568238174649	273.5174028272718	21/02/21 12:33:07
20	924	351.715055480395	273.49370619442317	21/02/21 12:33:07
20	924	351.715055480395	273.49370619442317	21/02/21 12:33:08
20	924	351.5152929904824	273.47412671417464	21/02/21 12:33:08
20	924	351.05896976121244	273.4294007415541	21/02/21 12:33:08
20	924	351.05896976121244	273.4294007415541	21/02/21 12:33:08
20	924	350.8805642199746	273.41191453694967	21/02/21 12:33:08
20	924	350.44018255571615	273.3687510576551	21/02/21 12:33:08
20	924	350.44018255571615	273.3687510576551	21/02/21 12:33:08
20	924	349.9757776133948	273.3232329656475	21/02/21 12:33:08
20	924	349.825180724057	273.3084723926211	21/02/21 12:33:08
20	924	349.5377130680639	273.2802965959784	21/02/21 12:33:09
20	924	349.3613035702222	273.2630060311674	21/02/21 12:33:09
20	924	349.3613035702222	273.2630060311674	21/02/21 12:33:09
20	924	349.0854471280177	273.2359682936825	21/02/21 12:33:09
20	924	348.885870157824	273.21640699692614	21/02/21 12:33:09
20	924	348.359628968474	273.16482809951975	21/02/21 12:33:09
20	924	348.359628968474	273.16482809951975	21/02/21 12:33:09
20	924	347.9650117262936	273.1261501650267	21/02/21 12:33:09
20	924	347.7487511641694	273.10495364606805	21/02/21 12:33:09
20	924	347.45282550334656	273.07594884825215	21/02/21 12:33:09
20	924	347.300661586008	273.06103468486054	21/02/21 12:33:10
20	924	347.0291422209238	273.0344220407746	21/02/21 12:33:10
20	924	346.79829490335266	273.0117958185204	21/02/21 12:33:10
20	924	346.79829490335266	273.0117958185204	21/02/21 12:33:10
20	924	346.5086611132725	272.9834077108498	21/02/21 12:33:10
20	924	346.1222986263605	272.9455388562686	21/02/21 12:33:10
20	924	346.1222986263605	272.9455388562686	21/02/21 12:33:10
20	924	345.85567143879734	272.9194057130799	21/02/21 12:33:10
20	924	345.43041498524366	272.8777247131256	21/02/21 12:33:10
20	924	345.16171795832383	272.8513886971212	21/02/21 12:33:11
20	924	344.9312096582688	272.8287957032612	21/02/21 12:33:11
20	924	344.6680304362149	272.80300050826594	21/02/21 12:33:11
20	924	344.46235510121375	272.7828414876158	21/02/21 12:33:11
20	924	344.17579569093533	272.7547547115848	21/02/21 12:33:11
20	924	344.17579569093533	272.7547547115848	21/02/21 12:33:11
20	924	343.9980969101145	272.7373377792528	21/02/21 12:33:11
20	924	343.8410923296188	272.7219491640824	21/02/21 12:33:11
20	924	343.8410923296188	272.7219491640824	21/02/21 12:33:11
20	924	343.3613611245128	272.67492888685666	21/02/21 12:33:11
20	924	343.0937512352202	272.6486994253396	21/02/21 12:33:12
20	924	342.8630578511415	272.62608829069154	21/02/21 12:33:12
20	924	342.6171434177868	272.601985283201	21/02/21 12:33:12
20	924	342.36316687154124	272.57709207740953	21/02/21 12:33:12
20	924	342.12749308481335	272.5539927945844	21/02/21 12:33:12
20	924	342.12749308481335	272.5539927945844	21/02/21 12:33:12
20	924	341.8402890466753	272.5258428361288	21/02/21 12:33:12
20	924	341.56633448134147	272.49899150881856	21/02/21 12:33:12
20	924	341.3266716013636	272.4755012398152	21/02/21 12:33:12
20	924	341.06264336199104	272.4496228294083	21/02/21 12:33:13
20	924	340.84198733917293	272.427995494655	21/02/21 12:33:13
20	924	340.34577714173696	272.3793600488109	21/02/21 12:33:13
20	924	340.09785794911954	272.35506054725175	21/02/21 12:33:13
20	924	339.9308787091446	272.33869427782633	21/02/21 12:33:13
20	924	339.64928136619477	272.31109385285794	21/02/21 12:33:13
20	924	339.49888246543424	272.29635268544394	21/02/21 12:33:13
20	924	339.3142127111752	272.2782525015325	21/02/21 12:33:13
20	924	339.133986815136	272.2605878770411	21/02/21 12:33:13
20	924	338.91555679186627	272.23917872095694	21/02/21 12:33:14
20	924	338.724538859817	272.22045632803264	21/02/21 12:33:14
20	924	338.4380371556282	272.1923752079946	21/02/21 12:33:14
20	924	338.23924480824684	272.1728908150997	21/02/21 12:33:14
20	924	338.23924480824684	272.1728908150997	21/02/21 12:33:14
20	924	337.680009259861	272.1180780152658	21/02/21 12:33:14
20	924	337.680009259861	272.1180780152658	21/02/21 12:33:14
20	924	337.3965269231054	272.0902928348961	21/02/21 12:33:14
20	924	337.20214526862424	272.0712407507623	21/02/21 12:33:14
20	924	336.94504110745396	272.04604099555473	21/02/21 12:33:14
20	924	336.7375282604337	272.0257018733735	21/02/21 12:33:15
20	924	336.5508203446061	272.0074019215067	21/02/21 12:33:15
20	924	336.3129446748874	271.9840868237678	21/02/21 12:33:15
20	924	336.0658579601768	271.95986891652973	21/02/21 12:33:15
20	924	335.82232988363637	271.93599980493286	21/02/21 12:33:15
20	924	335.5894933078741	271.913178607929	21/02/21 12:33:15
20	924	335.2959085152275	271.8844032474927	21/02/21 12:33:15
20	924	335.1346261647751	271.8685953518437	21/02/21 12:33:15
20	924	334.62481118853105	271.81862644996346	21/02/21 12:33:15
20	924	334.35684473362704	271.7923620400967	21/02/21 12:33:16
20	924	334.1737569412674	271.77441691027866	21/02/21 12:33:16
20	924	334.1737569412674	271.77441691027866	21/02/21 12:33:16
20	924	333.9686104462352	271.7543097232422	21/02/21 12:33:16
20	924	333.7256221016547	271.7304935128244	21/02/21 12:33:16
20	924	333.47318893989114	271.70575158000713	21/02/21 12:33:16
20	924	333.27313420194287	271.6861434554188	21/02/21 12:33:16
20	924	333.02528686149043	271.6618509963632	21/02/21 12:33:16
20	924	332.6155739056858	271.62169347365085	21/02/21 12:33:16
20	924	332.6155739056858	271.62169347365085	21/02/21 12:33:16
20	924	332.37754198212855	271.59836306087993	21/02/21 12:33:17
20	924	332.12332129220425	271.57344592563936	21/02/21 12:33:17
20	924	331.8726214127374	271.5488738784023	21/02/21 12:33:17
20	924	331.61103819715163	271.5232351140619	21/02/21 12:33:17
20	924	331.45702678793566	271.5081398709754	21/02/21 12:33:17
20	924	331.1988961856379	271.48283951037496	21/02/21 12:33:17
20	924	330.93739183943626	271.4572084763224	21/02/21 12:33:17
20	924	330.7848777624498	271.44225999245396	21/02/21 12:33:17
20	924	330.4945475588661	271.41380362665114	21/02/21 12:33:17
20	903	330.4017582109734	271.31836254570567	21/02/21 12:33:18
20	903	330.3885529482802	271.038972245088	21/02/21 12:33:18
20	903	330.37987150059354	270.85529454511897	21/02/21 12:33:18
20	903	330.3704972523776	270.6569589203038	21/02/21 12:33:18
20	903	330.3621188659991	270.47969323893335	21/02/21 12:33:18
20	903	330.3535363086745	270.29810781146443	21/02/21 12:33:18
20	903	330.3433920620827	270.083480948625	21/02/21 12:33:18
20	903	330.33421719195405	269.8893636650136	21/02/21 12:33:18
20	903	330.3210100707161	269.6099340422414	21/02/21 12:33:18
20	903	330.3100069009969	269.377134516248	21/02/21 12:33:18
20	903	330.29858012889207	269.1353726242183	21/02/21 12:33:19
20	903	330.2910800453319	268.9766896317468	21/02/21 12:33:19
20	903	330.2812544167484	268.76880392833675	21/02/21 12:33:19
20	903	330.2729200312195	268.5924691947916	21/02/21 12:33:19
20	903	330.26064369951104	268.3327327483318	21/02/21 12:33:19
20	903	330.2508920710395	268.12641270203903	21/02/21 12:33:19
20	903	330.2417559204319	267.9331146265637	21/02/21 12:33:19
20	903	330.22763879505413	267.63443159429124	21/02/21 12:33:19
