floorId	partitionId	location_x	location_y	timeStamp
3	17	359.0905138376525	252.42678797081683	20/04/28 05:14:48
3	17	359.26700241303433	252.4045726512832	20/04/28 05:14:48
3	17	359.4871148945169	252.3768662170344	20/04/28 05:14:48
3	17	359.4871148945169	252.3768662170344	20/04/28 05:14:48
3	17	359.74966634697785	252.3438178205712	20/04/28 05:14:48
3	17	359.9237461827493	252.3219056986808	20/04/28 05:14:48
3	17	360.0956381831398	252.30026896833897	20/04/28 05:14:48
3	17	360.31409281056614	252.27277121477968	20/04/28 05:14:49
3	17	360.535624924658	252.2448860857232	20/04/28 05:14:49
3	17	360.7890724504935	252.21298363674447	20/04/28 05:14:49
3	17	361.0230148390045	252.1835363770451	20/04/28 05:14:49
3	17	361.2066803820224	252.16041766402563	20/04/28 05:14:49
3	17	361.4139462091814	252.13432828929538	20/04/28 05:14:49
3	17	361.6973850028164	252.0986507200521	20/04/28 05:14:49
3	17	361.9305119328019	252.06930610536344	20/04/28 05:14:49
3	17	362.1591406634389	252.04052769693283	20/04/28 05:14:49
3	17	362.445846332343	252.00443891309493	20/04/28 05:14:49
3	17	362.69517106355204	251.9730554166875	20/04/28 05:14:50
3	17	362.90025385921945	251.9472408288211	20/04/28 05:14:50
3	17	363.13348136479476	251.9178835542826	20/04/28 05:14:50
3	17	363.3101086220069	251.89565077831492	20/04/28 05:14:50
3	17	363.5797819307171	251.86170592545554	20/04/28 05:14:50
3	17	363.86301409201184	251.82605436584745	20/04/28 05:14:50
3	17	363.8826765435973	251.82357937479583	20/04/28 05:14:50
3	17	364.12182267529334	251.74170926618555	20/04/28 05:14:50
3	17	364.09896015837575	251.89368470121195	20/04/28 05:14:50
3	17	364.10661693297754	251.9312290875561	20/04/28 05:14:51
3	17	364.030378957545	251.8932662935813	20/04/28 05:14:51
3	17	364.00564388450806	252.0733261514064	20/04/28 05:14:51
3	17	364.08601942146936	251.98101197574456	20/04/28 05:14:51
3	17	363.8022028675657	251.7269194780001	20/04/28 05:14:51
3	17	363.9908996274665	251.76492762581074	20/04/28 05:14:51
3	17	363.9908996274665	251.76492762581074	20/04/28 05:14:51
3	17	364.0219896943015	251.94146511679784	20/04/28 05:14:51
3	17	364.0071850163363	252.0160616916687	20/04/28 05:14:51
3	17	364.0375535299223	252.02685617058063	20/04/28 05:14:51
3	17	363.9342586918921	252.09146652819138	20/04/28 05:14:52
3	17	363.9765916463982	252.12580353246415	20/04/28 05:14:52
3	17	363.9765916463982	252.12580353246415	20/04/28 05:14:52
3	17	363.833865933486	252.1182016860064	20/04/28 05:14:52
3	17	363.7664106341212	252.21325565225177	20/04/28 05:14:52
3	17	363.95795903342315	252.02017363770162	20/04/28 05:14:52
3	17	363.95795903342315	252.02017363770162	20/04/28 05:14:52
3	17	363.9435100599816	252.07660029164157	20/04/28 05:14:52
3	17	364.10421172792394	252.20915833736257	20/04/28 05:14:52
3	17	364.0442817444608	252.39882302344373	20/04/28 05:14:53
3	17	364.07334496109286	252.43015712734706	20/04/28 05:14:53
3	17	363.9274572641181	252.59071110322478	20/04/28 05:14:53
3	17	363.91106668448873	252.4473046028389	20/04/28 05:14:53
3	17	363.7393440981612	252.51481442296105	20/04/28 05:14:53
3	17	363.8900831198375	252.44185065526128	20/04/28 05:14:53
3	17	364.0913122568862	252.27940661634022	20/04/28 05:14:53
3	17	363.7995560442599	252.20971416376176	20/04/28 05:14:53
3	17	363.7844464688262	252.20253763245194	20/04/28 05:14:53
3	17	363.7844464688262	252.20253763245194	20/04/28 05:14:53
3	17	363.8591610492828	252.25220558583342	20/04/28 05:14:54
3	17	363.77891533250414	252.28089411815787	20/04/28 05:14:54
3	17	363.9672134847345	252.23114360363934	20/04/28 05:14:54
3	17	363.95678323771534	252.0841481293274	20/04/28 05:14:54
3	17	363.97493839626287	252.04843295587207	20/04/28 05:14:54
3	17	363.79035269142105	252.0038470199928	20/04/28 05:14:54
3	17	363.79035269142105	252.0038470199928	20/04/28 05:14:54
3	17	363.83651334532766	251.98229588535614	20/04/28 05:14:54
3	17	363.79970844882376	252.235450721553	20/04/28 05:14:54
3	17	363.7524103589605	252.4811596357545	20/04/28 05:14:54
3	17	363.7524103589605	252.4811596357545	20/04/28 05:14:55
3	17	363.7013404256132	252.4656772262662	20/04/28 05:14:55
3	17	363.8343884982921	252.71394334887125	20/04/28 05:14:55
3	17	363.8940436336411	252.66747265838492	20/04/28 05:14:55
3	17	363.6506488632357	252.51522057786585	20/04/28 05:14:55
3	17	363.77975239688465	252.6325724028965	20/04/28 05:14:55
3	17	364.0602411086143	252.643609814339	20/04/28 05:14:55
3	17	364.02965761497273	252.5224652922761	20/04/28 05:14:55
3	17	364.0670791713574	252.53866850095156	20/04/28 05:14:55
3	17	364.05057702917446	252.38709456360104	20/04/28 05:14:56
3	17	363.8520417914821	252.30754353972864	20/04/28 05:14:56
3	17	363.87870633586414	252.22523103469962	20/04/28 05:14:56
3	17	363.81661763455344	252.12895847600964	20/04/28 05:14:56
3	17	363.9558189254949	252.02140411940823	20/04/28 05:14:56
3	17	363.9590130729657	252.01524871594455	20/04/28 05:14:56
3	17	363.959385651864	252.27679873172033	20/04/28 05:14:56
3	17	363.94860649569324	252.3009696747196	20/04/28 05:14:56
3	17	363.8371369266795	252.109500457796	20/04/28 05:14:56
3	17	363.81594047827485	251.9891425624369	20/04/28 05:14:56
3	17	363.81594047827485	251.9891425624369	20/04/28 05:14:57
3	17	363.94614567388635	251.73320200689463	20/04/28 05:14:57
3	17	364.0137949493103	251.9033218748661	20/04/28 05:14:57
3	17	363.9783917758559	251.74754393906719	20/04/28 05:14:57
3	17	364.08095655725816	251.77179661926914	20/04/28 05:14:57
3	17	364.08095655725816	251.77179661926914	20/04/28 05:14:57
3	17	363.9613407257028	251.53459498944812	20/04/28 05:14:57
3	17	363.7961526213636	251.61050295196338	20/04/28 05:14:57
3	17	363.7961526213636	251.61050295196338	20/04/28 05:14:57
3	17	363.72800760933075	251.75626162396335	20/04/28 05:14:57
3	17	364.05170666308436	251.93771053435404	20/04/28 05:14:58
3	17	364.01351580517047	251.8521328049891	20/04/28 05:14:58
3	17	364.01351580517047	251.8521328049891	20/04/28 05:14:58
3	17	363.4890358174048	251.84194000129287	20/04/28 05:14:58
3	17	363.4890358174048	251.84194000129287	20/04/28 05:14:58
3	17	363.45707302312417	251.76421833638716	20/04/28 05:14:58
3	17	363.21431213264054	251.7158566652107	20/04/28 05:14:58
3	17	363.3034259646195	251.7000813011233	20/04/28 05:14:58
3	17	363.5787716513024	251.75426192153103	20/04/28 05:14:58
3	17	363.50207263387733	251.58906196662878	20/04/28 05:14:59
3	17	363.28329395190366	251.76566144117206	20/04/28 05:14:59
3	17	363.21503910417033	251.7897729870223	20/04/28 05:14:59
3	17	363.4215573361546	251.9312340853983	20/04/28 05:14:59
3	17	363.33074098768395	251.94624752679366	20/04/28 05:14:59
3	17	363.23260206309493	251.72856853790165	20/04/28 05:14:59
3	17	363.2891181737449	251.62698636143247	20/04/28 05:14:59
3	17	363.10828437615	251.65126180634113	20/04/28 05:14:59
3	17	363.1281441335882	251.59238673517638	20/04/28 05:14:59
3	17	362.8743288929721	251.6201974794573	20/04/28 05:14:59
3	17	362.7263322689733	251.70363230795948	20/04/28 05:15:00
3	17	362.85200275915315	251.68604318946572	20/04/28 05:15:00
3	17	362.9095147752124	251.51734447574287	20/04/28 05:15:00
3	17	362.80430832933394	251.2684656768256	20/04/28 05:15:00
3	17	362.94770474342124	251.31749274427082	20/04/28 05:15:00
3	17	362.94770474342124	251.31749274427082	20/04/28 05:15:00
3	17	362.94770474342124	251.31749274427082	20/04/28 05:15:00
3	17	362.7433340973238	251.49783511725033	20/04/28 05:15:00
3	17	362.56320781211815	251.6567835882283	20/04/28 05:15:00
3	17	362.34114533886503	251.85273772421058	20/04/28 05:15:00
3	17	362.12642184398055	252.04221574045886	20/04/28 05:15:01
3	17	361.9479304053379	252.19972157711408	20/04/28 05:15:01
3	17	361.83241964812544	252.30165149933208	20/04/28 05:15:01
3	17	361.6908862885673	252.42654449353589	20/04/28 05:15:01
3	17	361.53407937869105	252.56491529563814	20/04/28 05:15:01
3	17	361.3725071272566	252.70749116838573	20/04/28 05:15:01
3	17	361.2342159088816	252.82952320654883	20/04/28 05:15:01
3	17	361.0305026694622	253.0092854654924	20/04/28 05:15:01
3	17	360.9145498702606	253.11160545792254	20/04/28 05:15:01
3	17	360.7468994306181	253.25954489391063	20/04/28 05:15:02
3	17	360.5443122205197	253.43831351309393	20/04/28 05:15:02
3	17	360.3247649418539	253.6320481710394	20/04/28 05:15:02
3	17	360.19376830599015	253.74764326561447	20/04/28 05:15:02
3	17	359.9877688323557	253.92942296155988	20/04/28 05:15:02
3	17	359.9877688323557	253.92942296155988	20/04/28 05:15:02
3	17	359.8336675012466	254.06540628530126	20/04/28 05:15:02
3	17	359.6243835716465	254.25008427703477	20/04/28 05:15:02
3	17	359.4418922916487	254.41111968555026	20/04/28 05:15:02
3	17	359.3149434076121	254.52314293072482	20/04/28 05:15:02
3	17	359.46862555369364	254.59682970049576	20/04/28 05:15:03
3	17	359.305268781986	254.54518722832347	20/04/28 05:15:03
3	17	359.19931273267207	254.70138750085263	20/04/28 05:15:03
3	17	359.1324821646583	254.8991802643784	20/04/28 05:15:03
3	17	358.91890859848115	254.8387551248721	20/04/28 05:15:03
3	17	358.801329879361	254.8463713129517	20/04/28 05:15:03
3	17	358.65945047267905	254.77828015904902	20/04/28 05:15:03
3	17	358.58191559444555	254.75495303233689	20/04/28 05:15:03
3	17	358.57944335634176	254.65082729966122	20/04/28 05:15:03
3	17	358.5983245895009	254.57619102372104	20/04/28 05:15:03
3	17	358.7569843371772	254.53363104226509	20/04/28 05:15:04
3	17	358.95173646752625	254.58476548021216	20/04/28 05:15:04
3	17	358.92719084248597	254.37968139144473	20/04/28 05:15:04
3	17	359.14066260820607	254.33771408619128	20/04/28 05:15:04
3	17	359.2940275736621	254.301707195657	20/04/28 05:15:04
3	17	359.23675508851915	254.30528895936033	20/04/28 05:15:04
3	17	359.20046597514977	254.35296354767402	20/04/28 05:15:04
3	17	359.1519118258256	254.40935233775028	20/04/28 05:15:04
3	17	359.196405377719	254.62790485654486	20/04/28 05:15:04
3	17	359.1971080968755	254.6555521762628	20/04/28 05:15:05
3	17	359.21491612770404	254.57757072609846	20/04/28 05:15:05
3	17	359.3068655713826	254.49071606618236	20/04/28 05:15:05
3	17	359.28403975626793	254.5458252013265	20/04/28 05:15:05
3	17	359.2857134875624	254.3396471566695	20/04/28 05:15:05
3	17	359.4167955232794	254.1032081670353	20/04/28 05:15:05
3	17	359.20864485395913	254.08113522440595	20/04/28 05:15:05
3	17	358.98134489618707	254.23511356180776	20/04/28 05:15:05
3	17	358.97993096177026	254.1167047209084	20/04/28 05:15:05
3	17	359.17400233294677	254.318483568522	20/04/28 05:15:05
3	17	359.1109587721064	254.30864905746628	20/04/28 05:15:06
3	17	359.2725346855604	254.27835026297703	20/04/28 05:15:06
3	17	359.3657920616917	254.11432135495645	20/04/28 05:15:06
3	17	359.2025327194866	254.29061800011047	20/04/28 05:15:06
3	17	359.03979071788217	254.27538006141407	20/04/28 05:15:06
3	17	359.12131707827047	254.43761066197064	20/04/28 05:15:06
3	17	358.9571044137652	254.60371666355707	20/04/28 05:15:06
3	17	359.02140554311546	254.61570801584605	20/04/28 05:15:06
3	17	359.1672479556974	254.41147065791168	20/04/28 05:15:06
3	17	359.26437843914476	254.33509077902087	20/04/28 05:15:06
3	17	359.2912347424084	254.59886092312826	20/04/28 05:15:07
3	17	359.40878359598867	254.38991051619007	20/04/28 05:15:07
3	17	359.1963992260031	254.19908335315424	20/04/28 05:15:07
3	17	359.3481865170147	254.22703685685892	20/04/28 05:15:07
3	17	359.2786106438648	254.0050133896465	20/04/28 05:15:07
3	17	359.2899433395222	253.9526648248886	20/04/28 05:15:07
3	17	359.1966809498013	253.99255583708228	20/04/28 05:15:07
3	17	359.0870202010193	253.7397030353452	20/04/28 05:15:07
3	17	359.0010831305128	253.8353630309844	20/04/28 05:15:07
3	17	358.85025381968137	253.83145059402716	20/04/28 05:15:08
3	17	358.91109922810176	253.76531625791043	20/04/28 05:15:08
3	17	358.9663191537837	253.6571293682437	20/04/28 05:15:08
3	17	359.10084274540134	253.9067705708784	20/04/28 05:15:08
3	17	359.14903880271675	253.9717635522774	20/04/28 05:15:08
3	17	359.21927667802737	253.7296299736505	20/04/28 05:15:08
3	17	359.33189477409826	253.6597578457972	20/04/28 05:15:08
3	17	359.3292787400594	253.6066761982412	20/04/28 05:15:08
3	17	359.26660750383195	253.57993135026203	20/04/28 05:15:08
3	17	359.3714154050836	253.5864101562001	20/04/28 05:15:08
3	17	359.43977167854354	253.30674450906318	20/04/28 05:15:09
3	17	359.45506409549745	253.3266091825666	20/04/28 05:15:09
3	17	359.5324224085093	253.10237552279622	20/04/28 05:15:09
3	17	359.37271610658877	253.24309052467623	20/04/28 05:15:09
3	17	359.5471723495247	253.0230500568259	20/04/28 05:15:09
3	17	359.6184770765525	253.01103392614806	20/04/28 05:15:09
3	17	359.577287431742	253.08920996065743	20/04/28 05:15:09
3	17	359.78042475949536	252.98387546962064	20/04/28 05:15:09
3	17	359.5521690825521	252.80470881599982	20/04/28 05:15:09
3	17	359.54913532274264	252.79514119353124	20/04/28 05:15:10
3	17	359.64566557459386	253.05162574099663	20/04/28 05:15:10
3	17	359.84026784020017	252.98500497983488	20/04/28 05:15:10
3	17	359.8602166727311	252.8234424013053	20/04/28 05:15:10
3	17	359.9735835581557	252.8766062053532	20/04/28 05:15:10
3	17	359.90963386861563	252.9423034492533	20/04/28 05:15:10
3	17	359.86727212234433	252.90705204239447	20/04/28 05:15:10
3	17	360.0145736478084	252.7173651971812	20/04/28 05:15:10
3	17	360.0145736478084	252.7173651971812	20/04/28 05:15:10
3	17	359.8244170377736	252.88289766892044	20/04/28 05:15:10
3	17	359.747224960637	253.18655814143136	20/04/28 05:15:11
3	17	359.747224960637	253.18655814143136	20/04/28 05:15:11
3	17	359.967797206215	253.3591969038351	20/04/28 05:15:11
3	17	359.967797206215	253.3591969038351	20/04/28 05:15:11
3	17	360.061706920719	253.35178996906754	20/04/28 05:15:11
3	17	359.914856875978	253.40536498590097	20/04/28 05:15:11
3	17	360.02877432002583	253.37236026739257	20/04/28 05:15:11
3	17	359.9686323591392	253.2211117814291	20/04/28 05:15:11
3	17	360.10768556123367	252.98842527857326	20/04/28 05:15:11
3	17	360.19734640302767	253.15157067125065	20/04/28 05:15:11
3	17	360.27549275331876	253.13446568923095	20/04/28 05:15:12
3	17	360.2859973574997	253.1362378527551	20/04/28 05:15:12
3	17	360.1591974125592	253.36258641532018	20/04/28 05:15:12
3	17	360.12183757656754	253.17926058202107	20/04/28 05:15:12
3	17	360.0729842136703	253.19186077178253	20/04/28 05:15:12
3	17	360.0729842136703	253.19186077178253	20/04/28 05:15:12
3	17	360.0729842136703	253.19186077178253	20/04/28 05:15:12
3	17	360.01755157631607	253.08924719263862	20/04/28 05:15:12
3	17	360.0075590559721	253.10797641789367	20/04/28 05:15:12
3	17	360.14200143617376	253.15228539046288	20/04/28 05:15:13
3	17	360.2610112040185	253.32702521087572	20/04/28 05:15:13
3	17	360.3279495497617	253.46293345263857	20/04/28 05:15:13
3	17	360.3279495497617	253.46293345263857	20/04/28 05:15:13
3	17	360.4746580749632	253.45336569778667	20/04/28 05:15:13
3	17	360.6647958230486	253.31864429513908	20/04/28 05:15:13
3	17	360.553010866136	253.29345243731282	20/04/28 05:15:13
3	17	360.4849608500455	253.1054131521254	20/04/28 05:15:13
3	17	360.4918452324733	252.9926575929203	20/04/28 05:15:13
3	17	360.48535213438504	252.98069759224822	20/04/28 05:15:13
3	17	360.4767984630264	252.96755368865203	20/04/28 05:15:14
3	17	360.3474919457874	252.93434361322784	20/04/28 05:15:14
3	17	360.374443098403	253.17949175889208	20/04/28 05:15:14
3	17	360.4624246467742	253.14148083329442	20/04/28 05:15:14
3	17	360.2053598117439	253.05136214479185	20/04/28 05:15:14
3	17	360.2421780118064	253.0673979656313	20/04/28 05:15:14
3	17	360.3302429397379	253.08983931081735	20/04/28 05:15:14
3	17	360.18516814350784	253.00999458285256	20/04/28 05:15:14
3	17	360.38330678235263	252.78487519100065	20/04/28 05:15:14
3	17	360.3599275295913	252.74026600523052	20/04/28 05:15:15
3	17	360.367484880873	252.70759397595322	20/04/28 05:15:15
3	17	360.64963166983495	252.67057685539348	20/04/28 05:15:15
3	17	360.87647920519504	252.7490472881138	20/04/28 05:15:15
3	17	360.87797852066603	252.83962594588814	20/04/28 05:15:15
3	17	360.86879582365515	252.824292361797	20/04/28 05:15:15
3	17	360.8205392704989	252.78429410942326	20/04/28 05:15:15
3	17	361.06123786836696	252.75809655495027	20/04/28 05:15:15
3	17	360.9424165719209	252.72643120993737	20/04/28 05:15:15
3	17	360.804884549193	252.80700788665914	20/04/28 05:15:15
3	17	361.0880169162148	252.7820368148356	20/04/28 05:15:16
3	17	360.96298402627116	253.02904822528407	20/04/28 05:15:16
3	17	360.99073771233765	253.0284072261134	20/04/28 05:15:16
3	17	360.88076853953606	253.12520667953964	20/04/28 05:15:16
3	17	360.7829169639894	253.01703341109535	20/04/28 05:15:16
3	17	360.80988065249807	253.01620266400582	20/04/28 05:15:16
3	17	361.0128967536416	253.03391569679027	20/04/28 05:15:16
3	17	360.8309187725863	253.10939257636218	20/04/28 05:15:16
3	17	360.84605632407573	253.2257761938646	20/04/28 05:15:16
3	17	360.8264198054042	253.20165617498282	20/04/28 05:15:17
3	17	360.93449504110356	253.40210957764702	20/04/28 05:15:17
3	17	361.04336054429166	253.35313851395188	20/04/28 05:15:17
3	17	360.8253623070171	253.33233225247508	20/04/28 05:15:17
3	17	360.80730917680836	253.39096317771222	20/04/28 05:15:17
3	17	360.81287198197	253.53476701774062	20/04/28 05:15:17
3	17	360.8568640117211	253.74447134256496	20/04/28 05:15:17
3	17	360.7225265863188	253.72970432869954	20/04/28 05:15:17
3	17	360.7010733766108	253.72613294610687	20/04/28 05:15:17
3	17	360.6587624578248	253.90394864133566	20/04/28 05:15:17
3	17	360.7298073355942	253.8793530756848	20/04/28 05:15:18
3	17	360.79188759505666	253.92472448781047	20/04/28 05:15:18
3	17	360.83974970582034	254.06810773347144	20/04/28 05:15:18
3	17	361.037968224838	254.1685431441582	20/04/28 05:15:18
3	17	361.02938028723975	254.12338903697733	20/04/28 05:15:18
3	17	361.0280747709464	254.14655143262914	20/04/28 05:15:18
3	17	361.0868659104164	253.96529693114718	20/04/28 05:15:18
3	17	361.3103021849021	253.8329167078227	20/04/28 05:15:18
3	17	361.4272705887321	253.77845200403823	20/04/28 05:15:18
3	17	361.4134583254272	253.843151243599	20/04/28 05:15:18
3	17	361.50141937083316	253.99840211107724	20/04/28 05:15:19
3	17	361.57836632146024	253.91935839070752	20/04/28 05:15:19
3	17	361.7291806964157	253.89337343621196	20/04/28 05:15:19
3	17	361.9921012979158	253.90665693990627	20/04/28 05:15:19
3	17	362.1056659125667	253.82797300054222	20/04/28 05:15:19
3	17	362.2838279569014	253.83292713205032	20/04/28 05:15:19
3	17	362.3927209037426	253.60910155914365	20/04/28 05:15:19
3	17	362.3596062602343	253.5161627508652	20/04/28 05:15:19
3	17	362.1399818394971	253.5337786734463	20/04/28 05:15:19
3	17	362.17756483997385	253.77591946462096	20/04/28 05:15:20
3	17	362.36210122550824	253.92546646129477	20/04/28 05:15:20
3	17	362.30339656768984	254.03427152064327	20/04/28 05:15:20
3	17	362.44243592211075	254.05257347958542	20/04/28 05:15:20
3	17	362.4640006419916	253.90098027258222	20/04/28 05:15:20
3	17	362.4130435706031	253.70546215540222	20/04/28 05:15:20
3	17	362.44494582207926	253.57958501806047	20/04/28 05:15:20
3	17	362.45791721129837	253.57149045366918	20/04/28 05:15:20
3	17	362.4770646554981	253.54328656887668	20/04/28 05:15:20
3	17	362.3553221007899	253.46776860473773	20/04/28 05:15:20
3	17	362.5767570491951	253.45721976953428	20/04/28 05:15:21
3	17	362.5569321375229	253.4383044513118	20/04/28 05:15:21
3	17	362.55187953139347	253.4469573132976	20/04/28 05:15:21
3	17	362.5491706838705	253.52115234010327	20/04/28 05:15:21
3	17	362.5928785875127	253.74923995643195	20/04/28 05:15:21
3	17	362.6746593552568	253.66825294670846	20/04/28 05:15:21
3	17	362.72288414695885	253.7334556242091	20/04/28 05:15:21
3	17	362.72152210283804	253.61487048236734	20/04/28 05:15:21
3	17	362.83074190695856	253.72262944239327	20/04/28 05:15:21
3	17	362.93899839443407	253.68930946322922	20/04/28 05:15:21
3	17	362.932666656177	253.68144598930692	20/04/28 05:15:22
3	17	363.11109238857057	253.77723562357303	20/04/28 05:15:22
3	17	363.25493265425945	253.73989543035077	20/04/28 05:15:22
3	17	363.1694861453275	253.8825610033103	20/04/28 05:15:22
3	17	363.0818764246552	253.92161931393923	20/04/28 05:15:22
3	17	363.0541618386638	253.89983741917055	20/04/28 05:15:22
3	17	363.07698222250656	253.93219935005152	20/04/28 05:15:22
3	17	363.20513575698527	253.69384516425984	20/04/28 05:15:22
3	17	363.20446418754625	253.79656728104248	20/04/28 05:15:22
3	17	363.3093052483355	253.6369602730581	20/04/28 05:15:23
3	17	363.2042139453787	253.7900546175458	20/04/28 05:15:23
3	17	363.1580947706303	253.8581928695224	20/04/28 05:15:23
3	17	363.29544272060105	253.6612255302607	20/04/28 05:15:23
3	17	363.34564320636696	253.80912916861004	20/04/28 05:15:23
3	17	363.4095724560352	253.53176540770772	20/04/28 05:15:23
3	17	363.4494556472077	253.6217702061358	20/04/28 05:15:23
3	17	363.30381928242815	253.4600403777704	20/04/28 05:15:23
3	17	363.3655146742061	253.40828894395156	20/04/28 05:15:23
3	17	363.3775460377569	253.312512470746	20/04/28 05:15:23
3	17	363.32425398286574	253.42601130636086	20/04/28 05:15:24
3	17	363.5082649358494	253.36102955370097	20/04/28 05:15:24
3	17	363.50957184723046	253.37401230132977	20/04/28 05:15:24
3	17	363.4802439527602	253.46172991126278	20/04/28 05:15:24
3	17	363.6351149548671	253.3044095076102	20/04/28 05:15:24
3	17	363.63587157928305	253.27520642594675	20/04/28 05:15:24
3	17	363.86258047874946	253.14709846502063	20/04/28 05:15:24
3	17	363.793111781287	253.07155337352555	20/04/28 05:15:24
3	17	363.89481951797114	253.12408314237632	20/04/28 05:15:24
3	17	363.88776832148994	253.20107632471763	20/04/28 05:15:25
3	17	363.9005403064638	253.07260113491273	20/04/28 05:15:25
3	17	363.874101741134	253.01645275932333	20/04/28 05:15:25
3	17	364.03541853843166	253.18837232724516	20/04/28 05:15:25
3	17	364.01111590646724	253.2667782182923	20/04/28 05:15:25
3	17	363.8740839436832	253.502080936422	20/04/28 05:15:25
3	17	363.71522421100246	253.5743084332652	20/04/28 05:15:25
3	17	363.7182910674863	253.6964780992087	20/04/28 05:15:25
3	17	363.5965478011891	253.4409426144457	20/04/28 05:15:25
3	17	363.5941181050318	253.38641357791363	20/04/28 05:15:25
3	17	363.5693567485691	253.24110288891524	20/04/28 05:15:26
3	17	363.4173808593119	253.34544925801637	20/04/28 05:15:26
3	17	363.5417816356649	253.53903219303396	20/04/28 05:15:26
3	17	363.47925534608646	253.6248020552914	20/04/28 05:15:26
3	17	363.6429894287881	253.47513933807124	20/04/28 05:15:26
3	17	363.7292056890113	253.55812962924804	20/04/28 05:15:26
3	17	363.72812014947846	253.558861809461	20/04/28 05:15:26
3	17	363.90350014001064	253.74537789746356	20/04/28 05:15:26
3	17	363.83702661852834	253.63560493584896	20/04/28 05:15:26
3	17	363.83536632648617	253.6744824083443	20/04/28 05:15:26
3	17	363.8145954653796	253.64812868603718	20/04/28 05:15:27
3	17	363.7731825121501	253.78377424039243	20/04/28 05:15:27
3	17	363.67563149886547	253.96586805883135	20/04/28 05:15:27
3	17	363.5611225031037	253.9408718207183	20/04/28 05:15:27
3	17	363.29955866981805	253.84959376763254	20/04/28 05:15:27
3	17	363.4328877068714	253.61105760913026	20/04/28 05:15:27
3	17	363.36304822650004	253.6267098442506	20/04/28 05:15:27
3	17	363.31892837717055	253.6432239112333	20/04/28 05:15:27
3	17	363.4185852342944	253.49026705549466	20/04/28 05:15:27
3	17	363.3046232593903	253.6261975973705	20/04/28 05:15:28
3	17	363.1526503876979	253.70763382469406	20/04/28 05:15:28
3	17	363.11969899075984	253.7947924160417	20/04/28 05:15:28
3	17	362.9105981806916	253.58440962597388	20/04/28 05:15:28
3	17	362.9422033681064	253.55894510857	20/04/28 05:15:28
3	17	362.9073796966613	253.62906355698811	20/04/28 05:15:28
3	17	362.9363260843823	253.65372377911027	20/04/28 05:15:28
3	17	363.1380389609888	253.53551441241785	20/04/28 05:15:28
3	17	363.42208285226485	253.5157764794587	20/04/28 05:15:28
3	17	363.3667430219707	253.30421272074815	20/04/28 05:15:28
3	17	363.62267602698944	253.36188505334786	20/04/28 05:15:29
3	17	363.61943470512097	253.38910701373317	20/04/28 05:15:29
3	17	363.67794391205	253.2332721168546	20/04/28 05:15:29
3	17	363.61480640579884	252.98949057439953	20/04/28 05:15:29
3	17	363.4595916662063	252.9116680718784	20/04/28 05:15:29
3	17	363.6055389149319	252.84519763920107	20/04/28 05:15:29
3	17	363.6748340241521	252.8660492357599	20/04/28 05:15:29
3	17	363.550357066439	253.06531619765505	20/04/28 05:15:29
3	17	363.31774023762034	253.2220742793544	20/04/28 05:15:29
3	17	363.0359182292324	253.13110830809725	20/04/28 05:15:30
3	17	363.00697062456	253.15801511682477	20/04/28 05:15:30
3	17	363.0113480067522	253.10389450295412	20/04/28 05:15:30
3	17	363.09915563286637	253.1276247688183	20/04/28 05:15:30
3	17	363.1242085806941	252.87535729408285	20/04/28 05:15:30
3	17	363.10891349353386	252.869229913923	20/04/28 05:15:30
3	17	363.21854837237333	252.9218881849453	20/04/28 05:15:30
3	17	363.18301153457884	252.73599995216608	20/04/28 05:15:30
3	17	363.11212877984536	253.01679701777505	20/04/28 05:15:30
3	17	363.009052176635	253.06171644855158	20/04/28 05:15:30
3	17	362.84319253569663	253.13597046513127	20/04/28 05:15:31
3	17	362.5524228369562	252.8218982833855	20/04/28 05:15:31
3	17	362.50901228291775	252.78460852009866	20/04/28 05:15:31
3	17	362.50901228291775	252.78460852009866	20/04/28 05:15:31
3	17	362.4763638229948	252.79455865515214	20/04/28 05:15:31
3	17	362.48532736778964	252.82459545063762	20/04/28 05:15:31
3	17	362.48532736778964	252.82459545063762	20/04/28 05:15:31
3	17	362.5185755950748	252.70462420256803	20/04/28 05:15:31
3	17	362.496800476479	252.81872585667588	20/04/28 05:15:31
3	17	362.8417710731432	252.62925143068148	20/04/28 05:15:31
3	17	362.7879467668666	252.8348119850893	20/04/28 05:15:32
3	17	362.7879664695362	252.8348590854577	20/04/28 05:15:32
3	17	362.8766679212142	252.99460097043487	20/04/28 05:15:32
3	17	362.9811304722309	252.81103144708962	20/04/28 05:15:32
3	17	362.9811304722309	252.81103144708962	20/04/28 05:15:32
3	17	363.03945514696744	252.97423369131525	20/04/28 05:15:32
3	17	363.0483118545336	253.0412239470077	20/04/28 05:15:32
3	17	363.1323476675893	253.14923035913372	20/04/28 05:15:32
3	17	362.92410636754676	253.00059834001794	20/04/28 05:15:32
3	17	362.77894293954614	253.04661119032687	20/04/28 05:15:33
3	17	363.0319233050313	253.07035811438368	20/04/28 05:15:33
3	17	362.82829484368887	253.03960076844004	20/04/28 05:15:33
3	17	362.9288549022351	252.96350289583418	20/04/28 05:15:33
3	17	363.1025010927166	252.75538751989998	20/04/28 05:15:33
3	17	363.1114426758724	252.7638028510273	20/04/28 05:15:33
3	17	363.3865089982473	252.65297596842976	20/04/28 05:15:33
3	17	363.3852808876804	252.65504405650094	20/04/28 05:15:33
3	17	363.4329166314632	252.75479642798447	20/04/28 05:15:33
3	17	363.59292167179063	252.59813671201366	20/04/28 05:15:33
3	17	363.69834326383017	252.40521090490336	20/04/28 05:15:34
3	17	363.63682285311546	252.3769541120254	20/04/28 05:15:34
3	17	363.5757029523521	252.384596109031	20/04/28 05:15:34
3	17	363.48034101770634	252.27264983451107	20/04/28 05:15:34
3	17	363.53000214622955	252.3022593467167	20/04/28 05:15:34
3	17	363.3852870717869	252.5514934972036	20/04/28 05:15:34
3	17	363.28350150486943	252.70233526144892	20/04/28 05:15:34
3	17	363.2384914163852	252.74079940183165	20/04/28 05:15:34
3	17	363.2827529107143	252.70889640935914	20/04/28 05:15:34
3	17	363.14681973682826	252.83535933417673	20/04/28 05:15:34
3	17	363.14681973682826	252.83535933417673	20/04/28 05:15:35
3	17	363.138219900303	252.835178136663	20/04/28 05:15:35
3	17	363.26888695634165	253.0489526068826	20/04/28 05:15:35
3	17	363.07738601374797	253.14826488114272	20/04/28 05:15:35
3	17	363.0867084409388	253.1669811160256	20/04/28 05:15:35
3	17	362.9948427937414	253.118609050694	20/04/28 05:15:35
3	17	363.14998094018443	253.19817402109993	20/04/28 05:15:35
3	17	363.0563697254765	253.1047802349303	20/04/28 05:15:35
3	17	363.0864399068054	253.05583615219774	20/04/28 05:15:35
3	17	363.08290997178955	253.0841074921684	20/04/28 05:15:36
3	17	362.857292232502	253.03344862311408	20/04/28 05:15:36
3	17	362.85586865865923	253.22915147683946	20/04/28 05:15:36
3	17	362.9048692243274	252.99094845223178	20/04/28 05:15:36
3	17	362.831882064003	253.02422481686435	20/04/28 05:15:36
3	17	362.7179567279364	253.02256735066672	20/04/28 05:15:36
3	17	362.80345465813997	252.98845940529554	20/04/28 05:15:36
3	17	362.7010509493272	252.79696923023067	20/04/28 05:15:36
3	17	362.6349192357277	252.65738417853848	20/04/28 05:15:36
3	17	362.59536950228085	252.69606515471926	20/04/28 05:15:36
3	17	362.6215955387015	252.73386560316825	20/04/28 05:15:37
3	17	362.6153330581846	252.7252043521306	20/04/28 05:15:37
3	17	362.6225483540163	252.72207513498063	20/04/28 05:15:37
3	17	362.77927219459525	252.8233816727497	20/04/28 05:15:37
3	17	362.6494399837872	252.7816482703066	20/04/28 05:15:37
3	17	362.6915766907889	252.56970114682233	20/04/28 05:15:37
3	17	362.69193016887766	252.66303646471044	20/04/28 05:15:37
3	17	362.64772127538544	252.63623140709447	20/04/28 05:15:37
3	17	362.5231195958966	252.5597382230874	20/04/28 05:15:37
3	17	362.5288536536735	252.58744126639755	20/04/28 05:15:37
3	17	362.6796798813419	252.51678903414958	20/04/28 05:15:38
3	17	362.62013061131006	252.57595198336404	20/04/28 05:15:38
3	17	362.7657014487985	252.34574117936833	20/04/28 05:15:38
3	17	362.8188285870336	252.25925782533915	20/04/28 05:15:38
3	17	362.8534224118511	252.2793849503227	20/04/28 05:15:38
3	17	362.72238339822866	252.45552158638856	20/04/28 05:15:38
3	17	362.65763313739	252.24488400182022	20/04/28 05:15:38
3	17	362.44869802917594	252.15541028467322	20/04/28 05:15:38
3	17	362.4719279930446	252.1586178659822	20/04/28 05:15:38
3	17	362.4304813020805	252.33795669244984	20/04/28 05:15:38
3	17	362.39261809624446	252.36435646891277	20/04/28 05:15:39
3	17	362.1968542637315	252.22322546983133	20/04/28 05:15:39
3	17	362.1145499020702	252.3139561191322	20/04/28 05:15:39
3	17	362.2127235154118	252.33845187441904	20/04/28 05:15:39
3	17	361.97976785135677	252.44044578666535	20/04/28 05:15:39
3	17	361.9817035894778	252.43665973423984	20/04/28 05:15:39
3	17	361.993251008167	252.44224563325656	20/04/28 05:15:39
3	17	362.25399042470116	252.31750075663075	20/04/28 05:15:39
3	17	362.08466349925726	252.36405254941957	20/04/28 05:15:39
3	17	362.0159618147145	252.3315288510196	20/04/28 05:15:40
3	17	362.0786064959678	252.38825750400164	20/04/28 05:15:40
3	17	362.163252137833	252.12277307766902	20/04/28 05:15:40
3	17	362.1400022451563	252.26295233203552	20/04/28 05:15:40
3	17	361.9101408103002	252.31979829660258	20/04/28 05:15:40
3	17	361.89380539155854	252.07850884083598	20/04/28 05:15:40
3	17	361.7366135129487	252.18890215571162	20/04/28 05:15:40
3	17	361.7719736783801	252.18906616101557	20/04/28 05:15:40
3	17	361.71028732126416	252.2131848068558	20/04/28 05:15:40
3	17	361.8102773189918	252.4252518477413	20/04/28 05:15:40
3	17	361.68933393186546	252.296683403541	20/04/28 05:15:41
3	17	361.8660025934552	252.51010841776338	20/04/28 05:15:41
3	17	361.84375718086983	252.50850372424347	20/04/28 05:15:41
3	17	361.746907834913	252.61955472085765	20/04/28 05:15:41
3	17	361.83685801128274	252.40723136007813	20/04/28 05:15:41
3	17	361.74295034920976	252.25963298847856	20/04/28 05:15:41
3	17	361.51908370257524	252.21854166212637	20/04/28 05:15:41
3	17	361.42241386646776	252.14987279407094	20/04/28 05:15:41
3	17	361.5920650739199	252.0351354065851	20/04/28 05:15:41
3	17	361.3874920133752	252.06799359693787	20/04/28 05:15:41
3	17	361.37178588793057	252.0144477686444	20/04/28 05:15:42
3	17	361.3888302415847	251.98613855557986	20/04/28 05:15:42
3	17	361.3888302415847	251.98613855557986	20/04/28 05:15:42
3	17	361.3888302415847	251.98613855557986	20/04/28 05:15:42
3	17	361.26916660427025	252.05389486297244	20/04/28 05:15:42
3	17	361.2748710659464	252.05763188976226	20/04/28 05:15:42
3	17	361.20487491270256	252.1662824066188	20/04/28 05:15:42
3	17	361.04222861390394	252.25856657459158	20/04/28 05:15:42
3	17	360.9498077749911	252.37275619735465	20/04/28 05:15:42
3	17	360.83755190509356	252.15180486427246	20/04/28 05:15:43
3	17	360.85145448164945	252.34216685058493	20/04/28 05:15:43
3	17	360.8545574579518	252.34116806312056	20/04/28 05:15:43
3	17	360.80698679759473	252.46142363444707	20/04/28 05:15:43
3	17	360.868901356984	252.55763662064845	20/04/28 05:15:43
3	17	360.6470040275918	252.530447072294	20/04/28 05:15:43
3	17	360.6916269357522	252.53672447648592	20/04/28 05:15:43
3	17	360.61585524476527	252.76563238499872	20/04/28 05:15:43
3	17	360.56445815165154	253.02924029211664	20/04/28 05:15:43
3	17	360.73154546908813	252.8803864610521	20/04/28 05:15:43
3	17	360.45055805343713	252.82281797984263	20/04/28 05:15:44
3	17	360.4439992502125	252.91814510736884	20/04/28 05:15:44
3	17	360.51331599837846	252.9566038838942	20/04/28 05:15:44
3	17	360.57327711165954	252.76543148025306	20/04/28 05:15:44
3	17	360.65608742635817	252.7626413330457	20/04/28 05:15:44
3	17	360.7028465085906	252.87344441947562	20/04/28 05:15:44
3	17	360.95069398343065	252.825062216909	20/04/28 05:15:44
3	17	360.93638818857175	253.0141981566679	20/04/28 05:15:44
3	17	360.90976191779936	252.92043342764146	20/04/28 05:15:44
3	17	360.8237830943568	252.94508495122716	20/04/28 05:15:45
3	17	360.7906995321474	252.91572842000434	20/04/28 05:15:45
3	17	360.7885388932396	252.91093592471944	20/04/28 05:15:45
3	17	360.70425122014603	253.00533755955334	20/04/28 05:15:45
3	17	360.4977615302206	252.97688197604532	20/04/28 05:15:45
3	17	360.53291467515015	252.71570429866304	20/04/28 05:15:45
3	17	360.68180515884904	252.68033434392717	20/04/28 05:15:45
3	17	360.71772813791813	252.80684439550708	20/04/28 05:15:45
3	17	360.72767977178296	252.78726129272974	20/04/28 05:15:45
3	17	360.89964525404434	252.55064015893237	20/04/28 05:15:45
3	17	360.98460461320207	252.58786706594503	20/04/28 05:15:46
3	17	360.91682557548694	252.44798353474647	20/04/28 05:15:46
3	17	360.88530865305506	252.35384079874498	20/04/28 05:15:46
3	17	360.7823171301247	252.45673100531448	20/04/28 05:15:46
3	17	360.72772265609166	252.32918594292997	20/04/28 05:15:46
3	17	360.6894094170454	252.4473320020844	20/04/28 05:15:46
3	17	360.59303067844786	252.4769857748673	20/04/28 05:15:46
3	17	360.621319006221	252.48561022272153	20/04/28 05:15:46
3	17	360.621319006221	252.48561022272153	20/04/28 05:15:46
3	17	360.52731150661583	252.2756408527146	20/04/28 05:15:46
3	17	360.52731150661583	252.2756408527146	20/04/28 05:15:47
3	17	360.43061295576905	252.18585629534317	20/04/28 05:15:47
3	17	360.35920377123284	252.13679613624575	20/04/28 05:15:47
3	17	360.2594435453761	252.11979698188577	20/04/28 05:15:47
3	17	360.0342066989311	251.99415882467915	20/04/28 05:15:47
3	17	359.96651180639344	252.04960297544784	20/04/28 05:15:47
3	17	359.99583598195807	251.8592848339148	20/04/28 05:15:47
3	17	360.14251799258375	251.94430845990877	20/04/28 05:15:47
3	17	360.1275313430686	251.88895250528714	20/04/28 05:15:47
3	17	360.1259354170802	251.89180372341963	20/04/28 05:15:48
3	17	360.1759769133761	251.74521485221146	20/04/28 05:15:48
3	17	360.17314934329534	251.91456594809574	20/04/28 05:15:48
3	17	360.2391993160452	252.0348011332885	20/04/28 05:15:48
3	17	360.10280096135335	252.22206329791985	20/04/28 05:15:48
3	17	360.09580925869756	252.2127054378534	20/04/28 05:15:48
3	17	359.94594500219677	252.05076037925252	20/04/28 05:15:48
3	17	359.86474487978	252.11733558206603	20/04/28 05:15:48
3	17	359.8699911582935	252.1251442222326	20/04/28 05:15:48
3	17	359.8065278268994	252.2323838351679	20/04/28 05:15:48
3	17	359.8158329529154	252.2305565805231	20/04/28 05:15:49
3	17	359.8158329529154	252.2305565805231	20/04/28 05:15:49
3	17	359.8158329529154	252.2305565805231	20/04/28 05:15:49
3	17	359.9625889972335	252.18790083273674	20/04/28 05:15:49
3	17	360.14186606563817	252.13579260476374	20/04/28 05:15:49
3	17	360.34914870903737	252.07554434583574	20/04/28 05:15:49
3	17	360.57541781910805	252.0097775276044	20/04/28 05:15:49
3	17	360.57541781910805	252.0097775276044	20/04/28 05:15:49
3	17	360.84568103234034	251.9312234924835	20/04/28 05:15:49
3	17	361.2592705295803	251.8110105951999	20/04/28 05:15:49
3	17	361.2592705295803	251.8110105951999	20/04/28 05:15:50
3	17	361.51245622631916	251.7374202686591	20/04/28 05:15:50
3	17	361.6594407004349	251.6946981260344	20/04/28 05:15:50
3	17	361.8917148904369	251.62718588616693	20/04/28 05:15:50
3	17	362.0395228088273	251.5842244032721	20/04/28 05:15:50
3	17	362.27882904828294	251.5146682453547	20/04/28 05:15:50
3	17	362.5476691879385	251.4365278372694	20/04/28 05:15:50
3	17	362.5476691879385	251.4365278372694	20/04/28 05:15:50
3	17	362.9718797427283	251.31322784974586	20/04/28 05:15:50
3	17	363.14760576467546	251.26215176012715	20/04/28 05:15:51
3	17	363.3515261409787	251.20288076941253	20/04/28 05:15:51
3	17	363.3515261409787	251.20288076941253	20/04/28 05:15:51
3	17	363.664421436506	251.11193539900844	20/04/28 05:15:51
3	17	363.664421436506	251.11193539900844	20/04/28 05:15:51
3	17	364.01328185065637	251.0105364964434	20/04/28 05:15:51
3	17	364.1985339189155	250.95669158983472	20/04/28 05:15:51
3	34	364.33608333333336	250.974227058453	20/04/28 05:15:51
3	34	364.33608333333336	251.2054307648068	20/04/28 05:15:51
3	34	364.33608333333336	251.35815131454464	20/04/28 05:15:51
3	34	364.33608333333336	251.56747901754207	20/04/28 05:15:52
3	34	364.33608333333336	251.75782166345766	20/04/28 05:15:52
3	34	364.33608333333336	251.9376444135157	20/04/28 05:15:52
3	34	364.33608333333336	252.2334223600271	20/04/28 05:15:52
3	34	364.33608333333336	252.43519787556767	20/04/28 05:15:52
3	34	364.33608333333336	252.66918327525116	20/04/28 05:15:52
3	34	364.33608333333336	252.92667655884443	20/04/28 05:15:52
3	34	364.33608333333336	253.13037929496988	20/04/28 05:15:52
3	34	364.33608333333336	253.37679410325225	20/04/28 05:15:52
3	34	364.33608333333336	253.65615132790293	20/04/28 05:15:52
3	34	364.33608333333336	253.94836260049388	20/04/28 05:15:53
3	34	364.33608333333336	254.17267927422583	20/04/28 05:15:53
3	34	364.33608333333336	254.42000425566772	20/04/28 05:15:53
3	34	364.33608333333336	254.70731750236496	20/04/28 05:15:53
3	34	364.33608333333336	254.91601002868398	20/04/28 05:15:53
3	34	364.33608333333336	255.13459104501356	20/04/28 05:15:53
3	34	364.33608333333336	255.3216265344062	20/04/28 05:15:53
3	34	364.31291826788	255.5549344382904	20/04/28 05:15:53
3	34	364.2490430199197	255.7702652824578	20/04/28 05:15:53
3	34	364.1891059398422	255.97232010748255	20/04/28 05:15:54
3	34	364.1089562649812	256.24251392588155	20/04/28 05:15:54
3	34	364.0408093724441	256.47224497767394	20/04/28 05:15:54
3	34	363.99144983648824	256.63864167881377	20/04/28 05:15:54
3	34	363.92366548343614	256.86715056809646	20/04/28 05:15:54
3	34	363.875196307616	257.03054576230284	20/04/28 05:15:54
3	34	363.8136146125124	257.2381447746803	20/04/28 05:15:54
3	34	363.750473830708	257.45099964853983	20/04/28 05:15:54
3	34	363.68675337007204	257.6658086867454	20/04/28 05:15:54
3	34	363.6392665753768	257.8258921606271	20/04/28 05:15:54
3	34	363.5923577179325	257.98402734123255	20/04/28 05:15:55
3	34	363.5403367050729	258.15939618865315	20/04/28 05:15:55
3	34	363.46403969848365	258.41660221698095	20/04/28 05:15:55
3	34	363.38781575911156	258.6735619272739	20/04/28 05:15:55
3	34	363.32029484233146	258.9011827424331	20/04/28 05:15:55
3	34	363.2631697982797	259.0937578689738	20/04/28 05:15:55
3	34	363.19678557140134	259.3175467710851	20/04/28 05:15:55
3	34	363.11375269701153	259.5974601883626	20/04/28 05:15:55
3	34	363.06625234136175	259.75758937778954	20/04/28 05:15:55
3	34	362.9839938890344	260.0348921287795	20/04/28 05:15:55
3	34	362.9324484462961	260.2086577743505	20/04/28 05:15:56
3	34	362.86440940121423	260.43802525990543	20/04/28 05:15:56
3	15	362.9023346303629	260.59044717018935	20/04/28 05:15:56
3	15	363.13619818390237	260.59621950653593	20/04/28 05:15:56
3	15	363.38569299309887	260.60237766129586	20/04/28 05:15:56
3	15	363.58168962399617	260.6072153474561	20/04/28 05:15:56
3	15	363.74178563985924	260.6111669168106	20/04/28 05:15:56
3	15	363.9198611984724	260.6155622661665	20/04/28 05:15:56
3	15	364.15691353247695	260.6214133095758	20/04/28 05:15:56
3	15	364.3556864453638	260.6263195213066	20/04/28 05:15:57
3	15	364.5350709605522	260.6307471789786	20/04/28 05:15:57
3	15	364.82115861777197	260.63780853658255	20/04/28 05:15:57
3	15	365.1157808315643	260.6450805483494	20/04/28 05:15:57
3	15	365.2878800920485	260.6493283877476	20/04/28 05:15:57
3	15	365.5737962262571	260.65638551173544	20/04/28 05:15:57
3	15	365.8617940427498	260.663494016839	20/04/28 05:15:57
3	15	366.0923867882514	260.6691856214776	20/04/28 05:15:57
3	15	366.2522977000228	260.67313262200105	20/04/28 05:15:57
3	15	366.4858813909596	260.67889805063993	20/04/28 05:15:57
3	15	366.67561122156417	260.68358105652374	20/04/28 05:15:58
3	15	366.9184407755581	260.68957469614537	20/04/28 05:15:58
3	15	367.1746134544662	260.69589767740126	20/04/28 05:15:58
3	15	367.3848040940155	260.70108570713063	20/04/28 05:15:58
3	15	367.6342348108023	260.7072422799299	20/04/28 05:15:58
3	15	367.90590647717687	260.71394781489	20/04/28 05:15:58
3	15	368.09863369345504	260.71870480373525	20/04/28 05:15:58
3	15	368.3353391067398	260.7245472842751	20/04/28 05:15:58
3	15	368.5206166736745	260.72912039717636	20/04/28 05:15:58
3	15	368.76239451813535	260.73508807798106	20/04/28 05:15:58
3	15	368.91573202757576	260.7388728305243	20/04/28 05:15:59
3	15	369.09231403539076	260.74323131531787	20/04/28 05:15:59
3	15	369.3454545004128	260.7494794539651	20/04/28 05:15:59
3	15	369.56868823521484	260.7549894198477	20/04/28 05:15:59
3	15	369.86695097932375	260.76235128899145	20/04/28 05:15:59
3	15	370.1202096384325	260.76860234496377	20/04/28 05:15:59
3	15	370.3638190555012	260.774615233553	20/04/28 05:15:59
3	15	370.65667437166576	260.7818436338753	20/04/28 05:15:59
3	15	370.8390103859476	260.78634414191345	20/04/28 05:15:59
3	15	371.06622019461537	260.79195224722537	20/04/28 05:16:00
3	15	371.2951624245035	260.79760311301806	20/04/28 05:16:00
3	15	371.4488915247901	260.80139753100104	20/04/28 05:16:00
3	15	371.645503879606	260.80625041476475	20/04/28 05:16:00
3	15	371.8575746092591	260.81148484981156	20/04/28 05:16:00
3	15	372.07679934213223	260.81689586351797	20/04/28 05:16:00
3	15	372.24704946529306	260.82109806159053	20/04/28 05:16:00
3	15	372.4998696401923	260.8273382946779	20/04/28 05:16:00
3	15	372.7394667745698	260.83325215011354	20/04/28 05:16:00
3	15	372.9538409686777	260.8385434404138	20/04/28 05:16:00
3	15	373.2349510090356	260.8454819380069	20/04/28 05:16:01
3	15	373.40092675565916	260.8495786337955	20/04/28 05:16:01
3	15	373.63662229276326	260.85539618807	20/04/28 05:16:01
3	15	373.89810673371665	260.8618502768741	20/04/28 05:16:01
3	15	374.0972087054409	260.8667646105985	20/04/28 05:16:01
3	15	374.38055199618924	260.8737582303866	20/04/28 05:16:01
3	15	374.6464287124102	260.8803207315097	20/04/28 05:16:01
3	15	374.8254285421038	260.88473889418333	20/04/28 05:16:01
3	15	374.9794334563413	260.8885401199432	20/04/28 05:16:01
3	15	375.2699791454079	260.8957115129027	20/04/28 05:16:01
3	15	375.50988544449496	260.90163299929526	20/04/28 05:16:02
3	15	375.7396523694412	260.90730422062086	20/04/28 05:16:02
3	15	376.01460092050803	260.914090637276	20/04/28 05:16:02
3	15	376.2926743888265	260.9209541846903	20/04/28 05:16:02
3	15	376.4544035172136	260.924946063339	20/04/28 05:16:02
3	15	376.7094970455682	260.9312424084651	20/04/28 05:16:02
3	15	376.88965231601765	260.9356890903012	20/04/28 05:16:02
3	15	377.08021832082727	260.9403927350519	20/04/28 05:16:02
3	15	377.35886627941653	260.9472704623203	20/04/28 05:16:02
3	15	377.5595444112496	260.9522236996111	20/04/28 05:16:03
3	15	377.71230470063784	260.9559942049225	20/04/28 05:16:03
3	15	377.9782087541739	260.9625573807988	20/04/28 05:16:03
3	15	378.1539357192181	260.9668947610021	20/04/28 05:16:03
3	15	378.31082848890526	260.970767266244	20/04/28 05:16:03
3	15	378.4967989944953	260.9753574826012	20/04/28 05:16:03
3	15	378.6720193405594	261.10652429160086	20/04/28 05:16:03
3	15	378.8144399856317	261.27897155507617	20/04/28 05:16:03
3	15	378.97585294903047	261.4744152971926	20/04/28 05:16:03
3	15	379.0978145574061	261.62209013466264	20/04/28 05:16:03
3	15	379.2279515880892	261.77966402296175	20/04/28 05:16:04
3	15	379.2279515880892	261.77966402296175	20/04/28 05:16:04
3	15	379.2279515880892	261.77966402296175	20/04/28 05:16:04
3	15	379.3726452907165	261.9548635738944	20/04/28 05:16:04
3	15	379.49393363919046	262.1017232077288	20/04/28 05:16:04
3	15	379.62299193335406	262.25799092892896	20/04/28 05:16:04
3	15	379.7219279824305	262.3777857165009	20/04/28 05:16:04
3	15	379.8910547435912	262.58256956035876	20/04/28 05:16:04
3	15	380.0637521028779	262.79167679339577	20/04/28 05:16:04
3	15	380.0637521028779	262.79167679339577	20/04/28 05:16:04
3	15	380.22605859350057	262.98820244554366	20/04/28 05:16:05
3	15	380.38333970556255	263.1786432159649	20/04/28 05:16:05
3	15	380.65504373944697	263.50763075211034	20/04/28 05:16:05
3	15	380.65504373944697	263.50763075211034	20/04/28 05:16:05
3	15	380.78061139452586	263.65967190097876	20/04/28 05:16:05
3	15	380.93071704634684	263.841424405158	20/04/28 05:16:05
3	15	381.19633795700975	264.16304631006085	20/04/28 05:16:05
3	15	381.3099942313879	264.3006647956629	20/04/28 05:16:05
3	15	381.3099942313879	264.3006647956629	20/04/28 05:16:05
3	15	381.6125736919012	264.667037240633	20/04/28 05:16:06
3	15	381.7259184160269	264.80427849168143	20/04/28 05:16:06
1	33	381.8240752203093	264.92604908776906	20/04/28 05:16:06
1	33	381.5920530148714	264.7368529548102	20/04/28 05:16:06
1	33	381.42248389230207	264.59858247247087	20/04/28 05:16:06
1	33	381.42248389230207	264.59858247247087	20/04/28 05:16:06
1	33	381.2738764610828	264.4774046254516	20/04/28 05:16:06
1	33	381.14098898249773	264.36904518192546	20/04/28 05:16:06
1	33	380.932162159925	264.1987630866653	20/04/28 05:16:06
1	33	380.7165651836721	264.02296045558654	20/04/28 05:16:06
1	33	380.58936775268376	263.91924080504754	20/04/28 05:16:07
1	33	380.46701150059994	263.8194687608421	20/04/28 05:16:07
1	33	380.3460865277118	263.7208638139345	20/04/28 05:16:07
1	33	380.22246933098353	263.6200635670613	20/04/28 05:16:07
1	33	380.0323436976249	263.46503084275844	20/04/28 05:16:07
1	33	379.8268057989007	263.29743061009225	20/04/28 05:16:07
1	33	379.6790161697621	263.17691961731174	20/04/28 05:16:07
1	33	379.5458004025253	263.0682924798238	20/04/28 05:16:07
1	33	379.36149678545104	262.91800715874876	20/04/28 05:16:07
1	33	379.22505961680173	262.80675321798225	20/04/28 05:16:07
1	33	379.08089900696035	262.6892014092857	20/04/28 05:16:08
1	33	378.94941086660873	262.5819830176773	20/04/28 05:16:08
1	33	378.77203032006787	262.4373429242676	20/04/28 05:16:08
1	33	378.6411027128561	262.3305816040084	20/04/28 05:16:08
1	22	378.37637165119224	262.2522287417797	20/04/28 05:16:08
1	22	378.2097203858113	262.2377768582826	20/04/28 05:16:08
1	22	377.92539513347737	262.2131203673005	20/04/28 05:16:08
1	22	377.6918068905128	262.1928637549916	20/04/28 05:16:08
1	22	377.3968781456877	262.16728773640926	20/04/28 05:16:08
1	22	377.1392634156829	262.144947563614	20/04/28 05:16:09
1	22	376.9089984052129	262.124979139749	20/04/28 05:16:09
1	22	376.65503264457175	262.10295540307555	20/04/28 05:16:09
1	22	376.50118735026496	262.0896140446117	20/04/28 05:16:09
1	22	376.2706709059225	262.06962381657365	20/04/28 05:16:09
1	22	376.01195741605454	262.04718836007623	20/04/28 05:16:09
1	22	375.83203260775065	262.03158540403564	20/04/28 05:16:09
1	22	375.56242099602224	262.00820486988096	20/04/28 05:16:09
1	22	375.31842791939147	261.98704595752884	20/04/28 05:16:09
1	22	375.0584624177905	261.96450192743214	20/04/28 05:16:09
1	22	374.8085463361599	261.94282937614656	20/04/28 05:16:10
1	22	374.3026244507606	261.898956177046	20/04/28 05:16:10
1	22	374.3026244507606	261.898956177046	20/04/28 05:16:10
1	22	373.874816955749	261.86185700433373	20/04/28 05:16:10
1	22	373.69682165076915	261.8464213734988	20/04/28 05:16:10
1	22	373.69682165076915	261.8464213734988	20/04/28 05:16:10
1	22	373.4294849987004	261.82323812228634	20/04/28 05:16:10
1	22	373.2289208933408	261.805845340553	20/04/28 05:16:10
1	22	373.0433956695841	261.78975672032334	20/04/28 05:16:10
1	22	372.7861227514845	261.76744618922214	20/04/28 05:16:10
1	22	372.34167468494354	261.72890395755365	20/04/28 05:16:11
1	22	372.1802162858328	261.7149023958599	20/04/28 05:16:11
1	22	371.95618251824646	261.6954743411063	20/04/28 05:16:11
1	22	371.6956726753549	261.67288310610604	20/04/28 05:16:11
1	22	371.4610297470288	261.65253503220555	20/04/28 05:16:11
1	22	371.4610297470288	261.65253503220555	20/04/28 05:16:11
1	22	371.2119783410453	261.63093746499936	20/04/28 05:16:11
1	22	370.6573315134485	261.5828388723116	20/04/28 05:16:11
1	22	370.50732495079484	261.56983040602535	20/04/28 05:16:11
1	22	370.2523854712072	261.54772222911237	20/04/28 05:16:12
1	22	370.2523854712072	261.54772222911237	20/04/28 05:16:12
1	22	370.0119134552784	261.52686866073066	20/04/28 05:16:12
1	22	369.8198279040692	261.5102111334013	20/04/28 05:16:12
1	22	369.56224343200415	261.48787358455377	20/04/28 05:16:12
1	22	369.56224343200415	261.48787358455377	20/04/28 05:16:12
1	22	369.3580909925418	261.4701696249468	20/04/28 05:16:12
1	22	369.18455446744093	261.4551206564465	20/04/28 05:16:12
1	22	368.7829408286912	261.4202929969938	20/04/28 05:16:12
1	22	368.602821807965	261.40467319898505	20/04/28 05:16:12
1	22	368.39995298952425	261.38708055411314	20/04/28 05:16:13
1	22	368.1966851752008	261.3694533085918	20/04/28 05:16:13
1	22	368.02335499100104	261.354422233833	20/04/28 05:16:13
1	22	367.77787713476226	261.3331345624111	20/04/28 05:16:13
1	22	367.5183377087472	261.3106274812971	20/04/28 05:16:13
1	22	367.2212723079909	261.28486617337705	20/04/28 05:16:13
1	22	367.0680748290241	261.27158099301545	20/04/28 05:16:13
1	22	366.8004367973358	261.24837160636895	20/04/28 05:16:13
1	22	366.6457889177199	261.2349606482573	20/04/28 05:16:13
1	22	366.42876038753366	261.21614008288907	20/04/28 05:16:13
1	22	366.16990262519926	261.1936921151822	20/04/28 05:16:14
1	22	365.97307642052243	261.17662348163384	20/04/28 05:16:14
1	22	365.7428657067347	261.1566597663399	20/04/28 05:16:14
1	22	365.4474478866843	261.1310413354892	20/04/28 05:16:14
1	22	365.21519305709154	261.11090035587387	20/04/28 05:16:14
1	22	364.9364937689515	261.0867317446502	20/04/28 05:16:14
1	22	364.6835162033573	261.0647937035739	20/04/28 05:16:14
1	22	364.5137229262875	261.05006934697695	20/04/28 05:16:14
1	22	364.251855668609	261.0273603978968	20/04/28 05:16:14
1	22	364.06153602741887	261.01085600907385	20/04/28 05:16:15
1	22	363.84669283878543	260.9922249550271	20/04/28 05:16:15
1	22	363.6909802048355	260.97872166214944	20/04/28 05:16:15
1	22	363.5370582989884	260.96537365998535	20/04/28 05:16:15
1	22	363.2963781461289	260.9445020421117	20/04/28 05:16:15
1	22	363.1403403009093	260.9309705471357	20/04/28 05:16:15
1	22	362.89539408857803	260.909728979509	20/04/28 05:16:15
1	22	362.721907591243	260.89468434938226	20/04/28 05:16:15
1	22	362.721907591243	260.89468434938226	20/04/28 05:16:15
1	22	362.500006439228	260.8754412335892	20/04/28 05:16:15
1	22	362.31340875039297	260.8592596099231	20/04/28 05:16:16
1	22	362.31340875039297	260.8592596099231	20/04/28 05:16:16
1	22	362.13683654878935	260.8439473896374	20/04/28 05:16:16
1	22	361.98179973359413	260.83050270329886	20/04/28 05:16:16
1	22	361.7586252190889	260.81114916238346	20/04/28 05:16:16
1	22	361.4703348429533	260.78614881858334	20/04/28 05:16:16
1	22	361.19555016568694	260.76231967973126	20/04/28 05:16:16
1	22	360.98987563173637	260.74448372513365	20/04/28 05:16:16
1	22	360.8119451384354	260.7290537147231	20/04/28 05:16:16
1	22	360.64540312558853	260.71461130553087	20/04/28 05:16:16
1	22	360.4269206481418	260.69566465485286	20/04/28 05:16:17
1	22	360.1432662722149	260.67106634181295	20/04/28 05:16:17
1	22	359.97792403865543	260.6567279766581	20/04/28 05:16:17
1	22	359.705105599237	260.63306934860435	20/04/28 05:16:17
1	22	359.45053096727816	260.61099281102764	20/04/28 05:16:17
1	22	359.1767653427477	260.58725204373025	20/04/28 05:16:17
1	22	359.0255934749566	260.5741425229813	20/04/28 05:16:17
1	22	358.8570405005359	260.5595257245798	20/04/28 05:16:17
1	22	358.5992997523381	260.5371746235732	20/04/28 05:16:17
1	22	358.4296718243675	260.5224646059368	20/04/28 05:16:18
1	22	358.2637540420172	260.5080763295853	20/04/28 05:16:18
1	22	358.1102695768659	260.4947662619785	20/04/28 05:16:18
1	22	358.1102695768659	260.4947662619785	20/04/28 05:16:18
1	22	357.9597241622323	260.4817110668179	20/04/28 05:16:18
1	22	357.69164254368013	260.4584632126227	20/04/28 05:16:18
1	22	357.48492006899215	260.44053638132266	20/04/28 05:16:18
1	22	357.3196465502935	260.4262039750734	20/04/28 05:16:18
1	22	357.0282128758368	260.4009310465976	20/04/28 05:16:18
1	22	356.7463026053137	260.37648398118273	20/04/28 05:16:18
1	22	356.52878798426303	260.35762126234795	20/04/28 05:16:19
1	22	356.3538477733292	260.34245056717447	20/04/28 05:16:19
1	22	356.1738556416572	260.3268417728976	20/04/28 05:16:19
1	22	355.9155814831145	260.30444441491153	20/04/28 05:16:19
1	22	355.75943567218326	260.290903557223	20/04/28 05:16:19
1	22	355.5544450331716	260.2731269095256	20/04/28 05:16:19
1	22	355.2852991981608	260.2497867672086	20/04/28 05:16:19
1	22	355.03203916781865	260.22782423098295	20/04/28 05:16:19
1	22	354.8773912162512	260.2144132666317	20/04/28 05:16:19
1	22	354.66392014863067	260.1959012019786	20/04/28 05:16:20
1	22	354.39403457994854	260.17249691046464	20/04/28 05:16:20
1	22	354.1002304907673	260.1470184212488	20/04/28 05:16:20
1	22	353.91166736293565	260.1306663560602	20/04/28 05:16:20
1	22	353.7619797006046	260.1176855445913	20/04/28 05:16:20
1	22	353.51180116358523	260.0959902333543	20/04/28 05:16:20
1	22	353.2142072053184	260.07018308928923	20/04/28 05:16:20
1	22	353.03440837131296	260.05459105765345	20/04/28 05:16:20
1	22	352.757464694099	260.03057469180584	20/04/28 05:16:20
1	22	352.5181862411407	260.0098246283868	20/04/28 05:16:20
1	22	352.3381831936039	259.99421488749357	20/04/28 05:16:21
1	22	352.1167671676104	259.9750138414965	20/04/28 05:16:21
1	22	351.90838512777435	259.9569430938444	20/04/28 05:16:21
1	22	351.7199968345352	259.94060619019183	20/04/28 05:16:21
1	22	351.4364113871968	259.9160138545919	20/04/28 05:16:21
1	22	351.27233092875355	259.90178490971016	20/04/28 05:16:21
1	22	351.1048934395046	259.8872648454182	20/04/28 05:16:21
1	22	350.88311345043354	259.86803223679254	20/04/28 05:16:21
1	22	350.6086320583908	259.84422939862714	20/04/28 05:16:21
1	22	350.33562715970373	259.8205546009534	20/04/28 05:16:21
1	22	350.0970485206621	259.79986522491754	20/04/28 05:16:22
1	22	349.94016260897314	259.7862601861986	20/04/28 05:16:22
1	22	349.6675650476118	259.76262071253853	20/04/28 05:16:22
1	22	349.42057215422847	259.74120165813395	20/04/28 05:16:22
1	22	349.14278455304503	259.71711210777823	20/04/28 05:16:22
1	22	348.94538366191745	259.69999363781477	20/04/28 05:16:22
1	22	348.75741841575143	259.6836934205144	20/04/28 05:16:22
1	22	348.5349454253572	259.664400715289	20/04/28 05:16:22
1	22	348.5349454253572	259.664400715289	20/04/28 05:16:22
1	22	348.2892039041224	259.64309017901934	20/04/28 05:16:23
1	22	348.0516140270194	259.62248654774095	20/04/28 05:16:23
1	22	347.8017484243172	259.6008183739534	20/04/28 05:16:23
1	22	347.64673567950405	259.5873757749819	20/04/28 05:16:23
1	22	347.4076530695599	259.56664269493484	20/04/28 05:16:23
1	22	347.18131908322897	259.5470151667885	20/04/28 05:16:23
1	22	346.93750887356913	259.5258721125348	20/04/28 05:16:23
1	22	346.6841015991002	259.5038968073994	20/04/28 05:16:23
1	22	346.3859857890794	259.478044408708	20/04/28 05:16:23
1	22	346.1913259239844	259.46116363864314	20/04/28 05:16:23
1	22	345.9996687913771	259.4445432634813	20/04/28 05:16:24
1	22	345.7141742747005	259.41978537469697	20/04/28 05:16:24
1	22	345.52739556509636	259.4035880530339	20/04/28 05:16:24
1	22	345.3164458699387	259.3852946400724	20/04/28 05:16:24
1	22	345.1570825929753	259.3714747659351	20/04/28 05:16:24
1	22	344.976005872266	259.35577191684035	20/04/28 05:16:24
1	22	344.6888969091272	259.33087402436547	20/04/28 05:16:24
1	22	344.5200538089347	259.316232066456	20/04/28 05:16:24
1	22	344.35853501926084	259.302225267734	20/04/28 05:16:24
1	22	344.20829045039335	259.289196161712	20/04/28 05:16:24
1	22	343.98154275889885	259.26953275733746	20/04/28 05:16:25
1	22	343.70547843686444	259.2455926485682	20/04/28 05:16:25
1	22	343.45087107896904	259.2235132730207	20/04/28 05:16:25
1	22	343.2799456624626	259.2086907380679	20/04/28 05:16:25
1	22	343.1097741591131	259.19393358194725	20/04/28 05:16:25
1	22	342.9416260824988	259.179351896006	20/04/28 05:16:25
1	69	342.7139155236653	259.16339994212586	20/04/28 05:16:25
1	69	342.76638168927934	259.44060932205554	20/04/28 05:16:25
1	69	342.8138707060267	259.69152151912476	20/04/28 05:16:25
1	69	342.8628121776642	259.9501078832453	20/04/28 05:16:26
1	69	342.8937639895928	260.11364437370565	20/04/28 05:16:26
1	69	342.94365508614777	260.3772481606063	20/04/28 05:16:26
1	69	342.9898157908493	260.6211421097387	20/04/28 05:16:26
1	69	343.0289896304001	260.8281203717146	20/04/28 05:16:26
1	69	343.07365463055345	261.0641116406053	20/04/28 05:16:26
1	69	343.12303067979366	261.3249941318846	20/04/28 05:16:26
1	69	343.1775931261585	261.61327938671957	20/04/28 05:16:26
1	69	343.22662154318414	261.87232513407963	20/04/28 05:16:26
1	69	343.26955141040446	262.09914868280543	20/04/28 05:16:26
1	69	343.3017306558335	262.2691704209598	20/04/28 05:16:27
1	69	343.3551578236981	262.55145733676187	20/04/28 05:16:27
1	69	343.3984018251489	262.77994064000234	20/04/28 05:16:27
1	69	343.44739640860536	263.0388076248664	20/04/28 05:16:27
1	69	343.4983937591283	263.308256397253	20/04/28 05:16:27
1	69	343.5425481529566	263.54154983486296	20/04/28 05:16:27
1	69	343.59303589672896	263.80830605730443	20/04/28 05:16:27
1	69	343.6218656541893	263.960630495265	20/04/28 05:16:27
1	69	343.67642767924406	264.2489135240725	20/04/28 05:16:27
1	69	343.7183373609877	264.47034683739406	20/04/28 05:16:27
1	69	343.75767546795646	264.67819302003016	20/04/28 05:16:28
1	69	343.80586287579973	264.932795224943	20/04/28 05:16:28
1	22	343.81519059056296	264.9820789870669	20/04/28 05:16:28
1	22	343.7514158956004	265.2590954763766	20/04/28 05:16:28
1	22	343.93792849898796	265.049133127574	20/04/28 05:16:28
1	22	344.2126959382733	265.166013235524	20/04/28 05:16:28
1	22	344.3648938333908	265.3362941357996	20/04/28 05:16:28
1	22	344.38082408690565	265.347070163324	20/04/28 05:16:28
1	22	344.50874539365856	265.42440680547077	20/04/28 05:16:28
1	22	344.47073740109533	265.41560801706447	20/04/28 05:16:29
1	22	344.37587950724446	265.3925152922092	20/04/28 05:16:29
1	22	344.16334135457606	265.435760618164	20/04/28 05:16:29
1	22	344.36167882541196	265.60701576803973	20/04/28 05:16:29
1	22	344.38912356398646	265.5990835646854	20/04/28 05:16:29
1	22	344.39719776352683	265.32682433171044	20/04/28 05:16:29
1	22	344.20534644819895	265.4088905090218	20/04/28 05:16:29
1	22	344.1770786018862	265.40630333849947	20/04/28 05:16:29
1	22	344.1289195936252	265.5130953483176	20/04/28 05:16:29
1	22	344.2742322041212	265.56562569652357	20/04/28 05:16:29
1	22	344.49112770951785	265.5634345381661	20/04/28 05:16:30
1	22	344.69569023993097	265.5288837135855	20/04/28 05:16:30
1	22	344.85602828168425	265.7405836436796	20/04/28 05:16:30
1	22	344.9282163876878	265.92950582644426	20/04/28 05:16:30
1	22	345.08049917865424	265.8845333184187	20/04/28 05:16:30
1	22	344.9984341879615	265.8916369330527	20/04/28 05:16:30
1	22	345.2002054370721	265.79754632343366	20/04/28 05:16:30
1	22	345.3246049265685	265.7302470664724	20/04/28 05:16:30
1	22	345.2831341706872	265.7005038933852	20/04/28 05:16:30
1	22	345.346115276561	265.72428778902565	20/04/28 05:16:30
1	22	345.34653686391766	265.7233538087726	20/04/28 05:16:31
1	22	345.3556016472113	265.7553609385877	20/04/28 05:16:31
1	22	345.3616292554494	265.7503840418874	20/04/28 05:16:31
1	22	345.35301308637315	265.7374301491986	20/04/28 05:16:31
1	22	345.25218733125075	265.7283539868483	20/04/28 05:16:31
1	22	345.0624033473235	265.80756749116586	20/04/28 05:16:31
1	22	344.94234789331705	265.7282022205621	20/04/28 05:16:31
1	22	345.0244607007993	265.6579412871004	20/04/28 05:16:31
1	22	344.85030984101263	265.56429954334214	20/04/28 05:16:31
1	22	344.8479023509919	265.54762148630937	20/04/28 05:16:32
1	22	344.86306416388976	265.5315845110198	20/04/28 05:16:32
1	22	344.8718419833566	265.5181110697216	20/04/28 05:16:32
1	22	344.9162419509934	265.2484847404806	20/04/28 05:16:32
1	22	345.1433350210948	265.3312471743773	20/04/28 05:16:32
1	22	345.33182048696	265.4533134882346	20/04/28 05:16:32
1	22	345.30848283784644	265.44712039896416	20/04/28 05:16:32
1	22	345.3430003695513	265.4817807665372	20/04/28 05:16:32
1	22	345.5328654811083	265.6873828529396	20/04/28 05:16:32
1	22	345.6204938719959	265.6125402817476	20/04/28 05:16:32
1	22	345.562672463682	265.5025575976562	20/04/28 05:16:33
1	22	345.7286123059605	265.6978031027387	20/04/28 05:16:33
1	22	345.65202558970316	265.5414694325772	20/04/28 05:16:33
1	22	345.5811106285421	265.36241995737106	20/04/28 05:16:33
1	22	345.5677528189306	265.37387382966483	20/04/28 05:16:33
1	22	345.4720000005425	265.3911190223416	20/04/28 05:16:33
1	22	345.3323323961837	265.242175493524	20/04/28 05:16:33
1	22	345.07603839474507	265.38205552556644	20/04/28 05:16:33
1	22	344.98037356991694	265.51122448983705	20/04/28 05:16:33
1	22	344.94301376266986	265.484399646377	20/04/28 05:16:33
1	22	344.9884283367604	265.3174352414758	20/04/28 05:16:34
1	22	344.9542583458035	265.41754448987143	20/04/28 05:16:34
1	22	345.0087505172135	265.38730180969026	20/04/28 05:16:34
1	22	344.85863771806805	265.390558371765	20/04/28 05:16:34
1	22	344.704096713971	265.46956873470094	20/04/28 05:16:34
1	22	344.9370348847368	265.3193029759382	20/04/28 05:16:34
1	22	344.92945013463583	265.40047298667525	20/04/28 05:16:34
1	22	344.9411482082882	265.411111886427	20/04/28 05:16:34
1	22	344.8492742607122	265.60891495137275	20/04/28 05:16:34
1	22	345.0684941335766	265.71956508559356	20/04/28 05:16:35
1	22	345.08828712921746	265.6909525533738	20/04/28 05:16:35
1	22	345.0511098202325	265.68673595809275	20/04/28 05:16:35
1	22	345.05399604106907	265.65422548675554	20/04/28 05:16:35
1	22	344.85316542230186	265.68630820921356	20/04/28 05:16:35
1	22	344.8086508033686	265.6034452240753	20/04/28 05:16:35
1	22	344.7267193567754	265.5746910014851	20/04/28 05:16:35
1	22	344.73002803040583	265.575241889722	20/04/28 05:16:35
1	22	344.73227463200965	265.5747824411599	20/04/28 05:16:35
1	22	344.73227463200965	265.5747824411599	20/04/28 05:16:35
