floorId	partitionId	location_x	location_y	timeStamp
18	982	312.6235964601118	283.19072256626896	21/02/24 15:38:00
18	982	312.62380716177955	283.1529450274687	21/02/24 15:38:00
18	982	312.6345244543351	283.3435176333527	21/02/24 15:38:00
18	982	312.64595169114665	283.2723518443639	21/02/24 15:38:00
18	982	312.9321509425006	283.1880399245076	21/02/24 15:38:00
18	982	312.9321509425006	283.1880399245076	21/02/24 15:38:00
18	982	312.9321509425006	283.1880399245076	21/02/24 15:38:00
18	982	312.8973128037006	283.4108118018003	21/02/24 15:38:00
18	982	312.9911692738795	283.54681242665976	21/02/24 15:38:00
18	982	312.9737619677271	283.5890579738039	21/02/24 15:38:00
18	982	313.11224532598845	283.71306262590315	21/02/24 15:38:01
18	982	313.1498714549876	283.8375672415334	21/02/24 15:38:01
18	982	313.0896932797264	283.8291152336488	21/02/24 15:38:01
18	982	313.02562065169275	283.6725533920579	21/02/24 15:38:01
18	982	312.9777826003982	283.7583055172711	21/02/24 15:38:01
18	982	312.9324086868278	283.82015842976506	21/02/24 15:38:01
18	982	312.7127890284126	283.89766126279704	21/02/24 15:38:01
18	982	312.7852477226883	283.9790453563002	21/02/24 15:38:01
18	982	312.6298480977537	283.9054134362868	21/02/24 15:38:01
18	982	312.74357604233313	283.7982726442091	21/02/24 15:38:01
18	982	312.69622685733316	283.75958940458804	21/02/24 15:38:02
18	982	312.4516644673416	283.67153793160327	21/02/24 15:38:02
18	982	312.40395549894964	283.5041627903002	21/02/24 15:38:02
18	982	312.4029918721136	283.56724576968486	21/02/24 15:38:02
18	982	312.38743650617374	283.5994100651122	21/02/24 15:38:02
18	982	312.23957240175866	283.3687480571488	21/02/24 15:38:02
18	982	312.3023119908168	283.36456782993946	21/02/24 15:38:02
18	982	312.40155051748377	283.3688916087133	21/02/24 15:38:02
18	982	312.4093675361235	283.363388381519	21/02/24 15:38:02
18	982	312.4136140337752	283.35535252741636	21/02/24 15:38:03
18	982	312.3952708356539	283.203010881606	21/02/24 15:38:03
18	982	312.12102615817076	283.1615832941321	21/02/24 15:38:03
18	982	312.1167015188516	283.1918147814296	21/02/24 15:38:03
18	982	312.05544828299287	283.33416397564963	21/02/24 15:38:03
18	982	312.2410803714851	283.2137589853592	21/02/24 15:38:03
18	982	312.22611469053186	283.3096898591279	21/02/24 15:38:03
18	982	312.01680287588124	283.4530909416442	21/02/24 15:38:03
18	982	312.11543265538586	283.39279482476394	21/02/24 15:38:03
18	982	312.3847364249866	283.4064501718836	21/02/24 15:38:03
18	982	312.4292414285745	283.3920309276105	21/02/24 15:38:04
18	982	312.480634663072	283.5846011310509	21/02/24 15:38:04
18	982	312.5228119741835	283.601329398087	21/02/24 15:38:04
18	982	312.457532691882	283.33577967386884	21/02/24 15:38:04
18	982	312.39898746479514	283.62198080169816	21/02/24 15:38:04
18	982	312.40181458494226	283.6219074600744	21/02/24 15:38:04
18	982	312.4621412219627	283.52929097307776	21/02/24 15:38:04
18	982	312.56910144603205	283.27573432429347	21/02/24 15:38:04
18	982	312.40189586396946	283.1754734341846	21/02/24 15:38:04
18	982	312.4743010406498	283.179500432771	21/02/24 15:38:04
18	982	312.4413970405	283.43981384815237	21/02/24 15:38:05
18	982	312.4400537577424	283.442731568586	21/02/24 15:38:05
18	982	312.36707880010084	283.35257724154735	21/02/24 15:38:05
18	982	312.1941910294223	283.58587458342	21/02/24 15:38:05
18	982	312.2434196156508	283.5790917968274	21/02/24 15:38:05
18	982	311.99764869123624	283.4200496397308	21/02/24 15:38:05
18	982	311.8488420428066	283.25745078402196	21/02/24 15:38:05
18	982	311.89915181136973	283.30065705255276	21/02/24 15:38:05
18	982	311.9103180697641	283.2780772746688	21/02/24 15:38:05
18	982	311.90980347080284	283.2800815454776	21/02/24 15:38:06
18	982	312.17761811657476	283.2969197837987	21/02/24 15:38:06
18	982	311.9787864100996	283.26947269327565	21/02/24 15:38:06
18	982	311.8158757344108	283.3691628084176	21/02/24 15:38:06
18	982	311.79629070165333	283.4560934788506	21/02/24 15:38:06
18	982	311.66491441965127	283.6348011572339	21/02/24 15:38:06
18	982	311.6867971908074	283.5972269904893	21/02/24 15:38:06
18	982	311.85033477946865	283.48105299626553	21/02/24 15:38:06
18	982	312.0369041988228	283.71387151282744	21/02/24 15:38:06
18	982	311.83238467534477	283.771627256649	21/02/24 15:38:06
18	982	311.9209313612403	283.769083350859	21/02/24 15:38:07
18	982	312.06983747474834	283.5446550468254	21/02/24 15:38:07
18	982	312.0261423747138	283.54809652379606	21/02/24 15:38:07
18	982	311.9822616731471	283.8248371135625	21/02/24 15:38:07
18	982	311.9550930821136	283.8414736722142	21/02/24 15:38:07
18	982	312.1660341744478	283.8434120926436	21/02/24 15:38:07
18	982	312.2492718777168	283.6292500581373	21/02/24 15:38:07
18	982	312.2135874543798	283.60581232486464	21/02/24 15:38:07
18	982	312.2643127364703	283.8397421729632	21/02/24 15:38:07
18	982	312.10380458796305	283.60766988625005	21/02/24 15:38:07
18	982	312.10630213579464	283.5390122120193	21/02/24 15:38:08
18	982	312.11595662368353	283.41552914207887	21/02/24 15:38:08
18	982	312.16800471155403	283.4819096956187	21/02/24 15:38:08
18	982	312.1617552033865	283.5124567646532	21/02/24 15:38:08
18	982	312.0653698210658	283.47629773831767	21/02/24 15:38:08
18	982	311.810500335462	283.5326412813954	21/02/24 15:38:08
18	982	311.80075052255745	283.5028927717452	21/02/24 15:38:08
18	982	311.7191093077114	283.48876510998093	21/02/24 15:38:08
18	982	311.95401362050353	283.3112292952844	21/02/24 15:38:08
18	982	311.8331464367988	283.24714426339125	21/02/24 15:38:09
18	982	311.6637501634586	283.16106895487843	21/02/24 15:38:09
18	982	311.54297599809917	283.2552942910786	21/02/24 15:38:09
18	982	311.43838962080594	283.0955057979129	21/02/24 15:38:09
18	982	311.4040728117366	283.301832472562	21/02/24 15:38:09
18	982	311.4313975889191	283.27689237365286	21/02/24 15:38:09
18	982	311.26128752485647	283.31980998867436	21/02/24 15:38:09
18	982	311.02314951225947	283.26951164669777	21/02/24 15:38:09
18	982	311.0241976415156	283.20245199753225	21/02/24 15:38:09
18	982	310.9880781748576	283.1670478331403	21/02/24 15:38:09
18	982	310.98955096065396	283.1719390864856	21/02/24 15:38:10
18	982	311.0002163932622	283.1873017889481	21/02/24 15:38:10
18	982	310.83121461126075	283.009056596948	21/02/24 15:38:10
18	982	310.8251786740998	283.0626306668203	21/02/24 15:38:10
18	982	310.799139384743	283.05231732567	21/02/24 15:38:10
18	982	310.8327289348704	283.1943685212195	21/02/24 15:38:10
18	982	310.7930700820631	283.24016044141706	21/02/24 15:38:10
18	982	310.55031902004333	283.38109952040173	21/02/24 15:38:10
18	982	310.475153174743	283.1094096234345	21/02/24 15:38:10
18	982	310.6169394211784	283.17713762551244	21/02/24 15:38:10
18	982	310.615952623033	283.4733018137881	21/02/24 15:38:11
18	982	310.86770938715955	283.424465920221	21/02/24 15:38:11
18	982	310.9268336746399	283.5481749742731	21/02/24 15:38:11
18	982	310.92643127551827	283.54452007588804	21/02/24 15:38:11
18	982	311.13407629247394	283.52258595722407	21/02/24 15:38:11
18	982	311.1728706771658	283.3241283782365	21/02/24 15:38:11
18	982	311.1717596478318	283.32553956449857	21/02/24 15:38:11
18	982	311.1246625008364	283.0492476133045	21/02/24 15:38:11
18	982	311.16953649212434	282.95459771700274	21/02/24 15:38:11
18	982	311.18413537052385	283.00314200699574	21/02/24 15:38:12
18	982	311.2846223277859	283.1990632647034	21/02/24 15:38:12
18	982	311.41529466313676	282.981394039512	21/02/24 15:38:12
18	982	311.61988599821365	282.92100314717555	21/02/24 15:38:12
18	982	311.55275093075176	283.08914728177393	21/02/24 15:38:12
18	982	311.7926804197227	282.9748619864235	21/02/24 15:38:12
18	982	311.81054193012244	282.95825966024546	21/02/24 15:38:12
18	982	311.70507518431043	282.70318908033767	21/02/24 15:38:12
18	982	311.5903819327293	282.86475140586214	21/02/24 15:38:12
18	982	311.47471283229044	282.7488391110043	21/02/24 15:38:12
18	982	311.46190672483874	282.8366884912733	21/02/24 15:38:13
18	982	311.68302497498246	282.7998562754502	21/02/24 15:38:13
18	982	311.5724872506452	282.64396825529843	21/02/24 15:38:13
18	982	311.5582491472667	282.877772912285	21/02/24 15:38:13
18	982	311.5346922855377	282.9234854397864	21/02/24 15:38:13
18	982	311.42040327532544	283.02138235990134	21/02/24 15:38:13
18	982	311.40356349681826	283.2859544361228	21/02/24 15:38:13
18	982	311.5512704842447	283.45939124028564	21/02/24 15:38:13
18	982	311.5305933974286	283.3226809259538	21/02/24 15:38:13
18	982	311.76155508068814	283.3857438692733	21/02/24 15:38:13
18	982	311.77815847879845	283.42778147871485	21/02/24 15:38:14
18	982	311.7947720262735	283.42855849362707	21/02/24 15:38:14
18	982	311.86617475216997	283.4269443264496	21/02/24 15:38:14
18	982	311.88021411487193	283.4960831298006	21/02/24 15:38:14
18	982	311.8890798630906	283.4880485120533	21/02/24 15:38:14
18	982	311.80436154415213	283.7714705709821	21/02/24 15:38:14
18	982	312.06169056918367	283.57678565499367	21/02/24 15:38:14
18	982	312.06169056918367	283.57678565499367	21/02/24 15:38:14
18	982	312.00643696937954	283.44607173962754	21/02/24 15:38:14
18	982	312.00643696937954	283.44607173962754	21/02/24 15:38:15
18	982	311.76990450374853	283.4192529238705	21/02/24 15:38:15
18	982	311.80521898757155	283.30556239988914	21/02/24 15:38:15
18	982	311.75338137445016	283.3534701759274	21/02/24 15:38:15
18	982	311.88689568114955	283.1993931135166	21/02/24 15:38:15
18	982	312.06391569026687	283.2810359907677	21/02/24 15:38:15
18	982	311.99867987123656	283.2563832257537	21/02/24 15:38:15
18	982	311.75755576034845	283.12633399347214	21/02/24 15:38:15
18	982	311.75755576034845	283.12633399347214	21/02/24 15:38:15
18	982	311.96836844854886	283.1865790323314	21/02/24 15:38:15
18	982	312.004922308958	283.2590024488734	21/02/24 15:38:16
18	982	312.00699320612785	283.2720645535311	21/02/24 15:38:16
18	982	311.9835850626489	283.0126733887574	21/02/24 15:38:16
18	982	311.95842147776824	283.26380705955086	21/02/24 15:38:16
18	982	311.93399228529654	283.54049769264714	21/02/24 15:38:16
18	982	311.6954759605438	283.45274018428216	21/02/24 15:38:16
18	982	311.8532784380084	283.6269343799925	21/02/24 15:38:16
18	982	311.6640136816197	283.593680863778	21/02/24 15:38:16
18	982	311.77909485988437	283.6523543118209	21/02/24 15:38:16
18	982	311.60647499674417	283.7106152763265	21/02/24 15:38:16
18	982	311.77509410798535	283.5066678266211	21/02/24 15:38:17
18	982	311.77509410798535	283.5066678266211	21/02/24 15:38:17
18	982	311.56789481688065	283.3646865114563	21/02/24 15:38:17
18	982	311.7842956178843	283.35079825831593	21/02/24 15:38:17
18	982	311.6554147386626	283.3564787810203	21/02/24 15:38:17
18	982	311.59517294124555	283.4870437362145	21/02/24 15:38:17
18	982	311.7969065785452	283.6688358116697	21/02/24 15:38:17
18	982	311.9525103108342	283.6473636303574	21/02/24 15:38:17
18	982	311.90842116643836	283.3822029472414	21/02/24 15:38:17
18	982	311.8360956528006	283.21335698681884	21/02/24 15:38:18
18	982	311.8003680369636	283.3883858991763	21/02/24 15:38:18
18	982	311.6697324153895	283.1543672466594	21/02/24 15:38:18
18	982	311.66836156830504	282.98357655779347	21/02/24 15:38:18
18	982	311.9375659628344	282.85227794391307	21/02/24 15:38:18
18	982	311.92978406725393	282.85092894158686	21/02/24 15:38:18
18	982	311.92905576068273	282.8501586445984	21/02/24 15:38:18
18	982	311.99692731163634	282.7613052906422	21/02/24 15:38:18
18	982	311.99537544756106	282.77766503589885	21/02/24 15:38:18
18	982	311.882588977072	282.81946375211015	21/02/24 15:38:18
18	982	311.94125628698464	282.8427442134958	21/02/24 15:38:19
18	982	311.9701439326997	283.0039917214018	21/02/24 15:38:19
18	982	312.1824349589621	282.8157656459416	21/02/24 15:38:19
18	982	312.29986706563017	282.79281119965816	21/02/24 15:38:19
18	982	312.2584781668875	282.8318407578301	21/02/24 15:38:19
18	982	312.2774136904068	282.6958166373127	21/02/24 15:38:19
18	982	312.12429981197096	282.6542081884091	21/02/24 15:38:19
18	982	312.28891746267004	282.443523477394	21/02/24 15:38:19
18	982	312.3012231191993	282.4502861498653	21/02/24 15:38:19
18	982	312.3012231191993	282.4502861498653	21/02/24 15:38:19
18	982	312.2191291834102	282.43291239851237	21/02/24 15:38:20
18	982	312.12308376397846	282.54714976476725	21/02/24 15:38:20
18	982	312.1373230588761	282.5280388522067	21/02/24 15:38:20
18	982	312.01175771681795	282.583298923852	21/02/24 15:38:20
18	982	312.0382287328302	282.572056027209	21/02/24 15:38:20
18	982	312.0885106212267	282.48723221554565	21/02/24 15:38:20
18	982	311.9179601956739	282.4994009879303	21/02/24 15:38:20
18	982	311.73000362085037	282.6416455064965	21/02/24 15:38:20
18	982	311.73000362085037	282.6416455064965	21/02/24 15:38:20
18	982	311.7846353977719	282.744693807171	21/02/24 15:38:21
18	982	311.8321005387122	282.7464213022428	21/02/24 15:38:21
18	982	311.8321005387122	282.7464213022428	21/02/24 15:38:21
18	982	311.9358025249143	282.9020269707199	21/02/24 15:38:21
18	982	311.9358025249143	282.9020269707199	21/02/24 15:38:21
18	982	311.7705153874526	282.5818023704853	21/02/24 15:38:21
18	982	311.8687974041387	282.625385623219	21/02/24 15:38:21
18	982	311.80275910733275	282.58483880027	21/02/24 15:38:21
18	982	311.80275910733275	282.58483880027	21/02/24 15:38:21
18	982	311.819809515481	282.3713542434561	21/02/24 15:38:21
18	982	311.83007990694637	282.4103841944384	21/02/24 15:38:22
18	982	311.7927159018788	282.2514763713826	21/02/24 15:38:22
18	982	311.8153597652453	282.1220203156844	21/02/24 15:38:22
18	982	311.83997749651115	282.1361860528325	21/02/24 15:38:22
18	982	311.8607799108438	282.1008379188315	21/02/24 15:38:22
18	982	311.800397859339	282.0931306768441	21/02/24 15:38:22
18	982	311.63686464743745	281.882061962798	21/02/24 15:38:22
18	982	311.6413269934872	281.88464340797725	21/02/24 15:38:22
18	982	311.65957351214644	281.780840813516	21/02/24 15:38:22
18	982	311.4643241194132	281.6513736911545	21/02/24 15:38:22
18	982	311.3765727875152	281.75226283303556	21/02/24 15:38:23
18	982	311.162223322604	281.9095763376348	21/02/24 15:38:23
18	982	311.02420943374966	281.8907335936839	21/02/24 15:38:23
18	982	311.13390077884725	282.0186673200223	21/02/24 15:38:23
18	982	310.882563220643	281.8852963346282	21/02/24 15:38:23
18	982	310.8658331957349	281.8718540224502	21/02/24 15:38:23
18	982	310.7940984243177	281.84225227201784	21/02/24 15:38:23
18	982	310.7940984243177	281.84225227201784	21/02/24 15:38:23
18	982	310.90534733464955	281.63049076337467	21/02/24 15:38:23
18	982	310.8468478390443	281.7772518231578	21/02/24 15:38:24
18	982	311.0334824008707	281.7928010805691	21/02/24 15:38:24
18	982	311.00161289771626	281.7482362030216	21/02/24 15:38:24
18	982	311.00161289771626	281.7482362030216	21/02/24 15:38:24
18	982	311.0530955554105	281.7321495420225	21/02/24 15:38:24
18	982	311.0684684790541	281.51438037732254	21/02/24 15:38:24
18	982	311.04275979979263	281.51725960399295	21/02/24 15:38:24
18	982	311.2901811841725	281.48682703341495	21/02/24 15:38:24
18	982	311.3423220652977	281.53751786859476	21/02/24 15:38:24
18	982	311.54245012724283	281.5350807452271	21/02/24 15:38:24
18	982	311.6393425466278	281.3153247500868	21/02/24 15:38:25
18	982	311.6393425466278	281.3153247500868	21/02/24 15:38:25
18	982	311.7046474400736	281.37184560915426	21/02/24 15:38:25
18	982	311.5095100120259	281.3868961854685	21/02/24 15:38:25
18	982	311.57847696855856	281.52854180926323	21/02/24 15:38:25
18	982	311.6507531747133	281.5190419407848	21/02/24 15:38:25
18	982	311.60464469480274	281.4349788911543	21/02/24 15:38:25
18	982	311.6803577366167	281.48378552840035	21/02/24 15:38:25
18	982	311.9032795947128	281.3814751387017	21/02/24 15:38:25
18	982	312.0861178947527	281.57292933240535	21/02/24 15:38:25
18	982	312.00815487050323	281.5064715451061	21/02/24 15:38:26
18	982	312.20410764432665	281.38503788727445	21/02/24 15:38:26
18	982	312.1256347373373	281.5887005132365	21/02/24 15:38:26
18	982	312.07167228786386	281.56593962305317	21/02/24 15:38:26
18	982	312.05782309090125	281.52896901591765	21/02/24 15:38:26
18	982	312.1980191242114	281.5663043404206	21/02/24 15:38:26
18	982	312.237359799668	281.56306898112825	21/02/24 15:38:26
18	982	312.33889567152795	281.3218623036738	21/02/24 15:38:26
18	982	312.21074026352807	281.21087073371586	21/02/24 15:38:26
18	982	312.2305975862912	281.3121947179745	21/02/24 15:38:26
18	982	312.23072412370516	281.3119882974275	21/02/24 15:38:27
18	982	312.23072412370516	281.3119882974275	21/02/24 15:38:27
18	982	312.1640968671986	281.3773864756773	21/02/24 15:38:27
18	982	312.36828240376286	281.468264729572	21/02/24 15:38:27
18	982	312.36828240376286	281.468264729572	21/02/24 15:38:27
18	982	312.6634534471289	281.5084424436128	21/02/24 15:38:27
18	982	312.6636053213444	281.51123342079705	21/02/24 15:38:27
18	982	312.9013949340085	281.4729349946462	21/02/24 15:38:27
18	982	312.89995990844756	281.42974506295883	21/02/24 15:38:27
18	982	312.8999547179662	281.4298423180294	21/02/24 15:38:28
18	982	312.80348556203063	281.34246800825946	21/02/24 15:38:28
18	982	312.75878404231963	281.169947997836	21/02/24 15:38:28
18	982	312.9609672439064	281.1234981554048	21/02/24 15:38:28
18	982	312.98846230722495	281.135969960391	21/02/24 15:38:28
18	982	312.9485580639996	281.05566259534476	21/02/24 15:38:28
18	982	312.94891598889336	281.05641050120397	21/02/24 15:38:28
18	982	313.09351921347303	280.9926279286348	21/02/24 15:38:28
18	982	313.19763629830214	280.9791038167479	21/02/24 15:38:28
18	982	313.297316001312	280.70141964791156	21/02/24 15:38:28
18	982	313.20498316433435	280.8402182587731	21/02/24 15:38:29
18	982	313.18324755729077	281.02666128560077	21/02/24 15:38:29
18	982	313.36254077165984	281.0623729517559	21/02/24 15:38:29
18	982	313.36254077165984	281.0623729517559	21/02/24 15:38:29
18	982	313.36254077165984	281.0623729517559	21/02/24 15:38:29
18	982	313.51629689632847	281.025695875861	21/02/24 15:38:29
18	982	313.7106335660797	280.9793386930106	21/02/24 15:38:29
18	982	313.9376181942251	280.9251936470724	21/02/24 15:38:29
18	982	314.1579308398781	280.87264013973964	21/02/24 15:38:29
18	982	314.43601987318686	280.80630461910795	21/02/24 15:38:29
18	982	314.6545606460263	280.75417377535234	21/02/24 15:38:30
18	982	314.84703415226727	280.70826103261527	21/02/24 15:38:30
18	982	315.05773183743145	280.65800108358036	21/02/24 15:38:30
18	982	315.34385746911505	280.5897485080725	21/02/24 15:38:30
18	982	315.59891397339754	280.5289071803841	21/02/24 15:38:30
18	982	316.0994299894966	280.40951379720246	21/02/24 15:38:30
18	982	316.3004565431311	280.3615608055383	21/02/24 15:38:30
18	982	316.5911035856831	280.2922296900378	21/02/24 15:38:30
18	982	316.5911035856831	280.2922296900378	21/02/24 15:38:30
18	982	316.98571900693526	280.19809789668153	21/02/24 15:38:31
18	982	317.1919014773051	280.14891500962415	21/02/24 15:38:31
18	982	317.38069083406697	280.1038810860583	21/02/24 15:38:31
18	982	317.38069083406697	280.1038810860583	21/02/24 15:38:31
18	982	317.5421569028911	280.06536487557577	21/02/24 15:38:31
18	982	317.6981381999033	280.0281570057687	21/02/24 15:38:31
18	982	317.8930641346174	279.9816592593095	21/02/24 15:38:31
18	982	318.10588569014806	279.9308926809953	21/02/24 15:38:31
18	982	318.34927178778236	279.87283521893363	21/02/24 15:38:31
18	982	318.63499756809995	279.80467802420446	21/02/24 15:38:31
18	982	318.8390808218008	279.7559958855189	21/02/24 15:38:32
18	982	319.0484275265079	279.7060582001523	21/02/24 15:38:32
18	982	319.31757621171977	279.64185531538396	21/02/24 15:38:32
18	982	319.60874000634624	279.5724009335414	21/02/24 15:38:32
18	982	319.83731293995186	279.5178770122899	21/02/24 15:38:32
18	982	320.0008278894356	279.47887206061665	21/02/24 15:38:32
18	982	320.2299699481612	279.42421237992613	21/02/24 15:38:32
18	982	320.38377285490463	279.38752414460777	21/02/24 15:38:32
18	982	320.5318089587719	279.21993014619375	21/02/24 15:38:32
18	982	320.7525067617162	279.3066906560555	21/02/24 15:38:32
18	982	320.56276954903547	279.1896889885212	21/02/24 15:38:33
18	982	320.46376419991964	279.0149416938532	21/02/24 15:38:33
18	982	320.6143258542217	279.14697739542356	21/02/24 15:38:33
18	982	320.4927399243052	279.14234692402846	21/02/24 15:38:33
18	982	320.28006741986655	279.1704753102198	21/02/24 15:38:33
18	982	320.3242809403314	279.1780440962481	21/02/24 15:38:33
18	982	320.44973105360657	279.2741130777264	21/02/24 15:38:33
18	982	320.1882079637395	279.23510006488146	21/02/24 15:38:33
18	982	320.23226010294917	279.28153178434764	21/02/24 15:38:33
18	982	320.2182254249734	279.2510113814293	21/02/24 15:38:34
18	982	320.24412947395746	279.11083409499344	21/02/24 15:38:34
18	982	320.2018214055307	279.12658007898506	21/02/24 15:38:34
18	982	320.2339851692091	279.11651454431905	21/02/24 15:38:34
18	982	320.2067830548684	279.06224580186483	21/02/24 15:38:34
18	982	320.2531785651908	279.1610062140741	21/02/24 15:38:34
18	982	320.36050220083865	279.01608827337805	21/02/24 15:38:34
18	982	320.45688867626797	279.04734282696813	21/02/24 15:38:34
18	982	320.2993703388678	279.2203032343124	21/02/24 15:38:34
18	982	320.2442870971953	279.0836425222379	21/02/24 15:38:34
18	982	320.23929238262593	279.18641370269944	21/02/24 15:38:35
18	982	320.18433285681914	279.1156688491178	21/02/24 15:38:35
18	982	320.3907085647134	279.16262399795255	21/02/24 15:38:35
18	982	320.29673022153116	279.02483600850115	21/02/24 15:38:35
18	982	320.2868331705156	279.0576162766675	21/02/24 15:38:35
18	982	320.2166436165265	279.0903310945476	21/02/24 15:38:35
18	982	320.412685941187	278.9139601660826	21/02/24 15:38:35
18	982	320.29750381569335	278.99172517088556	21/02/24 15:38:35
18	982	320.2088833858707	279.0198611460833	21/02/24 15:38:35
18	982	320.4099283881706	279.23571903264366	21/02/24 15:38:35
18	982	320.41112239241784	279.2291134867761	21/02/24 15:38:36
18	982	320.2438574687323	279.3781728273644	21/02/24 15:38:36
18	982	320.3549715772378	279.62511545834036	21/02/24 15:38:36
18	982	320.3480128584836	279.8273142363974	21/02/24 15:38:36
18	982	320.613621311328	279.69165812248224	21/02/24 15:38:36
18	982	320.746989772046	279.760975802799	21/02/24 15:38:36
18	982	320.92918230906776	279.77339839694855	21/02/24 15:38:36
18	982	320.67904205975583	279.7773882938711	21/02/24 15:38:36
18	982	320.63757412976537	279.74018582481574	21/02/24 15:38:36
18	982	320.70880272961915	279.5247485007522	21/02/24 15:38:37
18	982	320.9494540168717	279.5664635334745	21/02/24 15:38:37
18	982	321.0215506388694	279.54014728979683	21/02/24 15:38:37
18	982	321.00934387118986	279.48226699445695	21/02/24 15:38:37
18	982	320.9746051610809	279.59734435114416	21/02/24 15:38:37
18	982	321.1291257587444	279.373164376534	21/02/24 15:38:37
18	982	321.1998136740763	279.12700976727643	21/02/24 15:38:37
18	982	321.03366222109764	279.14231513910676	21/02/24 15:38:37
18	982	321.161100918219	279.14994520909045	21/02/24 15:38:37
18	982	321.1112949397731	279.2753926943343	21/02/24 15:38:37
18	982	321.09830498310464	279.26289235568333	21/02/24 15:38:38
18	982	321.0158246306905	279.1988475064534	21/02/24 15:38:38
18	982	320.77766254239464	279.25515453148364	21/02/24 15:38:38
18	982	320.75104857483564	279.28361932904926	21/02/24 15:38:38
18	982	321.0068109898114	279.3227047129557	21/02/24 15:38:38
18	982	321.01903777654644	279.3330080397444	21/02/24 15:38:38
18	982	321.2079637870035	279.56443036591133	21/02/24 15:38:38
18	982	321.112348753885	279.68015164777466	21/02/24 15:38:38
18	982	321.0571340474062	279.6621924799802	21/02/24 15:38:38
18	982	321.09145026933044	279.5678021276309	21/02/24 15:38:38
18	982	321.117133173266	279.55764338557157	21/02/24 15:38:39
18	982	321.119701299294	279.56872165564573	21/02/24 15:38:39
18	982	321.12114362356317	279.5675316193896	21/02/24 15:38:39
18	982	321.35525323993835	279.5502256802099	21/02/24 15:38:39
18	982	321.22919965949126	279.5185896507157	21/02/24 15:38:39
18	982	321.26026438917603	279.5328879193394	21/02/24 15:38:39
18	982	321.23025778957367	279.30238235046096	21/02/24 15:38:39
18	982	321.29080359026744	279.2322948709972	21/02/24 15:38:39
18	982	321.28616794245187	278.94773822569636	21/02/24 15:38:39
18	982	321.34175234100235	278.9902368908056	21/02/24 15:38:40
18	982	321.49940792914856	278.86323512429516	21/02/24 15:38:40
18	982	321.49940792914856	278.86323512429516	21/02/24 15:38:40
18	982	321.48820923739106	279.12971848885996	21/02/24 15:38:40
18	982	321.48820923739106	279.12971848885996	21/02/24 15:38:40
18	982	321.27760314030553	279.17073844894577	21/02/24 15:38:40
18	982	321.27760314030553	279.17073844894577	21/02/24 15:38:40
18	982	321.2856137248027	279.1758824092026	21/02/24 15:38:40
18	982	321.1995106049791	279.0493150454967	21/02/24 15:38:40
18	982	321.38710033820416	278.9485127612852	21/02/24 15:38:40
18	982	321.4155307743415	278.91695756701847	21/02/24 15:38:41
18	982	321.3284449518918	278.8154625789024	21/02/24 15:38:41
18	982	321.3323984696778	278.83450881460533	21/02/24 15:38:41
18	982	321.3323984696778	278.83450881460533	21/02/24 15:38:41
18	982	321.2402139082444	278.556969437567	21/02/24 15:38:41
18	982	321.2402139082444	278.556969437567	21/02/24 15:38:41
18	982	321.21142384531106	278.61844026129796	21/02/24 15:38:41
18	982	321.44859537727694	278.71675642848635	21/02/24 15:38:41
18	982	321.43357417915684	278.7175643845711	21/02/24 15:38:41
18	982	321.72555928683664	278.6701694300318	21/02/24 15:38:41
18	982	321.70809073385607	278.387096919926	21/02/24 15:38:42
18	982	321.71110065993116	278.3881611187447	21/02/24 15:38:42
18	982	321.77762019074004	278.52031591771885	21/02/24 15:38:42
18	982	321.6761515914837	278.3549717872632	21/02/24 15:38:42
18	982	321.67981107677974	278.3542671568258	21/02/24 15:38:42
18	982	321.640589458641	278.5994543840771	21/02/24 15:38:42
18	982	321.5381421552096	278.4741347448923	21/02/24 15:38:42
18	982	321.64017537166035	278.46514287316853	21/02/24 15:38:42
18	982	321.64017537166035	278.46514287316853	21/02/24 15:38:42
18	982	321.38119772048384	278.4229950045421	21/02/24 15:38:43
18	982	321.34915040794044	278.3063201667523	21/02/24 15:38:43
18	982	321.4668668446134	278.31063224273964	21/02/24 15:38:43
18	982	321.4581571963388	278.4371448373411	21/02/24 15:38:43
18	982	321.2213831876799	278.4739855106132	21/02/24 15:38:43
18	982	321.43136586295077	278.4935204988683	21/02/24 15:38:43
18	982	321.43136586295077	278.4935204988683	21/02/24 15:38:43
18	982	321.4762086867767	278.5101551553671	21/02/24 15:38:43
18	982	321.6565809699337	278.3414256684707	21/02/24 15:38:43
18	982	321.73902278406536	278.5399438428634	21/02/24 15:38:43
18	982	321.73902278406536	278.5399438428634	21/02/24 15:38:44
18	982	321.93305484034954	278.286937349291	21/02/24 15:38:44
18	982	321.96852394168025	278.0155793978012	21/02/24 15:38:44
18	982	321.75891202827853	278.0699173432838	21/02/24 15:38:44
18	982	321.70767207054337	278.0500158452005	21/02/24 15:38:44
18	982	321.72969120309745	278.1254011791816	21/02/24 15:38:44
18	982	321.72969120309745	278.1254011791816	21/02/24 15:38:44
18	982	321.9388290640632	278.02221433118456	21/02/24 15:38:44
18	982	321.9411604504911	278.0330946141535	21/02/24 15:38:44
18	982	321.7828499448098	277.79856536442054	21/02/24 15:38:44
18	982	321.93723413382395	277.6036724777452	21/02/24 15:38:45
18	982	321.8018865035411	277.57790627183243	21/02/24 15:38:45
18	982	322.02930311719905	277.6336879493028	21/02/24 15:38:45
18	982	322.01164075744384	277.3827939222675	21/02/24 15:38:45
18	982	322.0217391069938	277.4233115178091	21/02/24 15:38:45
18	982	321.9702884672601	277.20907260642116	21/02/24 15:38:45
18	982	321.98895026813966	277.2181161023183	21/02/24 15:38:45
18	982	321.9904037339704	277.2307470697351	21/02/24 15:38:45
18	982	321.79175998484635	277.2688012103977	21/02/24 15:38:45
18	982	321.60223651094736	277.0535505218874	21/02/24 15:38:46
18	982	321.50192441581595	276.9476453734163	21/02/24 15:38:46
18	982	321.61515913894834	276.75955548025735	21/02/24 15:38:46
18	982	321.7762757990814	276.9200767839647	21/02/24 15:38:46
18	982	321.87128058257093	277.08487877806584	21/02/24 15:38:46
18	982	321.85227711761576	276.88866248603705	21/02/24 15:38:46
18	982	321.739731144213	276.84149780109544	21/02/24 15:38:46
18	982	321.91887227816153	276.89058676739575	21/02/24 15:38:46
18	982	322.11343050948335	277.0913344527171	21/02/24 15:38:46
18	982	322.22074953021894	276.9992827574617	21/02/24 15:38:46
18	982	322.1073324486557	277.16770748232403	21/02/24 15:38:47
18	982	322.2631813151275	277.2783076501936	21/02/24 15:38:47
18	982	322.2278071876267	277.3307474949728	21/02/24 15:38:47
18	982	322.1831861270548	277.1375304263051	21/02/24 15:38:47
18	982	322.3090649998631	277.16115438450817	21/02/24 15:38:47
18	982	322.356670049209	277.16992600336096	21/02/24 15:38:47
18	982	322.3807655458279	276.955190027202	21/02/24 15:38:47
18	982	322.23416816222255	277.07603133872556	21/02/24 15:38:47
18	982	322.31652703339927	276.9851772802373	21/02/24 15:38:47
18	982	322.40734582108917	276.85072013269524	21/02/24 15:38:47
18	982	322.4065500397065	276.935713633168	21/02/24 15:38:48
18	982	322.5272883900628	276.8193357692996	21/02/24 15:38:48
18	982	322.518914699749	276.947983409811	21/02/24 15:38:48
18	982	322.45664154611586	276.75862699766566	21/02/24 15:38:48
18	982	322.579415051689	276.66293993664283	21/02/24 15:38:48
18	982	322.3117255933539	276.7933368839418	21/02/24 15:38:48
18	982	322.0835261822944	276.83056124319313	21/02/24 15:38:48
18	982	322.0563937297402	276.7902657159206	21/02/24 15:38:48
18	982	321.9164837211984	276.5319253021703	21/02/24 15:38:48
18	982	321.733973336579	276.52297293878695	21/02/24 15:38:49
18	982	321.69811130170757	276.8151794752482	21/02/24 15:38:49
18	982	321.69758619931343	276.8180916756379	21/02/24 15:38:49
18	982	321.61532671609336	276.9345588006156	21/02/24 15:38:49
18	982	321.5381587915086	276.85594361108605	21/02/24 15:38:49
18	982	321.5735034749029	276.6548621011261	21/02/24 15:38:49
18	982	321.8527764124533	276.66549161672816	21/02/24 15:38:49
18	982	321.97072171085665	276.6447169208169	21/02/24 15:38:49
18	982	321.95864137392005	276.6514639216928	21/02/24 15:38:49
18	982	321.92571978607884	276.4513881673711	21/02/24 15:38:49
18	982	322.030413548781	276.57032219906245	21/02/24 15:38:50
18	982	322.05251077167236	276.6347895388066	21/02/24 15:38:50
18	982	321.85171440150106	276.56798461871233	21/02/24 15:38:50
18	982	321.81926190351834	276.56118549743184	21/02/24 15:38:50
18	982	321.88716822393786	276.74615318039605	21/02/24 15:38:50
18	982	321.615308251698	276.6374621379045	21/02/24 15:38:50
18	982	321.6002274893337	276.922636539615	21/02/24 15:38:50
18	982	321.4980497913101	276.8292558947575	21/02/24 15:38:50
18	982	321.3395444600411	276.7026324122158	21/02/24 15:38:50
18	982	321.3154592735141	276.57033580939225	21/02/24 15:38:50
18	982	321.35359256663355	276.6832905513576	21/02/24 15:38:51
18	982	321.3646556503172	276.69931892710326	21/02/24 15:38:51
18	982	321.28022052100016	276.5859590026277	21/02/24 15:38:51
18	982	321.3611355874731	276.7896698244183	21/02/24 15:38:51
18	982	321.37053833984857	276.76077767361375	21/02/24 15:38:51
18	982	321.5063294233542	276.9279255846303	21/02/24 15:38:51
18	982	321.3847203669885	276.7061402231851	21/02/24 15:38:51
18	982	321.4309201656333	276.6482055988422	21/02/24 15:38:51
18	982	321.4630283879421	276.6669056526821	21/02/24 15:38:51
18	982	321.41033798450565	276.57599293068597	21/02/24 15:38:52
18	982	321.42397638815845	276.4962418454998	21/02/24 15:38:52
18	982	321.3857579541264	276.4808365067129	21/02/24 15:38:52
18	982	321.5390967179722	276.56239940393067	21/02/24 15:38:52
18	982	321.51490447475726	276.5466994045325	21/02/24 15:38:52
18	982	321.41860005323514	276.4618270528669	21/02/24 15:38:52
18	982	321.3341439452134	276.45134329025353	21/02/24 15:38:52
18	982	321.16395946822956	276.5349240726458	21/02/24 15:38:52
18	982	321.19259558227725	276.45174100361436	21/02/24 15:38:52
18	982	321.1987018203077	276.47357049460413	21/02/24 15:38:52
18	982	321.3778316044661	276.40812413199365	21/02/24 15:38:53
18	982	321.4540104924965	276.4596159266403	21/02/24 15:38:53
18	982	321.37205490617805	276.4787723861622	21/02/24 15:38:53
18	982	321.5305471383887	276.5916310541187	21/02/24 15:38:53
18	982	321.38311460384466	276.5058210524643	21/02/24 15:38:53
18	982	321.1529589021378	276.45739544394246	21/02/24 15:38:53
18	982	321.08277658161205	276.3541132091991	21/02/24 15:38:53
18	982	321.17316144110197	276.51332077062995	21/02/24 15:38:53
18	982	321.2340901921835	276.5099924134656	21/02/24 15:38:53
18	982	321.2988950145314	276.49735787414033	21/02/24 15:38:53
18	982	321.2904671218666	276.46570911157306	21/02/24 15:38:54
18	982	321.255944573068	276.73938960205146	21/02/24 15:38:54
18	982	321.23456707494574	276.74103897365234	21/02/24 15:38:54
18	982	321.20208497941456	276.85563556590506	21/02/24 15:38:54
18	982	321.20808688174134	276.87000261147654	21/02/24 15:38:54
18	982	321.1774903424932	276.8523740294458	21/02/24 15:38:54
18	982	321.16073859829913	276.84647650735934	21/02/24 15:38:54
18	982	321.1378850515705	276.75759080151744	21/02/24 15:38:54
18	982	320.95321664802293	276.93190551937437	21/02/24 15:38:54
18	982	320.9607872124006	276.93117881010863	21/02/24 15:38:55
18	982	321.02682294588277	276.81470196122063	21/02/24 15:38:55
18	982	321.00600656981186	276.87238653484616	21/02/24 15:38:55
18	982	321.0057013947311	276.872950917007	21/02/24 15:38:55
18	982	320.9001948956392	277.1306211015209	21/02/24 15:38:55
18	982	320.6674209467511	277.1457526980425	21/02/24 15:38:55
18	982	320.84107323122095	277.2449975217265	21/02/24 15:38:55
18	982	320.67858602679763	277.03086403566033	21/02/24 15:38:55
18	982	320.80146321231183	276.8060137362479	21/02/24 15:38:55
18	982	320.77835727843996	276.8154466908154	21/02/24 15:38:55
18	982	320.6370179685384	276.8085248094699	21/02/24 15:38:56
18	982	320.7774265299876	276.6884130029981	21/02/24 15:38:56
18	982	320.5768857071541	276.65460922705495	21/02/24 15:38:56
18	982	320.39839967203375	276.78589222432805	21/02/24 15:38:56
18	982	320.4915678452343	276.82807470309547	21/02/24 15:38:56
18	982	320.34394852077	276.7823666979291	21/02/24 15:38:56
18	982	320.5455746392188	276.96350901790623	21/02/24 15:38:56
18	982	320.3677538418789	276.75411511136895	21/02/24 15:38:56
18	982	320.4100331168981	276.9258776142794	21/02/24 15:38:56
18	982	320.5037939301535	276.8191391844801	21/02/24 15:38:56
18	982	320.4905575642254	276.7966653422089	21/02/24 15:38:57
18	982	320.531984196547	276.793960394942	21/02/24 15:38:57
18	982	320.483593883642	276.67095997823094	21/02/24 15:38:57
18	982	320.460947082136	276.67666480032284	21/02/24 15:38:57
18	982	320.1906741520122	276.7329779614314	21/02/24 15:38:57
18	982	320.1558020876896	276.7048721494852	21/02/24 15:38:57
18	982	320.14122172914915	276.58931591991444	21/02/24 15:38:57
18	982	319.86854869524706	276.63725578696454	21/02/24 15:38:57
18	982	319.8812028633902	276.6344555276024	21/02/24 15:38:57
18	982	319.6763085150402	276.6664311779126	21/02/24 15:38:58
18	982	319.9203455499003	276.57575073343145	21/02/24 15:38:58
18	982	319.903588898575	276.55737814785783	21/02/24 15:38:58
18	982	320.12127836411224	276.6889455791778	21/02/24 15:38:58
18	982	320.42060592442834	276.516950342839	21/02/24 15:38:58
18	982	320.3956048610521	276.4508184953683	21/02/24 15:38:58
18	982	320.56410590920956	276.5988466621788	21/02/24 15:38:58
18	982	320.59561503756566	276.3508287339793	21/02/24 15:38:58
18	982	320.6923282212436	276.3525322427806	21/02/24 15:38:58
18	982	320.4918899203182	276.41370991280365	21/02/24 15:38:58
18	982	320.637424071474	276.3027531176471	21/02/24 15:38:59
18	982	320.7544164441436	276.3319070036213	21/02/24 15:38:59
18	982	320.8033921402739	276.246334684118	21/02/24 15:38:59
18	982	320.72801304057543	276.19070925572345	21/02/24 15:38:59
18	982	320.7346195704454	276.21628157371936	21/02/24 15:38:59
18	982	320.9014820015903	276.10049411494754	21/02/24 15:38:59
18	982	320.9014820015903	276.10049411494754	21/02/24 15:38:59
18	982	320.7169131450359	276.0004909813324	21/02/24 15:38:59
18	982	320.5264618739555	275.8815885612812	21/02/24 15:38:59
18	982	320.46788887492113	275.836366363206	21/02/24 15:39:00
18	982	320.5265911316579	275.83836633644614	21/02/24 15:39:00
18	982	320.3394397577644	275.8421491917601	21/02/24 15:39:00
18	982	320.3394397577644	275.8421491917601	21/02/24 15:39:00
18	982	320.33932071988977	275.840339311341	21/02/24 15:39:00
18	982	320.23255407396994	275.69776823616644	21/02/24 15:39:00
18	982	320.28611371094536	275.5181014949815	21/02/24 15:39:00
18	982	320.4998732135316	275.70591661502937	21/02/24 15:39:00
18	982	320.57342085593837	275.82656159066534	21/02/24 15:39:00
18	982	320.37171183346936	275.9285327800922	21/02/24 15:39:00
18	982	320.2693069793222	276.0591591925181	21/02/24 15:39:01
18	982	320.24048593274256	276.17346702548605	21/02/24 15:39:01
18	982	320.1212159323616	276.1527553706905	21/02/24 15:39:01
18	982	320.11380627412336	276.15273944343915	21/02/24 15:39:01
18	982	320.22542880097205	276.35955911598194	21/02/24 15:39:01
18	982	320.15494790176416	276.64549140832867	21/02/24 15:39:01
18	982	320.05628708297405	276.6652018822074	21/02/24 15:39:01
18	982	320.05163505337515	276.6656145645523	21/02/24 15:39:01
18	982	319.9108872340361	276.5718624857881	21/02/24 15:39:01
18	982	319.79436884671475	276.6267427893683	21/02/24 15:39:01
18	982	319.8745461396627	276.84735932616655	21/02/24 15:39:02
18	982	319.8209228289128	276.79027078485706	21/02/24 15:39:02
18	982	320.00292928046537	276.8480531749909	21/02/24 15:39:02
18	982	320.0202568634991	276.8187796973491	21/02/24 15:39:02
18	982	320.03052482720034	276.8098081512284	21/02/24 15:39:02
18	982	320.0301628348403	276.7830532491527	21/02/24 15:39:02
18	982	320.0676916042908	276.65821411484785	21/02/24 15:39:02
18	982	320.1632351377991	276.8039080084934	21/02/24 15:39:02
18	982	320.09539254188854	276.9677978377168	21/02/24 15:39:02
18	982	319.9536212007156	276.8851484763493	21/02/24 15:39:02
18	982	319.6817855998658	276.9020841181159	21/02/24 15:39:03
18	982	319.6817855998658	276.9020841181159	21/02/24 15:39:03
18	982	319.6817855998658	276.9020841181159	21/02/24 15:39:03
18	982	319.8402908931635	276.93258080353434	21/02/24 15:39:03
18	982	320.1007896257567	276.982701198472	21/02/24 15:39:03
18	982	320.3082234403724	277.0226118138077	21/02/24 15:39:03
18	982	320.52598805459974	277.06451009239004	21/02/24 15:39:03
18	982	320.7322752875187	277.104200103476	21/02/24 15:39:03
18	982	320.9109067612411	277.13856909990886	21/02/24 15:39:03
18	982	321.1794752579838	277.1902421310617	21/02/24 15:39:04
18	982	321.3268957051411	277.2186060734113	21/02/24 15:39:04
18	982	321.5454192334451	277.2606503683403	21/02/24 15:39:04
18	982	321.74359458247466	277.29877963930215	21/02/24 15:39:04
18	982	321.97355743394917	277.34302487927766	21/02/24 15:39:04
18	982	322.2296545332239	277.3922983925507	21/02/24 15:39:04
18	982	322.40844077605806	277.4266971668214	21/02/24 15:39:04
18	982	322.6779711710233	277.47855526881244	21/02/24 15:39:04
18	982	322.86888794598934	277.5152879778981	21/02/24 15:39:04
18	982	323.10957457264	277.5615964902807	21/02/24 15:39:04
18	982	323.264730927533	277.59144883430906	21/02/24 15:39:05
18	982	323.4916279978699	277.6351042128296	21/02/24 15:39:05
18	982	323.7372364931891	277.6823597010345	21/02/24 15:39:05
18	982	323.98649376550054	277.73031722007875	21/02/24 15:39:05
18	982	324.24642163821045	277.78032778061333	21/02/24 15:39:05
18	982	324.43071325245177	277.81578579761606	21/02/24 15:39:05
18	982	324.6499757889118	277.85797227895904	21/02/24 15:39:05
18	982	324.8381408214301	277.8941755481627	21/02/24 15:39:05
18	982	325.3604084411734	277.99466071791426	21/02/24 15:39:05
18	982	325.5137637729032	278.02416654205234	21/02/24 15:39:06
18	982	325.5137637729032	278.02416654205234	21/02/24 15:39:06
18	982	325.8483649292371	278.0885443681366	21/02/24 15:39:06
18	982	326.13804481795427	278.14427926666554	21/02/24 15:39:06
18	982	326.34318615369244	278.1837488052037	21/02/24 15:39:06
18	982	326.60256609424926	278.2336539426691	21/02/24 15:39:06
18	982	326.88608783335485	278.28820400283996	21/02/24 15:39:06
18	982	327.05112502412913	278.3199574363353	21/02/24 15:39:06
18	982	327.2782976883725	278.3636658395877	21/02/24 15:39:06
18	982	327.42650138271586	278.3921804800152	21/02/24 15:39:06
18	982	327.67780479072906	278.440531679015	21/02/24 15:39:07
18	982	327.90926893260183	278.4850657697919	21/02/24 15:39:07
18	982	328.06314207486116	278.5146712215481	21/02/24 15:39:07
18	982	328.31820726803466	278.5637461943491	21/02/24 15:39:07
18	982	328.31820726803466	278.5637461943491	21/02/24 15:39:07
18	982	328.47187297183115	278.59331173459566	21/02/24 15:39:07
18	982	328.6618145709124	278.62985681819845	21/02/24 15:39:07
18	982	328.865144432351	278.66897782603013	21/02/24 15:39:07
18	982	329.08694837410263	278.711653278032	21/02/24 15:39:07
18	982	329.3200048629963	278.7564937390579	21/02/24 15:39:07
18	982	329.6704770611589	278.82392518032333	21/02/24 15:39:08
18	982	329.871151181473	278.8625352190893	21/02/24 15:39:08
18	982	330.0980416614182	278.9061893296074	21/02/24 15:39:08
18	982	330.3427267237701	278.95326714775393	21/02/24 15:39:08
18	982	330.3427267237701	278.95326714775393	21/02/24 15:39:08
18	982	330.8194158628629	279.0449829410555	21/02/24 15:39:08
18	982	330.8194158628629	279.0449829410555	21/02/24 15:39:08
18	982	330.9728717592944	279.0745081140116	21/02/24 15:39:08
18	982	331.130119532233	279.10476285039476	21/02/24 15:39:08
18	982	331.28486873345884	279.13453685737176	21/02/24 15:39:09
18	982	331.4555077481653	279.1673680912274	21/02/24 15:39:09
18	982	331.71260409319325	279.2168338610665	21/02/24 15:39:09
18	982	331.87566115044336	279.2482063135364	21/02/24 15:39:09
18	982	332.3086412901946	279.3315124217408	21/02/24 15:39:09
18	982	332.4561024392528	279.35988419520464	21/02/24 15:39:09
18	982	332.7218028922008	279.41100540990044	21/02/24 15:39:09
18	982	332.9029385863357	279.4458562225588	21/02/24 15:39:09
18	982	332.9029385863357	279.4458562225588	21/02/24 15:39:09
18	982	333.23307803288765	279.50937560816567	21/02/24 15:39:09
18	982	333.39525568087754	279.5405788608126	21/02/24 15:39:10
18	982	333.39525568087754	279.5405788608126	21/02/24 15:39:10
18	982	333.93300894552635	279.6440434947282	21/02/24 15:39:10
18	982	334.20211095765	279.695819175139	21/02/24 15:39:10
18	982	334.20211095765	279.695819175139	21/02/24 15:39:10
18	982	334.48091974763975	279.7494624559614	21/02/24 15:39:10
18	982	335.02509906993674	279.8541634741926	21/02/24 15:39:10
18	982	335.02509906993674	279.8541634741926	21/02/24 15:39:10
18	982	335.18324645241364	279.8845912969662	21/02/24 15:39:10
18	982	335.461742045377	279.93817431815324	21/02/24 15:39:10
18	982	335.98829395583954	280.0394837926557	21/02/24 15:39:11
18	982	335.98829395583954	280.0394837926557	21/02/24 15:39:11
18	982	336.2445340813744	280.08878482442213	21/02/24 15:39:11
18	982	336.5059583679583	280.13908329750666	21/02/24 15:39:11
18	982	336.68753317486136	280.1740185962013	21/02/24 15:39:11
18	982	336.9230361672119	280.2193297686132	21/02/24 15:39:11
18	982	337.18210296938395	280.2691746577259	21/02/24 15:39:11
18	982	337.38769885949176	280.30873165329047	21/02/24 15:39:11
18	982	337.65832925242535	280.3608013967435	21/02/24 15:39:11
18	982	337.8734456972244	280.4021901630672	21/02/24 15:39:12
18	982	338.0405968788182	280.43435033195703	21/02/24 15:39:12
18	982	338.26384736665204	280.4773041018617	21/02/24 15:39:12
18	982	338.44585461644465	280.5123226032967	21/02/24 15:39:12
18	982	338.61576877021724	280.5450143726877	21/02/24 15:39:12
18	982	338.8297819824366	280.5861908752048	21/02/24 15:39:12
18	982	339.09073601752385	280.63639887110924	21/02/24 15:39:12
18	979	339.36424703795336	280.66247224501615	21/02/24 15:39:12
18	979	339.57936091101476	280.66247224501615	21/02/24 15:39:12
18	982	339.7341026619864	280.5793107753186	21/02/24 15:39:12
18	982	339.6923605556152	280.3322034985103	21/02/24 15:39:13
18	982	339.6572527825862	280.12437052259736	21/02/24 15:39:13
18	982	339.6277385352741	279.9496504158665	21/02/24 15:39:13
18	982	339.5924388873724	279.7406815682545	21/02/24 15:39:13
18	982	339.5466641657132	279.4697017879032	21/02/24 15:39:13
18	982	339.52085997918476	279.3169447083586	21/02/24 15:39:13
18	982	339.4954002333951	279.16622666853635	21/02/24 15:39:13
18	982	339.4680022576976	279.0040345859313	21/02/24 15:39:13
18	982	339.428135013284	278.76802622273823	21/02/24 15:39:13
18	982	339.38657769714035	278.5220128775465	21/02/24 15:39:13
18	982	339.34379231006534	278.2687295287552	21/02/24 15:39:14
18	982	339.317430628497	278.11267215861415	21/02/24 15:39:14
18	979	339.26817192129886	277.8210676840678	21/02/24 15:39:14
18	979	339.32252066198345	277.7945215408529	21/02/24 15:39:14
18	979	339.4135841738376	277.7362702124247	21/02/24 15:39:14
18	979	339.42055059863924	277.710988158821	21/02/24 15:39:14
18	979	339.4200452319759	277.6448257868144	21/02/24 15:39:14
18	979	339.240842681831	277.41610503958333	21/02/24 15:39:14
18	979	339.240842681831	277.41610503958333	21/02/24 15:39:14
18	979	339.240842681831	277.41610503958333	21/02/24 15:39:15
18	979	339.18177022751973	277.66050760464935	21/02/24 15:39:15
18	979	339.0791053415606	278.0852666867492	21/02/24 15:39:15
18	979	339.0371364337343	278.2589061409644	21/02/24 15:39:15
18	979	338.97164081543565	278.5298834907194	21/02/24 15:39:15
18	979	338.97164081543565	278.5298834907194	21/02/24 15:39:15
18	979	338.935797824335	278.6781779719082	21/02/24 15:39:15
18	979	338.83040750015664	279.11421310643345	21/02/24 15:39:15
18	979	338.83040750015664	279.11421310643345	21/02/24 15:39:15
18	979	338.7688939951608	279.36871511726866	21/02/24 15:39:15
18	979	338.7189747030912	279.5752479788257	21/02/24 15:39:16
18	979	338.65450779119897	279.84196922499785	21/02/24 15:39:16
18	979	338.6042494907022	280.0499046781711	21/02/24 15:39:16
18	979	338.59254406478647	280.06405245221487	21/02/24 15:39:16
18	979	338.57346364599533	280.0886975955478	21/02/24 15:39:16
18	979	338.6276442792931	280.2423670429297	21/02/24 15:39:16
18	979	338.67475430673863	280.0519407874896	21/02/24 15:39:16
18	979	338.83131678306927	279.80826631526605	21/02/24 15:39:16
18	979	338.63369750711615	279.7853800119928	21/02/24 15:39:16
18	979	338.647601952328	279.88714368770644	21/02/24 15:39:16
18	979	338.4483340599447	279.7153627220713	21/02/24 15:39:17
18	979	338.4427709022156	279.57654522642827	21/02/24 15:39:17
18	979	338.35702280757334	279.47899108613154	21/02/24 15:39:17
18	979	338.2123000800163	279.3918029865744	21/02/24 15:39:17
18	979	338.3893438784558	279.1860234754648	21/02/24 15:39:17
18	979	338.3964755707804	279.0642351013159	21/02/24 15:39:17
18	979	338.2323029324555	279.05593211035335	21/02/24 15:39:17
18	979	338.1358474273416	279.19553689212296	21/02/24 15:39:17
18	979	338.19164638637625	279.13393938689524	21/02/24 15:39:17
18	979	338.3184845867944	279.0514608451166	21/02/24 15:39:18
18	979	338.2963515063898	279.1550900192961	21/02/24 15:39:18
18	979	338.2963515063898	279.1550900192961	21/02/24 15:39:18
18	979	338.35379380912906	279.18221308861587	21/02/24 15:39:18
18	979	338.51346520407935	279.3177300736872	21/02/24 15:39:18
18	979	338.507379875255	279.2195223807724	21/02/24 15:39:18
18	979	338.48880011986773	279.2011831638721	21/02/24 15:39:18
18	979	338.4899489377724	279.2010949517619	21/02/24 15:39:18
18	979	338.29016759183844	279.0823631858204	21/02/24 15:39:18
18	979	338.2814387971621	279.0574318906823	21/02/24 15:39:18
18	979	338.31202168873347	279.14855327816133	21/02/24 15:39:19
18	979	338.39641747136113	279.1026625321365	21/02/24 15:39:19
18	979	338.3628574155085	279.11115260659614	21/02/24 15:39:19
18	979	338.26916667871126	278.97908664334983	21/02/24 15:39:19
18	979	338.26916667871126	278.97908664334983	21/02/24 15:39:19
18	979	338.4592036544129	278.9796670970601	21/02/24 15:39:19
18	979	338.5020053630857	279.08994601311343	21/02/24 15:39:19
18	979	338.4474363753179	279.23634726260815	21/02/24 15:39:19
18	979	338.29387729303767	279.15705191958534	21/02/24 15:39:19
18	979	338.3240845994947	279.1858439256631	21/02/24 15:39:19
18	979	338.22082150957027	279.2249816109956	21/02/24 15:39:20
18	979	338.26877716734975	279.06809146593827	21/02/24 15:39:20
18	979	338.07557061790084	279.12835059094823	21/02/24 15:39:20
18	979	338.1075116163694	279.0835338555394	21/02/24 15:39:20
18	979	337.9415194668823	278.91310971078366	21/02/24 15:39:20
18	979	338.06454635971875	278.9860061120551	21/02/24 15:39:20
18	979	337.9963052467466	278.9672584432198	21/02/24 15:39:20
18	979	337.9048018520288	279.1272417510973	21/02/24 15:39:20
18	979	337.84569769771673	278.918755906243	21/02/24 15:39:20
18	979	337.73981121314677	278.9708758635248	21/02/24 15:39:21
18	979	337.90433889260805	278.92657590702197	21/02/24 15:39:21
18	979	337.9781751774635	279.1337942328844	21/02/24 15:39:21
18	979	337.9215332355342	279.15780507315515	21/02/24 15:39:21
18	979	337.9746872955028	279.0120258163349	21/02/24 15:39:21
18	979	338.000877325511	279.0148363093119	21/02/24 15:39:21
18	979	337.88150494105145	279.08962025591427	21/02/24 15:39:21
18	979	337.8370928182935	279.1408253208863	21/02/24 15:39:21
18	979	337.9455273606802	279.29153356454765	21/02/24 15:39:21
18	979	337.7544565522599	279.4464245839118	21/02/24 15:39:21
18	979	337.9462376837466	279.59531929709135	21/02/24 15:39:22
18	979	337.75367298625406	279.5151350671169	21/02/24 15:39:22
18	979	337.7608823013673	279.5048423147218	21/02/24 15:39:22
18	979	337.84088169938263	279.5472548670833	21/02/24 15:39:22
18	979	337.8699189082839	279.63676688344435	21/02/24 15:39:22
18	979	337.99243736674293	279.6335029643711	21/02/24 15:39:22
18	979	338.01859078344177	279.6959775621552	21/02/24 15:39:22
18	979	338.1285199529414	279.6997420221089	21/02/24 15:39:22
18	979	338.00988465526547	279.9376157119578	21/02/24 15:39:22
18	979	338.15338365769134	279.8254663671275	21/02/24 15:39:22
18	979	338.3220715909383	279.9192012332727	21/02/24 15:39:23
18	979	338.3220715909383	279.9192012332727	21/02/24 15:39:23
18	979	338.49626575496603	280.237431520863	21/02/24 15:39:23
18	979	338.7442192901388	280.1670465075129	21/02/24 15:39:23
18	979	338.6518191750577	280.03653603221227	21/02/24 15:39:23
18	979	338.4963096926685	279.8466782364661	21/02/24 15:39:23
18	979	338.34795484140557	279.7045438791476	21/02/24 15:39:23
18	979	338.1937318629905	279.89169345843123	21/02/24 15:39:23
18	979	338.0428987917552	279.79112612156933	21/02/24 15:39:23
18	979	338.0725009839247	279.8441967667829	21/02/24 15:39:24
18	979	338.33048097720865	279.9383056849472	21/02/24 15:39:24
18	979	338.5449736191893	279.8157281230826	21/02/24 15:39:24
18	979	338.5846693186312	279.9471222087972	21/02/24 15:39:24
18	979	338.47192988742756	279.8812626981497	21/02/24 15:39:24
18	979	338.49126810652194	279.77560689506294	21/02/24 15:39:24
18	979	338.6284646377874	279.857390785474	21/02/24 15:39:24
18	979	338.55318000195206	279.9063396589455	21/02/24 15:39:24
18	979	338.32058364615716	279.9031629394555	21/02/24 15:39:24
18	979	338.2853236421866	279.8909651830254	21/02/24 15:39:24
18	979	338.2853236421866	279.8909651830254	21/02/24 15:39:25
18	979	338.3422506278652	279.87320266469027	21/02/24 15:39:25
18	979	338.4061052824706	279.93470289025385	21/02/24 15:39:25
18	979	338.51926029593847	280.1172388740858	21/02/24 15:39:25
18	979	338.78831249341226	280.112860162491	21/02/24 15:39:25
18	979	338.9787150895804	280.17823150603726	21/02/24 15:39:25
18	979	339.03274085183523	279.77282707509244	21/02/24 15:39:25
18	979	339.03274085183523	279.77282707509244	21/02/24 15:39:25
18	979	339.1614838965137	280.01745727440624	21/02/24 15:39:25
18	979	339.14015190199075	279.92081820447174	21/02/24 15:39:25
18	979	339.2229143578793	279.8553858328617	21/02/24 15:39:26
18	979	339.2229143578793	279.8553858328617	21/02/24 15:39:26
18	979	339.1612868337734	279.8165892735667	21/02/24 15:39:26
18	979	339.3297908641965	279.7277360814836	21/02/24 15:39:26
18	979	339.32619812701876	279.69956206277675	21/02/24 15:39:26
18	979	339.4510088686367	279.4727368005099	21/02/24 15:39:26
18	979	339.5881771003504	279.47359395821854	21/02/24 15:39:26
18	979	339.4845596836063	279.3565807414867	21/02/24 15:39:26
18	979	339.4807614524797	279.3171091771914	21/02/24 15:39:26
18	979	339.37369738426435	279.2108294582209	21/02/24 15:39:27
18	979	339.37369738426435	279.2108294582209	21/02/24 15:39:27
18	979	339.2260189940676	278.99346392284633	21/02/24 15:39:27
18	979	339.1604669189223	279.14044161859863	21/02/24 15:39:27
18	979	339.02419655776345	279.1300364479627	21/02/24 15:39:27
18	979	338.8671104791567	279.36432013334723	21/02/24 15:39:27
18	979	338.6288993608371	279.48407970544014	21/02/24 15:39:27
18	979	338.68511700086646	279.5706166900618	21/02/24 15:39:27
18	979	338.6572625290391	279.4506008386685	21/02/24 15:39:27
18	979	338.55264556496104	279.59018959940215	21/02/24 15:39:27
18	979	338.74728181171383	279.5150065507328	21/02/24 15:39:28
18	979	338.78294471299364	279.49954136001753	21/02/24 15:39:28
18	979	338.7838530675608	279.5244375683607	21/02/24 15:39:28
18	979	339.1914512418408	279.67259456097514	21/02/24 15:39:28
18	979	339.09461781778344	279.8235230244811	21/02/24 15:39:28
18	979	339.1900261815508	279.78400110628	21/02/24 15:39:28
18	979	339.4235339825293	279.67405806686094	21/02/24 15:39:28
18	979	339.4235339825293	279.67405806686094	21/02/24 15:39:28
18	979	339.2298964117766	279.53571480178204	21/02/24 15:39:28
18	979	339.2382992085918	279.6008393396174	21/02/24 15:39:29
18	979	339.29518616286566	279.7211580754067	21/02/24 15:39:29
18	979	339.1925311665629	279.7643062375848	21/02/24 15:39:29
18	979	339.1925311665629	279.7643062375848	21/02/24 15:39:29
18	979	339.23858324485764	279.694696549325	21/02/24 15:39:29
18	979	339.24414318948124	279.6781903424732	21/02/24 15:39:29
18	979	339.2856970970993	279.7077646332443	21/02/24 15:39:29
18	979	339.1328260033812	279.6507953311177	21/02/24 15:39:29
18	979	339.1771901672801	279.53627990799316	21/02/24 15:39:29
18	979	339.4140290310384	279.60118285874256	21/02/24 15:39:29
18	979	339.58715435467246	279.7422872971634	21/02/24 15:39:30
18	979	339.52856212647055	279.8115774681247	21/02/24 15:39:30
18	979	339.52856212647055	279.8115774681247	21/02/24 15:39:30
18	979	339.5256342040645	279.8054134327906	21/02/24 15:39:30
18	979	339.4466492119128	279.816422908627	21/02/24 15:39:30
18	979	339.47711233059147	279.85055822916905	21/02/24 15:39:30
18	979	339.47711233059147	279.85055822916905	21/02/24 15:39:30
18	979	339.51277338483874	279.92446589244355	21/02/24 15:39:30
18	979	339.52596849746897	279.9370913801876	21/02/24 15:39:30
18	979	339.4010679251709	279.8871735989718	21/02/24 15:39:30
18	979	339.34071635768015	279.8738981346113	21/02/24 15:39:31
18	979	339.39267735993826	279.79214865217995	21/02/24 15:39:31
18	979	339.2604358296121	279.7404671040381	21/02/24 15:39:31
18	979	339.45715435849934	279.8241482577142	21/02/24 15:39:31
18	979	339.45715435849934	279.8241482577142	21/02/24 15:39:31
18	979	339.516742259643	279.8713553423807	21/02/24 15:39:31
18	979	339.52929763525003	279.8685548008204	21/02/24 15:39:31
18	979	339.52929763525003	279.8685548008204	21/02/24 15:39:31
18	979	339.36815920847835	279.843299378273	21/02/24 15:39:31
18	979	339.1307482743887	279.8079188708529	21/02/24 15:39:32
18	979	339.1814290551148	280.08540561555316	21/02/24 15:39:32
18	979	339.5135185106293	280.2184104315826	21/02/24 15:39:32
18	979	339.69514433275805	280.31222706416077	21/02/24 15:39:32
18	979	339.876069494969	280.4452928204142	21/02/24 15:39:32
18	979	339.88532715714234	280.20875902484704	21/02/24 15:39:32
18	979	340.1160124166917	280.3454228251617	21/02/24 15:39:32
18	979	340.1160124166917	280.3454228251617	21/02/24 15:39:32
18	979	339.92887768191673	280.45922755653703	21/02/24 15:39:32
18	979	339.92492257746477	280.462100764566	21/02/24 15:39:32
18	979	339.8315727381404	280.20084701581555	21/02/24 15:39:33
18	979	340.09675300519143	280.31917127308327	21/02/24 15:39:33
18	979	340.08498817350915	280.37454986174214	21/02/24 15:39:33
18	979	340.063056221737	280.411425856321	21/02/24 15:39:33
18	979	340.0910731635138	280.43529464860575	21/02/24 15:39:33
18	979	340.09125668235	280.41590402375215	21/02/24 15:39:33
18	979	340.02868054320226	280.30858887119996	21/02/24 15:39:33
18	979	340.02868054320226	280.30858887119996	21/02/24 15:39:33
18	979	339.85675829645277	280.24386510182006	21/02/24 15:39:33
18	979	339.8519195226873	280.45483020778755	21/02/24 15:39:34
18	979	339.8519195226873	280.45483020778755	21/02/24 15:39:34
18	979	339.82429649203175	280.3570228847848	21/02/24 15:39:34
18	979	339.76366430199846	280.30639094452886	21/02/24 15:39:34
18	979	339.77093297843794	280.2893632508662	21/02/24 15:39:34
18	979	339.7157454474211	280.4198751136882	21/02/24 15:39:34
18	979	339.6485393644267	280.39805040801957	21/02/24 15:39:34
18	979	339.7357866790611	280.3656261933418	21/02/24 15:39:34
18	979	339.7357866790611	280.3656261933418	21/02/24 15:39:34
18	979	339.7357866790611	280.3656261933418	21/02/24 15:39:34
18	979	339.5679076068809	280.22737088504806	21/02/24 15:39:35
18	979	339.38567527818344	280.0772950807327	21/02/24 15:39:35
18	979	339.23179655909934	279.9505696380046	21/02/24 15:39:35
18	979	339.23179655909934	279.9505696380046	21/02/24 15:39:35
18	979	339.0348802620439	279.78840098288936	21/02/24 15:39:35
18	979	338.8225647913419	279.61355047605593	21/02/24 15:39:35
18	979	338.6041391715737	279.4336680106115	21/02/24 15:39:35
18	979	338.4612067126392	279.3159572625203	21/02/24 15:39:35
18	979	338.24990948199286	279.141945318177	21/02/24 15:39:35
18	979	338.11202726747484	279.028393653703	21/02/24 15:39:35
18	979	337.9888987271834	278.92699224567355	21/02/24 15:39:36
18	979	337.77682766370134	278.75234301821996	21/02/24 15:39:36
18	979	337.56425548789866	278.57728110419697	21/02/24 15:39:36
18	979	337.56425548789866	278.57728110419697	21/02/24 15:39:36
18	979	337.4335059748367	278.4696035122084	21/02/24 15:39:36
18	979	337.2684742968506	278.3336931499346	21/02/24 15:39:36
18	979	337.1208676869751	278.21213304664417	21/02/24 15:39:36
18	979	336.95698392466034	278.0771680400539	21/02/24 15:39:36
18	979	336.728356714102	277.8888841457627	21/02/24 15:39:36
18	979	336.5233976825848	277.72009196861995	21/02/24 15:39:37
18	979	336.3750112578007	277.5978896557366	21/02/24 15:39:37
18	979	336.17497837423895	277.4331543636805	21/02/24 15:39:37
18	979	336.0340055960844	277.3170574931673	21/02/24 15:39:37
18	979	335.89383156050576	277.2016184199581	21/02/24 15:39:37
18	979	335.774343370515	277.1032149898575	21/02/24 15:39:37
18	979	335.5898968444124	276.95131570307416	21/02/24 15:39:37
18	979	335.44251224141385	276.82993843156146	21/02/24 15:39:37
18	979	335.2509843131112	276.6722073193361	21/02/24 15:39:37
18	979	335.1041519395109	276.5512848314049	21/02/24 15:39:37
18	979	334.972430611824	276.4428069101744	21/02/24 15:39:38
18	979	334.76275926098367	276.27013394460266	21/02/24 15:39:38
18	979	334.5977925383793	276.1342770757525	21/02/24 15:39:38
18	979	334.45640041137995	276.01783485424903	21/02/24 15:39:38
18	979	334.4632028769466	276.0222274083894	21/02/24 15:39:38
18	979	334.6627327683638	276.00877510812296	21/02/24 15:39:38
18	979	334.6627327683638	276.00877510812296	21/02/24 15:39:38
18	979	334.8039216190203	275.90044091644836	21/02/24 15:39:38
18	979	334.8269623151194	276.03270807238664	21/02/24 15:39:38
18	979	334.8805175206789	275.9726599102816	21/02/24 15:39:38
18	979	335.01709025845156	275.9763095121154	21/02/24 15:39:39
18	979	335.01709025845156	275.9763095121154	21/02/24 15:39:39
18	979	335.26343384473984	276.01077828454027	21/02/24 15:39:39
18	979	335.5911067009545	275.82910340146105	21/02/24 15:39:39
18	979	335.5911067009545	275.82910340146105	21/02/24 15:39:39
18	979	335.3865506399176	275.6806540273136	21/02/24 15:39:39
18	979	335.3130363800516	275.8048430091597	21/02/24 15:39:39
18	979	335.3100998131624	275.818849832935	21/02/24 15:39:39
18	979	335.17989817555053	275.95057182905987	21/02/24 15:39:39
18	979	335.17953780815014	275.94883351336824	21/02/24 15:39:40
18	979	335.03429307498124	275.9694286073363	21/02/24 15:39:40
18	979	335.03429307498124	275.9694286073363	21/02/24 15:39:40
18	979	334.8407343447365	275.7239046575712	21/02/24 15:39:40
18	979	334.8407343447365	275.7239046575712	21/02/24 15:39:40
18	979	334.7085534674392	275.7369540213049	21/02/24 15:39:40
18	979	334.93927136598694	275.85187890573286	21/02/24 15:39:40
18	979	335.21465680604365	275.93173834584735	21/02/24 15:39:40
18	979	335.18299443005105	275.97852547826454	21/02/24 15:39:40
18	979	335.39577000839904	275.8406241762566	21/02/24 15:39:40
18	979	335.3950212633035	275.8266666728998	21/02/24 15:39:41
18	979	335.4015889955084	275.6822682145668	21/02/24 15:39:41
18	979	335.4889826547085	275.65660872596084	21/02/24 15:39:41
18	979	335.5980629129621	275.9019436579208	21/02/24 15:39:41
18	979	335.41714683227184	276.04923919100077	21/02/24 15:39:41
18	979	335.4005098880108	276.09262116683476	21/02/24 15:39:41
18	979	335.35150819712425	276.12268910112925	21/02/24 15:39:41
18	979	335.3229604867145	276.16717987354974	21/02/24 15:39:41
18	979	335.17159693666764	276.2497153350447	21/02/24 15:39:41
18	979	335.3498937953292	276.1249409744735	21/02/24 15:39:41
18	979	335.49950464847547	276.0418175131321	21/02/24 15:39:42
18	979	335.4663476584598	276.04104311992666	21/02/24 15:39:42
18	979	335.63626617159105	276.1819498352183	21/02/24 15:39:42
18	979	335.6599150137492	276.2585929564656	21/02/24 15:39:42
18	979	335.50744244005574	276.1654490387605	21/02/24 15:39:42
18	979	335.3045510672658	276.1711935549365	21/02/24 15:39:42
18	979	335.3509367913741	276.09011904922704	21/02/24 15:39:42
18	979	335.1494229115317	276.2015095403805	21/02/24 15:39:42
18	979	335.205408894027	276.12997833767156	21/02/24 15:39:42
18	979	335.21332428837866	276.21887037184473	21/02/24 15:39:43
18	979	335.14411076123093	276.29536306593104	21/02/24 15:39:43
18	979	335.1363194303601	276.4140426427335	21/02/24 15:39:43
18	979	335.23647377431837	276.32853734327	21/02/24 15:39:43
18	979	335.1381568691832	276.1091571849195	21/02/24 15:39:43
18	979	335.1381568691832	276.1091571849195	21/02/24 15:39:43
18	979	335.15244968990953	276.23216537566964	21/02/24 15:39:43
18	979	335.25563043746934	276.2101883171653	21/02/24 15:39:43
18	979	335.46143398505006	276.38482160358694	21/02/24 15:39:43
18	979	335.44345120017624	276.27042214948574	21/02/24 15:39:43
18	979	335.6122018436684	276.1432364513654	21/02/24 15:39:44
18	979	335.62599923003825	276.0924900009989	21/02/24 15:39:44
18	979	335.61460097586234	276.13044424594943	21/02/24 15:39:44
18	979	335.77739476107547	276.273103347846	21/02/24 15:39:44
18	979	335.8645488361244	276.4482853101003	21/02/24 15:39:44
18	979	335.8905756987311	276.47749603569133	21/02/24 15:39:44
18	979	335.78951251812856	276.52397064442687	21/02/24 15:39:44
18	979	335.55932709578815	276.5991014018371	21/02/24 15:39:44
18	979	335.53783310201777	276.6039354676132	21/02/24 15:39:44
18	979	335.4229663686659	276.51040561128286	21/02/24 15:39:44
18	979	335.35508190603144	276.514327512162	21/02/24 15:39:45
18	979	335.2156496826663	276.5604480116986	21/02/24 15:39:45
18	979	335.1603006270519	276.8546603232448	21/02/24 15:39:45
18	979	335.1070913368555	276.8881037957686	21/02/24 15:39:45
18	979	335.05416804522224	276.81483660837836	21/02/24 15:39:45
18	979	335.17906608880656	276.7929012901819	21/02/24 15:39:45
18	979	335.4340509246147	276.7781325531899	21/02/24 15:39:45
18	979	335.58923908125837	276.8921018015358	21/02/24 15:39:45
18	979	335.4096143713282	276.72898203386126	21/02/24 15:39:45
18	979	335.64691275556834	276.75260070071516	21/02/24 15:39:45
18	979	335.48094720843363	276.55984377204413	21/02/24 15:39:46
18	979	335.5107221249105	276.4255775910236	21/02/24 15:39:46
18	979	335.78305303521466	276.38577383441674	21/02/24 15:39:46
18	979	335.55985922745657	276.2178293589738	21/02/24 15:39:46
18	979	335.7124212125784	276.2652780718048	21/02/24 15:39:46
18	979	335.4542364605311	276.41569348760027	21/02/24 15:39:46
18	979	335.2659454291338	276.64919730516004	21/02/24 15:39:46
18	979	335.2648639132701	276.65367872200216	21/02/24 15:39:46
18	979	335.3084315106055	276.6425750272801	21/02/24 15:39:46
18	979	335.3071433815948	276.6632006869091	21/02/24 15:39:47
18	979	335.28393014425365	276.82282749487774	21/02/24 15:39:47
18	979	335.4587810376445	276.8314218526216	21/02/24 15:39:47
18	979	335.4587810376445	276.8314218526216	21/02/24 15:39:47
18	979	335.4587810376445	276.8314218526216	21/02/24 15:39:47
18	979	335.6208890270726	276.97822527401695	21/02/24 15:39:47
18	979	335.7830516069931	277.12507813203223	21/02/24 15:39:47
18	979	335.99535498676954	277.3173380116034	21/02/24 15:39:47
18	979	336.2076708209615	277.5096091697724	21/02/24 15:39:47
18	979	336.57506776188455	277.8423202725871	21/02/24 15:39:47
18	979	336.7336906312321	277.9859676030729	21/02/24 15:39:48
18	979	336.9110676818983	278.14659853808524	21/02/24 15:39:48
18	979	337.0371735215554	278.26079876217597	21/02/24 15:39:48
18	979	337.156427559688	278.36879406132704	21/02/24 15:39:48
18	979	337.28488319577485	278.4851222382515	21/02/24 15:39:48
18	979	337.4834331933341	278.664927188412	21/02/24 15:39:48
18	979	337.672008407885	278.8356990719206	21/02/24 15:39:48
18	979	337.8714361120476	279.0162988646598	21/02/24 15:39:48
18	979	338.0817059322252	279.20671717240117	21/02/24 15:39:48
18	979	338.19637446588274	279.3105598832182	21/02/24 15:39:49
18	979	338.32145649484175	279.4238329542805	21/02/24 15:39:49
18	979	338.4639165969818	279.55284343969987	21/02/24 15:39:49
18	979	338.66151450888896	279.7317861903372	21/02/24 15:39:49
18	979	338.78774777362156	279.84610180933925	21/02/24 15:39:49
18	979	338.9416060951779	279.9854344116021	21/02/24 15:39:49
18	979	339.121916703363	280.14872194782305	21/02/24 15:39:49
18	979	339.24979422461007	280.2645265895613	21/02/24 15:39:49
18	979	339.3796809737184	280.38215076854397	21/02/24 15:39:49
18	979	339.54238643116554	280.52949525117685	21/02/24 15:39:49
18	979	339.7413977263392	280.66247224501615	21/02/24 15:39:50
18	979	339.94766220236784	280.66247224501615	21/02/24 15:39:50
18	982	340.1346553235499	280.68908049310386	21/02/24 15:39:50
18	982	340.38042249039574	280.7311429389179	21/02/24 15:39:50
18	982	340.5300249639847	280.75674703412614	21/02/24 15:39:50
18	982	340.75661365333895	280.79552713071246	21/02/24 15:39:50
18	982	340.9809570914171	280.8339229580681	21/02/24 15:39:50
18	982	341.17341199725655	280.8668611416034	21/02/24 15:39:50
18	982	341.4276572238368	280.9103745864779	21/02/24 15:39:50
18	982	341.6280407509911	280.9446697340402	21/02/24 15:39:50
18	982	341.88769469306453	280.9891088672614	21/02/24 15:39:51
18	982	342.14252241500856	281.032722004784	21/02/24 15:39:51
18	982	342.3538624266557	281.0688923277052	21/02/24 15:39:51
18	982	342.6062503107419	281.11208789298246	21/02/24 15:39:51
18	982	342.8863809580005	281.1600315639064	21/02/24 15:39:51
18	982	342.8863809580005	281.1600315639064	21/02/24 15:39:51
18	982	343.36864087111974	281.24256916127626	21/02/24 15:39:51
18	982	343.6374653530671	281.28857780982975	21/02/24 15:39:51
18	982	343.82131189282626	281.32004269269413	21/02/24 15:39:51
18	982	344.0421315281825	281.35783542988537	21/02/24 15:39:51
18	982	344.0421315281825	281.35783542988537	21/02/24 15:39:52
18	982	344.54945668315855	281.4446628817177	21/02/24 15:39:52
18	982	344.75785509105475	281.48032975639575	21/02/24 15:39:52
18	982	344.93317741511447	281.5103357407198	21/02/24 15:39:52
18	982	344.93317741511447	281.5103357407198	21/02/24 15:39:52
18	982	345.29135787194116	281.5716374444839	21/02/24 15:39:52
18	982	345.54313495462515	281.6147284726042	21/02/24 15:39:52
18	982	345.77901630398145	281.65509898508225	21/02/24 15:39:52
18	982	345.99242733295745	281.69162375752285	21/02/24 15:39:52
18	982	346.1830254765214	281.7242441607639	21/02/24 15:39:53
18	982	346.44893672119116	281.7697542159263	21/02/24 15:39:53
18	982	346.7020523596624	281.8130743345757	21/02/24 15:39:53
18	982	346.9875072035367	281.8619292286484	21/02/24 15:39:53
18	982	347.2081209608542	281.89968673031996	21/02/24 15:39:53
18	982	347.2081209608542	281.89968673031996	21/02/24 15:39:53
18	982	347.3604038039166	281.92574956416763	21/02/24 15:39:53
18	982	347.6344929372404	281.9726592448488	21/02/24 15:39:53
18	982	347.79044990268227	281.99935089570033	21/02/24 15:39:53
18	982	348.08078257778715	282.0490406185847	21/02/24 15:39:53
18	982	348.349370019455	282.09500869827764	21/02/24 15:39:54
18	982	348.349370019455	282.09500869827764	21/02/24 15:39:54
18	982	348.54953877130174	282.1292670875746	21/02/24 15:39:54
18	982	348.6975429655723	282.15459764121056	21/02/24 15:39:54
18	982	348.89828106503325	282.18895347295063	21/02/24 15:39:54
18	982	349.05743020909927	282.21619145731825	21/02/24 15:39:54
18	982	349.31357127699016	282.2600293707677	21/02/24 15:39:54
18	982	349.4801171235359	282.2885332825627	21/02/24 15:39:54
18	982	349.72867575690253	282.3310734810024	21/02/24 15:39:54
18	982	349.89951486854267	282.3603121745533	21/02/24 15:39:54
18	982	350.1065789756666	282.3957506869377	21/02/24 15:39:55
18	982	350.3364048009452	282.43508481137144	21/02/24 15:39:55
18	982	350.50535455315566	282.46400014570537	21/02/24 15:39:55
18	982	350.65861577426944	282.4902304265489	21/02/24 15:39:55
18	982	350.8205222221701	282.5179403166826	21/02/24 15:39:55
18	982	351.0418757771412	282.55582443290206	21/02/24 15:39:55
18	982	351.2562809939899	282.5925193581505	21/02/24 15:39:55
18	982	351.5024669447747	282.63465347780516	21/02/24 15:39:55
18	982	351.6542091326499	282.660623779848	21/02/24 15:39:55
18	982	351.8754986669894	282.6984969390939	21/02/24 15:39:56
18	982	352.0644096758764	282.7308285933867	21/02/24 15:39:56
18	982	352.0644096758764	282.7308285933867	21/02/24 15:39:56
18	982	352.2337975949081	282.7598189188938	21/02/24 15:39:56
18	982	352.4846924967928	282.80275896394124	21/02/24 15:39:56
18	982	352.69215898036276	282.8382663420641	21/02/24 15:39:56
18	982	352.9061342847872	282.87488768885913	21/02/24 15:39:56
18	982	353.1761998064393	282.9211087383041	21/02/24 15:39:56
18	982	353.3330644191215	282.94795573074725	21/02/24 15:39:56
18	982	353.6076252663819	282.9949461441078	21/02/24 15:39:56
18	982	353.8147527826592	283.0303955088127	21/02/24 15:39:57
18	982	354.2373505642162	283.10272207918416	21/02/24 15:39:57
18	982	354.38850483176094	283.12859176010926	21/02/24 15:39:57
18	982	354.38850483176094	283.12859176010926	21/02/24 15:39:57
18	982	354.68165367315913	283.17876346292456	21/02/24 15:39:57
18	982	354.92108726707283	283.2197419333171	21/02/24 15:39:57
18	982	355.2229394127303	283.2714031852391	21/02/24 15:39:57
18	982	355.2229394127303	283.2714031852391	21/02/24 15:39:57
18	982	355.5101808767972	283.3205638549612	21/02/24 15:39:57
18	982	355.68647641978066	283.35073640330916	21/02/24 15:39:58
18	982	355.8970818040403	283.3867809965608	21/02/24 15:39:58
18	982	356.1421223434367	283.48060370158896	21/02/24 15:39:58
18	982	356.1421223434367	283.48060370158896	21/02/24 15:39:58
18	982	356.2736293035829	283.2551849202685	21/02/24 15:39:58
18	982	356.3242002687839	283.46419046289674	21/02/24 15:39:58
18	982	356.58540134251456	283.47115312927974	21/02/24 15:39:58
18	982	356.58540134251456	283.47115312927974	21/02/24 15:39:58
18	982	356.59144840806056	283.4717285675188	21/02/24 15:39:58
18	982	356.5153307709139	283.458770733123	21/02/24 15:39:58
18	982	356.5584182003317	283.4622992062886	21/02/24 15:39:59
18	982	356.4851269377707	283.625590410573	21/02/24 15:39:59
18	982	356.63935245652624	283.6108118137779	21/02/24 15:39:59
18	982	356.4756488428734	283.6460050710382	21/02/24 15:39:59
18	982	356.544373319079	283.86942554339885	21/02/24 15:39:59
18	982	356.5564698218593	283.97766452154315	21/02/24 15:39:59
18	982	356.63271179492824	283.9278503210155	21/02/24 15:39:59
18	982	356.5474233648242	283.74294170442846	21/02/24 15:39:59
18	982	356.7782641987174	283.74308518671455	21/02/24 15:39:59
18	982	356.8283361381545	283.5811224066412	21/02/24 15:39:59
18	982	356.8506757087184	283.5939435068475	21/02/24 15:40:00
18	982	356.6097888114806	283.7203874158049	21/02/24 15:40:00
18	982	356.5162651149779	283.66805947941435	21/02/24 15:40:00
18	982	356.7828313166598	283.7292803995529	21/02/24 15:40:00
18	982	356.7748688957341	283.73260903324166	21/02/24 15:40:00
18	982	356.7748688957341	283.73260903324166	21/02/24 15:40:00
18	982	356.68284991967437	283.4962924163327	21/02/24 15:40:00
18	982	356.7505188020821	283.43082304742956	21/02/24 15:40:00
18	982	356.7719729630541	283.42042642669804	21/02/24 15:40:00
18	982	356.7688551958927	283.4181259100289	21/02/24 15:40:00
18	982	356.7811216441399	283.3699881406188	21/02/24 15:40:01
18	982	356.8216159066848	283.3403747515935	21/02/24 15:40:01
18	982	356.7498970472587	283.6229986224651	21/02/24 15:40:01
18	982	356.75077090623705	283.579623824526	21/02/24 15:40:01
18	982	356.7647108135155	283.35351371837805	21/02/24 15:40:01
18	982	356.61269567233296	283.57628765877587	21/02/24 15:40:01
18	982	356.52813333160043	283.3832190602884	21/02/24 15:40:01
18	982	356.5190783418726	283.40726185877134	21/02/24 15:40:01
18	982	356.3938280850087	283.5524133716072	21/02/24 15:40:01
18	982	356.4002255908304	283.568183636288	21/02/24 15:40:02
18	982	356.1381480425346	283.4890400394352	21/02/24 15:40:02
18	982	356.228560506976	283.7422990984934	21/02/24 15:40:02
18	982	356.3032326671354	283.78901758976383	21/02/24 15:40:02
18	982	356.3661941804161	283.7775102973702	21/02/24 15:40:02
18	982	356.3661941804161	283.7775102973702	21/02/24 15:40:02
18	982	356.4734722251239	283.62069404796625	21/02/24 15:40:02
18	982	356.7481131875829	283.6856946174371	21/02/24 15:40:02
18	982	356.7481131875829	283.6856946174371	21/02/24 15:40:02
18	982	356.7360030266173	283.69138473559786	21/02/24 15:40:02
18	982	356.88262118671156	283.6465693323926	21/02/24 15:40:03
18	982	356.8307309698633	283.6991895188593	21/02/24 15:40:03
18	982	356.7957947565835	283.64263094274463	21/02/24 15:40:03
18	982	356.65441073517064	283.7976744229737	21/02/24 15:40:03
18	982	356.5814827722974	283.8910887662876	21/02/24 15:40:03
18	982	356.5814827722974	283.8910887662876	21/02/24 15:40:03
18	982	356.6138830739417	283.9631969707972	21/02/24 15:40:03
18	982	356.55523435115487	283.5373108066986	21/02/24 15:40:03
18	982	356.55523435115487	283.5373108066986	21/02/24 15:40:03
18	982	356.5463467458179	283.53744478568984	21/02/24 15:40:03
18	982	356.6187611886553	283.80959562039885	21/02/24 15:40:04
18	982	356.61161892481897	283.8214041012599	21/02/24 15:40:04
18	982	356.5714900175868	283.92216882997286	21/02/24 15:40:04
18	982	356.5258923495025	283.84296092437944	21/02/24 15:40:04
18	982	356.5625627792153	284.12393695732413	21/02/24 15:40:04
18	982	356.4856897314453	284.06541072791345	21/02/24 15:40:04
18	982	356.56815724475894	284.1850303581749	21/02/24 15:40:04
18	982	356.4572589820397	284.21719871083434	21/02/24 15:40:04
18	982	356.4729396879937	284.40112069738836	21/02/24 15:40:04
18	982	356.52438005235604	284.4868677486283	21/02/24 15:40:05
18	982	356.5704705183529	284.5244142338908	21/02/24 15:40:05
18	982	356.70763193972465	284.2320583820877	21/02/24 15:40:05
18	982	356.70763193972465	284.2320583820877	21/02/24 15:40:05
18	982	356.9145559615529	284.2421494955215	21/02/24 15:40:05
18	982	356.7944158599847	284.3484506905549	21/02/24 15:40:05
18	982	356.7407897812393	284.4310910266368	21/02/24 15:40:05
18	982	356.7407897812393	284.4310910266368	21/02/24 15:40:05
18	982	356.7398307825945	284.48445654039267	21/02/24 15:40:05
18	982	356.9088344085709	284.368002279126	21/02/24 15:40:05
18	982	356.84926325563197	284.4436868819426	21/02/24 15:40:06
18	982	357.16968220374036	284.48565522198714	21/02/24 15:40:06
18	982	357.19972425203	284.5484938526915	21/02/24 15:40:06
18	982	357.26710707369546	284.55854663822123	21/02/24 15:40:06
18	982	357.0290614934433	284.4590316969949	21/02/24 15:40:06
18	982	357.083098425332	284.4612514243017	21/02/24 15:40:06
18	982	357.14536815628605	284.5055872943187	21/02/24 15:40:06
18	982	356.8665348310773	284.42824745179763	21/02/24 15:40:06
18	982	356.6245142101697	284.43566713079076	21/02/24 15:40:06
18	982	356.5592930368828	284.5445680517397	21/02/24 15:40:06
18	982	356.5476140275556	284.54034899601385	21/02/24 15:40:07
18	982	356.70723425100135	284.54594384565627	21/02/24 15:40:07
18	982	356.4493143853221	284.4118405009526	21/02/24 15:40:07
18	982	356.4977704996577	284.5855341860078	21/02/24 15:40:07
18	982	356.4752369895473	284.59245690713567	21/02/24 15:40:07
18	982	356.54819178182703	284.55977421282284	21/02/24 15:40:07
18	982	356.57935155391544	284.58212309994605	21/02/24 15:40:07
18	982	356.5768037360823	284.5992309888777	21/02/24 15:40:07
18	982	356.3689152419585	284.7451024083036	21/02/24 15:40:07
18	982	356.433420725224	284.67419991773426	21/02/24 15:40:08
18	982	356.6029761209657	284.8831842843402	21/02/24 15:40:08
18	982	356.7146422230164	284.86107147558334	21/02/24 15:40:08
18	982	356.7427718413795	284.85799316257084	21/02/24 15:40:08
18	982	356.60691840407605	284.6841342208279	21/02/24 15:40:08
18	982	356.49602656517044	284.7720503404828	21/02/24 15:40:08
18	982	356.51120462030184	285.0355667081136	21/02/24 15:40:08
18	982	356.31585904516413	285.2614332000495	21/02/24 15:40:08
18	982	356.3114809209034	285.3416935109016	21/02/24 15:40:08
18	982	356.35067805017127	285.29866415235745	21/02/24 15:40:08
18	982	356.16633591387193	285.28005718520745	21/02/24 15:40:09
18	982	356.3393329868297	285.5140034953669	21/02/24 15:40:09
18	982	356.4602809631101	285.64810818210634	21/02/24 15:40:09
18	982	356.2984772027329	285.5816884566263	21/02/24 15:40:09
18	982	356.3105376807017	285.55686563429776	21/02/24 15:40:09
18	982	356.1066989177969	285.3974539811302	21/02/24 15:40:09
18	982	356.0111248409746	285.49110626570405	21/02/24 15:40:09
18	982	356.1842115047057	285.53912403366445	21/02/24 15:40:09
18	982	356.1601330055459	285.6260314152716	21/02/24 15:40:09
18	982	356.20870688044675	285.6654902010496	21/02/24 15:40:09
18	982	355.96059479131725	285.54282091508514	21/02/24 15:40:10
18	982	355.97023109177053	285.5395839048795	21/02/24 15:40:10
18	982	356.0337201877862	285.6735711059962	21/02/24 15:40:10
18	982	356.00193578536374	285.69449578237754	21/02/24 15:40:10
18	982	356.00193578536374	285.69449578237754	21/02/24 15:40:10
18	982	356.28757487830416	285.67486340414985	21/02/24 15:40:10
18	982	356.36238344824284	285.5309663919038	21/02/24 15:40:10
18	982	356.37235565485287	285.4076029939104	21/02/24 15:40:10
18	982	356.4484114606638	285.3490525882119	21/02/24 15:40:10
18	982	356.6520954519419	285.51300815221396	21/02/24 15:40:11
18	982	356.5956104242715	285.3280607226981	21/02/24 15:40:11
18	982	356.5864942940356	285.27526575748124	21/02/24 15:40:11
18	982	356.55848729427504	285.4453557634252	21/02/24 15:40:11
18	982	356.2838848485723	285.52696328465055	21/02/24 15:40:11
18	982	356.44059783625283	285.2860106298326	21/02/24 15:40:11
18	982	356.4466566302157	285.37525299824784	21/02/24 15:40:11
18	982	356.3284638595412	285.54603774781003	21/02/24 15:40:11
18	982	356.1739853361183	285.41210586380987	21/02/24 15:40:11
18	982	356.2211828417208	285.20711705157765	21/02/24 15:40:11
18	982	356.1056796967975	285.1761217056066	21/02/24 15:40:12
18	982	356.1792045094661	285.2433542835543	21/02/24 15:40:12
18	982	356.0904366205402	285.1696997533942	21/02/24 15:40:12
18	982	356.0932238884478	285.17510142504653	21/02/24 15:40:12
18	982	355.93726417117193	284.96365140270177	21/02/24 15:40:12
18	982	355.91760114167323	285.0363374751879	21/02/24 15:40:12
18	982	355.6665063572917	285.1939373788892	21/02/24 15:40:12
18	982	355.83436324356967	285.24687382484166	21/02/24 15:40:12
18	982	355.76211235990604	285.30086746423217	21/02/24 15:40:12
18	982	356.0085466568996	285.33722574318386	21/02/24 15:40:12
18	982	356.0442582559101	285.3016395339423	21/02/24 15:40:13
18	982	356.06153369703003	285.42606743309614	21/02/24 15:40:13
18	982	356.3137574706716	285.4155518695929	21/02/24 15:40:13
18	982	356.33730978094303	285.4042357956934	21/02/24 15:40:13
18	982	356.40669450372707	285.57837660112216	21/02/24 15:40:13
18	982	356.43414000184407	285.59975055275464	21/02/24 15:40:13
18	982	356.3010841161159	285.7464008186131	21/02/24 15:40:13
18	982	356.1929146229341	285.93011316106816	21/02/24 15:40:13
18	982	356.1934897321199	285.9975147353969	21/02/24 15:40:13
18	982	356.0927760875182	286.1583277013622	21/02/24 15:40:14
18	982	356.0927760875182	286.1583277013622	21/02/24 15:40:14
