floorId	partitionId	location_x	location_y	timeStamp
3	54	350.37914153837863	260.97432627346046	20/04/28 05:08:49
3	54	350.37914153837863	260.97432627346046	20/04/28 05:08:50
3	54	350.37914153837863	260.97432627346046	20/04/28 05:08:51
3	54	350.37914153837863	260.97432627346046	20/04/28 05:08:52
3	42	347.94554835318087	258.6717142733518	20/04/28 05:08:53
3	42	342.32654047717824	258.48773934260805	20/04/28 05:08:54
3	99	339.59375125487367	258.8166372045796	20/04/28 05:08:55
3	NULL	337.70753542622793	260.4595329480968	20/04/28 05:08:56
3	NULL	337.70753542622793	260.45953294809686	20/04/28 05:08:57
3	54	334.4407240787428	261.4032786809491	20/04/28 05:08:58
3	54	334.4407240787428	261.4032786809491	20/04/28 05:08:59
3	54	334.4407240787428	261.4032786809491	20/04/28 05:09:00
3	25	331.1647001544473	259.0572050353964	20/04/28 05:09:01
3	25	331.1647001544473	259.0572050353964	20/04/28 05:09:02
3	25	327.25467987903363	260.11294318823207	20/04/28 05:09:03
3	25	325.4405213333773	256.06970886355725	20/04/28 05:09:04
3	NULL	329.350541608791	255.01397071072157	20/04/28 05:09:05
3	25	328.11083110267094	255.78740321788817	20/04/28 05:09:06
3	25	328.11083110267094	255.78740321788817	20/04/28 05:09:07
3	25	328.11083110267094	255.78740321788817	20/04/28 05:09:08
3	25	325.4405213333774	256.06970886355725	20/04/28 05:09:09
3	25	328.11083110267094	255.78740321788817	20/04/28 05:09:10
3	73	323.11326204380686	253.8963777389766	20/04/28 05:09:11
3	25	328.11083110267094	255.78740321788817	20/04/28 05:09:12
3	25	328.11083110267094	255.78740321788817	20/04/28 05:09:13
3	25	328.11083110267094	255.78740321788817	20/04/28 05:09:14
3	73	327.8080185048159	251.46097815343785	20/04/28 05:09:15
3	25	328.11083110267094	255.78740321788817	20/04/28 05:09:16
3	25	328.11083110267094	255.78740321788817	20/04/28 05:09:17
3	25	328.11083110267094	255.78740321788817	20/04/28 05:09:18
3	73	323.11326204380686	253.8963777389766	20/04/28 05:09:19
3	25	328.11083110267094	255.78740321788823	20/04/28 05:09:20
3	25	325.4405213333773	256.06970886355725	20/04/28 05:09:21
3	25	325.4405213333773	256.06970886355725	20/04/28 05:09:22
3	25	328.11083110267094	255.78740321788823	20/04/28 05:09:23
3	25	325.4405213333773	256.06970886355725	20/04/28 05:09:24
3	25	328.11083110267094	255.78740321788823	20/04/28 05:09:25
3	25	328.11083110267094	255.78740321788823	20/04/28 05:09:26
3	25	325.4405213333773	256.06970886355725	20/04/28 05:09:27
3	54	327.3540763805351	261.1072377077433	20/04/28 05:09:28
3	25	331.1647001544473	259.0572050353964	20/04/28 05:09:29
3	54	334.4407240787428	261.4032786809491	20/04/28 05:09:30
3	54	334.4407240787428	261.4032786809491	20/04/28 05:09:31
3	54	334.4407240787428	261.4032786809491	20/04/28 05:09:32
3	NULL	337.70753542622793	260.4595329480968	20/04/28 05:09:33
3	99	339.59375125487367	258.8166372045796	20/04/28 05:09:34
3	99	339.59375125487367	258.8166372045796	20/04/28 05:09:35
3	42	343.19179870246967	259.9647561276533	20/04/28 05:09:36
3	54	347.60382460234183	261.16234003976894	20/04/28 05:09:37
3	54	350.37914153837863	260.97432627346046	20/04/28 05:09:38
3	54	350.37914153837863	260.97432627346046	20/04/28 05:09:39
3	54	350.37914153837863	260.97432627346046	20/04/28 05:09:40
3	54	352.9059324522066	261.07811147821695	20/04/28 05:09:41
3	54	356.0030407869288	263.6276478520211	20/04/28 05:09:42
3	54	359.56855835216805	263.2279362811352	20/04/28 05:09:43
3	54	359.5685583521681	263.2279362811352	20/04/28 05:09:44
3	34	362.2167196060361	259.70189758364177	20/04/28 05:09:45
3	34	361.2642468288334	255.55936173685845	20/04/28 05:09:46
3	17	361.9057312824121	254.45903554354518	20/04/28 05:09:47
3	17	363.0633788732786	253.76883669815365	20/04/28 05:09:48
3	17	363.0633788732786	253.76883669815368	20/04/28 05:09:49
3	17	362.3945272480641	251.57317905073432	20/04/28 05:09:50
3	17	359.96968039487183	251.3655491305634	20/04/28 05:09:51
3	17	359.96968039487183	251.3655491305634	20/04/28 05:09:52
3	17	359.96968039487183	251.3655491305634	20/04/28 05:09:53
3	17	359.96968039487183	251.3655491305634	20/04/28 05:09:54
3	17	359.96968039487183	251.3655491305634	20/04/28 05:09:55
3	17	359.4808844292199	254.25140562337432	20/04/28 05:09:56
3	17	359.4808844292199	254.25140562337432	20/04/28 05:09:57
3	84	357.1311797592782	253.49332104078317	20/04/28 05:09:58
3	84	357.1311797592782	253.49332104078317	20/04/28 05:09:59
3	17	359.96968039487183	251.3655491305634	20/04/28 05:10:00
3	84	357.1311797592782	253.49332104078317	20/04/28 05:10:01
3	84	357.1311797592782	253.49332104078317	20/04/28 05:10:02
3	17	359.96968039487183	251.3655491305634	20/04/28 05:10:03
3	84	357.1311797592782	253.49332104078317	20/04/28 05:10:04
3	84	357.1311797592782	253.49332104078317	20/04/28 05:10:05
3	84	357.1311797592782	253.49332104078317	20/04/28 05:10:06
3	84	357.1311797592782	253.49332104078317	20/04/28 05:10:07
3	17	360.59539520361886	253.36370408943912	20/04/28 05:10:08
3	17	359.4808844292199	254.25140562337432	20/04/28 05:10:09
3	17	362.3945272480641	251.57317905073432	20/04/28 05:10:10
3	17	362.3945272480641	251.57317905073432	20/04/28 05:10:11
3	17	362.3945272480641	251.57317905073432	20/04/28 05:10:12
3	17	361.9057312824121	254.45903554354518	20/04/28 05:10:13
3	34	361.2642468288334	255.55936173685845	20/04/28 05:10:14
3	34	362.2167196060361	259.70189758364177	20/04/28 05:10:15
3	34	363.08940602427793	260.2393220879455	20/04/28 05:10:16
3	34	362.2167196060361	259.70189758364177	20/04/28 05:10:17
3	54	366.3485015775939	262.5395237573883	20/04/28 05:10:18
3	54	372.48785670166836	262.3595943162643	20/04/28 05:10:19
3	54	372.48785670166836	262.3595943162643	20/04/28 05:10:20
3	54	372.48785670166836	262.3595943162643	20/04/28 05:10:21
3	54	376.18269094789457	263.03655301878126	20/04/28 05:10:22
3	15	379.8755906118027	262.6421307240284	20/04/28 05:10:23
3	15	380.97239583354167	266.94453563659977	20/04/28 05:10:24
3	15	380.4411889868181	268.9485571439715	20/04/28 05:10:25
3	15	380.4411889868181	268.9485571439715	20/04/28 05:10:26
3	15	380.4411889868181	268.9485571439715	20/04/28 05:10:27
3	15	380.4411889868181	268.9485571439715	20/04/28 05:10:28
3	15	380.4411889868181	268.9485571439715	20/04/28 05:10:29
3	15	380.4411889868181	268.9485571439715	20/04/28 05:10:30
3	15	380.4411889868181	268.9485571439715	20/04/28 05:10:31
3	15	380.4411889868181	268.9485571439715	20/04/28 05:10:32
3	15	380.4411889868181	268.9485571439715	20/04/28 05:10:33
3	15	380.4411889868181	268.9485571439715	20/04/28 05:10:34
3	15	380.4411889868181	268.9485571439715	20/04/28 05:10:35
3	15	380.4411889868181	268.9485571439715	20/04/28 05:10:36
3	15	380.4411889868181	268.9485571439715	20/04/28 05:10:37
3	15	380.4411889868181	268.9485571439715	20/04/28 05:10:38
3	15	380.4411889868181	268.9485571439715	20/04/28 05:10:39
3	15	380.4411889868181	268.9485571439715	20/04/28 05:10:40
3	15	380.4411889868181	268.9485571439715	20/04/28 05:10:41
3	15	380.4411889868181	268.9485571439715	20/04/28 05:10:42
3	15	380.4411889868181	268.9485571439715	20/04/28 05:10:43
3	15	380.4411889868181	268.9485571439715	20/04/28 05:10:44
3	15	380.4411889868181	268.9485571439715	20/04/28 05:10:45
3	15	380.4411889868181	268.9485571439715	20/04/28 05:10:46
3	15	380.4411889868181	268.9485571439715	20/04/28 05:10:47
3	15	380.4411889868181	268.9485571439715	20/04/28 05:10:48
3	15	380.4411889868181	268.9485571439715	20/04/28 05:10:49
3	15	380.97239583354167	266.94453563659977	20/04/28 05:10:50
3	15	380.97239583354167	266.94453563659977	20/04/28 05:10:51
3	46	374.77284073484725	264.6119154739458	20/04/28 05:10:52
3	54	376.18269094789457	263.03655301878126	20/04/28 05:10:53
3	54	372.48785670166836	262.3595943162643	20/04/28 05:10:54
3	54	372.48785670166836	262.3595943162643	20/04/28 05:10:55
3	54	372.48785670166836	262.3595943162643	20/04/28 05:10:56
3	54	372.48785670166836	262.3595943162643	20/04/28 05:10:57
3	54	365.2339908031949	263.4272252913235	20/04/28 05:10:58
3	54	365.2339908031949	263.4272252913235	20/04/28 05:10:59
3	46	361.61703194828846	264.17422801455785	20/04/28 05:11:00
3	54	359.5685583521681	263.2279362811352	20/04/28 05:11:01
3	8	357.87501606482897	266.0533751351783	20/04/28 05:11:02
3	8	357.87501606482897	266.0533751351783	20/04/28 05:11:03
3	54	354.93110780732565	263.85962413987545	20/04/28 05:11:04
3	54	350.89456573837674	262.47535273189357	20/04/28 05:11:05
3	54	350.89456573837674	262.47535273189357	20/04/28 05:11:06
3	54	349.17477120857285	262.4807721885283	20/04/28 05:11:07
3	54	349.17477120857285	262.4807721885283	20/04/28 05:11:08
3	42	343.19179870246967	259.9647561276533	20/04/28 05:11:09
3	54	339.37751996608864	260.697329100326	20/04/28 05:11:10
3	54	336.1107086186035	261.64107483317827	20/04/28 05:11:11
3	54	334.4407240787428	261.4032786809491	20/04/28 05:11:12
3	54	332.9065526505472	263.50534437986465	20/04/28 05:11:13
3	NULL	332.3533251581634	266.365063132458	20/04/28 05:11:14
3	28	333.24293976137614	268.509049904148	20/04/28 05:11:15
3	28	331.09063981873896	271.8943872588648	20/04/28 05:11:16
3	28	330.38805197472635	273.40940455651815	20/04/28 05:11:17
3	28	330.5705331969472	274.8438544447426	20/04/28 05:11:18
3	66	331.2689521710873	278.7029296672786	20/04/28 05:11:19
3	28	330.5705331969472	274.84385444474253	20/04/28 05:11:20
3	28	330.38805197472635	273.40940455651815	20/04/28 05:11:21
3	28	330.38805197472635	273.40940455651815	20/04/28 05:11:22
3	28	331.09063981873896	271.8943872588648	20/04/28 05:11:23
3	28	330.38805197472635	273.40940455651815	20/04/28 05:11:24
3	28	331.09063981873896	271.8943872588648	20/04/28 05:11:25
3	28	330.5705331969472	274.84385444474253	20/04/28 05:11:26
3	66	331.0864709488664	277.2684797790542	20/04/28 05:11:27
3	66	331.01632652645577	276.97177295324167	20/04/28 05:11:28
3	28	330.5705331969472	274.8438544447426	20/04/28 05:11:29
3	28	330.6406776193578	275.1405612705551	20/04/28 05:11:30
3	28	330.5705331969472	274.8438544447426	20/04/28 05:11:31
3	28	330.38805197472635	273.40940455651815	20/04/28 05:11:32
3	28	330.5705331969472	274.8438544447426	20/04/28 05:11:33
3	28	330.38805197472635	273.40940455651815	20/04/28 05:11:34
3	66	331.0163265264558	276.9717729532416	20/04/28 05:11:35
3	28	330.38805197472635	273.40940455651815	20/04/28 05:11:36
3	28	331.09063981873896	271.8943872588648	20/04/28 05:11:37
3	NULL	332.3533251581634	266.365063132458	20/04/28 05:11:38
3	NULL	332.3533251581634	266.365063132458	20/04/28 05:11:39
3	28	332.6477860802388	265.03642994070896	20/04/28 05:11:40
3	54	332.9065526505472	263.50534437986465	20/04/28 05:11:41
3	54	329.0533935951116	265.2057707173094	20/04/28 05:11:42
3	18	322.99113575264545	265.5352298501222	20/04/28 05:11:43
3	18	323.5974156050991	264.28862562276623	20/04/28 05:11:44
3	18	322.99113575264545	265.5352298501222	20/04/28 05:11:45
3	18	320.4944104797189	266.6682886729029	20/04/28 05:11:46
3	63	317.94247989051127	266.8160251834265	20/04/28 05:11:47
1	81	315.74240883925677	260.5181275582284	20/04/28 05:11:48
3	51	313.2523840549326	264.4074609667819	20/04/28 05:11:49
3	51	312.6019130172586	265.6450929868838	20/04/28 05:11:50
3	NULL	309.29436722642214	263.9851754886794	20/04/28 05:11:51
1	98	305.42047124180004	265.2616066172563	20/04/28 05:11:52
3	47	303.28594423312194	264.61216223098285	20/04/28 05:11:53
3	47	302.3157990937455	265.96754816044853	20/04/28 05:11:54
1	98	303.4235469930243	265.77780366757264	20/04/28 05:11:55
1	98	305.14384176673207	266.22087392439636	20/04/28 05:11:56
1	98	305.14384176673207	266.22087392439636	20/04/28 05:11:57
1	56	307.159840217744	263.3357311024059	20/04/28 05:11:58
1	81	311.6591172126105	263.4112042347413	20/04/28 05:11:59
1	81	314.50318194109644	265.02915212402996	20/04/28 05:12:00
1	81	314.50318194109644	265.02915212402996	20/04/28 05:12:01
1	81	316.8584991431141	264.5437756453438	20/04/28 05:12:02
1	56	319.89662212153377	266.1573209564685	20/04/28 05:12:03
1	56	319.89662212153377	266.1573209564685	20/04/28 05:12:04
1	72	322.34915620924	265.0152899264337	20/04/28 05:12:05
1	56	325.7003720753315	267.4297414274409	20/04/28 05:12:06
1	37	325.93617404217133	264.2093005099789	20/04/28 05:12:07
1	NULL	331.9249996219656	268.7304237073172	20/04/28 05:12:08
1	NULL	331.9249996219656	268.73042370731713	20/04/28 05:12:09
1	29	332.3707929514742	270.8583422158162	20/04/28 05:12:10
1	29	332.3707929514742	270.8583422158162	20/04/28 05:12:11
1	29	333.41684249911117	274.9598401222384	20/04/28 05:12:13
1	29	333.41684249911117	274.9598401222384	20/04/28 05:12:14
1	29	333.41684249911117	274.9598401222384	20/04/28 05:12:15
1	29	333.41684249911117	274.9598401222384	20/04/28 05:12:16
1	29	333.41684249911117	274.9598401222384	20/04/28 05:12:17
1	29	333.41684249911117	274.9598401222384	20/04/28 05:12:18
1	29	333.41684249911117	274.9598401222384	20/04/28 05:12:19
1	29	333.41684249911117	274.9598401222384	20/04/28 05:12:20
1	29	333.41684249911117	274.9598401222384	20/04/28 05:12:21
1	29	333.41684249911117	274.9598401222384	20/04/28 05:12:22
1	29	333.41684249911117	274.9598401222384	20/04/28 05:12:23
1	29	333.41684249911117	274.9598401222384	20/04/28 05:12:24
1	29	333.41684249911117	274.9598401222384	20/04/28 05:12:25
1	29	333.41684249911117	274.9598401222384	20/04/28 05:12:26
1	29	333.41684249911117	274.9598401222384	20/04/28 05:12:27
1	29	333.41684249911117	274.9598401222384	20/04/28 05:12:28
1	29	333.41684249911117	274.9598401222384	20/04/28 05:12:29
