floorId	partitionId	location_x	location_y	timeStamp
1	97	336.53585426801055	287.8812247794712	20/04/28 05:13:08
1	97	336.53585426801055	287.8812247794712	20/04/28 05:13:09
1	97	336.53585426801055	287.8812247794712	20/04/28 05:13:10
1	97	336.53585426801055	287.8812247794712	20/04/28 05:13:11
1	97	336.53585426801055	287.8812247794712	20/04/28 05:13:12
1	97	336.53585426801055	287.8812247794712	20/04/28 05:13:13
1	97	336.53585426801055	287.8812247794712	20/04/28 05:13:14
1	97	336.53585426801055	287.8812247794712	20/04/28 05:13:15
1	97	336.53585426801055	287.8812247794712	20/04/28 05:13:16
1	97	336.53585426801055	287.8812247794712	20/04/28 05:13:17
1	97	336.53585426801055	287.8812247794712	20/04/28 05:13:18
1	97	336.53585426801055	287.8812247794712	20/04/28 05:13:19
1	97	336.53585426801055	287.8812247794712	20/04/28 05:13:20
1	97	336.53585426801055	287.8812247794712	20/04/28 05:13:21
1	97	336.53585426801055	287.8812247794712	20/04/28 05:13:22
1	97	337.5607221213916	286.380934101518	20/04/28 05:13:23
1	97	336.53585426801055	287.8812247794712	20/04/28 05:13:24
1	97	336.53585426801055	287.8812247794712	20/04/28 05:13:25
1	97	336.53585426801055	287.8812247794712	20/04/28 05:13:26
1	97	339.4344475351989	287.82523322481603	20/04/28 05:13:27
1	97	336.53585426801055	287.8812247794712	20/04/28 05:13:28
1	97	336.53585426801055	287.8812247794712	20/04/28 05:13:29
1	97	337.5607221213916	286.380934101518	20/04/28 05:13:30
1	97	336.53585426801055	287.8812247794712	20/04/28 05:13:31
1	97	336.53585426801055	287.8812247794712	20/04/28 05:13:32
1	97	336.53585426801055	287.8812247794712	20/04/28 05:13:33
1	NULL	338.7950920964135	285.0161233311299	20/04/28 05:13:34
1	97	339.4344475351989	287.82523322481603	20/04/28 05:13:35
1	97	336.53585426801055	287.8812247794712	20/04/28 05:13:36
1	97	336.53585426801055	287.8812247794712	20/04/28 05:13:37
1	97	336.53585426801055	287.8812247794712	20/04/28 05:13:38
1	97	339.4344475351989	287.82523322481603	20/04/28 05:13:39
1	97	339.66076347093946	288.6267384172868	20/04/28 05:13:40
1	97	339.4344475351989	287.82523322481603	20/04/28 05:13:41
1	83	342.5807005615859	288.2997905770318	20/04/28 05:13:42
1	97	339.4344475351989	287.82523322481603	20/04/28 05:13:43
1	97	339.4344475351989	287.82523322481603	20/04/28 05:13:44
1	97	336.53585426801055	287.8812247794712	20/04/28 05:13:45
1	97	339.4344475351989	287.82523322481603	20/04/28 05:13:46
1	97	340.37782042758784	289.0677806668841	20/04/28 05:13:47
1	97	336.53585426801055	287.8812247794712	20/04/28 05:13:48
1	97	336.53585426801055	287.8812247794712	20/04/28 05:13:49
1	97	339.4344475351989	287.82523322481603	20/04/28 05:13:50
1	97	336.53585426801055	287.8812247794712	20/04/28 05:13:51
1	97	336.53585426801055	287.8812247794712	20/04/28 05:13:52
1	97	336.53585426801055	287.8812247794712	20/04/28 05:13:53
1	97	336.53585426801055	287.8812247794712	20/04/28 05:13:54
1	97	337.88530719282556	289.7001362044199	20/04/28 05:13:55
1	97	339.4305406561234	290.4854027362428	20/04/28 05:13:56
1	97	336.53585426801055	287.8812247794712	20/04/28 05:13:57
1	97	336.53585426801055	287.8812247794712	20/04/28 05:13:58
1	97	336.53585426801055	287.8812247794712	20/04/28 05:13:59
1	97	336.53585426801055	287.8812247794712	20/04/28 05:14:00
1	97	336.53585426801055	287.8812247794712	20/04/28 05:14:01
1	97	336.53585426801055	287.8812247794712	20/04/28 05:14:02
1	97	336.53585426801055	287.8812247794712	20/04/28 05:14:03
1	97	339.4344475351989	287.82523322481603	20/04/28 05:14:04
1	97	338.4871677637345	289.2428552941747	20/04/28 05:14:05
1	97	339.66076347093946	288.6267384172868	20/04/28 05:14:06
1	97	339.4305406561234	290.4854027362428	20/04/28 05:14:07
1	97	339.4305406561234	290.4854027362428	20/04/28 05:14:08
1	83	342.55544985905226	291.2309163740584	20/04/28 05:14:09
1	83	342.32913392331176	290.4294111815877	20/04/28 05:14:10
1	83	342.55544985905226	291.2309163740584	20/04/28 05:14:11
1	83	342.55544985905226	291.2309163740584	20/04/28 05:14:12
1	83	342.55544985905226	291.2309163740584	20/04/28 05:14:13
1	97	340.37782042758784	289.0677806668841	20/04/28 05:14:14
1	97	339.4344475351989	287.82523322481603	20/04/28 05:14:15
1	97	336.53585426801055	287.8812247794712	20/04/28 05:14:16
1	97	336.53585426801055	287.8812247794712	20/04/28 05:14:17
1	97	339.66076347093946	288.6267384172868	20/04/28 05:14:18
1	97	336.53585426801055	287.8812247794712	20/04/28 05:14:19
1	97	336.53585426801055	287.8812247794712	20/04/28 05:14:20
1	83	342.32913392331176	290.4294111815877	20/04/28 05:14:21
1	97	339.8366206885495	291.06176671912345	20/04/28 05:14:22
1	97	339.4344475351989	287.82523322481603	20/04/28 05:14:23
1	83	341.6120769666634	289.98836893199035	20/04/28 05:14:24
1	97	339.4305406561234	290.4854027362428	20/04/28 05:14:25
1	83	341.6120769666634	289.98836893199035	20/04/28 05:14:26
1	83	342.55544985905226	291.2309163740584	20/04/28 05:14:27
1	83	342.55544985905226	291.2309163740584	20/04/28 05:14:28
1	83	342.55544985905226	291.2309163740584	20/04/28 05:14:29
1	83	342.55544985905226	291.2309163740584	20/04/28 05:14:30
1	97	339.4305406561234	290.4854027362428	20/04/28 05:14:31
1	97	336.93802742136114	291.11775827377863	20/04/28 05:14:32
1	83	342.55544985905226	291.2309163740584	20/04/28 05:14:33
3	100	340.7799935809384	292.30431416119154	20/04/28 05:14:34
1	97	340.7799935809384	292.30431416119154	20/04/28 05:14:35
1	83	342.55544985905226	291.2309163740584	20/04/28 05:14:36
1	97	340.7799935809384	292.30431416119154	20/04/28 05:14:37
1	91	348.80423999387625	284.7738810183333	20/04/28 05:14:38
1	91	348.80423999387625	284.7738810183333	20/04/28 05:14:39
1	83	342.55544985905226	291.2309163740584	20/04/28 05:14:40
1	83	342.55544985905226	291.2309163740584	20/04/28 05:14:41
1	97	340.06293662429005	291.86327191159415	20/04/28 05:14:42
1	83	342.55544985905226	291.2309163740584	20/04/28 05:14:43
1	97	339.4305406561234	290.4854027362428	20/04/28 05:14:44
1	91	348.80423999387625	284.7738810183333	20/04/28 05:14:45
1	83	342.32913392331176	290.4294111815877	20/04/28 05:14:46
1	83	343.2653176928634	291.1808219005122	20/04/28 05:14:47
1	83	342.32913392331176	290.4294111815877	20/04/28 05:14:48
1	83	342.55544985905226	291.2309163740584	20/04/28 05:14:49
1	97	339.4305406561234	290.4854027362428	20/04/28 05:14:50
1	83	342.32913392331176	290.4294111815877	20/04/28 05:14:51
1	97	336.93802742136114	291.11775827377863	20/04/28 05:14:52
1	97	340.7799935809384	292.30431416119154	20/04/28 05:14:53
1	97	339.4305406561234	290.4854027362428	20/04/28 05:14:54
1	97	337.88530719282556	289.70013620441995	20/04/28 05:14:55
1	97	339.4305406561234	290.4854027362428	20/04/28 05:14:56
1	83	342.55544985905226	291.2309163740584	20/04/28 05:14:57
1	97	336.53585426801055	287.8812247794712	20/04/28 05:14:58
1	83	342.55544985905226	291.2309163740584	20/04/28 05:14:59
1	97	336.53585426801055	287.8812247794712	20/04/28 05:15:00
1	97	336.53585426801055	287.8812247794712	20/04/28 05:15:01
1	97	339.66076347093946	288.6267384172868	20/04/28 05:15:02
1	97	336.53585426801055	287.8812247794712	20/04/28 05:15:03
