stationId	t_start	t_end	t_max	timeStamp
94	20/04/28 05:15:32	20/04/28 05:15:32	20/04/28 05:15:32
92	20/04/28 05:15:34	20/04/28 05:15:34	20/04/28 05:15:34
94	20/04/28 05:15:36	20/04/28 05:15:36	20/04/28 05:15:36
109	20/04/28 05:15:38	20/04/28 05:15:38	20/04/28 05:15:38
13	20/04/28 05:15:40	20/04/28 05:15:40	20/04/28 05:15:40
109	20/04/28 05:15:42	20/04/28 05:15:42	20/04/28 05:15:42
149	20/04/28 05:15:44	20/04/28 05:15:44	20/04/28 05:15:44
109	20/04/28 05:14:13	20/04/28 05:15:46	20/04/28 05:15:46
96	20/04/28 05:15:48	20/04/28 05:15:48	20/04/28 05:15:48
96	20/04/28 05:15:50	20/04/28 05:15:50	20/04/28 05:15:50
109	20/04/28 05:15:52	20/04/28 05:15:52	20/04/28 05:15:52
49	20/04/28 05:15:54	20/04/28 05:15:54	20/04/28 05:15:54
49	20/04/28 05:15:57	20/04/28 05:15:57	20/04/28 05:15:57
108	20/04/28 05:09:22	20/04/28 05:15:59	20/04/28 05:15:22
109	20/04/28 05:16:01	20/04/28 05:16:01	20/04/28 05:16:01
96	20/04/28 05:16:03	20/04/28 05:16:03	20/04/28 05:16:03
94	20/04/28 05:16:05	20/04/28 05:16:05	20/04/28 05:16:05
108	20/04/28 05:16:07	20/04/28 05:16:07	20/04/28 05:16:07
108	20/04/28 05:16:09	20/04/28 05:16:09	20/04/28 05:16:09
45	20/04/28 05:16:11	20/04/28 05:16:11	20/04/28 05:16:11
108	20/04/28 05:16:13	20/04/28 05:16:14	20/04/28 05:16:14
141	20/04/28 05:16:16	20/04/28 05:15:07	20/04/28 05:15:07
108	20/04/28 05:16:18	20/04/28 05:16:18	20/04/28 05:16:18
85	20/04/28 05:16:20	20/04/28 05:16:20	20/04/28 05:16:20
93	20/04/28 05:16:22	20/04/28 05:16:22	20/04/28 05:16:22
64	20/04/28 05:16:24	20/04/28 05:16:24	20/04/28 05:16:24
96	20/04/28 05:16:26	20/04/28 05:16:26	20/04/28 05:16:26
92	20/04/28 05:16:28	20/04/28 05:16:28	20/04/28 05:16:28
45	20/04/28 05:16:30	20/04/28 05:16:30	20/04/28 05:16:30
93	20/04/28 05:16:32	20/04/28 05:16:33	20/04/28 05:16:33
70	20/04/28 05:16:35	20/04/28 05:16:35	20/04/28 05:16:35
45	20/04/28 05:16:37	20/04/28 05:16:37	20/04/28 05:16:37
96	20/04/28 05:16:39	20/04/28 05:16:40	20/04/28 05:16:40
96	20/04/28 05:16:42	20/04/28 05:16:42	20/04/28 05:16:42
96	20/04/28 05:16:44	20/04/28 05:16:44	20/04/28 05:16:44
93	20/04/28 05:16:46	20/04/28 05:16:46	20/04/28 05:16:46
94	20/04/28 05:16:48	20/04/28 05:16:48	20/04/28 05:16:48
139	20/04/28 05:16:50	20/04/28 05:16:50	20/04/28 05:16:50
96	20/04/28 05:16:52	20/04/28 05:16:52	20/04/28 05:16:52
93	20/04/28 05:16:54	20/04/28 05:16:54	20/04/28 05:16:54
45	20/04/28 05:16:56	20/04/28 05:16:56	20/04/28 05:16:56
96	20/04/28 05:16:58	20/04/28 05:16:58	20/04/28 05:16:58
85	20/04/28 05:17:00	20/04/28 05:17:01	20/04/28 05:17:01
63	20/04/28 05:17:03	20/04/28 05:17:03	20/04/28 05:17:03
93	20/04/28 05:17:05	20/04/28 05:17:05	20/04/28 05:17:05
94	20/04/28 05:17:07	20/04/28 05:17:07	20/04/28 05:17:07
96	20/04/28 05:17:09	20/04/28 05:17:10	20/04/28 05:17:09
70	20/04/28 05:17:12	20/04/28 05:17:13	20/04/28 05:17:13
63	20/04/28 05:17:15	20/04/28 05:17:15	20/04/28 05:17:15
85	20/04/28 05:17:17	20/04/28 05:17:17	20/04/28 05:17:17
63	20/04/28 05:17:19	20/04/28 05:17:19	20/04/28 05:17:19
63	20/04/28 05:17:21	20/04/28 05:17:21	20/04/28 05:17:21
85	20/04/28 05:17:23	20/04/28 05:17:23	20/04/28 05:17:23
93	20/04/28 05:17:25	20/04/28 05:17:25	20/04/28 05:17:25
45	20/04/28 05:17:27	20/04/28 05:17:27	20/04/28 05:17:27
108	20/04/28 05:17:29	20/04/28 05:17:30	20/04/28 05:17:30
94	20/04/28 05:17:32	20/04/28 05:17:32	20/04/28 05:17:32
108	20/04/28 05:17:34	20/04/28 05:17:35	20/04/28 05:17:35
108	20/04/28 05:17:37	20/04/28 05:17:37	20/04/28 05:17:37
