floorId	partitionId	location_x	location_y	timeStamp
3	42	340.39847756944295	257.5774165717636	20/04/28 05:14:46
3	42	343.53091080698397	256.98129342754027	20/04/28 05:14:47
3	42	344.3961690322755	258.45831021258545	20/04/28 05:14:48
3	42	344.3961690322754	258.45831021258545	20/04/28 05:14:49
3	42	340.39847756944295	257.5774165717636	20/04/28 05:14:50
3	42	343.53091080698397	256.9812934275402	20/04/28 05:14:51
3	42	343.53091080698397	256.9812934275402	20/04/28 05:14:52
3	42	347.94554835318087	258.6717142733518	20/04/28 05:14:53
3	54	350.37914153837863	260.97432627346046	20/04/28 05:14:54
3	54	350.37914153837863	260.97432627346046	20/04/28 05:14:55
3	54	350.37914153837863	260.97432627346046	20/04/28 05:14:56
3	54	350.37914153837863	260.97432627346046	20/04/28 05:14:57
3	42	349.51649495941183	259.9901464221112	20/04/28 05:14:58
3	42	346.32423194001075	259.3686329834299	20/04/28 05:14:59
3	42	341.52181416260896	259.72695997542405	20/04/28 05:15:00
3	99	339.59375125487367	258.8166372045796	20/04/28 05:15:01
3	NULL	337.70753542622793	260.4595329480968	20/04/28 05:15:02
3	54	334.4407240787428	261.4032786809491	20/04/28 05:15:03
3	54	334.4407240787428	261.4032786809491	20/04/28 05:15:04
3	54	334.4407240787428	261.4032786809491	20/04/28 05:15:05
3	54	330.84633159361556	261.5726194575496	20/04/28 05:15:06
3	54	327.3540763805351	261.10723770774325	20/04/28 05:15:07
3	54	324.6837666112415	261.38954335341236	20/04/28 05:15:08
3	54	324.6837666112415	261.38954335341236	20/04/28 05:15:09
3	18	323.5974156050991	264.28862562276623	20/04/28 05:15:10
3	18	322.99113575264545	265.5352298501222	20/04/28 05:15:11
3	54	319.48620817163163	261.8793631615085	20/04/28 05:15:12
1	81	315.0919378015828	261.7557595783303	20/04/28 05:15:13
1	81	315.74240883925677	260.5181275582284	20/04/28 05:15:14
1	81	313.37765885306834	261.0920988121665	20/04/28 05:15:15
3	NULL	309.29436722642214	263.9851754886794	20/04/28 05:15:16
3	47	305.42047124180004	265.2616066172563	20/04/28 05:15:17
3	47	305.42047124180004	265.2616066172563	20/04/28 05:15:18
3	47	302.3157990937455	265.96754816044853	20/04/28 05:15:19
1	98	303.28594423312194	264.61216223098285	20/04/28 05:15:20
1	98	303.28594423312194	264.61216223098285	20/04/28 05:15:21
1	98	303.28594423312194	264.61216223098285	20/04/28 05:15:22
1	56	307.159840217744	263.3357311024059	20/04/28 05:15:23
1	56	307.159840217744	263.3357311024059	20/04/28 05:15:24
1	81	314.5031819410965	265.02915212402996	20/04/28 05:15:25
1	81	314.50318194109644	265.02915212402996	20/04/28 05:15:26
1	81	317.4633882763735	263.93806291016494	20/04/28 05:15:27
1	56	319.89662212153377	266.1573209564685	20/04/28 05:15:28
1	56	319.89662212153377	266.1573209564685	20/04/28 05:15:29
1	72	322.34915620924	265.0152899264337	20/04/28 05:15:30
1	72	322.34915620924	265.0152899264337	20/04/28 05:15:31
1	72	322.34915620924	265.0152899264337	20/04/28 05:15:32
1	37	325.93617404217133	264.20930050997885	20/04/28 05:15:33
1	37	328.6595361715347	265.5401093895471	20/04/28 05:15:34
1	56	333.50170633168455	266.97796434330365	20/04/28 05:15:35
1	56	333.50170633168455	266.9779643433037	20/04/28 05:15:36
1	56	333.50170633168455	266.97796434330365	20/04/28 05:15:37
1	56	339.15829612064346	267.33478272605527	20/04/28 05:15:38
1	56	342.8440990865012	267.81543116836286	20/04/28 05:15:39
1	NULL	344.77216199423657	268.7257539392073	20/04/28 05:15:40
1	NULL	344.77216199423657	268.7257539392073	20/04/28 05:15:41
1	NULL	344.77216199423657	268.7257539392073	20/04/28 05:15:42
1	56	346.99665348868166	266.7562728884459	20/04/28 05:15:43
3	62	350.4695213738825	267.93134037464137	20/04/28 05:15:44
3	43	356.3611717223227	268.61788452847554	20/04/28 05:15:45
1	45	354.92432902796776	273.612071983729	20/04/28 05:15:46
1	45	348.65557854846685	274.12559453304283	20/04/28 05:15:47
3	40	352.2637601833551	274.60835422172534	20/04/28 05:15:48
1	45	350.3816592865578	274.5925036482883	20/04/28 05:15:49
1	56	348.71644801848555	266.7508534318112	20/04/28 05:15:50
3	43	351.93013471364594	270.83346514040494	20/04/28 05:15:51
1	56	354.83784735563466	267.95314652065605	20/04/28 05:15:52
3	43	351.93013471364594	270.83346514040494	20/04/28 05:15:53
1	45	350.5106868279581	273.4278672788951	20/04/28 05:15:54
1	45	352.26376018335503	274.6083542217253	20/04/28 05:15:55
3	43	351.93013471364594	270.83346514040494	20/04/28 05:15:56
3	40	352.2637601833551	274.60835422172534	20/04/28 05:15:57
3	62	350.59854891528283	266.7667040052482	20/04/28 05:15:58
3	40	348.65557854846685	274.12559453304283	20/04/28 05:15:59
1	29	330.50654284319626	272.5117043844613	20/04/28 05:16:00
1	78	354.297033819604	271.1243520356463	20/04/28 05:16:01
1	45	352.26376018335503	274.6083542217253	20/04/28 05:16:02
1	45	352.26376018335503	274.6083542217253	20/04/28 05:16:03
1	45	352.2637601833551	274.60835422172534	20/04/28 05:16:04
1	45	352.26376018335503	274.6083542217253	20/04/28 05:16:05
1	45	352.26376018335503	274.6083542217253	20/04/28 05:16:06
3	40	352.26376018335503	274.6083542217253	20/04/28 05:16:07
1	45	354.79530148656744	274.7767083531221	20/04/28 05:16:08
3	40	354.92432902796776	273.612071983729	20/04/28 05:16:09
1	45	351.8011071722456	271.99810150979806	20/04/28 05:16:10
1	78	352.78728266448314	269.84386583242093	20/04/28 05:16:11
3	40	354.92432902796776	273.612071983729	20/04/28 05:16:12
1	45	352.26376018335503	274.6083542217253	20/04/28 05:16:13
1	45	354.92432902796776	273.612071983729	20/04/28 05:16:14
1	45	352.26376018335503	274.6083542217253	20/04/28 05:16:15
1	45	354.92432902796776	273.612071983729	20/04/28 05:16:16
1	45	354.92432902796776	273.612071983729	20/04/28 05:16:17
1	45	354.92432902796776	273.612071983729	20/04/28 05:16:18
1	45	354.79530148656744	274.7767083531221	20/04/28 05:16:19
1	45	352.26376018335503	274.6083542217253	20/04/28 05:16:20
3	40	354.92432902796776	273.612071983729	20/04/28 05:16:21
1	45	352.26376018335503	274.6083542217253	20/04/28 05:16:22
3	40	352.2637601833551	274.60835422172534	20/04/28 05:16:23
1	45	352.2637601833551	274.60835422172534	20/04/28 05:16:24
3	40	352.2637601833551	274.60835422172534	20/04/28 05:16:25
1	45	350.3816592865578	274.5925036482883	20/04/28 05:16:26
1	45	350.5106868279581	273.4278672788951	20/04/28 05:16:27
3	62	350.0750264341548	271.5311923945526	20/04/28 05:16:28
1	56	354.73261095196	268.2177663658703	20/04/28 05:16:29
3	62	350.0750264341547	271.5311923945526	20/04/28 05:16:30
1	45	350.38165928655775	274.5925036482883	20/04/28 05:16:31
1	78	352.78728266448314	269.84386583242093	20/04/28 05:16:32
1	45	350.3816592865578	274.5925036482883	20/04/28 05:16:33
3	62	350.0750264341547	271.5311923945526	20/04/28 05:16:34
1	56	355.6391193977739	268.05709270383943	20/04/28 05:16:35
1	78	352.78728266448314	269.84386583242093	20/04/28 05:16:36
1	45	352.2637601833551	274.60835422172534	20/04/28 05:16:37
1	45	352.26376018335503	274.6083542217253	20/04/28 05:16:38
1	45	351.8011071722456	271.99810150979806	20/04/28 05:16:39
1	78	351.93013471364594	270.83346514040494	20/04/28 05:16:40
3	40	354.92432902796776	273.612071983729	20/04/28 05:16:41
1	45	354.92432902796776	273.612071983729	20/04/28 05:16:42
3	40	354.92432902796776	273.612071983729	20/04/28 05:16:43
1	45	352.26376018335503	274.6083542217253	20/04/28 05:16:44
1	45	350.5106868279581	273.4278672788951	20/04/28 05:16:45
1	41	352.5027950101314	264.44733818856236	20/04/28 05:16:46
3	40	350.5106868279581	273.4278672788951	20/04/28 05:16:47
1	78	355.31882396769544	270.0122199638177	20/04/28 05:16:48
1	45	354.79530148656744	274.7767083531221	20/04/28 05:16:49
1	78	352.78728266448314	269.84386583242093	20/04/28 05:16:50
1	78	354.2294846529072	270.0777356517107	20/04/28 05:16:51
3	54	349.2732493252067	263.17227144197165	20/04/28 05:16:52
1	56	346.99665348868166	266.75627288844595	20/04/28 05:16:53
1	88	345.6348085732032	269.7099337905566	20/04/28 05:16:54
1	NULL	344.77216199423657	268.7257539392073	20/04/28 05:16:55
1	NULL	344.77216199423657	268.7257539392073	20/04/28 05:16:56
1	56	339.15829612064346	267.33478272605527	20/04/28 05:16:57
1	29	335.9541401525873	269.19905227274165	20/04/28 05:16:58
1	56	333.50170633168455	266.9779643433037	20/04/28 05:16:59
1	56	333.50170633168455	266.9779643433037	20/04/28 05:17:00
1	5	332.9065526505472	263.50534437986465	20/04/28 05:17:01
1	37	325.93617404217133	264.20930050997885	20/04/28 05:17:02
1	37	325.93617404217133	264.20930050997885	20/04/28 05:17:03
1	37	323.6597216964546	264.1572674834102	20/04/28 05:17:04
1	72	322.34915620924	265.0152899264337	20/04/28 05:17:05
1	72	322.34915620924	265.0152899264337	20/04/28 05:17:06
1	56	319.89662212153377	266.1573209564685	20/04/28 05:17:07
1	81	316.8584991431141	264.5437756453438	20/04/28 05:17:08
1	81	314.50318194109644	265.02915212402996	20/04/28 05:17:09
1	81	314.50318194109644	265.02915212402996	20/04/28 05:17:10
1	81	311.65911721261057	263.4112042347413	20/04/28 05:17:11
1	56	307.159840217744	263.3357311024059	20/04/28 05:17:12
1	56	307.159840217744	263.3357311024059	20/04/28 05:17:13
1	98	303.28594423312194	264.61216223098285	20/04/28 05:17:14
1	98	303.28594423312194	264.61216223098285	20/04/28 05:17:15
3	47	302.3157990937455	265.96754816044853	20/04/28 05:17:16
3	47	302.8570592601016	265.6207358146814	20/04/28 05:17:17
3	47	303.28594423312194	264.61216223098285	20/04/28 05:17:18
3	47	305.42047124180004	265.2616066172563	20/04/28 05:17:19
3	20	308.1866193271433	264.1749199815553	20/04/28 05:17:20
1	81	312.6019130172586	265.6450929868838	20/04/28 05:17:21
1	81	313.37765885306834	261.0920988121665	20/04/28 05:17:22
3	NULL	315.74240883925677	260.5181275582284	20/04/28 05:17:23
1	81	318.718225726321	262.2630310087092	20/04/28 05:17:24
3	54	321.27015631552865	262.1152944981856	20/04/28 05:17:25
3	54	324.01518066743233	262.76750572012435	20/04/28 05:17:26
3	54	324.6837666112415	261.38954335341236	20/04/28 05:17:27
3	54	327.3540763805351	261.1072377077433	20/04/28 05:17:28
3	54	327.3540763805351	261.10723770774325	20/04/28 05:17:29
3	54	334.4407240787428	261.4032786809491	20/04/28 05:17:30
3	54	334.4407240787428	261.4032786809491	20/04/28 05:17:31
3	54	334.4407240787428	261.4032786809491	20/04/28 05:17:32
3	54	334.4407240787428	261.4032786809491	20/04/28 05:17:33
3	NULL	337.70753542622793	260.4595329480968	20/04/28 05:17:34
3	99	339.59375125487367	258.8166372045796	20/04/28 05:17:35
3	42	343.19179870246967	259.9647561276533	20/04/28 05:17:36
3	54	350.3791415383785	260.97432627346046	20/04/28 05:17:37
3	54	350.37914153837863	260.97432627346046	20/04/28 05:17:38
3	54	350.37914153837863	260.97432627346046	20/04/28 05:17:39
3	54	352.9059324522066	261.07811147821695	20/04/28 05:17:40
3	54	354.93110780732565	263.85962413987545	20/04/28 05:17:41
3	54	358.23287936641947	263.00617074250107	20/04/28 05:17:42
3	54	359.56855835216805	263.2279362811352	20/04/28 05:17:43
3	54	359.5685583521681	263.2279362811352	20/04/28 05:17:44
3	46	361.6170319482885	264.17422801455785	20/04/28 05:17:45
3	57	365.8336784609425	258.9548948604074	20/04/28 05:17:46
3	54	367.80245440868674	262.5455232582413	20/04/28 05:17:47
3	54	372.48785670166836	262.3595943162643	20/04/28 05:17:48
3	54	372.48785670166836	262.3595943162643	20/04/28 05:17:49
3	54	372.48785670166836	262.3595943162643	20/04/28 05:17:50
3	54	375.1867774942457	263.7731434229599	20/04/28 05:17:51
3	15	379.8755906118027	262.6421307240284	20/04/28 05:17:52
3	15	379.8755906118027	262.6421307240284	20/04/28 05:17:53
3	15	381.6109766893215	266.73786054806715	20/04/28 05:17:54
1	33	381.6109766893215	266.73786054806715	20/04/28 05:17:55
1	33	379.8755906118027	262.6421307240284	20/04/28 05:17:56
1	33	379.51825801393375	263.17204603967434	20/04/28 05:17:57
3	57	377.9566720707791	257.7033955780391	20/04/28 05:17:58
3	57	377.9566720707791	257.7033955780391	20/04/28 05:17:59
3	57	377.9566720707791	257.7033955780391	20/04/28 05:18:00
3	57	372.1191876279541	254.90991466941398	20/04/28 05:18:01
3	57	371.49347281920717	252.91175971053826	20/04/28 05:18:02
3	57	372.1191876279541	254.90991466941398	20/04/28 05:18:03
3	57	372.1191876279541	254.90991466941398	20/04/28 05:18:04
3	57	371.49347281920717	252.91175971053826	20/04/28 05:18:05
3	57	372.1191876279541	254.90991466941398	20/04/28 05:18:06
3	57	372.1191876279541	254.90991466941398	20/04/28 05:18:07
3	57	372.1191876279541	254.90991466941398	20/04/28 05:18:08
3	57	372.11918762795403	254.90991466941398	20/04/28 05:18:09
3	57	367.9225813006245	252.20998711858013	20/04/28 05:18:10
3	57	367.9225813006245	252.20998711858013	20/04/28 05:18:11
3	57	372.1191876279541	254.90991466941398	20/04/28 05:18:12
3	57	367.9225813006245	252.20998711858013	20/04/28 05:18:13
3	57	371.49347281920706	252.91175971053826	20/04/28 05:18:14
3	57	369.9048574370517	250.13674253917654	20/04/28 05:18:15
3	57	373.47574895563434	250.83851513113464	20/04/28 05:18:16
3	57	367.9225813006244	252.20998711858013	20/04/28 05:18:17
3	57	372.1191876279541	254.90991466941398	20/04/28 05:18:18
3	57	372.1191876279541	254.90991466941398	20/04/28 05:18:19
3	57	367.9225813006245	252.20998711858013	20/04/28 05:18:20
3	57	372.1191876279541	254.90991466941398	20/04/28 05:18:21
3	57	372.1191876279541	254.90991466941398	20/04/28 05:18:22
3	57	374.0879635756983	258.5005430672479	20/04/28 05:18:23
3	57	374.26377240687094	258.097817872792	20/04/28 05:18:24
1	69	376.18075636557654	261.96517202151136	20/04/28 05:18:25
1	33	379.51825801393375	263.17204603967434	20/04/28 05:18:26
1	33	380.6150632356726	267.4744509522458	20/04/28 05:18:27
1	86	377.91614244309534	266.0609018455502	20/04/28 05:18:28
1	74	374.22324277918716	266.45532414030305	20/04/28 05:18:29
1	74	373.5846619234073	266.66199922883567	20/04/28 05:18:30
1	13	368.31727752533806	266.1301521552222	20/04/28 05:18:31
1	13	368.31727752533806	266.1301521552222	20/04/28 05:18:32
1	86	366.41078151858073	270.04703022855466	20/04/28 05:18:33
1	86	366.41078151858073	270.04703022855466	20/04/28 05:18:34
1	13	368.31727752533806	266.1301521552222	20/04/28 05:18:35
1	86	366.41078151858073	270.04703022855466	20/04/28 05:18:36
1	13	368.31727752533806	266.1301521552222	20/04/28 05:18:37
1	86	366.41078151858073	270.04703022855466	20/04/28 05:18:38
1	NULL	369.15505395524525	268.76260300101654	20/04/28 05:18:39
1	86	366.41078151858073	270.04703022855466	20/04/28 05:18:40
1	NULL	369.15505395524525	268.76260300101654	20/04/28 05:18:41
1	86	366.41078151858073	270.04703022855466	20/04/28 05:18:42
1	13	368.31727752533806	266.1301521552222	20/04/28 05:18:43
1	86	366.41078151858073	270.04703022855466	20/04/28 05:18:44
1	86	366.41078151858073	270.04703022855466	20/04/28 05:18:45
1	NULL	369.15505395524525	268.76260300101654	20/04/28 05:18:46
1	86	366.41078151858073	270.04703022855466	20/04/28 05:18:47
1	NULL	369.15505395524525	268.76260300101654	20/04/28 05:18:48
