floorId	partitionId	location_x	location_y	timeStamp
3	42	340.6773105385091	260.12647138771956	20/04/28 05:17:18
3	42	340.78001495202034	260.34399947614423	20/04/28 05:17:18
3	42	340.78001495202034	260.34399947614423	20/04/28 05:17:18
3	42	340.8600864562612	260.2781546882357	20/04/28 05:17:18
3	42	340.8600864562612	260.2781546882357	20/04/28 05:17:18
3	42	341.0216331263821	260.1812412543972	20/04/28 05:17:19
3	42	341.0106641486593	260.18226957127433	20/04/28 05:17:19
3	42	340.869302394894	260.2314243169047	20/04/28 05:17:19
3	42	340.90162415894855	260.3490208387365	20/04/28 05:17:19
3	42	340.8998376550058	260.34751488916567	20/04/28 05:17:19
3	42	340.7640851386083	260.27791989777097	20/04/28 05:17:19
3	42	340.734825802525	260.2690878857742	20/04/28 05:17:19
3	42	340.7250900703104	260.2741312852753	20/04/28 05:17:19
3	42	340.6611198524351	260.0554352760767	20/04/28 05:17:19
3	42	340.8267197384241	260.2274363548003	20/04/28 05:17:19
3	42	340.6073999822911	260.32620096858165	20/04/28 05:17:20
3	42	340.5557630320414	260.36384704231074	20/04/28 05:17:20
3	42	340.5557630320414	260.36384704231074	20/04/28 05:17:20
3	42	340.5169674395716	260.3610891678251	20/04/28 05:17:20
3	42	340.7492164268796	260.12545192271443	20/04/28 05:17:20
3	42	340.88841083592024	260.29686620732986	20/04/28 05:17:20
3	42	340.88841083592024	260.29686620732986	20/04/28 05:17:20
3	42	340.8576166896927	260.0397636846731	20/04/28 05:17:20
3	42	340.6754417608171	259.9389634445002	20/04/28 05:17:20
3	42	340.80272970167374	260.0250051064551	20/04/28 05:17:21
3	42	340.80272970167374	260.0250051064551	20/04/28 05:17:21
3	42	340.77769187913236	259.9109322306599	20/04/28 05:17:21
3	42	340.6058054359742	259.8324417324732	20/04/28 05:17:21
3	42	340.8460076436684	259.8599447395839	20/04/28 05:17:21
3	42	340.73042611958846	259.9406859417996	20/04/28 05:17:21
3	42	340.4880868656597	259.9273540791001	20/04/28 05:17:21
3	42	340.5562052701803	259.937967497604	20/04/28 05:17:21
3	42	340.6644327014486	260.1497298770872	20/04/28 05:17:21
3	42	340.89223085597456	260.11952097769097	20/04/28 05:17:21
3	42	340.7884610505376	260.2908209633274	20/04/28 05:17:22
3	42	340.72713430872244	260.3674145130645	20/04/28 05:17:22
3	42	340.47071203945325	260.2413045098405	20/04/28 05:17:22
3	42	340.2568534060142	260.3766111040625	20/04/28 05:17:22
3	42	340.13837677539857	260.30208962276487	20/04/28 05:17:22
3	42	340.04539597203774	260.34436205601764	20/04/28 05:17:22
3	42	340.1035868355329	260.33354762343777	20/04/28 05:17:22
3	42	340.07260038709467	260.3155973034968	20/04/28 05:17:22
3	42	340.0533376062628	260.3277603627816	20/04/28 05:17:22
3	42	340.2412382651584	260.2135461285868	20/04/28 05:17:22
3	42	340.2532946144587	260.2449645944459	20/04/28 05:17:23
3	42	340.13557476375337	260.0393380366821	20/04/28 05:17:23
3	42	340.15419302800194	260.06087289641215	20/04/28 05:17:23
3	42	340.3531322252279	260.1845027231945	20/04/28 05:17:23
3	42	340.5126419773022	260.3789532839279	20/04/28 05:17:23
3	42	340.5230153554544	260.297214321638	20/04/28 05:17:23
3	42	340.63351933344785	260.33658316265445	20/04/28 05:17:23
3	42	340.8231453042392	260.2152560564224	20/04/28 05:17:23
3	42	340.78717756212046	259.98798535622814	20/04/28 05:17:23
3	42	340.84055465745314	260.25177197054245	20/04/28 05:17:24
3	42	340.9877805684863	260.3697802226124	20/04/28 05:17:24
3	42	341.00045228840645	260.3698754819281	20/04/28 05:17:24
3	42	341.09560590385576	260.23120552674663	20/04/28 05:17:24
3	42	340.86098587410316	260.20632134492473	20/04/28 05:17:24
3	42	340.7816859052663	260.2527909429842	20/04/28 05:17:24
3	42	340.8431567524219	260.2456456028549	20/04/28 05:17:24
3	42	340.88825800897337	260.22898510197984	20/04/28 05:17:24
3	42	340.67601492621077	260.02230079897714	20/04/28 05:17:24
3	42	340.66803437081063	260.0270289855506	20/04/28 05:17:24
3	42	340.478717836038	259.9496006344974	20/04/28 05:17:25
3	42	340.5370199437194	259.78715108705137	20/04/28 05:17:25
3	42	340.4997683490763	259.74829112228235	20/04/28 05:17:25
3	42	340.684361132058	259.77548492830454	20/04/28 05:17:25
3	42	340.5272153294635	259.77070558580266	20/04/28 05:17:25
3	42	340.56554640667275	259.75039895578715	20/04/28 05:17:25
3	42	340.64908591781153	259.7912783462184	20/04/28 05:17:25
3	42	340.7074266715753	259.81976599869137	20/04/28 05:17:25
3	42	340.64084461173854	259.8678670451964	20/04/28 05:17:25
3	42	340.65737868749153	259.86856251377986	20/04/28 05:17:25
3	42	340.7740624504774	260.0204063678494	20/04/28 05:17:26
3	42	340.6885300394104	260.28430911432804	20/04/28 05:17:26
3	42	340.6391633266892	260.23897719070345	20/04/28 05:17:26
3	42	340.6626494477024	260.2345457649058	20/04/28 05:17:26
3	42	340.7089543446261	260.3269458911372	20/04/28 05:17:26
3	42	340.7091446678701	260.32513468520574	20/04/28 05:17:26
3	42	340.7577027138401	260.34340379901266	20/04/28 05:17:26
3	42	340.7242330473335	260.1321040556911	20/04/28 05:17:26
3	42	340.7920518536002	259.9056888921609	20/04/28 05:17:26
3	42	340.7920518536002	259.9056888921609	20/04/28 05:17:26
3	42	340.8350381000754	260.0645626074568	20/04/28 05:17:27
3	42	340.93761413020707	260.0491262528396	20/04/28 05:17:27
3	42	341.0745324149852	259.9497400694076	20/04/28 05:17:27
3	42	341.06467301810966	259.93187980760393	20/04/28 05:17:27
3	42	341.0654684373723	259.9489627362439	20/04/28 05:17:27
3	42	341.05216281545694	259.9583462859132	20/04/28 05:17:27
3	42	341.12216873026654	260.27811764827715	20/04/28 05:17:27
3	42	341.0992711228543	260.04799828782967	20/04/28 05:17:27
3	42	341.1125987762618	260.0433784300645	20/04/28 05:17:27
3	42	341.031772035006	260.09527122328876	20/04/28 05:17:28
3	42	341.2920929405527	260.04609389462183	20/04/28 05:17:28
3	42	341.2920929405527	260.04609389462183	20/04/28 05:17:28
3	42	341.1612289177351	260.11206142768845	20/04/28 05:17:28
3	42	341.1318440575181	260.1087437419676	20/04/28 05:17:28
3	42	341.10587242508956	260.17953576030584	20/04/28 05:17:28
3	42	341.12518911677284	260.1971035721302	20/04/28 05:17:28
3	42	341.3397778359775	260.10267769987144	20/04/28 05:17:28
3	42	341.32247743880777	260.08905610609156	20/04/28 05:17:28
3	42	341.23636474856613	259.86699056317684	20/04/28 05:17:28
3	42	341.14266543094016	259.8619967708651	20/04/28 05:17:29
3	42	341.3523230901163	259.6926274148847	20/04/28 05:17:29
3	42	341.30021458311137	259.4393657989502	20/04/28 05:17:29
3	42	341.4065294682764	259.38260830322605	20/04/28 05:17:29
3	42	341.44522209389726	259.42246141387494	20/04/28 05:17:29
3	42	341.08891613613	259.35030477260375	20/04/28 05:17:29
3	42	341.1702061006405	259.40039297713327	20/04/28 05:17:29
3	42	341.0629405695869	259.30964836108734	20/04/28 05:17:29
3	42	340.91112474759643	259.07285935011754	20/04/28 05:17:29
3	42	341.1746566403313	259.1421023614922	20/04/28 05:17:29
3	42	341.1746566403313	259.1421023614922	20/04/28 05:17:30
3	42	341.16114551752395	259.0068150111493	20/04/28 05:17:30
3	42	341.01478461305214	258.91826254569605	20/04/28 05:17:30
3	42	340.9400470313064	258.8834145822148	20/04/28 05:17:30
3	42	340.8799392113265	258.71136899583365	20/04/28 05:17:30
3	42	341.0189372034583	258.8550713906575	20/04/28 05:17:30
3	42	340.77712550477247	258.90689104391953	20/04/28 05:17:30
3	42	340.77712550477247	258.90689104391953	20/04/28 05:17:30
3	42	340.96899640037674	258.9302086080346	20/04/28 05:17:30
3	42	340.93344534428394	259.2014964967843	20/04/28 05:17:31
3	42	340.93344534428394	259.2014964967843	20/04/28 05:17:31
3	42	340.7034643240966	259.22248801206916	20/04/28 05:17:31
3	42	340.70105872602045	259.1908486339285	20/04/28 05:17:31
3	42	340.70105872602045	259.1908486339285	20/04/28 05:17:31
3	42	340.90093022977095	259.2309814400154	20/04/28 05:17:31
3	42	341.06392634396764	259.08830560884473	20/04/28 05:17:31
3	42	340.89831842085573	259.0297222687714	20/04/28 05:17:31
3	42	340.76535332798665	259.1441249513648	20/04/28 05:17:31
3	42	340.76535332798665	259.1441249513648	20/04/28 05:17:31
3	42	340.66924989999495	259.0686867523864	20/04/28 05:17:32
3	42	340.6488458463979	258.9145347502766	20/04/28 05:17:32
3	42	340.6488458463979	258.9145347502766	20/04/28 05:17:32
3	42	340.5495119974897	258.7317059069103	20/04/28 05:17:32
3	42	340.5495119974897	258.7317059069103	20/04/28 05:17:32
3	42	340.5531352862434	258.73544036396447	20/04/28 05:17:32
3	42	340.6489363531317	258.9607782037822	20/04/28 05:17:32
3	42	340.78898950998376	258.92228510115206	20/04/28 05:17:32
3	42	340.82672708212124	258.90656693421727	20/04/28 05:17:32
3	42	340.99925386240255	258.87882225890615	20/04/28 05:17:32
3	42	341.06602486444194	258.91237871905133	20/04/28 05:17:33
3	42	341.3494110661105	258.9050865651667	20/04/28 05:17:33
3	42	341.4281978427713	258.96041196117056	20/04/28 05:17:33
3	42	341.71645804489606	258.9177207961445	20/04/28 05:17:33
3	42	341.72243083578115	259.1459143917601	20/04/28 05:17:33
3	42	341.7322058427163	259.1152211152806	20/04/28 05:17:33
3	42	341.8528251271596	259.2114338667685	20/04/28 05:17:33
3	42	341.96140863100055	259.16070172175336	20/04/28 05:17:33
3	42	342.01472040293606	259.1820493660381	20/04/28 05:17:33
3	42	341.9718098005689	259.0395104582898	20/04/28 05:17:34
3	42	341.92666154126533	259.04324952747885	20/04/28 05:17:34
3	42	341.9938930949746	258.9583186224378	20/04/28 05:17:34
3	42	341.9938930949746	258.9583186224378	20/04/28 05:17:34
3	42	342.07294757613823	258.91264715201106	20/04/28 05:17:34
3	42	342.07544887891174	258.9189544242964	20/04/28 05:17:34
3	42	342.07416736241237	259.091927424162	20/04/28 05:17:34
3	42	342.08525055863856	259.0910009368052	20/04/28 05:17:34
3	42	342.2443899221265	258.88244981606374	20/04/28 05:17:34
3	42	342.2154072432032	258.8463067836963	20/04/28 05:17:34
3	42	342.05696261882605	258.98372880345147	20/04/28 05:17:35
3	42	342.1257739131142	259.158922432509	20/04/28 05:17:35
3	42	342.15431459653223	259.02066557246013	20/04/28 05:17:35
3	42	342.1404324830216	259.09244279944113	20/04/28 05:17:35
3	42	342.1404324830216	259.09244279944113	20/04/28 05:17:35
3	42	342.2648761209014	259.1216932078807	20/04/28 05:17:35
3	42	342.2648761209014	259.1216932078807	20/04/28 05:17:35
3	42	342.37721548428476	259.33072708406297	20/04/28 05:17:35
3	42	342.4802471943207	259.3404088824097	20/04/28 05:17:35
3	42	342.4802471943207	259.3404088824097	20/04/28 05:17:35
3	42	342.2285164914592	259.35287404367745	20/04/28 05:17:36
3	42	342.1965383767999	259.33137237226214	20/04/28 05:17:36
3	42	342.35424855146425	259.4733744112299	20/04/28 05:17:36
3	42	342.3739486171233	259.45656678708895	20/04/28 05:17:36
3	42	342.18431337834517	259.48008042891587	20/04/28 05:17:36
3	42	342.30391810563333	259.50671112585053	20/04/28 05:17:36
3	42	342.3719106895204	259.6791876352107	20/04/28 05:17:36
3	42	342.4641180867823	259.9534770563114	20/04/28 05:17:36
3	42	342.4705223809677	259.66545145477556	20/04/28 05:17:36
3	42	342.67004323816144	259.82184246098996	20/04/28 05:17:37
3	42	342.91769447807775	259.76094779410533	20/04/28 05:17:37
3	42	342.91305430800077	259.75072377924187	20/04/28 05:17:37
3	42	342.7919628830757	259.8197752326813	20/04/28 05:17:37
3	42	343.04228475553765	259.7516692043783	20/04/28 05:17:37
3	42	342.79933845220967	259.84028855070903	20/04/28 05:17:37
3	42	342.78309917444767	259.7382140842271	20/04/28 05:17:37
3	42	342.75678171615925	259.7477971981006	20/04/28 05:17:37
3	42	342.5827060892821	259.80086792640105	20/04/28 05:17:37
3	42	342.622243268409	259.74204332518644	20/04/28 05:17:37
3	42	342.66095592662924	259.7396343847728	20/04/28 05:17:38
3	42	342.78772370661295	259.6643603402116	20/04/28 05:17:38
3	42	343.02265382304864	259.62630381507694	20/04/28 05:17:38
3	42	342.9415843928538	259.58505235497955	20/04/28 05:17:38
3	42	342.76541923774874	259.46372880595493	20/04/28 05:17:38
3	42	342.89175677471013	259.54467950684955	20/04/28 05:17:38
3	42	342.77322327519556	259.50055906459846	20/04/28 05:17:38
3	42	342.9067129190883	259.3829270926895	20/04/28 05:17:38
3	42	342.89145712164924	259.52265830070274	20/04/28 05:17:38
3	42	342.8849867156327	259.22629542892787	20/04/28 05:17:39
3	42	343.1231579762073	259.09200283569544	20/04/28 05:17:39
3	42	343.0457480156895	259.0454388660722	20/04/28 05:17:39
3	42	343.2314381264104	259.04732337176586	20/04/28 05:17:39
3	42	343.2525705052645	258.80581885526243	20/04/28 05:17:39
3	42	343.29974114609473	258.752353843902	20/04/28 05:17:39
3	42	343.124519101863	258.74531515688625	20/04/28 05:17:39
3	42	343.07750716970975	258.6095018074989	20/04/28 05:17:39
3	42	343.07375383013556	258.3841721491055	20/04/28 05:17:39
3	42	343.226363220659	258.43000556827434	20/04/28 05:17:39
3	42	343.4008046000186	258.335412029256	20/04/28 05:17:40
3	42	343.4130404544978	258.34851979233264	20/04/28 05:17:40
3	42	343.3251295842522	258.25455487121917	20/04/28 05:17:40
3	42	343.5911978232092	258.20146958111957	20/04/28 05:17:40
3	42	343.3950018172507	258.3300468562621	20/04/28 05:17:40
3	42	343.4073417679515	258.33876456966567	20/04/28 05:17:40
3	42	343.3827631443951	258.32644948205945	20/04/28 05:17:40
3	42	343.3798935573779	258.1082169479977	20/04/28 05:17:40
3	42	343.5160978884507	258.1528113208699	20/04/28 05:17:40
3	42	343.61474340873804	258.00384456289675	20/04/28 05:17:40
3	42	343.4993782874481	257.9372455910308	20/04/28 05:17:41
3	42	343.4852805443821	258.0867316890837	20/04/28 05:17:41
3	42	343.65979945236353	257.9057197947213	20/04/28 05:17:41
3	42	343.783228766223	258.1777538210617	20/04/28 05:17:41
3	42	343.9228684160347	257.96998634318703	20/04/28 05:17:41
3	42	343.8009793300463	258.0037689888719	20/04/28 05:17:41
3	42	343.58052524816776	257.88981372364367	20/04/28 05:17:41
3	42	343.60766122100927	257.8152574079915	20/04/28 05:17:41
3	42	343.59706725031833	257.98868826119747	20/04/28 05:17:41
3	42	343.581728881554	257.99938986075273	20/04/28 05:17:42
3	42	343.47948136957694	257.99663733843266	20/04/28 05:17:42
3	42	343.3163456918671	257.7999638224676	20/04/28 05:17:42
3	42	343.2811510755384	257.7311277870175	20/04/28 05:17:42
3	42	343.45351570374515	257.71324976214913	20/04/28 05:17:42
3	42	343.45351570374515	257.71324976214913	20/04/28 05:17:42
3	42	343.45351570374515	257.71324976214913	20/04/28 05:17:42
3	42	343.4645999415999	257.6890139908858	20/04/28 05:17:42
3	42	343.5832251740809	257.6158570185151	20/04/28 05:17:42
3	42	343.5193088258252	257.3597007989145	20/04/28 05:17:42
3	42	343.6137365269373	257.43326471814265	20/04/28 05:17:43
3	42	343.60731964452674	257.30149919946643	20/04/28 05:17:43
3	42	343.47905065795015	257.46114737107524	20/04/28 05:17:43
3	42	343.62806645485466	257.52482467743687	20/04/28 05:17:43
3	42	343.55531199016167	257.4770924831264	20/04/28 05:17:43
3	42	343.7967622049471	257.4063789734483	20/04/28 05:17:43
3	42	343.5881897393269	257.46847316845975	20/04/28 05:17:43
3	42	343.59566679381135	257.5613812236338	20/04/28 05:17:43
3	42	343.4876757655991	257.39907186419094	20/04/28 05:17:43
3	42	343.2236515002391	257.4045282618266	20/04/28 05:17:44
3	42	343.2846094465866	257.38471939046855	20/04/28 05:17:44
3	42	343.47202317888366	257.4598489460492	20/04/28 05:17:44
3	42	343.361311924668	257.5521045562281	20/04/28 05:17:44
3	42	343.54223872248537	257.4699737889872	20/04/28 05:17:44
3	42	343.66380883584736	257.3950939488473	20/04/28 05:17:44
3	42	343.666906737916	257.37790960084357	20/04/28 05:17:44
3	42	343.39745750544165	257.37012350933173	20/04/28 05:17:44
3	42	343.47244308287145	257.56213543528685	20/04/28 05:17:44
3	42	343.5528546500055	257.64270156411123	20/04/28 05:17:44
3	42	343.472951626929	257.78073612949197	20/04/28 05:17:45
3	42	343.2219836965971	257.721580353937	20/04/28 05:17:45
3	42	343.04298817850764	257.7872101811616	20/04/28 05:17:45
3	42	343.0518879866078	257.7527111692178	20/04/28 05:17:45
3	42	343.0154293957274	257.9763593792377	20/04/28 05:17:45
3	42	342.98051558985907	258.125863857499	20/04/28 05:17:45
3	42	342.993992459744	258.04383560968034	20/04/28 05:17:45
3	42	342.9137458047422	258.0964500779421	20/04/28 05:17:45
3	42	343.02581335816944	258.25220833416876	20/04/28 05:17:45
3	42	342.9732523583804	258.2735840749543	20/04/28 05:17:46
3	42	342.9963658092091	258.37108117556755	20/04/28 05:17:46
3	42	343.0270424632899	258.35281576724833	20/04/28 05:17:46
3	42	343.0189927618339	258.4377227577832	20/04/28 05:17:46
3	42	343.01892597614636	258.4376994826988	20/04/28 05:17:46
3	42	342.7683566928262	258.34772644486304	20/04/28 05:17:46
3	42	342.7658458209276	258.3871835784435	20/04/28 05:17:46
3	42	342.61579871477056	258.35569103130535	20/04/28 05:17:46
3	42	342.52902508457663	258.288377086419	20/04/28 05:17:46
3	42	342.4138717384224	258.30954104222116	20/04/28 05:17:46
3	42	342.42600702624014	258.3613264452112	20/04/28 05:17:47
3	42	342.43298113983127	258.183365362331	20/04/28 05:17:47
3	42	342.29156773512904	258.179395848289	20/04/28 05:17:47
3	42	342.3352259489498	258.21009919161145	20/04/28 05:17:47
3	42	342.5500488427686	258.0040661739877	20/04/28 05:17:47
3	42	342.5398418272404	258.068505023378	20/04/28 05:17:47
3	42	342.5474781566097	258.01955576173475	20/04/28 05:17:47
3	42	342.5472131762658	258.01784410063937	20/04/28 05:17:47
3	42	342.56260056788153	258.01071232882316	20/04/28 05:17:47
3	42	342.50413541741904	258.28044975543804	20/04/28 05:17:47
3	42	342.54066342845846	258.3511073207541	20/04/28 05:17:48
3	42	342.45683853639235	258.18954168369896	20/04/28 05:17:48
3	42	342.74144315456556	258.22164553123145	20/04/28 05:17:48
3	42	342.7701893490864	258.1786863171541	20/04/28 05:17:48
3	42	342.8069459849958	258.2022541431815	20/04/28 05:17:48
3	42	342.5422450413396	258.2716167332138	20/04/28 05:17:48
3	42	342.47154629042575	258.28493922827454	20/04/28 05:17:48
3	42	342.74431070242747	258.2948649242013	20/04/28 05:17:48
3	42	342.66214218821824	258.33697747605964	20/04/28 05:17:48
3	42	342.70984123306573	258.27886006594144	20/04/28 05:17:49
3	42	342.63496416401404	258.2249157874413	20/04/28 05:17:49
3	42	342.61370058797735	258.4417455343647	20/04/28 05:17:49
3	42	342.5426748698786	258.3601621469695	20/04/28 05:17:49
3	42	342.5918691521221	258.55406697247685	20/04/28 05:17:49
3	42	342.4750261993559	258.5180804450595	20/04/28 05:17:49
3	42	342.18188367630773	258.5429382355399	20/04/28 05:17:49
3	42	342.2136255659779	258.55382473138	20/04/28 05:17:49
3	42	342.37284585996434	258.7382762702772	20/04/28 05:17:49
3	42	342.37284585996434	258.7382762702772	20/04/28 05:17:49
3	42	342.56610356138634	258.8454437113772	20/04/28 05:17:50
3	42	342.56610356138634	258.8454437113772	20/04/28 05:17:50
3	42	342.68554468264847	258.93533503697716	20/04/28 05:17:50
3	42	342.6156662374367	258.96204807787313	20/04/28 05:17:50
3	42	342.6392903046438	258.9698273857744	20/04/28 05:17:50
3	42	342.87773130805243	258.8626304316661	20/04/28 05:17:50
3	42	342.984098256582	258.86694788807785	20/04/28 05:17:50
3	42	342.9475303328173	258.6954112291312	20/04/28 05:17:50
3	42	342.9475303328173	258.6954112291312	20/04/28 05:17:50
3	42	342.95119275084977	258.69570563601644	20/04/28 05:17:51
3	42	342.6862360430387	258.57668504755463	20/04/28 05:17:51
3	42	342.6846133200315	258.58936543879	20/04/28 05:17:51
3	42	342.904297131421	258.7876585542524	20/04/28 05:17:51
3	42	343.08467479485046	258.64314974564724	20/04/28 05:17:51
3	42	343.0432946690403	258.6106163258092	20/04/28 05:17:51
3	42	343.1362204180948	258.5613361182111	20/04/28 05:17:51
3	42	343.287134658197	258.4873732036651	20/04/28 05:17:51
3	42	343.5244784155978	258.63981460310816	20/04/28 05:17:51
3	42	343.73901597146056	258.72948324840485	20/04/28 05:17:51
3	42	343.63005008790424	258.6145477746911	20/04/28 05:17:52
3	42	343.5237820918738	258.8575568466286	20/04/28 05:17:52
3	42	343.52419337284914	259.02906190653954	20/04/28 05:17:52
3	42	343.531252899812	259.02095823080987	20/04/28 05:17:52
3	42	343.29931416552336	259.1885836542656	20/04/28 05:17:52
3	42	343.3340093710391	258.90213856965835	20/04/28 05:17:52
3	42	343.18887559426054	258.7752658619205	20/04/28 05:17:52
3	42	343.1268688699755	258.67026351178924	20/04/28 05:17:52
3	42	343.25676562152637	258.56559431264725	20/04/28 05:17:52
3	42	343.0759437344823	258.7708132697276	20/04/28 05:17:52
3	42	343.18056896074216	258.7616829790347	20/04/28 05:17:53
3	42	342.95163142423485	258.84200080226697	20/04/28 05:17:53
3	42	343.07354856983216	258.92892974720286	20/04/28 05:17:53
3	42	343.2716660218733	258.7945343773864	20/04/28 05:17:53
3	42	343.00389256844693	258.79273994709496	20/04/28 05:17:53
3	42	343.09310485790166	258.86843939641807	20/04/28 05:17:53
3	42	342.9819330044656	258.84599128807054	20/04/28 05:17:53
3	42	342.9874663583895	258.8481516573245	20/04/28 05:17:53
3	42	343.0074878426326	258.71074401380804	20/04/28 05:17:53
3	42	342.9779574689108	258.856209277465	20/04/28 05:17:54
3	42	342.9507882388027	258.8772745479769	20/04/28 05:17:54
3	42	343.119565698595	258.8424017103736	20/04/28 05:17:54
3	42	343.20097014176486	258.9134743520685	20/04/28 05:17:54
3	42	343.13257301708535	258.8517378697708	20/04/28 05:17:54
3	42	343.2078403294952	258.9426891582641	20/04/28 05:17:54
3	42	343.1570013652044	258.9171112464695	20/04/28 05:17:54
3	42	343.04556451478084	258.9523822832859	20/04/28 05:17:54
3	42	343.06021297532067	258.9552582425556	20/04/28 05:17:54
3	42	343.0431351194343	259.1023530435115	20/04/28 05:17:54
3	42	343.1356830246647	259.0535894821504	20/04/28 05:17:55
3	42	343.15357020151737	259.24099816829965	20/04/28 05:17:55
3	42	343.14735855463357	259.2345154265534	20/04/28 05:17:55
3	42	343.0453632029654	259.1328975437513	20/04/28 05:17:55
3	42	343.2160077574744	259.0727116151048	20/04/28 05:17:55
3	42	343.1627678615031	258.85655356891056	20/04/28 05:17:55
3	42	343.4286454092578	258.92262665057615	20/04/28 05:17:55
3	42	343.59533952130397	259.0076829003469	20/04/28 05:17:55
3	42	343.603417728802	259.0211812386724	20/04/28 05:17:55
3	42	343.4663867192555	259.08434327183767	20/04/28 05:17:55
3	42	343.61734638189967	259.05580981580806	20/04/28 05:17:56
3	42	343.52406024597576	259.19953942883285	20/04/28 05:17:56
3	42	343.2774717095469	259.0774326346101	20/04/28 05:17:56
3	42	343.3276587518459	258.80212299536043	20/04/28 05:17:56
3	42	343.0331241506968	258.8454927574884	20/04/28 05:17:56
3	42	343.12531728783864	258.76781905445944	20/04/28 05:17:56
3	42	342.86015134042793	258.64003481405007	20/04/28 05:17:56
3	42	342.8579046658951	258.5079748314129	20/04/28 05:17:56
3	42	342.936314756435	258.56741959516296	20/04/28 05:17:56
3	42	342.7435138257072	258.3916740172613	20/04/28 05:17:56
3	42	342.9848488954232	258.47575590844014	20/04/28 05:17:57
3	42	343.01320915435826	258.4478466134017	20/04/28 05:17:57
3	42	343.02577181169016	258.52856493486377	20/04/28 05:17:57
3	42	343.21434147311203	258.361831489755	20/04/28 05:17:57
3	42	343.2682515568745	258.40809675642225	20/04/28 05:17:57
3	42	342.9835164692282	258.4799083210547	20/04/28 05:17:57
3	42	343.04244571688747	258.21854354701463	20/04/28 05:17:57
3	42	343.0280348540342	258.227293628161	20/04/28 05:17:57
3	42	342.890001815601	258.12931958088774	20/04/28 05:17:57
3	42	342.67955734435026	258.3369409220839	20/04/28 05:17:58
3	42	342.54055101991725	258.20408929557203	20/04/28 05:17:58
3	42	342.5233908808512	258.0969894449932	20/04/28 05:17:58
3	42	342.77289790744317	258.142777171494	20/04/28 05:17:58
3	42	342.74934317369724	258.1578787054611	20/04/28 05:17:58
3	42	342.7294833740498	258.18378203691464	20/04/28 05:17:58
3	42	342.62847018146545	258.17135292790283	20/04/28 05:17:58
3	42	342.45418608869926	258.18652175467116	20/04/28 05:17:58
3	42	342.63892114198933	258.07302539408704	20/04/28 05:17:58
3	42	342.51130198199434	258.2690014751795	20/04/28 05:17:58
3	42	342.65937149703257	258.19739711203965	20/04/28 05:17:59
3	42	342.70315424887843	258.4382450198732	20/04/28 05:17:59
3	42	342.66652793796	258.38818968537106	20/04/28 05:17:59
3	42	342.61549590643364	258.3740498218929	20/04/28 05:17:59
3	42	342.41790762438234	258.37263313471345	20/04/28 05:17:59
3	42	342.4444626598169	258.55531016350983	20/04/28 05:17:59
3	42	342.4250659865066	258.4959938968311	20/04/28 05:17:59
3	42	342.4140818619383	258.4865298660207	20/04/28 05:17:59
3	42	342.5257548655993	258.5367963306442	20/04/28 05:17:59
3	42	342.4990463893959	258.63576422645235	20/04/28 05:17:59
3	42	342.61872828463186	258.8059847824836	20/04/28 05:18:00
3	42	342.3957110089496	258.93122140050457	20/04/28 05:18:00
3	42	342.3794516889412	259.1045873910262	20/04/28 05:18:00
3	42	342.6568640072308	259.15175362724705	20/04/28 05:18:00
3	42	342.6225234321195	259.1544608439193	20/04/28 05:18:00
3	42	342.75326416841307	259.1253413497119	20/04/28 05:18:00
3	42	342.75886291828834	259.12736719023354	20/04/28 05:18:00
3	42	342.94074397907997	259.1865741892252	20/04/28 05:18:00
3	42	342.7414712386333	259.1601369354524	20/04/28 05:18:00
3	42	342.70171613970234	259.3586801755203	20/04/28 05:18:01
3	42	342.6654166834956	259.59583279440346	20/04/28 05:18:01
3	42	342.6185357570924	259.5277167456243	20/04/28 05:18:01
3	42	342.6978847418186	259.8130545612181	20/04/28 05:18:01
3	42	342.8928195947988	259.6187184437662	20/04/28 05:18:01
3	42	342.8908454270827	259.61647880400204	20/04/28 05:18:01
3	42	342.7877938727131	259.4565267331569	20/04/28 05:18:01
3	42	342.78640151952794	259.420843673142	20/04/28 05:18:01
3	42	342.8081169869213	259.3590250778939	20/04/28 05:18:01
3	42	342.79696793190493	259.3901324824663	20/04/28 05:18:01
3	42	342.88051673809184	259.5611348560454	20/04/28 05:18:02
3	42	342.95342207306413	259.44796151422906	20/04/28 05:18:02
3	42	342.8223760524458	259.53175803062675	20/04/28 05:18:02
3	42	342.7356395450357	259.63062194413664	20/04/28 05:18:02
3	42	342.8051642497517	259.74526148347843	20/04/28 05:18:02
3	42	342.633327734029	259.7899918192051	20/04/28 05:18:02
3	42	342.51541225426405	259.7469785298148	20/04/28 05:18:02
3	42	342.2472389450148	259.7813297607563	20/04/28 05:18:02
3	42	342.2219483112319	259.48890133229736	20/04/28 05:18:02
3	42	342.4672969351395	259.58736676507925	20/04/28 05:18:02
3	42	342.46982564908336	259.5776058099128	20/04/28 05:18:03
3	42	342.55279533181925	259.5350016689164	20/04/28 05:18:03
3	42	342.5418339628987	259.54204524433214	20/04/28 05:18:03
3	42	342.46036355171844	259.28881024287614	20/04/28 05:18:03
3	42	342.42174511441203	259.16673167190953	20/04/28 05:18:03
3	42	342.46543403262166	259.1674133892879	20/04/28 05:18:03
3	42	342.5642547786221	259.3249780489381	20/04/28 05:18:03
3	42	342.5277298831394	259.269521455405	20/04/28 05:18:03
3	42	342.47793956367127	259.1735699122578	20/04/28 05:18:03
3	42	342.64511505959456	259.1959978678579	20/04/28 05:18:04
3	42	342.6592435022498	259.1577781000659	20/04/28 05:18:04
3	42	342.4991007597382	259.3416455510254	20/04/28 05:18:04
3	42	342.4806939990546	259.3462683628608	20/04/28 05:18:04
3	42	342.4389275001354	259.5228622370976	20/04/28 05:18:04
3	42	342.42707130890733	259.53427473641347	20/04/28 05:18:04
3	42	342.69274624459604	259.5294177124991	20/04/28 05:18:04
3	42	342.57949455558526	259.46128461111067	20/04/28 05:18:04
3	42	342.3696024230229	259.52448251237433	20/04/28 05:18:04
3	42	342.630103814454	259.5428612020696	20/04/28 05:18:04
3	42	342.4640237334256	259.5575086523971	20/04/28 05:18:05
3	42	342.4238507568201	259.5989459552575	20/04/28 05:18:05
3	42	342.42861003615354	259.64408796081057	20/04/28 05:18:05
3	42	342.4649344495302	259.5569641613744	20/04/28 05:18:05
3	42	342.61523307649804	259.40313898044457	20/04/28 05:18:05
3	42	342.8294768063723	259.5980076840813	20/04/28 05:18:05
3	42	343.0029402614368	259.411930227746	20/04/28 05:18:05
3	42	343.21182298368007	259.4305283824151	20/04/28 05:18:05
3	42	343.24811012459406	259.2883946389547	20/04/28 05:18:05
3	42	343.2271324754083	259.2794026477737	20/04/28 05:18:05
3	42	343.0609353119868	259.1087405102784	20/04/28 05:18:06
3	42	343.1158264128444	258.9960293097616	20/04/28 05:18:06
3	42	343.1811008924656	259.07668765728016	20/04/28 05:18:06
3	42	343.0448285399494	259.2272736622446	20/04/28 05:18:06
3	42	342.9554763569205	259.22432242591077	20/04/28 05:18:06
3	42	342.8730519233661	259.4414607837611	20/04/28 05:18:06
3	42	343.0803667048314	259.56654249523234	20/04/28 05:18:06
3	42	343.03107362098046	259.7167839200156	20/04/28 05:18:06
3	42	342.99045789350447	259.93516698454727	20/04/28 05:18:06
3	42	342.8860600366818	260.0065167052341	20/04/28 05:18:07
3	42	342.8174297509104	260.1805353893472	20/04/28 05:18:07
3	42	342.7980610086898	260.2274883002396	20/04/28 05:18:07
3	42	342.74475961957955	260.33902136746025	20/04/28 05:18:07
3	42	342.59564189964414	260.1517376195629	20/04/28 05:18:07
3	42	342.76803161550174	260.20401590961376	20/04/28 05:18:07
3	42	342.81870434880284	260.18060863951325	20/04/28 05:18:07
3	42	342.85488439760235	260.2361785517209	20/04/28 05:18:07
3	42	342.82600307549694	260.19060785163896	20/04/28 05:18:07
3	42	342.7089468896992	260.14702990264794	20/04/28 05:18:07
3	42	342.90492927314784	260.1401266218309	20/04/28 05:18:08
3	42	343.17667793278173	260.24001007450397	20/04/28 05:18:08
3	42	343.17667793278173	260.24001007450397	20/04/28 05:18:08
3	42	343.17667793278173	260.24001007450397	20/04/28 05:18:08
3	42	343.11856251640575	260.34019673231535	20/04/28 05:18:08
3	42	342.95401447198327	260.270103734411	20/04/28 05:18:08
3	42	342.83329831111917	260.0810142270354	20/04/28 05:18:08
3	42	342.9613904364244	260.16608670417787	20/04/28 05:18:08
3	42	342.9618989971371	260.3093888444799	20/04/28 05:18:08
3	42	342.84360798393163	260.3726077707909	20/04/28 05:18:08
3	42	343.10980960911934	260.38063699192406	20/04/28 05:18:09
3	42	343.3203357155313	260.27977329175604	20/04/28 05:18:09
3	42	343.57645469589494	260.2659082601033	20/04/28 05:18:09
3	42	343.56400320049113	260.2726384903112	20/04/28 05:18:09
3	42	343.48173537140286	260.27660985583714	20/04/28 05:18:09
3	42	343.2713949303333	260.3325596548923	20/04/28 05:18:09
3	42	343.1291022699385	260.12959954925674	20/04/28 05:18:09
3	42	343.2098841543448	260.0500795292892	20/04/28 05:18:09
3	42	343.3320310631947	260.2301836576736	20/04/28 05:18:09
3	42	343.22142917368734	260.2688531874347	20/04/28 05:18:10
3	42	343.21836066667396	260.33441380888627	20/04/28 05:18:10
3	42	343.2237991689625	260.05247693967414	20/04/28 05:18:10
3	42	343.1145830239161	259.78231413045455	20/04/28 05:18:10
3	42	343.1338216335503	259.887502487198	20/04/28 05:18:10
3	42	342.95813418017934	259.6877279593508	20/04/28 05:18:10
3	42	342.92560150547234	259.7569249859826	20/04/28 05:18:10
3	42	343.0304106121913	259.60998794244887	20/04/28 05:18:10
3	42	342.9376586565448	259.7450717685544	20/04/28 05:18:10
3	42	342.8288508219393	259.7302895276849	20/04/28 05:18:10
3	42	342.8034114768609	259.680689253903	20/04/28 05:18:11
3	42	342.79250220424854	259.6690893582137	20/04/28 05:18:11
3	42	342.53270919154465	259.67228965586486	20/04/28 05:18:11
3	42	342.35561773359746	259.6889926570279	20/04/28 05:18:11
3	42	342.2499826730605	259.56427745760095	20/04/28 05:18:11
3	42	342.14813674964165	259.4156339573966	20/04/28 05:18:11
3	42	342.2342260996862	259.6516048030751	20/04/28 05:18:11
3	42	342.0485199021178	259.7656004302816	20/04/28 05:18:11
3	42	342.0755803637698	259.71034745007825	20/04/28 05:18:11
3	42	342.286377124319	259.5881683364468	20/04/28 05:18:11
3	42	342.371266462334	259.4099242962572	20/04/28 05:18:12
3	42	342.2001848510592	259.2739162646871	20/04/28 05:18:12
3	42	342.32470960493106	259.36187565699197	20/04/28 05:18:12
3	42	342.4737579078058	259.60835956956083	20/04/28 05:18:12
3	42	342.56368078909446	259.6136094963462	20/04/28 05:18:12
3	42	342.68041047602196	259.71938464553074	20/04/28 05:18:12
3	42	342.67544841969146	259.71442938133237	20/04/28 05:18:12
3	42	342.66895730147047	259.70843014257434	20/04/28 05:18:12
3	42	342.74722198796763	259.53709165650014	20/04/28 05:18:12
3	42	342.58148906665315	259.6471169609691	20/04/28 05:18:13
3	42	342.61750152419273	259.5113542893897	20/04/28 05:18:13
3	42	342.8453057765043	259.4928366107694	20/04/28 05:18:13
3	42	343.0391116226939	259.5249228237664	20/04/28 05:18:13
3	42	343.0881420850103	259.47620355431746	20/04/28 05:18:13
3	42	343.19271356251056	259.2458453695779	20/04/28 05:18:13
3	42	343.1032265989875	259.23487410716405	20/04/28 05:18:13
3	42	342.87392272245216	259.31628141217396	20/04/28 05:18:13
3	42	342.73879121617733	259.0599764873284	20/04/28 05:18:13
3	42	342.54422541212784	259.0150360810007	20/04/28 05:18:13
3	42	342.5084503456219	259.0683899394283	20/04/28 05:18:14
3	42	342.4215871606256	259.0118192670033	20/04/28 05:18:14
3	42	342.40957748896574	258.9409177749057	20/04/28 05:18:14
3	42	342.38762002784375	258.9507000676237	20/04/28 05:18:14
3	42	342.31129692485246	258.94704024461015	20/04/28 05:18:14
3	42	342.26652144979096	258.97537486239526	20/04/28 05:18:14
3	42	342.34108564003157	258.8698159248332	20/04/28 05:18:14
3	42	342.5523226904987	258.7536586666537	20/04/28 05:18:14
3	42	342.7207688058393	258.8838681484755	20/04/28 05:18:14
3	42	342.568125844926	258.94837468804536	20/04/28 05:18:14
3	42	342.5241706915953	258.9606078675744	20/04/28 05:18:15
3	42	342.54837065074605	259.001511425564	20/04/28 05:18:15
3	42	342.40513295369806	259.04040219892204	20/04/28 05:18:15
3	42	342.3808804523757	258.9553675533781	20/04/28 05:18:15
3	42	342.3808804523757	258.9553675533781	20/04/28 05:18:15
3	42	342.2065595878666	258.95950013577936	20/04/28 05:18:15
3	42	342.3264082512636	258.8867379464481	20/04/28 05:18:15
3	42	342.49469007868976	258.88042865003	20/04/28 05:18:15
3	42	342.7411055976383	259.03381803590787	20/04/28 05:18:15
3	42	342.70103127636366	259.3413428013244	20/04/28 05:18:16
3	42	342.83761651241684	259.51464809573105	20/04/28 05:18:16
3	42	342.83761651241684	259.51464809573105	20/04/28 05:18:16
3	42	342.772813630957	259.5489099432638	20/04/28 05:18:16
3	42	342.8578647224997	259.5281543940287	20/04/28 05:18:16
3	42	342.8296776684918	259.7080621852295	20/04/28 05:18:16
3	42	342.78022145390224	259.47498239140003	20/04/28 05:18:16
3	42	342.8663574833129	259.2781034995596	20/04/28 05:18:16
3	42	342.76692672936684	259.2826629818698	20/04/28 05:18:16
3	42	342.7745717467534	259.28450810809653	20/04/28 05:18:16
3	42	342.6334350324938	259.52583227162773	20/04/28 05:18:17
3	42	342.5907013192574	259.55249162677546	20/04/28 05:18:17
3	42	342.3918029736374	259.6123661573656	20/04/28 05:18:17
3	42	342.6148685417875	259.6756643646891	20/04/28 05:18:17
3	42	342.6031020129192	259.7835681943915	20/04/28 05:18:17
3	42	342.7765765847456	259.7875198252979	20/04/28 05:18:17
3	42	342.70387019620375	259.51167588367395	20/04/28 05:18:17
3	42	342.78420531904925	259.51071624985724	20/04/28 05:18:17
3	42	342.83775279071114	259.34104170996903	20/04/28 05:18:17
3	42	342.9028626807339	259.15249085502666	20/04/28 05:18:17
3	42	342.93688418417867	259.33420810872536	20/04/28 05:18:18
3	42	342.93688418417867	259.33420810872536	20/04/28 05:18:18
3	42	342.8872686248515	259.36700704038856	20/04/28 05:18:18
3	42	342.5313132463254	259.6062653239853	20/04/28 05:18:18
3	42	342.5313132463254	259.6062653239853	20/04/28 05:18:18
3	42	342.42709994653745	259.6872110459133	20/04/28 05:18:18
3	42	342.27121572568245	259.7760942034424	20/04/28 05:18:18
3	42	342.14491686253234	259.78190199020213	20/04/28 05:18:18
3	42	342.1708118161134	259.7922062948539	20/04/28 05:18:18
3	42	342.06588471740605	259.71380628491227	20/04/28 05:18:19
3	42	341.9986248585183	259.6997768289705	20/04/28 05:18:19
3	42	341.82839036510774	259.49862562959544	20/04/28 05:18:19
3	42	341.9039329742976	259.50472326745756	20/04/28 05:18:19
3	42	342.07241424159633	259.3672524702553	20/04/28 05:18:19
3	42	342.1138437120726	259.2265346920127	20/04/28 05:18:19
3	42	342.172312362096	259.31113869325856	20/04/28 05:18:19
3	42	342.28521021816357	259.47316335305203	20/04/28 05:18:19
3	42	342.52080696278597	259.35944673923893	20/04/28 05:18:19
3	42	342.58464040711607	259.5496212469321	20/04/28 05:18:19
3	42	342.34714573478357	259.38945301518237	20/04/28 05:18:20
3	42	342.5625317263831	259.4333617358663	20/04/28 05:18:20
3	42	342.6511255723371	259.34580743293765	20/04/28 05:18:20
3	42	342.6083865498271	259.344199737468	20/04/28 05:18:20
3	42	342.6413683245674	259.3138785497303	20/04/28 05:18:20
3	42	342.6436238082775	259.35531296195427	20/04/28 05:18:20
3	42	342.68701166951973	259.15089209036347	20/04/28 05:18:20
3	42	342.6774874829046	259.158929339672	20/04/28 05:18:20
3	42	342.80380701962315	259.19791676824826	20/04/28 05:18:20
3	42	342.6325876970629	259.0547282258712	20/04/28 05:18:20
3	42	342.7608298806989	258.9562600472674	20/04/28 05:18:21
3	42	342.6764033575985	258.7462045753594	20/04/28 05:18:21
3	42	342.80769407047046	258.91482003549635	20/04/28 05:18:21
3	42	342.8083532006186	258.7318953620844	20/04/28 05:18:21
3	42	342.7880945285551	258.7418179326305	20/04/28 05:18:21
3	42	342.6778047457168	258.65133228966016	20/04/28 05:18:21
3	42	342.6480340035212	258.55133778410044	20/04/28 05:18:21
3	42	342.6679267385511	258.56866402762074	20/04/28 05:18:21
3	42	342.6489145913603	258.5347538404464	20/04/28 05:18:21
3	42	342.44702448569893	258.404680330227	20/04/28 05:18:22
3	42	342.4817508388736	258.37026915575854	20/04/28 05:18:22
3	42	342.71774849059886	258.53357818806245	20/04/28 05:18:22
3	42	342.49194118014407	258.4078959071833	20/04/28 05:18:22
3	42	342.2586142823667	258.3613554864864	20/04/28 05:18:22
3	42	342.2758888669381	258.42701188296684	20/04/28 05:18:22
3	42	342.2744993954579	258.42632245183995	20/04/28 05:18:22
3	42	342.3351190492666	258.3789590875969	20/04/28 05:18:22
3	42	342.15894701299004	258.50573573847817	20/04/28 05:18:22
3	42	342.2524396433698	258.41907697947903	20/04/28 05:18:22
3	42	342.35244921590873	258.6747720334354	20/04/28 05:18:23
3	42	342.38920057565036	258.6774994208876	20/04/28 05:18:23
3	42	342.32248819710037	258.8984204807137	20/04/28 05:18:23
3	42	342.55720899642245	259.0557758082204	20/04/28 05:18:23
3	42	342.8362050513961	259.10289327046416	20/04/28 05:18:23
3	42	342.6247785708845	259.06035814642115	20/04/28 05:18:23
3	42	342.7332538100125	258.81563746328527	20/04/28 05:18:23
3	42	342.70203379779883	258.92367409919956	20/04/28 05:18:23
3	42	342.74294654715885	258.8421089221453	20/04/28 05:18:23
3	42	342.61672139846	259.09828916981667	20/04/28 05:18:23
3	42	342.8121633909608	259.096735065503	20/04/28 05:18:24
3	42	342.9090054424831	259.2165348643088	20/04/28 05:18:24
3	42	342.86966778837404	259.09506486803366	20/04/28 05:18:24
3	42	342.6417176618803	259.2077460509335	20/04/28 05:18:24
3	42	342.5099986648754	259.2309379211626	20/04/28 05:18:24
3	42	342.50612622295137	259.2456157979548	20/04/28 05:18:24
3	42	342.45940470663794	259.2731124835458	20/04/28 05:18:24
3	42	342.4780861109196	259.19278324721915	20/04/28 05:18:24
3	42	342.4743812032191	259.18948659818517	20/04/28 05:18:24
3	42	342.57842633050893	259.3983203788353	20/04/28 05:18:25
3	42	342.60662909235964	259.3825483320411	20/04/28 05:18:25
3	42	342.84649118108246	259.4550599912114	20/04/28 05:18:25
3	42	343.0189141276708	259.5174844522581	20/04/28 05:18:25
3	42	342.7483454856962	259.46318279913567	20/04/28 05:18:25
3	42	342.6900598640698	259.32175318840103	20/04/28 05:18:25
3	42	342.75396751353185	259.30792069167825	20/04/28 05:18:25
3	42	342.8436744708978	259.12900322240824	20/04/28 05:18:25
3	42	342.85916785437934	259.25862780522306	20/04/28 05:18:25
3	42	342.67825055285056	259.2870248565259	20/04/28 05:18:25
3	42	342.70222708049096	259.0266692135222	20/04/28 05:18:26
3	42	342.68396896569675	259.0661008088117	20/04/28 05:18:26
3	42	342.655506618386	259.3140878907529	20/04/28 05:18:26
3	42	342.9342971928054	259.2884637114955	20/04/28 05:18:26
3	42	342.8622508057991	259.0632337044408	20/04/28 05:18:26
3	42	342.82249431577446	259.01172487232225	20/04/28 05:18:26
3	42	342.7051110751354	258.83460441109867	20/04/28 05:18:26
3	42	342.72496944098236	259.1130716243898	20/04/28 05:18:26
3	42	342.7236833473862	259.16638508521	20/04/28 05:18:26
3	42	342.67894552095004	259.1687358027988	20/04/28 05:18:26
3	42	342.6759211681803	259.2248665849498	20/04/28 05:18:27
3	42	342.573441079358	259.350667806689	20/04/28 05:18:27
3	42	342.4468613460585	259.3369576889306	20/04/28 05:18:27
3	42	342.4486698430698	259.54914515592264	20/04/28 05:18:27
3	42	342.41831654069733	259.7143010637428	20/04/28 05:18:27
3	42	342.3567965395237	259.7050869579532	20/04/28 05:18:27
3	42	342.36069739248944	259.69765455576714	20/04/28 05:18:27
3	42	342.42872924120246	259.510213988323	20/04/28 05:18:27
3	42	342.5961433620106	259.55283680164456	20/04/28 05:18:27
3	42	342.5961433620106	259.55283680164456	20/04/28 05:18:28
3	42	342.5961433620106	259.55283680164456	20/04/28 05:18:28
3	42	342.58932337497487	259.5765617718065	20/04/28 05:18:28
3	42	342.5626152495738	259.32609097934073	20/04/28 05:18:28
3	42	342.4999694056238	259.5528332225012	20/04/28 05:18:28
3	42	342.4704363583861	259.66391781877337	20/04/28 05:18:28
3	42	342.39244004517093	259.6836665227162	20/04/28 05:18:28
3	42	342.44288045386776	259.5582379112296	20/04/28 05:18:28
3	42	342.44011996879635	259.3212817845352	20/04/28 05:18:28
3	42	342.2379204345314	259.234334387613	20/04/28 05:18:28
3	42	342.2404583246155	259.237530164689	20/04/28 05:18:29
3	42	342.3425959607623	259.3070119389805	20/04/28 05:18:29
3	42	342.14345470093764	259.3514057772989	20/04/28 05:18:29
3	42	341.8696192131321	259.31514441731156	20/04/28 05:18:29
3	42	341.7719557254752	259.24878941352	20/04/28 05:18:29
3	42	341.97602922847227	259.4387186874536	20/04/28 05:18:29
3	42	342.0376813168544	259.5963710001339	20/04/28 05:18:29
3	42	342.0683925938619	259.63859655237746	20/04/28 05:18:29
3	42	342.0293140814605	259.5500413994256	20/04/28 05:18:29
3	42	342.05044305272514	259.5708043951901	20/04/28 05:18:29
3	42	342.1387980775933	259.61844363682997	20/04/28 05:18:30
3	42	342.08922385796313	259.7733579424179	20/04/28 05:18:30
3	42	342.15216946167317	259.85770307232224	20/04/28 05:18:30
3	42	342.2492146674326	260.09309680567134	20/04/28 05:18:30
3	42	342.0585872142618	260.1132383329129	20/04/28 05:18:30
3	42	342.15388541437125	260.19572463545313	20/04/28 05:18:30
3	42	342.2275211477674	260.1007513780932	20/04/28 05:18:30
3	42	342.22512878691646	260.11036954979096	20/04/28 05:18:30
3	42	342.3944126994564	260.05889134598516	20/04/28 05:18:30
3	42	342.37130384043934	260.01233411033513	20/04/28 05:18:31
3	42	342.47591983807155	259.76029916061765	20/04/28 05:18:31
3	42	342.53574637630027	259.8408147391874	20/04/28 05:18:31
3	42	342.7155539443707	259.9626250667236	20/04/28 05:18:31
3	42	342.82437122262576	259.7933898273662	20/04/28 05:18:31
3	42	342.8237864777157	259.7824283804769	20/04/28 05:18:31
3	42	342.8284030104067	259.77186895634287	20/04/28 05:18:31
3	42	342.6658117103396	259.8966147721176	20/04/28 05:18:31
3	42	342.544498355422	259.79464936790754	20/04/28 05:18:31
3	42	342.32471644404467	259.9632682762456	20/04/28 05:18:31
3	42	342.32534063880587	259.96302502375084	20/04/28 05:18:32
3	42	342.2422604836098	259.7563090106778	20/04/28 05:18:32
3	42	342.1907670084607	259.76361437817906	20/04/28 05:18:32
3	42	341.9526401622609	259.8186638344922	20/04/28 05:18:32
3	42	342.0372984456955	259.6131858371297	20/04/28 05:18:32
3	42	342.22150661232234	259.55184435102456	20/04/28 05:18:32
3	42	342.2984792734558	259.50226611737475	20/04/28 05:18:32
3	42	342.17299035288795	259.4102708993742	20/04/28 05:18:32
3	42	341.8942981179978	259.50181839018745	20/04/28 05:18:32
3	42	341.9240318820877	259.37005638886507	20/04/28 05:18:32
3	42	341.92358567337214	259.3507256331744	20/04/28 05:18:33
3	42	341.9367633329567	259.393548425025	20/04/28 05:18:33
3	42	342.11765016338256	259.37232419022206	20/04/28 05:18:33
3	42	342.10413065428554	259.4480483311589	20/04/28 05:18:33
3	42	342.30889632755685	259.3456495048378	20/04/28 05:18:33
3	42	342.30074401202484	259.3234878932073	20/04/28 05:18:33
3	42	342.40111880843153	259.46019957787826	20/04/28 05:18:33
3	42	342.33952774910074	259.4323355295607	20/04/28 05:18:33
3	42	342.574377254631	259.59671573890097	20/04/28 05:18:33
3	42	342.62746026555783	259.5888657075012	20/04/28 05:18:34
3	42	342.67657473216485	259.7467574216999	20/04/28 05:18:34
3	42	342.5163627906918	259.9828674813546	20/04/28 05:18:34
3	42	342.684747414609	260.0722680392994	20/04/28 05:18:34
3	42	342.6200758961503	260.23823049030875	20/04/28 05:18:34
3	42	342.59592798321603	260.3243033793805	20/04/28 05:18:34
3	42	342.50240545037894	260.25596358244746	20/04/28 05:18:34
3	42	342.46101199023343	260.2936509197123	20/04/28 05:18:34
3	42	342.3843407740593	260.0569341299288	20/04/28 05:18:34
3	42	342.54811776773255	260.1316656107575	20/04/28 05:18:34
3	42	342.70611846918075	260.13774216128127	20/04/28 05:18:35
3	42	342.70340935278034	260.1401217588142	20/04/28 05:18:35
3	42	342.57922261095433	259.98870292573685	20/04/28 05:18:35
3	42	342.52281911595963	259.9931398812579	20/04/28 05:18:35
3	42	342.29904004158186	260.0652957114274	20/04/28 05:18:35
3	42	342.301476665772	259.96535689449496	20/04/28 05:18:35
3	42	342.4085292516328	259.6875520926978	20/04/28 05:18:35
3	42	342.6406762548584	259.7425963167534	20/04/28 05:18:35
3	42	342.85430428737084	259.698108299865	20/04/28 05:18:35
3	42	342.66831243037853	259.50867750799904	20/04/28 05:18:35
3	42	342.51481352496046	259.6964753032468	20/04/28 05:18:36
3	42	342.4312582659076	259.66064050303413	20/04/28 05:18:36
3	42	342.24980786987527	259.4528156246569	20/04/28 05:18:36
3	42	342.2279425849234	259.24691066787824	20/04/28 05:18:36
3	42	342.18732131546847	259.21745443659023	20/04/28 05:18:36
3	42	341.9378373624905	259.2251517840166	20/04/28 05:18:36
3	42	341.96769637756483	259.2882916569106	20/04/28 05:18:36
3	42	342.04118788890133	259.21755415704285	20/04/28 05:18:36
3	42	342.0311889465138	259.17265157302035	20/04/28 05:18:36
3	42	341.82549504106845	259.170929243909	20/04/28 05:18:37
3	42	341.8332297821611	259.2518401646454	20/04/28 05:18:37
3	42	341.67928728503324	259.19185846129966	20/04/28 05:18:37
3	42	341.8957502612331	259.18166537275613	20/04/28 05:18:37
3	42	341.7077196714669	259.39885555771133	20/04/28 05:18:37
3	42	341.66027642336275	259.304137934268	20/04/28 05:18:37
3	42	341.4452219821298	259.2401608649189	20/04/28 05:18:37
3	42	341.19290656056876	259.1695979634956	20/04/28 05:18:37
3	42	341.0796026310074	259.3632102114198	20/04/28 05:18:37
3	42	341.1988363553225	259.3824239982175	20/04/28 05:18:37
3	42	341.40795888120164	259.3884600616309	20/04/28 05:18:38
3	42	341.4795990050263	259.61104157573095	20/04/28 05:18:38
3	42	341.6628319632318	259.5618811189643	20/04/28 05:18:38
3	42	341.4660498580056	259.70335209019777	20/04/28 05:18:38
3	42	341.6553585895631	259.8378531605863	20/04/28 05:18:38
3	42	341.724887816703	259.8708725438707	20/04/28 05:18:38
3	42	341.7484596073623	260.0845663661362	20/04/28 05:18:38
3	42	341.69774664295824	260.11170701112644	20/04/28 05:18:38
3	42	341.5899631220623	260.14948960912363	20/04/28 05:18:38
3	42	341.56604319033585	260.01752054666434	20/04/28 05:18:38
3	42	341.38311093821784	260.2170813251516	20/04/28 05:18:39
3	42	341.6736213275691	260.2556776267946	20/04/28 05:18:39
3	42	341.69128829362586	260.3756910010763	20/04/28 05:18:39
3	42	341.7079127841858	260.34954103179	20/04/28 05:18:39
3	42	341.73967896002006	260.3598166999638	20/04/28 05:18:39
3	42	341.7714157140556	260.3657320917053	20/04/28 05:18:39
3	42	341.9052008398684	260.22525958793125	20/04/28 05:18:39
3	42	342.0183368863223	260.2819547399089	20/04/28 05:18:39
3	42	342.03017017251835	260.28390261168545	20/04/28 05:18:39
3	42	341.9246983263668	260.173644507634	20/04/28 05:18:40
3	42	341.86912665289384	260.2122790277285	20/04/28 05:18:40
3	42	341.88328831489355	260.1987804707774	20/04/28 05:18:40
3	42	341.8762300482958	260.20089912379274	20/04/28 05:18:40
3	42	341.9220226718067	260.1257087774892	20/04/28 05:18:40
3	42	342.14661730915014	260.1536620851838	20/04/28 05:18:40
3	42	342.0986429822976	260.1387009502014	20/04/28 05:18:40
3	42	341.9480336305858	260.07652292198867	20/04/28 05:18:40
3	42	341.93416001243503	260.1094221458924	20/04/28 05:18:40
3	42	342.0103662494911	260.2751246582532	20/04/28 05:18:40
3	42	342.03698359184796	260.267857562767	20/04/28 05:18:41
3	42	341.9963290314462	260.3457021889434	20/04/28 05:18:41
3	42	342.0116899833056	260.35459524576436	20/04/28 05:18:41
3	42	342.292322084655	260.36727072869223	20/04/28 05:18:41
3	42	342.292322084655	260.36727072869223	20/04/28 05:18:41
3	42	342.292322084655	260.36727072869223	20/04/28 05:18:41
3	42	342.292322084655	260.36727072869223	20/04/28 05:18:41
3	42	342.4969847972461	260.3721342001621	20/04/28 05:18:41
3	42	342.6812936139076	260.3765139948992	20/04/28 05:18:41
3	42	342.91702647199185	260.3821157970804	20/04/28 05:18:41
3	42	343.15934046035966	260.3878739889575	20/04/28 05:18:42
3	42	343.32760141171156	260.39187243267025	20/04/28 05:18:42
3	42	343.48999331226764	260.39573140808056	20/04/28 05:18:42
3	42	343.6409609947371	260.39931890580925	20/04/28 05:18:42
3	42	343.8928129171128	260.405303750941	20/04/28 05:18:42
3	42	344.0551555339216	260.40916155520443	20/04/28 05:18:42
3	42	344.3026550698025	260.41504297305687	20/04/28 05:18:42
3	42	344.52061004665643	260.42022231324165	20/04/28 05:18:42
3	42	344.72065805413706	260.42497612386336	20/04/28 05:18:42
3	42	345.00358490625985	260.43169941339636	20/04/28 05:18:42
3	42	345.23897396698044	260.43729304580086	20/04/28 05:18:43
3	42	345.5103690044191	260.4437423007967	20/04/28 05:18:43
3	42	345.70022809034265	260.4482539885194	20/04/28 05:18:43
3	42	345.88795398175745	260.45271498439644	20/04/28 05:18:43
3	42	346.07390291496307	260.45713375379535	20/04/28 05:18:43
3	42	346.2662840542114	260.4617053739514	20/04/28 05:18:43
3	42	346.4240885290056	260.46545533676226	20/04/28 05:18:43
3	42	346.6887664448672	260.47174497045376	20/04/28 05:18:43
3	42	346.9825151682749	260.4787254238911	20/04/28 05:18:43
3	42	347.25074420904997	260.4850994442033	20/04/28 05:18:44
3	42	347.5050216676441	260.4911419281988	20/04/28 05:18:44
3	42	347.7076652826251	260.49595741914743	20/04/28 05:18:44
3	42	348.00001967635455	260.50290473864203	20/04/28 05:18:44
3	42	348.2087907611994	260.5078658387957	20/04/28 05:18:44
3	42	348.482339238248	260.5143662667286	20/04/28 05:18:44
3	42	348.6788350074005	260.51903566427114	20/04/28 05:18:44
3	42	348.8710195894576	260.52360261357006	20/04/28 05:18:44
3	42	349.1547189426752	260.5303442603162	20/04/28 05:18:44
3	42	349.37011802230626	260.5354628638232	20/04/28 05:18:44
3	42	349.64005305858615	260.541877424302	20/04/28 05:18:45
3	42	349.85285967292987	260.5469344221516	20/04/28 05:18:45
3	42	350.0885426077144	260.55253503798804	20/04/28 05:18:45
3	42	350.33589687227897	260.55841300370747	20/04/28 05:18:45
3	42	350.51454252672113	260.5626582227442	20/04/28 05:18:45
3	42	350.76706259751694	260.56865894532007	20/04/28 05:18:45
3	42	351.05387661325716	260.5754746068788	20/04/28 05:18:45
3	42	351.2769389234435	260.5807753144081	20/04/28 05:18:45
3	42	351.4627704621108	260.5851912941196	20/04/28 05:18:45
3	15	351.6664269267659	260.5904330251875	20/04/28 05:18:45
3	15	351.90623001968953	260.5975454859205	20/04/28 05:18:46
3	15	352.0953298809923	260.60315410973647	20/04/28 05:18:46
3	15	352.3495388091819	260.61069384159595	20/04/28 05:18:46
3	15	352.3495388091819	260.61069384159595	20/04/28 05:18:46
3	15	352.5166079549769	260.6156490434854	20/04/28 05:18:46
3	15	353.0471844015962	260.63138572184266	20/04/28 05:18:46
3	15	353.0471844015962	260.63138572184266	20/04/28 05:18:46
3	15	353.5322224559622	260.6457717502863	20/04/28 05:18:46
3	15	353.72002997145927	260.65134204365927	20/04/28 05:18:46
3	15	353.8836770717645	260.6561957490923	20/04/28 05:18:47
3	15	354.0986080603645	260.6625705134795	20/04/28 05:18:47
3	15	354.3476578061818	260.66995722611983	20/04/28 05:18:47
3	15	354.54200398302476	260.6757214534888	20/04/28 05:18:47
3	15	354.54200398302476	260.6757214534888	20/04/28 05:18:47
3	15	354.6996528320393	260.6803972532649	20/04/28 05:18:47
3	15	354.96461605957745	260.6882559532031	20/04/28 05:18:47
3	15	355.23977666919166	260.6964171032837	20/04/28 05:18:47
3	15	355.5228048479631	260.7048116022173	20/04/28 05:18:47
3	15	355.77789383051424	260.71237743612585	20/04/28 05:18:47
3	15	356.0451716814676	260.72030478683894	20/04/28 05:18:48
3	15	356.2960488130205	260.7277456989857	20/04/28 05:18:48
3	15	356.5285100635041	260.734640403703	20/04/28 05:18:48
3	15	356.80060234843216	260.7427105485402	20/04/28 05:18:48
3	15	356.95158475467565	260.747188624376	20/04/28 05:18:48
3	15	357.2156834079287	260.75502168139786	20/04/28 05:18:48
3	15	357.4731322724167	260.7626575084303	20/04/28 05:18:48
3	15	357.72766652461706	260.77020688926564	20/04/28 05:18:48
3	15	357.9713858973801	260.7774355052418	20/04/28 05:18:48
3	15	358.14234153319967	260.78250597882084	20/04/28 05:18:48
3	15	358.37226496411455	260.78932541285747	20/04/28 05:18:49
