floorId	partitionId	location_x	location_y	timeStamp
3	18	323.08282049270593	267.37542903932564	20/04/28 05:17:35
3	18	322.99113575264545	265.5352298501222	20/04/28 05:17:36
3	18	323.08282049270593	267.37542903932564	20/04/28 05:17:37
3	18	323.08282049270593	267.37542903932564	20/04/28 05:17:38
3	18	322.99113575264545	265.5352298501222	20/04/28 05:17:39
3	18	322.99113575264545	265.5352298501222	20/04/28 05:17:40
3	18	322.99113575264545	265.5352298501222	20/04/28 05:17:41
3	18	322.99113575264545	265.5352298501222	20/04/28 05:17:42
3	14	325.7144978820088	266.8660387296905	20/04/28 05:17:43
3	18	322.99113575264545	265.5352298501222	20/04/28 05:17:44
3	18	322.99113575264545	265.5352298501222	20/04/28 05:17:45
3	18	323.08282049270593	267.37542903932564	20/04/28 05:17:46
3	18	322.99113575264545	265.5352298501222	20/04/28 05:17:47
3	18	323.5974156050991	264.28862562276623	20/04/28 05:17:48
3	18	323.5974156050991	264.28862562276623	20/04/28 05:17:49
3	18	323.5974156050991	264.28862562276623	20/04/28 05:17:50
3	18	322.99113575264545	265.5352298501222	20/04/28 05:17:51
3	18	322.99113575264545	265.5352298501222	20/04/28 05:17:52
3	18	322.99113575264545	265.5352298501222	20/04/28 05:17:53
3	18	322.99113575264545	265.5352298501222	20/04/28 05:17:54
3	18	323.08282049270593	267.37542903932564	20/04/28 05:17:55
3	18	322.99113575264545	265.5352298501222	20/04/28 05:17:56
3	18	322.99113575264545	265.5352298501222	20/04/28 05:17:57
3	NULL	326.2677253743927	264.00631997709723	20/04/28 05:17:58
3	28	332.6477860802388	265.03642994070896	20/04/28 05:17:59
3	28	332.6477860802388	265.03642994070896	20/04/28 05:18:00
3	54	334.4407240787428	261.4032786809491	20/04/28 05:18:01
3	54	334.4407240787428	261.4032786809491	20/04/28 05:18:02
3	NULL	337.70753542622793	260.45953294809686	20/04/28 05:18:03
3	NULL	337.7075354262279	260.45953294809675	20/04/28 05:18:04
3	42	343.19179870246967	259.9647561276533	20/04/28 05:18:05
1	22	345.98250818917177	261.859258749847	20/04/28 05:18:06
3	54	348.7578251252085	261.67124498353854	20/04/28 05:18:07
3	54	350.89456573837674	262.47535273189357	20/04/28 05:18:08
3	54	350.89456573837674	262.47535273189357	20/04/28 05:18:09
3	54	352.40431689349754	263.755838935119	20/04/28 05:18:10
3	54	354.93110780732565	263.85962413987545	20/04/28 05:18:11
3	8	357.87501606482897	266.0533751351783	20/04/28 05:18:12
3	8	357.87501606482897	266.0533751351783	20/04/28 05:18:13
3	8	357.8750160648289	266.0533751351783	20/04/28 05:18:14
3	46	361.61703194828846	264.17422801455785	20/04/28 05:18:15
3	46	364.87612750160434	266.4744296840007	20/04/28 05:18:16
3	46	368.31727752533806	266.1301521552222	20/04/28 05:18:17
3	54	372.48785670166836	262.3595943162643	20/04/28 05:18:18
3	54	372.48785670166836	262.3595943162643	20/04/28 05:18:19
3	54	372.48785670166836	262.3595943162643	20/04/28 05:18:20
3	54	376.18269094789457	263.03655301878126	20/04/28 05:18:21
3	15	378.8796771581538	263.378721128207	20/04/28 05:18:22
3	15	380.97239583354167	266.94453563659977	20/04/28 05:18:23
3	15	380.97239583354167	266.94453563659977	20/04/28 05:18:24
1	33	381.6109766893215	266.73786054806715	20/04/28 05:18:25
1	33	381.6109766893215	266.73786054806715	20/04/28 05:18:26
1	69	376.3565651967492	261.56244682705545	20/04/28 05:18:27
3	54	372.48785670166836	262.3595943162643	20/04/28 05:18:28
1	69	372.48785670166836	262.35959431626424	20/04/28 05:18:29
1	69	372.48785670166836	262.35959431626424	20/04/28 05:18:30
3	54	372.48785670166836	262.3595943162643	20/04/28 05:18:31
3	57	370.34327192275146	259.17169111288626	20/04/28 05:18:32
3	57	370.34327192275146	259.17169111288626	20/04/28 05:18:33
3	57	370.51908075392413	258.76896591843035	20/04/28 05:18:34
3	57	370.34327192275146	259.17169111288626	20/04/28 05:18:35
3	57	372.1191876279541	254.90991466941398	20/04/28 05:18:36
3	57	370.34327192275146	259.17169111288626	20/04/28 05:18:37
3	57	369.6413500560468	258.57074489261345	20/04/28 05:18:38
1	69	368.9169651830857	261.6578217243062	20/04/28 05:18:39
1	69	357.38882019700463	252.59744162104838	20/04/28 05:18:40
3	57	370.34327192275146	259.17169111288626	20/04/28 05:18:41
3	57	370.34327192275146	259.17169111288626	20/04/28 05:18:42
3	57	374.0879635756983	258.5005430672479	20/04/28 05:18:43
3	57	374.0879635756983	258.5005430672479	20/04/28 05:18:44
3	57	370.51908075392413	258.7689659184304	20/04/28 05:18:45
3	57	370.34327192275146	259.17169111288626	20/04/28 05:18:46
3	57	365.6578696297699	259.3576200548633	20/04/28 05:18:47
3	34	361.2642468288334	255.55936173685845	20/04/28 05:18:48
