stationId	t_start	t_end	t_max	timeStamp
8	20/04/28 05:08:49	20/04/28 05:08:49	20/04/28 05:08:49
121	20/04/28 05:08:51	20/04/28 05:08:51	20/04/28 05:08:51
3	20/04/28 05:08:53	20/04/28 05:08:53	20/04/28 05:08:53
4	20/04/28 05:08:55	20/04/28 05:08:55	20/04/28 05:08:55
161	20/04/28 05:08:57	20/04/28 05:08:57	20/04/28 05:08:57
161	20/04/28 05:08:59	20/04/28 05:08:59	20/04/28 05:08:59
44	20/04/28 05:09:01	20/04/28 05:09:02	20/04/28 05:09:02
3	20/04/28 05:09:04	20/04/28 05:09:04	20/04/28 05:09:04
3	20/04/28 05:09:06	20/04/28 05:09:06	20/04/28 05:09:06
9	20/04/28 05:09:08	20/04/28 05:09:08	20/04/28 05:09:08
161	20/04/28 05:09:10	20/04/28 05:09:10	20/04/28 05:09:10
3	20/04/28 05:09:12	20/04/28 05:09:12	20/04/28 05:09:12
121	20/04/28 05:09:14	20/04/28 05:09:14	20/04/28 05:09:14
45	20/04/28 05:09:16	20/04/28 05:09:16	20/04/28 05:09:16
161	20/04/28 05:09:18	20/04/28 05:09:18	20/04/28 05:09:18
64	20/04/28 05:09:20	20/04/28 05:09:20	20/04/28 05:09:20
8	20/04/28 05:09:22	20/04/28 05:09:22	20/04/28 05:09:22
64	20/04/28 05:09:24	20/04/28 05:09:24	20/04/28 05:09:24
161	20/04/28 05:09:26	20/04/28 05:09:26	20/04/28 05:09:26
4	20/04/28 05:09:28	20/04/28 05:09:28	20/04/28 05:09:28
63	20/04/28 05:09:30	20/04/28 05:09:30	20/04/28 05:09:30
63	20/04/28 05:09:32	20/04/28 05:09:32	20/04/28 05:09:32
63	20/04/28 05:09:34	20/04/28 05:09:34	20/04/28 05:09:34
63	20/04/28 05:09:36	20/04/28 05:09:36	20/04/28 05:09:36
63	20/04/28 05:09:38	20/04/28 05:09:38	20/04/28 05:09:38
56	20/04/28 05:09:40	20/04/28 05:09:40	20/04/28 05:09:40
56	20/04/28 05:09:42	20/04/28 05:09:42	20/04/28 05:09:42
63	20/04/28 05:09:44	20/04/28 05:09:45	20/04/28 05:09:45
56	20/04/28 05:09:47	20/04/28 05:09:47	20/04/28 05:09:47
46	20/04/28 05:09:49	20/04/28 05:09:49	20/04/28 05:09:49
85	20/04/28 05:09:51	20/04/28 05:09:51	20/04/28 05:09:51
85	20/04/28 05:09:53	20/04/28 05:09:53	20/04/28 05:09:53
136	20/04/28 05:09:55	20/04/28 05:09:55	20/04/28 05:09:55
37	20/04/28 05:09:57	20/04/28 05:09:58	20/04/28 05:09:58
136	20/04/28 05:10:00	20/04/28 05:10:01	20/04/28 05:10:01
76	20/04/28 05:10:03	20/04/28 05:10:03	20/04/28 05:10:03
37	20/04/28 05:10:05	20/04/28 05:10:05	20/04/28 05:10:05
63	20/04/28 05:10:07	20/04/28 05:10:08	20/04/28 05:10:08
37	20/04/28 05:10:10	20/04/28 05:10:10	20/04/28 05:10:10
136	20/04/28 05:10:12	20/04/28 05:10:12	20/04/28 05:10:12
47	20/04/28 05:10:14	20/04/28 05:10:14	20/04/28 05:10:14
76	20/04/28 05:10:16	20/04/28 05:10:16	20/04/28 05:10:16
85	20/04/28 05:10:18	20/04/28 05:10:18	20/04/28 05:10:18
37	20/04/28 05:10:20	20/04/28 05:10:20	20/04/28 05:10:20
46	20/04/28 05:10:22	20/04/28 05:10:22	20/04/28 05:10:22
63	20/04/28 05:10:24	20/04/28 05:10:24	20/04/28 05:10:24
63	20/04/28 05:10:26	20/04/28 05:10:26	20/04/28 05:10:26
64	20/04/28 05:10:28	20/04/28 05:10:28	20/04/28 05:10:28
38	20/04/28 05:10:30	20/04/28 05:10:30	20/04/28 05:10:30
13	20/04/28 05:10:32	20/04/28 05:10:32	20/04/28 05:10:32
85	20/04/28 05:10:34	20/04/28 05:10:35	20/04/28 05:10:35
40	20/04/28 05:10:37	20/04/28 05:10:37	20/04/28 05:10:37
64	20/04/28 05:10:39	20/04/28 05:10:39	20/04/28 05:10:39
13	20/04/28 05:10:41	20/04/28 05:10:41	20/04/28 05:10:41
63	20/04/28 05:10:43	20/04/28 05:10:43	20/04/28 05:10:43
38	20/04/28 05:10:45	20/04/28 05:10:45	20/04/28 05:10:45
63	20/04/28 05:10:47	20/04/28 05:10:48	20/04/28 05:10:48
13	20/04/28 05:10:50	20/04/28 05:10:50	20/04/28 05:10:50
70	20/04/28 05:10:52	20/04/28 05:10:52	20/04/28 05:10:52
46	20/04/28 05:10:54	20/04/28 05:10:54	20/04/28 05:10:54
85	20/04/28 05:10:56	20/04/28 05:10:56	20/04/28 05:10:56
