stationId	t_start	t_end	t_max	timeStamp
77	20/04/28 05:09:57	20/04/28 05:09:57	20/04/28 05:09:57
63	20/04/28 05:09:59	20/04/28 05:09:59	20/04/28 05:09:59
109	20/04/28 05:10:01	20/04/28 05:10:01	20/04/28 05:10:01
77	20/04/28 05:10:03	20/04/28 05:10:03	20/04/28 05:10:03
77	20/04/28 05:10:05	20/04/28 05:10:05	20/04/28 05:10:05
13	20/04/28 05:10:07	20/04/28 05:10:08	20/04/28 05:10:08
160	20/04/28 05:10:10	20/04/28 05:10:10	20/04/28 05:10:10
160	20/04/28 05:10:12	20/04/28 05:10:12	20/04/28 05:10:12
160	20/04/28 05:10:14	20/04/28 05:10:14	20/04/28 05:10:14
77	20/04/28 05:10:16	20/04/28 05:10:16	20/04/28 05:10:16
160	20/04/28 05:10:18	20/04/28 05:10:20	20/04/28 05:10:20
160	20/04/28 05:10:22	20/04/28 05:10:22	20/04/28 05:10:22
40	20/04/28 05:10:24	20/04/28 05:10:24	20/04/28 05:10:24
47	20/04/28 05:10:26	20/04/28 05:10:26	20/04/28 05:10:26
140	20/04/28 05:10:28	20/04/28 05:10:28	20/04/28 05:10:28
85	20/04/28 05:10:30	20/04/28 05:10:30	20/04/28 05:10:30
47	20/04/28 05:10:32	20/04/28 05:10:32	20/04/28 05:10:32
85	20/04/28 05:10:34	20/04/28 05:10:34	20/04/28 05:10:34
78	20/04/28 05:10:36	20/04/28 05:10:36	20/04/28 05:10:36
13	20/04/28 05:10:38	20/04/28 05:10:38	20/04/28 05:10:38
85	20/04/28 05:10:40	20/04/28 05:10:41	20/04/28 05:10:41
70	20/04/28 05:10:43	20/04/28 05:10:43	20/04/28 05:10:43
78	20/04/28 05:10:45	20/04/28 05:10:45	20/04/28 05:10:45
78	20/04/28 05:10:47	20/04/28 05:10:47	20/04/28 05:10:47
13	20/04/28 05:10:49	20/04/28 05:10:49	20/04/28 05:10:49
56	20/04/28 05:10:51	20/04/28 05:10:51	20/04/28 05:10:51
78	20/04/28 05:10:53	20/04/28 05:10:53	20/04/28 05:10:53
56	20/04/28 05:10:55	20/04/28 05:10:57	20/04/28 05:10:57
63	20/04/28 05:10:59	20/04/28 05:10:59	20/04/28 05:10:59
70	20/04/28 05:11:01	20/04/28 05:11:01	20/04/28 05:11:01
56	20/04/28 05:11:03	20/04/28 05:11:03	20/04/28 05:11:03
46	20/04/28 05:11:05	20/04/28 05:11:05	20/04/28 05:11:05
47	20/04/28 05:11:07	20/04/28 05:11:07	20/04/28 05:11:07
63	20/04/28 05:11:09	20/04/28 05:11:09	20/04/28 05:11:09
70	20/04/28 05:11:11	20/04/28 05:11:11	20/04/28 05:11:11
37	20/04/28 05:11:13	20/04/28 05:11:13	20/04/28 05:11:13
63	20/04/28 05:11:15	20/04/28 05:11:15	20/04/28 05:11:15
40	20/04/28 05:11:17	20/04/28 05:11:17	20/04/28 05:11:17
47	20/04/28 05:11:19	20/04/28 05:11:19	20/04/28 05:11:19
70	20/04/28 05:11:21	20/04/28 05:11:21	20/04/28 05:11:21
56	20/04/28 05:11:23	20/04/28 05:11:23	20/04/28 05:11:23
13	20/04/28 05:11:25	20/04/28 05:11:25	20/04/28 05:11:25
56	20/04/28 05:11:27	20/04/28 05:11:27	20/04/28 05:11:27
38	20/04/28 05:11:29	20/04/28 05:11:29	20/04/28 05:11:29
78	20/04/28 05:11:31	20/04/28 05:11:31	20/04/28 05:11:31
38	20/04/28 05:11:33	20/04/28 05:11:33	20/04/28 05:11:33
56	20/04/28 05:11:35	20/04/28 05:15:26	20/04/28 05:11:36
70	20/04/28 05:11:38	20/04/28 05:11:38	20/04/28 05:11:38
56	20/04/28 05:11:40	20/04/28 05:11:40	20/04/28 05:11:40
78	20/04/28 05:11:42	20/04/28 05:11:42	20/04/28 05:11:42
63	20/04/28 05:11:44	20/04/28 05:11:44	20/04/28 05:11:44
47	20/04/28 05:11:46	20/04/28 05:11:46	20/04/28 05:11:46
13	20/04/28 05:11:48	20/04/28 05:11:48	20/04/28 05:11:48
70	20/04/28 05:11:50	20/04/28 05:11:50	20/04/28 05:14:39
63	20/04/28 05:11:52	20/04/28 05:11:52	20/04/28 05:11:52
159	20/04/28 05:11:54	20/04/28 05:11:54	20/04/28 05:11:54
13	20/04/28 05:11:56	20/04/28 05:11:56	20/04/28 05:11:56
85	20/04/28 05:11:58	20/04/28 05:11:58	20/04/28 05:11:58
85	20/04/28 05:12:00	20/04/28 05:12:02	20/04/28 05:12:02
85	20/04/28 05:12:04	20/04/28 05:12:04	20/04/28 05:12:04
70	20/04/28 05:12:06	20/04/28 05:12:06	20/04/28 05:12:06
140	20/04/28 05:12:08	20/04/28 05:12:08	20/04/28 05:12:08
160	20/04/28 05:12:10	20/04/28 05:12:10	20/04/28 05:12:10
140	20/04/28 05:12:13	20/04/28 05:12:13	20/04/28 05:12:13
159	20/04/28 05:12:15	20/04/28 05:12:15	20/04/28 05:12:15
13	20/04/28 05:12:17	20/04/28 05:12:17	20/04/28 05:12:17
140	20/04/28 05:12:19	20/04/28 05:12:19	20/04/28 05:12:19
70	20/04/28 05:12:21	20/04/28 05:12:21	20/04/28 05:12:21
70	20/04/28 05:12:23	20/04/28 05:12:23	20/04/28 05:12:23
70	20/04/28 05:12:25	20/04/28 05:12:26	20/04/28 05:12:26
140	20/04/28 05:12:28	20/04/28 05:12:28	20/04/28 05:12:28
63	20/04/28 05:12:30	20/04/28 05:12:30	20/04/28 05:12:30
70	20/04/28 05:12:32	20/04/28 05:12:32	20/04/28 05:12:32
109	20/04/28 05:12:34	20/04/28 05:12:34	20/04/28 05:12:34
160	20/04/28 05:12:36	20/04/28 05:12:36	20/04/28 05:12:36
77	20/04/28 05:12:38	20/04/28 05:12:39	20/04/28 05:12:39
140	20/04/28 05:12:41	20/04/28 05:12:42	20/04/28 05:12:42
109	20/04/28 05:12:44	20/04/28 05:12:44	20/04/28 05:12:44
160	20/04/28 05:12:46	20/04/28 05:12:46	20/04/28 05:12:46
112	20/04/28 05:12:48	20/04/28 05:12:48	20/04/28 05:12:48
12	20/04/28 05:12:50	20/04/28 05:12:50	20/04/28 05:12:50
112	20/04/28 05:12:52	20/04/28 05:12:52	20/04/28 05:12:52
109	20/04/28 05:12:54	20/04/28 05:12:55	20/04/28 05:12:55
129	20/04/28 05:12:57	20/04/28 05:12:57	20/04/28 05:12:57
112	20/04/28 05:12:59	20/04/28 05:12:59	20/04/28 05:12:59
64	20/04/28 05:13:01	20/04/28 05:13:01	20/04/28 05:13:01
2	20/04/28 05:13:03	20/04/28 05:13:03	20/04/28 05:13:03
160	20/04/28 05:13:05	20/04/28 05:13:06	20/04/28 05:13:05
129	20/04/28 05:13:08	20/04/28 05:13:08	20/04/28 05:13:08
129	20/04/28 05:13:10	20/04/28 05:13:10	20/04/28 05:13:10
160	20/04/28 05:13:12	20/04/28 05:13:12	20/04/28 05:13:12
109	20/04/28 05:13:14	20/04/28 05:13:14	20/04/28 05:13:14
108	20/04/28 05:13:16	20/04/28 05:13:16	20/04/28 05:13:16
