stationId	t_start	t_end	t_max	timeStamp
48	20/04/28 05:11:19	20/04/28 05:11:19	20/04/28 05:11:19
77	20/04/28 05:11:21	20/04/28 05:11:21	20/04/28 05:11:21
46	20/04/28 05:11:23	20/04/28 05:11:23	20/04/28 05:11:23
84	20/04/28 05:11:25	20/04/28 05:11:25	20/04/28 05:11:25
84	20/04/28 05:11:27	20/04/28 05:11:29	20/04/28 05:11:28
56	20/04/28 05:11:31	20/04/28 05:11:31	20/04/28 05:11:31
141	20/04/28 05:11:33	20/04/28 05:11:33	20/04/28 05:11:33
44	20/04/28 05:11:35	20/04/28 05:11:35	20/04/28 05:11:35
141	20/04/28 05:11:37	20/04/28 05:11:37	20/04/28 05:11:37
126	20/04/28 05:11:39	20/04/28 05:11:39	20/04/28 05:11:39
44	20/04/28 05:11:41	20/04/28 05:11:41	20/04/28 05:11:41
49	20/04/28 05:11:43	20/04/28 05:11:43	20/04/28 05:11:43
49	20/04/28 05:11:45	20/04/28 05:11:45	20/04/28 05:11:45
47	20/04/28 05:11:47	20/04/28 05:11:48	20/04/28 05:11:48
77	20/04/28 05:11:50	20/04/28 05:11:51	20/04/28 05:14:47
78	20/04/28 05:11:53	20/04/28 05:11:53	20/04/28 05:11:53
33	20/04/28 05:11:55	20/04/28 05:11:55	20/04/28 05:11:55
85	20/04/28 05:11:57	20/04/28 05:11:57	20/04/28 05:11:57
126	20/04/28 05:11:59	20/04/28 05:11:59	20/04/28 05:11:59
29	20/04/28 05:12:02	20/04/28 05:12:03	20/04/28 05:12:03
77	20/04/28 05:12:05	20/04/28 05:12:05	20/04/28 05:12:05
85	20/04/28 05:12:24	20/04/28 05:12:09	20/04/28 05:12:09
85	20/04/28 05:12:11	20/04/28 05:12:11	20/04/28 05:12:11
78	20/04/28 05:12:13	20/04/28 05:12:14	20/04/28 05:12:14
78	20/04/28 05:12:16	20/04/28 05:12:16	20/04/28 05:12:16
85	20/04/28 05:12:18	20/04/28 05:12:19	20/04/28 05:12:19
47	20/04/28 05:12:21	20/04/28 05:12:21	20/04/28 05:12:21
160	20/04/28 05:12:23	20/04/28 05:12:23	20/04/28 05:12:23
85	20/04/28 05:12:25	20/04/28 05:12:25	20/04/28 05:12:25
37	20/04/28 05:12:27	20/04/28 05:12:27	20/04/28 05:12:27
85	20/04/28 05:12:29	20/04/28 05:12:29	20/04/28 05:12:29
85	20/04/28 05:15:49	20/04/28 05:12:31	20/04/28 05:12:31
70	20/04/28 05:12:33	20/04/28 05:12:33	20/04/28 05:12:33
70	20/04/28 05:12:35	20/04/28 05:12:35	20/04/28 05:12:35
140	20/04/28 05:12:37	20/04/28 05:12:38	20/04/28 05:12:38
47	20/04/28 05:12:40	20/04/28 05:12:40	20/04/28 05:12:40
76	20/04/28 05:12:42	20/04/28 05:12:42	20/04/28 05:12:42
56	20/04/28 05:12:44	20/04/28 05:12:44	20/04/28 05:12:44
76	20/04/28 05:12:46	20/04/28 05:12:46	20/04/28 05:12:46
76	20/04/28 05:12:48	20/04/28 05:12:48	20/04/28 05:12:48
70	20/04/28 05:12:50	20/04/28 05:12:50	20/04/28 05:12:50
