floorId	partitionId	location_x	location_y	timeStamp
19	937	375.3069192384801	278.526579341296	21/02/21 12:25:07
19	937	375.3069192384801	278.526579341296	21/02/21 12:25:08
19	990	377.53406484850603	282.0682559955897	21/02/21 12:25:09
19	990	377.53406484850603	282.0682559955897	21/02/21 12:25:10
19	937	373.9025762518031	279.2932613585551	21/02/21 12:25:11
19	937	373.90257625180317	279.2932613585551	21/02/21 12:25:12
19	990	369.3697686233802	281.9000383871016	21/02/21 12:25:13
19	990	369.36976862338014	281.9000383871016	21/02/21 12:25:14
19	990	364.8554360955142	278.53407260132843	21/02/21 12:25:15
19	990	364.8554360955142	278.53407260132843	21/02/21 12:25:16
19	990	360.7696344530844	281.71047019619976	21/02/21 12:25:17
19	990	360.7696344530844	281.71047019619976	21/02/21 12:25:18
19	964	356.2347098348241	282.1892423922322	21/02/21 12:25:19
19	990	360.7696344530844	281.71047019619976	21/02/21 12:25:20
19	954	353.50966239774925	278.7343482092214	21/02/21 12:25:21
19	954	353.50966239774925	278.7343482092214	21/02/21 12:25:22
19	946	348.3933779365746	276.25566046828567	21/02/21 12:25:23
19	946	348.3933779365746	276.2556604682856	21/02/21 12:25:24
19	964	342.4775564324098	276.1752949727016	21/02/21 12:25:25
19	964	343.44367231207883	275.15890443585744	21/02/21 12:25:26
19	NULL	339.53717683545176	273.7210898699794	21/02/21 12:25:27
19	NULL	339.53717683545176	273.7210898699794	21/02/21 12:25:28
