stationId	t_start	t_end	t_max	timeStamp
55	20/04/28 05:16:30	20/04/28 05:16:30	20/04/28 05:16:30
3	20/04/28 05:16:45	20/04/28 05:16:45	20/04/28 05:16:45
121	20/04/28 05:16:47	20/04/28 05:16:48	20/04/28 05:16:48
8	20/04/28 05:16:50	20/04/28 05:16:51	20/04/28 05:16:50
22	20/04/28 05:16:53	20/04/28 05:16:53	20/04/28 05:16:53
56	20/04/28 05:16:55	20/04/28 05:16:55	20/04/28 05:16:55
132	20/04/28 05:16:57	20/04/28 05:16:57	20/04/28 05:16:57
132	20/04/28 05:16:59	20/04/28 05:16:59	20/04/28 05:16:59
56	20/04/28 05:17:01	20/04/28 05:17:01	20/04/28 05:17:01
110	20/04/28 05:17:03	20/04/28 05:17:03	20/04/28 05:17:03
3	20/04/28 05:17:05	20/04/28 05:17:05	20/04/28 05:17:05
110	20/04/28 05:17:08	20/04/28 05:17:08	20/04/28 05:17:08
121	20/04/28 05:18:03	20/04/28 05:17:10	20/04/28 05:17:10
3	20/04/28 05:17:12	20/04/28 05:17:12	20/04/28 05:17:12
3	20/04/28 05:17:14	20/04/28 05:17:14	20/04/28 05:17:14
56	20/04/28 05:17:16	20/04/28 05:17:17	20/04/28 05:17:17
55	20/04/28 05:17:19	20/04/28 05:17:19	20/04/28 05:17:19
22	20/04/28 05:17:21	20/04/28 05:17:21	20/04/28 05:17:21
56	20/04/28 05:17:23	20/04/28 05:17:23	20/04/28 05:17:23
132	20/04/28 05:17:25	20/04/28 05:17:25	20/04/28 05:17:25
110	20/04/28 05:17:27	20/04/28 05:17:27	20/04/28 05:17:27
56	20/04/28 05:17:29	20/04/28 05:17:29	20/04/28 05:17:29
8	20/04/28 05:17:31	20/04/28 05:17:31	20/04/28 05:17:31
132	20/04/28 05:17:33	20/04/28 05:17:33	20/04/28 05:17:33
22	20/04/28 05:17:35	20/04/28 05:17:35	20/04/28 05:17:35
8	20/04/28 05:17:37	20/04/28 05:17:38	20/04/28 05:17:38
56	20/04/28 05:17:40	20/04/28 05:17:41	20/04/28 05:17:41
56	20/04/28 05:17:43	20/04/28 05:17:44	20/04/28 05:17:43
132	20/04/28 05:17:46	20/04/28 05:17:46	20/04/28 05:17:46
22	20/04/28 05:17:48	20/04/28 05:17:48	20/04/28 05:17:48
110	20/04/28 05:17:50	20/04/28 05:17:50	20/04/28 05:17:50
55	20/04/28 05:17:52	20/04/28 05:17:52	20/04/28 05:17:52
55	20/04/28 05:17:54	20/04/28 05:17:54	20/04/28 05:17:54
55	20/04/28 05:17:56	20/04/28 05:17:56	20/04/28 05:17:56
56	20/04/28 05:17:58	20/04/28 05:17:58	20/04/28 05:17:58
110	20/04/28 05:18:00	20/04/28 05:18:00	20/04/28 05:18:00
132	20/04/28 05:18:02	20/04/28 05:18:02	20/04/28 05:18:02
56	20/04/28 05:18:04	20/04/28 05:18:04	20/04/28 05:18:04
3	20/04/28 05:18:06	20/04/28 05:18:06	20/04/28 05:18:06
3	20/04/28 05:18:08	20/04/28 05:18:08	20/04/28 05:18:08
56	20/04/28 05:18:10	20/04/28 05:18:11	20/04/28 05:18:10
110	20/04/28 05:18:13	20/04/28 05:18:13	20/04/28 05:18:13
3	20/04/28 05:18:15	20/04/28 05:18:15	20/04/28 05:18:15
8	20/04/28 05:18:17	20/04/28 05:18:17	20/04/28 05:18:17
22	20/04/28 05:18:19	20/04/28 05:18:19	20/04/28 05:18:19
132	20/04/28 05:18:21	20/04/28 05:18:21	20/04/28 05:18:21
3	20/04/28 05:18:23	20/04/28 05:18:23	20/04/28 05:18:23
22	20/04/28 05:18:25	20/04/28 05:18:25	20/04/28 05:18:25
22	20/04/28 05:18:27	20/04/28 05:18:27	20/04/28 05:18:27
8	20/04/28 05:18:29	20/04/28 05:18:29	20/04/28 05:12:08
121	20/04/28 05:18:31	20/04/28 05:18:31	20/04/28 05:18:31
132	20/04/28 05:18:33	20/04/28 05:18:33	20/04/28 05:18:33
3	20/04/28 05:18:35	20/04/28 05:18:35	20/04/28 05:18:35
3	20/04/28 05:18:37	20/04/28 05:18:38	20/04/28 05:18:38
3	20/04/28 05:18:40	20/04/28 05:18:41	20/04/28 05:18:40
121	20/04/28 05:18:43	20/04/28 05:18:43	20/04/28 05:18:43
3	20/04/28 05:18:45	20/04/28 05:18:45	20/04/28 05:18:45
3	20/04/28 05:18:47	20/04/28 05:18:47	20/04/28 05:18:47
