stationId	t_start	t_end	t_max	timeStamp
150	20/04/28 05:08:49	20/04/28 05:08:49	20/04/28 05:08:49
39	20/04/28 05:08:51	20/04/28 05:08:51	20/04/28 05:08:51
4	20/04/28 05:08:53	20/04/28 05:08:53	20/04/28 05:08:53
30	20/04/28 05:08:55	20/04/28 05:08:55	20/04/28 05:08:55
39	20/04/28 05:08:57	20/04/28 05:08:57	20/04/28 05:08:57
78	20/04/28 05:08:59	20/04/28 05:08:59	20/04/28 05:08:59
3	20/04/28 05:09:01	20/04/28 05:09:01	20/04/28 05:09:01
39	20/04/28 05:09:03	20/04/28 05:09:03	20/04/28 05:09:03
3	20/04/28 05:09:05	20/04/28 05:09:05	20/04/28 05:09:05
54	20/04/28 05:09:07	20/04/28 05:09:07	20/04/28 05:09:07
111	20/04/28 05:09:09	20/04/28 05:09:10	20/04/28 05:09:09
45	20/04/28 05:09:12	20/04/28 05:09:13	20/04/28 05:09:12
33	20/04/28 05:09:15	20/04/28 05:09:16	20/04/28 05:09:16
56	20/04/28 05:09:18	20/04/28 05:09:18	20/04/28 05:09:18
83	20/04/28 05:09:20	20/04/28 05:09:20	20/04/28 05:09:20
155	20/04/28 05:09:22	20/04/28 05:09:22	20/04/28 05:09:22
111	20/04/28 05:09:24	20/04/28 05:09:24	20/04/28 05:09:24
106	20/04/28 05:09:26	20/04/28 05:09:26	20/04/28 05:09:26
130	20/04/28 05:09:28	20/04/28 05:09:28	20/04/28 05:09:28
3	20/04/28 05:09:30	20/04/28 05:09:30	20/04/28 05:09:30
43	20/04/28 05:09:32	20/04/28 05:09:32	20/04/28 05:09:32
151	20/04/28 05:09:34	20/04/28 05:09:34	20/04/28 05:09:34
70	20/04/28 05:09:36	20/04/28 05:09:36	20/04/28 05:09:36
109	20/04/28 05:09:38	20/04/28 05:09:38	20/04/28 05:09:38
85	20/04/28 05:09:40	20/04/28 05:09:40	20/04/28 05:09:40
2	20/04/28 05:09:42	20/04/28 05:09:42	20/04/28 05:09:42
15	20/04/28 05:09:44	20/04/28 05:09:44	20/04/28 05:09:44
74	20/04/28 05:09:46	20/04/28 05:09:46	20/04/28 05:09:46
74	20/04/28 05:09:48	20/04/28 05:09:48	20/04/28 05:09:48
21	20/04/28 05:09:50	20/04/28 05:09:50	20/04/28 05:09:50
143	20/04/28 05:09:52	20/04/28 05:09:52	20/04/28 05:09:52
75	20/04/28 05:09:54	20/04/28 05:09:54	20/04/28 05:09:54
143	20/04/28 05:09:56	20/04/28 05:09:56	20/04/28 05:09:56
150	20/04/28 05:09:58	20/04/28 05:09:58	20/04/28 05:09:58
150	20/04/28 05:10:00	20/04/28 05:10:01	20/04/28 05:10:01
133	20/04/28 05:10:03	20/04/28 05:10:03	20/04/28 05:10:03
22	20/04/28 05:10:05	20/04/28 05:10:05	20/04/28 05:10:05
111	20/04/28 05:10:07	20/04/28 05:10:07	20/04/28 05:10:07
155	20/04/28 05:10:09	20/04/28 05:10:09	20/04/28 05:10:09
70	20/04/28 05:10:11	20/04/28 05:10:11	20/04/28 05:10:11
75	20/04/28 05:10:13	20/04/28 05:10:13	20/04/28 05:10:13
29	20/04/28 05:10:15	20/04/28 05:10:15	20/04/28 05:10:15
33	20/04/28 05:10:17	20/04/28 05:10:17	20/04/28 05:10:17
64	20/04/28 05:10:19	20/04/28 05:10:19	20/04/28 05:10:19
155	20/04/28 05:10:21	20/04/28 05:10:21	20/04/28 05:10:21
62	20/04/28 05:10:23	20/04/28 05:10:23	20/04/28 05:10:23
12	20/04/28 05:10:25	20/04/28 05:10:25	20/04/28 05:10:25
130	20/04/28 05:10:27	20/04/28 05:10:27	20/04/28 05:10:27
130	20/04/28 05:10:29	20/04/28 05:10:30	20/04/28 05:10:30
33	20/04/28 05:10:32	20/04/28 05:10:32	20/04/28 05:10:32
74	20/04/28 05:10:34	20/04/28 05:10:34	20/04/28 05:10:34
152	20/04/28 05:10:36	20/04/28 05:10:36	20/04/28 05:10:36
78	20/04/28 05:10:38	20/04/28 05:10:39	20/04/28 05:10:38
39	20/04/28 05:10:41	20/04/28 05:10:41	20/04/28 05:10:41
67	20/04/28 05:10:43	20/04/28 05:10:43	20/04/28 05:10:43
25	20/04/28 05:10:45	20/04/28 05:10:45	20/04/28 05:10:45
65	20/04/28 05:10:47	20/04/28 05:10:47	20/04/28 05:10:47
100	20/04/28 05:10:49	20/04/28 05:10:49	20/04/28 05:10:49
91	20/04/28 05:10:51	20/04/28 05:10:51	20/04/28 05:10:51
41	20/04/28 05:10:53	20/04/28 05:10:53	20/04/28 05:10:53
103	20/04/28 05:10:55	20/04/28 05:10:57	20/04/28 05:10:57
120	20/04/28 05:10:59	20/04/28 05:11:00	20/04/28 05:11:00
105	20/04/28 05:11:02	20/04/28 05:11:02	20/04/28 05:11:02
120	20/04/28 05:11:04	20/04/28 05:11:04	20/04/28 05:11:04
103	20/04/28 05:11:06	20/04/28 05:11:06	20/04/28 05:11:06
41	20/04/28 05:11:08	20/04/28 05:11:08	20/04/28 05:11:08
120	20/04/28 05:11:10	20/04/28 05:11:11	20/04/28 05:11:10
118	20/04/28 05:11:13	20/04/28 05:11:13	20/04/28 05:11:13
103	20/04/28 05:11:15	20/04/28 05:11:15	20/04/28 05:11:15
87	20/04/28 05:11:17	20/04/28 05:11:17	20/04/28 05:11:17
67	20/04/28 05:11:19	20/04/28 05:11:19	20/04/28 05:11:19
67	20/04/28 05:11:21	20/04/28 05:11:21	20/04/28 05:11:21
98	20/04/28 05:11:23	20/04/28 05:11:23	20/04/28 05:11:23
103	20/04/28 05:11:25	20/04/28 05:11:25	20/04/28 05:11:25
157	20/04/28 05:11:27	20/04/28 05:11:27	20/04/28 05:11:27
85	20/04/28 05:11:29	20/04/28 05:11:29	20/04/28 05:11:29
71	20/04/28 05:11:31	20/04/28 05:11:31	20/04/28 05:11:31
26	20/04/28 05:11:33	20/04/28 05:11:33	20/04/28 05:11:33
78	20/04/28 05:11:35	20/04/28 05:11:35	20/04/28 05:11:35
43	20/04/28 05:11:37	20/04/28 05:11:37	20/04/28 05:11:37
88	20/04/28 05:11:39	20/04/28 05:11:39	20/04/28 05:11:39
54	20/04/28 05:11:41	20/04/28 05:11:41	20/04/28 05:11:41
152	20/04/28 05:11:43	20/04/28 05:11:43	20/04/28 05:11:43
150	20/04/28 05:11:45	20/04/28 05:11:45	20/04/28 05:11:45
152	20/04/28 05:11:47	20/04/28 05:11:47	20/04/28 05:11:47
150	20/04/28 05:11:49	20/04/28 05:11:49	20/04/28 05:11:49
28	20/04/28 05:11:51	20/04/28 05:11:51	20/04/28 05:11:51
90	20/04/28 05:11:53	20/04/28 05:11:54	20/04/28 05:11:54
150	20/04/28 05:11:56	20/04/28 05:11:56	20/04/28 05:11:56
107	20/04/28 05:11:58	20/04/28 05:11:58	20/04/28 05:11:58
107	20/04/28 05:12:00	20/04/28 05:12:00	20/04/28 05:12:00
158	20/04/28 05:12:02	20/04/28 05:12:02	20/04/28 05:12:02
150	20/04/28 05:12:04	20/04/28 05:12:04	20/04/28 05:12:04
90	20/04/28 05:12:06	20/04/28 05:12:06	20/04/28 05:12:06
106	20/04/28 05:12:08	20/04/28 05:12:08	20/04/28 05:12:08
90	20/04/28 05:12:10	20/04/28 05:12:11	20/04/28 05:12:10
157	20/04/28 05:12:13	20/04/28 05:12:13	20/04/28 05:12:13
158	20/04/28 05:12:15	20/04/28 05:12:18	20/04/28 05:12:18
157	20/04/28 05:12:20	20/04/28 05:12:20	20/04/28 05:12:20
62	20/04/28 05:12:22	20/04/28 05:12:22	20/04/28 05:12:22
107	20/04/28 05:12:24	20/04/28 05:12:24	20/04/28 05:12:24
62	20/04/28 05:12:26	20/04/28 05:12:26	20/04/28 05:12:26
157	20/04/28 05:12:28	20/04/28 05:12:28	20/04/28 05:12:28
133	20/04/28 05:12:30	20/04/28 05:12:30	20/04/28 05:12:30
133	20/04/28 05:12:32	20/04/28 05:12:32	20/04/28 05:12:32
106	20/04/28 05:12:34	20/04/28 05:12:34	20/04/28 05:12:34
107	20/04/28 05:12:36	20/04/28 05:12:36	20/04/28 05:12:36
106	20/04/28 05:12:39	20/04/28 05:12:39	20/04/28 05:12:39
133	20/04/28 05:12:41	20/04/28 05:12:41	20/04/28 05:12:41
106	20/04/28 05:12:43	20/04/28 05:12:43	20/04/28 05:12:43
