floorId	partitionId	location_x	location_y	timeStamp
20	901	358.5624477710021	268.85102908178015	21/02/24 15:47:21
20	901	358.5624477710021	268.85102908178015	21/02/24 15:47:22
20	924	355.56028389898916	271.8020848561595	21/02/24 15:47:23
20	924	355.56028389898916	271.8020848561595	21/02/24 15:47:24
20	924	355.56028389898916	271.8020848561595	21/02/24 15:47:25
20	924	355.56028389898916	271.8020848561595	21/02/24 15:47:26
20	924	355.56028389898916	271.8020848561595	21/02/24 15:47:27
20	924	355.56028389898916	271.8020848561595	21/02/24 15:47:28
20	924	355.56028389898916	271.8020848561595	21/02/24 15:47:29
20	924	355.9354067326995	272.34540467798035	21/02/24 15:47:30
20	924	355.56028389898916	271.8020848561595	21/02/24 15:47:31
20	901	358.5624477710021	268.85102908178015	21/02/24 15:47:32
20	924	355.56028389898916	271.8020848561595	21/02/24 15:47:33
20	924	355.56028389898916	271.8020848561595	21/02/24 15:47:34
20	924	355.56028389898916	271.8020848561595	21/02/24 15:47:35
20	924	355.56028389898916	271.8020848561595	21/02/24 15:47:36
20	924	355.56028389898916	271.8020848561595	21/02/24 15:47:37
20	924	355.56028389898916	271.8020848561595	21/02/24 15:47:38
20	924	355.9354067326995	272.34540467798035	21/02/24 15:47:39
20	924	355.56028389898916	271.8020848561595	21/02/24 15:47:40
20	924	355.56028389898916	271.8020848561595	21/02/24 15:47:41
20	924	355.56028389898916	271.8020848561595	21/02/24 15:47:42
20	957	354.2791803609243	269.74324524730173	21/02/24 15:47:43
20	924	355.56028389898916	271.8020848561595	21/02/24 15:47:44
20	924	355.56028389898916	271.8020848561595	21/02/24 15:47:45
20	924	355.56028389898916	271.8020848561595	21/02/24 15:47:46
20	924	355.9354067326995	272.34540467798035	21/02/24 15:47:47
20	924	355.56028389898916	271.8020848561595	21/02/24 15:47:48
20	924	355.56028389898916	271.8020848561595	21/02/24 15:47:49
20	924	355.56028389898916	271.8020848561595	21/02/24 15:47:50
20	924	355.56028389898916	271.8020848561595	21/02/24 15:47:51
20	924	355.9354067326995	272.34540467798035	21/02/24 15:47:52
20	924	355.56028389898916	271.8020848561595	21/02/24 15:47:53
20	924	355.56028389898916	271.8020848561595	21/02/24 15:47:54
20	924	355.56028389898916	271.8020848561595	21/02/24 15:47:55
20	924	355.56028389898916	271.8020848561595	21/02/24 15:47:56
20	924	355.56028389898916	271.8020848561595	21/02/24 15:47:57
20	924	355.56028389898916	271.8020848561595	21/02/24 15:47:58
20	924	355.9354067326995	272.34540467798035	21/02/24 15:47:59
