floorId	partitionId	location_x	location_y	timeStamp
20	947	356.1766400472787	276.6350854846016	21/02/21 12:33:05
20	947	356.1766400472787	276.6350854846016	21/02/21 12:33:06
20	924	354.3797948003316	273.10460039853206	21/02/21 12:33:07
20	924	354.37979480033164	273.10460039853206	21/02/21 12:33:08
20	924	353.0864814049491	272.085675129114	21/02/21 12:33:09
20	947	352.8469021492069	274.8545217763175	21/02/21 12:33:10
20	947	350.47000855666397	273.9422901622144	21/02/21 12:33:11
20	947	350.47000855666397	273.9422901622144	21/02/21 12:33:12
20	991	350.70958781240614	271.173443515011	21/02/21 12:33:13
20	967	345.62598948586157	269.4194065703784	21/02/21 12:33:14
20	947	350.47000855666397	273.9422901622144	21/02/21 12:33:15
20	947	350.47000855666397	273.9422901622144	21/02/21 12:33:16
