floorId	partitionId	location_x	location_y	timeStamp
18	982	335.5707947754775	282.66660998132573	21/02/24 15:47:21
18	982	336.8789610560853	282.55920847249035	21/02/24 15:47:22
18	982	335.5707947754775	282.66660998132573	21/02/24 15:47:23
18	982	335.5707947754775	282.66660998132573	21/02/24 15:47:24
18	979	341.3179542174323	279.8134374747344	21/02/24 15:47:25
18	979	341.3179542174323	279.8134374747344	21/02/24 15:47:26
18	979	341.3179542174323	279.8134374747344	21/02/24 15:47:27
18	979	341.3179542174323	279.8134374747344	21/02/24 15:47:28
18	979	341.3179542174323	279.8134374747344	21/02/24 15:47:29
18	979	341.3179542174323	279.8134374747344	21/02/24 15:47:30
18	979	341.3179542174323	279.8134374747344	21/02/24 15:47:31
18	979	341.3179542174323	279.8134374747344	21/02/24 15:47:32
18	979	341.3179542174323	279.8134374747344	21/02/24 15:47:33
18	979	341.3179542174323	279.8134374747344	21/02/24 15:47:34
18	979	341.3179542174323	279.8134374747344	21/02/24 15:47:35
18	979	341.3179542174323	279.8134374747344	21/02/24 15:47:36
18	979	341.3179542174323	279.8134374747344	21/02/24 15:47:37
18	979	341.3179542174323	279.8134374747344	21/02/24 15:47:38
18	979	341.3179542174323	279.8134374747344	21/02/24 15:47:39
18	979	341.3179542174323	279.8134374747344	21/02/24 15:47:40
18	979	341.3179542174323	279.8134374747344	21/02/24 15:47:41
18	979	341.3179542174323	279.8134374747344	21/02/24 15:47:42
18	979	341.3179542174323	279.8134374747344	21/02/24 15:47:43
18	979	341.3179542174323	279.8134374747344	21/02/24 15:47:44
18	979	341.3179542174323	279.8134374747344	21/02/24 15:47:45
18	979	341.3179542174323	279.8134374747344	21/02/24 15:47:46
18	979	341.3179542174323	279.8134374747344	21/02/24 15:47:47
18	979	341.3179542174323	279.8134374747344	21/02/24 15:47:48
18	979	341.3179542174323	279.8134374747344	21/02/24 15:47:49
18	979	341.3179542174323	279.8134374747344	21/02/24 15:47:50
18	979	341.3179542174323	279.8134374747344	21/02/24 15:47:51
18	979	341.3179542174323	279.8134374747344	21/02/24 15:47:52
18	979	341.3179542174323	279.8134374747344	21/02/24 15:47:53
18	979	341.3179542174323	279.8134374747344	21/02/24 15:47:54
18	979	341.3179542174323	279.8134374747344	21/02/24 15:47:55
18	979	341.3179542174323	279.8134374747344	21/02/24 15:47:56
18	979	341.3179542174323	279.8134374747344	21/02/24 15:47:57
18	979	341.3179542174323	279.8134374747344	21/02/24 15:47:58
18	979	341.3179542174323	279.8134374747344	21/02/24 15:47:59
