floorId	partitionId	location_x	location_y	timeStamp
21	962	339.0352058930359	273.3587161799046	21/02/24 15:40:32
21	962	340.35445811124504	268.8676821963595	21/02/24 15:40:33
21	962	340.3747604189219	274.7010460143811	21/02/24 15:40:34
21	962	339.0352058930359	273.3587161799046	21/02/24 15:40:35
21	962	335.9061167518121	274.04579276282294	21/02/24 15:40:37
21	962	341.69401263713104	270.2100120308361	21/02/24 15:40:38
21	962	340.35445811124504	268.8676821963595	21/02/24 15:40:39
21	962	339.0352058930359	273.3587161799046	21/02/24 15:40:40
21	962	339.0352058930359	273.3587161799046	21/02/24 15:40:41
21	931	344.8231017783549	269.52293544791775	21/02/24 15:40:42
21	931	346.85767897953696	265.8061934915046	21/02/24 15:40:43
21	931	346.85767897953684	265.80619349150453	21/02/24 15:40:44
21	962	340.3747604189219	274.7010460143811	21/02/24 15:40:45
21	962	340.35445811124504	268.86768219635957	21/02/24 15:40:46
21	962	339.0352058930359	273.3587161799046	21/02/24 15:40:47
21	931	344.8231017783549	269.52293544791775	21/02/24 15:40:48
21	962	340.35445811124504	268.86768219635957	21/02/24 15:40:49
21	931	347.47131480237994	267.06283511097325	21/02/24 15:40:50
21	931	344.8231017783549	269.52293544791775	21/02/24 15:40:51
21	931	346.85767897953696	265.8061934915046	21/02/24 15:40:52
21	931	346.85767897953684	265.80619349150453	21/02/24 15:40:53
21	931	344.8231017783549	269.52293544791775	21/02/24 15:40:54
21	962	340.35445811124504	268.8676821963595	21/02/24 15:40:55
21	931	344.8231017783549	269.52293544791775	21/02/24 15:40:56
21	931	344.8231017783549	269.52293544791775	21/02/24 15:40:57
21	931	344.82310177835484	269.5229354479177	21/02/24 15:40:58
21	962	340.35445811124504	268.8676821963595	21/02/24 15:40:59
21	962	340.35445811124504	268.8676821963595	21/02/24 15:41:00
21	962	341.6834189170609	270.8986158429601	21/02/24 15:41:01
21	962	340.35445811124504	268.86768219635957	21/02/24 15:41:02
21	962	340.35445811124504	268.8676821963595	21/02/24 15:41:03
21	962	335.9061167518121	274.04579276282294	21/02/24 15:41:04
21	962	341.69401263713104	270.2100120308361	21/02/24 15:41:05
21	962	335.9061167518121	274.04579276282294	21/02/24 15:41:06
21	962	339.0352058930359	273.3587161799046	21/02/24 15:41:07
21	962	335.9061167518121	274.04579276282294	21/02/24 15:41:08
21	962	335.9061167518121	274.04579276282294	21/02/24 15:41:09
21	962	335.9061167518121	274.04579276282294	21/02/24 15:41:10
21	962	335.9061167518121	274.04579276282294	21/02/24 15:41:11
21	962	335.9061167518121	274.04579276282294	21/02/24 15:41:12
21	962	335.9061167518121	274.04579276282294	21/02/24 15:41:13
21	962	335.9061167518121	274.04579276282294	21/02/24 15:41:14
21	962	335.906116751812	274.04579276282294	21/02/24 15:41:15
21	962	335.9061167518121	274.04579276282294	21/02/24 15:41:16
21	962	335.906116751812	274.04579276282294	21/02/24 15:41:17
21	962	335.9061167518121	274.04579276282294	21/02/24 15:41:18
21	962	335.9061167518121	274.04579276282294	21/02/24 15:41:19
21	962	335.906116751812	274.04579276282294	21/02/24 15:41:20
21	962	335.9061167518121	274.04579276282294	21/02/24 15:41:21
21	962	335.9061167518121	274.04579276282294	21/02/24 15:41:22
21	962	336.7019889059573	278.9083575242709	21/02/24 15:41:23
21	962	335.9061167518121	274.04579276282294	21/02/24 15:41:24
21	962	335.906116751812	274.04579276282294	21/02/24 15:41:25
21	962	335.906116751812	274.04579276282294	21/02/24 15:41:26
21	962	335.906116751812	274.04579276282294	21/02/24 15:41:27
21	962	336.7019889059573	278.9083575242709	21/02/24 15:41:28
21	962	336.7019889059573	278.9083575242709	21/02/24 15:41:29
21	962	336.7019889059573	278.9083575242709	21/02/24 15:41:30
21	962	336.7019889059573	278.9083575242709	21/02/24 15:41:31
21	962	335.906116751812	274.04579276282294	21/02/24 15:41:32
21	962	336.7019889059573	278.9083575242709	21/02/24 15:41:33
21	962	336.7019889059573	278.9083575242709	21/02/24 15:41:34
21	962	336.7019889059573	278.9083575242709	21/02/24 15:41:35
21	962	336.7019889059573	278.9083575242709	21/02/24 15:41:36
21	962	335.906116751812	274.04579276282294	21/02/24 15:41:37
21	962	336.7019889059573	278.9083575242709	21/02/24 15:41:38
21	962	335.906116751812	274.04579276282294	21/02/24 15:41:39
21	962	336.7019889059573	278.9083575242709	21/02/24 15:41:40
21	962	336.7019889059573	278.9083575242709	21/02/24 15:41:41
21	962	336.7019889059573	278.9083575242709	21/02/24 15:41:42
21	962	336.7019889059573	278.9083575242709	21/02/24 15:41:43
21	962	336.7019889059573	278.9083575242709	21/02/24 15:41:44
21	962	336.7019889059573	278.9083575242709	21/02/24 15:41:45
21	962	336.7019889059573	278.9083575242709	21/02/24 15:41:46
21	962	336.7019889059573	278.9083575242709	21/02/24 15:41:47
21	962	335.906116751812	274.04579276282294	21/02/24 15:41:48
21	962	336.7019889059573	278.9083575242709	21/02/24 15:41:49
21	962	336.7019889059573	278.9083575242709	21/02/24 15:41:50
21	962	336.7019889059573	278.9083575242709	21/02/24 15:41:51
21	962	336.7019889059573	278.9083575242709	21/02/24 15:41:52
21	962	336.7019889059573	278.9083575242709	21/02/24 15:41:53
21	962	336.7019889059573	278.9083575242709	21/02/24 15:41:54
21	962	336.7019889059573	278.9083575242709	21/02/24 15:41:55
21	962	336.7019889059573	278.9083575242709	21/02/24 15:41:56
21	962	336.7019889059573	278.9083575242709	21/02/24 15:41:57
21	962	336.7019889059573	278.9083575242709	21/02/24 15:41:58
21	962	336.7019889059573	278.9083575242709	21/02/24 15:41:59
21	962	336.7019889059573	278.9083575242709	21/02/24 15:42:00
21	962	336.7019889059573	278.9083575242709	21/02/24 15:42:01
21	962	336.7019889059573	278.9083575242709	21/02/24 15:42:02
21	962	336.7019889059573	278.9083575242709	21/02/24 15:42:03
21	962	336.7019889059573	278.9083575242709	21/02/24 15:42:04
21	962	336.7019889059573	278.9083575242709	21/02/24 15:42:05
21	962	336.7019889059573	278.9083575242709	21/02/24 15:42:06
21	962	336.7019889059573	278.9083575242709	21/02/24 15:42:07
21	962	336.7019889059573	278.9083575242709	21/02/24 15:42:08
21	962	336.7019889059573	278.9083575242709	21/02/24 15:42:09
21	962	336.7019889059573	278.9083575242709	21/02/24 15:42:10
21	962	336.7019889059573	278.9083575242709	21/02/24 15:42:11
21	962	336.7019889059573	278.9083575242709	21/02/24 15:42:12
21	962	336.7019889059573	278.9083575242709	21/02/24 15:42:13
21	962	336.7019889059573	278.9083575242709	21/02/24 15:42:14
21	962	336.7019889059573	278.9083575242709	21/02/24 15:42:15
21	962	336.7019889059573	278.9083575242709	21/02/24 15:42:16
21	962	336.7019889059573	278.9083575242709	21/02/24 15:42:17
21	962	336.7019889059573	278.9083575242709	21/02/24 15:42:18
21	942	334.21131339204896	281.8578062266767	21/02/24 15:42:19
21	962	336.7019889059573	278.9083575242709	21/02/24 15:42:20
21	962	336.7019889059573	278.9083575242709	21/02/24 15:42:21
21	962	336.7019889059573	278.9083575242709	21/02/24 15:42:22
21	962	336.7019889059573	278.9083575242709	21/02/24 15:42:23
21	962	336.7019889059573	278.9083575242709	21/02/24 15:42:24
21	962	336.7019889059573	278.9083575242709	21/02/24 15:42:25
21	962	336.7019889059573	278.9083575242709	21/02/24 15:42:26
21	962	336.7019889059573	278.9083575242709	21/02/24 15:42:27
21	962	336.7019889059573	278.9083575242709	21/02/24 15:42:28
21	962	336.7019889059573	278.9083575242709	21/02/24 15:42:29
21	962	336.7019889059573	278.9083575242709	21/02/24 15:42:30
21	962	336.7019889059573	278.9083575242709	21/02/24 15:42:31
21	962	336.7019889059573	278.9083575242709	21/02/24 15:42:32
21	962	336.7019889059573	278.9083575242709	21/02/24 15:42:33
21	962	336.7019889059573	278.9083575242709	21/02/24 15:42:34
21	962	336.7019889059573	278.9083575242709	21/02/24 15:42:35
21	962	336.7019889059573	278.9083575242709	21/02/24 15:42:36
21	962	336.7019889059573	278.9083575242709	21/02/24 15:42:37
21	962	336.7019889059573	278.9083575242709	21/02/24 15:42:38
