stationId	t_start	t_end	t_max	timeStamp
18	20/04/28 05:08:49	20/04/28 05:08:49	20/04/28 05:08:49
111	20/04/28 05:14:12	20/04/28 05:08:51	20/04/28 05:08:51
18	20/04/28 05:08:53	20/04/28 05:08:54	20/04/28 05:08:54
111	20/04/28 05:08:56	20/04/28 05:08:56	20/04/28 05:08:56
111	20/04/28 05:08:58	20/04/28 05:08:58	20/04/28 05:08:58
18	20/04/28 05:09:00	20/04/28 05:09:00	20/04/28 05:09:00
61	20/04/28 05:09:02	20/04/28 05:09:03	20/04/28 05:09:03
61	20/04/28 05:09:05	20/04/28 05:09:06	20/04/28 05:09:06
61	20/04/28 05:09:08	20/04/28 05:09:08	20/04/28 05:09:08
64	20/04/28 05:09:10	20/04/28 05:09:11	20/04/28 05:09:11
56	20/04/28 05:09:13	20/04/28 05:09:13	20/04/28 05:09:13
86	20/04/28 05:09:15	20/04/28 05:09:15	20/04/28 05:09:15
157	20/04/28 05:09:17	20/04/28 05:09:17	20/04/28 05:09:17
132	20/04/28 05:09:19	20/04/28 05:09:19	20/04/28 05:09:19
135	20/04/28 05:09:21	20/04/28 05:09:21	20/04/28 05:09:21
97	20/04/28 05:09:23	20/04/28 05:09:23	20/04/28 05:09:23
157	20/04/28 05:09:25	20/04/28 05:09:26	20/04/28 05:09:26
69	20/04/28 05:09:28	20/04/28 05:09:28	20/04/28 05:09:28
157	20/04/28 05:09:30	20/04/28 05:09:30	20/04/28 05:09:30
51	20/04/28 05:09:32	20/04/28 05:09:32	20/04/28 05:09:32
157	20/04/28 05:09:34	20/04/28 05:09:35	20/04/28 05:09:35
126	20/04/28 05:09:37	20/04/28 05:09:37	20/04/28 05:09:37
95	20/04/28 05:09:39	20/04/28 05:09:39	20/04/28 05:09:39
96	20/04/28 05:09:41	20/04/28 05:09:41	20/04/28 05:09:41
69	20/04/28 05:09:43	20/04/28 05:09:43	20/04/28 05:09:43
43	20/04/28 05:09:45	20/04/28 05:09:45	20/04/28 05:09:45
51	20/04/28 05:09:47	20/04/28 05:09:47	20/04/28 05:09:47
46	20/04/28 05:09:49	20/04/28 05:09:49	20/04/28 05:09:49
157	20/04/28 05:09:51	20/04/28 05:09:51	20/04/28 05:09:51
46	20/04/28 05:09:53	20/04/28 05:09:53	20/04/28 05:09:53
126	20/04/28 05:09:55	20/04/28 05:09:55	20/04/28 05:09:55
9	20/04/28 05:09:57	20/04/28 05:09:57	20/04/28 05:09:57
126	20/04/28 05:09:59	20/04/28 05:09:59	20/04/28 05:09:59
46	20/04/28 05:10:01	20/04/28 05:10:02	20/04/28 05:10:02
126	20/04/28 05:10:04	20/04/28 05:10:04	20/04/28 05:10:04
9	20/04/28 05:10:06	20/04/28 05:10:06	20/04/28 05:10:06
69	20/04/28 05:10:08	20/04/28 05:10:08	20/04/28 05:10:08
43	20/04/28 05:10:10	20/04/28 05:10:10	20/04/28 05:10:10
46	20/04/28 05:10:12	20/04/28 05:10:12	20/04/28 05:10:12
157	20/04/28 05:10:14	20/04/28 05:10:14	20/04/28 05:10:14
157	20/04/28 05:10:16	20/04/28 05:10:16	20/04/28 05:10:16
51	20/04/28 05:10:18	20/04/28 05:10:20	20/04/28 05:10:20
126	20/04/28 05:10:22	20/04/28 05:10:22	20/04/28 05:10:22
51	20/04/28 05:10:24	20/04/28 05:10:24	20/04/28 05:10:24
51	20/04/28 05:10:26	20/04/28 05:10:26	20/04/28 05:10:26
126	20/04/28 05:10:28	20/04/28 05:10:28	20/04/28 05:10:28
43	20/04/28 05:10:30	20/04/28 05:10:31	20/04/28 05:10:31
51	20/04/28 05:10:33	20/04/28 05:10:33	20/04/28 05:10:33
9	20/04/28 05:10:35	20/04/28 05:10:35	20/04/28 05:10:35
51	20/04/28 05:10:37	20/04/28 05:10:37	20/04/28 05:10:37
95	20/04/28 05:10:39	20/04/28 05:10:39	20/04/28 05:10:39
43	20/04/28 05:10:41	20/04/28 05:10:42	20/04/28 05:10:42
157	20/04/28 05:10:44	20/04/28 05:10:44	20/04/28 05:10:44
135	20/04/28 05:10:35	20/04/28 05:10:46	20/04/28 05:10:46
158	20/04/28 05:10:48	20/04/28 05:10:48	20/04/28 05:10:48
78	20/04/28 05:10:50	20/04/28 05:10:50	20/04/28 05:10:50
121	20/04/28 05:10:52	20/04/28 05:10:52	20/04/28 05:10:52
161	20/04/28 05:10:54	20/04/28 05:10:56	20/04/28 05:10:56
78	20/04/28 05:10:58	20/04/28 05:10:58	20/04/28 05:10:58
106	20/04/28 05:11:00	20/04/28 05:11:00	20/04/28 05:11:00
111	20/04/28 05:11:02	20/04/28 05:11:02	20/04/28 05:11:02
85	20/04/28 05:11:04	20/04/28 05:11:04	20/04/28 05:11:04
155	20/04/28 05:11:06	20/04/28 05:11:06	20/04/28 05:10:48
155	20/04/28 05:11:08	20/04/28 05:11:08	20/04/28 05:11:08
75	20/04/28 05:11:10	20/04/28 05:11:10	20/04/28 05:11:10
70	20/04/28 05:11:12	20/04/28 05:11:12	20/04/28 05:11:12
61	20/04/28 05:11:14	20/04/28 05:11:14	20/04/28 05:11:14
155	20/04/28 05:11:16	20/04/28 05:11:16	20/04/28 05:11:16
57	20/04/28 05:11:18	20/04/28 05:11:18	20/04/28 05:11:18
53	20/04/28 05:11:20	20/04/28 05:11:20	20/04/28 05:11:20
79	20/04/28 05:11:22	20/04/28 05:11:22	20/04/28 05:11:22
89	20/04/28 05:11:24	20/04/28 05:11:24	20/04/28 05:11:24
32	20/04/28 05:11:26	20/04/28 05:11:26	20/04/28 05:11:26
14	20/04/28 05:11:28	20/04/28 05:11:28	20/04/28 05:11:28
40	20/04/28 05:11:30	20/04/28 05:11:30	20/04/28 05:11:30
85	20/04/28 05:11:32	20/04/28 05:11:32	20/04/28 05:11:32
41	20/04/28 05:11:34	20/04/28 05:11:35	20/04/28 05:11:35
39	20/04/28 05:11:37	20/04/28 05:11:37	20/04/28 05:11:37
11	20/04/28 05:11:39	20/04/28 05:11:40	20/04/28 05:11:39
23	20/04/28 05:11:42	20/04/28 05:11:42	20/04/28 05:11:42
32	20/04/28 05:11:44	20/04/28 05:11:44	20/04/28 05:11:44
41	20/04/28 05:11:46	20/04/28 05:11:47	20/04/28 05:11:47
105	20/04/28 05:11:49	20/04/28 05:11:49	20/04/28 05:11:49
87	20/04/28 05:11:51	20/04/28 05:11:51	20/04/28 05:11:51
67	20/04/28 05:11:53	20/04/28 05:11:53	20/04/28 05:11:53
65	20/04/28 05:11:55	20/04/28 05:11:56	20/04/28 05:11:56
65	20/04/28 05:11:58	20/04/28 05:11:59	20/04/28 05:11:59
158	20/04/28 05:12:01	20/04/28 05:12:01	20/04/28 05:12:01
114	20/04/28 05:12:03	20/04/28 05:12:03	20/04/28 05:12:03
94	20/04/28 05:12:05	20/04/28 05:12:05	20/04/28 05:12:05
26	20/04/28 05:12:07	20/04/28 05:12:07	20/04/28 05:12:07
134	20/04/28 05:12:09	20/04/28 05:12:09	20/04/28 05:12:09
128	20/04/28 05:12:11	20/04/28 05:12:11	20/04/28 05:12:11
34	20/04/28 05:12:13	20/04/28 05:12:13	20/04/28 05:12:13
95	20/04/28 05:12:15	20/04/28 05:12:15	20/04/28 05:12:15
129	20/04/28 05:12:17	20/04/28 05:12:17	20/04/28 05:12:17
152	20/04/28 05:12:19	20/04/28 05:13:44	20/04/28 05:12:20
134	20/04/28 05:12:22	20/04/28 05:12:22	20/04/28 05:12:22
26	20/04/28 05:12:24	20/04/28 05:12:24	20/04/28 05:12:24
95	20/04/28 05:12:26	20/04/28 05:12:27	20/04/28 05:12:27
134	20/04/28 05:12:29	20/04/28 05:12:29	20/04/28 05:12:29
151	20/04/28 05:12:31	20/04/28 05:12:31	20/04/28 05:12:31
150	20/04/28 05:12:33	20/04/28 05:12:33	20/04/28 05:12:33
150	20/04/28 05:12:36	20/04/28 05:12:36	20/04/28 05:12:36
45	20/04/28 05:12:38	20/04/28 05:12:38	20/04/28 05:12:38
143	20/04/28 05:12:40	20/04/28 05:12:40	20/04/28 05:12:40
152	20/04/28 05:12:42	20/04/28 05:12:42	20/04/28 05:12:42
133	20/04/28 05:12:44	20/04/28 05:12:44	20/04/28 05:12:44
152	20/04/28 05:12:46	20/04/28 05:12:47	20/04/28 05:12:47
45	20/04/28 05:12:49	20/04/28 05:12:49	20/04/28 05:12:49
134	20/04/28 05:12:51	20/04/28 05:12:51	20/04/28 05:12:51
151	20/04/28 05:12:53	20/04/28 05:12:53	20/04/28 05:12:53
131	20/04/28 05:12:55	20/04/28 05:12:55	20/04/28 05:12:55
101	20/04/28 05:12:57	20/04/28 05:12:58	20/04/28 05:12:58
151	20/04/28 05:13:00	20/04/28 05:13:00	20/04/28 05:13:00
