floorId	partitionId	location_x	location_y	timeStamp
21	962	331.7993881980144	267.51001751675824	21/02/24 15:38:00
21	962	331.7993881980144	267.51001751675824	21/02/24 15:38:00
21	962	331.5942891905886	267.5444456003686	21/02/24 15:38:00
21	962	331.2701043015002	267.5729047069294	21/02/24 15:38:00
21	962	331.33130791586274	267.58058166827425	21/02/24 15:38:00
21	962	331.35843318060375	267.4190036213652	21/02/24 15:38:00
21	962	331.3676257119962	267.4105220777087	21/02/24 15:38:00
21	962	331.29025380188216	267.3411789412309	21/02/24 15:38:00
21	962	331.24235322697217	267.34681353221293	21/02/24 15:38:00
21	962	331.2761049399303	267.35983750418853	21/02/24 15:38:01
21	962	331.38294542672736	267.38898958107325	21/02/24 15:38:01
21	962	331.3253638493725	267.6074456498092	21/02/24 15:38:01
21	962	331.2130000675152	267.50401490320587	21/02/24 15:38:01
21	962	331.1270293220097	267.4969846990294	21/02/24 15:38:01
21	962	331.3535352288966	267.44534269617344	21/02/24 15:38:01
21	962	331.26989353871517	267.3415474260421	21/02/24 15:38:01
21	962	331.2898144898262	267.3437569675282	21/02/24 15:38:01
21	962	331.3619827876592	267.1404553073975	21/02/24 15:38:01
21	962	331.39785227090084	267.2628924890945	21/02/24 15:38:01
21	962	331.34048315513496	267.3251891480227	21/02/24 15:38:02
21	962	331.57931741944543	267.31678340834424	21/02/24 15:38:02
21	962	331.5795163824857	267.31672241162136	21/02/24 15:38:02
21	962	331.6010779156755	267.2534790116567	21/02/24 15:38:02
21	962	331.5707038180132	267.21789710666775	21/02/24 15:38:02
21	962	331.6169827037811	267.3434587000562	21/02/24 15:38:02
21	962	331.56680462641344	267.48329251064143	21/02/24 15:38:02
21	962	331.65039416332087	267.48629984774595	21/02/24 15:38:02
21	962	331.94864334975955	267.47076510460266	21/02/24 15:38:02
21	962	331.8105430257771	267.48826307200335	21/02/24 15:38:03
21	962	331.86114118356426	267.2882302015654	21/02/24 15:38:03
21	962	331.82115346947	267.3180094294447	21/02/24 15:38:03
21	962	331.954862490066	267.18537073280896	21/02/24 15:38:03
21	962	331.7195131554488	267.2284889060504	21/02/24 15:38:03
21	962	331.57871007203346	267.3774766328363	21/02/24 15:38:03
21	962	331.4804165307263	267.24103406481777	21/02/24 15:38:03
21	962	331.5768185400905	267.4870335175513	21/02/24 15:38:03
21	962	331.665534329659	267.589720999643	21/02/24 15:38:03
21	962	331.8514810050761	267.7641007217738	21/02/24 15:38:03
21	962	331.6647015117613	267.8896582281281	21/02/24 15:38:04
21	962	331.67788008718856	267.9610885235408	21/02/24 15:38:04
21	962	331.6073448854925	268.0158003713488	21/02/24 15:38:04
21	962	331.83122800322224	267.9746316227827	21/02/24 15:38:04
21	962	331.7455536973228	268.10890965248376	21/02/24 15:38:04
21	962	331.56581109939003	268.0288029566704	21/02/24 15:38:04
21	962	331.6511520303907	267.8506835296887	21/02/24 15:38:04
21	962	331.6715236453166	267.9581254634757	21/02/24 15:38:04
21	962	331.6715236453166	267.9581254634757	21/02/24 15:38:04
21	962	331.6715236453166	267.9581254634757	21/02/24 15:38:05
21	962	331.4308397578407	268.10569854921124	21/02/24 15:38:05
21	962	331.4476828175136	268.01721246893425	21/02/24 15:38:05
21	962	331.4184229113218	268.2630383224698	21/02/24 15:38:05
21	962	331.4859228072141	268.2500930545793	21/02/24 15:38:05
21	962	331.4454940507395	268.17735381173566	21/02/24 15:38:05
21	962	331.50848178987064	268.2869012358642	21/02/24 15:38:05
21	962	331.50087836501325	268.5273354591655	21/02/24 15:38:05
21	962	331.7574037379765	268.66890527954683	21/02/24 15:38:05
21	962	331.512435484513	268.6818321217859	21/02/24 15:38:05
21	962	331.5364414039625	268.6518765983847	21/02/24 15:38:06
21	962	331.38270619296037	268.5696780990963	21/02/24 15:38:06
21	962	331.1365804260707	268.62773299143913	21/02/24 15:38:06
21	962	330.8817713463103	268.7593971552366	21/02/24 15:38:06
21	962	330.9778004710163	268.5661610005465	21/02/24 15:38:06
21	962	331.02810316387894	268.7968551333275	21/02/24 15:38:06
21	962	331.1031087147936	268.6410756570655	21/02/24 15:38:06
21	962	331.1309169965327	268.5905733288619	21/02/24 15:38:06
21	962	331.15442948508826	268.65118638870365	21/02/24 15:38:06
21	962	330.9270465924254	268.6442554834077	21/02/24 15:38:06
21	962	330.8960683886106	268.57071068057667	21/02/24 15:38:07
21	962	330.8633109132979	268.4107421897414	21/02/24 15:38:07
21	962	330.8549498428184	268.3601192361308	21/02/24 15:38:07
21	962	330.8332988119401	268.30251723697864	21/02/24 15:38:07
21	962	331.03676422677444	268.15051728411885	21/02/24 15:38:07
21	962	330.9512558582419	268.0312547124687	21/02/24 15:38:07
21	962	330.8547621676789	267.93157329832115	21/02/24 15:38:07
21	962	330.8378653383074	267.98088215637165	21/02/24 15:38:07
21	962	330.78253506150634	268.18622070333276	21/02/24 15:38:07
21	962	331.02556344323057	268.2202668212544	21/02/24 15:38:08
21	962	331.23581677060787	268.04678002866837	21/02/24 15:38:08
21	962	331.2913863349362	267.8226481531229	21/02/24 15:38:08
21	962	331.34873785105185	268.0601506057526	21/02/24 15:38:08
21	962	331.23361864866894	268.03356567594994	21/02/24 15:38:08
21	962	331.12831767954134	268.03905577215005	21/02/24 15:38:08
21	962	331.00909893121207	267.9981520143606	21/02/24 15:38:08
21	962	331.13263793228714	268.15007357076837	21/02/24 15:38:08
21	962	331.3848004446971	268.23909327573074	21/02/24 15:38:08
21	962	331.36291519337163	268.10240805246406	21/02/24 15:38:08
21	962	331.18680815870306	268.14346867920216	21/02/24 15:38:09
21	962	330.9594560284701	268.0258982140496	21/02/24 15:38:09
21	962	330.95518741662386	268.00650620730846	21/02/24 15:38:09
21	962	330.93085945249464	267.92591262041265	21/02/24 15:38:09
21	962	330.8801031886099	268.1112384611415	21/02/24 15:38:09
21	962	330.96736592149153	268.14729316188874	21/02/24 15:38:09
21	962	330.69922252723137	268.18785752086006	21/02/24 15:38:09
21	962	330.69367094305557	268.3012759765965	21/02/24 15:38:09
21	962	330.70671423607786	268.42123145274235	21/02/24 15:38:09
21	962	330.60229213591913	268.30462100918675	21/02/24 15:38:09
21	962	330.60669385657724	268.30295969503624	21/02/24 15:38:10
21	962	330.63134153834227	268.3550979137341	21/02/24 15:38:10
21	962	330.65033110004725	268.38070717545696	21/02/24 15:38:10
21	962	330.5939841128124	268.3647427047867	21/02/24 15:38:10
21	962	330.4265085275107	268.2825677808939	21/02/24 15:38:10
21	962	330.46476097081916	268.29823632748526	21/02/24 15:38:10
21	962	330.4102958418974	268.3040623666082	21/02/24 15:38:10
21	962	330.3101617711952	268.2902439492874	21/02/24 15:38:10
21	962	330.2559819679128	268.42461573164377	21/02/24 15:38:10
21	962	330.4967485189168	268.24596545127764	21/02/24 15:38:11
21	962	330.6786381178966	268.0463638669115	21/02/24 15:38:11
21	962	330.8097571307533	268.20078158264977	21/02/24 15:38:11
21	962	330.83036948170394	268.2193371991174	21/02/24 15:38:11
21	962	330.8222044892632	268.324783517889	21/02/24 15:38:11
21	962	330.6738423534919	268.1537955965189	21/02/24 15:38:11
21	962	330.73796284795424	268.2616846237017	21/02/24 15:38:11
21	962	330.6354800537411	268.3953922347983	21/02/24 15:38:11
21	962	330.73487334050566	268.42558674493085	21/02/24 15:38:11
21	962	330.9322335906221	268.53501771764104	21/02/24 15:38:11
21	962	330.969050315729	268.41471512135104	21/02/24 15:38:12
21	962	330.78434702875074	268.4691664360221	21/02/24 15:38:12
21	962	330.9152336109475	268.531786220404	21/02/24 15:38:12
21	962	330.9034253097616	268.5253464140577	21/02/24 15:38:12
21	962	330.8836834281699	268.69177399259644	21/02/24 15:38:12
21	962	330.9901595156518	268.89005722655344	21/02/24 15:38:12
21	962	331.1368304675243	268.74386329784284	21/02/24 15:38:12
21	962	331.25449593523746	269.01961400960863	21/02/24 15:38:12
21	962	331.254553002809	269.0196530172941	21/02/24 15:38:12
21	962	331.41145310772276	269.0482501683835	21/02/24 15:38:12
21	962	331.446529614124	268.950406438424	21/02/24 15:38:13
21	962	331.47512798133323	268.9702137597149	21/02/24 15:38:13
21	962	331.2416409244589	268.8754265380879	21/02/24 15:38:13
21	962	331.2183982229256	268.5866881995008	21/02/24 15:38:13
21	962	331.18394920132283	268.66012639418307	21/02/24 15:38:13
21	962	331.1318965763047	268.9337097029865	21/02/24 15:38:13
21	962	331.0266381525554	268.7376226834673	21/02/24 15:38:13
21	962	331.12456001266435	268.75210605306927	21/02/24 15:38:13
21	962	331.0798714188858	268.6321038865602	21/02/24 15:38:13
21	962	331.03532406303117	268.7933059806783	21/02/24 15:38:13
21	962	330.9428181740182	268.79507317463185	21/02/24 15:38:14
21	962	330.8837536824851	268.58223761606547	21/02/24 15:38:14
21	962	330.8004342611983	268.5710594148708	21/02/24 15:38:14
21	962	330.87116232855107	268.7484374574431	21/02/24 15:38:14
21	962	330.8390629022515	268.6819201325182	21/02/24 15:38:14
21	962	331.07248106513447	268.657382048959	21/02/24 15:38:14
21	962	330.97521602655036	268.6655881366297	21/02/24 15:38:14
21	962	331.0551737106581	268.70047547078036	21/02/24 15:38:14
21	962	330.99370406413976	268.68065084897086	21/02/24 15:38:14
21	962	330.80831975926833	268.72190466664637	21/02/24 15:38:15
21	962	330.98016052513077	268.8677899500435	21/02/24 15:38:15
21	962	330.99079508745916	268.78830372372346	21/02/24 15:38:15
21	962	331.23305377367086	268.8024884652352	21/02/24 15:38:15
21	962	331.27880503906505	268.6570876497684	21/02/24 15:38:15
21	962	331.2506019859916	268.5638386429382	21/02/24 15:38:15
21	962	331.4408067506755	268.7392399948957	21/02/24 15:38:15
21	962	331.4244818120504	268.7283257768234	21/02/24 15:38:15
21	962	331.31875310282885	268.6151829216739	21/02/24 15:38:15
21	962	331.16578319806075	268.77490395059516	21/02/24 15:38:15
21	962	331.3594678361327	268.8898734030034	21/02/24 15:38:16
21	962	331.35895431330636	268.88925683015344	21/02/24 15:38:16
21	962	331.1969939053633	268.79883712591794	21/02/24 15:38:16
21	962	330.99772897903273	268.78854100604616	21/02/24 15:38:16
21	962	330.74441326859903	268.9441826054695	21/02/24 15:38:16
21	962	330.74191696818866	268.94114798907555	21/02/24 15:38:16
21	962	330.8214787471197	268.7379339664107	21/02/24 15:38:16
21	962	330.82132388166235	268.7371907811632	21/02/24 15:38:16
21	962	331.0268348408887	268.94603521289656	21/02/24 15:38:16
21	962	330.7698952593313	268.9383288625037	21/02/24 15:38:16
21	962	330.6042715182673	268.99664560208174	21/02/24 15:38:17
21	962	330.7909870319929	268.7969689217143	21/02/24 15:38:17
21	962	330.83194529921104	268.8310387309128	21/02/24 15:38:17
21	962	330.95934487422716	268.73556026609964	21/02/24 15:38:17
21	962	330.95322014158944	268.73288114470296	21/02/24 15:38:17
21	962	330.9871927763942	268.6565273409872	21/02/24 15:38:17
21	962	330.9460497899198	268.67973156526466	21/02/24 15:38:17
21	962	331.0584536275721	268.7159652243057	21/02/24 15:38:17
21	962	331.1666002379414	268.6349887211898	21/02/24 15:38:17
21	962	331.1927850379084	268.50083706578147	21/02/24 15:38:18
21	962	331.24404773257385	268.5305649147125	21/02/24 15:38:18
21	962	331.2113349184554	268.52904754960196	21/02/24 15:38:18
21	962	331.1423993273564	268.6636042043541	21/02/24 15:38:18
21	962	331.0531126329453	268.6658687917325	21/02/24 15:38:18
21	962	331.09173606747055	268.63760252360134	21/02/24 15:38:18
21	962	330.96985556208153	268.42251502343805	21/02/24 15:38:18
21	962	330.9182137375469	268.1934727397838	21/02/24 15:38:18
21	962	331.0467410649654	267.99673997329745	21/02/24 15:38:18
21	962	330.89401150385726	268.01105872649543	21/02/24 15:38:18
21	962	330.9116604552482	268.02050892195723	21/02/24 15:38:19
21	962	330.9281765079502	268.0042661196652	21/02/24 15:38:19
21	962	330.9989421649109	267.9741675491138	21/02/24 15:38:19
21	962	331.0100362553992	267.9215670858366	21/02/24 15:38:19
21	962	331.22319465275757	267.9790096154994	21/02/24 15:38:19
21	962	331.2174876818797	267.8554084743627	21/02/24 15:38:19
21	962	331.42169856615385	268.06935368772156	21/02/24 15:38:19
21	962	331.42918501270447	267.8245012042054	21/02/24 15:38:19
21	962	331.42963018906573	267.8083671289572	21/02/24 15:38:19
21	962	331.6298274660291	267.84176660686535	21/02/24 15:38:19
21	962	331.6533618393756	267.81218235135793	21/02/24 15:38:20
21	962	331.6533618393756	267.81218235135793	21/02/24 15:38:20
21	962	331.2836211735643	267.7010213496791	21/02/24 15:38:20
21	962	331.2836211735643	267.7010213496791	21/02/24 15:38:20
21	962	331.49357701731145	267.7063678831415	21/02/24 15:38:20
21	962	331.47414315593977	267.69927774924264	21/02/24 15:38:20
21	962	331.5254505721661	267.562998304013	21/02/24 15:38:20
21	962	331.78128770883285	267.4862870325939	21/02/24 15:38:20
21	962	331.6421028529122	267.73438249251	21/02/24 15:38:20
21	962	331.6365059144231	267.74688541363633	21/02/24 15:38:21
21	962	331.5558424001009	267.9450702500406	21/02/24 15:38:21
21	962	331.78343837637533	267.8399801831546	21/02/24 15:38:21
21	962	331.73617560051844	267.5496528138137	21/02/24 15:38:21
21	962	331.5977018464528	267.473090064425	21/02/24 15:38:21
21	962	331.5841476989786	267.6704375451361	21/02/24 15:38:21
21	962	331.5320285206641	267.6438584222207	21/02/24 15:38:21
21	962	331.47393894763434	267.64081316836416	21/02/24 15:38:21
21	962	331.42835931341654	267.91818630189664	21/02/24 15:38:21
21	962	331.55460772998777	268.00132524757424	21/02/24 15:38:21
21	962	331.74579409209366	267.7920937893733	21/02/24 15:38:22
21	962	331.76193596258514	267.8376513186669	21/02/24 15:38:22
21	962	331.7384381381264	267.9634441242841	21/02/24 15:38:22
21	962	331.7384381381264	267.9634441242841	21/02/24 15:38:22
21	962	331.9038040041705	268.1549430425884	21/02/24 15:38:22
21	962	331.8335685711055	268.1251090685191	21/02/24 15:38:22
21	962	331.7250368494713	267.9644956187293	21/02/24 15:38:22
21	962	331.7440427853922	268.0129886609289	21/02/24 15:38:22
21	962	332.02193000813213	268.0734190985551	21/02/24 15:38:22
21	962	332.27262839686796	267.9305667965764	21/02/24 15:38:22
21	962	332.3009836878551	268.13478904390064	21/02/24 15:38:23
21	962	332.33205117034316	268.1082185488971	21/02/24 15:38:23
21	962	332.1020875644529	267.9735728765752	21/02/24 15:38:23
21	962	332.0467908487865	267.9501726560997	21/02/24 15:38:23
21	962	332.04881272345887	267.9495995802885	21/02/24 15:38:23
21	962	332.0501360148678	267.95192580828666	21/02/24 15:38:23
21	962	332.0501360148678	267.95192580828666	21/02/24 15:38:23
21	962	332.0015796075782	267.9603957900064	21/02/24 15:38:23
21	962	332.09145363056786	268.009857196389	21/02/24 15:38:23
21	962	332.0954577371746	267.94122195520976	21/02/24 15:38:24
21	962	331.9593903457885	268.0119474177279	21/02/24 15:38:24
21	962	331.9440345306522	267.78520699398973	21/02/24 15:38:24
21	962	331.7294591502722	267.83632962750994	21/02/24 15:38:24
21	962	331.7294591502722	267.83632962750994	21/02/24 15:38:24
21	962	331.58381269354254	267.60572551057425	21/02/24 15:38:24
21	962	331.7511243979913	267.63070755464673	21/02/24 15:38:24
21	962	331.71162930915034	267.87906324041694	21/02/24 15:38:24
21	962	331.8720487672449	267.6779770509117	21/02/24 15:38:24
21	962	332.12360341789196	267.5948259370689	21/02/24 15:38:24
21	962	332.01058473378725	267.55734835998896	21/02/24 15:38:25
21	962	331.8158226354469	267.35525085862133	21/02/24 15:38:25
21	962	331.85205422591457	267.3559047959706	21/02/24 15:38:25
21	962	331.9131039106857	267.16188465851485	21/02/24 15:38:25
21	962	331.71948484380545	267.27481682757184	21/02/24 15:38:25
21	962	331.71948484380545	267.27481682757184	21/02/24 15:38:25
21	962	331.7943290208057	267.3812009500914	21/02/24 15:38:25
21	962	331.7943290208057	267.3812009500914	21/02/24 15:38:25
21	962	331.7943290208057	267.3812009500914	21/02/24 15:38:25
21	962	331.86286074399897	267.39429301610164	21/02/24 15:38:25
21	962	331.84502590293397	267.13758151834134	21/02/24 15:38:26
21	962	331.7982175202933	267.2900342373166	21/02/24 15:38:26
21	962	331.7982175202933	267.2900342373166	21/02/24 15:38:26
21	962	331.78017702780863	267.2858102433938	21/02/24 15:38:26
21	962	331.8993146869928	267.3913587818081	21/02/24 15:38:26
21	962	331.87652674013395	267.5879085882744	21/02/24 15:38:26
21	962	331.8672831786387	267.3986385564484	21/02/24 15:38:26
21	962	331.992518317089	267.26833863563724	21/02/24 15:38:26
21	962	331.9307943016438	267.17363670749666	21/02/24 15:38:26
21	962	331.70184910743933	267.05053619199293	21/02/24 15:38:26
21	962	331.70013568929505	267.0494150792825	21/02/24 15:38:27
21	962	331.69721376866556	267.0474427019703	21/02/24 15:38:27
21	962	331.71396915500253	266.99098819631365	21/02/24 15:38:27
21	962	331.7561392192446	266.8135345364668	21/02/24 15:38:27
21	962	331.88750563962725	266.56623890041897	21/02/24 15:38:27
21	962	331.73767449586444	266.54078482648345	21/02/24 15:38:27
21	962	331.7464174648593	266.7264653810994	21/02/24 15:38:27
21	962	331.70320362533295	266.7513836381728	21/02/24 15:38:27
21	962	331.5954517991292	266.6335119443707	21/02/24 15:38:27
21	962	331.63366340210075	266.4651466255721	21/02/24 15:38:28
21	962	331.63366340210075	266.4651466255721	21/02/24 15:38:28
21	962	331.53482287632914	266.48120151426684	21/02/24 15:38:28
21	962	331.65289727006245	266.64610953813803	21/02/24 15:38:28
21	962	331.429911243419	266.56176047540254	21/02/24 15:38:28
21	962	331.5148945472654	266.5534996619671	21/02/24 15:38:28
21	962	331.2208826304366	266.5682775176245	21/02/24 15:38:28
21	962	331.21358527592787	266.51840074632383	21/02/24 15:38:28
21	962	331.2850743125791	266.6079991249346	21/02/24 15:38:28
21	962	331.31883851631477	266.41037254174	21/02/24 15:38:28
21	962	331.4797265050631	266.53958261958354	21/02/24 15:38:29
21	962	331.59807172208934	266.4676833225334	21/02/24 15:38:29
21	962	331.7698781731941	266.3358661088239	21/02/24 15:38:29
21	962	331.69598137274727	266.4327603366279	21/02/24 15:38:29
21	962	331.69598137274727	266.4327603366279	21/02/24 15:38:29
21	962	331.48187325003425	266.6501952377224	21/02/24 15:38:29
21	962	331.3432601235935	266.5258444549735	21/02/24 15:38:29
21	962	331.3343911449061	266.5187484669819	21/02/24 15:38:29
21	962	331.23975716747395	266.484220661639	21/02/24 15:38:29
21	962	331.23975716747395	266.484220661639	21/02/24 15:38:30
21	962	331.1684892451373	266.4574366937875	21/02/24 15:38:30
21	962	331.1918781414153	266.4166816168794	21/02/24 15:38:30
21	962	331.1746604711638	266.40599570434676	21/02/24 15:38:30
21	962	331.36393431852855	266.2688994612468	21/02/24 15:38:30
21	962	331.29552355499607	266.5067584250902	21/02/24 15:38:30
21	962	331.29280914857395	266.6837943425924	21/02/24 15:38:30
21	962	331.286036203981	266.69934496408985	21/02/24 15:38:30
21	962	331.1667782578481	266.89064297389837	21/02/24 15:38:30
21	962	331.3503385214311	266.695831988681	21/02/24 15:38:30
21	962	331.17459195088475	266.7187933220103	21/02/24 15:38:31
21	962	331.12515296664384	266.82647686283246	21/02/24 15:38:31
21	962	331.16666422746823	266.772918994406	21/02/24 15:38:31
21	962	330.9833421913856	266.8745131469301	21/02/24 15:38:31
21	962	331.00013268023304	266.99214532610887	21/02/24 15:38:31
21	962	330.97289936209654	266.9639598792339	21/02/24 15:38:31
21	962	331.1521184915491	266.7806961847924	21/02/24 15:38:31
21	962	331.0188991381113	266.55369492597185	21/02/24 15:38:31
21	962	331.02149971103523	266.5515315625252	21/02/24 15:38:31
21	962	331.11996054195146	266.42415681581	21/02/24 15:38:31
21	962	331.18254032728885	266.488343602833	21/02/24 15:38:32
21	962	331.4512971234987	266.387596356187	21/02/24 15:38:32
21	962	331.4947214890242	266.4772248295843	21/02/24 15:38:32
21	962	331.5925041000897	266.19604433888156	21/02/24 15:38:32
21	962	331.5326114898118	266.2975811708426	21/02/24 15:38:32
21	962	331.7309746936414	266.20544551494345	21/02/24 15:38:32
21	962	331.6952867283496	266.21759822182065	21/02/24 15:38:32
21	962	331.8169602405576	266.23936706162493	21/02/24 15:38:32
21	962	332.03501782834496	266.1762723965051	21/02/24 15:38:32
21	962	332.03501782834496	266.1762723965051	21/02/24 15:38:33
21	962	332.03501782834496	266.1762723965051	21/02/24 15:38:33
21	962	332.0885930206983	265.9596876135914	21/02/24 15:38:33
21	962	332.0908578063819	265.9853438399241	21/02/24 15:38:33
21	962	331.94013579466906	266.2083175952223	21/02/24 15:38:33
21	962	331.91856119859676	266.4866790951714	21/02/24 15:38:33
21	962	331.87660672242947	266.45656987234804	21/02/24 15:38:33
21	962	332.0768306302896	266.44590570816945	21/02/24 15:38:33
21	962	332.09643378376046	266.5397369398133	21/02/24 15:38:33
21	962	331.9853584805206	266.48739196962896	21/02/24 15:38:33
21	962	331.8139748776234	266.49736455473396	21/02/24 15:38:34
21	962	331.87118363013934	266.4803648613384	21/02/24 15:38:34
21	962	331.69515564784496	266.3567681446197	21/02/24 15:38:34
21	962	331.5607863719787	266.44940772601086	21/02/24 15:38:34
21	962	331.36866595856054	266.53468481370817	21/02/24 15:38:34
21	962	331.4680587838205	266.4944534304652	21/02/24 15:38:34
21	962	331.38255554779505	266.4987791307852	21/02/24 15:38:34
21	962	331.3058092157839	266.2700282091044	21/02/24 15:38:34
21	962	331.45673782277777	266.40018342688313	21/02/24 15:38:34
21	962	331.39852351609903	266.4264512747048	21/02/24 15:38:34
21	962	331.4351734884886	266.29915700893974	21/02/24 15:38:35
21	962	331.52529075390476	266.3079128611778	21/02/24 15:38:35
21	962	331.5627799070619	266.2969517827354	21/02/24 15:38:35
21	962	331.66952216130846	266.2591910676111	21/02/24 15:38:35
21	962	331.9432257536253	266.31154303512346	21/02/24 15:38:35
21	962	331.91272895290655	266.49611778107464	21/02/24 15:38:35
21	962	331.750908802678	266.61777827157465	21/02/24 15:38:35
21	962	331.6417513486676	266.47985664149627	21/02/24 15:38:35
21	962	331.6264455810039	266.4780306308468	21/02/24 15:38:35
21	962	331.5027158751709	266.4602881557468	21/02/24 15:38:36
21	962	331.49740102108444	266.4262277671081	21/02/24 15:38:36
21	962	331.45920337954726	266.4613340406465	21/02/24 15:38:36
21	962	331.45920337954726	266.4613340406465	21/02/24 15:38:36
21	962	331.1204774123953	266.30430431176353	21/02/24 15:38:36
21	962	330.84700819696394	266.4109573054086	21/02/24 15:38:36
21	962	330.9820807142468	266.60253250384085	21/02/24 15:38:36
21	962	330.9820807142468	266.60253250384085	21/02/24 15:38:36
21	962	331.02383392528094	266.865216659825	21/02/24 15:38:36
21	962	331.03446376377576	266.8444500376093	21/02/24 15:38:36
21	962	331.23235667425735	266.8087417614022	21/02/24 15:38:37
21	962	331.1680604037463	266.69776351300834	21/02/24 15:38:37
21	962	331.0352468448116	266.7588037772543	21/02/24 15:38:37
21	962	331.1251312550048	266.64717422863055	21/02/24 15:38:37
21	962	331.16336235830056	266.5679591508827	21/02/24 15:38:37
21	962	331.3166486474767	266.75436080533825	21/02/24 15:38:37
21	962	331.4005149633228	266.7175700033412	21/02/24 15:38:37
21	962	331.4796738126627	266.7134155125831	21/02/24 15:38:37
21	962	331.34468864860344	266.5792140726661	21/02/24 15:38:37
21	962	331.3649876161855	266.5974023287507	21/02/24 15:38:38
21	962	331.3064729131056	266.5629843925967	21/02/24 15:38:38
21	962	331.34053450055444	266.65008126565124	21/02/24 15:38:38
21	962	331.2858960097614	266.63064030465137	21/02/24 15:38:38
21	962	331.26235224433714	266.61846113543726	21/02/24 15:38:38
21	962	331.28179790034574	266.74577407161496	21/02/24 15:38:38
21	962	331.26469458117816	266.7252975216452	21/02/24 15:38:38
21	962	331.2988741316957	266.74023090039185	21/02/24 15:38:38
21	962	331.4187758514818	266.70032923996655	21/02/24 15:38:38
21	962	331.41886015774975	266.6746993888619	21/02/24 15:38:38
21	962	331.4469515268458	266.5602542081952	21/02/24 15:38:39
21	962	331.3644854053964	266.4104507501253	21/02/24 15:38:39
21	962	331.48260872729406	266.6592536286007	21/02/24 15:38:39
21	962	331.31965333093666	266.53651940875045	21/02/24 15:38:39
21	962	331.33683345741355	266.5124399803334	21/02/24 15:38:39
21	962	331.3013532976273	266.5988615288447	21/02/24 15:38:39
21	962	331.36241265540275	266.5939178779932	21/02/24 15:38:39
21	962	331.3764243124839	266.4056325211473	21/02/24 15:38:39
21	962	331.3469644308857	266.25458370961167	21/02/24 15:38:39
21	962	331.41913983589734	266.0499949327278	21/02/24 15:38:40
21	962	331.54415899072495	265.84045011234883	21/02/24 15:38:40
21	962	331.704588632522	266.06579861566127	21/02/24 15:38:40
21	962	331.662829693088	266.16601665579645	21/02/24 15:38:40
21	962	331.6866578703722	266.1653990370654	21/02/24 15:38:40
21	962	331.6211531533522	266.08243625320097	21/02/24 15:38:40
21	962	331.6296844836726	266.15581713538205	21/02/24 15:38:40
21	962	331.78571501083206	266.0595092824892	21/02/24 15:38:40
21	962	331.6297590633497	266.18882605807397	21/02/24 15:38:40
21	962	331.71165902593737	266.45477989494015	21/02/24 15:38:40
21	962	331.7651912687278	266.5223874926075	21/02/24 15:38:41
21	962	331.6773680501274	266.60572624080316	21/02/24 15:38:41
21	962	331.72970710117335	266.79250839798254	21/02/24 15:38:41
21	962	331.47887687848674	266.6309192230078	21/02/24 15:38:41
21	962	331.27516704185035	266.73171558274987	21/02/24 15:38:41
21	962	331.23714007498165	266.7545918678748	21/02/24 15:38:41
21	962	331.1940283611571	266.7471315814839	21/02/24 15:38:41
21	962	331.00712423967127	266.7700480959127	21/02/24 15:38:41
21	962	330.9272928783753	266.6786902613543	21/02/24 15:38:41
21	962	330.7756522478174	266.8432825433216	21/02/24 15:38:41
21	962	330.83831922506107	267.0192003072653	21/02/24 15:38:42
21	962	330.6842206045251	266.80782635381894	21/02/24 15:38:42
21	962	330.6486854281489	266.6948557202179	21/02/24 15:38:42
21	962	330.6093192176737	266.61085458354125	21/02/24 15:38:42
21	962	330.58352504975824	266.6035525459669	21/02/24 15:38:42
21	962	330.60870836151355	266.68202262697974	21/02/24 15:38:42
21	962	330.6049427253235	266.7950528794316	21/02/24 15:38:42
21	962	330.61320875223316	266.7951120656509	21/02/24 15:38:42
21	962	330.8505598144243	266.62605844017804	21/02/24 15:38:42
21	962	331.0712647359933	266.4629631896714	21/02/24 15:38:43
21	962	331.2992451605812	266.6158376516448	21/02/24 15:38:43
21	962	331.25409974625376	266.68398594964157	21/02/24 15:38:43
21	962	331.2803388066788	266.72687100492044	21/02/24 15:38:43
21	962	331.1297094760659	266.68928050230414	21/02/24 15:38:43
21	962	331.0478829569492	266.4894630236213	21/02/24 15:38:43
21	962	331.0724791172878	266.50808938732916	21/02/24 15:38:43
21	962	331.1416188279495	266.3197813003139	21/02/24 15:38:43
21	962	331.2055397070239	266.45625188873885	21/02/24 15:38:43
21	962	331.1041513020274	266.21489704404536	21/02/24 15:38:43
21	962	331.12448658049135	266.086083549768	21/02/24 15:38:44
21	962	331.03302905036765	266.12383678762643	21/02/24 15:38:44
21	962	330.9925884500318	265.9715416086507	21/02/24 15:38:44
21	962	331.25380747996263	265.9557700732363	21/02/24 15:38:44
21	962	331.2211603820296	265.91613726311346	21/02/24 15:38:44
21	962	331.094814575046	266.06088815582746	21/02/24 15:38:44
21	962	331.12884556874064	265.82174841060174	21/02/24 15:38:44
21	962	331.19261988786934	265.91908155690754	21/02/24 15:38:44
21	962	331.4518002870548	265.8420878538973	21/02/24 15:38:44
21	962	331.15934144962307	265.8522445059841	21/02/24 15:38:44
21	962	331.2001539024466	265.87404395178845	21/02/24 15:38:45
21	962	331.24062637163985	265.9953788877271	21/02/24 15:38:45
21	962	331.25353518611337	265.9245402293523	21/02/24 15:38:45
21	962	331.4638188240788	266.1037638866516	21/02/24 15:38:45
21	962	331.2315154433055	266.1047667100493	21/02/24 15:38:45
21	962	331.1367840072733	266.2843451706727	21/02/24 15:38:45
21	962	330.98597594364975	266.16180803437464	21/02/24 15:38:45
21	962	330.97415399888325	266.1571964026339	21/02/24 15:38:45
21	962	330.96297770802516	266.2539796473715	21/02/24 15:38:45
21	962	330.7602685447086	266.11589817621945	21/02/24 15:38:46
21	962	330.78739818617055	265.91702634133856	21/02/24 15:38:46
21	962	331.0082839153903	265.9614807512161	21/02/24 15:38:46
21	962	330.8912961831137	266.1091189835266	21/02/24 15:38:46
21	962	330.70642238109104	266.2593902724571	21/02/24 15:38:46
21	962	330.9628842375649	266.13668466141115	21/02/24 15:38:46
21	962	331.09454563279104	265.96926936314713	21/02/24 15:38:46
21	962	331.05092157313436	265.9860095422399	21/02/24 15:38:46
21	962	331.18484330698175	266.122689417556	21/02/24 15:38:46
21	962	331.22897028175623	266.4126281532314	21/02/24 15:38:46
21	962	331.1779559892993	266.55733736379125	21/02/24 15:38:47
21	962	331.1512090690648	266.5343050601157	21/02/24 15:38:47
21	962	331.2622559263082	266.38518312648864	21/02/24 15:38:47
21	962	331.24682406223405	266.2459105097675	21/02/24 15:38:47
21	962	331.2450846817135	266.278506319566	21/02/24 15:38:47
21	962	331.2849811362745	266.2600260862034	21/02/24 15:38:47
21	962	331.3841183592946	266.139361214403	21/02/24 15:38:47
21	962	331.4876396068262	265.9637130100116	21/02/24 15:38:47
21	962	331.51220617957296	265.9240070476903	21/02/24 15:38:47
21	962	331.3496860150975	265.82857476930644	21/02/24 15:38:47
21	962	331.35325519252325	265.90748080763996	21/02/24 15:38:48
21	962	331.32446457171085	265.85721000057254	21/02/24 15:38:48
21	962	331.3084578355906	265.826692445315	21/02/24 15:38:48
21	962	331.5371967318563	265.93050335447117	21/02/24 15:38:48
21	962	331.32194417487415	265.85487106525113	21/02/24 15:38:48
21	962	331.3605137612256	265.68323053974393	21/02/24 15:38:48
21	962	331.3882445354792	265.6323156913344	21/02/24 15:38:48
21	962	331.3747816791506	265.69428292448276	21/02/24 15:38:48
21	962	331.53501758297944	265.6316201912029	21/02/24 15:38:48
21	962	331.5466612329274	265.67916692161737	21/02/24 15:38:49
21	962	331.3122230586403	265.8022909891007	21/02/24 15:38:49
21	962	331.3030997215557	265.6924432751744	21/02/24 15:38:49
21	962	331.21313349146817	265.68314365018057	21/02/24 15:38:49
21	962	331.3276999214765	265.83476992207494	21/02/24 15:38:49
21	962	331.2360356025741	265.55120327857765	21/02/24 15:38:49
21	962	331.3906826546629	265.63880206265577	21/02/24 15:38:49
21	962	331.59934090931773	265.8219325753423	21/02/24 15:38:49
21	962	331.5976391748027	266.1005079188525	21/02/24 15:38:49
21	962	331.62159698565563	266.08745995150207	21/02/24 15:38:49
21	962	331.7189176575644	266.17846309288075	21/02/24 15:38:50
21	962	331.72777375373647	266.1818648331377	21/02/24 15:38:50
21	962	331.6953392688425	265.9521191868414	21/02/24 15:38:50
21	962	331.77697063630364	265.87854265327763	21/02/24 15:38:50
21	962	331.66749359668376	265.7270096987568	21/02/24 15:38:50
21	962	331.82480912680194	265.9151768107864	21/02/24 15:38:50
21	962	331.5861500551042	265.86670817146	21/02/24 15:38:50
21	962	331.6651269693817	266.0315828104885	21/02/24 15:38:50
21	962	331.6332705671311	265.93070357162117	21/02/24 15:38:50
21	962	331.8256179545055	265.90612327103355	21/02/24 15:38:50
21	962	331.84429770008506	265.89957227083977	21/02/24 15:38:51
21	962	331.65059469931094	265.8792420780159	21/02/24 15:38:51
21	962	331.482133168845	265.6700190079063	21/02/24 15:38:51
21	962	331.55372071053665	265.57595097578456	21/02/24 15:38:51
21	962	331.5090778963558	265.8390228995144	21/02/24 15:38:51
21	962	331.71598073807695	265.86780698613654	21/02/24 15:38:51
21	962	331.9292764358062	265.7187050732577	21/02/24 15:38:51
21	962	331.96174576433793	265.7023366150609	21/02/24 15:38:51
21	962	331.7243470695979	265.7081589820674	21/02/24 15:38:51
21	962	331.75883532887303	265.75033007452873	21/02/24 15:38:52
21	962	331.6997855866701	265.62520898319787	21/02/24 15:38:52
21	962	331.57523079253684	265.5456926081939	21/02/24 15:38:52
21	962	331.5996153006497	265.51862136471385	21/02/24 15:38:52
21	962	331.43783492648834	265.3070578606534	21/02/24 15:38:52
21	962	331.42763829659805	265.28628158386385	21/02/24 15:38:52
21	962	331.4682501832901	265.13382072642224	21/02/24 15:38:52
21	962	331.5159486755359	265.18048518618315	21/02/24 15:38:52
21	962	331.4212503814214	265.3077914807292	21/02/24 15:38:52
21	962	331.55000446342564	265.41625949736346	21/02/24 15:38:52
21	962	331.70081568430606	265.5923469625645	21/02/24 15:38:53
21	962	331.61027508885496	265.69862698928796	21/02/24 15:38:53
21	962	331.5750784629642	265.7817711943721	21/02/24 15:38:53
21	962	331.5903232132881	265.6657218922635	21/02/24 15:38:53
21	962	331.5398019914354	265.9255741680006	21/02/24 15:38:53
21	962	331.5319434133253	265.9933746902968	21/02/24 15:38:53
21	962	331.54487487017235	266.0956770751143	21/02/24 15:38:53
21	962	331.78377094434404	266.1664672112198	21/02/24 15:38:53
21	962	331.81642916606063	266.08467737930033	21/02/24 15:38:53
21	962	331.6625188413017	266.0740904441952	21/02/24 15:38:53
21	962	331.8431698933105	266.150902238804	21/02/24 15:38:54
21	962	331.70766037668034	265.8943479605871	21/02/24 15:38:54
21	962	331.67196417065014	265.88897485382364	21/02/24 15:38:54
21	962	331.62694210170093	265.85913478875153	21/02/24 15:38:54
21	962	331.67985962090523	265.6468378198447	21/02/24 15:38:54
21	962	331.82719767642834	265.5506785995177	21/02/24 15:38:54
21	962	331.606257341241	265.73406561111955	21/02/24 15:38:54
21	962	331.56782894750467	265.5537516845736	21/02/24 15:38:54
21	962	331.5657825790928	265.5457392930367	21/02/24 15:38:54
21	962	331.4140920574433	265.74685974313337	21/02/24 15:38:55
21	962	331.46554766928926	265.82783533441216	21/02/24 15:38:55
21	962	331.3589336871527	265.81859866784026	21/02/24 15:38:55
21	962	331.3073141500586	265.88912536114805	21/02/24 15:38:55
21	962	331.2932717807494	265.7419733448199	21/02/24 15:38:55
21	962	331.2459315022079	265.72441177062524	21/02/24 15:38:55
21	962	331.3372527500713	265.81206608917756	21/02/24 15:38:55
21	962	331.3576072170078	265.84637825557473	21/02/24 15:38:55
21	962	331.4118338138444	265.79706917913006	21/02/24 15:38:55
21	962	331.6033029658012	265.76810976832394	21/02/24 15:38:55
21	962	331.5874816597964	265.7787418987448	21/02/24 15:38:56
21	962	331.53841047049315	265.73776974503375	21/02/24 15:38:56
21	962	331.4277534049624	265.71658298248786	21/02/24 15:38:56
21	962	331.4979265527206	265.7303413950318	21/02/24 15:38:56
21	962	331.5173115074277	265.9366688551018	21/02/24 15:38:56
21	962	331.57883100723444	265.9817565223069	21/02/24 15:38:56
21	962	331.4978506208641	265.91683965864513	21/02/24 15:38:56
21	962	331.4735713584283	265.76933667158215	21/02/24 15:38:56
21	962	331.2929939950765	265.90945979771897	21/02/24 15:38:56
21	962	331.16823963971797	266.0257746704087	21/02/24 15:38:56
21	962	331.13034707752865	266.18654829766336	21/02/24 15:38:57
21	962	331.2313635586244	266.0178395737246	21/02/24 15:38:57
21	962	331.0260370887108	266.02152519608046	21/02/24 15:38:57
21	962	331.09370395943733	265.9915323590292	21/02/24 15:38:57
21	962	330.9417179443374	265.87091042670266	21/02/24 15:38:57
21	962	330.93549633894577	265.8668890011262	21/02/24 15:38:57
21	962	331.0005081597894	265.8612789535539	21/02/24 15:38:57
21	962	331.2505407932338	265.8904177431725	21/02/24 15:38:57
21	962	331.35753509894465	266.01653815625906	21/02/24 15:38:57
21	962	331.5296764141271	266.07672989273635	21/02/24 15:38:58
21	962	331.53449400076494	266.26018678457814	21/02/24 15:38:58
21	962	331.4219941350062	266.36367259004015	21/02/24 15:38:58
21	962	331.4812588715667	266.265944760507	21/02/24 15:38:58
21	962	331.4395383384028	266.1486506906055	21/02/24 15:38:58
21	962	331.0757661868995	266.2155648626439	21/02/24 15:38:58
21	962	330.8564341564557	266.244595768043	21/02/24 15:38:58
21	962	330.9214968428949	266.2345644393744	21/02/24 15:38:58
21	962	331.0768651477063	266.10252795767445	21/02/24 15:38:58
21	962	331.0327942761443	266.1974072545443	21/02/24 15:38:58
21	962	331.19089861374107	266.1714949684751	21/02/24 15:38:59
21	962	331.27114736076453	266.4176021956014	21/02/24 15:38:59
21	962	331.1801164164076	266.47011662699964	21/02/24 15:38:59
21	962	331.2798327409036	266.39147949193966	21/02/24 15:38:59
21	962	331.329406811633	266.37936462864155	21/02/24 15:38:59
21	962	331.52006603914293	266.3309794150067	21/02/24 15:38:59
21	962	331.483756915366	266.30817399273417	21/02/24 15:38:59
21	962	331.5422707183355	266.36459132099225	21/02/24 15:38:59
21	962	331.5599773474559	266.3860681080008	21/02/24 15:38:59
21	962	331.48263021516334	266.5455407906879	21/02/24 15:39:00
21	962	331.60615444763147	266.66098787176793	21/02/24 15:39:00
21	962	331.60615444763147	266.66098787176793	21/02/24 15:39:00
21	962	331.4451036255456	266.53317159671474	21/02/24 15:39:00
21	962	331.51890711947675	266.37064975384953	21/02/24 15:39:00
21	962	331.34104178264755	266.4950861300133	21/02/24 15:39:00
21	962	331.23056200104514	266.2297084563679	21/02/24 15:39:00
21	962	331.1929533510733	266.0152259201821	21/02/24 15:39:00
21	962	331.1474290244778	266.1136494248027	21/02/24 15:39:00
21	962	331.07706883395787	266.2787129573296	21/02/24 15:39:00
21	962	330.9580891347675	266.4583182830204	21/02/24 15:39:01
21	962	330.8648281974472	266.1864021160188	21/02/24 15:39:01
21	962	330.8414892868159	266.4463912250102	21/02/24 15:39:01
21	962	330.58595092440277	266.3665772502545	21/02/24 15:39:01
21	962	330.5718101203712	266.37495818513787	21/02/24 15:39:01
21	962	330.65662352300825	266.5133946551798	21/02/24 15:39:01
21	962	330.6878127374867	266.44984276760107	21/02/24 15:39:01
21	962	330.9027581202981	266.39401769568957	21/02/24 15:39:01
21	962	330.76925779853974	266.4111506367667	21/02/24 15:39:01
21	962	330.72752979131695	266.343447401041	21/02/24 15:39:01
21	962	330.90940785141686	266.3242579173452	21/02/24 15:39:02
21	962	330.85030776983575	266.39620620751305	21/02/24 15:39:02
21	962	330.85030776983575	266.39620620751305	21/02/24 15:39:02
21	962	330.85030776983575	266.39620620751305	21/02/24 15:39:02
21	962	331.03151373112337	266.40635025473995	21/02/24 15:39:02
21	962	330.9106945074408	266.3292035941058	21/02/24 15:39:02
21	962	330.6563861538912	266.407766338131	21/02/24 15:39:02
21	962	330.8271544276644	266.22999489736327	21/02/24 15:39:02
21	962	330.8048157776703	266.22226029894927	21/02/24 15:39:02
21	962	330.74911639609104	265.95392026864687	21/02/24 15:39:03
21	962	330.8212392808764	266.0327025700711	21/02/24 15:39:03
21	962	330.804112000922	266.0556554726741	21/02/24 15:39:03
21	962	330.83459133356405	266.1877384297379	21/02/24 15:39:03
21	962	330.9790555446262	266.3139949188802	21/02/24 15:39:03
21	962	330.8980015089347	266.5712932085911	21/02/24 15:39:03
21	962	330.7588323562049	266.82197838807747	21/02/24 15:39:03
21	962	330.79414328245474	266.780549451807	21/02/24 15:39:03
21	962	330.87514487322017	266.8738488677639	21/02/24 15:39:03
21	962	330.9816278297811	266.91324663118405	21/02/24 15:39:03
21	962	330.9814211528885	266.9157530775054	21/02/24 15:39:04
21	962	331.0063321137999	266.9080396520361	21/02/24 15:39:04
21	962	330.9476857338151	266.90673390800015	21/02/24 15:39:04
21	962	330.9321844221956	266.92193391767205	21/02/24 15:39:04
21	962	330.92203853365476	266.9484836590947	21/02/24 15:39:04
21	962	330.9682857925891	267.0937644135995	21/02/24 15:39:04
21	962	330.96327294998196	267.0952212650649	21/02/24 15:39:04
21	962	331.0398006546624	267.1004051532494	21/02/24 15:39:04
21	962	331.08702316655075	267.0831892545465	21/02/24 15:39:04
21	962	330.9358673935568	267.23571913345205	21/02/24 15:39:04
21	962	330.91958535390546	266.98319208893435	21/02/24 15:39:05
21	962	330.8719876559774	266.828352714294	21/02/24 15:39:05
21	962	331.0456345166511	267.0559049811332	21/02/24 15:39:05
21	962	330.90598134882794	266.85714520772126	21/02/24 15:39:05
21	962	330.6525948280686	266.8516361053718	21/02/24 15:39:05
21	962	330.9005748930936	266.84286719425427	21/02/24 15:39:05
21	962	330.9037133382045	266.9232709255283	21/02/24 15:39:05
21	962	330.81183449230474	266.9793366380753	21/02/24 15:39:05
21	962	330.7923380404992	266.97705257959535	21/02/24 15:39:05
21	962	330.9374763205513	266.8048639102803	21/02/24 15:39:06
21	962	331.17560266198865	266.76038450828054	21/02/24 15:39:06
21	962	331.127847552794	266.8516740210707	21/02/24 15:39:06
21	962	331.0230614717023	266.7661588481664	21/02/24 15:39:06
21	962	331.0285613639066	266.73527894944186	21/02/24 15:39:06
21	962	331.16364225975724	266.81780769159616	21/02/24 15:39:06
21	962	331.1211293693654	266.82837043533453	21/02/24 15:39:06
21	962	331.1187905348854	266.8190028175452	21/02/24 15:39:06
21	962	331.2631784009116	266.7735380039574	21/02/24 15:39:06
21	962	331.2591480440922	266.81396032276496	21/02/24 15:39:06
21	962	331.37089670838105	266.8005533548494	21/02/24 15:39:07
21	962	331.34177727106413	266.88586261772224	21/02/24 15:39:07
21	962	331.4103255627826	266.8919187981275	21/02/24 15:39:07
21	962	331.2725588152951	266.8691419038556	21/02/24 15:39:07
21	962	331.5401106601137	266.94816316791014	21/02/24 15:39:07
21	962	331.7369683400711	267.1365724615139	21/02/24 15:39:07
21	962	331.62639114931085	267.21048747081187	21/02/24 15:39:07
21	962	331.6241667370692	267.32352185515526	21/02/24 15:39:07
21	962	331.68692478186915	267.25658948592627	21/02/24 15:39:07
21	962	331.6892461024107	267.25224979593	21/02/24 15:39:07
21	962	331.55844109178855	267.2183455282378	21/02/24 15:39:08
21	962	331.7671259977648	267.0390181056286	21/02/24 15:39:08
21	962	331.79088862041635	267.2300691811266	21/02/24 15:39:08
21	962	331.82013946144275	267.1619079813318	21/02/24 15:39:08
21	962	331.8960488732862	267.3065587586052	21/02/24 15:39:08
21	962	331.8236795201786	267.3747145519538	21/02/24 15:39:08
21	962	331.72716988185044	267.34875174559846	21/02/24 15:39:08
21	962	331.67251183968006	267.53305707563	21/02/24 15:39:08
21	962	331.5297583495084	267.55319795962924	21/02/24 15:39:08
21	962	331.42200519819596	267.5957472065353	21/02/24 15:39:09
21	962	331.45697610117696	267.78873192832714	21/02/24 15:39:09
21	962	331.63276499803885	267.87194621059894	21/02/24 15:39:09
21	962	331.4928467860033	268.0670563654752	21/02/24 15:39:09
21	962	331.49672937479426	268.0872571361355	21/02/24 15:39:09
21	962	331.50612880345403	268.08548990728383	21/02/24 15:39:09
21	962	331.69194835607107	268.223374439418	21/02/24 15:39:09
21	962	331.6397077122274	268.44610985089946	21/02/24 15:39:09
21	962	331.53174510472866	268.26699328816136	21/02/24 15:39:09
21	962	331.3946257723011	268.4057373735556	21/02/24 15:39:09
21	962	331.37633856094175	268.6119836981915	21/02/24 15:39:10
21	962	331.36226718832035	268.6205389081762	21/02/24 15:39:10
21	962	331.2164014686787	268.6317410096218	21/02/24 15:39:10
21	962	331.06411390029245	268.5867467052611	21/02/24 15:39:10
21	962	331.234790192573	268.70063567302765	21/02/24 15:39:10
21	962	331.0903138412644	268.76092613513396	21/02/24 15:39:10
21	962	331.10521488125204	268.80026156956046	21/02/24 15:39:10
21	962	331.26240576833857	268.67409846850296	21/02/24 15:39:10
21	962	331.07812971268567	268.59991165656294	21/02/24 15:39:10
21	962	331.276339534921	268.62873253037355	21/02/24 15:39:10
21	962	331.31107721853795	268.7462013839891	21/02/24 15:39:11
21	962	331.27203274542956	268.8036670971268	21/02/24 15:39:11
21	962	331.2220269905086	268.6173457465673	21/02/24 15:39:11
21	962	331.17686587787927	268.55085705543905	21/02/24 15:39:11
21	962	331.18929359777684	268.4979816044398	21/02/24 15:39:11
21	962	331.16152077953126	268.44567393077665	21/02/24 15:39:11
21	962	331.17971876919745	268.47899232397475	21/02/24 15:39:11
21	962	331.2894158719966	268.34024281135277	21/02/24 15:39:11
21	962	331.44801840966136	268.16746708165164	21/02/24 15:39:11
21	962	331.5242832930139	268.3693375899687	21/02/24 15:39:12
21	962	331.74171812804036	268.22799592585085	21/02/24 15:39:12
21	962	331.60793565262003	268.1180853214611	21/02/24 15:39:12
21	962	331.6144857335782	267.8691531090767	21/02/24 15:39:12
21	962	331.59992068775284	267.8329379194114	21/02/24 15:39:12
21	962	331.68725536975677	267.7217635762157	21/02/24 15:39:12
21	962	331.65812874849263	267.7737651636836	21/02/24 15:39:12
21	962	331.7754376991041	267.8105308908491	21/02/24 15:39:12
21	962	331.86444957585536	267.9718692529269	21/02/24 15:39:12
21	962	331.7977910114895	268.0391621470009	21/02/24 15:39:12
21	962	331.7575291523042	268.16865048419186	21/02/24 15:39:13
21	962	331.750658132564	268.17764183362846	21/02/24 15:39:13
21	962	331.59865393666104	268.17868115393844	21/02/24 15:39:13
21	962	331.53649505921777	268.2785134031484	21/02/24 15:39:13
21	962	331.68361893858497	268.329078823935	21/02/24 15:39:13
21	962	331.6683971705595	268.2422010290253	21/02/24 15:39:13
21	962	331.58021160112656	268.2062090602646	21/02/24 15:39:13
21	962	331.4547304887257	267.9600922269397	21/02/24 15:39:13
21	962	331.49741127366957	268.09774529808135	21/02/24 15:39:13
21	962	331.44887886495184	268.1600754341299	21/02/24 15:39:13
21	962	331.25105636385257	268.1817870160049	21/02/24 15:39:14
21	962	331.10158036818433	268.19408986021944	21/02/24 15:39:14
21	962	331.18043279906476	268.1553497241544	21/02/24 15:39:14
21	962	331.23742892521284	268.0989747631419	21/02/24 15:39:14
21	962	331.25489655004543	268.06962509377365	21/02/24 15:39:14
21	962	331.2433303516776	268.2313217641601	21/02/24 15:39:14
21	962	331.3242957280526	268.0652301503773	21/02/24 15:39:14
21	962	331.2385638692374	268.07022591562446	21/02/24 15:39:14
21	962	331.0154975743302	267.9255787309957	21/02/24 15:39:14
21	962	331.0429317807241	267.9348124469418	21/02/24 15:39:15
21	962	330.99575396102483	268.11054667992005	21/02/24 15:39:15
21	962	330.9948335712011	268.21554588976835	21/02/24 15:39:15
21	962	331.13975194736474	268.3468617180827	21/02/24 15:39:15
21	962	331.0634106298808	268.3410728466243	21/02/24 15:39:15
21	962	331.29055341656743	268.20437275409347	21/02/24 15:39:15
21	962	331.3189927164007	268.1259840918727	21/02/24 15:39:15
21	962	331.3817747504929	268.05977909187794	21/02/24 15:39:15
21	962	331.5821320600594	267.9811338126938	21/02/24 15:39:15
21	962	331.5821320600594	267.9811338126938	21/02/24 15:39:15
21	962	331.5821320600594	267.9811338126938	21/02/24 15:39:16
21	962	331.82885334594005	267.8247854642382	21/02/24 15:39:16
21	962	331.7009122937653	267.8078608478773	21/02/24 15:39:16
21	962	331.7330335743237	267.82067102710073	21/02/24 15:39:16
21	962	331.7487449527552	267.79681837719585	21/02/24 15:39:16
21	962	331.7085499547656	267.6696611533766	21/02/24 15:39:16
21	962	331.70345209024043	267.92539303370637	21/02/24 15:39:16
21	962	331.72222527633676	267.6672432390395	21/02/24 15:39:16
21	962	331.71144770865783	267.8016325760843	21/02/24 15:39:16
21	962	331.6049416225576	267.56440118832796	21/02/24 15:39:16
21	962	331.71621126032363	267.4455194147655	21/02/24 15:39:17
21	962	331.73801115560724	267.20976293844575	21/02/24 15:39:17
21	962	331.6965505564419	267.19121339577214	21/02/24 15:39:17
21	962	331.66446447932185	267.4031447604565	21/02/24 15:39:17
21	962	331.6065041748952	267.43643415918365	21/02/24 15:39:17
21	962	331.5356169691822	267.37523065548635	21/02/24 15:39:17
21	962	331.5688517657925	267.4328395072477	21/02/24 15:39:17
21	962	331.5479372351485	267.6583007167849	21/02/24 15:39:17
21	962	331.4007731987322	267.51533690536996	21/02/24 15:39:17
21	962	331.6081856759151	267.34380147849987	21/02/24 15:39:17
21	962	331.7950883263812	267.26554275962786	21/02/24 15:39:18
21	962	331.7779784903511	267.3252353406562	21/02/24 15:39:18
21	962	331.74623996578225	267.2452350622302	21/02/24 15:39:18
21	962	331.73460684126997	266.9473152619944	21/02/24 15:39:18
21	962	331.7857723038263	266.9423661995078	21/02/24 15:39:18
21	962	332.0487119446457	266.84404954424804	21/02/24 15:39:18
21	962	331.9716298553094	266.8656661239597	21/02/24 15:39:18
21	962	331.7310890335687	266.99071772210823	21/02/24 15:39:18
21	962	331.86237145679735	267.13273146470897	21/02/24 15:39:18
21	962	331.8552056230432	267.15721938434604	21/02/24 15:39:19
21	962	331.8519039946822	267.16094442265864	21/02/24 15:39:19
21	962	331.8123848549584	267.1020699253404	21/02/24 15:39:19
21	962	331.73566318740905	267.22392676615334	21/02/24 15:39:19
21	962	331.70252609795733	267.07435041053424	21/02/24 15:39:19
21	962	331.7542338954047	266.9397709236481	21/02/24 15:39:19
21	962	331.94698838327076	267.0552857657121	21/02/24 15:39:19
21	962	331.86003589262947	267.0733853060503	21/02/24 15:39:19
21	962	331.86693160864513	267.0594979515721	21/02/24 15:39:19
21	962	332.04975100173533	266.8565744014556	21/02/24 15:39:19
21	962	332.1301851140355	266.68550055232686	21/02/24 15:39:20
21	962	332.1746894799401	266.41696066841166	21/02/24 15:39:20
21	962	332.13425715056866	266.3770375901402	21/02/24 15:39:20
21	962	332.14577345346345	266.32215671986313	21/02/24 15:39:20
21	962	332.35088321494464	266.3039024863001	21/02/24 15:39:20
21	962	332.3338420724704	266.3823683000484	21/02/24 15:39:20
21	962	332.27611163926326	266.4284101822631	21/02/24 15:39:20
21	962	332.108005789815	266.3652378625852	21/02/24 15:39:20
21	962	332.3575009561551	266.2651810060403	21/02/24 15:39:20
21	962	332.43894496430073	266.18492127940425	21/02/24 15:39:20
21	962	332.63189336541444	266.40958534320157	21/02/24 15:39:21
21	962	332.5962220026418	266.47408066123904	21/02/24 15:39:21
21	962	332.5103697052785	266.32198054272834	21/02/24 15:39:21
21	962	332.6149489230285	266.43832150193884	21/02/24 15:39:21
21	962	332.5345255774683	266.34084187633505	21/02/24 15:39:21
21	962	332.7954572252909	266.3991585643018	21/02/24 15:39:21
21	962	332.7064684828452	266.40196272547826	21/02/24 15:39:21
21	962	332.77032246323796	266.540102104047	21/02/24 15:39:21
21	962	332.77828056151947	266.50966559709934	21/02/24 15:39:21
21	962	332.87506324616265	266.7157437562689	21/02/24 15:39:22
21	962	332.70150259051826	266.5921682010549	21/02/24 15:39:22
21	962	332.85896944837845	266.621718974158	21/02/24 15:39:22
21	962	332.8864250484631	266.6433676483889	21/02/24 15:39:22
21	962	332.9195910206268	266.66247313358974	21/02/24 15:39:22
21	962	332.87646406741345	266.5772782744072	21/02/24 15:39:22
21	962	332.96302815297884	266.61629297102706	21/02/24 15:39:22
21	962	332.9845957159543	266.58364491765326	21/02/24 15:39:22
21	962	333.1336789698129	266.80378746677496	21/02/24 15:39:22
21	962	333.1009330308215	267.07348525968735	21/02/24 15:39:22
21	962	332.96183652844365	266.8278719161334	21/02/24 15:39:23
21	962	333.08661986048105	266.7791928654982	21/02/24 15:39:23
21	962	332.93585047454434	266.70978753280474	21/02/24 15:39:23
21	962	332.9115509658725	266.6289937919947	21/02/24 15:39:23
21	962	333.09169318417474	266.71928992247507	21/02/24 15:39:23
21	962	333.01913328116405	266.76313488960676	21/02/24 15:39:23
21	962	332.8891304194603	266.5527460753261	21/02/24 15:39:23
21	962	332.8450818538036	266.5002680112977	21/02/24 15:39:23
21	962	332.96554852923776	266.6079489049764	21/02/24 15:39:23
21	962	333.0191957391586	266.5469396708268	21/02/24 15:39:23
21	962	332.7605007201535	266.56354237521236	21/02/24 15:39:24
21	962	332.5806326427718	266.4256698046169	21/02/24 15:39:24
21	962	332.5672392385581	266.3843750403472	21/02/24 15:39:24
21	962	332.5696095815312	266.27124880488014	21/02/24 15:39:24
21	962	332.7799219750272	266.3424271777326	21/02/24 15:39:24
21	962	332.6993529836558	266.3412622295267	21/02/24 15:39:24
21	962	332.7848197701589	266.48057150826463	21/02/24 15:39:24
21	962	332.6548685129697	266.4810096242428	21/02/24 15:39:24
21	962	332.6424425097275	266.4728219492551	21/02/24 15:39:24
21	962	332.6523369785935	266.6836761011883	21/02/24 15:39:25
21	962	332.5601981246141	266.45837907688343	21/02/24 15:39:25
21	962	332.5738643825445	266.56676973054516	21/02/24 15:39:25
21	962	332.41462233304617	266.6781098837302	21/02/24 15:39:25
21	962	332.32993758235904	266.6192018093317	21/02/24 15:39:25
21	962	332.15247962551	266.6397366401169	21/02/24 15:39:25
21	962	332.1972539027853	266.46153364116094	21/02/24 15:39:25
21	962	332.0631893259573	266.5616078362151	21/02/24 15:39:25
21	962	331.8449629325539	266.58645473465737	21/02/24 15:39:25
21	962	331.9673828500963	266.42393563774164	21/02/24 15:39:25
21	962	331.77889519362753	266.60558306033437	21/02/24 15:39:26
21	962	331.737170936324	266.7124711343987	21/02/24 15:39:26
21	962	331.69037722166	266.7180113071381	21/02/24 15:39:26
21	962	331.68404095205864	266.72682866607926	21/02/24 15:39:26
21	962	331.7581907014453	266.75511788861337	21/02/24 15:39:26
21	962	331.8019987670522	266.8021822584448	21/02/24 15:39:26
21	962	331.79263854414154	266.8774564633905	21/02/24 15:39:26
21	962	331.888512911621	266.78871461162686	21/02/24 15:39:26
21	962	331.8323907208349	267.0581946857441	21/02/24 15:39:26
21	962	332.0999736346625	267.16754748590523	21/02/24 15:39:26
21	962	332.3263909571605	267.2283411727273	21/02/24 15:39:27
21	962	332.2245090371049	266.95288832830425	21/02/24 15:39:27
21	962	332.1810695854485	266.94371202752285	21/02/24 15:39:27
21	962	331.9502735599048	266.97845057343113	21/02/24 15:39:27
21	962	332.19637297361544	266.92047169472283	21/02/24 15:39:27
21	962	332.102056405697	266.6566828834321	21/02/24 15:39:27
21	962	331.98419338287516	266.74039480877764	21/02/24 15:39:27
21	962	331.83085163711223	266.6587491448905	21/02/24 15:39:27
21	962	331.7533050044474	266.59778251646134	21/02/24 15:39:27
21	962	331.7815483253487	266.59926900852645	21/02/24 15:39:28
21	962	332.04183393348967	266.46609635179266	21/02/24 15:39:28
21	962	332.0131405421173	266.4135026513911	21/02/24 15:39:28
21	962	331.98008146096606	266.4836972296643	21/02/24 15:39:28
21	962	332.11239053409224	266.3830258533259	21/02/24 15:39:28
21	962	332.04371775959726	266.4824240718796	21/02/24 15:39:28
21	962	331.9375059093501	266.6219788349377	21/02/24 15:39:28
21	962	332.01300067785	266.51342135608957	21/02/24 15:39:28
21	962	331.97277450378306	266.7465993798191	21/02/24 15:39:28
21	962	331.7384249636711	266.7317866630897	21/02/24 15:39:28
21	962	331.7363690227832	266.91707775451925	21/02/24 15:39:29
21	962	331.89186634735756	266.78706340868274	21/02/24 15:39:29
21	962	331.73952051749933	266.78803644377876	21/02/24 15:39:29
21	962	331.77218525826345	266.8574165989441	21/02/24 15:39:29
21	962	331.91067791803766	266.8922566685404	21/02/24 15:39:29
21	962	331.65601201810375	266.9794676114069	21/02/24 15:39:29
21	962	331.61719414673547	267.1119471009103	21/02/24 15:39:29
21	962	331.4798281818275	267.089676421029	21/02/24 15:39:29
21	962	331.2413113626359	266.9158691856114	21/02/24 15:39:29
21	962	331.2299907152825	266.89322720305694	21/02/24 15:39:30
21	962	331.1344710810346	266.7744729189091	21/02/24 15:39:30
21	962	331.18376322275975	266.6801166156311	21/02/24 15:39:30
21	962	331.1267554084163	266.68244540563205	21/02/24 15:39:30
21	962	331.07954542928815	266.7659213079539	21/02/24 15:39:30
21	962	331.1671020416848	266.89693580800196	21/02/24 15:39:30
21	962	331.15756750776904	266.76355825475093	21/02/24 15:39:30
21	962	331.1297991646246	266.5417602612173	21/02/24 15:39:30
21	962	331.1866130430857	266.3468387461939	21/02/24 15:39:30
21	962	331.2207062766599	266.34993343290535	21/02/24 15:39:30
21	962	331.2903414830986	266.12862340926887	21/02/24 15:39:31
21	962	331.3713950262296	266.0670152899442	21/02/24 15:39:31
21	962	331.3671909468914	266.0488612290343	21/02/24 15:39:31
21	962	331.274244148339	266.02191985628866	21/02/24 15:39:31
21	962	331.1006090248196	266.06315440690554	21/02/24 15:39:31
21	962	331.05748759304225	266.11529277935205	21/02/24 15:39:31
21	962	331.2018136204029	265.94142594289474	21/02/24 15:39:31
21	962	331.1059170426504	265.94052379884255	21/02/24 15:39:31
21	962	331.0148063380527	266.1609782946507	21/02/24 15:39:31
21	962	330.9230891542354	266.12722173669283	21/02/24 15:39:31
21	962	330.9007741226594	265.9791551550714	21/02/24 15:39:32
21	962	330.88964220091884	265.7660167077013	21/02/24 15:39:32
21	962	331.09637798690983	265.877781164603	21/02/24 15:39:32
21	962	331.053364963348	265.87507074813664	21/02/24 15:39:32
21	962	330.9451548252542	265.9442473760633	21/02/24 15:39:32
21	962	330.94334761600004	266.0185501108837	21/02/24 15:39:32
21	962	331.00323542584357	265.89989884067376	21/02/24 15:39:32
21	962	331.0353305190776	265.79970721686914	21/02/24 15:39:32
21	962	330.89856133558936	265.91234235104696	21/02/24 15:39:32
21	962	330.888884720311	266.1977475951176	21/02/24 15:39:32
21	962	330.97024642872475	266.3399968648815	21/02/24 15:39:33
21	962	331.1997761642225	266.34097649229363	21/02/24 15:39:33
21	962	331.23509894342254	266.3518802258207	21/02/24 15:39:33
21	962	331.1194333600644	266.38762053400626	21/02/24 15:39:33
21	962	331.1101288710425	266.3920263934278	21/02/24 15:39:33
21	962	331.36078296908437	266.2324864384572	21/02/24 15:39:33
21	962	331.22961016333664	266.42196203244754	21/02/24 15:39:33
21	962	331.0401771067792	266.63481380744525	21/02/24 15:39:33
21	962	331.2596798334938	266.470905233002	21/02/24 15:39:33
21	962	331.3868953027482	266.3532923920654	21/02/24 15:39:34
21	962	331.4984320118192	266.14352112183184	21/02/24 15:39:34
21	962	331.4522656275902	266.2056084347327	21/02/24 15:39:34
21	962	331.48587044792464	266.2827254957895	21/02/24 15:39:34
21	962	331.52942130764893	266.23095109942597	21/02/24 15:39:34
21	962	331.6843282769804	265.98503970467965	21/02/24 15:39:34
21	962	331.7477627037653	265.94565890736607	21/02/24 15:39:34
21	962	331.82952533608284	266.02754808505006	21/02/24 15:39:34
21	962	331.8671537737912	265.8469782837667	21/02/24 15:39:34
21	962	332.10260481957	265.8512468653396	21/02/24 15:39:34
21	962	331.9747052621482	265.68870582319636	21/02/24 15:39:35
21	962	331.9747052621482	265.68870582319636	21/02/24 15:39:35
21	962	331.9747052621482	265.68870582319636	21/02/24 15:39:35
21	962	331.9653611570196	265.5554931610233	21/02/24 15:39:35
21	962	332.03527414450417	265.47626032927957	21/02/24 15:39:35
21	962	331.9207899774306	265.4358657673701	21/02/24 15:39:35
21	962	332.11375920628075	265.3967269942472	21/02/24 15:39:35
21	962	332.1061517799986	265.31669259427764	21/02/24 15:39:35
21	962	332.0866739901311	265.3216058625814	21/02/24 15:39:35
21	962	332.265736988372	265.31887026210626	21/02/24 15:39:35
21	962	332.3558653795191	265.5036277009629	21/02/24 15:39:36
21	962	332.5707786702121	265.5246955635182	21/02/24 15:39:36
21	962	332.4679156650337	265.62734674725965	21/02/24 15:39:36
21	962	332.38632646155264	265.65917637501025	21/02/24 15:39:36
21	962	332.34602788404163	265.7625272337923	21/02/24 15:39:36
21	962	332.5033898646347	265.68755653003853	21/02/24 15:39:36
21	962	332.5732125661487	265.7652956208965	21/02/24 15:39:36
21	962	332.58604434876116	265.7821270604017	21/02/24 15:39:36
21	962	332.69881770796474	265.98876150484114	21/02/24 15:39:36
21	962	332.8734474585389	265.8944481446122	21/02/24 15:39:37
21	962	332.8682465569806	265.89438585137384	21/02/24 15:39:37
21	962	332.8030802366893	265.8211357012791	21/02/24 15:39:37
21	962	332.68993232855183	265.75576651577853	21/02/24 15:39:37
21	962	332.69818405434023	265.7690898328348	21/02/24 15:39:37
21	962	332.5950398917538	265.82566201886493	21/02/24 15:39:37
21	962	332.6276988402795	265.8774121960477	21/02/24 15:39:37
21	962	332.7018891289333	265.91130128347464	21/02/24 15:39:37
21	962	332.7108108852925	265.9052358426236	21/02/24 15:39:37
21	962	332.6329665154237	265.9082516659568	21/02/24 15:39:37
21	962	332.6419833603863	265.9236637845283	21/02/24 15:39:38
21	962	332.61248679577454	265.83395987277765	21/02/24 15:39:38
21	962	332.641160198814	265.8149440195513	21/02/24 15:39:38
21	962	332.64185417490603	265.8140780259027	21/02/24 15:39:38
21	962	332.47640361092226	265.61807737058444	21/02/24 15:39:38
21	962	332.561697832353	265.5301859960231	21/02/24 15:39:38
21	962	332.5828139621794	265.691248110812	21/02/24 15:39:38
21	962	332.59906254537947	265.4612071202097	21/02/24 15:39:38
21	962	332.55112650077456	265.36506195591727	21/02/24 15:39:38
21	962	332.41307577892945	265.30560954849625	21/02/24 15:39:38
21	962	332.31637730091336	265.04044579474026	21/02/24 15:39:39
21	962	332.3733408159466	264.92788832279854	21/02/24 15:39:39
21	962	332.2771650569952	264.8287749813072	21/02/24 15:39:39
21	962	332.29853152199263	264.82895187941705	21/02/24 15:39:39
21	962	332.4031549555707	264.8496298360088	21/02/24 15:39:39
21	962	332.20655716430446	264.9422747190645	21/02/24 15:39:39
21	962	332.206563982788	264.9289717409987	21/02/24 15:39:39
21	962	332.43016212788416	265.0220586562598	21/02/24 15:39:39
21	962	332.4182403580942	265.30239102814056	21/02/24 15:39:39
21	962	332.19300354626483	265.1206059502391	21/02/24 15:39:40
21	962	332.1817674959058	265.04191953195954	21/02/24 15:39:40
21	962	332.09876915274396	264.8836318482936	21/02/24 15:39:40
21	962	332.07084504069843	264.87033786740017	21/02/24 15:39:40
21	962	332.03670526143026	264.84662406071226	21/02/24 15:39:40
21	962	332.1896669929192	264.8926234789798	21/02/24 15:39:40
21	962	332.3677214511171	265.0666028292913	21/02/24 15:39:40
21	962	332.37104952528193	265.05688319788317	21/02/24 15:39:40
21	962	332.37374319371736	265.0492174031675	21/02/24 15:39:40
21	962	332.3733117339226	265.0035797630266	21/02/24 15:39:40
21	962	332.26639206669927	264.99671500578063	21/02/24 15:39:41
21	962	332.4217237029103	265.21436281228404	21/02/24 15:39:41
21	962	332.6350876833001	265.2866459555904	21/02/24 15:39:41
21	962	332.62788334824427	265.2995779538884	21/02/24 15:39:41
21	962	332.69415769863053	265.30644409034267	21/02/24 15:39:41
21	962	332.7660529661017	265.3050803420653	21/02/24 15:39:41
21	962	332.76507844692406	265.23758382443253	21/02/24 15:39:41
21	962	332.820378573043	265.2194794039061	21/02/24 15:39:41
21	962	332.9508345167779	265.47683333231504	21/02/24 15:39:41
21	962	332.9886670686256	265.3193809491858	21/02/24 15:39:41
21	962	332.9817887069533	265.3477814039893	21/02/24 15:39:42
21	962	332.8367701833477	265.4483015951966	21/02/24 15:39:42
21	962	332.96875512350033	265.45133862085964	21/02/24 15:39:42
21	962	332.94123479226715	265.4510775536171	21/02/24 15:39:42
21	962	332.89491362285816	265.23323896861956	21/02/24 15:39:42
21	962	332.93882175304213	265.1389374225353	21/02/24 15:39:42
21	962	332.9532175919833	265.3824665472782	21/02/24 15:39:42
21	962	332.7192789832729	265.2138046622478	21/02/24 15:39:42
21	962	332.7608744396627	265.28072158703924	21/02/24 15:39:42
21	962	332.51052298550877	265.1254834449819	21/02/24 15:39:43
21	962	332.49030637586617	264.9714318950684	21/02/24 15:39:43
21	962	332.45734085610064	264.8606513617931	21/02/24 15:39:43
21	962	332.4528771615763	264.8531737331863	21/02/24 15:39:43
21	962	332.3632210562327	264.9633699284441	21/02/24 15:39:43
21	962	332.09798301434523	264.8441500026821	21/02/24 15:39:43
21	962	332.2827279024372	264.6729029021932	21/02/24 15:39:43
21	962	332.23922677206235	264.7028588703914	21/02/24 15:39:43
21	962	332.26616371503155	264.6717592984579	21/02/24 15:39:43
21	962	332.4297618294625	264.74853904047853	21/02/24 15:39:43
21	962	332.5040846779394	264.73891106179224	21/02/24 15:39:44
21	962	332.3015105138625	264.9328476728165	21/02/24 15:39:44
21	962	332.27596941354955	264.9193740679661	21/02/24 15:39:44
21	962	332.3448675572241	265.1865350318158	21/02/24 15:39:44
21	962	332.37053280839103	265.1510342788512	21/02/24 15:39:44
21	962	332.52624582662924	265.22073755359776	21/02/24 15:39:44
21	962	332.55203455575185	265.0836240646101	21/02/24 15:39:44
21	962	332.45739794101536	265.33620274122944	21/02/24 15:39:44
21	962	332.54223061836547	265.26252842160847	21/02/24 15:39:44
21	962	332.43658504774885	265.07537152001805	21/02/24 15:39:44
21	962	332.498139241147	265.0859810054003	21/02/24 15:39:45
21	962	332.2629872541807	265.1756140247281	21/02/24 15:39:45
21	962	332.22752882154685	265.03704067546005	21/02/24 15:39:45
21	962	332.31018038427567	265.07523579737517	21/02/24 15:39:45
21	962	332.3375749477711	265.22878786221764	21/02/24 15:39:45
21	962	332.54937917884416	265.3308197406187	21/02/24 15:39:45
21	962	332.57243164139544	265.58949905541897	21/02/24 15:39:45
21	962	332.74586387622304	265.67326529277864	21/02/24 15:39:45
21	962	332.7011015477303	265.7021580776891	21/02/24 15:39:45
21	962	332.5764704178757	265.952344280476	21/02/24 15:39:46
21	962	332.63565603044157	266.1323336108825	21/02/24 15:39:46
21	962	332.63722123445825	266.1217558405831	21/02/24 15:39:46
21	962	332.65345923273935	266.0915704313726	21/02/24 15:39:46
21	962	332.6549998688397	266.08460500700374	21/02/24 15:39:46
21	962	332.4618505161258	266.2951743738774	21/02/24 15:39:46
21	962	332.2920160907411	266.31465064050457	21/02/24 15:39:46
21	962	332.2935267426266	266.3082388429745	21/02/24 15:39:46
21	962	332.1518763293236	266.32290030392517	21/02/24 15:39:46
21	962	332.20499611446036	266.25177562939547	21/02/24 15:39:46
21	962	332.17814090478436	266.29311143068884	21/02/24 15:39:47
21	962	331.9653182339132	266.4036717735562	21/02/24 15:39:47
21	962	332.02561917240973	266.3753379855514	21/02/24 15:39:47
21	962	332.28273892455684	266.39948303341737	21/02/24 15:39:47
21	962	332.04553959458167	266.5404685441452	21/02/24 15:39:47
21	962	332.1284478768479	266.5510458061648	21/02/24 15:39:47
21	962	332.35637925230947	266.4287641217411	21/02/24 15:39:47
21	962	332.5131605612745	266.52083913710504	21/02/24 15:39:47
21	962	332.3857790685141	266.6538924366803	21/02/24 15:39:47
21	962	332.3879864532084	266.65175763413765	21/02/24 15:39:47
21	962	332.4155928208139	266.5568544071532	21/02/24 15:39:48
21	962	332.2306199749465	266.4993346982251	21/02/24 15:39:48
21	962	332.2096692651979	266.5239972344703	21/02/24 15:39:48
21	962	332.0248748527625	266.55664263259666	21/02/24 15:39:48
21	962	331.930195189008	266.4629414864748	21/02/24 15:39:48
21	962	332.1748730628671	266.55862370405504	21/02/24 15:39:48
21	962	332.29873934390906	266.64836956800633	21/02/24 15:39:48
21	962	332.08517554423	266.6416855695848	21/02/24 15:39:48
21	962	332.1213813643497	266.39044135539837	21/02/24 15:39:48
21	962	332.3543692570073	266.2208067719226	21/02/24 15:39:49
21	962	332.3259632033773	266.17764016030884	21/02/24 15:39:49
21	962	332.5720212292498	266.1507095526014	21/02/24 15:39:49
21	962	332.5205518929318	266.43092362329776	21/02/24 15:39:49
21	962	332.33534384679126	266.23496851011305	21/02/24 15:39:49
21	962	332.3679701236384	265.9873144659318	21/02/24 15:39:49
21	962	332.4147239686379	266.22484817573906	21/02/24 15:39:49
21	962	332.4147239686379	266.22484817573906	21/02/24 15:39:49
21	962	332.3545828517335	266.24490448942254	21/02/24 15:39:49
21	962	332.3464472895705	266.29813072999826	21/02/24 15:39:49
21	962	332.41961880006943	266.1943951756362	21/02/24 15:39:50
21	962	332.52136009818935	266.285358391995	21/02/24 15:39:50
21	962	332.3581291484037	266.3572201671969	21/02/24 15:39:50
21	962	332.35442153035564	266.1097684215386	21/02/24 15:39:50
21	962	332.2437757808834	266.1718959191836	21/02/24 15:39:50
21	962	332.27389566782966	266.1476783307245	21/02/24 15:39:50
21	962	332.4204114794703	266.2224262886954	21/02/24 15:39:50
21	962	332.2821807784717	266.1502940920147	21/02/24 15:39:50
21	962	332.4218539858807	266.2817284516895	21/02/24 15:39:50
21	962	332.39164037444203	266.19566985081605	21/02/24 15:39:50
21	962	332.3706480305252	266.23966678872915	21/02/24 15:39:51
21	962	332.45472134648116	266.04943113571215	21/02/24 15:39:51
21	962	332.41775389174956	266.08893720563725	21/02/24 15:39:51
21	962	332.35542100857157	265.96904152461155	21/02/24 15:39:51
21	962	332.3287876954488	266.038200160409	21/02/24 15:39:51
21	962	332.3260608468276	266.181442982967	21/02/24 15:39:51
21	962	332.1410449356923	266.24513587322514	21/02/24 15:39:51
21	962	332.17971202849634	266.253946273535	21/02/24 15:39:51
21	962	332.17971202849634	266.253946273535	21/02/24 15:39:51
21	962	332.1190743186348	266.10446635013506	21/02/24 15:39:51
21	962	332.1190743186348	266.10446635013506	21/02/24 15:39:52
21	962	332.15044358140864	266.09390025873563	21/02/24 15:39:52
21	962	332.15044358140864	266.09390025873563	21/02/24 15:39:52
21	962	332.15044358140864	266.09390025873563	21/02/24 15:39:52
21	962	331.96391587363803	265.90891019698915	21/02/24 15:39:52
21	962	332.09929778858344	266.0026515893971	21/02/24 15:39:52
21	962	331.85297006762835	266.13086272208994	21/02/24 15:39:52
21	962	331.75517113845564	266.2962645390847	21/02/24 15:39:52
21	962	331.9926503425391	266.12884070350907	21/02/24 15:39:52
21	962	332.04402300759585	266.1077263747437	21/02/24 15:39:53
21	962	332.3409303051428	266.1035355515474	21/02/24 15:39:53
21	962	332.5222653966748	265.9667366353611	21/02/24 15:39:53
21	962	332.6630356102112	265.9258373207293	21/02/24 15:39:53
21	962	332.571561104948	265.92021369799954	21/02/24 15:39:53
21	962	332.30739235585304	265.9381075606669	21/02/24 15:39:53
21	962	332.5650302626417	265.91236371126064	21/02/24 15:39:53
21	962	332.52117679202155	265.6339000724326	21/02/24 15:39:53
21	962	332.2475321663051	265.7086730116322	21/02/24 15:39:53
21	962	332.16877987826024	265.97912310218834	21/02/24 15:39:53
21	962	332.2370265497316	265.94365824719705	21/02/24 15:39:54
21	962	331.9433861925558	265.972421330995	21/02/24 15:39:54
21	962	332.0862306690406	266.1763843824035	21/02/24 15:39:54
21	962	332.07486987325143	266.38889888800946	21/02/24 15:39:54
21	962	332.21012544177773	266.5482362225594	21/02/24 15:39:54
21	962	332.41804418460475	266.68250729666585	21/02/24 15:39:54
21	962	332.3181481851515	266.8770036410048	21/02/24 15:39:54
21	962	332.4021422776569	266.8672973960165	21/02/24 15:39:54
21	962	332.32985889688996	266.82633885916823	21/02/24 15:39:54
21	962	332.3840732977116	266.8262687665421	21/02/24 15:39:54
21	962	332.5058622850836	266.7794142197288	21/02/24 15:39:55
21	962	332.7901501082587	266.7493018918594	21/02/24 15:39:55
21	962	332.99723051234844	266.6545839214493	21/02/24 15:39:55
21	962	332.95280978569707	266.7464626261259	21/02/24 15:39:55
21	962	332.9022457836395	266.5322453413671	21/02/24 15:39:55
21	962	332.78874150551604	266.5814954006257	21/02/24 15:39:55
21	962	332.7600923733185	266.5965921544736	21/02/24 15:39:55
21	962	332.542289953532	266.6583968607795	21/02/24 15:39:55
21	962	332.6335368016109	266.73403088693004	21/02/24 15:39:55
21	962	332.6630898100392	266.72441938434923	21/02/24 15:39:56
21	962	332.44633470746777	266.8341850887379	21/02/24 15:39:56
21	962	332.36082247445955	266.5974563000064	21/02/24 15:39:56
21	962	332.185415444469	266.5985352109987	21/02/24 15:39:56
21	962	332.0652707085608	266.54002645859606	21/02/24 15:39:56
21	962	331.95247247033365	266.2881300608781	21/02/24 15:39:56
21	962	331.96624194746636	266.10789783813533	21/02/24 15:39:56
21	962	331.9972199724883	265.8853160613837	21/02/24 15:39:56
21	962	331.644565681961	266.02056506184186	21/02/24 15:39:56
21	962	331.54375254980374	266.0169835735727	21/02/24 15:39:56
21	962	331.54375254980374	266.0169835735727	21/02/24 15:39:57
21	962	331.6290825245453	265.8393027194653	21/02/24 15:39:57
21	962	331.70417649424013	265.8789112222567	21/02/24 15:39:57
21	962	331.915600357831	265.76669029312325	21/02/24 15:39:57
21	962	331.95817442210233	266.09024915708574	21/02/24 15:39:57
21	962	332.11404124292005	266.18283487197755	21/02/24 15:39:57
21	962	332.08482295966263	266.0441287865585	21/02/24 15:39:57
21	962	331.9974347260951	265.96226522567804	21/02/24 15:39:57
21	962	331.89457373979957	265.87427739679674	21/02/24 15:39:57
21	962	331.77519068282373	265.655890179198	21/02/24 15:39:58
21	962	331.81213606413473	265.635173059505	21/02/24 15:39:58
21	962	331.8059929427366	265.77426547134104	21/02/24 15:39:58
21	962	331.67942121092494	265.7635185701619	21/02/24 15:39:58
21	962	331.7733807182713	265.8873964233911	21/02/24 15:39:58
21	962	331.7796781839069	265.8671709902466	21/02/24 15:39:58
21	962	331.7740137767166	265.8685022083264	21/02/24 15:39:58
21	962	331.79409324339946	265.91396565552685	21/02/24 15:39:58
21	962	331.9904747740475	265.8634304817142	21/02/24 15:39:58
21	962	331.9323090527878	265.8358188166048	21/02/24 15:39:58
21	962	331.8774882838544	265.7755909328196	21/02/24 15:39:59
21	962	331.94266148890154	266.036514134555	21/02/24 15:39:59
21	962	331.9005772397032	266.33168907473396	21/02/24 15:39:59
21	962	332.04273484588214	266.1869908768039	21/02/24 15:39:59
21	962	332.04273484588214	266.1869908768039	21/02/24 15:39:59
21	962	332.0740003430165	266.17589232760514	21/02/24 15:39:59
21	962	331.92797802740137	266.2327476371879	21/02/24 15:39:59
21	962	331.9740598737851	266.2958218682342	21/02/24 15:39:59
21	962	331.9740598737851	266.2958218682342	21/02/24 15:39:59
21	962	331.7151893218436	266.6610659501561	21/02/24 15:39:59
21	962	331.7754714850121	266.95354260341423	21/02/24 15:40:00
21	962	331.68161416726855	266.9793180123631	21/02/24 15:40:00
21	962	331.68161416726855	266.9793180123631	21/02/24 15:40:00
21	962	331.82673928405853	266.89871465551505	21/02/24 15:40:00
21	962	331.82673928405853	266.89871465551505	21/02/24 15:40:00
21	962	332.06615977812083	266.8488949306732	21/02/24 15:40:00
21	962	331.9715859819689	267.14473152658854	21/02/24 15:40:00
21	962	331.9715859819689	267.14473152658854	21/02/24 15:40:00
21	962	332.2452175847341	267.1152112109274	21/02/24 15:40:00
21	962	332.18807106886334	267.14775716474816	21/02/24 15:40:00
21	962	332.056836355232	267.2596433065782	21/02/24 15:40:01
21	962	332.07724357560403	267.4039315187097	21/02/24 15:40:01
21	962	331.97992158699986	267.34148024751795	21/02/24 15:40:01
21	962	332.0054429017518	267.3153089564096	21/02/24 15:40:01
21	962	331.92039192950034	267.2574520441375	21/02/24 15:40:01
21	962	331.8843457627648	267.53375328620564	21/02/24 15:40:01
21	962	331.8843457627648	267.53375328620564	21/02/24 15:40:01
21	962	332.11313631235356	267.44338376004737	21/02/24 15:40:01
21	962	332.10752010859784	267.43391172999674	21/02/24 15:40:01
21	962	332.2642022365054	267.5091454866994	21/02/24 15:40:02
21	962	332.21356840890724	267.49782486854	21/02/24 15:40:02
21	962	332.2409920445062	267.2163029292859	21/02/24 15:40:02
21	962	332.2171574769908	267.14279944688064	21/02/24 15:40:02
21	962	332.16014872327827	267.0956819882268	21/02/24 15:40:02
21	962	332.3704232752435	266.9035436895057	21/02/24 15:40:02
21	962	332.4810848877007	267.1259558884033	21/02/24 15:40:02
21	962	332.4745225070991	267.1296929792575	21/02/24 15:40:02
21	962	332.6038054387974	267.1801316961232	21/02/24 15:40:02
21	962	332.55110166108176	267.38369404195373	21/02/24 15:40:02
21	962	332.3127104816707	267.35541926836805	21/02/24 15:40:03
21	962	332.511489713019	267.50182976726256	21/02/24 15:40:03
21	962	332.5221141169956	267.492597744572	21/02/24 15:40:03
21	962	332.3449544743277	267.6154998936099	21/02/24 15:40:03
21	962	332.29693916220737	267.68250502986353	21/02/24 15:40:03
21	962	332.2897061886986	267.6864695853035	21/02/24 15:40:03
21	962	332.2979491537646	267.71279762323076	21/02/24 15:40:03
21	962	332.205017996658	267.7890688466667	21/02/24 15:40:03
21	962	331.92318276615896	267.81158495549437	21/02/24 15:40:03
21	962	331.82577752008785	267.69808271932743	21/02/24 15:40:03
21	962	331.82608821195794	267.6980162890098	21/02/24 15:40:04
21	962	331.7192242087244	267.59756971904636	21/02/24 15:40:04
21	962	331.71529221860254	267.5927072630061	21/02/24 15:40:04
21	962	331.55518220284335	267.5287234273099	21/02/24 15:40:04
21	962	331.6270456454938	267.696997064308	21/02/24 15:40:04
21	962	331.8480729647966	267.7178700595883	21/02/24 15:40:04
21	962	331.8274482185847	267.7191242448479	21/02/24 15:40:04
21	962	332.12048708524816	267.6786081667684	21/02/24 15:40:04
21	962	332.11936707528804	267.6849617374808	21/02/24 15:40:04
21	962	332.1864467823935	267.44351364854407	21/02/24 15:40:05
21	962	332.2108433219253	267.403001506941	21/02/24 15:40:05
21	962	332.19951466119477	267.5244541767309	21/02/24 15:40:05
21	962	332.1962530659595	267.53691719439445	21/02/24 15:40:05
21	962	332.0854761967448	267.5607853551818	21/02/24 15:40:05
21	962	332.09543116378416	267.4651227453894	21/02/24 15:40:05
21	962	331.8453735413607	267.3755904099084	21/02/24 15:40:05
21	962	332.00702548839365	267.53327151197306	21/02/24 15:40:05
21	962	331.93551402221914	267.479065010207	21/02/24 15:40:05
21	962	332.0498493407329	267.668639957262	21/02/24 15:40:05
21	962	331.93767420437973	267.4690535287167	21/02/24 15:40:06
21	962	331.8026962558737	267.6371019594691	21/02/24 15:40:06
21	962	331.8026962558737	267.6371019594691	21/02/24 15:40:06
21	962	331.73531549504264	267.4551955406799	21/02/24 15:40:06
21	962	331.8359734236205	267.67122042964616	21/02/24 15:40:06
21	962	331.9155183560602	267.48184085574337	21/02/24 15:40:06
21	962	332.07806376728183	267.52089638297963	21/02/24 15:40:06
21	962	331.95153265507685	267.5135962324011	21/02/24 15:40:06
21	962	332.2352626226613	267.56500775643156	21/02/24 15:40:06
21	962	332.3037123740864	267.6293456917747	21/02/24 15:40:06
21	962	332.3104885812561	267.4267027255636	21/02/24 15:40:07
21	962	332.3472375433136	267.3863616405698	21/02/24 15:40:07
21	962	332.1827611379207	267.29727629465464	21/02/24 15:40:07
21	962	332.2060537767631	267.4825301835186	21/02/24 15:40:07
21	962	332.2068202205466	267.5430810095238	21/02/24 15:40:07
21	962	332.0003862158837	267.45002925938115	21/02/24 15:40:07
21	962	332.11082031877874	267.67181282145793	21/02/24 15:40:07
21	962	331.89391417535217	267.60093607705284	21/02/24 15:40:07
21	962	332.1691091095184	267.49037875218914	21/02/24 15:40:07
21	962	332.08099753115505	267.60958120536264	21/02/24 15:40:08
21	962	332.1101014660334	267.6620324501158	21/02/24 15:40:08
21	962	332.1859707351133	267.64572713052627	21/02/24 15:40:08
21	962	332.384674877745	267.8373398252271	21/02/24 15:40:08
21	962	332.36802908267975	267.8227165583149	21/02/24 15:40:08
21	962	332.1893085247905	267.6500554738791	21/02/24 15:40:08
21	962	332.2454018319482	267.72375009915044	21/02/24 15:40:08
21	962	332.39600184510533	267.51102013601314	21/02/24 15:40:08
21	962	332.4160090112295	267.5089379453648	21/02/24 15:40:08
21	962	332.4966371940768	267.7105370750458	21/02/24 15:40:08
21	962	332.4922764220473	267.89671031172907	21/02/24 15:40:09
21	962	332.4568519295229	267.9611197586751	21/02/24 15:40:09
21	962	332.58787486277146	267.9490234343688	21/02/24 15:40:09
21	962	332.707596998887	268.18541875188123	21/02/24 15:40:09
21	962	332.707596998887	268.18541875188123	21/02/24 15:40:09
21	962	332.67722503012186	268.0900139899341	21/02/24 15:40:09
21	962	332.65914105941476	268.05271549826233	21/02/24 15:40:09
21	962	332.6246501665239	268.3135081316215	21/02/24 15:40:09
21	962	332.56158507551174	268.4859877941853	21/02/24 15:40:09
21	962	332.44710422996167	268.5276027206925	21/02/24 15:40:09
21	962	332.37409387587127	268.37387974940236	21/02/24 15:40:10
21	962	332.54866668152573	268.6660172819021	21/02/24 15:40:10
21	962	332.54866668152573	268.6660172819021	21/02/24 15:40:10
21	962	332.5487496967897	268.64164702102494	21/02/24 15:40:10
21	962	332.7329415066887	268.4360691866412	21/02/24 15:40:10
21	962	332.65891124113426	268.2000727745357	21/02/24 15:40:10
21	962	332.52712767719527	268.08201381397214	21/02/24 15:40:10
21	962	332.6119890606822	267.9783156759443	21/02/24 15:40:10
21	962	332.8423421511964	267.96816124361305	21/02/24 15:40:10
21	962	332.7943154945006	267.9596942133675	21/02/24 15:40:11
21	962	332.82385211011814	267.9503516662908	21/02/24 15:40:11
21	962	333.01447190937563	267.819788078186	21/02/24 15:40:11
21	962	332.8894892281645	267.83319582717775	21/02/24 15:40:11
21	962	332.7233094358932	267.986599232608	21/02/24 15:40:11
21	962	332.59836659846184	267.9928209398784	21/02/24 15:40:11
21	962	332.4899945256949	267.94085467200347	21/02/24 15:40:11
21	962	332.41862840111753	268.1182821093181	21/02/24 15:40:11
21	962	332.5027671640366	268.0287659918123	21/02/24 15:40:11
21	962	332.56448571546565	268.22133606792164	21/02/24 15:40:11
21	962	332.3286574497231	268.37983501347395	21/02/24 15:40:12
21	962	332.3617314710175	268.2786613987106	21/02/24 15:40:12
21	962	332.37065754320145	268.0998924002183	21/02/24 15:40:12
21	962	332.41670891849003	267.9078034136996	21/02/24 15:40:12
21	962	332.4986605341988	268.1248230946807	21/02/24 15:40:12
21	962	332.7856029900711	268.204887377116	21/02/24 15:40:12
21	962	332.8243454263773	268.4102131420023	21/02/24 15:40:12
21	962	332.7376973288457	268.17330441155633	21/02/24 15:40:12
21	962	332.90097884676203	268.0024528939555	21/02/24 15:40:12
21	962	332.737192091031	267.75120110561903	21/02/24 15:40:12
21	962	332.68324293688306	267.7313911997117	21/02/24 15:40:13
21	962	332.7803228225241	267.95328396326033	21/02/24 15:40:13
21	962	332.7555424143679	268.00181775429184	21/02/24 15:40:13
21	962	332.73369219253993	267.96459782082576	21/02/24 15:40:13
21	962	332.6510550331856	268.0205233879845	21/02/24 15:40:13
21	962	332.58772068320496	267.8848294286831	21/02/24 15:40:13
21	962	332.6002476115313	267.88573234908296	21/02/24 15:40:13
21	962	332.84676700911206	267.91709034509825	21/02/24 15:40:13
21	962	332.9101368559008	267.9908570995011	21/02/24 15:40:13
21	962	333.092804209155	268.382857508985	21/02/24 15:40:14
21	962	333.16859788925785	268.3743893171945	21/02/24 15:40:14
21	962	332.9831458488368	268.4322021283399	21/02/24 15:40:14
21	962	333.16253885468126	268.3933858123062	21/02/24 15:40:14
21	962	333.2898648753636	268.4402829071093	21/02/24 15:40:14
21	962	333.34144292157856	268.19294913024356	21/02/24 15:40:14
21	962	333.3961175849853	267.97502837531056	21/02/24 15:40:14
21	962	333.3478376996598	267.9859260766758	21/02/24 15:40:14
21	962	333.3478376996598	267.9859260766758	21/02/24 15:40:14
21	962	333.3425905914383	268.1965850352325	21/02/24 15:40:14
21	962	333.28584040734665	268.40347119193467	21/02/24 15:40:15
21	962	333.28584040734665	268.40347119193467	21/02/24 15:40:15
21	962	333.28584040734665	268.40347119193467	21/02/24 15:40:15
21	962	333.15872960324384	268.3263261760609	21/02/24 15:40:15
21	962	332.97522096455936	268.19885799931393	21/02/24 15:40:15
21	962	332.97522096455936	268.19885799931393	21/02/24 15:40:15
21	962	332.870650511894	268.4189167329822	21/02/24 15:40:15
21	962	332.93784673642614	268.47582355161984	21/02/24 15:40:15
21	962	332.71368062960187	268.50496964514264	21/02/24 15:40:15
21	962	332.71368062960187	268.50496964514264	21/02/24 15:40:15
21	962	332.69959374549114	268.717950645878	21/02/24 15:40:16
21	962	332.83472819830564	268.71807166840387	21/02/24 15:40:16
21	962	332.69405546951305	268.98008422035116	21/02/24 15:40:16
21	962	332.5710235371953	269.22066484027204	21/02/24 15:40:16
21	962	332.58078510668633	269.0102339895721	21/02/24 15:40:16
21	962	332.6702138937035	269.18304128313287	21/02/24 15:40:16
21	962	332.6682103695274	269.60599354146086	21/02/24 15:40:16
21	962	332.67757492110593	269.6200514413062	21/02/24 15:40:16
21	962	332.718722167665	269.6210422806648	21/02/24 15:40:16
21	962	332.7410560538689	269.7887088950028	21/02/24 15:40:17
21	962	332.91233628260255	269.968083647163	21/02/24 15:40:17
21	962	333.05537629528243	270.13241796600715	21/02/24 15:40:17
21	962	333.15492639251454	270.2766403252103	21/02/24 15:40:17
21	962	333.0217227005527	270.193311794774	21/02/24 15:40:17
21	962	332.8868504841229	270.07084799208917	21/02/24 15:40:17
21	962	332.8346655217107	270.198803460261	21/02/24 15:40:17
21	962	332.80565579787736	270.4502031098522	21/02/24 15:40:17
21	962	332.88977520604357	270.40878504875707	21/02/24 15:40:17
21	962	332.998710677113	270.37428541638343	21/02/24 15:40:17
21	962	332.8364432416381	270.3849801896709	21/02/24 15:40:18
21	962	332.78234343522917	270.18066654354107	21/02/24 15:40:18
21	962	332.65530501154984	270.3960052494103	21/02/24 15:40:18
21	962	332.40918354289045	270.5044630689584	21/02/24 15:40:18
21	962	332.2906786487562	270.36194495675653	21/02/24 15:40:18
21	962	332.37415235026657	270.40330797523006	21/02/24 15:40:18
21	962	332.5778656219622	270.5518397628571	21/02/24 15:40:18
21	962	332.48508393053305	270.6495682689153	21/02/24 15:40:18
21	962	332.5535947017689	270.66639824978637	21/02/24 15:40:18
21	962	332.5488926314857	270.64508839322247	21/02/24 15:40:18
21	962	332.52446994465583	270.39765848011206	21/02/24 15:40:19
21	962	332.5484885195985	270.43504967130616	21/02/24 15:40:19
21	962	332.52825359204303	270.3553024143492	21/02/24 15:40:19
21	962	332.36838369491073	270.31155904732543	21/02/24 15:40:19
21	962	332.51538615100213	270.30191273843616	21/02/24 15:40:19
21	962	332.5254012302857	270.2595611314693	21/02/24 15:40:19
21	962	332.5272174040655	270.24190274456873	21/02/24 15:40:19
21	962	332.37653158274964	270.3745044958403	21/02/24 15:40:19
21	962	332.37653158274964	270.3745044958403	21/02/24 15:40:19
21	962	332.47070616171743	270.3164775722072	21/02/24 15:40:20
21	962	332.31763700680864	270.1809551803396	21/02/24 15:40:20
21	962	332.31377095524215	270.1717178769477	21/02/24 15:40:20
21	962	332.4183241781107	270.2829981466294	21/02/24 15:40:20
21	962	332.4149426305643	270.2893236022643	21/02/24 15:40:20
21	962	332.48250693936285	270.26702006007446	21/02/24 15:40:20
21	962	332.7682591115677	270.21620007956244	21/02/24 15:40:20
21	962	332.7206534131321	270.1797589630718	21/02/24 15:40:20
21	962	332.54469873670337	270.35959137008547	21/02/24 15:40:20
21	962	332.5324649680625	270.3339675984902	21/02/24 15:40:20
21	962	332.52991641260996	270.366721857344	21/02/24 15:40:21
21	962	332.6045894668177	270.3165913566572	21/02/24 15:40:21
21	962	332.5802529302506	270.549163884563	21/02/24 15:40:21
21	962	332.6688827135709	270.75299143079667	21/02/24 15:40:21
21	962	332.9553124059469	270.83350820356566	21/02/24 15:40:21
21	962	333.0212996138523	270.7999929718561	21/02/24 15:40:21
21	962	333.03374058809675	270.8570140685323	21/02/24 15:40:21
21	962	332.91948377265794	270.77954008703693	21/02/24 15:40:21
21	962	332.84251216939765	270.84504360047646	21/02/24 15:40:21
21	962	332.7466184702904	270.89491170922554	21/02/24 15:40:21
21	962	333.0118925348654	270.880323075358	21/02/24 15:40:22
21	962	333.14347894942085	270.6711672813864	21/02/24 15:40:22
21	962	333.0025528697812	270.53838313130586	21/02/24 15:40:22
21	962	332.9671088967628	270.5615430977355	21/02/24 15:40:22
21	962	333.20500362992226	270.3888204484746	21/02/24 15:40:22
21	962	333.2051642268326	270.37075752385334	21/02/24 15:40:22
21	962	333.04744623287894	270.48037177130215	21/02/24 15:40:22
21	962	333.0918971936484	270.45276355180266	21/02/24 15:40:22
21	962	333.05059150056354	270.16713451210813	21/02/24 15:40:22
21	962	333.169551379292	270.03552314350543	21/02/24 15:40:23
21	962	332.88668080938044	269.99717456113154	21/02/24 15:40:23
21	962	332.9846486412025	270.2036093716713	21/02/24 15:40:23
21	962	333.1582581655942	270.26817081661693	21/02/24 15:40:23
21	962	333.37829417813305	270.314072427012	21/02/24 15:40:23
21	962	333.36429697300576	270.31387439625433	21/02/24 15:40:23
21	962	333.30649366233666	270.29010792231225	21/02/24 15:40:23
21	962	333.1938340388473	270.3209092111224	21/02/24 15:40:23
21	962	333.1527031534923	270.4254626565634	21/02/24 15:40:23
21	962	333.1640062685578	270.5131414624091	21/02/24 15:40:23
21	962	333.03190301795206	270.6419995459036	21/02/24 15:40:24
21	962	332.90422300562307	270.45377105426127	21/02/24 15:40:24
21	962	333.01620968611513	270.6444648623716	21/02/24 15:40:24
21	962	333.0706841350159	270.6735289707266	21/02/24 15:40:24
21	962	333.05388810803765	270.381036920345	21/02/24 15:40:24
21	962	332.8173547968217	270.43379092776456	21/02/24 15:40:24
21	962	332.734834158911	270.54373344884567	21/02/24 15:40:24
21	962	332.8555972124174	270.69025488251276	21/02/24 15:40:24
21	962	332.9601684597002	270.7658436606524	21/02/24 15:40:24
21	962	332.7399933281535	270.9157274354773	21/02/24 15:40:24
21	962	332.660382598402	271.0442422716947	21/02/24 15:40:25
21	962	332.66521536172417	270.9032454481353	21/02/24 15:40:25
21	962	332.6526956510196	270.89386033991394	21/02/24 15:40:25
21	962	332.7207299772985	270.86698196612093	21/02/24 15:40:25
21	962	332.49687843173007	270.94195221535716	21/02/24 15:40:25
21	962	332.57408917013487	270.92829673457743	21/02/24 15:40:25
21	962	332.81401421485464	271.0882784374827	21/02/24 15:40:25
21	962	332.6175531235872	271.0633205010058	21/02/24 15:40:25
21	962	332.7720191163193	271.2394645835882	21/02/24 15:40:25
21	962	332.85305133863613	271.3156929349434	21/02/24 15:40:26
21	962	333.0211054920076	271.15590499977304	21/02/24 15:40:26
21	962	333.0934702273993	271.0696501509211	21/02/24 15:40:26
21	962	332.882364159113	271.1499727183041	21/02/24 15:40:26
21	962	333.01778078713056	271.0838809528625	21/02/24 15:40:26
21	962	333.150449583062	271.11356868854404	21/02/24 15:40:26
21	962	333.04184685885184	270.87843775107183	21/02/24 15:40:26
21	962	332.9078887146229	270.80318060093924	21/02/24 15:40:26
21	962	333.11282479265725	270.71046571450506	21/02/24 15:40:26
21	962	332.98414631164627	270.5493781423084	21/02/24 15:40:26
21	962	333.1958367798365	270.4497423230553	21/02/24 15:40:27
21	962	333.1958367798365	270.4497423230553	21/02/24 15:40:27
21	962	333.0230652411288	270.43732225416585	21/02/24 15:40:27
21	962	333.0230652411288	270.43732225416585	21/02/24 15:40:27
21	962	332.7308931374563	270.49114012656884	21/02/24 15:40:27
21	962	332.53613977130914	270.4802542917704	21/02/24 15:40:27
21	962	332.2994078069443	270.562168045209	21/02/24 15:40:27
21	962	332.19296559361646	270.6457940942796	21/02/24 15:40:27
21	962	332.13606646714106	270.6234392360127	21/02/24 15:40:27
21	962	332.111612304819	270.6692599286742	21/02/24 15:40:27
21	962	332.0683844989071	270.6798538829923	21/02/24 15:40:28
21	962	332.0198734659959	270.6971373829659	21/02/24 15:40:28
21	962	332.0788652263585	270.5775355362804	21/02/24 15:40:28
21	962	331.9729991452683	270.68095150926325	21/02/24 15:40:28
21	962	332.0658907897767	270.8537889864774	21/02/24 15:40:28
21	962	332.2420079537659	271.06791070162126	21/02/24 15:40:28
21	962	332.50904756312764	271.00369128503866	21/02/24 15:40:28
21	962	332.4091056848607	271.0295789460843	21/02/24 15:40:28
21	962	332.15431148917355	271.12373231765804	21/02/24 15:40:28
21	962	331.9742024033592	271.33152309866125	21/02/24 15:40:29
21	962	331.8203770890112	271.5223624135305	21/02/24 15:40:29
21	962	331.9656997780774	271.682191001811	21/02/24 15:40:29
21	962	331.9204012044434	271.70332263746593	21/02/24 15:40:29
21	962	331.77263697076705	271.8438361516692	21/02/24 15:40:29
21	962	331.7723232899521	271.84398212018647	21/02/24 15:40:29
21	962	331.80285679767803	271.8074791406121	21/02/24 15:40:29
21	962	331.8095749078202	271.7820032462604	21/02/24 15:40:29
21	962	331.8190677073089	271.84815832708716	21/02/24 15:40:29
21	962	331.55149599681914	271.76174250557585	21/02/24 15:40:29
21	962	331.70430687551857	271.7119797042043	21/02/24 15:40:30
21	962	331.70430687551857	271.7119797042043	21/02/24 15:40:30
21	962	331.7725500292285	271.6889747763666	21/02/24 15:40:30
21	962	331.97459570739585	271.57137354432024	21/02/24 15:40:30
21	962	332.08412529587645	271.54338375847465	21/02/24 15:40:30
21	962	332.2540895912289	271.49791048211154	21/02/24 15:40:30
21	962	332.22257327044196	271.5319956532192	21/02/24 15:40:30
21	962	332.2861935156252	271.7927461765299	21/02/24 15:40:30
21	962	332.2695162842636	271.8548584655095	21/02/24 15:40:30
21	962	332.2368079956523	271.83195512333685	21/02/24 15:40:30
21	962	332.0801604896322	271.8939442046267	21/02/24 15:40:31
21	962	332.0801604896322	271.8939442046267	21/02/24 15:40:31
21	962	331.96860128462777	272.1286997321946	21/02/24 15:40:31
21	962	332.1026750039114	272.03111963513925	21/02/24 15:40:31
21	962	332.1026750039114	272.03111963513925	21/02/24 15:40:31
21	962	331.97849953228507	272.07494156364567	21/02/24 15:40:31
21	962	331.74285712955	272.24052150545464	21/02/24 15:40:31
21	962	331.837498032887	272.3149070310861	21/02/24 15:40:31
21	962	331.88818490198264	272.09511844596176	21/02/24 15:40:31
21	962	331.88818490198264	272.09511844596176	21/02/24 15:40:32
21	962	331.9078335818916	272.23703921440443	21/02/24 15:40:32
21	962	331.774976888863	272.33332808191494	21/02/24 15:40:32
21	962	331.56543109884814	272.2606742572613	21/02/24 15:40:32
21	962	331.5476640617866	272.2776473865994	21/02/24 15:40:32
21	962	331.6157448459044	272.27422408527406	21/02/24 15:40:32
21	962	331.80588913504045	272.4454044769577	21/02/24 15:40:32
21	962	331.99219601824836	272.52742026303474	21/02/24 15:40:32
21	962	331.7909675979327	272.66788794705104	21/02/24 15:40:32
21	962	331.6473654505613	272.7247374299208	21/02/24 15:40:32
21	962	331.501769076575	272.7088808398062	21/02/24 15:40:33
21	962	331.5610194788628	272.68410798974674	21/02/24 15:40:33
21	962	331.5610194788628	272.68410798974674	21/02/24 15:40:33
21	962	331.42157732150486	272.8007446825309	21/02/24 15:40:33
21	962	331.2385423784562	272.86162448643927	21/02/24 15:40:33
21	962	331.07998933716664	272.7917792729863	21/02/24 15:40:33
21	962	331.0201450708239	272.9560074500663	21/02/24 15:40:33
21	962	331.0201450708239	272.9560074500663	21/02/24 15:40:33
21	962	331.12942672809436	273.15233024482967	21/02/24 15:40:33
21	962	331.08051905580726	273.419103586609	21/02/24 15:40:33
21	962	331.04427048506716	273.5230852176821	21/02/24 15:40:34
21	962	331.0296424849533	273.23668475906686	21/02/24 15:40:34
21	962	330.9285874030559	273.14759293317417	21/02/24 15:40:34
21	962	330.9347138834653	273.1630509955336	21/02/24 15:40:34
21	962	331.07187775248406	273.12896118452306	21/02/24 15:40:34
21	962	330.9477501512283	273.0394708721436	21/02/24 15:40:34
21	962	331.21059645060694	273.0051051715549	21/02/24 15:40:34
21	962	331.2833197281217	272.9390358972145	21/02/24 15:40:34
21	962	331.0157814784925	273.0455352636102	21/02/24 15:40:34
21	962	330.9417829602359	272.92469679443275	21/02/24 15:40:35
21	962	330.7029355982799	273.083724810469	21/02/24 15:40:35
21	962	330.626532643134	273.0717678160197	21/02/24 15:40:35
21	962	330.64686849356804	273.13513609109566	21/02/24 15:40:35
21	962	330.57796600783786	273.26317344378725	21/02/24 15:40:35
21	962	330.44592643735234	273.43926664944144	21/02/24 15:40:35
21	962	330.4462446594527	273.4394146248858	21/02/24 15:40:35
21	962	330.4473000658713	273.4484448656552	21/02/24 15:40:35
21	962	330.435109169267	273.66419281873596	21/02/24 15:40:35
21	962	330.470146796737	273.9383913182421	21/02/24 15:40:35
21	962	330.46061240539734	273.929925185338	21/02/24 15:40:36
21	962	330.21908950132	273.7705251681593	21/02/24 15:40:36
21	962	330.30871516658004	273.75086895414364	21/02/24 15:40:36
21	962	330.26210893171304	273.7331022116208	21/02/24 15:40:36
21	962	330.30233365455365	273.85902536076117	21/02/24 15:40:36
21	962	330.03663838099004	273.93836508329355	21/02/24 15:40:36
21	962	330.08283524739494	274.1030162243044	21/02/24 15:40:36
21	962	330.07423839222145	274.09726314304436	21/02/24 15:40:36
21	962	330.12945277541723	274.2020387722604	21/02/24 15:40:36
21	962	330.10590076498005	274.3858859879572	21/02/24 15:40:36
21	962	329.98966547984327	274.36220548528877	21/02/24 15:40:37
21	962	330.1160321943412	274.2104828540926	21/02/24 15:40:37
21	962	330.1323681705613	274.0696725626469	21/02/24 15:40:37
21	962	330.0975593895647	274.27731767845694	21/02/24 15:40:37
21	962	330.0847414107853	274.14898876773753	21/02/24 15:40:37
21	962	330.16022223859335	273.873254059315	21/02/24 15:40:37
21	962	329.91219423523387	273.82498004734066	21/02/24 15:40:37
21	962	329.80395954835797	273.89382291027744	21/02/24 15:40:37
21	962	329.61227610867456	274.1214808930031	21/02/24 15:40:37
21	962	329.7805767608017	274.0204555301256	21/02/24 15:40:38
21	962	329.84023177010306	274.1875737855732	21/02/24 15:40:38
21	962	329.66625340287874	274.1195502827051	21/02/24 15:40:38
21	962	329.6625377331465	274.2591792115255	21/02/24 15:40:38
21	962	329.7510102449116	274.44880327660826	21/02/24 15:40:38
21	962	329.76630397185914	274.42397251307074	21/02/24 15:40:38
21	962	329.76630397185914	274.42397251307074	21/02/24 15:40:38
21	962	329.4973476007691	274.3079838416362	21/02/24 15:40:38
21	962	329.58843417040333	274.2123104777554	21/02/24 15:40:38
21	962	329.6603395658608	274.16053298671375	21/02/24 15:40:38
21	962	329.86476941709407	274.173942893162	21/02/24 15:40:39
21	962	329.79548966549015	274.04492766816423	21/02/24 15:40:39
21	962	329.94770875980925	274.0951027300818	21/02/24 15:40:39
21	962	329.79088852410365	274.0632928914432	21/02/24 15:40:39
21	962	329.8546993619022	274.0563939491176	21/02/24 15:40:39
21	962	329.8542194723273	274.0558460475636	21/02/24 15:40:39
21	962	329.98418761974824	273.8752819198175	21/02/24 15:40:39
21	962	329.95184478830873	273.7582152824208	21/02/24 15:40:39
21	962	329.9429867728469	273.78048832487224	21/02/24 15:40:39
21	962	329.8098911815735	273.63304792942546	21/02/24 15:40:39
21	962	329.9412919305868	273.8156874535526	21/02/24 15:40:40
21	962	329.7290557270911	273.68638226077286	21/02/24 15:40:40
21	962	329.74159627548556	273.82238862538446	21/02/24 15:40:40
21	962	329.74159627548556	273.82238862538446	21/02/24 15:40:40
21	962	329.7303877462915	273.81933956579826	21/02/24 15:40:40
21	962	329.4927036389744	273.66928360135097	21/02/24 15:40:40
21	962	329.2814236471953	273.73156534996974	21/02/24 15:40:40
21	962	329.2814236471953	273.73156534996974	21/02/24 15:40:40
21	962	329.41949816756926	273.5972448719793	21/02/24 15:40:40
21	962	329.41949816756926	273.5972448719793	21/02/24 15:40:41
21	962	329.41973960735817	273.89298588053055	21/02/24 15:40:41
21	962	329.6131130180563	273.98056504509884	21/02/24 15:40:41
21	962	329.66121684092883	274.0544684628821	21/02/24 15:40:41
21	962	329.66121684092883	274.0544684628821	21/02/24 15:40:41
21	962	329.57987759275557	274.23084906640844	21/02/24 15:40:41
21	962	329.7359173501816	274.41911906113535	21/02/24 15:40:41
21	962	329.46996095091004	274.30146101925436	21/02/24 15:40:41
21	962	329.4648623658824	274.28431634839677	21/02/24 15:40:41
21	962	329.39513931156085	274.31513042071765	21/02/24 15:40:41
21	962	329.37045570271795	274.35433396049547	21/02/24 15:40:42
21	962	329.39000998903975	274.2929774199463	21/02/24 15:40:42
21	962	329.5832503203956	274.2966758316543	21/02/24 15:40:42
21	962	329.46513652327667	274.51457261646493	21/02/24 15:40:42
21	962	329.4201618031827	274.4911253865089	21/02/24 15:40:42
21	962	329.47639244797847	274.2142767918437	21/02/24 15:40:42
21	962	329.4534237153079	273.96538993032846	21/02/24 15:40:42
21	962	329.30573256715036	273.93172437329383	21/02/24 15:40:42
21	962	329.0315177493641	273.95687496821796	21/02/24 15:40:42
21	962	329.04342979772883	273.94717171528913	21/02/24 15:40:42
21	962	329.04276636157135	273.95056639623175	21/02/24 15:40:43
21	962	328.9531449770309	273.87497954879905	21/02/24 15:40:43
21	962	328.915884709917	273.7653864373713	21/02/24 15:40:43
21	962	328.915884709917	273.7653864373713	21/02/24 15:40:43
