floorId	partitionId	location_x	location_y	timeStamp
18	982	335.5707947754775	282.66660998132573	21/02/24 15:38:00
18	982	335.5707947754775	282.66660998132573	21/02/24 15:38:01
18	982	335.5707947754775	282.66660998132573	21/02/24 15:38:02
18	982	335.5707947754775	282.66660998132573	21/02/24 15:38:03
18	982	335.5707947754775	282.66660998132573	21/02/24 15:38:04
18	982	335.5707947754775	282.66660998132573	21/02/24 15:38:05
18	982	335.5707947754775	282.66660998132573	21/02/24 15:38:06
18	982	335.5707947754775	282.66660998132573	21/02/24 15:38:07
18	982	335.5707947754775	282.66660998132573	21/02/24 15:38:08
18	982	335.5707947754775	282.66660998132573	21/02/24 15:38:09
18	982	335.5707947754775	282.66660998132573	21/02/24 15:38:10
18	982	335.5707947754775	282.66660998132573	21/02/24 15:38:11
18	982	335.5707947754775	282.66660998132573	21/02/24 15:38:12
18	982	335.5707947754775	282.66660998132573	21/02/24 15:38:13
18	982	335.5707947754775	282.66660998132573	21/02/24 15:38:14
18	982	336.8789610560853	282.55920847249035	21/02/24 15:38:15
18	982	335.5707947754775	282.66660998132573	21/02/24 15:38:16
18	982	335.5707947754775	282.66660998132573	21/02/24 15:38:17
18	982	335.5707947754775	282.66660998132573	21/02/24 15:38:18
18	982	335.5707947754775	282.66660998132573	21/02/24 15:38:19
18	982	335.5707947754775	282.66660998132573	21/02/24 15:38:20
18	982	335.5707947754775	282.66660998132573	21/02/24 15:38:21
18	982	335.5707947754775	282.66660998132573	21/02/24 15:38:22
18	982	335.5707947754775	282.66660998132573	21/02/24 15:38:23
18	982	335.5707947754775	282.66660998132573	21/02/24 15:38:24
18	982	335.5707947754775	282.66660998132573	21/02/24 15:38:25
18	982	335.5707947754775	282.66660998132573	21/02/24 15:38:26
18	982	335.5707947754775	282.66660998132573	21/02/24 15:38:27
18	979	341.3179542174323	279.8134374747344	21/02/24 15:38:28
18	979	341.3179542174323	279.8134374747344	21/02/24 15:38:29
18	979	341.3179542174323	279.8134374747344	21/02/24 15:38:30
18	979	341.3179542174323	279.8134374747344	21/02/24 15:38:31
18	979	341.3179542174323	279.8134374747344	21/02/24 15:38:32
18	979	341.3179542174323	279.8134374747344	21/02/24 15:38:33
18	979	341.3179542174323	279.8134374747344	21/02/24 15:38:34
18	979	341.3179542174323	279.8134374747344	21/02/24 15:38:35
18	979	341.3179542174323	279.8134374747344	21/02/24 15:38:36
18	979	341.3179542174323	279.8134374747344	21/02/24 15:38:37
18	979	341.3179542174323	279.8134374747344	21/02/24 15:38:38
18	979	341.3179542174323	279.8134374747344	21/02/24 15:38:39
18	979	341.3179542174323	279.8134374747344	21/02/24 15:38:40
18	979	341.3179542174323	279.8134374747344	21/02/24 15:38:41
18	979	341.3179542174323	279.8134374747344	21/02/24 15:38:42
18	979	341.3179542174323	279.8134374747344	21/02/24 15:38:43
18	979	341.3179542174323	279.8134374747344	21/02/24 15:38:44
18	979	341.3179542174323	279.8134374747344	21/02/24 15:38:45
18	979	341.3179542174323	279.8134374747344	21/02/24 15:38:46
18	979	341.3179542174323	279.8134374747344	21/02/24 15:38:47
18	979	341.3179542174323	279.8134374747344	21/02/24 15:38:48
18	979	341.3179542174323	279.8134374747344	21/02/24 15:38:49
18	979	341.3179542174323	279.8134374747344	21/02/24 15:38:50
18	979	341.3179542174323	279.8134374747344	21/02/24 15:38:51
18	979	341.3179542174323	279.8134374747344	21/02/24 15:38:52
18	979	341.3179542174323	279.8134374747344	21/02/24 15:38:53
18	979	341.3179542174323	279.8134374747344	21/02/24 15:38:54
18	979	341.3179542174323	279.8134374747344	21/02/24 15:38:55
18	979	341.3179542174323	279.8134374747344	21/02/24 15:38:56
18	979	341.3179542174323	279.8134374747344	21/02/24 15:38:57
18	979	341.3179542174323	279.8134374747344	21/02/24 15:38:58
18	979	341.3179542174323	279.8134374747344	21/02/24 15:38:59
18	979	341.3179542174323	279.8134374747344	21/02/24 15:39:00
18	979	341.3179542174323	279.8134374747344	21/02/24 15:39:01
18	979	341.3179542174323	279.8134374747344	21/02/24 15:39:02
18	979	341.3179542174323	279.8134374747344	21/02/24 15:39:03
18	979	341.3179542174323	279.8134374747344	21/02/24 15:39:04
18	979	341.3179542174323	279.8134374747344	21/02/24 15:39:05
18	979	341.3179542174323	279.8134374747344	21/02/24 15:39:06
18	979	341.3179542174323	279.8134374747344	21/02/24 15:39:07
18	979	341.3179542174323	279.8134374747344	21/02/24 15:39:08
18	979	341.3179542174323	279.8134374747344	21/02/24 15:39:09
18	979	341.3179542174323	279.8134374747344	21/02/24 15:39:10
18	979	341.3179542174323	279.8134374747344	21/02/24 15:39:11
18	979	341.3179542174323	279.8134374747344	21/02/24 15:39:12
18	979	341.3179542174323	279.8134374747344	21/02/24 15:39:13
18	979	341.3179542174323	279.8134374747344	21/02/24 15:39:14
18	979	341.3179542174323	279.8134374747344	21/02/24 15:39:15
18	979	341.3179542174323	279.8134374747344	21/02/24 15:39:16
18	979	341.3179542174323	279.8134374747344	21/02/24 15:39:17
18	979	341.3179542174323	279.8134374747344	21/02/24 15:39:18
18	979	341.3179542174323	279.8134374747344	21/02/24 15:39:19
18	979	341.3179542174323	279.8134374747344	21/02/24 15:39:20
18	979	341.3179542174323	279.8134374747344	21/02/24 15:39:21
18	979	341.3179542174323	279.8134374747344	21/02/24 15:39:22
18	979	341.3179542174323	279.8134374747344	21/02/24 15:39:23
18	979	341.3179542174323	279.8134374747344	21/02/24 15:39:24
18	979	341.3179542174323	279.8134374747344	21/02/24 15:39:25
18	979	341.3179542174323	279.8134374747344	21/02/24 15:39:26
18	979	341.3179542174323	279.8134374747344	21/02/24 15:39:27
18	979	341.3179542174323	279.8134374747344	21/02/24 15:39:28
18	979	341.3179542174323	279.8134374747344	21/02/24 15:39:29
18	979	341.3179542174323	279.8134374747344	21/02/24 15:39:30
18	979	341.3179542174323	279.8134374747344	21/02/24 15:39:31
18	979	341.3179542174323	279.8134374747344	21/02/24 15:39:32
18	979	341.3179542174323	279.8134374747344	21/02/24 15:39:33
18	979	341.3179542174323	279.8134374747344	21/02/24 15:39:34
18	979	341.3179542174323	279.8134374747344	21/02/24 15:39:35
18	979	341.3179542174323	279.8134374747344	21/02/24 15:39:36
18	979	341.3179542174323	279.8134374747344	21/02/24 15:39:37
18	979	341.3179542174323	279.8134374747344	21/02/24 15:39:38
18	979	341.3179542174323	279.8134374747344	21/02/24 15:39:39
18	979	341.3179542174323	279.8134374747344	21/02/24 15:39:40
18	979	341.3179542174323	279.8134374747344	21/02/24 15:39:41
18	979	341.3179542174323	279.8134374747344	21/02/24 15:39:42
18	979	341.3179542174323	279.8134374747344	21/02/24 15:39:43
18	979	348.2367582443579	277.15183328693064	21/02/24 15:39:44
18	979	341.3179542174323	279.8134374747344	21/02/24 15:39:45
18	979	341.3179542174323	279.8134374747344	21/02/24 15:39:46
18	979	341.3179542174323	279.8134374747344	21/02/24 15:39:47
18	979	341.3179542174323	279.8134374747344	21/02/24 15:39:48
18	979	348.2367582443579	277.15183328693064	21/02/24 15:39:49
18	979	348.2367582443579	277.15183328693064	21/02/24 15:39:50
18	979	348.2367582443579	277.15183328693064	21/02/24 15:39:51
18	979	348.2367582443579	277.15183328693064	21/02/24 15:39:52
18	979	348.2367582443579	277.15183328693064	21/02/24 15:39:53
18	979	348.2367582443579	277.15183328693064	21/02/24 15:39:54
18	979	348.2367582443579	277.15183328693064	21/02/24 15:39:55
18	979	348.2367582443579	277.15183328693064	21/02/24 15:39:56
18	979	341.3179542174323	279.8134374747344	21/02/24 15:39:57
18	979	341.3179542174323	279.8134374747344	21/02/24 15:39:58
18	979	341.3179542174323	279.8134374747344	21/02/24 15:39:59
18	979	341.3179542174323	279.8134374747344	21/02/24 15:40:00
18	979	341.3179542174323	279.8134374747344	21/02/24 15:40:01
18	979	341.3179542174323	279.8134374747344	21/02/24 15:40:02
18	979	341.3179542174323	279.8134374747344	21/02/24 15:40:03
18	979	341.3179542174323	279.8134374747344	21/02/24 15:40:04
18	979	341.3179542174323	279.8134374747344	21/02/24 15:40:05
18	979	348.2367582443579	277.15183328693064	21/02/24 15:40:06
18	979	341.3179542174323	279.8134374747344	21/02/24 15:40:07
18	979	341.3179542174323	279.8134374747344	21/02/24 15:40:08
18	979	341.3179542174323	279.8134374747344	21/02/24 15:40:09
18	979	341.3179542174323	279.8134374747344	21/02/24 15:40:10
18	979	341.3179542174323	279.8134374747344	21/02/24 15:40:11
18	979	341.3179542174323	279.8134374747344	21/02/24 15:40:12
18	979	341.3179542174323	279.8134374747344	21/02/24 15:40:13
18	979	341.3179542174323	279.8134374747344	21/02/24 15:40:14
18	979	341.3179542174323	279.8134374747344	21/02/24 15:40:15
18	979	341.3179542174323	279.8134374747344	21/02/24 15:40:16
18	979	341.3179542174323	279.8134374747344	21/02/24 15:40:17
18	979	341.3179542174323	279.8134374747344	21/02/24 15:40:18
18	979	341.3179542174323	279.8134374747344	21/02/24 15:40:19
18	979	341.3179542174323	279.8134374747344	21/02/24 15:40:20
18	979	341.3179542174323	279.8134374747344	21/02/24 15:40:21
18	979	341.3179542174323	279.8134374747344	21/02/24 15:40:22
18	979	341.3179542174323	279.8134374747344	21/02/24 15:40:23
18	979	341.3179542174323	279.8134374747344	21/02/24 15:40:24
18	982	335.5707947754775	282.66660998132573	21/02/24 15:40:25
18	979	341.3179542174323	279.8134374747344	21/02/24 15:40:26
18	979	341.3179542174323	279.8134374747344	21/02/24 15:40:27
18	979	341.3179542174323	279.8134374747344	21/02/24 15:40:28
18	979	341.3179542174323	279.8134374747344	21/02/24 15:40:29
18	979	341.3179542174323	279.8134374747344	21/02/24 15:40:30
18	979	341.3179542174323	279.8134374747344	21/02/24 15:40:31
18	979	341.3179542174323	279.8134374747344	21/02/24 15:40:32
18	979	341.3179542174323	279.8134374747344	21/02/24 15:40:33
18	979	341.3179542174323	279.8134374747344	21/02/24 15:40:34
18	979	341.3179542174323	279.8134374747344	21/02/24 15:40:35
18	979	348.2367582443579	277.15183328693064	21/02/24 15:40:36
18	979	348.2367582443579	277.1518332869306	21/02/24 15:40:37
18	979	348.2367582443579	277.1518332869306	21/02/24 15:40:38
18	979	348.2367582443579	277.1518332869306	21/02/24 15:40:39
18	982	360.3327834419265	278.3422844929435	21/02/24 15:40:40
18	982	360.3327834419265	278.3422844929435	21/02/24 15:40:41
18	982	360.3327834419265	278.3422844929435	21/02/24 15:40:42
18	982	360.3327834419265	278.3422844929435	21/02/24 15:40:43
18	982	360.3327834419265	278.3422844929435	21/02/24 15:40:44
18	982	360.3327834419265	278.3422844929435	21/02/24 15:40:45
18	982	360.3327834419265	278.3422844929435	21/02/24 15:40:46
