floorId	partitionId	location_x	location_y	timeStamp
21	988	360.83862340923207	289.16607836164457	21/02/21 12:29:17
21	988	360.8852796521225	288.985237500519	21/02/21 12:29:18
21	988	360.8852796521225	288.985237500519	21/02/21 12:29:18
21	988	361.0178894872855	288.4712381876963	21/02/21 12:29:18
21	988	361.0844186341964	288.21336941233085	21/02/21 12:29:18
21	988	361.1239214021258	288.06025561390607	21/02/21 12:29:18
21	902	361.23728577543636	287.8194507944241	21/02/21 12:29:18
21	902	361.31419966797586	287.6755152847272	21/02/21 12:29:18
21	902	361.4002892330966	287.51440855841156	21/02/21 12:29:18
21	902	361.481176493614	287.3630373472279	21/02/21 12:29:18
21	902	361.59266039264077	287.15440804373543	21/02/21 12:29:18
21	902	361.715505381111	286.92451776715	21/02/21 12:29:19
21	902	361.7973496879409	286.7713555537918	21/02/21 12:29:19
21	902	361.8866256095987	286.6042859274447	21/02/21 12:29:19
21	902	361.99878231576133	286.39439754272735	21/02/21 12:29:19
21	902	362.121884116474	286.1640266715473	21/02/21 12:29:19
21	902	362.2500941540332	285.92409632223024	21/02/21 12:29:19
21	902	362.32826308274167	285.7778121565923	21/02/21 12:29:19
21	902	362.46384606623553	285.52408418637685	21/02/21 12:29:19
21	902	362.5436752540703	285.3746930366079	21/02/21 12:29:19
21	902	362.645113693358	285.1848626564301	21/02/21 12:29:19
21	902	362.73169153182306	285.0228421826708	21/02/21 12:29:20
21	902	362.83208454766077	284.8349681923226	21/02/21 12:29:20
21	902	362.83208454766077	284.8349681923226	21/02/21 12:29:20
21	902	363.0393799937335	284.44703859074906	21/02/21 12:29:20
21	902	363.16476541328194	284.2123941893883	21/02/21 12:29:20
21	902	363.16476541328194	284.2123941893883	21/02/21 12:29:20
21	902	363.296125601703	283.96656869479966	21/02/21 12:29:20
21	902	363.3731861799056	283.82235867974384	21/02/21 12:29:20
21	902	363.46121659272757	283.6576198800289	21/02/21 12:29:20
21	902	363.584737742858	283.42646424461185	21/02/21 12:29:20
21	902	363.7119304125478	283.18843778232997	21/02/21 12:29:21
21	902	363.7848369881942	283.05200150561285	21/02/21 12:29:21
21	902	363.9241068098005	282.79137404162117	21/02/21 12:29:21
21	902	363.9241068098005	282.79137404162117	21/02/21 12:29:21
21	902	364.0090223333732	282.6324643991228	21/02/21 12:29:21
21	902	364.1318383128108	282.40262840960764	21/02/21 12:29:21
21	902	364.24811294684247	282.18503379618244	21/02/21 12:29:21
21	902	364.3653531571469	281.9656322177423	21/02/21 12:29:21
21	902	364.56259470195795	281.8383705829704	21/02/21 12:29:21
21	902	364.7482750118952	281.86543402689875	21/02/21 12:29:22
21	902	365.0222252733257	281.90536307237414	21/02/21 12:29:22
21	902	365.29402388104563	281.9449785080782	21/02/21 12:29:22
21	902	365.4559040243937	281.96857300866947	21/02/21 12:29:22
21	902	365.7302454774634	282.0085590714613	21/02/21 12:29:22
21	902	365.92721712883645	282.03726826116593	21/02/21 12:29:22
21	902	366.12494772688126	282.06608806955006	21/02/21 12:29:22
21	902	366.35735203162835	282.0999616712925	21/02/21 12:29:22
21	902	366.5916975704357	282.1341182135317	21/02/21 12:29:22
21	902	366.8321531499705	282.16916531193533	21/02/21 12:29:22
21	902	367.0409737524051	282.19960152063715	21/02/21 12:29:23
21	902	367.2943533036435	282.23653232541574	21/02/21 12:29:23
21	902	367.45676772967533	282.26020469925845	21/02/21 12:29:23
21	902	367.6097041045538	282.2824956196448	21/02/21 12:29:23
21	902	367.793649373476	282.30930617631094	21/02/21 12:29:23
21	902	367.9899638101272	282.3379195750629	21/02/21 12:29:23
21	902	368.2250786810389	282.3721882496886	21/02/21 12:29:23
21	902	368.5191262246872	282.4150465323599	21/02/21 12:29:23
21	902	368.75509111443705	282.44943909969754	21/02/21 12:29:23
21	902	369.02264816416726	282.4884363160176	21/02/21 12:29:23
21	902	369.1938886392248	282.5133951121148	21/02/21 12:29:24
21	902	369.48562590719814	282.5559166654032	21/02/21 12:29:24
21	902	369.74971183188273	282.5944079551763	21/02/21 12:29:24
21	902	369.91704324263486	282.6187969938087	21/02/21 12:29:24
21	902	370.1897177282745	282.6585400912609	21/02/21 12:29:24
21	902	370.34026919704667	282.68048340466237	21/02/21 12:29:24
21	902	370.6096328008078	282.71974393147417	21/02/21 12:29:24
21	902	370.75846799455996	282.7414370928117	21/02/21 12:29:24
21	902	371.02224270569656	282.7798830223072	21/02/21 12:29:24
21	902	371.02224270569656	282.7798830223072	21/02/21 12:29:24
21	902	371.28627665034156	282.81836673583877	21/02/21 12:29:25
21	902	371.5392186075169	282.855233760013	21/02/21 12:29:25
21	902	371.7921377493624	282.8920974587867	21/02/21 12:29:25
21	902	371.9849583597983	282.92020162223037	21/02/21 12:29:25
21	902	372.26909232746516	282.9616149724379	21/02/21 12:29:25
21	902	372.5264911224776	282.9991315936585	21/02/21 12:29:25
21	902	372.7259339396899	283.0282009629543	21/02/21 12:29:25
21	902	372.92364796582575	283.05701835593464	21/02/21 12:29:25
21	902	373.10319563473195	283.0831879496387	21/02/21 12:29:25
21	977	373.27818574358287	283.16617182430696	21/02/21 12:29:26
21	977	373.4982470789141	283.3124360473098	21/02/21 12:29:26
21	977	373.69873780911206	283.4456926270153	21/02/21 12:29:26
21	977	373.89684636021053	283.577365886441	21/02/21 12:29:26
21	977	374.0628650387336	283.6877105454952	21/02/21 12:29:26
21	977	374.2238613995623	283.79471711067595	21/02/21 12:29:26
21	977	374.4159945558843	283.92241881156866	21/02/21 12:29:26
21	977	374.57323839826637	284.02693125758003	21/02/21 12:29:26
21	977	374.7988100764972	284.1768579414212	21/02/21 12:29:26
21	977	375.0338285974241	284.33306348885594	21/02/21 12:29:26
21	977	375.25901996062555	284.482737395524	21/02/21 12:29:27
21	977	375.490446770419	284.6365557047036	21/02/21 12:29:27
21	977	375.69598079900527	284.7731643231443	21/02/21 12:29:27
21	977	375.8768942707889	284.89340883743546	21/02/21 12:29:27
21	977	376.0924354609394	285.0366687365677	21/02/21 12:29:27
21	977	376.21848771145136	285.12044962634167	21/02/21 12:29:27
21	977	376.4107060866781	285.2482079681562	21/02/21 12:29:27
21	977	376.6104003844859	285.38093519742154	21/02/21 12:29:27
21	977	376.7853993841928	285.49724864557845	21/02/21 12:29:27
21	977	376.7853993841928	285.49724864557845	21/02/21 12:29:27
21	977	376.969826016061	285.61982818900725	21/02/21 12:29:28
21	977	377.1617332011042	285.7473796976208	21/02/21 12:29:28
21	977	377.36755349434213	285.884178582456	21/02/21 12:29:28
21	977	377.58357710336014	286.02775912228924	21/02/21 12:29:28
21	977	377.8150761819019	286.1816254650423	21/02/21 12:29:28
21	977	377.99459943211633	286.3009459656838	21/02/21 12:29:28
21	977	378.2130781219799	286.44615828009364	21/02/21 12:29:28
21	977	378.4133689306273	286.5792819815259	21/02/21 12:29:28
21	977	378.56151436008304	286.6777471485129	21/02/21 12:29:28
21	977	378.735561062113	286.7934276500435	21/02/21 12:29:28
21	977	378.94557588891126	286.93301444031033	21/02/21 12:29:29
21	977	379.17778269633664	287.08735117653396	21/02/21 12:29:29
21	977	379.32655329218863	287.186231861663	21/02/21 12:29:29
21	977	379.49077547142866	287.2953824737422	21/02/21 12:29:29
21	977	379.6507340766984	287.4016992925381	21/02/21 12:29:29
21	977	379.8734977086426	287.54975960259014	21/02/21 12:29:29
21	977	380.0573086665938	287.6719299370729	21/02/21 12:29:29
21	977	380.2241990743408	287.782853992764	21/02/21 12:29:29
21	977	380.448343919131	287.93183232879915	21/02/21 12:29:29
21	977	380.67140790917944	288.0800922724882	21/02/21 12:29:30
21	977	380.831341245439	288.186392296184	21/02/21 12:29:30
21	977	381.05100947611305	288.33239524136104	21/02/21 12:29:30
21	977	381.19627775844816	288.42894810654616	21/02/21 12:29:30
21	977	381.4048574025943	288.56758099968624	21/02/21 12:29:30
21	977	381.61146774781673	288.70490499421174	21/02/21 12:29:30
21	977	381.74503087998335	288.7936780070573	21/02/21 12:29:30
21	977	381.87932312140805	288.8829356238836	21/02/21 12:29:30
21	977	382.04519223798434	288.99318087627967	21/02/21 12:29:30
