floorId	partitionId	location_x	location_y	timeStamp
1	39	324.30291682907847	279.31167853390167	20/04/28 05:10:34
1	39	324.3494704461871	279.2590546940856	20/04/28 05:10:34
1	39	324.2063438947725	279.3667310001749	20/04/28 05:10:34
1	39	324.2227303297055	279.3669837626394	20/04/28 05:10:34
1	39	324.2141796213096	279.1269178043892	20/04/28 05:10:34
1	39	324.2141796213096	279.1269178043892	20/04/28 05:10:34
1	39	324.2603506321561	279.030181471804	20/04/28 05:10:34
1	39	324.2514333743675	279.0301907015663	20/04/28 05:10:34
1	39	324.29195124833126	278.9919241082403	20/04/28 05:10:34
1	39	324.25181219672663	278.74249280038947	20/04/28 05:10:34
1	39	324.2875597779942	278.74498495105	20/04/28 05:10:35
1	39	324.2875597779942	278.74498495105	20/04/28 05:10:35
1	39	324.2070308863558	278.70770776588876	20/04/28 05:10:35
1	39	324.2901766450504	278.9071193964742	20/04/28 05:10:35
1	39	324.238139080582	278.9463098981211	20/04/28 05:10:35
1	39	324.20570149771083	278.9207133173163	20/04/28 05:10:35
1	39	324.059152912457	278.702330071317	20/04/28 05:10:35
1	39	324.1166752081075	278.6772968012515	20/04/28 05:10:35
1	39	324.1163745382074	278.72165392590824	20/04/28 05:10:35
1	39	324.30940666480626	278.8640909254314	20/04/28 05:10:35
1	39	324.3061920511491	278.8611917588498	20/04/28 05:10:36
1	39	324.5307640212267	278.79711429164485	20/04/28 05:10:36
1	39	324.428777244575	278.7345549362606	20/04/28 05:10:36
1	39	324.19573262933494	278.8501450771263	20/04/28 05:10:36
1	39	324.19573262933494	278.8501450771263	20/04/28 05:10:36
1	39	324.1836922156195	278.90881828280664	20/04/28 05:10:36
1	39	324.19816277607913	278.8499851563596	20/04/28 05:10:36
1	39	324.0337556397799	278.89561529915886	20/04/28 05:10:36
1	39	324.2093321059925	278.8064419729063	20/04/28 05:10:36
1	39	324.0588571186582	278.74046872909673	20/04/28 05:10:37
1	39	323.8944841940899	278.6487214415023	20/04/28 05:10:37
1	39	323.77458685559645	278.798718017219	20/04/28 05:10:37
1	39	323.7656187923861	278.80165238558664	20/04/28 05:10:37
1	39	323.7045335712553	278.81075582661435	20/04/28 05:10:37
1	39	323.64343937165654	278.6935293316769	20/04/28 05:10:37
1	39	323.46214111075307	278.6107445017923	20/04/28 05:10:37
1	39	323.5391482532692	278.7588610541494	20/04/28 05:10:37
1	39	323.557887250406	278.5258545728157	20/04/28 05:10:37
1	39	323.6834681114428	278.3712705003454	20/04/28 05:10:37
1	39	323.62868235118907	278.1600651924031	20/04/28 05:10:38
1	39	323.4412355722269	278.0646623403545	20/04/28 05:10:38
1	39	323.40189019605367	278.0134032539057	20/04/28 05:10:38
1	39	323.3357313162741	278.1517113873038	20/04/28 05:10:38
1	39	323.21622919414557	278.2650719532958	20/04/28 05:10:38
1	39	323.3829437271513	278.4610350354754	20/04/28 05:10:38
1	39	323.379479659605	278.4669457032991	20/04/28 05:10:38
1	39	323.4580473628902	278.34559198769176	20/04/28 05:10:38
1	39	323.45565173751504	278.3440523268682	20/04/28 05:10:38
1	39	323.54320183548856	278.32523671835696	20/04/28 05:10:39
1	39	323.56358879768965	278.24894283700496	20/04/28 05:10:39
1	39	323.5880374787182	278.3323658745512	20/04/28 05:10:39
1	39	323.31943651158423	278.4361175931536	20/04/28 05:10:39
1	39	323.35871009379434	278.3574517376539	20/04/28 05:10:39
1	39	323.50829456406984	278.09797171223556	20/04/28 05:10:39
1	39	323.5391433250996	277.91263823106186	20/04/28 05:10:39
1	39	323.46046012459686	278.126241585514	20/04/28 05:10:39
1	39	323.4583426997348	278.1295457903427	20/04/28 05:10:39
1	39	323.50719810357543	278.022390251133	20/04/28 05:10:39
1	39	323.44608014610355	277.99308445409156	20/04/28 05:10:40
1	39	323.4817037063601	278.08529495121707	20/04/28 05:10:40
1	39	323.41092017813025	277.82630945403577	20/04/28 05:10:40
1	39	323.6285166233069	277.7441163230347	20/04/28 05:10:40
1	39	323.6936381761805	277.58880681745427	20/04/28 05:10:40
1	39	323.6519189392461	277.78387563075887	20/04/28 05:10:40
1	39	323.7275465822893	277.60968327511586	20/04/28 05:10:40
1	39	323.73780001551626	277.5236135765447	20/04/28 05:10:40
1	39	323.60077322200124	277.67251832914997	20/04/28 05:10:40
1	39	323.611459804695	277.74514565108393	20/04/28 05:10:40
1	39	323.6232862750706	277.7948785417928	20/04/28 05:10:41
1	39	323.5778250070306	277.71913771909664	20/04/28 05:10:41
1	39	323.7123787584609	277.8647421291055	20/04/28 05:10:41
1	39	323.6919497349746	277.63074113444645	20/04/28 05:10:41
1	39	323.5631963928267	277.6729404833343	20/04/28 05:10:41
1	39	323.6820391187637	277.78218445401376	20/04/28 05:10:41
1	39	323.7113190199426	278.0034061381326	20/04/28 05:10:41
1	39	323.7113190199426	278.0034061381326	20/04/28 05:10:41
1	39	323.4324919993395	277.981883643761	20/04/28 05:10:41
1	39	323.5642744862101	277.9373566003926	20/04/28 05:10:42
1	39	323.53432694828535	277.9689289542145	20/04/28 05:10:42
1	39	323.53432694828535	277.9689289542145	20/04/28 05:10:42
1	39	323.53432694828535	277.9689289542145	20/04/28 05:10:42
1	39	323.699165170499	277.88028357118344	20/04/28 05:10:42
1	39	323.91916092774017	278.0062931482779	20/04/28 05:10:42
1	39	323.8342050048994	278.06788794358386	20/04/28 05:10:42
1	39	323.8342050048994	278.06788794358386	20/04/28 05:10:42
1	39	323.8342050048994	278.06788794358386	20/04/28 05:10:42
1	39	323.54515928216915	277.9994568699867	20/04/28 05:10:42
1	39	323.74090220799377	278.05429353253356	20/04/28 05:10:43
1	39	323.7330803879969	278.01174438309624	20/04/28 05:10:43
1	39	323.70804460000124	277.814010552616	20/04/28 05:10:43
1	39	323.7564347482739	277.8260795793849	20/04/28 05:10:43
1	39	324.0347738926714	277.89565922220487	20/04/28 05:10:43
1	39	323.9527132553833	278.0476587030313	20/04/28 05:10:43
1	39	324.0842889219959	278.02190203323585	20/04/28 05:10:43
1	39	324.3766260503064	277.98419682933695	20/04/28 05:10:43
1	39	324.39716435432547	277.76574480972556	20/04/28 05:10:43
1	39	324.15785285197876	277.88732108875973	20/04/28 05:10:44
1	39	324.1578513715155	277.8062028574355	20/04/28 05:10:44
1	39	324.03967707248853	278.03509804561577	20/04/28 05:10:44
1	39	323.8851781263708	278.02221963621224	20/04/28 05:10:44
1	39	323.87230170154623	278.0145350796959	20/04/28 05:10:44
1	39	323.86339951768093	277.803484568479	20/04/28 05:10:44
1	39	324.12023744307726	277.7502467480661	20/04/28 05:10:44
1	39	324.25747827377984	277.6374538956251	20/04/28 05:10:44
1	39	324.36381214137384	277.52650603261577	20/04/28 05:10:44
1	39	324.38435761041467	277.53149811997895	20/04/28 05:10:44
1	39	324.35058717652305	277.7473110938908	20/04/28 05:10:45
1	39	324.11606518603844	277.82539919924136	20/04/28 05:10:45
1	39	324.36622784688865	277.6799405873391	20/04/28 05:10:45
1	39	324.34814226463516	277.68486702513326	20/04/28 05:10:45
1	39	324.31740714556304	277.66098378975255	20/04/28 05:10:45
1	39	324.4204710683912	277.4743562905553	20/04/28 05:10:45
1	39	324.44015367892183	277.4609319083426	20/04/28 05:10:45
1	39	324.3601415718073	277.2635308511318	20/04/28 05:10:45
1	39	324.3569313278768	277.23551597614534	20/04/28 05:10:45
1	39	324.2062281084707	277.2683804047853	20/04/28 05:10:45
1	39	324.3206718626978	277.3342822551226	20/04/28 05:10:46
1	39	324.3239499117249	277.30550167561506	20/04/28 05:10:46
1	39	324.3148149211773	277.18112401542817	20/04/28 05:10:46
1	39	324.60406325432257	277.2484462687948	20/04/28 05:10:46
1	39	324.5607926800886	277.270152908715	20/04/28 05:10:46
1	39	324.7162173485523	277.49770419404757	20/04/28 05:10:46
1	39	324.6704282808434	277.491710532599	20/04/28 05:10:46
1	39	324.6716872002227	277.49404618884734	20/04/28 05:10:46
1	39	324.56922179429495	277.5473482630603	20/04/28 05:10:46
1	39	324.60724389225146	277.49187848199773	20/04/28 05:10:47
1	39	324.602207697025	277.46566350691046	20/04/28 05:10:47
1	39	324.6738231872096	277.39859068750303	20/04/28 05:10:47
1	39	324.4051926390113	277.4418103548814	20/04/28 05:10:47
1	39	324.36657563069764	277.47144500774823	20/04/28 05:10:47
1	39	324.49529358955857	277.40981803001495	20/04/28 05:10:47
1	39	324.20500084412504	277.33882026326876	20/04/28 05:10:47
1	39	324.19316151839473	277.40273192864765	20/04/28 05:10:47
1	39	324.3382649677953	277.5167084906081	20/04/28 05:10:47
1	39	324.19475548835965	277.72315472395275	20/04/28 05:10:47
1	39	324.25502322203823	277.87694764493494	20/04/28 05:10:48
1	39	324.36671858247115	277.81604254688597	20/04/28 05:10:48
1	39	324.5398414699634	278.0395500936759	20/04/28 05:10:48
1	39	324.5204322878792	278.0481976165834	20/04/28 05:10:48
1	39	324.66373574357607	278.0430316622293	20/04/28 05:10:48
1	39	324.62103304325564	278.2553062986306	20/04/28 05:10:48
1	39	324.71611920612946	278.2383921702345	20/04/28 05:10:48
1	39	324.73446992513334	278.4062694037817	20/04/28 05:10:48
1	39	324.5871769078235	278.40392680262335	20/04/28 05:10:48
1	39	324.48035016189976	278.27746284604837	20/04/28 05:10:48
1	39	324.67928262105727	278.0615013895402	20/04/28 05:10:49
1	39	324.86067446774575	278.01166553489793	20/04/28 05:10:49
1	39	324.8373158120095	278.07490651642945	20/04/28 05:10:49
1	39	324.75959311792946	278.22552668826216	20/04/28 05:10:49
1	39	324.84037631782144	278.2768028491152	20/04/28 05:10:49
1	39	324.85626925760005	278.30221766084185	20/04/28 05:10:49
1	39	324.8155457049919	278.285528729142	20/04/28 05:10:49
1	39	324.927379292688	278.2728013436645	20/04/28 05:10:49
1	39	324.9106040235426	278.146710409354	20/04/28 05:10:49
1	39	325.0749677869326	278.1560803832801	20/04/28 05:10:50
1	39	325.06183898265385	278.3095960982436	20/04/28 05:10:50
1	39	325.06842528139896	278.2757367488132	20/04/28 05:10:50
1	39	325.0562379557698	278.2807879702364	20/04/28 05:10:50
1	39	325.14516394452806	278.4978250404991	20/04/28 05:10:50
1	39	325.13445500420744	278.4676018320935	20/04/28 05:10:50
1	39	325.04646203596434	278.52741313847156	20/04/28 05:10:50
1	39	325.1929243372758	278.44820918157797	20/04/28 05:10:50
1	39	325.09470507898556	278.22715797039575	20/04/28 05:10:50
1	39	325.0818240705885	278.3226611941752	20/04/28 05:10:50
1	39	325.0162060519763	278.35835777142694	20/04/28 05:10:51
1	39	324.9671165381081	278.1303726263554	20/04/28 05:10:51
1	39	324.78294996441144	278.0608460978553	20/04/28 05:10:51
1	39	325.0549723472884	278.0190778006455	20/04/28 05:10:51
1	39	325.10642497344463	278.07632090332845	20/04/28 05:10:51
1	39	325.04825083700246	278.0754943807846	20/04/28 05:10:51
1	39	325.0855775428428	278.0936495783906	20/04/28 05:10:51
1	39	325.0385172268321	278.21208126849064	20/04/28 05:10:51
1	39	325.11161062880734	278.2239176919104	20/04/28 05:10:51
1	39	325.2049027648237	278.22393301518247	20/04/28 05:10:52
1	39	325.3067346652558	278.41665387293426	20/04/28 05:10:52
1	39	325.37935022339343	278.4502366963313	20/04/28 05:10:52
1	39	325.5963576632645	278.26048593191507	20/04/28 05:10:52
1	39	325.53084821372613	278.2802098858533	20/04/28 05:10:52
1	39	325.64769518860606	278.35437703634005	20/04/28 05:10:52
1	39	325.7279117327055	278.07018886306275	20/04/28 05:10:52
1	39	325.68519254681564	278.09983173382403	20/04/28 05:10:52
1	39	325.5461316280451	278.16574540410653	20/04/28 05:10:52
1	39	325.54508842874105	278.2270771185642	20/04/28 05:10:52
1	39	325.54429893421246	278.227611505222	20/04/28 05:10:53
1	39	325.54429893421246	278.227611505222	20/04/28 05:10:53
1	39	325.5840599267405	278.0126169123716	20/04/28 05:10:53
1	39	325.5840599267405	278.0126169123716	20/04/28 05:10:53
1	39	325.480552049696	277.74072919995643	20/04/28 05:10:53
1	39	325.52953023288717	277.86374963946486	20/04/28 05:10:53
1	39	325.79355005339403	277.74606590829404	20/04/28 05:10:53
1	39	325.89719483019843	277.6168243789313	20/04/28 05:10:53
1	39	326.0386061796918	277.5718117858213	20/04/28 05:10:53
1	39	325.9713500698701	277.542836760218	20/04/28 05:10:54
1	39	325.75864950766834	277.4212762454049	20/04/28 05:10:54
1	39	325.6522682262038	277.2435425039675	20/04/28 05:10:54
1	39	325.57068944967983	277.24567148405004	20/04/28 05:10:54
1	39	325.41096806174005	277.30137915840675	20/04/28 05:10:54
1	39	325.4952845938018	277.18787801412356	20/04/28 05:10:54
1	39	325.4952845938018	277.18787801412356	20/04/28 05:10:54
1	39	325.4952845938018	277.18787801412356	20/04/28 05:10:54
1	39	325.6304963949163	277.3906600991587	20/04/28 05:10:54
1	39	325.6696884577458	277.3934033554699	20/04/28 05:10:54
1	39	325.6699394480328	277.6047807198451	20/04/28 05:10:55
1	39	325.5860594987263	277.7419777005307	20/04/28 05:10:55
1	39	325.570661126872	277.67449376034364	20/04/28 05:10:55
1	39	325.64179721354736	277.78255582159545	20/04/28 05:10:55
1	39	325.55543055820226	277.79865921412284	20/04/28 05:10:55
1	39	325.6036150289739	277.69819483292554	20/04/28 05:10:55
1	39	325.61444168322214	277.6873648608116	20/04/28 05:10:55
1	39	325.6586753521011	277.8258511992722	20/04/28 05:10:55
1	39	325.4203718612681	277.9322893515469	20/04/28 05:10:55
1	39	325.5462255469538	277.93650820267237	20/04/28 05:10:55
1	39	325.7330480767032	277.85330113808766	20/04/28 05:10:56
1	39	325.8234053161618	277.72400620613683	20/04/28 05:10:56
1	39	325.7381049349105	277.68660320114816	20/04/28 05:10:56
1	39	325.5781348476849	277.8984723999334	20/04/28 05:10:56
1	39	325.66452922737227	277.98942603082776	20/04/28 05:10:56
1	39	325.669306513686	277.99100819374326	20/04/28 05:10:56
1	39	325.5993559489514	277.92942078167545	20/04/28 05:10:56
1	39	325.5614614597775	277.9067342995984	20/04/28 05:10:56
1	39	325.7163227720179	277.78752319127744	20/04/28 05:10:56
1	39	325.63908907658214	277.5038622411912	20/04/28 05:10:57
1	39	325.7597110190625	277.75458500182094	20/04/28 05:10:57
1	39	325.96119575889446	277.6406251415825	20/04/28 05:10:57
1	39	326.0480527940572	277.5729966899631	20/04/28 05:10:57
1	39	326.0490436584495	277.57532987209095	20/04/28 05:10:57
1	39	326.07963044292825	277.55231881234846	20/04/28 05:10:57
1	39	325.84412141670293	277.6442430345279	20/04/28 05:10:57
1	39	325.8428027812181	277.625929409065	20/04/28 05:10:57
1	39	325.9068223146292	277.6450769426581	20/04/28 05:10:57
1	39	326.023103773163	277.71214872094856	20/04/28 05:10:57
1	39	326.07795753277003	277.8380724442998	20/04/28 05:10:58
1	39	326.0846727154817	277.98935336896756	20/04/28 05:10:58
1	39	326.24326697046365	278.05062770233616	20/04/28 05:10:58
1	39	326.4981073967024	278.168671438638	20/04/28 05:10:58
1	39	326.7548345687517	278.26371585168187	20/04/28 05:10:58
1	39	326.7449754196737	278.2652114624583	20/04/28 05:10:58
1	39	326.9256391049332	278.47883884804907	20/04/28 05:10:58
1	39	326.94921705791074	278.558279302271	20/04/28 05:10:58
1	39	326.95512636926964	278.5595696771191	20/04/28 05:10:58
1	39	326.9095855973516	278.61000327311365	20/04/28 05:10:59
1	39	326.9241613879229	278.6383362566562	20/04/28 05:10:59
1	39	326.9122371578777	278.57936253161506	20/04/28 05:10:59
1	39	326.6379983483821	278.62095319640264	20/04/28 05:10:59
1	39	326.6867573533064	278.68015477438865	20/04/28 05:10:59
1	39	326.7231474569932	278.7139711940783	20/04/28 05:10:59
1	39	326.6946873628217	278.8026115190958	20/04/28 05:10:59
1	39	326.60907401096165	278.78162573470047	20/04/28 05:10:59
1	39	326.34280783359753	278.8638034487545	20/04/28 05:10:59
1	39	326.50181939519746	278.96136562250234	20/04/28 05:10:59
1	39	326.3619852468292	278.93751384862304	20/04/28 05:11:00
1	39	326.41733631985505	278.9365182637996	20/04/28 05:11:00
1	39	326.49533255534936	278.9715098234041	20/04/28 05:11:00
1	39	326.56830000771396	279.18693716950025	20/04/28 05:11:00
1	39	326.3071918944214	279.19296005379186	20/04/28 05:11:00
1	39	326.38569247041573	279.1865738312747	20/04/28 05:11:00
1	39	326.32748941065444	279.0732350422372	20/04/28 05:11:00
1	39	326.2255604886654	279.2996569982884	20/04/28 05:11:00
1	39	326.3054901121083	279.5063351442639	20/04/28 05:11:00
1	39	326.25267544178234	279.34571878799005	20/04/28 05:11:00
1	39	326.33508712867643	279.2549642565408	20/04/28 05:11:01
1	39	326.3387974505586	279.2457937250754	20/04/28 05:11:01
1	39	326.33779590544935	279.3386193823351	20/04/28 05:11:01
1	39	326.3143881663088	279.2469303467984	20/04/28 05:11:01
1	39	326.3010123112684	279.24137518792713	20/04/28 05:11:01
1	39	326.32114205101846	279.3417201977676	20/04/28 05:11:01
1	39	326.2653544363309	279.36069630182817	20/04/28 05:11:01
1	39	326.09505229241023	279.29381162355486	20/04/28 05:11:01
1	39	326.1391489945218	279.3785971498078	20/04/28 05:11:01
1	39	326.1360474608282	279.6759171407915	20/04/28 05:11:02
1	39	326.2478536829114	279.70393157822576	20/04/28 05:11:02
1	39	326.3668010187841	279.66458071990724	20/04/28 05:11:02
1	39	326.2997562160426	279.6554435101446	20/04/28 05:11:02
1	39	326.32141444381386	279.4724290647748	20/04/28 05:11:02
1	39	326.2622770787719	279.376735697118	20/04/28 05:11:02
1	39	326.28757979866316	279.4997193497843	20/04/28 05:11:02
1	39	326.31648621023334	279.46895364093456	20/04/28 05:11:02
1	39	326.30170763834195	279.47565760548065	20/04/28 05:11:02
1	39	326.3882072775365	279.5705697271148	20/04/28 05:11:02
1	39	326.31430242036635	279.5516759378775	20/04/28 05:11:03
1	39	326.2458964795126	279.5716131468792	20/04/28 05:11:03
1	39	326.1016456603334	279.77199899687264	20/04/28 05:11:03
1	39	326.06973010334366	279.75601526946184	20/04/28 05:11:03
1	39	325.9686869573719	279.5847931324953	20/04/28 05:11:03
1	39	325.91427437307925	279.514430255251	20/04/28 05:11:03
1	39	326.14349836224045	279.61397898107856	20/04/28 05:11:03
1	39	326.1579168112485	279.5551803014924	20/04/28 05:11:03
1	39	326.04062262138785	279.47220942820456	20/04/28 05:11:03
1	39	326.1946086108428	279.2726046519284	20/04/28 05:11:04
1	39	326.3543722096842	279.16757622371813	20/04/28 05:11:04
1	39	326.59766590787314	279.0764061454932	20/04/28 05:11:04
1	39	326.6031892461266	279.0728781898635	20/04/28 05:11:04
1	39	326.60171749973006	279.06826594626125	20/04/28 05:11:04
1	39	326.65690107691444	278.81236318268043	20/04/28 05:11:04
1	39	326.50266564300057	278.7462946669635	20/04/28 05:11:04
1	39	326.2486782200928	278.727897016103	20/04/28 05:11:04
1	39	326.34564987217414	278.64765562929256	20/04/28 05:11:04
1	39	326.53762300780744	278.509305010688	20/04/28 05:11:04
1	39	326.29605353552114	278.382808383426	20/04/28 05:11:05
1	39	326.3185910767043	278.5183139002164	20/04/28 05:11:05
1	39	326.1115201485721	278.52883627107434	20/04/28 05:11:05
1	39	325.9012213116876	278.55431397292057	20/04/28 05:11:05
1	39	325.9171658218516	278.323656124299	20/04/28 05:11:05
1	39	325.90438824646924	278.3371097506819	20/04/28 05:11:05
1	39	325.8870984295665	278.3401395248159	20/04/28 05:11:05
1	39	326.06053575147786	278.4981145179204	20/04/28 05:11:05
1	39	326.2414731921258	278.6399675607549	20/04/28 05:11:05
1	39	326.20138607163017	278.731757762728	20/04/28 05:11:05
1	39	326.2308857321331	278.9056778113648	20/04/28 05:11:06
1	39	326.4316569348078	278.8415282100547	20/04/28 05:11:06
1	39	326.519468441902	278.8594536369374	20/04/28 05:11:06
1	39	326.73939595741416	278.8170268719025	20/04/28 05:11:06
1	39	326.6528078435236	278.90267738877554	20/04/28 05:11:06
1	39	326.7266908217166	278.9187944313063	20/04/28 05:11:06
1	39	326.73770089052744	278.6520845629321	20/04/28 05:11:06
1	39	326.7182754225566	278.63994738630237	20/04/28 05:11:06
1	39	326.72828189655587	278.4590117806603	20/04/28 05:11:06
1	39	326.5898562452409	278.22796276335094	20/04/28 05:11:07
1	39	326.47443009615677	278.35570500934375	20/04/28 05:11:07
1	39	326.4080335104232	278.3509033829823	20/04/28 05:11:07
1	39	326.37234477059224	278.0736977605645	20/04/28 05:11:07
1	39	326.20515949653355	278.25304922228395	20/04/28 05:11:07
1	39	326.21172635937563	278.2933570499226	20/04/28 05:11:07
1	39	326.39223388403104	278.3658717304061	20/04/28 05:11:07
1	39	326.423742330421	278.4067733823379	20/04/28 05:11:07
1	39	326.42691920541665	278.4571104194015	20/04/28 05:11:07
1	39	326.3882242420395	278.4396020873818	20/04/28 05:11:07
1	39	326.15829009414654	278.44833262284834	20/04/28 05:11:08
1	39	326.2884897497672	278.56283383278617	20/04/28 05:11:08
1	39	326.3137259647374	278.5495134258963	20/04/28 05:11:08
1	39	326.2572758422916	278.3720133576725	20/04/28 05:11:08
1	39	326.135695471604	278.59340891147843	20/04/28 05:11:08
1	39	326.3225499130419	278.46214690913087	20/04/28 05:11:08
1	39	326.2834533390638	278.5017270219577	20/04/28 05:11:08
1	39	326.3565264698864	278.47459359861534	20/04/28 05:11:08
1	39	326.2466656151895	278.39317134424493	20/04/28 05:11:08
1	39	326.2634412678479	278.45142874309613	20/04/28 05:11:08
1	39	326.1533544927374	278.30787040576337	20/04/28 05:11:09
1	39	326.32086191832127	278.4342722423943	20/04/28 05:11:09
1	39	326.37729440116567	278.41418591122823	20/04/28 05:11:09
1	39	326.39992073466516	278.4256880907755	20/04/28 05:11:09
1	39	326.3174358777423	278.2641868022025	20/04/28 05:11:09
1	39	326.3809868258398	278.4919995603293	20/04/28 05:11:09
1	39	326.253934337104	278.4109216647903	20/04/28 05:11:09
1	39	326.1534715168208	278.3161442353376	20/04/28 05:11:09
1	39	326.16354110049286	278.32796889039133	20/04/28 05:11:09
1	39	326.2369704253989	278.4061688094218	20/04/28 05:11:10
1	39	326.4057164276586	278.285324758692	20/04/28 05:11:10
1	39	326.40550285391623	278.33912169339936	20/04/28 05:11:10
1	39	326.488825937689	278.5263643594031	20/04/28 05:11:10
1	39	326.6978334987106	278.3910141466951	20/04/28 05:11:10
1	39	326.8592503835448	278.31795898129116	20/04/28 05:11:10
1	39	326.9157694680857	278.25072328377274	20/04/28 05:11:10
1	39	326.9199511676019	278.14872198963826	20/04/28 05:11:10
1	39	326.89338655128296	278.15532588103235	20/04/28 05:11:10
1	39	327.020140620406	277.95834310377353	20/04/28 05:11:10
1	39	327.10624761049445	277.80620903688686	20/04/28 05:11:11
1	39	327.06244704522356	277.8092293983569	20/04/28 05:11:11
1	39	327.0061831686322	277.8483274846894	20/04/28 05:11:11
1	39	326.9678710967384	277.88697653818787	20/04/28 05:11:11
1	39	327.04758587769396	278.10854886979445	20/04/28 05:11:11
1	39	327.01192329877705	278.1153002543139	20/04/28 05:11:11
1	39	327.08659808546406	278.00543652910966	20/04/28 05:11:11
1	39	326.95134431309214	277.8670379459235	20/04/28 05:11:11
1	39	326.95134431309214	277.8670379459235	20/04/28 05:11:11
1	39	326.91238357727843	277.89227335103493	20/04/28 05:11:12
1	39	327.027774433568	277.703793002252	20/04/28 05:11:12
1	39	326.9172510867106	277.85769754384546	20/04/28 05:11:12
1	39	326.89220043250975	277.77932220891546	20/04/28 05:11:12
1	39	326.78089574561	277.7953745060345	20/04/28 05:11:12
1	39	326.99836257745966	277.84475713560806	20/04/28 05:11:12
1	39	326.92223544620737	277.8907729594709	20/04/28 05:11:12
1	39	327.08500056182686	277.69016024838135	20/04/28 05:11:12
1	39	327.20120465118924	277.543001069662	20/04/28 05:11:12
1	39	327.4451500011033	277.62019155909655	20/04/28 05:11:12
1	39	327.476231323306	277.56105908069685	20/04/28 05:11:13
1	39	327.5283130876725	277.36272455859313	20/04/28 05:11:13
1	39	327.58476448041694	277.49760317107103	20/04/28 05:11:13
1	39	327.5682636608683	277.4514906511898	20/04/28 05:11:13
1	39	327.5810260757367	277.4541853223538	20/04/28 05:11:13
1	39	327.58979429314087	277.5511180962277	20/04/28 05:11:13
1	39	327.60295790171654	277.54963865167053	20/04/28 05:11:13
1	39	327.6108478771963	277.52654442678585	20/04/28 05:11:13
1	39	327.50683558019625	277.63852460976375	20/04/28 05:11:13
1	39	327.4515782723456	277.6787900281666	20/04/28 05:11:14
1	39	327.45505959852346	277.6878476545602	20/04/28 05:11:14
1	39	327.2082276653611	277.75651718790897	20/04/28 05:11:14
1	39	327.2082276653611	277.75651718790897	20/04/28 05:11:14
1	39	327.3317386687065	277.7080063760609	20/04/28 05:11:14
1	39	327.46372797114856	277.83205147358353	20/04/28 05:11:14
1	39	327.46995606582124	277.83083647330557	20/04/28 05:11:14
1	39	327.4735076600255	277.71417751425645	20/04/28 05:11:14
1	39	327.2032052590166	277.63227410680474	20/04/28 05:11:14
1	39	326.9751478274791	277.75458066867867	20/04/28 05:11:14
1	39	327.0227364875495	277.96277565204775	20/04/28 05:11:15
1	39	326.9651378548467	277.9535613065753	20/04/28 05:11:15
1	39	326.9651378548467	277.9535613065753	20/04/28 05:11:15
1	39	327.07468604838135	278.2059451824679	20/04/28 05:11:15
1	39	327.30030661362986	278.1845090361409	20/04/28 05:11:15
1	39	327.35257949467314	278.1051432612572	20/04/28 05:11:15
1	39	327.57021804336847	277.96239464984325	20/04/28 05:11:15
1	39	327.5557885358624	277.9566343485398	20/04/28 05:11:15
1	39	327.37706261127653	278.0903406609974	20/04/28 05:11:15
1	39	327.28758610384403	278.2240658371755	20/04/28 05:11:15
1	39	327.03260146834424	278.37162001657896	20/04/28 05:11:16
1	39	326.94043509333557	278.63588342845503	20/04/28 05:11:16
1	39	327.0427146070006	278.83868458805375	20/04/28 05:11:16
1	39	327.1584176945439	279.02844608614066	20/04/28 05:11:16
1	39	327.0681765793513	279.0926634112536	20/04/28 05:11:16
1	39	327.2827817378427	279.06428897479867	20/04/28 05:11:16
1	39	327.5138896263853	279.0521328690725	20/04/28 05:11:16
1	39	327.60930750661555	279.02965478262695	20/04/28 05:11:16
1	39	327.67483873914813	279.1217810555868	20/04/28 05:11:16
1	39	327.67500584912966	279.12235373539676	20/04/28 05:11:17
1	39	327.5177614728312	278.90213275715666	20/04/28 05:11:17
1	39	327.7358907138668	279.10572310876495	20/04/28 05:11:17
1	39	327.82556949266956	279.0935086301148	20/04/28 05:11:17
1	39	327.8123739984395	279.0613652835973	20/04/28 05:11:17
1	39	328.05537517598253	278.9174452409874	20/04/28 05:11:17
1	39	328.04214998310994	279.04712343753175	20/04/28 05:11:17
1	39	328.0058110233974	279.0951170895031	20/04/28 05:11:17
1	39	328.02129598136804	279.19851692400744	20/04/28 05:11:17
1	39	328.0312165164466	279.2991715794693	20/04/28 05:11:17
1	39	328.0390067381857	279.2959675269476	20/04/28 05:11:18
1	39	328.0349644566406	279.29989894052284	20/04/28 05:11:18
1	39	328.03980693209684	279.2315196427042	20/04/28 05:11:18
1	39	328.03976847034517	279.23228615540353	20/04/28 05:11:18
1	39	328.03406985013356	279.26379335801886	20/04/28 05:11:18
1	39	328.1175141334682	279.2563506050366	20/04/28 05:11:18
1	39	328.3737230275595	279.20534317644325	20/04/28 05:11:18
1	39	328.43928241479887	279.1154671211042	20/04/28 05:11:18
1	39	328.29357768441116	279.1407396076009	20/04/28 05:11:18
1	39	328.31039319110965	278.84514985170034	20/04/28 05:11:18
1	39	328.3056931981909	278.83765713379375	20/04/28 05:11:19
1	39	328.2872667732755	278.8426285652928	20/04/28 05:11:19
1	39	328.2739465617872	278.74738466054146	20/04/28 05:11:19
1	39	328.195023411039	278.74803807043344	20/04/28 05:11:19
1	39	328.3189460942725	278.7939613495091	20/04/28 05:11:19
1	39	328.3365074445239	279.06467666941046	20/04/28 05:11:19
1	39	328.3274629295263	278.94119538274595	20/04/28 05:11:19
1	39	328.3537649510619	278.9363053007441	20/04/28 05:11:19
1	39	328.4508830936906	278.9905002782498	20/04/28 05:11:19
1	39	328.5054882827718	279.01386072897463	20/04/28 05:11:20
1	39	328.4673457136556	279.0298177886551	20/04/28 05:11:20
1	39	328.457279092081	279.09547785652717	20/04/28 05:11:20
1	39	328.46816648080943	279.089138293064	20/04/28 05:11:20
1	39	328.5224618836556	279.10352296455636	20/04/28 05:11:20
1	39	328.6267293147032	279.15190993154727	20/04/28 05:11:20
1	39	328.7401413783023	279.01369101807296	20/04/28 05:11:20
1	39	328.7980790046363	278.9111923054291	20/04/28 05:11:20
1	39	328.9681620390343	278.8434829914751	20/04/28 05:11:20
1	39	328.814021856887	278.9330314848037	20/04/28 05:11:20
1	39	328.7607754123044	279.17317608974037	20/04/28 05:11:21
1	39	328.57166780834905	279.3831295579798	20/04/28 05:11:21
1	39	328.35839097059744	279.4713831600407	20/04/28 05:11:21
1	39	328.333714419996	279.51253805045144	20/04/28 05:11:21
1	39	328.1551615402117	279.63027093191465	20/04/28 05:11:21
1	39	328.29167611511997	279.49980779376034	20/04/28 05:11:21
1	39	328.3606490885972	279.4986993928951	20/04/28 05:11:21
1	39	328.2759423222164	279.76578740086944	20/04/28 05:11:21
1	39	328.3614615582949	279.68835799269067	20/04/28 05:11:21
1	39	328.3077489225003	279.5993962544812	20/04/28 05:11:22
1	39	328.2390096169271	279.5629865552665	20/04/28 05:11:22
1	39	328.47661477861675	279.43576226183126	20/04/28 05:11:22
1	39	328.65078280665557	279.38090526544374	20/04/28 05:11:22
1	39	328.7654794319902	279.2796906148412	20/04/28 05:11:22
1	39	328.58685370936854	279.22358221118634	20/04/28 05:11:22
1	39	328.58685370936854	279.22358221118634	20/04/28 05:11:22
1	39	328.58685370936854	279.22358221118634	20/04/28 05:11:22
1	39	328.538038179848	279.01614524901396	20/04/28 05:11:22
1	39	328.6716341059555	279.1068495776905	20/04/28 05:11:22
1	39	328.6468136420435	278.9547247439606	20/04/28 05:11:23
1	39	328.5219369653879	278.78679696174765	20/04/28 05:11:23
1	39	328.52940255463824	278.8359315885344	20/04/28 05:11:23
1	39	328.5677781316774	278.812959814317	20/04/28 05:11:23
1	39	328.5627754770342	278.7451164048336	20/04/28 05:11:23
1	39	328.33875522208615	278.67377916198797	20/04/28 05:11:23
1	39	328.29565916979095	278.71494334360466	20/04/28 05:11:23
1	39	328.3896193689291	278.6409852965222	20/04/28 05:11:23
1	39	328.3261585689642	278.4520986293009	20/04/28 05:11:23
1	39	328.31758180441165	278.72101917706885	20/04/28 05:11:24
1	39	328.23588178132206	278.4588151820442	20/04/28 05:11:24
1	39	328.167457646203	278.42622446838385	20/04/28 05:11:24
1	39	328.3210353056504	278.673666931317	20/04/28 05:11:24
1	39	328.22354417949464	278.63128214237054	20/04/28 05:11:24
1	39	328.24673302832366	278.60366190719566	20/04/28 05:11:24
1	39	328.4005221155393	278.476186208522	20/04/28 05:11:24
1	39	328.1698221990733	278.4193316483607	20/04/28 05:11:24
1	39	328.05338070980883	278.3760218521065	20/04/28 05:11:24
1	39	327.97855589040114	278.3614109949206	20/04/28 05:11:24
1	39	328.0009808668794	278.05955206906526	20/04/28 05:11:25
1	39	327.7646487251766	278.1217849263729	20/04/28 05:11:25
1	39	328.01680221393957	278.2531571381081	20/04/28 05:11:25
1	39	328.0117696295067	278.24680725559256	20/04/28 05:11:25
1	39	328.2489507737029	278.2409681143243	20/04/28 05:11:25
1	39	328.2489507737029	278.2409681143243	20/04/28 05:11:25
1	39	328.0103581578897	278.2160809577615	20/04/28 05:11:25
1	39	327.67378895160823	278.2829886795836	20/04/28 05:11:25
1	39	327.67378895160823	278.2829886795836	20/04/28 05:11:25
1	39	327.68924593207845	278.27712529267376	20/04/28 05:11:25
1	39	327.5954842232297	278.2696605213431	20/04/28 05:11:26
1	39	327.5974386682698	277.9929577063307	20/04/28 05:11:26
1	39	327.5435351430966	278.16364801164417	20/04/28 05:11:26
1	39	327.6056645068923	278.274173346884	20/04/28 05:11:26
1	39	327.46201678854453	278.4657091730143	20/04/28 05:11:26
1	39	327.6164849100776	278.6924078682873	20/04/28 05:11:26
1	39	327.6164849100776	278.6924078682873	20/04/28 05:11:26
1	39	327.8367117139971	278.82821358788436	20/04/28 05:11:26
1	39	328.0356958215476	279.00328871963137	20/04/28 05:11:26
1	39	327.82896136883676	279.20684442094984	20/04/28 05:11:27
1	39	327.62623709312055	279.0368667960399	20/04/28 05:11:27
1	39	327.62623709312055	279.0368667960399	20/04/28 05:11:27
1	39	327.8852314685575	278.99221107137714	20/04/28 05:11:27
1	39	327.9306531489115	278.91229321333014	20/04/28 05:11:27
1	39	328.101434623837	278.896847905088	20/04/28 05:11:27
1	39	328.1395497877454	279.0552110412523	20/04/28 05:11:27
1	39	328.10739872083235	279.0217753875385	20/04/28 05:11:27
1	39	327.83898321375636	278.98608295909173	20/04/28 05:11:27
1	39	327.9250737036142	279.21399173528124	20/04/28 05:11:27
1	39	327.95785759060254	279.44701037612765	20/04/28 05:11:28
1	39	327.83771771031826	279.44443346515953	20/04/28 05:11:28
1	39	327.6003736421009	279.4732654898518	20/04/28 05:11:28
1	39	327.59942114346103	279.52576596273997	20/04/28 05:11:28
1	39	327.379906742371	279.61979506163965	20/04/28 05:11:28
1	39	327.38919191274925	279.63157224354654	20/04/28 05:11:28
1	39	327.55887504091936	279.73066959972306	20/04/28 05:11:28
1	39	327.5585038559016	279.63757256704776	20/04/28 05:11:28
1	39	327.53272880342445	279.630053056479	20/04/28 05:11:28
1	39	327.5479334057124	279.67084310510495	20/04/28 05:11:29
1	39	327.5395430803745	279.44008100570517	20/04/28 05:11:29
1	39	327.5408426847908	279.4359616869986	20/04/28 05:11:29
1	39	327.51646464905923	279.71908494265546	20/04/28 05:11:29
1	39	327.4437243454093	279.62236876168805	20/04/28 05:11:29
1	39	327.2965379665545	279.5125320297205	20/04/28 05:11:29
1	39	327.2965379665545	279.5125320297205	20/04/28 05:11:29
1	39	327.1559300641267	279.52644212816523	20/04/28 05:11:29
1	39	327.1143826932341	279.6587954694754	20/04/28 05:11:29
1	39	327.32041122888893	279.9460482663069	20/04/28 05:11:29
1	39	327.32041122888893	279.9460482663069	20/04/28 05:11:30
1	39	327.1070174528859	279.8531996831864	20/04/28 05:11:30
1	39	327.07305947485816	279.95674994625597	20/04/28 05:11:30
1	39	327.23314236542194	279.96930008442314	20/04/28 05:11:30
1	39	327.10055936262927	280.14095431343054	20/04/28 05:11:30
1	39	327.1306693330526	280.1166326483856	20/04/28 05:11:30
1	39	327.36266850209506	280.286116678016	20/04/28 05:11:30
1	39	327.34804634382135	280.3085052155808	20/04/28 05:11:30
1	39	327.36814289254033	280.2626170528399	20/04/28 05:11:30
1	39	327.38736141143335	280.30046915231446	20/04/28 05:11:30
1	39	327.40561120732815	280.4628638452797	20/04/28 05:11:31
1	39	327.40561120732815	280.4628638452797	20/04/28 05:11:31
1	39	327.5414377152097	280.3439243093604	20/04/28 05:11:31
1	39	327.54190703200965	280.339508642384	20/04/28 05:11:31
1	39	327.6177940297223	280.46375238715814	20/04/28 05:11:31
1	39	327.6066853171207	280.53148664577776	20/04/28 05:11:31
1	39	327.38201583031	280.45973678560387	20/04/28 05:11:31
1	39	327.24704311460187	280.50497070830886	20/04/28 05:11:31
1	39	327.318675513332	280.5444864544975	20/04/28 05:11:31
1	39	327.26981986230754	280.6497907293321	20/04/28 05:11:32
1	39	327.086568270466	280.6151022552463	20/04/28 05:11:32
1	39	327.0038159957811	280.3982217506313	20/04/28 05:11:32
1	39	326.99350394122195	280.4239397162356	20/04/28 05:11:32
1	39	327.111393720088	280.68405786886865	20/04/28 05:11:32
1	39	327.0698388692071	280.8819293771368	20/04/28 05:11:32
1	39	327.0698388692071	280.8819293771368	20/04/28 05:11:32
1	39	326.9367734287352	281.10533439835734	20/04/28 05:11:32
1	39	326.9444195818392	281.09722042003295	20/04/28 05:11:32
1	39	327.1460294647052	280.9653705063948	20/04/28 05:11:32
1	39	327.1438752040763	280.96482350892677	20/04/28 05:11:33
1	39	327.1438752040763	280.96482350892677	20/04/28 05:11:33
1	39	326.67603254112976	281.06004916061363	20/04/28 05:11:33
1	39	326.67603254112976	281.06004916061363	20/04/28 05:11:33
1	39	326.61477463016894	281.31264085894594	20/04/28 05:11:33
1	39	326.46848958390126	281.0561236743185	20/04/28 05:11:33
1	39	326.46848958390126	281.0561236743185	20/04/28 05:11:33
1	39	326.4745707691293	281.19942944236794	20/04/28 05:11:33
1	39	326.4745707691293	281.19942944236794	20/04/28 05:11:33
