stationId	t_start	t_end	t_max	timeStamp
56	20/04/28 05:17:09	20/04/28 05:17:09	20/04/28 05:17:09
56	20/04/28 05:17:11	20/04/28 05:17:11	20/04/28 05:17:11
139	20/04/28 05:17:13	20/04/28 05:17:13	20/04/28 05:17:13
136	20/04/28 05:17:15	20/04/28 05:08:57	20/04/28 05:17:15
45	20/04/28 05:17:17	20/04/28 05:17:17	20/04/28 05:17:17
40	20/04/28 05:17:19	20/04/28 05:17:19	20/04/28 05:17:19
45	20/04/28 05:17:21	20/04/28 05:17:21	20/04/28 05:17:21
109	20/04/28 05:17:23	20/04/28 05:17:23	20/04/28 05:17:23
108	20/04/28 05:17:25	20/04/28 05:17:28	20/04/28 05:17:25
108	20/04/28 05:17:30	20/04/28 05:17:30	20/04/28 05:17:30
78	20/04/28 05:17:32	20/04/28 05:17:33	20/04/28 05:17:33
139	20/04/28 05:17:35	20/04/28 05:17:36	20/04/28 05:17:36
78	20/04/28 05:17:38	20/04/28 05:17:38	20/04/28 05:17:38
78	20/04/28 05:17:40	20/04/28 05:17:40	20/04/28 05:17:40
78	20/04/28 05:17:42	20/04/28 05:17:42	20/04/28 05:17:42
70	20/04/28 05:17:44	20/04/28 05:17:45	20/04/28 05:17:45
70	20/04/28 05:17:47	20/04/28 05:17:47	20/04/28 05:17:47
63	20/04/28 05:17:49	20/04/28 05:17:49	20/04/28 05:17:49
78	20/04/28 05:17:51	20/04/28 05:17:51	20/04/28 05:17:51
13	20/04/28 05:17:53	20/04/28 05:17:53	20/04/28 05:17:53
78	20/04/28 05:17:55	20/04/28 05:09:45	20/04/28 05:09:45
85	20/04/28 05:17:57	20/04/28 05:17:58	20/04/28 05:17:58
85	20/04/28 05:18:00	20/04/28 05:18:02	20/04/28 05:18:02
76	20/04/28 05:18:04	20/04/28 05:18:04	20/04/28 05:18:04
63	20/04/28 05:18:06	20/04/28 05:18:06	20/04/28 05:18:06
85	20/04/28 05:18:08	20/04/28 05:18:08	20/04/28 05:18:08
136	20/04/28 05:18:10	20/04/28 05:18:10	20/04/28 05:18:10
70	20/04/28 05:18:12	20/04/28 05:18:14	20/04/28 05:18:14
24	20/04/28 05:18:16	20/04/28 05:18:16	20/04/28 05:18:16
15	20/04/28 05:18:18	20/04/28 05:18:19	20/04/28 05:18:19
70	20/04/28 05:18:21	20/04/28 05:18:22	20/04/28 05:18:22
76	20/04/28 05:18:24	20/04/28 05:18:24	20/04/28 05:18:24
70	20/04/28 05:18:26	20/04/28 05:18:26	20/04/28 05:18:26
63	20/04/28 05:18:28	20/04/28 05:18:28	20/04/28 05:18:28
76	20/04/28 05:18:30	20/04/28 05:18:30	20/04/28 05:18:30
136	20/04/28 05:18:32	20/04/28 05:18:32	20/04/28 05:18:32
76	20/04/28 05:18:34	20/04/28 05:18:34	20/04/28 05:18:34
85	20/04/28 05:18:36	20/04/28 05:18:36	20/04/28 05:18:36
95	20/04/28 05:18:38	20/04/28 05:18:38	20/04/28 05:18:38
70	20/04/28 05:18:40	20/04/28 05:18:40	20/04/28 05:18:40
39	20/04/28 05:18:42	20/04/28 05:18:43	20/04/28 05:18:43
24	20/04/28 05:18:45	20/04/28 05:18:45	20/04/28 05:18:45
