floorId	partitionId	location_x	location_y	timeStamp
19	980	310.36738320623186	287.58936639951213	21/02/24 15:38:00
19	929	307.5917897278964	285.09780219467183	21/02/24 15:38:01
19	929	307.59178972789636	285.09780219467183	21/02/24 15:38:02
19	929	307.59178972789636	285.09780219467183	21/02/24 15:38:03
19	980	311.1000485048991	283.6794021053163	21/02/24 15:38:04
19	980	311.1000485048991	283.6794021053162	21/02/24 15:38:05
19	897	319.01521359261704	283.59757186890573	21/02/24 15:38:06
19	897	319.01521359261704	283.59757186890573	21/02/24 15:38:07
19	897	319.01521359261704	283.59757186890573	21/02/24 15:38:08
19	NULL	322.7688919024709	282.9508947625264	21/02/24 15:38:09
19	NULL	322.7688919024709	282.9508947625264	21/02/24 15:38:10
19	NULL	322.7688919024709	282.9508947625264	21/02/24 15:38:11
19	955	328.92321811554416	278.4499778858854	21/02/24 15:38:12
19	955	328.92321811554416	278.4499778858854	21/02/24 15:38:13
19	955	328.92321811554416	278.4499778858854	21/02/24 15:38:14
19	955	332.13398995625107	274.9863189954403	21/02/24 15:38:15
19	955	332.13398995625107	274.9863189954403	21/02/24 15:38:16
19	909	333.40710539699086	273.0002052198683	21/02/24 15:38:17
19	909	336.46390262814583	272.33191667978036	21/02/24 15:38:18
19	NULL	337.73701806888556	270.34580290420837	21/02/24 15:38:19
19	909	333.79691834538926	273.32229963118385	21/02/24 15:38:20
19	909	333.4071053969908	273.0002052198683	21/02/24 15:38:21
19	909	333.79691834538926	273.32229963118385	21/02/24 15:38:22
19	909	333.79691834538926	273.32229963118385	21/02/24 15:38:23
19	909	333.79691834538926	273.32229963118385	21/02/24 15:38:24
19	909	333.79691834538926	273.32229963118385	21/02/24 15:38:25
19	909	333.79691834538926	273.32229963118385	21/02/24 15:38:26
19	909	333.79691834538926	273.32229963118385	21/02/24 15:38:27
19	909	333.79691834538926	273.32229963118385	21/02/24 15:38:28
19	909	333.4071053969908	273.0002052198683	21/02/24 15:38:29
19	909	333.79691834538926	273.32229963118385	21/02/24 15:38:30
19	909	333.79691834538926	273.32229963118385	21/02/24 15:38:31
19	909	333.79691834538926	273.32229963118385	21/02/24 15:38:32
19	909	333.79691834538926	273.32229963118385	21/02/24 15:38:33
19	909	333.79691834538926	273.32229963118385	21/02/24 15:38:34
19	909	333.79691834538926	273.32229963118385	21/02/24 15:38:35
19	909	333.79691834538926	273.32229963118385	21/02/24 15:38:36
19	909	333.79691834538926	273.32229963118385	21/02/24 15:38:37
19	909	333.79691834538926	273.32229963118385	21/02/24 15:38:38
19	909	333.7969183453893	273.32229963118385	21/02/24 15:38:39
19	909	333.79691834538926	273.32229963118385	21/02/24 15:38:40
19	909	333.79691834538926	273.32229963118385	21/02/24 15:38:41
19	909	333.79691834538926	273.32229963118385	21/02/24 15:38:42
19	909	333.79691834538926	273.32229963118385	21/02/24 15:38:43
19	909	333.7969183453893	273.32229963118385	21/02/24 15:38:44
19	909	333.7969183453893	273.32229963118385	21/02/24 15:38:45
19	909	333.79691834538926	273.32229963118385	21/02/24 15:38:46
19	909	333.7969183453893	273.32229963118385	21/02/24 15:38:47
19	909	333.79691834538926	273.32229963118385	21/02/24 15:38:48
19	909	333.79691834538926	273.32229963118385	21/02/24 15:38:49
19	909	333.79691834538926	273.32229963118385	21/02/24 15:38:50
19	909	333.79691834538926	273.32229963118385	21/02/24 15:38:51
19	NULL	337.73701806888556	270.34580290420837	21/02/24 15:38:52
19	NULL	337.73701806888556	270.34580290420837	21/02/24 15:38:53
19	904	345.58406694546534	272.03626967984314	21/02/24 15:38:54
19	954	349.64467777791396	276.6907309398741	21/02/24 15:38:55
19	954	351.0914713947271	276.75392450645927	21/02/24 15:38:56
19	964	355.482293890607	282.3613173869535	21/02/24 15:38:57
19	964	355.482293890607	282.3613173869535	21/02/24 15:38:58
19	964	355.482293890607	282.3613173869535	21/02/24 15:38:59
19	964	355.482293890607	282.3613173869535	21/02/24 15:39:00
19	964	355.482293890607	282.3613173869535	21/02/24 15:39:01
19	918	358.31519680311567	286.86252054896266	21/02/24 15:39:02
19	918	358.31519680311567	286.86252054896266	21/02/24 15:39:03
19	918	358.31519680311567	286.86252054896266	21/02/24 15:39:04
19	918	358.31519680311567	286.86252054896266	21/02/24 15:39:05
19	918	358.31519680311567	286.86252054896266	21/02/24 15:39:06
19	918	358.31519680311567	286.86252054896266	21/02/24 15:39:07
19	918	358.31519680311567	286.86252054896266	21/02/24 15:39:08
19	918	358.31519680311567	286.86252054896266	21/02/24 15:39:09
19	918	358.31519680311567	286.86252054896266	21/02/24 15:39:10
19	918	358.31519680311567	286.86252054896266	21/02/24 15:39:11
19	918	358.31519680311567	286.86252054896266	21/02/24 15:39:12
19	918	358.31519680311567	286.86252054896266	21/02/24 15:39:13
19	918	358.31519680311567	286.86252054896266	21/02/24 15:39:14
19	918	358.31519680311567	286.86252054896266	21/02/24 15:39:15
19	918	358.31519680311567	286.86252054896266	21/02/24 15:39:16
19	918	358.31519680311567	286.86252054896266	21/02/24 15:39:17
19	918	358.31519680311567	286.86252054896266	21/02/24 15:39:18
19	918	358.31519680311567	286.86252054896266	21/02/24 15:39:19
19	959	362.3530560401282	287.71527633822046	21/02/24 15:39:20
19	918	358.31519680311567	286.86252054896266	21/02/24 15:39:21
19	918	358.31519680311567	286.86252054896266	21/02/24 15:39:22
19	918	358.31519680311567	286.86252054896266	21/02/24 15:39:23
19	918	358.31519680311567	286.86252054896266	21/02/24 15:39:24
19	918	358.31519680311567	286.86252054896266	21/02/24 15:39:25
19	918	358.31519680311567	286.86252054896266	21/02/24 15:39:26
19	918	358.31519680311567	286.86252054896266	21/02/24 15:39:27
19	918	358.31519680311567	286.86252054896266	21/02/24 15:39:28
19	918	358.31519680311567	286.86252054896266	21/02/24 15:39:29
19	918	358.31519680311567	286.86252054896266	21/02/24 15:39:30
19	918	358.31519680311567	286.86252054896266	21/02/24 15:39:31
19	964	355.482293890607	282.3613173869535	21/02/24 15:39:32
19	964	355.482293890607	282.3613173869535	21/02/24 15:39:33
19	964	355.482293890607	282.3613173869535	21/02/24 15:39:34
19	964	355.482293890607	282.3613173869535	21/02/24 15:39:35
19	964	355.482293890607	282.3613173869535	21/02/24 15:39:36
19	964	349.72234002988336	284.71465847817086	21/02/24 15:39:37
19	964	349.72234002988336	284.71465847817086	21/02/24 15:39:38
19	964	340.04388943277826	286.2192342684243	21/02/24 15:39:39
19	955	332.13398995625107	274.9863189954403	21/02/24 15:39:40
19	955	328.92321811554416	278.4499778858854	21/02/24 15:39:41
19	955	328.92321811554416	278.4499778858854	21/02/24 15:39:42
19	955	328.92321811554416	278.4499778858854	21/02/24 15:39:43
19	955	328.92321811554416	278.4499778858854	21/02/24 15:39:44
19	955	328.92321811554416	278.4499778858854	21/02/24 15:39:45
19	NULL	326.2665356724085	280.50725420525265	21/02/24 15:39:46
19	NULL	322.7688919024709	282.9508947625264	21/02/24 15:39:47
19	NULL	322.7688919024709	282.9508947625264	21/02/24 15:39:48
19	897	319.01521359261704	283.59757186890573	21/02/24 15:39:49
19	897	319.01521359261704	283.59757186890573	21/02/24 15:39:50
19	897	319.01521359261704	283.59757186890573	21/02/24 15:39:51
19	897	319.01521359261704	283.59757186890573	21/02/24 15:39:52
19	897	319.01521359261704	283.59757186890573	21/02/24 15:39:53
19	897	319.01521359261704	283.59757186890573	21/02/24 15:39:54
19	897	319.01521359261704	283.59757186890573	21/02/24 15:39:55
19	897	319.01521359261704	283.59757186890573	21/02/24 15:39:56
19	897	319.01521359261704	283.59757186890573	21/02/24 15:39:57
19	897	319.01521359261704	283.59757186890573	21/02/24 15:39:58
19	897	319.01521359261704	283.59757186890573	21/02/24 15:39:59
19	897	319.01521359261704	283.59757186890573	21/02/24 15:40:00
19	897	319.01521359261704	283.59757186890573	21/02/24 15:40:01
19	897	319.01521359261704	283.59757186890573	21/02/24 15:40:02
19	NULL	322.7688919024709	282.9508947625264	21/02/24 15:40:03
19	NULL	322.7688919024709	282.9508947625264	21/02/24 15:40:04
19	NULL	326.2665356724085	280.50725420525265	21/02/24 15:40:05
19	955	328.92321811554416	278.4499778858854	21/02/24 15:40:06
19	955	328.92321811554416	278.4499778858854	21/02/24 15:40:07
19	955	331.14052623366666	274.53372397223194	21/02/24 15:40:08
19	955	331.14052623366666	274.53372397223194	21/02/24 15:40:09
19	955	331.14052623366666	274.53372397223194	21/02/24 15:40:10
19	909	333.4071053969908	273.0002052198683	21/02/24 15:40:11
19	950	335.24432386191205	269.68948620372345	21/02/24 15:40:12
19	NULL	337.73701806888556	270.34580290420837	21/02/24 15:40:13
19	NULL	337.73701806888556	270.34580290420837	21/02/24 15:40:14
19	919	340.2475697813879	268.60286504177043	21/02/24 15:40:15
19	919	340.2475697813879	268.60286504177043	21/02/24 15:40:16
19	919	340.2475697813879	268.60286504177043	21/02/24 15:40:17
19	919	340.2475697813879	268.60286504177043	21/02/24 15:40:18
19	919	340.2475697813879	268.60286504177043	21/02/24 15:40:19
19	919	340.2475697813879	268.60286504177043	21/02/24 15:40:20
19	919	340.2475697813879	268.60286504177043	21/02/24 15:40:21
19	919	340.2475697813879	268.60286504177043	21/02/24 15:40:22
19	919	340.2475697813879	268.60286504177043	21/02/24 15:40:23
19	919	340.2475697813879	268.60286504177043	21/02/24 15:40:24
19	919	340.2475697813879	268.60286504177043	21/02/24 15:40:25
19	919	340.2475697813879	268.6028650417705	21/02/24 15:40:26
19	919	340.2475697813879	268.6028650417705	21/02/24 15:40:27
19	919	340.2475697813879	268.60286504177043	21/02/24 15:40:28
19	919	340.2475697813879	268.60286504177043	21/02/24 15:40:29
19	NULL	337.73701806888556	270.34580290420837	21/02/24 15:40:30
19	NULL	337.73701806888556	270.34580290420837	21/02/24 15:40:31
19	950	335.24432386191205	269.68948620372345	21/02/24 15:40:32
19	909	333.4071053969908	273.0002052198683	21/02/24 15:40:33
19	955	331.14052623366666	274.53372397223194	21/02/24 15:40:34
19	955	331.14052623366666	274.53372397223194	21/02/24 15:40:35
19	955	327.5892974082492	276.18391471006385	21/02/24 15:40:36
19	955	328.92321811554416	278.4499778858854	21/02/24 15:40:37
19	955	328.92321811554416	278.4499778858854	21/02/24 15:40:38
19	NULL	326.2665356724085	280.50725420525265	21/02/24 15:40:39
19	955	323.9884222877308	280.17133116751256	21/02/24 15:40:40
19	NULL	322.7688919024709	282.9508947625264	21/02/24 15:40:41
19	897	319.01521359261704	283.59757186890573	21/02/24 15:40:42
19	897	319.01521359261704	283.59757186890573	21/02/24 15:40:43
19	897	319.01521359261704	283.59757186890573	21/02/24 15:40:44
19	897	319.01521359261704	283.59757186890573	21/02/24 15:40:45
19	980	311.1000485048991	283.6794021053162	21/02/24 15:40:46
19	980	310.36738320623186	287.58936639951213	21/02/24 15:40:47
19	980	310.36738320623186	287.58936639951213	21/02/24 15:40:48
19	980	310.36738320623186	287.58936639951213	21/02/24 15:40:49
19	980	310.36738320623186	287.58936639951213	21/02/24 15:40:50
19	980	311.1000485048991	283.6794021053163	21/02/24 15:40:51
19	911	314.5882445185791	281.94764300047444	21/02/24 15:40:52
19	897	319.01521359261704	283.59757186890573	21/02/24 15:40:53
19	897	319.01521359261704	283.59757186890573	21/02/24 15:40:54
19	897	319.01521359261704	283.59757186890573	21/02/24 15:40:55
19	897	319.01521359261704	283.59757186890573	21/02/24 15:40:56
19	NULL	322.7688919024709	282.9508947625264	21/02/24 15:40:57
19	NULL	322.7688919024709	282.9508947625264	21/02/24 15:40:58
19	NULL	322.76889190247095	282.9508947625264	21/02/24 15:40:59
19	922	325.5094724563825	285.1617596557406	21/02/24 15:41:00
19	922	325.058324077979	285.8702183049625	21/02/24 15:41:01
19	922	323.860105010692	290.22083145180585	21/02/24 15:41:02
19	922	324.34089059979624	295.34597935380293	21/02/24 15:41:03
19	922	324.34089059979624	295.34597935380293	21/02/24 15:41:04
19	922	324.34089059979624	295.34597935380293	21/02/24 15:41:05
19	922	324.34089059979624	295.34597935380293	21/02/24 15:41:06
19	922	324.34089059979624	295.34597935380293	21/02/24 15:41:07
19	922	324.34089059979624	295.34597935380293	21/02/24 15:41:08
19	922	324.34089059979624	295.34597935380293	21/02/24 15:41:09
19	922	324.34089059979624	295.34597935380293	21/02/24 15:41:10
19	922	324.34089059979624	295.34597935380293	21/02/24 15:41:11
19	922	324.34089059979624	295.34597935380293	21/02/24 15:41:12
19	922	324.34089059979624	295.34597935380293	21/02/24 15:41:13
19	922	324.34089059979624	295.34597935380293	21/02/24 15:41:14
19	922	324.34089059979624	295.34597935380293	21/02/24 15:41:15
19	922	324.34089059979624	295.34597935380293	21/02/24 15:41:16
19	922	324.34089059979624	295.34597935380293	21/02/24 15:41:17
19	922	324.34089059979624	295.34597935380293	21/02/24 15:41:18
19	922	324.34089059979624	295.34597935380293	21/02/24 15:41:19
19	922	324.34089059979624	295.34597935380293	21/02/24 15:41:20
19	922	324.34089059979624	295.34597935380293	21/02/24 15:41:21
19	922	324.34089059979624	295.34597935380293	21/02/24 15:41:22
19	922	324.34089059979624	295.34597935380293	21/02/24 15:41:23
19	922	324.34089059979624	295.34597935380293	21/02/24 15:41:24
19	922	324.34089059979624	295.34597935380293	21/02/24 15:41:25
19	922	324.34089059979624	295.34597935380293	21/02/24 15:41:26
19	922	324.34089059979624	295.34597935380293	21/02/24 15:41:27
19	922	324.34089059979624	295.34597935380293	21/02/24 15:41:28
19	922	324.34089059979624	295.34597935380293	21/02/24 15:41:29
19	922	324.34089059979624	295.34597935380293	21/02/24 15:41:30
19	922	324.34089059979624	295.34597935380293	21/02/24 15:41:31
19	922	324.34089059979624	295.34597935380293	21/02/24 15:41:32
19	922	324.34089059979624	295.34597935380293	21/02/24 15:41:33
19	922	324.34089059979624	295.34597935380293	21/02/24 15:41:34
19	922	324.34089059979624	295.34597935380293	21/02/24 15:41:35
19	922	324.34089059979624	295.34597935380293	21/02/24 15:41:36
19	922	324.34089059979624	295.34597935380293	21/02/24 15:41:37
19	922	324.34089059979624	295.34597935380293	21/02/24 15:41:38
19	922	326.4135561032469	289.70733103261364	21/02/24 15:41:39
19	922	324.34089059979624	295.34597935380293	21/02/24 15:41:40
19	922	324.34089059979624	295.34597935380293	21/02/24 15:41:41
19	922	324.34089059979624	295.34597935380293	21/02/24 15:41:42
19	922	324.34089059979624	295.34597935380293	21/02/24 15:41:43
19	922	324.34089059979624	295.34597935380293	21/02/24 15:41:44
19	922	324.34089059979624	295.34597935380293	21/02/24 15:41:45
19	922	330.8600733332926	293.64058094487933	21/02/24 15:41:46
19	922	330.8600733332926	293.64058094487933	21/02/24 15:41:47
19	922	324.34089059979624	295.34597935380293	21/02/24 15:41:48
19	922	330.8600733332926	293.64058094487933	21/02/24 15:41:49
19	922	324.34089059979624	295.34597935380293	21/02/24 15:41:50
19	922	324.34089059979624	295.34597935380293	21/02/24 15:41:51
19	922	330.8600733332926	293.64058094487933	21/02/24 15:41:52
19	922	330.8600733332926	293.64058094487933	21/02/24 15:41:53
19	922	326.4135561032469	289.70733103261364	21/02/24 15:41:54
19	922	326.4135561032469	289.70733103261364	21/02/24 15:41:55
19	922	325.5094724563825	285.1617596557406	21/02/24 15:41:56
19	922	325.5094724563825	285.1617596557406	21/02/24 15:41:57
19	NULL	322.76889190247095	282.9508947625264	21/02/24 15:41:58
19	NULL	322.7688919024709	282.9508947625264	21/02/24 15:41:59
19	NULL	326.2665356724085	280.50725420525265	21/02/24 15:42:00
19	955	328.92321811554416	278.4499778858854	21/02/24 15:42:01
19	955	328.92321811554416	278.4499778858854	21/02/24 15:42:02
19	955	328.92321811554416	278.4499778858854	21/02/24 15:42:03
19	955	332.13398995625107	274.9863189954403	21/02/24 15:42:04
19	955	332.13398995625107	274.9863189954403	21/02/24 15:42:05
19	909	333.4071053969908	273.0002052198683	21/02/24 15:42:06
19	NULL	337.73701806888556	270.34580290420837	21/02/24 15:42:07
19	895	344.21493558062156	279.99700365155473	21/02/24 15:42:08
19	904	347.25758750563756	270.59329170523137	21/02/24 15:42:09
19	954	351.0914713947271	276.75392450645927	21/02/24 15:42:10
19	909	344.1372733286521	271.97307611325795	21/02/24 15:42:11
19	904	345.5840669454654	272.03626967984314	21/02/24 15:42:12
19	904	347.25758750563756	270.59329170523137	21/02/24 15:42:13
19	940	347.9711572177418	278.13370891448585	21/02/24 15:42:14
19	904	345.58406694546534	272.03626967984314	21/02/24 15:42:15
19	904	345.58406694546534	272.03626967984314	21/02/24 15:42:16
19	909	344.1372733286521	271.97307611325795	21/02/24 15:42:17
19	954	349.64467777791396	276.690730939874	21/02/24 15:42:18
19	904	345.58406694546534	272.03626967984314	21/02/24 15:42:19
