floorId	partitionId	location_x	location_y	timeStamp
19	929	307.27788028221806	287.641854059611	21/02/21 12:27:50
19	929	307.27788028221806	287.641854059611	21/02/21 12:27:51
19	929	307.27788028221806	287.641854059611	21/02/21 12:27:51
19	929	307.2084001824421	287.40175255386373	21/02/21 12:27:51
19	929	307.1337353906597	287.1437343732469	21/02/21 12:27:51
19	929	307.06757583120935	286.9151076168832	21/02/21 12:27:51
19	929	307.0240796644487	286.7647984612091	21/02/21 12:27:51
19	929	306.8938900780599	286.314903947163	21/02/21 12:27:51
19	929	306.8297761042723	286.09334609541145	21/02/21 12:27:51
19	929	306.7494394898375	285.81572786868713	21/02/21 12:27:51
19	929	306.7494394898375	285.81572786868713	21/02/21 12:27:51
19	929	306.70414142869106	285.6591919292776	21/02/21 12:27:52
19	929	306.5899577731421	285.26460890885227	21/02/21 12:27:52
19	929	306.5411241879239	285.0958553034352	21/02/21 12:27:52
19	929	306.5411241879239	285.0958553034352	21/02/21 12:27:52
19	929	306.431479466235	284.71695741958564	21/02/21 12:27:52
19	929	306.431479466235	284.71695741958564	21/02/21 12:27:52
19	929	306.34938781012505	284.43327431744785	21/02/21 12:27:52
19	929	306.20417444640754	283.9314623252999	21/02/21 12:27:52
19	929	306.14742626903563	283.7353583634556	21/02/21 12:27:52
19	929	306.0993956634608	283.5693796046792	21/02/21 12:27:52
19	929	306.0993956634608	283.5693796046792	21/02/21 12:27:53
19	929	306.0216989331536	283.30088399228714	21/02/21 12:27:53
19	911	305.9857998094673	282.9844818786334	21/02/21 12:27:53
19	911	306.1704631723479	282.97572268276787	21/02/21 12:27:53
19	911	306.1704631723479	282.97572268276787	21/02/21 12:27:53
19	911	306.7019039977681	282.95051468152616	21/02/21 12:27:53
19	911	306.87792312584713	282.9421655103919	21/02/21 12:27:53
19	911	307.10215116532953	282.93152963067143	21/02/21 12:27:53
19	911	307.10215116532953	282.93152963067143	21/02/21 12:27:53
19	911	307.29162453431263	282.92254228026076	21/02/21 12:27:54
19	911	307.54811169458975	282.9103762434313	21/02/21 12:27:54
19	911	307.9850670689743	282.88965000055873	21/02/21 12:27:54
19	911	307.9850670689743	282.88965000055873	21/02/21 12:27:54
19	911	308.39222304549526	282.87033724197715	21/02/21 12:27:54
19	911	308.39222304549526	282.87033724197715	21/02/21 12:27:54
19	911	308.64176356367676	282.8585007074256	21/02/21 12:27:54
19	911	308.85719871913534	282.84828190336214	21/02/21 12:27:54
19	911	309.0237740530735	282.8403806827108	21/02/21 12:27:54
19	911	309.40154748081875	282.8224616358853	21/02/21 12:27:54
19	911	309.5578696425648	282.8150467572028	21/02/21 12:27:55
19	911	309.5578696425648	282.8150467572028	21/02/21 12:27:55
19	911	309.82617146883075	282.80232031157396	21/02/21 12:27:55
19	911	309.82617146883075	282.80232031157396	21/02/21 12:27:55
19	911	310.10170129878014	282.7892510177537	21/02/21 12:27:55
19	911	310.32404000641145	282.77870475531023	21/02/21 12:27:55
19	911	310.5269661959641	282.7690792929943	21/02/21 12:27:55
19	911	311.0752177933217	282.7430739010751	21/02/21 12:27:55
19	911	311.0752177933217	282.7430739010751	21/02/21 12:27:55
19	911	311.53613015873873	282.7212112986479	21/02/21 12:27:55
19	911	311.79258479534195	282.7090468045242	21/02/21 12:27:56
19	911	312.06437193159024	282.6961550390814	21/02/21 12:27:56
19	911	312.06437193159024	282.6961550390814	21/02/21 12:27:56
19	911	312.45885615415506	282.67744334382473	21/02/21 12:27:56
19	911	312.6203038038935	282.66978534624457	21/02/21 12:27:56
19	911	312.909142226425	282.65608478173095	21/02/21 12:27:56
19	911	312.909142226425	282.65608478173095	21/02/21 12:27:56
19	911	313.348514682382	282.6352438886615	21/02/21 12:27:56
19	911	313.5204034542002	282.6270906340258	21/02/21 12:27:56
19	911	313.67745427157786	282.61964119278963	21/02/21 12:27:57
19	911	313.67745427157786	282.61964119278963	21/02/21 12:27:57
19	911	314.1829747743749	282.5956626784327	21/02/21 12:27:57
19	911	314.1829747743749	282.5956626784327	21/02/21 12:27:57
19	911	314.5707797225999	282.5772678033143	21/02/21 12:27:57
19	911	314.5707797225999	282.5772678033143	21/02/21 12:27:57
19	911	315.0576938724332	282.55417184999925	21/02/21 12:27:57
19	911	315.0576938724332	282.55417184999925	21/02/21 12:27:57
19	911	315.3541521827199	282.5401098489328	21/02/21 12:27:57
19	911	315.578692786517	282.52945914325005	21/02/21 12:27:57
19	911	315.8706076176783	282.5156126544701	21/02/21 12:27:58
19	911	316.31733962292316	282.4944226735649	21/02/21 12:27:58
19	911	316.31733962292316	282.4944226735649	21/02/21 12:27:58
19	911	316.5392508916187	282.48389668596803	21/02/21 12:27:58
19	911	316.79591513096335	282.47172224969097	21/02/21 12:27:58
19	911	317.0571733311346	282.4593299066129	21/02/21 12:27:58
19	911	317.45573428562363	282.4404248384377	21/02/21 12:27:58
19	911	317.6783433230987	282.429865753353	21/02/21 12:27:58
19	911	317.9340551173379	282.41773649470673	21/02/21 12:27:58
19	911	318.14461427654425	282.4077489753201	21/02/21 12:27:58
19	911	318.14461427654425	282.4077489753201	21/02/21 12:27:59
19	911	318.42295463373927	282.3945463688695	21/02/21 12:27:59
19	911	318.58871372262826	282.38668386542855	21/02/21 12:27:59
19	911	318.80443206047227	282.3764516290851	21/02/21 12:27:59
19	911	319.0474680273485	282.36492362697885	21/02/21 12:27:59
19	911	319.33525464146237	282.3512729532276	21/02/21 12:27:59
19	911	319.6176727627456	282.33787692489955	21/02/21 12:27:59
19	911	319.88869690690785	282.3250213507024	21/02/21 12:27:59
19	911	320.16090764291255	282.312109492518	21/02/21 12:27:59
19	911	320.316784083203	282.30471575588274	21/02/21 12:28:00
19	911	320.316784083203	282.30471575588274	21/02/21 12:28:00
19	911	320.5642291372732	282.2929786161451	21/02/21 12:28:00
19	911	320.72679784539724	282.2852674430469	21/02/21 12:28:00
19	911	320.89469733590937	282.27730341325685	21/02/21 12:28:00
19	911	321.1643319846949	282.26451374743465	21/02/21 12:28:00
19	911	321.45417725606546	282.25076542474073	21/02/21 12:28:00
19	911	321.6565847035092	282.24116456808383	21/02/21 12:28:00
19	911	322.1108925769622	282.2196152386188	21/02/21 12:28:00
19	911	322.276305013376	282.2117691780547	21/02/21 12:28:00
19	911	322.4948152168599	282.20140451426283	21/02/21 12:28:01
19	911	322.73733968647804	282.1899007741683	21/02/21 12:28:01
19	911	322.9358559772234	282.1804844879813	21/02/21 12:28:01
19	911	323.17698617293814	282.16904688292306	21/02/21 12:28:01
19	911	323.4357577045994	282.1567724907811	21/02/21 12:28:01
19	911	323.62843194069063	282.1476333126256	21/02/21 12:28:01
19	911	323.7891317733681	282.14001078648926	21/02/21 12:28:01
19	911	324.06893546842343	282.1267387690698	21/02/21 12:28:01
19	911	324.2633872527354	282.1175152759057	21/02/21 12:28:01
19	911	324.5462601991286	282.10409767371397	21/02/21 12:28:01
19	911	324.82797693962095	282.0907349142035	21/02/21 12:28:02
19	911	324.82797693962095	282.0907349142035	21/02/21 12:28:02
19	911	325.31000630748434	282.06787066230106	21/02/21 12:28:02
19	911	325.4783870577837	282.0598838047628	21/02/21 12:28:02
19	911	325.74067082715214	282.04744281553565	21/02/21 12:28:02
19	911	325.74067082715214	282.04744281553565	21/02/21 12:28:02
19	911	325.9722620423383	282.0364576759665	21/02/21 12:28:02
19	911	326.1845241860152	282.0263893783773	21/02/21 12:28:02
19	911	326.43933692850834	282.0143027647377	21/02/21 12:28:02
19	911	326.59063599025916	282.0071261483506	21/02/21 12:28:02
19	911	326.59063599025916	282.0071261483506	21/02/21 12:28:03
19	911	326.80540202296123	281.99693908299906	21/02/21 12:28:03
19	911	327.30178572624163	281.97339395735173	21/02/21 12:28:03
19	911	327.30178572624163	281.97339395735173	21/02/21 12:28:03
19	911	327.51814886246154	281.96313113608244	21/02/21 12:28:03
19	911	327.67013307956876	281.955922020504	21/02/21 12:28:03
19	911	327.858606810644	281.94698208623527	21/02/21 12:28:03
19	911	328.0293100465856	281.9388850654989	21/02/21 12:28:03
19	911	328.1811818057048	281.93168128417585	21/02/21 12:28:03
19	911	328.47186129932993	281.9178933915531	21/02/21 12:28:04
19	911	328.47186129932993	281.9178933915531	21/02/21 12:28:04
19	911	328.6639604959658	281.9087814894265	21/02/21 12:28:04
19	911	328.8530242526443	281.89981356828616	21/02/21 12:28:04
19	911	329.04254499352754	281.8908239708691	21/02/21 12:28:04
19	911	329.24386513630395	281.8812746886794	21/02/21 12:28:04
19	911	329.50846183648434	281.8687239894714	21/02/21 12:28:04
19	911	329.70590932255783	281.8593584002354	21/02/21 12:28:04
19	911	329.87035636112694	281.8515581316934	21/02/21 12:28:04
19	911	330.0424237080495	281.84339640664825	21/02/21 12:28:04
19	964	330.3283872939715	281.82571258712346	21/02/21 12:28:05
19	964	330.51000796254476	281.8127230949224	21/02/21 12:28:05
19	964	330.876846172939	281.78648686250233	21/02/21 12:28:05
19	964	331.1519674956587	281.7668102127912	21/02/21 12:28:05
19	964	331.302888287633	281.75601637271933	21/02/21 12:28:05
19	964	331.47237072647107	281.7438950055049	21/02/21 12:28:05
19	964	331.47237072647107	281.7438950055049	21/02/21 12:28:05
19	964	331.71018896676776	281.7268862685485	21/02/21 12:28:05
19	964	332.2715453400443	281.6867381164138	21/02/21 12:28:05
19	964	332.5288211463049	281.66833777626965	21/02/21 12:28:05
19	964	332.7158393733225	281.65496225122405	21/02/21 12:28:06
19	964	333.00082347463274	281.6345802165664	21/02/21 12:28:06
19	964	333.1843268929546	281.6214560702901	21/02/21 12:28:06
19	964	333.3747357013187	281.6078380512029	21/02/21 12:28:06
19	964	333.6714995977146	281.5866135267692	21/02/21 12:28:06
19	964	333.87893302342735	281.57177790873794	21/02/21 12:28:06
19	964	333.87893302342735	281.57177790873794	21/02/21 12:28:06
19	964	334.07345552310426	281.5578656788561	21/02/21 12:28:06
19	964	334.550793416453	281.5237265200718	21/02/21 12:28:06
19	964	334.84734475552483	281.5025171977169	21/02/21 12:28:07
19	964	335.1174272519956	281.48320092435927	21/02/21 12:28:07
19	964	335.3024330807743	281.4699693258361	21/02/21 12:28:07
19	964	335.54201304545273	281.45283459052666	21/02/21 12:28:07
19	964	335.7915128781023	281.4349903872439	21/02/21 12:28:07
19	964	336.0461246334447	281.4167805797572	21/02/21 12:28:07
19	964	336.26842138131434	281.40088193839955	21/02/21 12:28:07
19	964	336.4309359527629	281.38925891236966	21/02/21 12:28:07
19	964	336.68595615914955	281.3710198925048	21/02/21 12:28:07
19	964	336.84120967236106	281.3599161766398	21/02/21 12:28:07
19	964	337.0588122435371	281.3443532623337	21/02/21 12:28:08
19	964	337.2258920754792	281.33240372932613	21/02/21 12:28:08
19	964	337.4516417499165	281.3162581350029	21/02/21 12:28:08
19	964	337.67070506303054	281.30059074857826	21/02/21 12:28:08
19	964	337.67070506303054	281.30059074857826	21/02/21 12:28:08
19	964	337.96582597179327	281.2794837304571	21/02/21 12:28:08
19	964	338.23053576438065	281.26055171234833	21/02/21 12:28:08
19	964	338.5028424787158	281.24107636314966	21/02/21 12:28:08
19	964	338.76255919631063	281.22250144926903	21/02/21 12:28:08
19	964	338.9239254701403	281.21096054937095	21/02/21 12:28:08
19	964	339.115378154852	281.1972678723509	21/02/21 12:28:09
19	964	339.329809691603	281.1819317501123	21/02/21 12:28:09
19	964	339.50033068631575	281.16973610548473	21/02/21 12:28:09
19	964	339.77863695086506	281.1498316690499	21/02/21 12:28:09
19	964	340.0608873566735	281.1296451480234	21/02/21 12:28:09
19	964	340.3227390109726	281.1109175436815	21/02/21 12:28:09
19	964	340.48464399380777	281.0993381153688	21/02/21 12:28:09
19	964	340.6433207338343	281.08798957066153	21/02/21 12:28:09
19	964	340.83442522082413	281.07432179670803	21/02/21 12:28:09
19	964	341.1244359333051	281.0535802593181	21/02/21 12:28:09
19	964	341.4211779052665	281.0323573029178	21/02/21 12:28:10
19	964	341.64713368459263	281.0161969679933	21/02/21 12:28:10
19	964	341.80789344118017	281.0046994461482	21/02/21 12:28:10
19	964	342.00751468501335	280.99042255459005	21/02/21 12:28:10
19	964	342.20687839894765	280.9761640815447	21/02/21 12:28:10
19	964	342.4989042603781	280.9552784209018	21/02/21 12:28:10
19	964	342.7030155830818	280.9406803993482	21/02/21 12:28:10
19	964	342.91394537650785	280.9255947214449	21/02/21 12:28:10
19	964	343.3727878356169	280.8927783542828	21/02/21 12:28:10
19	964	343.3727878356169	280.8927783542828	21/02/21 12:28:11
19	964	343.5342128665203	280.88123325208466	21/02/21 12:28:11
19	964	343.8090956333115	280.8615736638699	21/02/21 12:28:11
19	964	343.9596390249968	280.8508068154292	21/02/21 12:28:11
19	964	344.2149384413721	280.8325478264937	21/02/21 12:28:11
19	964	344.37970533342553	280.82076371471754	21/02/21 12:28:11
19	964	344.5390240867289	280.8093692532844	21/02/21 12:28:11
19	964	344.8302641765492	280.7885397909491	21/02/21 12:28:11
19	964	345.0722840510625	280.7712305535303	21/02/21 12:28:11
19	964	345.3350808225878	280.7524353544981	21/02/21 12:28:11
19	964	345.49820597586285	280.7407686597166	21/02/21 12:28:12
19	964	345.71396985223316	280.7253372486806	21/02/21 12:28:12
19	964	345.9686535797184	280.7071222937534	21/02/21 12:28:12
19	964	346.24690761757734	280.68722159256623	21/02/21 12:28:12
19	964	346.4238501580864	280.6745666796203	21/02/21 12:28:12
19	964	346.5885769174082	280.66278543813314	21/02/21 12:28:12
19	964	346.7723703883664	280.64964054732104	21/02/21 12:28:12
19	964	346.9238235247192	280.638808634032	21/02/21 12:28:12
19	964	347.18231950658827	280.6203210270494	21/02/21 12:28:12
19	964	347.45170897047365	280.6010543193135	21/02/21 12:28:12
19	964	347.604904941375	280.5900977586704	21/02/21 12:28:13
19	964	347.604904941375	280.5900977586704	21/02/21 12:28:13
19	964	347.8335375301806	280.5737459785975	21/02/21 12:28:13
19	964	348.08229755099796	280.5559546865836	21/02/21 12:28:13
19	964	348.34133870634486	280.537428088848	21/02/21 12:28:13
19	964	348.5104824849678	280.5253309425786	21/02/21 12:28:13
19	964	348.6799262215681	280.5132123433444	21/02/21 12:28:13
19	964	348.87629152270506	280.4991683164849	21/02/21 12:28:13
19	964	349.0486053653404	280.48684444755173	21/02/21 12:28:13
19	964	349.2133032497372	280.47506527119634	21/02/21 12:28:13
19	964	349.375695396011	280.4634510010028	21/02/21 12:28:14
19	964	349.6126517616211	280.4465039052385	21/02/21 12:28:14
19	964	349.79419944378367	280.43351963301825	21/02/21 12:28:14
19	964	349.9534455253651	280.42213036905946	21/02/21 12:28:14
19	964	350.20326996635424	280.40426294982046	21/02/21 12:28:14
19	964	350.4129482051342	280.3892667829813	21/02/21 12:28:14
19	954	350.3528603615038	280.20087528453723	21/02/21 12:28:14
19	954	350.2475554687065	279.97706006649605	21/02/21 12:28:14
19	954	350.17982436104654	279.8331042423516	21/02/21 12:28:14
19	954	350.10706849346843	279.67846878398683	21/02/21 12:28:14
19	954	350.0386120470081	279.5329713233861	21/02/21 12:28:15
19	954	349.94475532400025	279.3334880670377	21/02/21 12:28:15
19	954	349.8500181108336	279.1321334152427	21/02/21 12:28:15
19	954	349.727314636002	278.87133921808504	21/02/21 12:28:15
19	954	349.63845666525947	278.6824803192425	21/02/21 12:28:15
19	954	349.56348543107987	278.5231363165187	21/02/21 12:28:15
19	954	349.44177585386456	278.264454551232	21/02/21 12:28:15
19	954	349.3246221036187	278.0154557491908	21/02/21 12:28:15
19	954	349.2391530910682	277.8337997484903	21/02/21 12:28:15
19	954	349.1657162932903	277.6777170397928	21/02/21 12:28:15
19	954	349.064188109371	277.46192884593415	21/02/21 12:28:16
