floorId	partitionId	location_x	location_y	timeStamp
1	56	310.54516511258606	264.60686664592737	20/04/28 05:13:59
1	56	310.54516511258606	264.60686664592737	20/04/28 05:14:00
1	56	310.54516511258606	264.60686664592737	20/04/28 05:14:01
1	56	309.29436722642214	263.9851754886793	20/04/28 05:14:02
1	56	310.54516511258606	264.60686664592737	20/04/28 05:14:03
1	56	307.159840217744	263.3357311024059	20/04/28 05:14:04
1	56	310.54516511258606	264.60686664592737	20/04/28 05:14:05
1	56	307.159840217744	263.3357311024059	20/04/28 05:14:06
1	56	309.9813570346916	265.0278402586721	20/04/28 05:14:07
1	56	307.159840217744	263.3357311024059	20/04/28 05:14:08
1	56	308.4512500184315	264.78737494292824	20/04/28 05:14:09
1	56	308.4512500184315	264.78737494292824	20/04/28 05:14:10
1	56	307.159840217744	263.3357311024059	20/04/28 05:14:11
1	56	308.4512500184315	264.78737494292824	20/04/28 05:14:12
1	56	309.29436722642214	263.9851754886793	20/04/28 05:14:13
1	56	307.159840217744	263.3357311024059	20/04/28 05:14:14
1	56	307.159840217744	263.3357311024059	20/04/28 05:14:16
1	56	307.159840217744	263.3357311024059	20/04/28 05:14:17
1	56	307.159840217744	263.3357311024059	20/04/28 05:14:18
1	56	307.159840217744	263.3357311024059	20/04/28 05:14:19
1	81	311.65911721261057	263.4112042347413	20/04/28 05:14:20
1	56	309.29436722642214	263.9851754886793	20/04/28 05:14:21
1	56	309.29436722642214	263.9851754886793	20/04/28 05:14:22
1	56	310.54516511258606	264.60686664592737	20/04/28 05:14:23
1	56	307.159840217744	263.3357311024059	20/04/28 05:14:24
1	56	307.159840217744	263.3357311024059	20/04/28 05:14:25
1	98	303.28594423312194	264.61216223098285	20/04/28 05:14:26
1	98	303.28594423312194	264.61216223098285	20/04/28 05:14:27
1	98	303.28594423312194	264.61216223098285	20/04/28 05:14:28
3	47	302.3157990937455	265.96754816044853	20/04/28 05:14:29
3	47	303.2859442331219	264.61216223098285	20/04/28 05:14:30
3	47	303.28594423312194	264.61216223098285	20/04/28 05:14:31
1	98	305.42047124180004	265.2616066172563	20/04/28 05:14:32
1	56	309.29436722642214	263.9851754886794	20/04/28 05:14:33
1	81	313.37765885306834	261.0920988121665	20/04/28 05:14:34
3	54	313.37765885306834	261.0920988121665	20/04/28 05:14:35
3	NULL	315.74240883925677	260.5181275582284	20/04/28 05:14:36
3	54	321.27015631552865	262.1152944981856	20/04/28 05:14:37
3	18	323.5974156050991	264.28862562276623	20/04/28 05:14:38
3	54	324.0151806674323	262.76750572012435	20/04/28 05:14:39
3	54	324.6837666112415	261.38954335341236	20/04/28 05:14:40
3	54	327.3540763805351	261.1072377077433	20/04/28 05:14:41
3	54	334.4407240787428	261.4032786809491	20/04/28 05:14:42
3	54	334.4407240787428	261.4032786809491	20/04/28 05:14:43
3	54	334.4407240787428	261.4032786809491	20/04/28 05:14:44
3	54	334.4407240787428	261.4032786809491	20/04/28 05:14:45
3	NULL	337.70753542622793	260.4595329480968	20/04/28 05:14:46
3	99	338.72849302958224	257.33962041953436	20/04/28 05:14:47
3	54	344.0544452814365	260.94893597900256	20/04/28 05:14:48
3	42	346.32423194001075	259.3686329834299	20/04/28 05:14:49
1	41	349.17477120857285	262.4807721885283	20/04/28 05:14:50
3	54	350.37914153837863	260.97432627346046	20/04/28 05:14:51
3	54	350.37914153837863	260.97432627346046	20/04/28 05:14:52
3	54	354.93110780732565	263.85962413987545	20/04/28 05:14:53
3	54	356.0030407869288	263.6276478520211	20/04/28 05:14:54
3	54	359.56855835216805	263.2279362811352	20/04/28 05:14:55
3	54	359.5685583521681	263.2279362811352	20/04/28 05:14:56
3	54	359.5685583521681	263.2279362811352	20/04/28 05:14:57
3	34	362.2167196060361	259.70189758364177	20/04/28 05:14:58
3	54	364.361304384953	262.8898007870198	20/04/28 05:14:59
3	54	372.48785670166836	262.3595943162643	20/04/28 05:15:00
3	54	372.48785670166836	262.3595943162643	20/04/28 05:15:01
3	54	372.48785670166836	262.3595943162643	20/04/28 05:15:02
3	54	372.48785670166836	262.3595943162643	20/04/28 05:15:03
3	15	379.8755906118027	262.6421307240284	20/04/28 05:15:04
3	15	380.97239583354167	266.94453563659977	20/04/28 05:15:05
3	15	380.97239583354167	266.94453563659977	20/04/28 05:15:06
1	33	381.6109766893215	266.73786054806715	20/04/28 05:15:07
1	33	379.51825801393375	263.17204603967434	20/04/28 05:15:08
1	69	376.3565651967492	261.56244682705545	20/04/28 05:15:09
3	54	372.48785670166836	262.35959431626424	20/04/28 05:15:10
1	69	372.48785670166836	262.3595943162643	20/04/28 05:15:11
1	69	372.48785670166836	262.3595943162643	20/04/28 05:15:12
1	13	368.31727752533806	266.1301521552222	20/04/28 05:15:13
1	69	367.80245440868674	262.5455232582413	20/04/28 05:15:14
3	57	365.6578696297699	259.3576200548633	20/04/28 05:15:15
1	64	358.87237025214637	261.21107622709695	20/04/28 05:15:16
3	54	358.87237025214637	261.21107622709695	20/04/28 05:15:17
1	64	356.02694011127693	259.70882448523747	20/04/28 05:15:18
1	41	352.7251685521831	260.56227788261185	20/04/28 05:15:19
1	41	352.7251685521831	260.56227788261185	20/04/28 05:15:20
1	41	351.1038521390131	261.25919659269	20/04/28 05:15:21
1	41	349.6149730760457	260.6816456755546	20/04/28 05:15:22
1	22	346.48253983850464	261.2777688197779	20/04/28 05:15:23
1	22	343.1917987024697	259.9647561276533	20/04/28 05:15:24
1	NULL	341.7564158159603	259.49985762417106	20/04/28 05:15:25
1	69	340.1854692097293	258.18142547541174	20/04/28 05:15:26
1	69	340.1854692097293	258.18142547541174	20/04/28 05:15:27
1	69	338.1583683683643	258.3517387010974	20/04/28 05:15:28
1	5	333.7145018941879	260.98944075495035	20/04/28 05:15:29
1	5	333.7145018941879	260.9894407549504	20/04/28 05:15:30
3	54	333.1227839393323	261.62465248411826	20/04/28 05:15:31
1	37	326.9602189569582	261.441576379981	20/04/28 05:15:32
1	37	326.9602189569582	261.44157637998103	20/04/28 05:15:33
1	37	323.9780902572864	261.641853061257	20/04/28 05:15:34
1	37	323.9780902572864	261.641853061257	20/04/28 05:15:35
1	69	322.25711082016966	258.22191770932045	20/04/28 05:15:36
1	72	321.10779110724695	264.3050039939337	20/04/28 05:15:37
1	72	322.34915620924	265.0152899264337	20/04/28 05:15:38
1	72	322.34915620924	265.0152899264337	20/04/28 05:15:39
1	72	322.34915620924	265.0152899264337	20/04/28 05:15:40
1	72	322.34915620924	265.0152899264337	20/04/28 05:15:41
1	72	322.34915620924	265.0152899264337	20/04/28 05:15:42
1	72	322.34915620924	265.0152899264337	20/04/28 05:15:43
1	72	322.34915620924	265.0152899264337	20/04/28 05:15:44
1	72	322.34915620924	265.0152899264337	20/04/28 05:15:45
1	72	322.34915620924	265.0152899264337	20/04/28 05:15:46
1	72	322.34915620924	265.0152899264337	20/04/28 05:15:47
1	72	322.34915620924	265.0152899264337	20/04/28 05:15:48
1	72	322.34915620924	265.0152899264337	20/04/28 05:15:49
1	72	322.34915620924	265.0152899264337	20/04/28 05:15:50
1	72	322.34915620924	265.0152899264337	20/04/28 05:15:51
1	72	322.34915620924	265.0152899264337	20/04/28 05:15:52
1	72	322.34915620924	265.0152899264337	20/04/28 05:15:53
1	72	322.34915620924	265.0152899264337	20/04/28 05:15:54
1	72	322.34915620924	265.0152899264337	20/04/28 05:15:55
1	72	322.34915620924	265.0152899264337	20/04/28 05:15:56
1	72	322.34915620924	265.0152899264337	20/04/28 05:15:57
1	72	322.34915620924	265.0152899264337	20/04/28 05:15:58
1	72	322.34915620924	265.0152899264337	20/04/28 05:15:59
1	72	322.34915620924	265.0152899264337	20/04/28 05:16:00
1	56	319.89662212153377	266.1573209564685	20/04/28 05:16:01
1	56	319.89662212153377	266.1573209564685	20/04/28 05:16:02
1	72	322.34915620924	265.0152899264337	20/04/28 05:16:03
1	72	322.34915620924	265.0152899264337	20/04/28 05:16:04
1	72	322.34915620924	265.0152899264337	20/04/28 05:16:05
1	72	321.1077911072469	264.3050039939337	20/04/28 05:16:06
1	81	315.74240883925677	260.5181275582284	20/04/28 05:16:07
1	81	315.74240883925677	260.5181275582284	20/04/28 05:16:08
1	81	316.8584991431141	264.5437756453438	20/04/28 05:16:09
1	81	314.50318194109644	265.02915212402996	20/04/28 05:16:10
1	81	314.50318194109644	265.02915212402996	20/04/28 05:16:11
1	81	314.50318194109644	265.02915212402996	20/04/28 05:16:12
1	81	314.50318194109644	265.02915212402996	20/04/28 05:16:13
1	81	314.50318194109644	265.02915212402996	20/04/28 05:16:14
1	81	316.8584991431141	264.5437756453438	20/04/28 05:16:15
1	81	314.50318194109644	265.02915212402996	20/04/28 05:16:16
1	81	314.50318194109644	265.02915212402996	20/04/28 05:16:17
1	81	314.50318194109644	265.02915212402996	20/04/28 05:16:18
1	81	314.50318194109644	265.02915212402996	20/04/28 05:16:19
1	81	317.4633882763735	263.93806291016494	20/04/28 05:16:20
1	81	314.50318194109644	265.02915212402996	20/04/28 05:16:21
1	81	314.50318194109644	265.02915212402996	20/04/28 05:16:22
1	81	316.8584991431141	264.5437756453438	20/04/28 05:16:23
1	81	316.8584991431141	264.5437756453438	20/04/28 05:16:24
1	81	316.8584991431141	264.5437756453438	20/04/28 05:16:25
1	81	316.8584991431141	264.5437756453438	20/04/28 05:16:26
1	81	316.8584991431141	264.5437756453438	20/04/28 05:16:27
1	81	317.4633882763735	263.93806291016494	20/04/28 05:16:28
1	81	317.4633882763735	263.93806291016494	20/04/28 05:16:29
1	81	316.8584991431141	264.5437756453438	20/04/28 05:16:30
1	81	314.50318194109644	265.02915212402996	20/04/28 05:16:31
1	81	317.4633882763735	263.93806291016494	20/04/28 05:16:32
1	81	317.4633882763735	263.93806291016494	20/04/28 05:16:33
1	81	317.4633882763735	263.93806291016494	20/04/28 05:16:34
