floorId	partitionId	location_x	location_y	timeStamp
20	956	304.85689251195214	277.2778093167679	21/02/21 12:24:02
20	956	304.85689251195214	277.2778093167679	21/02/21 12:24:03
20	956	305.5027812908901	277.0365374597797	21/02/21 12:24:04
20	956	305.5027812908901	277.0365374597797	21/02/21 12:24:05
20	985	307.1478962332861	273.8212740309473	21/02/21 12:24:06
20	985	307.1478962332861	273.82127403094734	21/02/21 12:24:07
20	924	311.2741681782698	277.2327960641155	21/02/21 12:24:08
20	924	315.8017842956933	280.62370691481505	21/02/21 12:24:09
20	924	321.5875363529806	280.30847361537	21/02/21 12:24:10
20	924	321.5875363529806	280.30847361537	21/02/21 12:24:11
20	924	321.5875363529806	280.3084736153701	21/02/21 12:24:12
20	924	321.5875363529806	280.3084736153701	21/02/21 12:24:13
20	924	323.8139240931293	282.6089034188648	21/02/21 12:24:14
20	924	328.2209179123986	281.47797381601544	21/02/21 12:24:15
20	926	331.5505271454734	285.23428670745807	21/02/21 12:24:16
20	926	331.5505271454734	285.23428670745807	21/02/21 12:24:17
20	926	331.5505271454734	285.23428670745807	21/02/21 12:24:18
20	972	336.9215495784713	288.974458993959	21/02/21 12:24:19
20	972	336.9215495784713	288.974458993959	21/02/21 12:24:20
20	972	343.21902974784024	287.75047845872444	21/02/21 12:24:21
20	972	344.90409216822	281.5880632890479	21/02/21 12:24:22
20	932	352.2535313953617	283.8971284271518	21/02/21 12:24:23
20	932	352.2535313953617	283.8971284271518	21/02/21 12:24:24
20	932	352.2535313953617	283.89712842715187	21/02/21 12:24:25
20	932	352.2535313953617	283.89712842715187	21/02/21 12:24:26
20	963	353.15270471892836	280.8836178162515	21/02/21 12:24:27
20	963	354.53525774505084	282.7602882881901	21/02/21 12:24:28
20	963	356.94657623309735	281.5459279324403	21/02/21 12:24:29
20	963	357.249404999608	280.6834609675453	21/02/21 12:24:30
20	906	361.64860880101315	283.2360385081654	21/02/21 12:24:31
20	906	361.64860880101315	283.2360385081654	21/02/21 12:24:32
20	906	365.11134424431094	285.10891235863346	21/02/21 12:24:33
20	906	370.9074686093318	283.5533076889329	21/02/21 12:24:34
20	906	370.9074686093318	283.5533076889329	21/02/21 12:24:35
20	906	370.9074686093318	283.5533076889329	21/02/21 12:24:36
