deviceId	device_location_x	device_location_y	rssi_measurement	timeStamp
111	349.3574161788773	282.0413831973989	-66	21/02/24 15:47:21
102	348.60037065169166	290.2443240990335	-68	21/02/24 15:47:21
107	352.24436078636603	271.4962331820773	-71	21/02/24 15:47:21
106	352.82196230706245	270.7390515122939	-71	21/02/24 15:47:21
113	350.4034533178371	267.72630832367133	-69	21/02/24 15:47:21
95	348.2574783689184	265.4034322422755	-70	21/02/24 15:47:21
100	345.6304273143794	285.66832195343085	-66	21/02/24 15:47:21
101	344.8940587728134	285.507681768186	-64	21/02/24 15:47:21
104	344.29972171429097	278.87653419291075	-63	21/02/24 15:47:21
103	341.9121052518552	264.28883990856684	-66	21/02/24 15:47:21
123	336.827695172566	287.724880300128	-61	21/02/24 15:47:21
98	334.9124542906195	280.9377639416658	-45	21/02/24 15:47:21
121	334.15326338445544	296.57189544390747	-68	21/02/24 15:47:21
122	333.2695643238166	291.5458822091632	-65	21/02/24 15:47:21
120	332.7261018357164	292.45522740937736	-66	21/02/24 15:47:21
105	330.89379071296145	276.9107744382362	-48	21/02/24 15:47:21

111	349.3574161788773	282.0413831973989	-66	21/02/24 15:47:22
102	348.60037065169166	290.2443240990335	-69	21/02/24 15:47:22
107	352.24436078636603	271.4962331820773	-68	21/02/24 15:47:22
106	352.82196230706245	270.7390515122939	-71	21/02/24 15:47:22
113	350.4034533178371	267.72630832367133	-70	21/02/24 15:47:22
95	348.2574783689184	265.4034322422755	-71	21/02/24 15:47:22
100	345.6304273143794	285.66832195343085	-65	21/02/24 15:47:22
101	344.8940587728134	285.507681768186	-63	21/02/24 15:47:22
104	344.29972171429097	278.87653419291075	-62	21/02/24 15:47:22
103	341.9121052518552	264.28883990856684	-68	21/02/24 15:47:22
123	336.827695172566	287.724880300128	-63	21/02/24 15:47:22
98	334.9124542906195	280.9377639416658	-47	21/02/24 15:47:22
121	334.15326338445544	296.57189544390747	-68	21/02/24 15:47:22
122	333.2695643238166	291.5458822091632	-65	21/02/24 15:47:22
120	332.7261018357164	292.45522740937736	-67	21/02/24 15:47:22
105	330.89379071296145	276.9107744382362	-48	21/02/24 15:47:22

111	349.3574161788773	282.0413831973989	-69	21/02/24 15:47:23
102	348.60037065169166	290.2443240990335	-71	21/02/24 15:47:23
107	352.24436078636603	271.4962331820773	-69	21/02/24 15:47:23
106	352.82196230706245	270.7390515122939	-72	21/02/24 15:47:23
113	350.4034533178371	267.72630832367133	-69	21/02/24 15:47:23
95	348.2574783689184	265.4034322422755	-68	21/02/24 15:47:23
100	345.6304273143794	285.66832195343085	-67	21/02/24 15:47:23
101	344.8940587728134	285.507681768186	-66	21/02/24 15:47:23
104	344.29972171429097	278.87653419291075	-61	21/02/24 15:47:23
103	341.9121052518552	264.28883990856684	-65	21/02/24 15:47:23
123	336.827695172566	287.724880300128	-63	21/02/24 15:47:23
98	334.9124542906195	280.9377639416658	-48	21/02/24 15:47:23
121	334.15326338445544	296.57189544390747	-70	21/02/24 15:47:23
122	333.2695643238166	291.5458822091632	-65	21/02/24 15:47:23
120	332.7261018357164	292.45522740937736	-68	21/02/24 15:47:23
105	330.89379071296145	276.9107744382362	-49	21/02/24 15:47:23

111	349.3574161788773	282.0413831973989	-66	21/02/24 15:47:24
102	348.60037065169166	290.2443240990335	-69	21/02/24 15:47:24
107	352.24436078636603	271.4962331820773	-68	21/02/24 15:47:24
106	352.82196230706245	270.7390515122939	-71	21/02/24 15:47:24
113	350.4034533178371	267.72630832367133	-70	21/02/24 15:47:24
95	348.2574783689184	265.4034322422755	-68	21/02/24 15:47:24
100	345.6304273143794	285.66832195343085	-67	21/02/24 15:47:24
101	344.8940587728134	285.507681768186	-66	21/02/24 15:47:24
104	344.29972171429097	278.87653419291075	-60	21/02/24 15:47:24
103	341.9121052518552	264.28883990856684	-65	21/02/24 15:47:24
123	336.827695172566	287.724880300128	-61	21/02/24 15:47:24
98	334.9124542906195	280.9377639416658	-50	21/02/24 15:47:24
121	334.15326338445544	296.57189544390747	-70	21/02/24 15:47:24
122	333.2695643238166	291.5458822091632	-67	21/02/24 15:47:24
120	332.7261018357164	292.45522740937736	-69	21/02/24 15:47:24
105	330.89379071296145	276.9107744382362	-47	21/02/24 15:47:24

111	349.3574161788773	282.0413831973989	-67	21/02/24 15:47:25
102	348.60037065169166	290.2443240990335	-70	21/02/24 15:47:25
107	352.24436078636603	271.4962331820773	-68	21/02/24 15:47:25
106	352.82196230706245	270.7390515122939	-70	21/02/24 15:47:25
113	350.4034533178371	267.72630832367133	-71	21/02/24 15:47:25
95	348.2574783689184	265.4034322422755	-69	21/02/24 15:47:25
100	345.6304273143794	285.66832195343085	-66	21/02/24 15:47:25
101	344.8940587728134	285.507681768186	-65	21/02/24 15:47:25
104	344.29972171429097	278.87653419291075	-61	21/02/24 15:47:25
103	341.9121052518552	264.28883990856684	-68	21/02/24 15:47:25
123	336.827695172566	287.724880300128	-62	21/02/24 15:47:25
98	334.9124542906195	280.9377639416658	-50	21/02/24 15:47:25
121	334.15326338445544	296.57189544390747	-69	21/02/24 15:47:25
122	333.2695643238166	291.5458822091632	-67	21/02/24 15:47:25
120	332.7261018357164	292.45522740937736	-69	21/02/24 15:47:25
105	330.89379071296145	276.9107744382362	-47	21/02/24 15:47:25

111	349.3574161788773	282.0413831973989	-66	21/02/24 15:47:26
102	348.60037065169166	290.2443240990335	-71	21/02/24 15:47:26
107	352.24436078636603	271.4962331820773	-71	21/02/24 15:47:26
106	352.82196230706245	270.7390515122939	-70	21/02/24 15:47:26
113	350.4034533178371	267.72630832367133	-68	21/02/24 15:47:26
95	348.2574783689184	265.4034322422755	-70	21/02/24 15:47:26
100	345.6304273143794	285.66832195343085	-65	21/02/24 15:47:26
101	344.8940587728134	285.507681768186	-66	21/02/24 15:47:26
104	344.29972171429097	278.87653419291075	-61	21/02/24 15:47:26
103	341.9121052518552	264.28883990856684	-65	21/02/24 15:47:26
123	336.827695172566	287.724880300128	-62	21/02/24 15:47:26
98	334.9124542906195	280.9377639416658	-50	21/02/24 15:47:26
122	333.2695643238166	291.5458822091632	-66	21/02/24 15:47:26
120	332.7261018357164	292.45522740937736	-69	21/02/24 15:47:26
105	330.89379071296145	276.9107744382362	-50	21/02/24 15:47:26

111	349.3574161788773	282.0413831973989	-67	21/02/24 15:47:27
107	352.24436078636603	271.4962331820773	-70	21/02/24 15:47:27
106	352.82196230706245	270.7390515122939	-69	21/02/24 15:47:27
113	350.4034533178371	267.72630832367133	-70	21/02/24 15:47:27
95	348.2574783689184	265.4034322422755	-70	21/02/24 15:47:27
100	345.6304273143794	285.66832195343085	-67	21/02/24 15:47:27
101	344.8940587728134	285.507681768186	-66	21/02/24 15:47:27
104	344.29972171429097	278.87653419291075	-60	21/02/24 15:47:27
103	341.9121052518552	264.28883990856684	-65	21/02/24 15:47:27
123	336.827695172566	287.724880300128	-62	21/02/24 15:47:27
98	334.9124542906195	280.9377639416658	-53	21/02/24 15:47:27
122	333.2695643238166	291.5458822091632	-69	21/02/24 15:47:27
120	332.7261018357164	292.45522740937736	-66	21/02/24 15:47:27
105	330.89379071296145	276.9107744382362	-49	21/02/24 15:47:27

111	349.3574161788773	282.0413831973989	-66	21/02/24 15:47:28
102	348.60037065169166	290.2443240990335	-72	21/02/24 15:47:28
107	352.24436078636603	271.4962331820773	-71	21/02/24 15:47:28
106	352.82196230706245	270.7390515122939	-70	21/02/24 15:47:28
113	350.4034533178371	267.72630832367133	-71	21/02/24 15:47:28
95	348.2574783689184	265.4034322422755	-67	21/02/24 15:47:28
100	345.6304273143794	285.66832195343085	-66	21/02/24 15:47:28
101	344.8940587728134	285.507681768186	-66	21/02/24 15:47:28
104	344.29972171429097	278.87653419291075	-61	21/02/24 15:47:28
103	341.9121052518552	264.28883990856684	-64	21/02/24 15:47:28
123	336.827695172566	287.724880300128	-65	21/02/24 15:47:28
98	334.9124542906195	280.9377639416658	-50	21/02/24 15:47:28
122	333.2695643238166	291.5458822091632	-67	21/02/24 15:47:28
120	332.7261018357164	292.45522740937736	-70	21/02/24 15:47:28
105	330.89379071296145	276.9107744382362	-49	21/02/24 15:47:28

111	349.3574161788773	282.0413831973989	-68	21/02/24 15:47:29
107	352.24436078636603	271.4962331820773	-69	21/02/24 15:47:29
106	352.82196230706245	270.7390515122939	-72	21/02/24 15:47:29
113	350.4034533178371	267.72630832367133	-68	21/02/24 15:47:29
95	348.2574783689184	265.4034322422755	-68	21/02/24 15:47:29
100	345.6304273143794	285.66832195343085	-69	21/02/24 15:47:29
101	344.8940587728134	285.507681768186	-68	21/02/24 15:47:29
104	344.29972171429097	278.87653419291075	-61	21/02/24 15:47:29
103	341.9121052518552	264.28883990856684	-66	21/02/24 15:47:29
123	336.827695172566	287.724880300128	-63	21/02/24 15:47:29
98	334.9124542906195	280.9377639416658	-55	21/02/24 15:47:29
122	333.2695643238166	291.5458822091632	-67	21/02/24 15:47:29
120	332.7261018357164	292.45522740937736	-68	21/02/24 15:47:29
105	330.89379071296145	276.9107744382362	-48	21/02/24 15:47:29

111	349.3574161788773	282.0413831973989	-69	21/02/24 15:47:30
107	352.24436078636603	271.4962331820773	-72	21/02/24 15:47:30
113	350.4034533178371	267.72630832367133	-70	21/02/24 15:47:30
95	348.2574783689184	265.4034322422755	-70	21/02/24 15:47:30
100	345.6304273143794	285.66832195343085	-68	21/02/24 15:47:30
101	344.8940587728134	285.507681768186	-66	21/02/24 15:47:30
104	344.29972171429097	278.87653419291075	-63	21/02/24 15:47:30
103	341.9121052518552	264.28883990856684	-65	21/02/24 15:47:30
123	336.827695172566	287.724880300128	-66	21/02/24 15:47:30
98	334.9124542906195	280.9377639416658	-53	21/02/24 15:47:30
122	333.2695643238166	291.5458822091632	-68	21/02/24 15:47:30
120	332.7261018357164	292.45522740937736	-68	21/02/24 15:47:30
105	330.89379071296145	276.9107744382362	-44	21/02/24 15:47:30

111	349.3574161788773	282.0413831973989	-69	21/02/24 15:47:31
107	352.24436078636603	271.4962331820773	-70	21/02/24 15:47:31
106	352.82196230706245	270.7390515122939	-69	21/02/24 15:47:31
113	350.4034533178371	267.72630832367133	-70	21/02/24 15:47:31
95	348.2574783689184	265.4034322422755	-68	21/02/24 15:47:31
100	345.6304273143794	285.66832195343085	-66	21/02/24 15:47:31
101	344.8940587728134	285.507681768186	-68	21/02/24 15:47:31
104	344.29972171429097	278.87653419291075	-63	21/02/24 15:47:31
103	341.9121052518552	264.28883990856684	-64	21/02/24 15:47:31
123	336.827695172566	287.724880300128	-66	21/02/24 15:47:31
98	334.9124542906195	280.9377639416658	-55	21/02/24 15:47:31
122	333.2695643238166	291.5458822091632	-66	21/02/24 15:47:31
120	332.7261018357164	292.45522740937736	-68	21/02/24 15:47:31
105	330.89379071296145	276.9107744382362	-45	21/02/24 15:47:31

111	349.3574161788773	282.0413831973989	-68	21/02/24 15:47:32
107	352.24436078636603	271.4962331820773	-70	21/02/24 15:47:32
106	352.82196230706245	270.7390515122939	-71	21/02/24 15:47:32
113	350.4034533178371	267.72630832367133	-68	21/02/24 15:47:32
95	348.2574783689184	265.4034322422755	-71	21/02/24 15:47:32
100	345.6304273143794	285.66832195343085	-66	21/02/24 15:47:32
101	344.8940587728134	285.507681768186	-67	21/02/24 15:47:32
104	344.29972171429097	278.87653419291075	-63	21/02/24 15:47:32
103	341.9121052518552	264.28883990856684	-67	21/02/24 15:47:32
123	336.827695172566	287.724880300128	-62	21/02/24 15:47:32
98	334.9124542906195	280.9377639416658	-52	21/02/24 15:47:32
122	333.2695643238166	291.5458822091632	-67	21/02/24 15:47:32
120	332.7261018357164	292.45522740937736	-69	21/02/24 15:47:32
105	330.89379071296145	276.9107744382362	-48	21/02/24 15:47:32

111	349.3574161788773	282.0413831973989	-69	21/02/24 15:47:33
107	352.24436078636603	271.4962331820773	-68	21/02/24 15:47:33
106	352.82196230706245	270.7390515122939	-69	21/02/24 15:47:33
113	350.4034533178371	267.72630832367133	-68	21/02/24 15:47:33
95	348.2574783689184	265.4034322422755	-67	21/02/24 15:47:33
100	345.6304273143794	285.66832195343085	-68	21/02/24 15:47:33
101	344.8940587728134	285.507681768186	-67	21/02/24 15:47:33
104	344.29972171429097	278.87653419291075	-60	21/02/24 15:47:33
103	341.9121052518552	264.28883990856684	-64	21/02/24 15:47:33
123	336.827695172566	287.724880300128	-63	21/02/24 15:47:33
98	334.9124542906195	280.9377639416658	-52	21/02/24 15:47:33
122	333.2695643238166	291.5458822091632	-70	21/02/24 15:47:33
120	332.7261018357164	292.45522740937736	-68	21/02/24 15:47:33
105	330.89379071296145	276.9107744382362	-49	21/02/24 15:47:33

111	349.3574161788773	282.0413831973989	-67	21/02/24 15:47:34
102	348.60037065169166	290.2443240990335	-70	21/02/24 15:47:34
108	354.5433741308232	271.8469578377465	-70	21/02/24 15:47:34
107	352.24436078636603	271.4962331820773	-69	21/02/24 15:47:34
106	352.82196230706245	270.7390515122939	-71	21/02/24 15:47:34
113	350.4034533178371	267.72630832367133	-70	21/02/24 15:47:34
95	348.2574783689184	265.4034322422755	-68	21/02/24 15:47:34
100	345.6304273143794	285.66832195343085	-67	21/02/24 15:47:34
101	344.8940587728134	285.507681768186	-67	21/02/24 15:47:34
104	344.29972171429097	278.87653419291075	-60	21/02/24 15:47:34
103	341.9121052518552	264.28883990856684	-67	21/02/24 15:47:34
123	336.827695172566	287.724880300128	-64	21/02/24 15:47:34
98	334.9124542906195	280.9377639416658	-53	21/02/24 15:47:34
122	333.2695643238166	291.5458822091632	-68	21/02/24 15:47:34
120	332.7261018357164	292.45522740937736	-66	21/02/24 15:47:34
105	330.89379071296145	276.9107744382362	-50	21/02/24 15:47:34

111	349.3574161788773	282.0413831973989	-69	21/02/24 15:47:35
102	348.60037065169166	290.2443240990335	-71	21/02/24 15:47:35
108	354.5433741308232	271.8469578377465	-72	21/02/24 15:47:35
107	352.24436078636603	271.4962331820773	-69	21/02/24 15:47:35
106	352.82196230706245	270.7390515122939	-68	21/02/24 15:47:35
113	350.4034533178371	267.72630832367133	-67	21/02/24 15:47:35
95	348.2574783689184	265.4034322422755	-67	21/02/24 15:47:35
100	345.6304273143794	285.66832195343085	-66	21/02/24 15:47:35
101	344.8940587728134	285.507681768186	-65	21/02/24 15:47:35
104	344.29972171429097	278.87653419291075	-61	21/02/24 15:47:35
103	341.9121052518552	264.28883990856684	-67	21/02/24 15:47:35
123	336.827695172566	287.724880300128	-63	21/02/24 15:47:35
98	334.9124542906195	280.9377639416658	-53	21/02/24 15:47:35
122	333.2695643238166	291.5458822091632	-69	21/02/24 15:47:35
120	332.7261018357164	292.45522740937736	-69	21/02/24 15:47:35
105	330.89379071296145	276.9107744382362	-51	21/02/24 15:47:35

111	349.3574161788773	282.0413831973989	-66	21/02/24 15:47:36
102	348.60037065169166	290.2443240990335	-68	21/02/24 15:47:36
108	354.5433741308232	271.8469578377465	-69	21/02/24 15:47:36
107	352.24436078636603	271.4962331820773	-70	21/02/24 15:47:36
106	352.82196230706245	270.7390515122939	-70	21/02/24 15:47:36
113	350.4034533178371	267.72630832367133	-68	21/02/24 15:47:36
95	348.2574783689184	265.4034322422755	-69	21/02/24 15:47:36
100	345.6304273143794	285.66832195343085	-66	21/02/24 15:47:36
101	344.8940587728134	285.507681768186	-65	21/02/24 15:47:36
104	344.29972171429097	278.87653419291075	-59	21/02/24 15:47:36
103	341.9121052518552	264.28883990856684	-65	21/02/24 15:47:36
123	336.827695172566	287.724880300128	-64	21/02/24 15:47:36
98	334.9124542906195	280.9377639416658	-53	21/02/24 15:47:36
122	333.2695643238166	291.5458822091632	-66	21/02/24 15:47:36
120	332.7261018357164	292.45522740937736	-67	21/02/24 15:47:36
105	330.89379071296145	276.9107744382362	-53	21/02/24 15:47:36

111	349.3574161788773	282.0413831973989	-68	21/02/24 15:47:37
102	348.60037065169166	290.2443240990335	-70	21/02/24 15:47:37
108	354.5433741308232	271.8469578377465	-69	21/02/24 15:47:37
107	352.24436078636603	271.4962331820773	-69	21/02/24 15:47:37
106	352.82196230706245	270.7390515122939	-67	21/02/24 15:47:37
113	350.4034533178371	267.72630832367133	-66	21/02/24 15:47:37
95	348.2574783689184	265.4034322422755	-70	21/02/24 15:47:37
100	345.6304273143794	285.66832195343085	-65	21/02/24 15:47:37
101	344.8940587728134	285.507681768186	-63	21/02/24 15:47:37
104	344.29972171429097	278.87653419291075	-59	21/02/24 15:47:37
103	341.9121052518552	264.28883990856684	-67	21/02/24 15:47:37
123	336.827695172566	287.724880300128	-65	21/02/24 15:47:37
98	334.9124542906195	280.9377639416658	-52	21/02/24 15:47:37
122	333.2695643238166	291.5458822091632	-69	21/02/24 15:47:37
120	332.7261018357164	292.45522740937736	-68	21/02/24 15:47:37
105	330.89379071296145	276.9107744382362	-55	21/02/24 15:47:37

111	349.3574161788773	282.0413831973989	-66	21/02/24 15:47:38
102	348.60037065169166	290.2443240990335	-71	21/02/24 15:47:38
108	354.5433741308232	271.8469578377465	-69	21/02/24 15:47:38
107	352.24436078636603	271.4962331820773	-69	21/02/24 15:47:38
106	352.82196230706245	270.7390515122939	-68	21/02/24 15:47:38
113	350.4034533178371	267.72630832367133	-70	21/02/24 15:47:38
95	348.2574783689184	265.4034322422755	-67	21/02/24 15:47:38
100	345.6304273143794	285.66832195343085	-66	21/02/24 15:47:38
101	344.8940587728134	285.507681768186	-63	21/02/24 15:47:38
104	344.29972171429097	278.87653419291075	-57	21/02/24 15:47:38
103	341.9121052518552	264.28883990856684	-64	21/02/24 15:47:38
123	336.827695172566	287.724880300128	-65	21/02/24 15:47:38
98	334.9124542906195	280.9377639416658	-53	21/02/24 15:47:38
122	333.2695643238166	291.5458822091632	-66	21/02/24 15:47:38
120	332.7261018357164	292.45522740937736	-68	21/02/24 15:47:38
105	330.89379071296145	276.9107744382362	-56	21/02/24 15:47:38

111	349.3574161788773	282.0413831973989	-67	21/02/24 15:47:39
102	348.60037065169166	290.2443240990335	-71	21/02/24 15:47:39
108	354.5433741308232	271.8469578377465	-69	21/02/24 15:47:39
107	352.24436078636603	271.4962331820773	-68	21/02/24 15:47:39
106	352.82196230706245	270.7390515122939	-70	21/02/24 15:47:39
113	350.4034533178371	267.72630832367133	-68	21/02/24 15:47:39
95	348.2574783689184	265.4034322422755	-66	21/02/24 15:47:39
100	345.6304273143794	285.66832195343085	-63	21/02/24 15:47:39
101	344.8940587728134	285.507681768186	-65	21/02/24 15:47:39
104	344.29972171429097	278.87653419291075	-58	21/02/24 15:47:39
103	341.9121052518552	264.28883990856684	-67	21/02/24 15:47:39
123	336.827695172566	287.724880300128	-62	21/02/24 15:47:39
98	334.9124542906195	280.9377639416658	-53	21/02/24 15:47:39
122	333.2695643238166	291.5458822091632	-66	21/02/24 15:47:39
120	332.7261018357164	292.45522740937736	-67	21/02/24 15:47:39
105	330.89379071296145	276.9107744382362	-55	21/02/24 15:47:39

111	349.3574161788773	282.0413831973989	-64	21/02/24 15:47:40
102	348.60037065169166	290.2443240990335	-69	21/02/24 15:47:40
108	354.5433741308232	271.8469578377465	-71	21/02/24 15:47:40
107	352.24436078636603	271.4962331820773	-66	21/02/24 15:47:40
106	352.82196230706245	270.7390515122939	-68	21/02/24 15:47:40
113	350.4034533178371	267.72630832367133	-68	21/02/24 15:47:40
95	348.2574783689184	265.4034322422755	-67	21/02/24 15:47:40
100	345.6304273143794	285.66832195343085	-63	21/02/24 15:47:40
101	344.8940587728134	285.507681768186	-62	21/02/24 15:47:40
104	344.29972171429097	278.87653419291075	-59	21/02/24 15:47:40
103	341.9121052518552	264.28883990856684	-67	21/02/24 15:47:40
123	336.827695172566	287.724880300128	-63	21/02/24 15:47:40
98	334.9124542906195	280.9377639416658	-52	21/02/24 15:47:40
121	334.15326338445544	296.57189544390747	-72	21/02/24 15:47:40
122	333.2695643238166	291.5458822091632	-66	21/02/24 15:47:40
120	332.7261018357164	292.45522740937736	-67	21/02/24 15:47:40
105	330.89379071296145	276.9107744382362	-56	21/02/24 15:47:40

111	349.3574161788773	282.0413831973989	-64	21/02/24 15:47:41
102	348.60037065169166	290.2443240990335	-68	21/02/24 15:47:41
108	354.5433741308232	271.8469578377465	-69	21/02/24 15:47:41
107	352.24436078636603	271.4962331820773	-69	21/02/24 15:47:41
106	352.82196230706245	270.7390515122939	-69	21/02/24 15:47:41
113	350.4034533178371	267.72630832367133	-67	21/02/24 15:47:41
95	348.2574783689184	265.4034322422755	-68	21/02/24 15:47:41
100	345.6304273143794	285.66832195343085	-66	21/02/24 15:47:41
101	344.8940587728134	285.507681768186	-66	21/02/24 15:47:41
104	344.29972171429097	278.87653419291075	-60	21/02/24 15:47:41
103	341.9121052518552	264.28883990856684	-64	21/02/24 15:47:41
123	336.827695172566	287.724880300128	-63	21/02/24 15:47:41
98	334.9124542906195	280.9377639416658	-52	21/02/24 15:47:41
122	333.2695643238166	291.5458822091632	-67	21/02/24 15:47:41
120	332.7261018357164	292.45522740937736	-68	21/02/24 15:47:41
105	330.89379071296145	276.9107744382362	-53	21/02/24 15:47:41

111	349.3574161788773	282.0413831973989	-64	21/02/24 15:47:42
102	348.60037065169166	290.2443240990335	-71	21/02/24 15:47:42
118	357.09356967635637	275.4844405310735	-68	21/02/24 15:47:42
108	354.5433741308232	271.8469578377465	-71	21/02/24 15:47:42
107	352.24436078636603	271.4962331820773	-67	21/02/24 15:47:42
106	352.82196230706245	270.7390515122939	-67	21/02/24 15:47:42
113	350.4034533178371	267.72630832367133	-68	21/02/24 15:47:42
95	348.2574783689184	265.4034322422755	-68	21/02/24 15:47:42
100	345.6304273143794	285.66832195343085	-65	21/02/24 15:47:42
101	344.8940587728134	285.507681768186	-62	21/02/24 15:47:42
104	344.29972171429097	278.87653419291075	-57	21/02/24 15:47:42
103	341.9121052518552	264.28883990856684	-66	21/02/24 15:47:42
123	336.827695172566	287.724880300128	-63	21/02/24 15:47:42
98	334.9124542906195	280.9377639416658	-52	21/02/24 15:47:42
122	333.2695643238166	291.5458822091632	-68	21/02/24 15:47:42
120	332.7261018357164	292.45522740937736	-69	21/02/24 15:47:42
105	330.89379071296145	276.9107744382362	-58	21/02/24 15:47:42

111	349.3574161788773	282.0413831973989	-65	21/02/24 15:47:43
102	348.60037065169166	290.2443240990335	-71	21/02/24 15:47:43
118	357.09356967635637	275.4844405310735	-69	21/02/24 15:47:43
108	354.5433741308232	271.8469578377465	-70	21/02/24 15:47:43
107	352.24436078636603	271.4962331820773	-66	21/02/24 15:47:43
106	352.82196230706245	270.7390515122939	-66	21/02/24 15:47:43
113	350.4034533178371	267.72630832367133	-66	21/02/24 15:47:43
95	348.2574783689184	265.4034322422755	-69	21/02/24 15:47:43
100	345.6304273143794	285.66832195343085	-66	21/02/24 15:47:43
101	344.8940587728134	285.507681768186	-62	21/02/24 15:47:43
104	344.29972171429097	278.87653419291075	-58	21/02/24 15:47:43
103	341.9121052518552	264.28883990856684	-63	21/02/24 15:47:43
123	336.827695172566	287.724880300128	-63	21/02/24 15:47:43
98	334.9124542906195	280.9377639416658	-51	21/02/24 15:47:43
122	333.2695643238166	291.5458822091632	-66	21/02/24 15:47:43
120	332.7261018357164	292.45522740937736	-69	21/02/24 15:47:43
105	330.89379071296145	276.9107744382362	-56	21/02/24 15:47:43

111	349.3574161788773	282.0413831973989	-67	21/02/24 15:47:44
102	348.60037065169166	290.2443240990335	-68	21/02/24 15:47:44
118	357.09356967635637	275.4844405310735	-71	21/02/24 15:47:44
108	354.5433741308232	271.8469578377465	-70	21/02/24 15:47:44
107	352.24436078636603	271.4962331820773	-68	21/02/24 15:47:44
106	352.82196230706245	270.7390515122939	-69	21/02/24 15:47:44
113	350.4034533178371	267.72630832367133	-67	21/02/24 15:47:44
95	348.2574783689184	265.4034322422755	-68	21/02/24 15:47:44
100	345.6304273143794	285.66832195343085	-64	21/02/24 15:47:44
101	344.8940587728134	285.507681768186	-62	21/02/24 15:47:44
104	344.29972171429097	278.87653419291075	-56	21/02/24 15:47:44
103	341.9121052518552	264.28883990856684	-64	21/02/24 15:47:44
123	336.827695172566	287.724880300128	-64	21/02/24 15:47:44
98	334.9124542906195	280.9377639416658	-54	21/02/24 15:47:44
122	333.2695643238166	291.5458822091632	-66	21/02/24 15:47:44
120	332.7261018357164	292.45522740937736	-67	21/02/24 15:47:44
105	330.89379071296145	276.9107744382362	-56	21/02/24 15:47:44

111	349.3574161788773	282.0413831973989	-65	21/02/24 15:47:45
102	348.60037065169166	290.2443240990335	-70	21/02/24 15:47:45
118	357.09356967635637	275.4844405310735	-69	21/02/24 15:47:45
108	354.5433741308232	271.8469578377465	-68	21/02/24 15:47:45
107	352.24436078636603	271.4962331820773	-68	21/02/24 15:47:45
106	352.82196230706245	270.7390515122939	-66	21/02/24 15:47:45
113	350.4034533178371	267.72630832367133	-65	21/02/24 15:47:45
95	348.2574783689184	265.4034322422755	-66	21/02/24 15:47:45
100	345.6304273143794	285.66832195343085	-65	21/02/24 15:47:45
101	344.8940587728134	285.507681768186	-62	21/02/24 15:47:45
104	344.29972171429097	278.87653419291075	-56	21/02/24 15:47:45
103	341.9121052518552	264.28883990856684	-63	21/02/24 15:47:45
123	336.827695172566	287.724880300128	-63	21/02/24 15:47:45
98	334.9124542906195	280.9377639416658	-55	21/02/24 15:47:45
122	333.2695643238166	291.5458822091632	-67	21/02/24 15:47:45
120	332.7261018357164	292.45522740937736	-70	21/02/24 15:47:45
105	330.89379071296145	276.9107744382362	-58	21/02/24 15:47:45

111	349.3574161788773	282.0413831973989	-67	21/02/24 15:47:46
102	348.60037065169166	290.2443240990335	-68	21/02/24 15:47:46
118	357.09356967635637	275.4844405310735	-70	21/02/24 15:47:46
108	354.5433741308232	271.8469578377465	-70	21/02/24 15:47:46
107	352.24436078636603	271.4962331820773	-68	21/02/24 15:47:46
106	352.82196230706245	270.7390515122939	-67	21/02/24 15:47:46
113	350.4034533178371	267.72630832367133	-67	21/02/24 15:47:46
95	348.2574783689184	265.4034322422755	-66	21/02/24 15:47:46
100	345.6304273143794	285.66832195343085	-66	21/02/24 15:47:46
101	344.8940587728134	285.507681768186	-63	21/02/24 15:47:46
104	344.29972171429097	278.87653419291075	-56	21/02/24 15:47:46
103	341.9121052518552	264.28883990856684	-64	21/02/24 15:47:46
123	336.827695172566	287.724880300128	-65	21/02/24 15:47:46
98	334.9124542906195	280.9377639416658	-54	21/02/24 15:47:46
122	333.2695643238166	291.5458822091632	-69	21/02/24 15:47:46
120	332.7261018357164	292.45522740937736	-69	21/02/24 15:47:46
105	330.89379071296145	276.9107744382362	-56	21/02/24 15:47:46

111	349.3574161788773	282.0413831973989	-63	21/02/24 15:47:47
102	348.60037065169166	290.2443240990335	-68	21/02/24 15:47:47
118	357.09356967635637	275.4844405310735	-69	21/02/24 15:47:47
108	354.5433741308232	271.8469578377465	-67	21/02/24 15:47:47
107	352.24436078636603	271.4962331820773	-66	21/02/24 15:47:47
106	352.82196230706245	270.7390515122939	-69	21/02/24 15:47:47
113	350.4034533178371	267.72630832367133	-65	21/02/24 15:47:47
95	348.2574783689184	265.4034322422755	-68	21/02/24 15:47:47
100	345.6304273143794	285.66832195343085	-62	21/02/24 15:47:47
101	344.8940587728134	285.507681768186	-63	21/02/24 15:47:47
104	344.29972171429097	278.87653419291075	-56	21/02/24 15:47:47
103	341.9121052518552	264.28883990856684	-64	21/02/24 15:47:47
123	336.827695172566	287.724880300128	-64	21/02/24 15:47:47
98	334.9124542906195	280.9377639416658	-54	21/02/24 15:47:47
122	333.2695643238166	291.5458822091632	-66	21/02/24 15:47:47
120	332.7261018357164	292.45522740937736	-69	21/02/24 15:47:47
105	330.89379071296145	276.9107744382362	-56	21/02/24 15:47:47

111	349.3574161788773	282.0413831973989	-65	21/02/24 15:47:48
102	348.60037065169166	290.2443240990335	-68	21/02/24 15:47:48
118	357.09356967635637	275.4844405310735	-70	21/02/24 15:47:48
108	354.5433741308232	271.8469578377465	-68	21/02/24 15:47:48
107	352.24436078636603	271.4962331820773	-68	21/02/24 15:47:48
106	352.82196230706245	270.7390515122939	-69	21/02/24 15:47:48
113	350.4034533178371	267.72630832367133	-65	21/02/24 15:47:48
95	348.2574783689184	265.4034322422755	-66	21/02/24 15:47:48
100	345.6304273143794	285.66832195343085	-66	21/02/24 15:47:48
101	344.8940587728134	285.507681768186	-63	21/02/24 15:47:48
104	344.29972171429097	278.87653419291075	-57	21/02/24 15:47:48
103	341.9121052518552	264.28883990856684	-63	21/02/24 15:47:48
123	336.827695172566	287.724880300128	-66	21/02/24 15:47:48
98	334.9124542906195	280.9377639416658	-56	21/02/24 15:47:48
122	333.2695643238166	291.5458822091632	-67	21/02/24 15:47:48
120	332.7261018357164	292.45522740937736	-67	21/02/24 15:47:48
105	330.89379071296145	276.9107744382362	-58	21/02/24 15:47:48

111	349.3574161788773	282.0413831973989	-66	21/02/24 15:47:49
102	348.60037065169166	290.2443240990335	-68	21/02/24 15:47:49
118	357.09356967635637	275.4844405310735	-68	21/02/24 15:47:49
108	354.5433741308232	271.8469578377465	-67	21/02/24 15:47:49
107	352.24436078636603	271.4962331820773	-66	21/02/24 15:47:49
106	352.82196230706245	270.7390515122939	-67	21/02/24 15:47:49
113	350.4034533178371	267.72630832367133	-64	21/02/24 15:47:49
95	348.2574783689184	265.4034322422755	-68	21/02/24 15:47:49
100	345.6304273143794	285.66832195343085	-63	21/02/24 15:47:49
101	344.8940587728134	285.507681768186	-62	21/02/24 15:47:49
104	344.29972171429097	278.87653419291075	-58	21/02/24 15:47:49
103	341.9121052518552	264.28883990856684	-64	21/02/24 15:47:49
123	336.827695172566	287.724880300128	-65	21/02/24 15:47:49
98	334.9124542906195	280.9377639416658	-57	21/02/24 15:47:49
122	333.2695643238166	291.5458822091632	-70	21/02/24 15:47:49
120	332.7261018357164	292.45522740937736	-69	21/02/24 15:47:49
105	330.89379071296145	276.9107744382362	-59	21/02/24 15:47:49

111	349.3574161788773	282.0413831973989	-64	21/02/24 15:47:50
102	348.60037065169166	290.2443240990335	-71	21/02/24 15:47:50
118	357.09356967635637	275.4844405310735	-69	21/02/24 15:47:50
108	354.5433741308232	271.8469578377465	-70	21/02/24 15:47:50
107	352.24436078636603	271.4962331820773	-68	21/02/24 15:47:50
106	352.82196230706245	270.7390515122939	-68	21/02/24 15:47:50
113	350.4034533178371	267.72630832367133	-66	21/02/24 15:47:50
95	348.2574783689184	265.4034322422755	-68	21/02/24 15:47:50
100	345.6304273143794	285.66832195343085	-64	21/02/24 15:47:50
101	344.8940587728134	285.507681768186	-63	21/02/24 15:47:50
104	344.29972171429097	278.87653419291075	-56	21/02/24 15:47:50
103	341.9121052518552	264.28883990856684	-66	21/02/24 15:47:50
123	336.827695172566	287.724880300128	-66	21/02/24 15:47:50
98	334.9124542906195	280.9377639416658	-53	21/02/24 15:47:50
122	333.2695643238166	291.5458822091632	-67	21/02/24 15:47:50
120	332.7261018357164	292.45522740937736	-70	21/02/24 15:47:50
105	330.89379071296145	276.9107744382362	-55	21/02/24 15:47:50

111	349.3574161788773	282.0413831973989	-66	21/02/24 15:47:51
102	348.60037065169166	290.2443240990335	-70	21/02/24 15:47:51
118	357.09356967635637	275.4844405310735	-69	21/02/24 15:47:51
108	354.5433741308232	271.8469578377465	-69	21/02/24 15:47:51
107	352.24436078636603	271.4962331820773	-65	21/02/24 15:47:51
106	352.82196230706245	270.7390515122939	-69	21/02/24 15:47:51
113	350.4034533178371	267.72630832367133	-67	21/02/24 15:47:51
95	348.2574783689184	265.4034322422755	-66	21/02/24 15:47:51
100	345.6304273143794	285.66832195343085	-63	21/02/24 15:47:51
101	344.8940587728134	285.507681768186	-66	21/02/24 15:47:51
104	344.29972171429097	278.87653419291075	-57	21/02/24 15:47:51
103	341.9121052518552	264.28883990856684	-63	21/02/24 15:47:51
123	336.827695172566	287.724880300128	-66	21/02/24 15:47:51
98	334.9124542906195	280.9377639416658	-55	21/02/24 15:47:51
122	333.2695643238166	291.5458822091632	-68	21/02/24 15:47:51
120	332.7261018357164	292.45522740937736	-71	21/02/24 15:47:51
105	330.89379071296145	276.9107744382362	-57	21/02/24 15:47:51

111	349.3574161788773	282.0413831973989	-67	21/02/24 15:47:52
102	348.60037065169166	290.2443240990335	-69	21/02/24 15:47:52
118	357.09356967635637	275.4844405310735	-68	21/02/24 15:47:52
108	354.5433741308232	271.8469578377465	-68	21/02/24 15:47:52
107	352.24436078636603	271.4962331820773	-67	21/02/24 15:47:52
106	352.82196230706245	270.7390515122939	-67	21/02/24 15:47:52
113	350.4034533178371	267.72630832367133	-67	21/02/24 15:47:52
95	348.2574783689184	265.4034322422755	-68	21/02/24 15:47:52
100	345.6304273143794	285.66832195343085	-65	21/02/24 15:47:52
101	344.8940587728134	285.507681768186	-66	21/02/24 15:47:52
104	344.29972171429097	278.87653419291075	-59	21/02/24 15:47:52
103	341.9121052518552	264.28883990856684	-65	21/02/24 15:47:52
123	336.827695172566	287.724880300128	-66	21/02/24 15:47:52
98	334.9124542906195	280.9377639416658	-53	21/02/24 15:47:52
122	333.2695643238166	291.5458822091632	-70	21/02/24 15:47:52
120	332.7261018357164	292.45522740937736	-68	21/02/24 15:47:52
105	330.89379071296145	276.9107744382362	-56	21/02/24 15:47:52

111	349.3574161788773	282.0413831973989	-65	21/02/24 15:47:53
102	348.60037065169166	290.2443240990335	-68	21/02/24 15:47:53
118	357.09356967635637	275.4844405310735	-69	21/02/24 15:47:53
108	354.5433741308232	271.8469578377465	-67	21/02/24 15:47:53
107	352.24436078636603	271.4962331820773	-67	21/02/24 15:47:53
106	352.82196230706245	270.7390515122939	-68	21/02/24 15:47:53
113	350.4034533178371	267.72630832367133	-67	21/02/24 15:47:53
95	348.2574783689184	265.4034322422755	-67	21/02/24 15:47:53
100	345.6304273143794	285.66832195343085	-65	21/02/24 15:47:53
101	344.8940587728134	285.507681768186	-65	21/02/24 15:47:53
104	344.29972171429097	278.87653419291075	-57	21/02/24 15:47:53
103	341.9121052518552	264.28883990856684	-63	21/02/24 15:47:53
123	336.827695172566	287.724880300128	-64	21/02/24 15:47:53
98	334.9124542906195	280.9377639416658	-57	21/02/24 15:47:53
122	333.2695643238166	291.5458822091632	-68	21/02/24 15:47:53
120	332.7261018357164	292.45522740937736	-69	21/02/24 15:47:53
105	330.89379071296145	276.9107744382362	-56	21/02/24 15:47:53

111	349.3574161788773	282.0413831973989	-66	21/02/24 15:47:54
102	348.60037065169166	290.2443240990335	-67	21/02/24 15:47:54
118	357.09356967635637	275.4844405310735	-71	21/02/24 15:47:54
108	354.5433741308232	271.8469578377465	-68	21/02/24 15:47:54
107	352.24436078636603	271.4962331820773	-69	21/02/24 15:47:54
106	352.82196230706245	270.7390515122939	-69	21/02/24 15:47:54
113	350.4034533178371	267.72630832367133	-67	21/02/24 15:47:54
95	348.2574783689184	265.4034322422755	-67	21/02/24 15:47:54
100	345.6304273143794	285.66832195343085	-65	21/02/24 15:47:54
101	344.8940587728134	285.507681768186	-64	21/02/24 15:47:54
104	344.29972171429097	278.87653419291075	-58	21/02/24 15:47:54
103	341.9121052518552	264.28883990856684	-65	21/02/24 15:47:54
123	336.827695172566	287.724880300128	-65	21/02/24 15:47:54
98	334.9124542906195	280.9377639416658	-54	21/02/24 15:47:54
122	333.2695643238166	291.5458822091632	-69	21/02/24 15:47:54
120	332.7261018357164	292.45522740937736	-69	21/02/24 15:47:54
105	330.89379071296145	276.9107744382362	-57	21/02/24 15:47:54

111	349.3574161788773	282.0413831973989	-67	21/02/24 15:47:55
102	348.60037065169166	290.2443240990335	-70	21/02/24 15:47:55
118	357.09356967635637	275.4844405310735	-70	21/02/24 15:47:55
108	354.5433741308232	271.8469578377465	-70	21/02/24 15:47:55
107	352.24436078636603	271.4962331820773	-66	21/02/24 15:47:55
106	352.82196230706245	270.7390515122939	-70	21/02/24 15:47:55
113	350.4034533178371	267.72630832367133	-68	21/02/24 15:47:55
95	348.2574783689184	265.4034322422755	-67	21/02/24 15:47:55
100	345.6304273143794	285.66832195343085	-66	21/02/24 15:47:55
101	344.8940587728134	285.507681768186	-66	21/02/24 15:47:55
104	344.29972171429097	278.87653419291075	-58	21/02/24 15:47:55
103	341.9121052518552	264.28883990856684	-66	21/02/24 15:47:55
123	336.827695172566	287.724880300128	-66	21/02/24 15:47:55
98	334.9124542906195	280.9377639416658	-55	21/02/24 15:47:55
122	333.2695643238166	291.5458822091632	-68	21/02/24 15:47:55
120	332.7261018357164	292.45522740937736	-69	21/02/24 15:47:55
105	330.89379071296145	276.9107744382362	-57	21/02/24 15:47:55

111	349.3574161788773	282.0413831973989	-67	21/02/24 15:47:56
102	348.60037065169166	290.2443240990335	-70	21/02/24 15:47:56
118	357.09356967635637	275.4844405310735	-71	21/02/24 15:47:56
108	354.5433741308232	271.8469578377465	-69	21/02/24 15:47:56
107	352.24436078636603	271.4962331820773	-69	21/02/24 15:47:56
106	352.82196230706245	270.7390515122939	-70	21/02/24 15:47:56
113	350.4034533178371	267.72630832367133	-66	21/02/24 15:47:56
95	348.2574783689184	265.4034322422755	-67	21/02/24 15:47:56
100	345.6304273143794	285.66832195343085	-66	21/02/24 15:47:56
101	344.8940587728134	285.507681768186	-65	21/02/24 15:47:56
104	344.29972171429097	278.87653419291075	-55	21/02/24 15:47:56
103	341.9121052518552	264.28883990856684	-64	21/02/24 15:47:56
123	336.827695172566	287.724880300128	-64	21/02/24 15:47:56
98	334.9124542906195	280.9377639416658	-52	21/02/24 15:47:56
122	333.2695643238166	291.5458822091632	-69	21/02/24 15:47:56
120	332.7261018357164	292.45522740937736	-69	21/02/24 15:47:56
105	330.89379071296145	276.9107744382362	-56	21/02/24 15:47:56

111	349.3574161788773	282.0413831973989	-65	21/02/24 15:47:57
102	348.60037065169166	290.2443240990335	-68	21/02/24 15:47:57
118	357.09356967635637	275.4844405310735	-69	21/02/24 15:47:57
108	354.5433741308232	271.8469578377465	-69	21/02/24 15:47:57
107	352.24436078636603	271.4962331820773	-65	21/02/24 15:47:57
106	352.82196230706245	270.7390515122939	-67	21/02/24 15:47:57
113	350.4034533178371	267.72630832367133	-66	21/02/24 15:47:57
95	348.2574783689184	265.4034322422755	-66	21/02/24 15:47:57
100	345.6304273143794	285.66832195343085	-63	21/02/24 15:47:57
101	344.8940587728134	285.507681768186	-62	21/02/24 15:47:57
104	344.29972171429097	278.87653419291075	-55	21/02/24 15:47:57
103	341.9121052518552	264.28883990856684	-64	21/02/24 15:47:57
123	336.827695172566	287.724880300128	-62	21/02/24 15:47:57
98	334.9124542906195	280.9377639416658	-53	21/02/24 15:47:57
122	333.2695643238166	291.5458822091632	-69	21/02/24 15:47:57
120	332.7261018357164	292.45522740937736	-69	21/02/24 15:47:57
105	330.89379071296145	276.9107744382362	-56	21/02/24 15:47:57

111	349.3574161788773	282.0413831973989	-63	21/02/24 15:47:58
102	348.60037065169166	290.2443240990335	-70	21/02/24 15:47:58
118	357.09356967635637	275.4844405310735	-71	21/02/24 15:47:58
108	354.5433741308232	271.8469578377465	-69	21/02/24 15:47:58
107	352.24436078636603	271.4962331820773	-68	21/02/24 15:47:58
106	352.82196230706245	270.7390515122939	-67	21/02/24 15:47:58
113	350.4034533178371	267.72630832367133	-68	21/02/24 15:47:58
95	348.2574783689184	265.4034322422755	-69	21/02/24 15:47:58
100	345.6304273143794	285.66832195343085	-65	21/02/24 15:47:58
101	344.8940587728134	285.507681768186	-63	21/02/24 15:47:58
104	344.29972171429097	278.87653419291075	-56	21/02/24 15:47:58
103	341.9121052518552	264.28883990856684	-66	21/02/24 15:47:58
123	336.827695172566	287.724880300128	-63	21/02/24 15:47:58
98	334.9124542906195	280.9377639416658	-52	21/02/24 15:47:58
122	333.2695643238166	291.5458822091632	-68	21/02/24 15:47:58
120	332.7261018357164	292.45522740937736	-67	21/02/24 15:47:58
105	330.89379071296145	276.9107744382362	-57	21/02/24 15:47:58

111	349.3574161788773	282.0413831973989	-63	21/02/24 15:47:59
102	348.60037065169166	290.2443240990335	-68	21/02/24 15:47:59
118	357.09356967635637	275.4844405310735	-68	21/02/24 15:47:59
108	354.5433741308232	271.8469578377465	-68	21/02/24 15:47:59
107	352.24436078636603	271.4962331820773	-66	21/02/24 15:47:59
106	352.82196230706245	270.7390515122939	-67	21/02/24 15:47:59
113	350.4034533178371	267.72630832367133	-65	21/02/24 15:47:59
95	348.2574783689184	265.4034322422755	-67	21/02/24 15:47:59
100	345.6304273143794	285.66832195343085	-63	21/02/24 15:47:59
101	344.8940587728134	285.507681768186	-61	21/02/24 15:47:59
104	344.29972171429097	278.87653419291075	-57	21/02/24 15:47:59
103	341.9121052518552	264.28883990856684	-66	21/02/24 15:47:59
123	336.827695172566	287.724880300128	-62	21/02/24 15:47:59
98	334.9124542906195	280.9377639416658	-54	21/02/24 15:47:59
122	333.2695643238166	291.5458822091632	-69	21/02/24 15:47:59
120	332.7261018357164	292.45522740937736	-67	21/02/24 15:47:59
105	330.89379071296145	276.9107744382362	-57	21/02/24 15:47:59

