floorId	partitionId	location_x	location_y	timeStamp
19	958	365.55243192741585	288.59648801263694	21/02/24 15:46:29
19	958	365.55243192741585	288.59648801263694	21/02/24 15:46:30
19	958	365.55243192741585	288.59648801263694	21/02/24 15:46:31
19	958	365.55243192741585	288.59648801263694	21/02/24 15:46:32
19	958	365.55243192741585	288.59648801263694	21/02/24 15:46:33
19	958	365.55243192741585	288.59648801263694	21/02/24 15:46:34
19	958	365.55243192741585	288.59648801263694	21/02/24 15:46:35
19	958	365.55243192741585	288.59648801263694	21/02/24 15:46:36
19	958	365.55243192741585	288.59648801263694	21/02/24 15:46:37
19	958	365.55243192741585	288.59648801263694	21/02/24 15:46:38
19	958	364.8238741505902	287.1482151372541	21/02/24 15:46:39
19	NULL	368.6441963719141	285.32200544753397	21/02/24 15:46:40
19	990	371.87975649755595	282.80894332222346	21/02/24 15:46:41
19	990	373.5702263177357	281.590961967497	21/02/24 15:46:42
19	990	373.5702263177357	281.5909619674969	21/02/24 15:46:43
19	990	373.5702263177357	281.5909619674969	21/02/24 15:46:44
19	NULL	375.70188389076833	280.5525699379839	21/02/24 15:46:45
19	NULL	375.70188389076833	280.5525699379839	21/02/24 15:46:46
19	NULL	375.70188389076833	280.5525699379839	21/02/24 15:46:47
19	937	374.63236040462476	279.0631299285737	21/02/24 15:46:48
19	937	374.63236040462476	279.0631299285737	21/02/24 15:46:49
19	937	374.6323604046247	279.06312992857363	21/02/24 15:46:50
19	937	374.63236040462476	279.0631299285737	21/02/24 15:46:51
19	937	374.63236040462476	279.0631299285737	21/02/24 15:46:52
19	937	374.63236040462476	279.0631299285737	21/02/24 15:46:53
19	937	374.63236040462476	279.0631299285737	21/02/24 15:46:54
19	937	374.6323604046247	279.06312992857363	21/02/24 15:46:55
19	937	374.63236040462476	279.0631299285737	21/02/24 15:46:56
19	937	374.6323604046247	279.06312992857363	21/02/24 15:46:57
19	937	374.6323604046247	279.06312992857363	21/02/24 15:46:58
19	937	374.63236040462476	279.0631299285737	21/02/24 15:46:59
19	937	374.6323604046247	279.06312992857363	21/02/24 15:47:00
19	937	374.63236040462476	279.0631299285737	21/02/24 15:47:01
19	937	374.63236040462476	279.0631299285737	21/02/24 15:47:02
19	937	374.6323604046247	279.06312992857363	21/02/24 15:47:03
19	937	374.63236040462476	279.0631299285737	21/02/24 15:47:04
19	937	374.6323604046247	279.06312992857363	21/02/24 15:47:05
19	937	374.6323604046247	279.06312992857363	21/02/24 15:47:06
19	937	374.63236040462476	279.0631299285737	21/02/24 15:47:07
19	937	374.63236040462476	279.0631299285737	21/02/24 15:47:08
19	937	374.63236040462476	279.0631299285737	21/02/24 15:47:09
19	NULL	375.70188389076833	280.5525699379839	21/02/24 15:47:10
19	937	374.63236040462476	279.0631299285737	21/02/24 15:47:11
19	937	374.63236040462476	279.0631299285737	21/02/24 15:47:12
19	937	374.63236040462476	279.0631299285737	21/02/24 15:47:13
19	937	374.6323604046247	279.06312992857363	21/02/24 15:47:14
19	937	374.6323604046247	279.06312992857363	21/02/24 15:47:15
19	937	374.6323604046247	279.06312992857363	21/02/24 15:47:16
19	937	374.63236040462476	279.0631299285737	21/02/24 15:47:17
19	937	374.63236040462476	279.0631299285737	21/02/24 15:47:18
19	937	374.6323604046247	279.06312992857363	21/02/24 15:47:19
19	937	374.6323604046247	279.06312992857363	21/02/24 15:47:20
19	937	374.6323604046247	279.06312992857363	21/02/24 15:47:21
19	937	374.63236040462476	279.0631299285737	21/02/24 15:47:22
19	937	374.63236040462476	279.0631299285737	21/02/24 15:47:23
19	NULL	375.70188389076833	280.5525699379839	21/02/24 15:47:24
19	NULL	375.7018838907682	280.5525699379839	21/02/24 15:47:25
19	990	373.5702263177357	281.5909619674969	21/02/24 15:47:26
19	990	373.5702263177357	281.590961967497	21/02/24 15:47:27
19	990	373.5702263177357	281.590961967497	21/02/24 15:47:28
19	910	371.49991506597235	283.64243362381774	21/02/24 15:47:29
19	990	365.6806020727022	281.19039879102405	21/02/24 15:47:30
19	987	363.64647505929315	279.84759664761776	21/02/24 15:47:31
19	987	360.4804147429043	276.7888416553232	21/02/24 15:47:32
19	987	363.64647505929315	279.84759664761776	21/02/24 15:47:33
19	NULL	360.5547106147949	283.12207921272073	21/02/24 15:47:34
19	NULL	360.5547106147949	283.12207921272073	21/02/24 15:47:35
19	987	360.4804147429043	276.7888416553232	21/02/24 15:47:36
19	987	363.64647505929315	279.84759664761776	21/02/24 15:47:37
19	NULL	361.8602798513784	283.01660848074425	21/02/24 15:47:38
19	NULL	360.5547106147949	283.12207921272073	21/02/24 15:47:39
19	NULL	360.5547106147949	283.12207921272073	21/02/24 15:47:40
19	987	360.4804147429043	276.7888416553232	21/02/24 15:47:41
19	NULL	361.8602798513784	283.01660848074425	21/02/24 15:47:42
19	NULL	360.5547106147949	283.12207921272073	21/02/24 15:47:43
19	NULL	360.5547106147949	283.12207921272073	21/02/24 15:47:44
19	NULL	360.5547106147949	283.12207921272073	21/02/24 15:47:45
19	NULL	361.8602798513784	283.01660848074425	21/02/24 15:47:46
19	987	363.64647505929315	279.84759664761776	21/02/24 15:47:47
19	987	363.64647505929315	279.84759664761776	21/02/24 15:47:48
19	987	363.64647505929315	279.84759664761776	21/02/24 15:47:49
19	NULL	360.5547106147949	283.12207921272073	21/02/24 15:47:50
19	987	363.64647505929315	279.84759664761776	21/02/24 15:47:51
19	959	364.13925124804297	284.5462645050939	21/02/24 15:47:52
19	910	371.49991506597235	283.64243362381774	21/02/24 15:47:53
19	990	373.5702263177357	281.590961967497	21/02/24 15:47:54
19	990	373.5702263177357	281.590961967497	21/02/24 15:47:55
19	990	373.5702263177357	281.590961967497	21/02/24 15:47:56
19	990	371.87975649755595	282.8089433222234	21/02/24 15:47:57
19	916	368.916162198344	278.6773366657135	21/02/24 15:47:58
19	990	371.87975649755595	282.80894332222346	21/02/24 15:47:59
