floorId	partitionId	location_x	location_y	timeStamp
19	955	324.5428020167151	277.91909661811553	21/02/24 15:42:56
19	955	324.93261496511354	278.2411910294311	21/02/24 15:42:57
19	955	324.54280201671514	277.9190966181156	21/02/24 15:42:58
19	955	328.92321811554416	278.4499778858854	21/02/24 15:42:59
19	955	328.92321811554416	278.4499778858854	21/02/24 15:43:00
19	955	328.92321811554416	278.4499778858854	21/02/24 15:43:01
19	955	328.92321811554416	278.4499778858854	21/02/24 15:43:02
19	955	332.13398995625107	274.9863189954403	21/02/24 15:43:03
19	955	331.5796102272668	277.2385535448373	21/02/24 15:43:04
19	964	336.0261274573125	281.17180345710295	21/02/24 15:43:05
19	915	336.54156488011523	280.3558442180772	21/02/24 15:43:06
19	940	347.9711572177418	278.13370891448585	21/02/24 15:43:07
19	964	349.72234002988336	284.71465847817086	21/02/24 15:43:08
19	964	349.72234002988336	284.71465847817086	21/02/24 15:43:09
19	964	355.482293890607	282.3613173869535	21/02/24 15:43:10
19	964	355.482293890607	282.3613173869535	21/02/24 15:43:11
19	964	355.482293890607	282.3613173869535	21/02/24 15:43:12
19	990	357.82242061436574	282.16385269148645	21/02/24 15:43:13
19	918	358.31519680311567	286.86252054896266	21/02/24 15:43:14
19	918	358.31519680311567	286.86252054896266	21/02/24 15:43:15
19	959	362.3530560401282	287.71527633822046	21/02/24 15:43:16
19	959	362.3530560401282	287.71527633822046	21/02/24 15:43:17
19	959	362.3530560401282	287.71527633822046	21/02/24 15:43:18
19	959	362.3530560401282	287.71527633822046	21/02/24 15:43:19
19	959	362.3530560401282	287.71527633822046	21/02/24 15:43:20
19	959	362.3530560401282	287.71527633822046	21/02/24 15:43:21
19	959	362.3530560401282	287.71527633822046	21/02/24 15:43:22
19	959	362.3530560401282	287.71527633822046	21/02/24 15:43:23
19	959	362.3530560401282	287.71527633822046	21/02/24 15:43:24
19	959	362.3530560401282	287.71527633822046	21/02/24 15:43:25
19	959	362.3530560401282	287.71527633822046	21/02/24 15:43:26
19	959	362.3530560401282	287.71527633822046	21/02/24 15:43:27
19	959	362.3530560401282	287.71527633822046	21/02/24 15:43:28
19	959	362.3530560401282	287.71527633822046	21/02/24 15:43:29
19	959	362.3530560401282	287.71527633822046	21/02/24 15:43:30
19	959	362.3530560401282	287.71527633822046	21/02/24 15:43:31
19	959	362.3530560401282	287.71527633822046	21/02/24 15:43:32
19	959	362.3530560401282	287.71527633822046	21/02/24 15:43:33
19	959	362.3530560401282	287.71527633822046	21/02/24 15:43:34
19	958	365.44482048462646	284.4407937731175	21/02/24 15:43:35
19	NULL	368.6441963719141	285.32200544753397	21/02/24 15:43:36
19	910	371.49991506597235	283.64243362381774	21/02/24 15:43:37
19	990	373.5702263177357	281.590961967497	21/02/24 15:43:38
19	990	373.5702263177357	281.590961967497	21/02/24 15:43:39
19	990	373.5702263177357	281.5909619674969	21/02/24 15:43:40
19	NULL	375.7018838907682	280.5525699379839	21/02/24 15:43:41
19	NULL	375.70188389076833	280.5525699379839	21/02/24 15:43:42
19	NULL	375.70188389076833	280.5525699379839	21/02/24 15:43:43
19	NULL	375.70188389076833	280.5525699379839	21/02/24 15:43:44
19	NULL	375.70188389076833	280.5525699379839	21/02/24 15:43:45
19	NULL	375.70188389076833	280.5525699379839	21/02/24 15:43:46
19	NULL	375.70188389076833	280.5525699379839	21/02/24 15:43:47
19	NULL	375.70188389076833	280.5525699379839	21/02/24 15:43:48
19	NULL	375.7018838907682	280.5525699379839	21/02/24 15:43:49
19	NULL	375.7018838907682	280.5525699379839	21/02/24 15:43:50
19	NULL	375.7018838907682	280.5525699379839	21/02/24 15:43:51
19	990	373.5702263177357	281.5909619674969	21/02/24 15:43:52
19	990	373.5702263177357	281.590961967497	21/02/24 15:43:53
19	990	373.5702263177357	281.590961967497	21/02/24 15:43:54
19	910	371.49991506597235	283.64243362381774	21/02/24 15:43:55
19	910	370.3346661920939	284.1040240928075	21/02/24 15:43:56
19	987	363.64647505929315	279.84759664761776	21/02/24 15:43:57
19	NULL	360.5547106147949	283.12207921272073	21/02/24 15:43:58
19	945	357.72180770228624	278.62087605071156	21/02/24 15:43:59
19	964	355.482293890607	282.3613173869535	21/02/24 15:44:00
19	964	355.482293890607	282.36131738695343	21/02/24 15:44:01
19	964	355.482293890607	282.3613173869535	21/02/24 15:44:02
19	964	355.482293890607	282.36131738695343	21/02/24 15:44:03
19	964	355.482293890607	282.36131738695343	21/02/24 15:44:04
19	964	355.482293890607	282.3613173869535	21/02/24 15:44:05
19	964	355.482293890607	282.36131738695343	21/02/24 15:44:06
19	964	355.482293890607	282.3613173869535	21/02/24 15:44:07
19	964	355.482293890607	282.36131738695343	21/02/24 15:44:08
19	945	357.7218077022862	278.62087605071156	21/02/24 15:44:09
19	945	357.7218077022862	278.62087605071156	21/02/24 15:44:10
19	968	355.71807547868275	279.11092240486005	21/02/24 15:44:11
19	964	355.482293890607	282.36131738695343	21/02/24 15:44:12
19	945	357.7218077022862	278.62087605071156	21/02/24 15:44:13
19	968	355.71807547868275	279.11092240486005	21/02/24 15:44:14
19	964	355.482293890607	282.3613173869535	21/02/24 15:44:15
19	945	357.72180770228624	278.62087605071156	21/02/24 15:44:16
19	945	357.72180770228624	278.62087605071156	21/02/24 15:44:17
19	945	357.72180770228624	278.62087605071156	21/02/24 15:44:18
19	968	355.71807547868275	279.11092240486005	21/02/24 15:44:19
19	945	357.72180770228624	278.62087605071156	21/02/24 15:44:20
19	964	355.482293890607	282.36131738695343	21/02/24 15:44:21
19	968	355.71807547868275	279.11092240486005	21/02/24 15:44:22
19	964	355.482293890607	282.3613173869535	21/02/24 15:44:23
19	968	355.71807547868275	279.11092240486005	21/02/24 15:44:24
19	968	355.71807547868275	279.11092240486005	21/02/24 15:44:25
19	954	351.0914713947271	276.75392450645927	21/02/24 15:44:26
19	904	347.2575875056375	270.5932917052313	21/02/24 15:44:27
19	909	344.1372733286521	271.97307611325795	21/02/24 15:44:28
19	919	341.8507959684553	269.41861351939014	21/02/24 15:44:29
19	NULL	337.73701806888556	270.34580290420837	21/02/24 15:44:30
19	NULL	337.73701806888556	270.34580290420837	21/02/24 15:44:31
19	909	333.79691834538926	273.32229963118385	21/02/24 15:44:32
19	909	333.79691834538926	273.32229963118385	21/02/24 15:44:33
19	909	333.79691834538926	273.32229963118385	21/02/24 15:44:34
19	909	333.79691834538926	273.32229963118385	21/02/24 15:44:35
19	909	333.79691834538926	273.32229963118385	21/02/24 15:44:36
19	NULL	337.73701806888556	270.34580290420837	21/02/24 15:44:37
19	NULL	337.73701806888556	270.34580290420837	21/02/24 15:44:38
19	909	333.79691834538926	273.32229963118385	21/02/24 15:44:39
19	NULL	337.73701806888556	270.34580290420837	21/02/24 15:44:40
19	909	333.79691834538926	273.32229963118385	21/02/24 15:44:41
19	909	333.79691834538926	273.32229963118385	21/02/24 15:44:42
19	909	333.79691834538926	273.32229963118385	21/02/24 15:44:43
19	909	333.79691834538926	273.32229963118385	21/02/24 15:44:44
19	909	333.79691834538926	273.32229963118385	21/02/24 15:44:45
19	909	333.79691834538926	273.32229963118385	21/02/24 15:44:46
19	909	333.79691834538926	273.32229963118385	21/02/24 15:44:47
19	909	333.79691834538926	273.32229963118385	21/02/24 15:44:48
19	909	333.79691834538926	273.32229963118385	21/02/24 15:44:49
19	909	333.79691834538926	273.32229963118385	21/02/24 15:44:50
19	909	333.79691834538926	273.32229963118385	21/02/24 15:44:51
19	909	333.7969183453893	273.32229963118385	21/02/24 15:44:52
19	909	333.79691834538926	273.32229963118385	21/02/24 15:44:53
19	909	333.79691834538926	273.32229963118385	21/02/24 15:44:54
19	909	333.79691834538926	273.32229963118385	21/02/24 15:44:55
19	909	333.79691834538926	273.32229963118385	21/02/24 15:44:56
19	909	333.79691834538926	273.32229963118385	21/02/24 15:44:57
19	909	333.79691834538926	273.32229963118385	21/02/24 15:44:58
19	909	333.79691834538926	273.32229963118385	21/02/24 15:44:59
19	909	333.79691834538926	273.32229963118385	21/02/24 15:45:00
19	NULL	337.73701806888556	270.34580290420837	21/02/24 15:45:01
19	NULL	337.73701806888556	270.34580290420837	21/02/24 15:45:02
19	919	341.8507959684553	269.41861351939014	21/02/24 15:45:03
19	NULL	337.73701806888556	270.34580290420837	21/02/24 15:45:05
19	NULL	337.73701806888556	270.34580290420837	21/02/24 15:45:06
19	950	335.24432386191205	269.68948620372345	21/02/24 15:45:07
19	950	335.24432386191205	269.68948620372345	21/02/24 15:45:08
19	950	332.12560097371966	268.39264382435715	21/02/24 15:45:09
19	950	332.12560097371966	268.3926438243571	21/02/24 15:45:10
19	950	334.5577883253506	267.2017191048172	21/02/24 15:45:11
19	950	332.12560097371966	268.3926438243571	21/02/24 15:45:12
19	950	332.12560097371966	268.3926438243571	21/02/24 15:45:13
19	909	332.94477462052106	270.4919384994539	21/02/24 15:45:14
19	950	332.12560097371966	268.3926438243571	21/02/24 15:45:15
19	950	334.5577883253506	267.2017191048172	21/02/24 15:45:16
19	950	334.5577883253506	267.2017191048172	21/02/24 15:45:17
19	950	332.12560097371966	268.3926438243571	21/02/24 15:45:18
19	950	332.12560097371966	268.3926438243571	21/02/24 15:45:19
19	950	332.12560097371966	268.39264382435715	21/02/24 15:45:20
19	950	332.12560097371966	268.3926438243571	21/02/24 15:45:21
19	950	332.12560097371966	268.3926438243571	21/02/24 15:45:22
19	950	332.12560097371966	268.39264382435715	21/02/24 15:45:23
19	950	335.244323861912	269.6894862037234	21/02/24 15:45:24
19	950	332.12560097371966	268.39264382435715	21/02/24 15:45:25
19	950	335.244323861912	269.6894862037234	21/02/24 15:45:26
19	950	335.24432386191205	269.68948620372345	21/02/24 15:45:27
19	NULL	337.73701806888556	270.34580290420837	21/02/24 15:45:28
19	NULL	337.73701806888556	270.34580290420837	21/02/24 15:45:29
19	919	340.2475697813879	268.6028650417705	21/02/24 15:45:30
19	919	341.8507959684553	269.41861351939014	21/02/24 15:45:31
19	904	347.2575875056375	270.59329170523137	21/02/24 15:45:32
19	904	347.25758750563756	270.59329170523137	21/02/24 15:45:33
19	904	353.3309852064064	273.01348317021734	21/02/24 15:45:34
19	968	355.71807547868275	279.11092240486005	21/02/24 15:45:35
19	964	355.482293890607	282.3613173869535	21/02/24 15:45:36
19	964	355.482293890607	282.3613173869535	21/02/24 15:45:37
19	964	355.482293890607	282.3613173869535	21/02/24 15:45:38
19	964	355.482293890607	282.3613173869535	21/02/24 15:45:39
19	990	357.82242061436574	282.16385269148645	21/02/24 15:45:40
19	918	358.31519680311567	286.86252054896266	21/02/24 15:45:41
19	NULL	361.8602798513784	283.01660848074425	21/02/24 15:45:42
19	958	365.44482048462646	284.4407937731175	21/02/24 15:45:43
19	910	371.49991506597235	283.64243362381774	21/02/24 15:45:44
19	910	371.49991506597235	283.6424336238178	21/02/24 15:45:45
19	990	373.5702263177357	281.590961967497	21/02/24 15:45:46
19	990	373.5702263177357	281.5909619674969	21/02/24 15:45:47
19	905	375.09542798338026	284.54571340969284	21/02/24 15:45:48
19	905	375.148476413878	287.03143447263193	21/02/24 15:45:49
19	905	375.1484764138781	287.03143447263193	21/02/24 15:45:50
19	905	375.1484764138781	287.03143447263193	21/02/24 15:45:51
19	905	375.1484764138781	287.03143447263193	21/02/24 15:45:52
19	905	375.1484764138781	287.03143447263193	21/02/24 15:45:53
19	905	375.1484764138781	287.03143447263193	21/02/24 15:45:54
19	905	375.1484764138781	287.03143447263193	21/02/24 15:45:55
19	905	375.1484764138781	287.03143447263193	21/02/24 15:45:56
19	905	375.1484764138781	287.03143447263193	21/02/24 15:45:57
19	905	375.1484764138781	287.03143447263193	21/02/24 15:45:58
19	905	375.1484764138781	287.03143447263193	21/02/24 15:45:59
19	905	375.1484764138781	287.03143447263193	21/02/24 15:46:00
19	905	375.1484764138781	287.03143447263193	21/02/24 15:46:01
19	905	375.1484764138781	287.03143447263193	21/02/24 15:46:02
19	905	375.1484764138781	287.03143447263193	21/02/24 15:46:03
19	905	375.1484764138781	287.03143447263193	21/02/24 15:46:04
19	905	375.1484764138781	287.03143447263193	21/02/24 15:46:05
19	905	375.09542798338026	284.54571340969284	21/02/24 15:46:06
