floorId	partitionId	location_x	location_y	timeStamp
1	97	336.53585426801055	287.8812247794712	20/04/28 05:11:56
1	97	336.53585426801055	287.8812247794712	20/04/28 05:11:57
1	97	340.7799935809384	292.30431416119154	20/04/28 05:11:58
1	83	342.32913392331176	290.4294111815877	20/04/28 05:11:59
1	97	340.37782042758784	289.0677806668841	20/04/28 05:12:00
1	83	342.32913392331176	290.4294111815877	20/04/28 05:12:01
1	97	339.4305406561234	290.4854027362428	20/04/28 05:12:02
1	83	341.6120769666634	289.98836893199035	20/04/28 05:12:03
1	97	340.37782042758784	289.0677806668841	20/04/28 05:12:04
1	83	342.32913392331176	290.4294111815877	20/04/28 05:12:05
1	83	342.32913392331176	290.4294111815877	20/04/28 05:12:07
1	83	342.55544985905226	291.2309163740584	20/04/28 05:12:08
1	83	342.55544985905226	291.2309163740584	20/04/28 05:12:09
1	83	341.6120769666634	289.98836893199035	20/04/28 05:12:10
1	97	336.53585426801055	287.8812247794712	20/04/28 05:12:11
1	83	341.6120769666634	289.98836893199035	20/04/28 05:12:12
1	83	342.32913392331176	290.4294111815877	20/04/28 05:12:13
1	83	342.32913392331176	290.4294111815877	20/04/28 05:12:14
1	83	342.32913392331176	290.4294111815877	20/04/28 05:12:15
1	83	343.5240734539748	289.5423380190998	20/04/28 05:12:16
1	83	342.32913392331176	290.4294111815877	20/04/28 05:12:17
1	97	338.4871677637345	289.2428552941747	20/04/28 05:12:18
1	97	340.629387065862	286.9381600623282	20/04/28 05:12:19
1	97	339.66076347093946	288.6267384172868	20/04/28 05:12:20
1	97	339.4344475351989	287.82523322481603	20/04/28 05:12:21
1	97	336.53585426801055	287.8812247794712	20/04/28 05:12:22
1	97	339.4344475351989	287.82523322481603	20/04/28 05:12:23
1	97	340.37782042758784	289.0677806668841	20/04/28 05:12:24
1	97	339.66076347093946	288.6267384172868	20/04/28 05:12:25
1	97	340.629387065862	286.9381600623282	20/04/28 05:12:26
1	83	343.7249323535639	286.8643675666835	20/04/28 05:12:27
1	9	339.74889046835307	281.85967503514354	20/04/28 05:12:28
1	9	339.74889046835307	281.85967503514354	20/04/28 05:12:29
1	83	341.3536088153646	278.57546762722654	20/04/28 05:12:30
1	7	339.13766985621356	279.10032233866974	20/04/28 05:12:31
1	9	340.5552095102039	281.0461193124156	20/04/28 05:12:32
1	83	341.3536088153646	278.57546762722654	20/04/28 05:12:33
1	83	341.3536088153646	278.57546762722654	20/04/28 05:12:34
1	83	342.14651366105164	278.29653465123357	20/04/28 05:12:35
1	9	340.5552095102039	281.0461193124156	20/04/28 05:12:36
1	83	341.3536088153646	278.57546762722654	20/04/28 05:12:37
1	7	339.13766985621356	279.10032233866974	20/04/28 05:12:38
1	9	340.5552095102039	281.0461193124156	20/04/28 05:12:39
1	9	340.5552095102039	281.0461193124156	20/04/28 05:12:40
1	83	341.3536088153646	278.57546762722654	20/04/28 05:12:41
1	83	341.3536088153646	278.57546762722654	20/04/28 05:12:42
1	7	339.13766985621356	279.10032233866974	20/04/28 05:12:43
1	83	341.3536088153646	278.57546762722654	20/04/28 05:12:44
1	7	339.13766985621356	279.10032233866974	20/04/28 05:12:45
1	9	340.5552095102039	281.0461193124156	20/04/28 05:12:46
1	83	341.3536088153646	278.57546762722654	20/04/28 05:12:47
1	83	341.3536088153646	278.57546762722654	20/04/28 05:12:48
1	83	341.3536088153646	278.57546762722654	20/04/28 05:12:49
1	83	341.3536088153646	278.57546762722654	20/04/28 05:12:50
1	83	341.3536088153646	278.57546762722654	20/04/28 05:12:51
1	7	339.13766985621356	279.10032233866974	20/04/28 05:12:52
1	9	340.5552095102039	281.0461193124156	20/04/28 05:12:53
1	83	341.3536088153646	278.57546762722654	20/04/28 05:12:54
1	83	341.3536088153646	278.57546762722654	20/04/28 05:12:55
1	9	340.5552095102039	281.0461193124156	20/04/28 05:12:56
1	7	339.13766985621356	279.10032233866974	20/04/28 05:12:57
1	9	340.5552095102039	281.0461193124156	20/04/28 05:12:58
1	83	341.3536088153646	278.57546762722654	20/04/28 05:12:59
1	83	341.3536088153646	278.57546762722654	20/04/28 05:13:00
1	7	339.13766985621356	279.10032233866974	20/04/28 05:13:01
1	83	341.3536088153646	278.57546762722654	20/04/28 05:13:02
1	83	341.3536088153646	278.57546762722654	20/04/28 05:13:03
1	7	339.13766985621356	279.10032233866974	20/04/28 05:13:04
1	9	339.74889046835307	281.85967503514354	20/04/28 05:13:05
1	83	342.84443575605496	281.7858825394988	20/04/28 05:13:06
1	83	341.3536088153646	278.57546762722654	20/04/28 05:13:07
1	83	341.3536088153646	278.57546762722654	20/04/28 05:13:08
1	83	342.84443575605496	281.7858825394988	20/04/28 05:13:09
1	83	341.3536088153646	278.57546762722654	20/04/28 05:13:10
1	83	342.14651366105164	278.29653465123357	20/04/28 05:13:11
1	83	341.3536088153646	278.57546762722654	20/04/28 05:13:12
1	9	340.5552095102039	281.0461193124156	20/04/28 05:13:13
1	83	341.3536088153646	278.57546762722654	20/04/28 05:13:14
1	7	339.13766985621356	279.10032233866974	20/04/28 05:13:15
1	83	341.3536088153646	278.57546762722654	20/04/28 05:13:16
1	83	341.3536088153646	278.57546762722654	20/04/28 05:13:17
1	83	341.3536088153646	278.57546762722654	20/04/28 05:13:18
1	83	341.3536088153646	278.57546762722654	20/04/28 05:13:19
1	83	341.3536088153646	278.57546762722654	20/04/28 05:13:20
1	9	340.5552095102039	281.0461193124156	20/04/28 05:13:21
1	83	341.3536088153646	278.57546762722654	20/04/28 05:13:22
1	83	341.3536088153646	278.57546762722654	20/04/28 05:13:23
1	83	341.3536088153646	278.57546762722654	20/04/28 05:13:24
1	83	341.3536088153646	278.57546762722654	20/04/28 05:13:25
1	83	341.3536088153646	278.57546762722654	20/04/28 05:13:26
1	83	341.3536088153646	278.57546762722654	20/04/28 05:13:27
1	83	342.14651366105164	278.29653465123357	20/04/28 05:13:28
1	83	341.3536088153646	278.57546762722654	20/04/28 05:13:29
1	83	341.3536088153646	278.57546762722654	20/04/28 05:13:30
1	83	341.3536088153646	278.57546762722654	20/04/28 05:13:31
1	83	341.3536088153646	278.57546762722654	20/04/28 05:13:32
1	83	341.3536088153646	278.57546762722654	20/04/28 05:13:33
