floorId	partitionId	location_x	location_y	timeStamp
19	955	324.5428020167151	277.91909661811553	21/02/24 15:47:21
19	955	323.9884222877308	280.17133116751256	21/02/24 15:47:22
19	955	325.8767227240101	280.18515979393715	21/02/24 15:47:23
19	955	328.92321811554416	278.4499778858854	21/02/24 15:47:24
19	955	328.92321811554416	278.4499778858854	21/02/24 15:47:25
19	955	328.92321811554416	278.4499778858854	21/02/24 15:47:26
19	955	331.57961022726676	277.2385535448373	21/02/24 15:47:27
19	955	331.57961022726676	277.2385535448373	21/02/24 15:47:28
19	915	336.54156488011523	280.3558442180772	21/02/24 15:47:29
19	964	340.04388943277826	286.2192342684243	21/02/24 15:47:30
19	940	347.9711572177418	278.13370891448585	21/02/24 15:47:31
19	964	349.72234002988336	284.71465847817086	21/02/24 15:47:32
19	964	355.482293890607	282.3613173869535	21/02/24 15:47:33
19	964	355.482293890607	282.3613173869535	21/02/24 15:47:34
19	964	355.482293890607	282.3613173869535	21/02/24 15:47:35
19	964	355.482293890607	282.3613173869535	21/02/24 15:47:36
19	990	357.82242061436574	282.16385269148645	21/02/24 15:47:37
19	NULL	360.5547106147948	283.12207921272073	21/02/24 15:47:38
19	959	362.3530560401282	287.71527633822046	21/02/24 15:47:39
19	959	362.3530560401282	287.71527633822046	21/02/24 15:47:40
19	959	362.3530560401282	287.71527633822046	21/02/24 15:47:41
19	959	362.3530560401282	287.71527633822046	21/02/24 15:47:42
19	959	362.3530560401282	287.71527633822046	21/02/24 15:47:43
19	959	362.3530560401282	287.71527633822046	21/02/24 15:47:44
19	959	362.3530560401282	287.71527633822046	21/02/24 15:47:45
19	959	362.3530560401282	287.71527633822046	21/02/24 15:47:46
19	959	362.3530560401282	287.71527633822046	21/02/24 15:47:47
19	959	362.3530560401282	287.71527633822046	21/02/24 15:47:48
19	959	362.3530560401282	287.71527633822046	21/02/24 15:47:49
19	959	362.3530560401282	287.71527633822046	21/02/24 15:47:50
19	959	362.3530560401282	287.71527633822046	21/02/24 15:47:51
19	959	362.3530560401282	287.71527633822046	21/02/24 15:47:52
19	959	362.3530560401282	287.71527633822046	21/02/24 15:47:53
19	959	362.3530560401282	287.71527633822046	21/02/24 15:47:54
19	959	362.3530560401282	287.71527633822046	21/02/24 15:47:55
19	958	365.55243192741585	288.59648801263694	21/02/24 15:47:56
19	958	365.55243192741585	288.59648801263694	21/02/24 15:47:57
19	959	362.3530560401282	287.71527633822046	21/02/24 15:47:58
19	959	362.3530560401282	287.71527633822046	21/02/24 15:47:59
