floorId	partitionId	location_x	location_y	timeStamp
18	982	373.47877411950606	288.3912237140066	21/02/24 15:38:00
18	982	373.50007541449287	288.418145653865	21/02/24 15:38:00
18	982	373.5683376675939	288.3745120705565	21/02/24 15:38:00
18	982	373.5905620182408	288.24789142515107	21/02/24 15:38:00
18	982	373.6531821292327	288.273206951942	21/02/24 15:38:00
18	982	373.60723361385317	288.29021319391234	21/02/24 15:38:00
18	982	373.6113944163424	288.240855021358	21/02/24 15:38:00
18	982	373.5452472365426	288.0518782989388	21/02/24 15:38:00
18	982	373.3099423025472	287.98090799401723	21/02/24 15:38:00
18	982	373.14783681160304	287.94355637854505	21/02/24 15:38:00
18	982	373.13606466644256	287.96044053706214	21/02/24 15:38:01
18	982	373.13862918447546	287.9258605496366	21/02/24 15:38:01
18	982	373.09203135940703	287.87130068462477	21/02/24 15:38:01
18	982	373.05332507668487	287.94748893832764	21/02/24 15:38:01
18	982	373.09141659850286	288.2244470610636	21/02/24 15:38:01
18	982	373.0717893900135	288.21425052057657	21/02/24 15:38:01
18	982	373.2229567110356	288.1439043171056	21/02/24 15:38:01
18	982	373.5131792697925	288.1063237957693	21/02/24 15:38:01
18	982	373.49042972754427	288.0892950099649	21/02/24 15:38:01
18	982	373.6048211861605	288.08275616563895	21/02/24 15:38:01
18	982	373.65229595037835	287.83173809456787	21/02/24 15:38:02
18	982	373.68944797390355	287.83896859613685	21/02/24 15:38:02
18	982	373.8387789225252	287.9998618418021	21/02/24 15:38:02
18	982	373.8220898469512	288.16105654048823	21/02/24 15:38:02
18	982	373.85033690824326	287.93758008583	21/02/24 15:38:02
18	982	373.8082497142209	287.7918354269064	21/02/24 15:38:02
18	982	373.99486233304884	287.74252203727303	21/02/24 15:38:02
18	982	374.01207511998376	287.5748249005299	21/02/24 15:38:02
18	982	374.0587312921743	287.42075798770765	21/02/24 15:38:02
18	982	373.88178788178556	287.62730843865245	21/02/24 15:38:03
18	982	373.87676454992896	287.9146901901196	21/02/24 15:38:03
18	982	373.74778647073515	288.10398774874307	21/02/24 15:38:03
18	982	373.7117568522939	287.89900989234036	21/02/24 15:38:03
18	982	373.6617814746533	287.9708971483803	21/02/24 15:38:03
18	982	373.6804490431524	288.1262280373217	21/02/24 15:38:03
18	982	373.7844973329839	288.29913454172487	21/02/24 15:38:03
18	982	373.92052584769726	288.37717720074414	21/02/24 15:38:03
18	982	373.7902282640809	288.38867749506625	21/02/24 15:38:03
18	982	373.80761884018204	288.31648470777935	21/02/24 15:38:03
18	982	373.63836308953194	288.42094247105473	21/02/24 15:38:04
18	982	373.7457590142599	288.39602066665094	21/02/24 15:38:04
18	982	373.4927955817774	288.4939799059395	21/02/24 15:38:04
18	982	373.5163959308472	288.5587740861536	21/02/24 15:38:04
18	982	373.636988277553	288.3140035982284	21/02/24 15:38:04
18	982	373.6108640755018	288.2912729844503	21/02/24 15:38:04
18	982	373.8440360967682	288.3154224913932	21/02/24 15:38:04
18	982	373.952154776147	288.53568080805843	21/02/24 15:38:04
18	982	373.7689830848201	288.77182232659374	21/02/24 15:38:04
18	982	373.78923685993766	288.57971288420885	21/02/24 15:38:05
18	982	373.54317539512664	288.52252719577933	21/02/24 15:38:05
18	982	373.4319293561183	288.291793595992	21/02/24 15:38:05
18	982	373.66225038023435	288.286090667315	21/02/24 15:38:05
18	982	373.6620071343833	288.29246452051024	21/02/24 15:38:05
18	982	373.76616401178	288.1916220507017	21/02/24 15:38:05
18	982	373.7525792204117	288.21717813864353	21/02/24 15:38:05
18	982	373.63199139298223	288.37053012355955	21/02/24 15:38:05
18	982	373.52110415354053	288.6480762763665	21/02/24 15:38:05
18	982	373.68442894219373	288.5192542674771	21/02/24 15:38:05
18	982	373.90863241423745	288.383251137649	21/02/24 15:38:06
18	982	373.8540192755809	288.33768114859976	21/02/24 15:38:06
18	982	373.8580228072947	288.350507147775	21/02/24 15:38:06
18	982	373.6985743307396	288.1986209834303	21/02/24 15:38:06
18	982	373.6556443948635	288.0189378676682	21/02/24 15:38:06
18	982	373.45981814362364	287.9696757713592	21/02/24 15:38:06
18	982	373.5061292946479	287.9908204990873	21/02/24 15:38:06
18	982	373.5044201782901	288.06721494989796	21/02/24 15:38:06
18	982	373.60586988490417	288.08950409714794	21/02/24 15:38:06
18	982	373.61068143517366	288.15465870643294	21/02/24 15:38:06
18	982	373.38915896094034	288.02889736619375	21/02/24 15:38:07
18	982	373.6773671177889	288.2017045209144	21/02/24 15:38:07
18	982	373.6707817522957	288.3716012845044	21/02/24 15:38:07
18	982	373.6698184764568	288.3691292025421	21/02/24 15:38:07
18	982	373.6698184764568	288.3691292025421	21/02/24 15:38:07
18	982	373.6692171799278	288.5388806162681	21/02/24 15:38:07
18	982	373.8599410374043	288.3871772492784	21/02/24 15:38:07
18	982	373.7869418213121	288.2553211735057	21/02/24 15:38:07
18	982	373.6521962136194	288.16333738705765	21/02/24 15:38:07
18	982	373.6123206059315	288.1534666144371	21/02/24 15:38:08
18	982	373.76650225659046	288.1738420201003	21/02/24 15:38:08
18	982	373.8139064866326	288.09401310517285	21/02/24 15:38:08
18	982	373.8139064866326	288.09401310517285	21/02/24 15:38:08
18	982	373.8627795385697	288.2026616200011	21/02/24 15:38:08
18	982	374.0785059209037	288.33450346240176	21/02/24 15:38:08
18	982	374.0796176894212	288.33391105654874	21/02/24 15:38:08
18	982	374.16448765598733	288.33515882982596	21/02/24 15:38:08
18	982	374.0369997083803	288.23220766905894	21/02/24 15:38:08
18	982	374.1899234521234	288.08634018776456	21/02/24 15:38:08
18	982	374.36762283240637	288.3237072968605	21/02/24 15:38:09
18	982	374.3454434282756	288.04432254889633	21/02/24 15:38:09
18	982	374.36950946329057	288.0365798034881	21/02/24 15:38:09
18	982	374.2472981207287	288.096591402466	21/02/24 15:38:09
18	982	374.26274940199215	288.1136205042519	21/02/24 15:38:09
18	982	374.50218283844765	287.9742316353508	21/02/24 15:38:09
18	982	374.53013221021376	287.9676074005889	21/02/24 15:38:09
18	982	374.6014707953238	287.90856822900116	21/02/24 15:38:09
18	982	374.6079787896468	288.0224645927991	21/02/24 15:38:09
18	982	374.8404447361826	288.0176664482329	21/02/24 15:38:09
18	982	374.83964149325067	287.9685702429795	21/02/24 15:38:10
18	982	374.8754683167975	288.1304092492157	21/02/24 15:38:10
18	982	374.7680643516216	288.0082385236798	21/02/24 15:38:10
18	982	374.58861183983583	287.8162148278895	21/02/24 15:38:10
18	982	374.8546629911158	287.7242586515129	21/02/24 15:38:10
18	982	374.9287173406295	287.7065358048229	21/02/24 15:38:10
18	982	375.08903593125626	287.5543604984035	21/02/24 15:38:10
18	982	375.04052504902313	287.67719496303255	21/02/24 15:38:10
18	982	375.0011177371407	287.6159170317158	21/02/24 15:38:10
18	982	374.82973187623634	287.8297577822144	21/02/24 15:38:10
18	982	374.94782222729015	287.6978202921765	21/02/24 15:38:11
18	982	374.77134515137465	287.8164196854636	21/02/24 15:38:11
18	982	374.86434671786776	287.7578142189806	21/02/24 15:38:11
18	982	374.99953096401237	287.6039708667864	21/02/24 15:38:11
18	982	375.1891649686155	287.3958584119058	21/02/24 15:38:11
18	982	375.0964425844196	287.4105123839149	21/02/24 15:38:11
18	982	375.34195373625914	287.3221587629243	21/02/24 15:38:11
18	982	375.4333735927664	287.37237258585515	21/02/24 15:38:11
18	982	375.4952221475268	287.5517307006179	21/02/24 15:38:11
18	982	375.4952221475268	287.5517307006179	21/02/24 15:38:12
18	982	375.4583582450424	287.48518277904026	21/02/24 15:38:12
18	982	375.55929948024635	287.60326275965804	21/02/24 15:38:12
18	982	375.5755913269297	287.6553278163879	21/02/24 15:38:12
18	982	375.6561089487046	287.66108738575946	21/02/24 15:38:12
18	982	375.6561089487046	287.66108738575946	21/02/24 15:38:12
18	982	375.5658678608757	287.5460483660086	21/02/24 15:38:12
18	982	375.50983649353356	287.4128680857862	21/02/24 15:38:12
18	982	375.64005332642483	287.43377756722515	21/02/24 15:38:12
18	982	375.47490218105634	287.6231245515677	21/02/24 15:38:12
18	982	375.47365963955593	287.67946428262377	21/02/24 15:38:13
18	982	375.58375675976436	287.6527848728896	21/02/24 15:38:13
18	982	375.7188073529822	287.6664037507538	21/02/24 15:38:13
18	982	375.73034570240077	287.6842467113288	21/02/24 15:38:13
18	982	375.8783821998705	287.7281911314373	21/02/24 15:38:13
18	982	375.9640532834763	287.7088453704428	21/02/24 15:38:13
18	982	376.0266155052713	287.4664429485522	21/02/24 15:38:13
18	982	375.9160718440209	287.43045883025195	21/02/24 15:38:13
18	982	375.8582366457839	287.42610171911815	21/02/24 15:38:13
18	982	375.66566434846777	287.4321684051932	21/02/24 15:38:13
18	982	375.58953183890986	287.47467627758994	21/02/24 15:38:14
18	982	375.4863168002431	287.7018001076692	21/02/24 15:38:14
18	982	375.4863168002431	287.7018001076692	21/02/24 15:38:14
18	982	375.4839403412476	287.70799758022133	21/02/24 15:38:14
18	982	375.6035989436241	287.60002212731274	21/02/24 15:38:14
18	982	375.6035989436241	287.60002212731274	21/02/24 15:38:14
18	982	375.72746673682974	287.5733367786783	21/02/24 15:38:14
18	982	375.84241993583504	287.55238472402567	21/02/24 15:38:14
18	982	375.84241993583504	287.55238472402567	21/02/24 15:38:14
18	982	375.84241993583504	287.55238472402567	21/02/24 15:38:15
18	982	375.3874728734261	287.4625564557179	21/02/24 15:38:15
18	982	375.3874728734261	287.4625564557179	21/02/24 15:38:15
18	982	375.22855446315884	287.43117837511016	21/02/24 15:38:15
18	982	374.9417236458192	287.37454427908483	21/02/24 15:38:15
18	982	374.7609982531947	287.3388604591416	21/02/24 15:38:15
18	982	374.5045026288104	287.28821597834207	21/02/24 15:38:15
18	982	374.2565176421125	287.2392519037013	21/02/24 15:38:15
18	982	374.0121226129526	287.1909966580553	21/02/24 15:38:15
18	982	373.83788506798385	287.15659384895514	21/02/24 15:38:15
18	982	373.5572148362204	287.10117614661556	21/02/24 15:38:16
18	982	373.2764674114267	287.04574320268677	21/02/24 15:38:16
18	982	373.0096196931003	286.9930547243565	21/02/24 15:38:16
18	982	372.54128305486637	286.90058271459156	21/02/24 15:38:16
18	982	372.2972836128023	286.8524055767228	21/02/24 15:38:16
18	982	372.2972836128023	286.8524055767228	21/02/24 15:38:16
18	982	372.0236626538094	286.79837973734516	21/02/24 15:38:16
18	982	371.86426743658103	286.76690751228153	21/02/24 15:38:16
18	982	371.654623200407	286.72551373209865	21/02/24 15:38:16
18	982	371.37744344693704	286.6707852168021	21/02/24 15:38:16
18	982	371.1557234454994	286.62700710408524	21/02/24 15:38:17
18	982	370.9358165462415	286.58358698429225	21/02/24 15:38:17
18	982	370.7709789622924	286.55104017623114	21/02/24 15:38:17
18	982	370.5495601782818	286.5073215382139	21/02/24 15:38:17
18	982	370.29132522887437	286.4563336316232	21/02/24 15:38:17
18	982	370.0295417270091	286.4046450713771	21/02/24 15:38:17
18	982	369.80460711848235	286.3602322417625	21/02/24 15:38:17
18	982	369.5588509515845	286.3117082425493	21/02/24 15:38:17
18	982	369.2818718885343	286.25701935312213	21/02/24 15:38:17
18	982	369.07453493985724	286.21608114163604	21/02/24 15:38:18
18	982	368.87865274710373	286.1774046457945	21/02/24 15:38:18
18	982	368.63348047568877	286.1289959354235	21/02/24 15:38:18
18	982	368.46016980042697	286.09477613465026	21/02/24 15:38:18
18	982	368.46016980042697	286.09477613465026	21/02/24 15:38:18
18	982	368.2533589744627	286.0539418049036	21/02/24 15:38:18
18	982	368.0122101281897	286.00632751072527	21/02/24 15:38:18
18	982	367.7573793870795	285.956011757362	21/02/24 15:38:18
18	982	367.5489930963095	285.91486635565343	21/02/24 15:38:18
18	982	367.3451501811378	285.8746180331789	21/02/24 15:38:18
18	982	367.1340326941555	285.8329333629566	21/02/24 15:38:19
18	982	366.89364908770744	285.7854701636506	21/02/24 15:38:19
18	982	366.89364908770744	285.7854701636506	21/02/24 15:38:19
18	982	366.66187899540864	285.7397076832282	21/02/24 15:38:19
18	982	366.5089097139032	285.70950424463655	21/02/24 15:38:19
18	982	366.2489479824847	285.65817538884403	21/02/24 15:38:19
18	982	366.0443759231261	285.6177830984992	21/02/24 15:38:19
18	982	366.0443759231261	285.6177830984992	21/02/24 15:38:19
18	982	365.79092302737973	285.56773939758614	21/02/24 15:38:19
18	982	365.5133463487007	285.51293251030495	21/02/24 15:38:19
18	982	365.32130273939885	285.4750139340825	21/02/24 15:38:20
18	982	365.1544830981812	285.44207577329746	21/02/24 15:38:20
18	982	364.8767316465151	285.38723437748536	21/02/24 15:38:20
18	982	364.70528935408606	285.3533834846758	21/02/24 15:38:20
18	982	364.70528935408606	285.3533834846758	21/02/24 15:38:20
18	982	364.5376529294763	285.3202840518577	21/02/24 15:38:20
18	982	364.2994359848034	285.2732486550178	21/02/24 15:38:20
18	982	363.8420130226969	285.1829315259157	21/02/24 15:38:20
18	982	363.6434840487278	285.1437324291106	21/02/24 15:38:20
18	982	363.39977631577506	285.095612888546	21/02/24 15:38:21
18	982	363.1267194162624	285.0416984214367	21/02/24 15:38:21
18	982	363.1267194162624	285.0416984214367	21/02/24 15:38:21
18	982	362.9622250841253	285.0092193876694	21/02/24 15:38:21
18	982	362.7662228762135	284.97051919510636	21/02/24 15:38:21
18	982	362.5559140096765	284.9289941851618	21/02/24 15:38:21
18	982	362.38210646154283	284.894676277964	21/02/24 15:38:21
18	982	361.92766857119534	284.8049485445279	21/02/24 15:38:21
18	982	361.92766857119534	284.8049485445279	21/02/24 15:38:21
18	982	361.67165667620407	284.7543995750028	21/02/24 15:38:21
18	982	361.67165667620407	284.7543995750028	21/02/24 15:38:22
18	982	361.50687950064554	284.7218646944418	21/02/24 15:38:22
18	982	361.33533638694445	284.6879938947002	21/02/24 15:38:22
18	982	361.1341130053494	284.64826279320454	21/02/24 15:38:22
18	982	360.8495452025354	284.59207552427796	21/02/24 15:38:22
18	982	360.6471546247151	284.55211396252804	21/02/24 15:38:22
18	982	360.39232942193837	284.5017993026962	21/02/24 15:38:22
18	982	360.24485922431495	284.47268164577724	21/02/24 15:38:22
18	982	360.0012591332959	284.4245833588689	21/02/24 15:38:22
18	982	359.8471921190978	284.3941631754404	21/02/24 15:38:22
18	982	359.69875391608974	284.364854388048	21/02/24 15:38:23
18	982	359.48124685370016	284.3219081106158	21/02/24 15:38:23
18	982	359.2141415630336	284.2691687752097	21/02/24 15:38:23
18	982	358.923526609204	284.2117875099948	21/02/24 15:38:23
18	982	358.7512027870681	284.1777625611388	21/02/24 15:38:23
18	982	358.55993403760345	284.13999697923833	21/02/24 15:38:23
18	982	358.29701113387836	284.08808344667256	21/02/24 15:38:23
18	982	358.10740035174166	284.0506452266704	21/02/24 15:38:23
18	982	357.9573436554319	284.02101687143687	21/02/24 15:38:23
18	982	357.71305692096706	283.97278300833347	21/02/24 15:38:23
18	982	357.5466252068386	283.93992144287466	21/02/24 15:38:24
18	982	357.38300268464917	283.90761454600937	21/02/24 15:38:24
18	982	357.22926545865016	283.8772594785147	21/02/24 15:38:24
18	982	357.0072334835388	283.83341976730173	21/02/24 15:38:24
18	982	356.80964823784495	283.79440700750973	21/02/24 15:38:24
18	982	356.5271637065098	283.73863107582395	21/02/24 15:38:24
18	982	356.3449270907371	283.70264886828875	21/02/24 15:38:24
18	982	356.15589596659885	283.6653251004471	21/02/24 15:38:24
18	982	355.9372885888967	283.62216156824553	21/02/24 15:38:24
18	982	355.7314035830055	283.58151003957795	21/02/24 15:38:25
18	982	355.4701886705855	283.5299337460316	21/02/24 15:38:25
18	982	355.31565504894957	283.49942143202	21/02/24 15:38:25
18	982	355.1616882386791	283.46902103363027	21/02/24 15:38:25
18	982	354.9507628030684	283.4273742835169	21/02/24 15:38:25
18	982	354.74178568811294	283.3861122249094	21/02/24 15:38:25
18	982	354.5932711660763	283.3567883684975	21/02/24 15:38:25
18	982	354.44477158170366	283.32746746149354	21/02/24 15:38:25
18	982	354.23179592769293	283.285415900395	21/02/24 15:38:25
18	982	354.02684580703584	283.24494896270204	21/02/24 15:38:25
18	982	353.8224166078424	283.2045848797737	21/02/24 15:38:26
18	982	353.5872578701872	283.1581533189913	21/02/24 15:38:26
18	982	353.40426449050113	283.12202169013335	21/02/24 15:38:26
18	982	353.1846463760259	283.0786585902424	21/02/24 15:38:26
18	982	352.9780175637097	283.03786019867886	21/02/24 15:38:26
18	982	352.7347393007661	282.98982545599597	21/02/24 15:38:26
18	982	352.57621859806375	282.9585259018472	21/02/24 15:38:26
18	982	352.3626638737297	282.9163600046233	21/02/24 15:38:26
18	982	352.15271290472776	282.8749056607374	21/02/24 15:38:26
18	982	351.9286434896892	282.8306636616198	21/02/24 15:38:26
18	982	351.66267035510043	282.7781478678701	21/02/24 15:38:27
18	982	351.46247073256137	282.7386189052841	21/02/24 15:38:27
18	982	351.20622146059407	282.68802306621205	21/02/24 15:38:27
18	982	351.0233015192463	282.65190593758786	21/02/24 15:38:27
18	982	350.7428427455236	282.59652998716007	21/02/24 15:38:27
18	982	350.5049526795414	282.54955913177827	21/02/24 15:38:27
18	982	350.2258230776068	282.49444562331325	21/02/24 15:38:27
18	982	349.9553640070538	282.4410440916554	21/02/24 15:38:27
18	982	349.69714109661504	282.39005856213186	21/02/24 15:38:27
18	982	349.5128052920945	282.3536618745271	21/02/24 15:38:28
18	982	349.2384995323739	282.2995008227949	21/02/24 15:38:28
18	982	349.0864429516482	282.2694775949076	21/02/24 15:38:28
18	982	348.9250390369078	282.2376087570642	21/02/24 15:38:28
18	982	348.7555266476564	282.2041389192714	21/02/24 15:38:28
18	982	348.4685994219976	282.14748578764153	21/02/24 15:38:28
18	982	348.2508104857474	282.10448385485324	21/02/24 15:38:28
18	982	347.9764869227145	282.0503192878973	21/02/24 15:38:28
18	982	347.79255940682447	282.01400321595906	21/02/24 15:38:28
18	982	347.5594314579592	281.96797262982926	21/02/24 15:38:28
18	982	347.392718389014	281.9350555114983	21/02/24 15:38:29
18	982	347.1120056752183	281.8796294211776	21/02/24 15:38:29
18	982	346.9478423650074	281.8472157469408	21/02/24 15:38:29
18	982	346.76947603450617	281.8119977184772	21/02/24 15:38:29
18	982	346.5867435572171	281.7759176042073	21/02/24 15:38:29
18	982	346.39637796079535	281.738330347832	21/02/24 15:38:29
18	982	346.11658912212374	281.68308667456455	21/02/24 15:38:29
18	982	345.95647984290093	281.65147345957547	21/02/24 15:38:29
18	982	345.750843392929	281.6108710077119	21/02/24 15:38:29
18	982	345.28727622469887	281.51934071900985	21/02/24 15:38:30
18	982	345.0543218852494	281.4733444116665	21/02/24 15:38:30
18	982	345.0543218852494	281.4733444116665	21/02/24 15:38:30
18	982	344.76449221156446	281.4161181982397	21/02/24 15:38:30
18	982	344.51839636887024	281.3675271308089	21/02/24 15:38:30
18	982	344.27544140839086	281.31955622346624	21/02/24 15:38:30
18	982	343.9838205047682	281.26197633574026	21/02/24 15:38:30
18	982	343.75271798945727	281.2163456668839	21/02/24 15:38:30
18	982	343.45922212268334	281.1583955719252	21/02/24 15:38:30
18	982	343.30275877004266	281.1275022368921	21/02/24 15:38:30
18	982	343.01619463884856	281.0709207974429	21/02/24 15:38:31
18	982	342.73852170359527	281.01609490451887	21/02/24 15:38:31
18	982	342.44783353563736	280.9586991833399	21/02/24 15:38:31
18	982	342.259345605146	280.921482667855	21/02/24 15:38:31
18	982	342.0846939614404	280.886998095896	21/02/24 15:38:31
18	982	341.8768345990289	280.8459567349998	21/02/24 15:38:31
18	982	341.65136651996227	280.8014385728339	21/02/24 15:38:31
18	982	341.50296751971285	280.7721375259375	21/02/24 15:38:31
18	982	341.27303288431506	280.7267374523281	21/02/24 15:38:31
18	982	341.0461040900678	280.6819308752542	21/02/24 15:38:31
18	979	341.03188768150136	280.66247224501615	21/02/24 15:38:32
18	979	341.2583694910075	280.66247224501615	21/02/24 15:38:32
18	979	341.4133241743007	280.66247224501615	21/02/24 15:38:32
18	979	341.6158721072138	280.66247224501615	21/02/24 15:38:32
18	979	341.84485423290977	280.66247224501615	21/02/24 15:38:32
18	979	341.84485423290977	280.66247224501615	21/02/24 15:38:32
18	979	342.0878524376929	280.66247224501615	21/02/24 15:38:32
18	979	342.24016325710005	280.66247224501615	21/02/24 15:38:32
18	982	342.10425479837	280.5864349629194	21/02/24 15:38:32
18	982	341.89560379752163	280.47077011235046	21/02/24 15:38:33
18	982	341.6449355930032	280.3318131924214	21/02/24 15:38:33
18	982	341.4867459709254	280.24412140601834	21/02/24 15:38:33
18	982	341.2484023704301	280.11199658119955	21/02/24 15:38:33
18	982	341.1130807981848	280.0369816070616	21/02/24 15:38:33
18	982	340.9038386761219	279.9209890708038	21/02/24 15:38:33
18	982	340.74417364366946	279.832479396541	21/02/24 15:38:33
18	982	340.4901508396175	279.69166286773304	21/02/24 15:38:33
18	982	340.3343856542553	279.6053150581587	21/02/24 15:38:33
18	982	340.1824963617944	279.52111583436357	21/02/24 15:38:33
18	982	339.9230712794261	279.37730457410623	21/02/24 15:38:34
18	982	339.70727773131847	279.25768028093665	21/02/24 15:38:34
18	982	339.57103590047797	279.18215516511486	21/02/24 15:38:34
18	982	339.57103590047797	279.18215516511486	21/02/24 15:38:34
18	982	339.3483496495736	279.0587099296265	21/02/24 15:38:34
18	982	339.16027038261734	278.954448937735	21/02/24 15:38:34
18	982	338.921113258722	278.8218731394624	21/02/24 15:38:34
18	982	338.7243616184985	278.71280465202113	21/02/24 15:38:34
18	982	338.56909671524784	278.626734171841	21/02/24 15:38:34
18	982	338.3579372202415	278.5096787475353	21/02/24 15:38:34
18	982	338.1108696503573	278.3727178250624	21/02/24 15:38:35
18	982	337.96863545964004	278.2938708684305	21/02/24 15:38:35
18	982	337.71046121332967	278.1507530041556	21/02/24 15:38:35
18	982	337.4771593573968	278.021423050337	21/02/24 15:38:35
18	982	337.31014345441247	277.92883845029786	21/02/24 15:38:35
18	982	337.1165320452913	277.8215107374502	21/02/24 15:38:35
18	982	336.8633486725988	277.6811595440701	21/02/24 15:38:35
18	982	336.71752838332804	277.6003246480004	21/02/24 15:38:35
18	982	336.5789486106464	277.5235035034388	21/02/24 15:38:35
18	982	336.3423046601609	277.3923208728276	21/02/24 15:38:36
18	982	336.0916293895571	277.2533600358423	21/02/24 15:38:36
18	982	335.7424999745245	277.05982153636336	21/02/24 15:38:36
18	982	335.7424999745245	277.05982153636336	21/02/24 15:38:36
18	982	335.52193828427295	276.9375540426037	21/02/24 15:38:36
18	982	335.3437674214197	276.8387857350286	21/02/24 15:38:36
18	979	335.0881385698984	276.69707890020817	21/02/24 15:38:36
18	979	335.04485538451974	276.87427225073026	21/02/24 15:38:36
18	979	334.8572155742231	276.67424667327805	21/02/24 15:38:36
18	979	334.9448739546649	276.6020634535706	21/02/24 15:38:36
18	979	334.9056684089959	276.5802829745634	21/02/24 15:38:37
18	979	334.7317331440808	276.49466512074594	21/02/24 15:38:37
18	979	334.73558178988867	276.49984864923647	21/02/24 15:38:37
18	979	334.5656005983031	276.4782230549527	21/02/24 15:38:37
18	979	334.5656005983031	276.4782230549527	21/02/24 15:38:37
18	979	334.4034711399369	276.59472790473137	21/02/24 15:38:37
18	979	334.33483460943506	276.6211699263751	21/02/24 15:38:37
18	979	334.12896624465526	276.65846862245036	21/02/24 15:38:37
18	979	334.0133278152096	276.43679213352664	21/02/24 15:38:37
18	979	334.13520056349944	276.32363846378826	21/02/24 15:38:38
18	979	334.13520056349944	276.32363846378826	21/02/24 15:38:38
18	979	334.14655362394325	276.46041827954184	21/02/24 15:38:38
18	979	334.0032665401043	276.42291178194614	21/02/24 15:38:38
18	979	334.0032665401043	276.42291178194614	21/02/24 15:38:38
18	979	334.0798152128249	276.3675066650657	21/02/24 15:38:38
18	979	334.0796963917375	276.26537355467843	21/02/24 15:38:38
18	979	334.04976858077106	276.38242223557376	21/02/24 15:38:38
18	979	334.2033272023675	276.42325051123555	21/02/24 15:38:38
18	979	334.21642121524565	276.43170264201285	21/02/24 15:38:38
18	979	334.21642121524565	276.43170264201285	21/02/24 15:38:39
18	979	334.03589734841063	276.38232303634635	21/02/24 15:38:39
18	979	334.03589734841063	276.38232303634635	21/02/24 15:38:39
18	979	334.2421822744184	276.4317949856754	21/02/24 15:38:39
18	979	334.06661005572244	276.60697213006097	21/02/24 15:38:39
18	979	334.031068766811	276.36860616297264	21/02/24 15:38:39
18	979	334.0648068404961	276.516172847071	21/02/24 15:38:39
18	979	333.87927564830153	276.7036599763413	21/02/24 15:38:39
18	979	333.6233384568479	276.72282430494886	21/02/24 15:38:39
18	979	333.6207924046407	276.84384465117915	21/02/24 15:38:40
18	979	333.6207924046407	276.84384465117915	21/02/24 15:38:40
18	979	333.67500823172446	276.8289965321248	21/02/24 15:38:40
18	979	333.69524875628963	276.78964682922924	21/02/24 15:38:40
18	979	333.76944059509685	276.67681823882447	21/02/24 15:38:40
18	979	333.7439678886192	276.71165880000785	21/02/24 15:38:40
18	979	333.80548762864515	276.47908956802974	21/02/24 15:38:40
18	979	333.81334013337477	276.46674184913456	21/02/24 15:38:40
18	979	333.7204137584484	276.7602879384699	21/02/24 15:38:40
18	979	333.72432285809464	276.68455268815705	21/02/24 15:38:40
18	979	333.6264069340846	276.72894528671173	21/02/24 15:38:41
18	979	333.50373015594835	276.592711025672	21/02/24 15:38:41
18	979	333.50373015594835	276.592711025672	21/02/24 15:38:41
18	979	333.50373015594835	276.592711025672	21/02/24 15:38:41
18	979	333.6748131462505	276.6905420754487	21/02/24 15:38:41
18	979	333.8360655005543	276.78275163452093	21/02/24 15:38:41
18	979	334.0730743845954	276.9182813437644	21/02/24 15:38:41
18	979	334.2200934221286	277.0023518101132	21/02/24 15:38:41
18	979	334.47851134400855	277.1501239324849	21/02/24 15:38:41
18	979	334.73474639161896	277.29664781339824	21/02/24 15:38:41
18	979	334.9794052070995	277.436552012602	21/02/24 15:38:42
18	979	335.1568725265602	277.53803383807895	21/02/24 15:38:42
18	979	335.3954693643527	277.674471593074	21/02/24 15:38:42
18	979	335.6132396725503	277.79900003288884	21/02/24 15:38:42
18	979	335.748764074309	277.8764974770883	21/02/24 15:38:42
18	979	335.96242966593405	277.99867870090804	21/02/24 15:38:42
18	979	335.96242966593405	277.99867870090804	21/02/24 15:38:42
18	979	336.14224457886627	278.10150295986335	21/02/24 15:38:42
18	979	336.3715471210767	278.2326259217739	21/02/24 15:38:42
18	979	336.5804492923266	278.3520832604487	21/02/24 15:38:43
18	979	336.7322960921029	278.43891440480223	21/02/24 15:38:43
18	979	336.8730490587258	278.51940171952356	21/02/24 15:38:43
18	979	337.0155497669999	278.60088845213073	21/02/24 15:38:43
18	979	337.24506143423946	278.73213099881764	21/02/24 15:38:43
18	979	337.4929429521042	278.8738780484229	21/02/24 15:38:43
18	979	337.67458507797005	278.97774716963573	21/02/24 15:38:43
18	979	337.8515665624787	279.07895117822807	21/02/24 15:38:43
18	979	338.0658705232457	279.2014974431497	21/02/24 15:38:43
18	979	338.3161845576751	279.34463548813505	21/02/24 15:38:43
18	979	338.57095169416067	279.49031996773755	21/02/24 15:38:44
18	979	338.71574213370394	279.5731160462556	21/02/24 15:38:44
18	979	338.86960204925845	279.66109835841115	21/02/24 15:38:44
18	979	339.1247241075159	279.80698579430674	21/02/24 15:38:44
18	979	339.2928779612209	279.90314186454447	21/02/24 15:38:44
18	979	339.5132574381826	280.02916231545163	21/02/24 15:38:44
18	979	339.6779645900282	280.1233474447993	21/02/24 15:38:44
18	979	339.86169550518144	280.2284110064903	21/02/24 15:38:44
18	979	340.08164184687524	280.3541837759776	21/02/24 15:38:44
18	979	340.2592731964845	280.45575939945047	21/02/24 15:38:44
18	979	340.50496784593776	280.59625592361164	21/02/24 15:38:45
18	979	340.7003260892981	280.66247224501615	21/02/24 15:38:45
18	979	340.91304163842545	280.66247224501615	21/02/24 15:38:45
18	979	341.17625024396995	280.66247224501615	21/02/24 15:38:45
18	979	341.4048411949994	280.66247224501615	21/02/24 15:38:45
18	979	341.7014525515993	280.66247224501615	21/02/24 15:38:45
18	979	341.8953641104165	280.66247224501615	21/02/24 15:38:45
18	982	342.09114760854266	280.666979905171	21/02/24 15:38:45
18	982	342.09114760854266	280.666979905171	21/02/24 15:38:45
18	982	342.09114760854266	280.666979905171	21/02/24 15:38:45
18	982	342.3590487632213	280.74705524083004	21/02/24 15:38:46
18	982	342.5209570983831	280.79544944913283	21/02/24 15:38:46
18	982	342.6787509783886	280.8426138516959	21/02/24 15:38:46
18	982	342.8536322463312	280.8948856541365	21/02/24 15:38:46
18	982	343.1141054282401	280.97274077759255	21/02/24 15:38:46
18	982	343.38811869854686	281.05464301732405	21/02/24 15:38:46
18	982	343.61689513771387	281.1230240221732	21/02/24 15:38:46
18	982	343.868167498024	281.1981290310254	21/02/24 15:38:46
18	982	344.0714020160985	281.25887558611896	21/02/24 15:38:46
18	982	344.25264158582445	281.3130478773803	21/02/24 15:38:47
18	982	344.47110048215626	281.37834498097976	21/02/24 15:38:47
18	982	344.67511060129607	281.4393233623068	21/02/24 15:38:47
18	982	344.87613873370094	281.4994104313549	21/02/24 15:38:47
18	982	345.13115755666536	281.5756352534268	21/02/24 15:38:47
18	982	345.2910368417622	281.62342298108484	21/02/24 15:38:47
18	982	345.2910368417622	281.62342298108484	21/02/24 15:38:47
18	982	345.4771276481515	281.6790453011997	21/02/24 15:38:47
18	982	345.73053251625504	281.75478771408837	21/02/24 15:38:47
18	982	345.92459963082604	281.81279414320693	21/02/24 15:38:47
18	982	346.072213207266	281.85691566517437	21/02/24 15:38:48
18	982	346.3489463139941	281.9396308607688	21/02/24 15:38:48
18	982	346.604614052292	282.01604964286	21/02/24 15:38:48
18	982	346.8661233844921	282.0942144704025	21/02/24 15:38:48
18	982	347.0476195301123	282.14846345189267	21/02/24 15:38:48
18	982	347.3251915153211	282.2314293872646	21/02/24 15:38:48
18	982	347.47091755552685	282.27498672690257	21/02/24 15:38:48
18	982	347.47091755552685	282.27498672690257	21/02/24 15:38:48
18	982	347.6264527737336	282.3214760181475	21/02/24 15:38:48
18	982	347.7808282887886	282.3676186755033	21/02/24 15:38:49
18	982	348.01645944004804	282.43804854562256	21/02/24 15:38:49
18	982	348.2593462981212	282.510647137856	21/02/24 15:38:49
18	982	348.4701521834355	282.57365676558857	21/02/24 15:38:49
18	982	348.6990648777033	282.64207849692485	21/02/24 15:38:49
18	982	348.9162230154106	282.70698680532263	21/02/24 15:38:49
18	982	349.115821746555	282.7666466280385	21/02/24 15:38:49
18	982	349.3080067776298	282.82409050464446	21/02/24 15:38:49
18	982	349.48720452639003	282.87765249805403	21/02/24 15:38:49
18	982	349.729082270619	282.9499494673628	21/02/24 15:38:49
18	982	349.97512074328955	283.023490073441	21/02/24 15:38:50
18	982	350.1749076514046	283.083206142029	21/02/24 15:38:50
18	982	350.3186403500623	283.12616767425527	21/02/24 15:38:50
18	982	350.54175787779155	283.19285723722396	21/02/24 15:38:50
18	982	350.803545708671	283.2711053076896	21/02/24 15:38:50
18	982	351.06548769712185	283.34939945566947	21/02/24 15:38:50
18	982	351.24090776706015	283.40183230538406	21/02/24 15:38:50
18	982	351.4363622666656	283.460253422235	21/02/24 15:38:50
18	982	351.6993929692848	283.5388729855815	21/02/24 15:38:50
18	982	351.8929155266639	283.5967166472048	21/02/24 15:38:50
18	982	352.0876487964458	283.6549221893215	21/02/24 15:38:51
18	982	352.34005822825077	283.7303670674876	21/02/24 15:38:51
18	982	352.5065279591246	283.78012467152917	21/02/24 15:38:51
18	982	352.7653697732224	283.8574921810919	21/02/24 15:38:51
18	982	352.7653697732224	283.8574921810919	21/02/24 15:38:51
18	982	353.03298896909513	283.93748323960006	21/02/24 15:38:51
18	982	353.21591100204427	283.9921584171125	21/02/24 15:38:51
18	982	353.4216309846234	284.0536478745825	21/02/24 15:38:51
18	982	353.5706320362243	284.098184111221	21/02/24 15:38:51
18	982	353.79960739283905	284.16662457225806	21/02/24 15:38:52
18	982	354.0631172962187	284.2453873681404	21/02/24 15:38:52
18	982	354.2130965546157	284.29021598962373	21/02/24 15:38:52
18	982	354.4387125628968	284.35765234544994	21/02/24 15:38:52
18	982	354.6959518970046	284.43454087565465	21/02/24 15:38:52
18	982	354.8615031140275	284.48402393700155	21/02/24 15:38:52
18	982	355.02393250420334	284.53257388802666	21/02/24 15:38:52
18	982	355.30045771571366	284.6152269439884	21/02/24 15:38:52
18	982	355.58571630782757	284.7004903969979	21/02/24 15:38:52
18	982	355.75529148993843	284.751176216711	21/02/24 15:38:52
18	982	355.9001566426336	284.79447623809864	21/02/24 15:38:53
18	982	356.11490353852565	284.85866382919323	21/02/24 15:38:53
18	982	356.2746921472134	284.9064244537807	21/02/24 15:38:53
18	982	356.5327753702704	284.98356522138596	21/02/24 15:38:53
18	982	356.7820345926375	285.05806850570775	21/02/24 15:38:53
18	982	356.97905819104494	285.1169586243194	21/02/24 15:38:53
18	982	357.22319265446794	285.1899301243041	21/02/24 15:38:53
18	982	357.48209967149313	285.2673171229441	21/02/24 15:38:53
18	982	357.6710859533963	285.3238048972372	21/02/24 15:38:53
18	982	357.89263205383963	285.3900247624641	21/02/24 15:38:53
18	982	358.0973195911654	285.4512056232791	21/02/24 15:38:54
18	982	358.29480385969936	285.51023343564225	21/02/24 15:38:54
18	982	358.4507621772173	285.55684919076674	21/02/24 15:38:54
18	982	358.6151582836598	285.6059869909386	21/02/24 15:38:54
18	982	358.8941881658656	285.6893886899844	21/02/24 15:38:54
18	982	359.03884853336564	285.7326275013214	21/02/24 15:38:54
18	982	359.25268126101247	285.79654184861766	21/02/24 15:38:54
18	982	359.4176510648039	285.845851126243	21/02/24 15:38:54
18	982	359.57856336776774	285.8939476217096	21/02/24 15:38:54
18	982	359.7989930465488	285.95983378983294	21/02/24 15:38:55
18	982	360.0633264051061	286.03884271548594	21/02/24 15:38:55
18	982	360.34255843223434	286.122304835408	21/02/24 15:38:55
18	982	360.59684460036675	286.19831066782433	21/02/24 15:38:55
18	982	360.84588634960676	286.27274894968775	21/02/24 15:38:55
18	982	361.03095685381635	286.32806630269783	21/02/24 15:38:55
18	982	361.2043151084059	286.37988287826346	21/02/24 15:38:55
18	982	361.4202033627092	286.4444116200261	21/02/24 15:38:55
18	982	361.63207024107646	286.50773837731697	21/02/24 15:38:55
18	982	361.8168307008751	286.5629630584223	21/02/24 15:38:55
18	982	362.0139120637327	286.62187044275925	21/02/24 15:38:56
18	982	362.19733209693254	286.6766944719527	21/02/24 15:38:56
18	982	362.3624973548506	286.7260621705834	21/02/24 15:38:56
18	982	362.51552286803263	286.7718013139893	21/02/24 15:38:56
18	982	362.7982015652423	286.85629363948846	21/02/24 15:38:56
18	982	363.0011392364739	286.91695146741466	21/02/24 15:38:56
18	982	363.1658903196716	286.96619536971536	21/02/24 15:38:56
18	982	363.33728526651686	287.01742511493745	21/02/24 15:38:56
18	982	363.55024292972246	287.08107790651576	21/02/24 15:38:56
18	982	363.71354657866095	287.12988917244246	21/02/24 15:38:56
18	982	363.9545888458249	287.2019364186528	21/02/24 15:38:57
18	982	364.13462214468854	287.25574815699184	21/02/24 15:38:57
18	982	364.34535827211045	287.3187369341736	21/02/24 15:38:57
18	982	364.5321876360618	287.374580008263	21/02/24 15:38:57
18	982	364.67669834376824	287.41777408646624	21/02/24 15:38:57
18	982	364.9116807466589	287.4880100464717	21/02/24 15:38:57
18	982	365.30783900582077	287.606421277713	21/02/24 15:38:57
18	982	365.30783900582077	287.606421277713	21/02/24 15:38:57
18	982	365.57707186128084	287.68689465714755	21/02/24 15:38:57
18	982	365.7799289293018	287.7475283928702	21/02/24 15:38:58
18	982	366.0075034932063	287.81555015863665	21/02/24 15:38:58
18	982	366.20747851364985	287.8753224537753	21/02/24 15:38:58
18	982	366.4600391953565	287.95081254035665	21/02/24 15:38:58
18	982	366.7289816064374	288.0311991063126	21/02/24 15:38:58
18	982	366.9902530311311	288.1092928235851	21/02/24 15:38:58
18	982	367.23096470070084	288.18124125456876	21/02/24 15:38:58
18	982	367.4897401045464	288.2585889141863	21/02/24 15:38:58
18	982	367.68956601836703	288.31831664153316	21/02/24 15:38:58
18	982	368.08162752489767	288.43550335829843	21/02/24 15:38:58
18	982	368.08162752489767	288.43550335829843	21/02/24 15:38:59
18	982	368.56397066970095	288.5796751490818	21/02/24 15:38:59
18	982	368.734458511482	288.63063376168196	21/02/24 15:38:59
18	982	368.9112560654466	288.6834783397294	21/02/24 15:38:59
18	982	369.07785054633314	288.73327323140103	21/02/24 15:38:59
18	982	369.28940813745595	288.7965075431034	21/02/24 15:38:59
18	982	369.56964637624804	288.8802704184919	21/02/24 15:38:59
18	982	369.56964637624804	288.8802704184919	21/02/24 15:38:59
18	982	369.7483123733245	288.93367347195726	21/02/24 15:38:59
18	982	369.942298953168	288.9916558293418	21/02/24 15:39:00
18	982	370.0884225488263	289.03533199783044	21/02/24 15:39:00
18	982	370.3662818513979	289.1183838120195	21/02/24 15:39:00
18	982	370.64425126062144	289.2014685369555	21/02/24 15:39:00
18	982	370.8943685422864	289.2762282941781	21/02/24 15:39:00
18	982	371.07335367111034	289.32972673574227	21/02/24 15:39:00
18	982	371.307848152098	289.3998168564728	21/02/24 15:39:00
18	982	371.5200930496057	289.46325660323396	21/02/24 15:39:00
18	982	371.72872258292983	289.525615721952	21/02/24 15:39:00
18	982	371.94585485087094	289.5905162979075	21/02/24 15:39:00
18	982	372.19085913298704	289.66374778566234	21/02/24 15:39:01
18	982	372.46525353199826	289.7457639443091	21/02/24 15:39:01
18	982	372.6761754884252	289.80880826555887	21/02/24 15:39:01
18	982	372.8445476533152	289.85913450485924	21/02/24 15:39:01
18	982	373.0641208959653	289.9247646852444	21/02/24 15:39:01
18	982	373.26100351447076	289.98361266513143	21/02/24 15:39:01
18	982	373.426681430633	290.0331335967	21/02/24 15:39:01
18	982	373.5890060833719	290.0816522418301	21/02/24 15:39:01
18	982	373.8179978180408	290.15009759824807	21/02/24 15:39:01
18	982	374.04187947325596	290.2170155580111	21/02/24 15:39:02
18	982	374.3153797202269	290.2987644556793	21/02/24 15:39:02
18	982	374.5157520862284	290.3586555169314	21/02/24 15:39:02
18	982	374.76232338866066	290.43235538518996	21/02/24 15:39:02
18	982	374.9501294094599	290.4884903808466	21/02/24 15:39:02
18	982	375.0979262348824	290.53266667571637	21/02/24 15:39:02
18	982	375.2940648943449	290.59129228713266	21/02/24 15:39:02
18	982	375.48070759941874	290.6470795691062	21/02/24 15:39:02
18	982	375.7500825948084	290.7275954339962	21/02/24 15:39:02
18	982	375.9044981722111	290.77375006593996	21/02/24 15:39:02
18	982	376.15538007875875	290.84873836862823	21/02/24 15:39:03
18	982	376.36279509637177	290.91073447004857	21/02/24 15:39:03
18	982	376.53115136382723	290.9610559576247	21/02/24 15:39:03
18	982	376.70206885584764	291.012142992169	21/02/24 15:39:03
18	982	376.8904402339972	291.06844697246345	21/02/24 15:39:03
18	982	377.0906220861515	291.1282810893538	21/02/24 15:39:03
18	982	377.2593500059772	291.1787136633802	21/02/24 15:39:03
18	982	377.41213968597435	291.22438231652836	21/02/24 15:39:03
18	982	377.1458985913833	291.22673503669773	21/02/24 15:39:03
18	982	377.1594851798968	291.2167843020673	21/02/24 15:39:03
18	982	376.9445581681461	291.14814534228003	21/02/24 15:39:04
18	982	377.051410040939	291.040420375228	21/02/24 15:39:04
18	982	376.9579341205963	291.09781501854434	21/02/24 15:39:04
18	982	376.9579341205963	291.09781501854434	21/02/24 15:39:04
18	982	376.9530011329854	291.09282737620055	21/02/24 15:39:04
18	982	376.9443313546831	291.0895003928225	21/02/24 15:39:04
18	982	377.1269029602786	291.16379124004203	21/02/24 15:39:04
18	982	377.2869705026229	291.2255931069943	21/02/24 15:39:04
18	982	377.3448263653633	291.3628695894111	21/02/24 15:39:04
18	982	377.27591530840283	291.2795769607348	21/02/24 15:39:04
18	982	377.1842105603384	291.4608132269392	21/02/24 15:39:05
18	982	377.1203369310024	291.6190376214748	21/02/24 15:39:05
18	982	377.3907483569682	291.652900436493	21/02/24 15:39:05
18	982	377.4139097647117	291.6264638297625	21/02/24 15:39:05
18	982	377.43207245954983	291.58427892237194	21/02/24 15:39:05
18	982	377.32946637257095	291.79466098199003	21/02/24 15:39:05
18	982	377.17550654209583	291.6906050849059	21/02/24 15:39:05
18	982	377.2585427399864	291.947610214415	21/02/24 15:39:05
18	982	377.47260793002465	291.77859822697565	21/02/24 15:39:05
18	982	377.4669144965431	291.9883430845552	21/02/24 15:39:06
18	982	377.4553861233656	291.85054872247315	21/02/24 15:39:06
18	982	377.4748858540363	291.9707288069747	21/02/24 15:39:06
18	982	377.3346072457873	292.0927376941746	21/02/24 15:39:06
18	982	377.22551019858065	292.15255710106504	21/02/24 15:39:06
18	982	377.07388095832874	292.30425776373653	21/02/24 15:39:06
18	982	376.9312289082866	292.0540735665138	21/02/24 15:39:06
18	982	376.93457455620063	292.1105996311411	21/02/24 15:39:06
18	982	376.8468368081048	292.18450529044816	21/02/24 15:39:06
18	982	376.83746220719456	292.36073129082905	21/02/24 15:39:06
18	982	376.82514991236206	292.24300742032864	21/02/24 15:39:07
18	982	376.84803721463817	292.1448020723107	21/02/24 15:39:07
18	982	376.7818594257135	291.8967069286493	21/02/24 15:39:07
18	982	376.7818594257135	291.8967069286493	21/02/24 15:39:07
18	982	376.6814590327414	291.756579504655	21/02/24 15:39:07
18	982	376.7984878566339	292.0335480325389	21/02/24 15:39:07
18	982	376.9977803814344	291.8546748709149	21/02/24 15:39:07
18	982	376.8706285928779	292.04248108270815	21/02/24 15:39:07
18	982	376.8706285928779	292.04248108270815	21/02/24 15:39:07
18	982	376.94900065242786	292.0160222570243	21/02/24 15:39:07
18	982	376.5672169800152	292.0720528420197	21/02/24 15:39:08
18	982	376.6138193833916	292.1043937199113	21/02/24 15:39:08
18	982	376.66155735063654	292.0493538244386	21/02/24 15:39:08
18	982	376.71766424945804	292.186295870922	21/02/24 15:39:08
18	982	376.95952654030697	292.14307116056193	21/02/24 15:39:08
18	982	377.0528457321789	292.12555433476604	21/02/24 15:39:08
18	982	377.15763052861666	292.0498623150637	21/02/24 15:39:08
18	982	377.0726308906233	291.944376234574	21/02/24 15:39:08
18	982	377.0879804117197	291.8924504024191	21/02/24 15:39:08
18	982	377.0879804117197	291.8924504024191	21/02/24 15:39:09
18	982	376.9252573564364	291.8596350081106	21/02/24 15:39:09
18	982	376.63954660088757	291.97787449431854	21/02/24 15:39:09
18	982	376.63954660088757	291.97787449431854	21/02/24 15:39:09
18	982	376.6179439468969	291.9081037808647	21/02/24 15:39:09
18	982	376.46915763850075	292.0185096571801	21/02/24 15:39:09
18	982	376.41825351185827	291.9255077182373	21/02/24 15:39:09
18	982	376.4614930362374	292.20652084659014	21/02/24 15:39:09
18	982	376.4614930362374	292.20652084659014	21/02/24 15:39:09
18	982	376.7086019965727	292.2268214146015	21/02/24 15:39:09
18	982	376.55394773072675	292.35918258929604	21/02/24 15:39:10
18	982	376.73275816950496	292.0879907420117	21/02/24 15:39:10
18	982	376.50667146026564	292.09525043274175	21/02/24 15:39:10
18	982	376.5148402736473	292.13577621252057	21/02/24 15:39:10
18	982	376.5148402736473	292.13577621252057	21/02/24 15:39:10
18	982	376.5396087121772	292.4056919476178	21/02/24 15:39:10
18	982	376.5219652286078	292.289491492451	21/02/24 15:39:10
18	982	376.5219652286078	292.289491492451	21/02/24 15:39:10
18	982	376.54151130286266	292.0323579673643	21/02/24 15:39:10
18	982	376.689905627658	291.9530028917128	21/02/24 15:39:10
18	982	376.9408930630854	291.9467404519443	21/02/24 15:39:11
18	982	377.03662385842085	292.21812839275646	21/02/24 15:39:11
18	982	376.99787305438207	292.1972904720921	21/02/24 15:39:11
18	982	377.08367902877256	292.3556323044732	21/02/24 15:39:11
18	982	377.09576983287207	292.27043327600205	21/02/24 15:39:11
18	982	376.87507504879414	292.2235422214936	21/02/24 15:39:11
18	982	376.87507504879414	292.2235422214936	21/02/24 15:39:11
18	982	376.79680004074913	292.49776798380367	21/02/24 15:39:11
18	982	377.01606671948736	292.38718410958757	21/02/24 15:39:11
18	982	376.83280164439356	292.45682814861885	21/02/24 15:39:12
18	982	376.7795323876732	292.45005377636863	21/02/24 15:39:12
18	982	376.7239717604935	292.52483029333564	21/02/24 15:39:12
18	982	376.7239717604935	292.52483029333564	21/02/24 15:39:12
18	982	376.75679487090775	292.418455705102	21/02/24 15:39:12
18	982	376.7559441515253	292.42163073247605	21/02/24 15:39:12
18	982	376.79178157466697	292.5075266997722	21/02/24 15:39:12
18	982	376.79178157466697	292.5075266997722	21/02/24 15:39:12
18	982	377.184695931256	292.1535230297306	21/02/24 15:39:12
18	982	377.202755770574	292.31144156877605	21/02/24 15:39:12
18	982	377.2759035393174	292.27824414659557	21/02/24 15:39:13
18	982	377.29933880111	292.02295002692466	21/02/24 15:39:13
18	982	377.2978765101952	292.0161015834687	21/02/24 15:39:13
18	982	377.33645084879385	292.2847464117955	21/02/24 15:39:13
18	982	377.1003018652802	292.1445711626441	21/02/24 15:39:13
18	982	377.21403007812745	291.906129135108	21/02/24 15:39:13
18	982	377.45595852880837	291.85545127292676	21/02/24 15:39:13
18	982	377.27780166830894	292.01756712116935	21/02/24 15:39:13
18	982	377.02756242941473	291.95193363954786	21/02/24 15:39:13
18	982	377.2346312368996	292.0427616258911	21/02/24 15:39:13
18	982	377.05596317159706	291.83436296699426	21/02/24 15:39:14
18	982	377.014857223833	291.68119589647335	21/02/24 15:39:14
18	982	376.94430608337586	291.6573183509347	21/02/24 15:39:14
18	982	376.9153309772751	291.6756001470398	21/02/24 15:39:14
18	982	376.7737253940836	291.92467488783336	21/02/24 15:39:14
18	982	376.79166118310974	292.05234513848836	21/02/24 15:39:14
18	982	376.8919537001967	292.15501603457733	21/02/24 15:39:14
18	982	376.94888645775944	292.1382260733944	21/02/24 15:39:14
18	982	377.0216049214214	292.200974987319	21/02/24 15:39:14
18	982	377.0207330931157	292.2718006237756	21/02/24 15:39:15
18	982	376.95773982496155	292.1227147122412	21/02/24 15:39:15
18	982	377.06712549469313	292.05790522362884	21/02/24 15:39:15
18	982	377.1701309703798	291.95593871845966	21/02/24 15:39:15
18	982	376.976406816707	292.1415223436322	21/02/24 15:39:15
18	982	376.92056061861	291.9450835870039	21/02/24 15:39:15
18	982	377.01090312399964	292.06037973643475	21/02/24 15:39:15
18	982	377.0170401262392	292.0815534953534	21/02/24 15:39:15
18	982	376.9649986557878	292.06591743171333	21/02/24 15:39:15
18	982	376.96008842971906	292.084501211879	21/02/24 15:39:15
18	982	377.0240293488759	291.91519221498373	21/02/24 15:39:16
18	982	377.2162898179281	291.71895434425016	21/02/24 15:39:16
18	982	377.27282035162534	291.79897639144923	21/02/24 15:39:16
18	982	377.21876493427277	291.770911390205	21/02/24 15:39:16
18	982	377.27893273797827	291.70044300062773	21/02/24 15:39:16
18	982	377.2701348912468	291.70057948295465	21/02/24 15:39:16
18	982	377.2701348912468	291.70057948295465	21/02/24 15:39:16
18	982	377.0489921837528	291.56805625448726	21/02/24 15:39:16
18	982	377.0453995365057	291.57084590684144	21/02/24 15:39:16
18	982	377.2663419174805	291.8244035696321	21/02/24 15:39:16
18	982	377.3052431577794	292.0676219374097	21/02/24 15:39:17
18	982	377.16985598006727	291.84895843553215	21/02/24 15:39:17
18	982	377.16985598006727	291.84895843553215	21/02/24 15:39:17
18	982	377.16985598006727	291.84895843553215	21/02/24 15:39:17
18	982	377.16985598006727	291.84895843553215	21/02/24 15:39:17
18	982	376.9899502424761	291.7929075107422	21/02/24 15:39:17
18	982	376.83506959489483	291.7446533324974	21/02/24 15:39:17
18	982	376.6698275428058	291.69317098425336	21/02/24 15:39:17
18	982	376.441701148532	291.6220965675102	21/02/24 15:39:17
18	982	376.441701148532	291.6220965675102	21/02/24 15:39:18
18	982	376.1847502036288	291.54204165497487	21/02/24 15:39:18
18	982	375.6247842966475	291.3675802544805	21/02/24 15:39:18
18	982	375.3902945593763	291.2945232925194	21/02/24 15:39:18
18	982	375.23060779925225	291.2447717353901	21/02/24 15:39:18
18	982	375.0772037094458	291.19697758932597	21/02/24 15:39:18
18	982	374.9072345711751	291.1440224834278	21/02/24 15:39:18
18	982	374.7569942838176	291.09721404274194	21/02/24 15:39:18
18	982	374.52110956337606	291.02372246375404	21/02/24 15:39:18
18	982	374.52110956337606	291.02372246375404	21/02/24 15:39:18
18	982	374.3085666890831	290.9575032045957	21/02/24 15:39:19
18	982	374.0492700717265	290.8767174809588	21/02/24 15:39:19
18	982	373.535102340403	290.71652483105396	21/02/24 15:39:19
18	982	373.2496933780446	290.6276036187696	21/02/24 15:39:19
18	982	373.0693779805103	290.5714250614819	21/02/24 15:39:19
18	982	372.8207500958297	290.4939632581425	21/02/24 15:39:19
18	982	372.8207500958297	290.4939632581425	21/02/24 15:39:19
18	982	372.56742060779453	290.41503663650695	21/02/24 15:39:19
18	982	372.38709374812555	290.35885450810883	21/02/24 15:39:19
18	982	372.22527693749504	290.3084393184443	21/02/24 15:39:19
18	982	371.9486576702384	290.22225659880434	21/02/24 15:39:20
18	982	371.6689897264582	290.1351240420952	21/02/24 15:39:20
18	982	371.4961912762434	290.08128744373823	21/02/24 15:39:20
18	982	371.26302023530786	290.0086413310925	21/02/24 15:39:20
18	982	371.01389035587584	289.93102312768264	21/02/24 15:39:20
18	982	371.01389035587584	289.93102312768264	21/02/24 15:39:20
18	982	370.83332275046797	289.8747659932203	21/02/24 15:39:20
18	982	370.6874525833006	289.82931909486973	21/02/24 15:39:20
18	982	370.40648141612235	289.7417805095499	21/02/24 15:39:20
18	982	370.2556213893271	289.69477898459064	21/02/24 15:39:21
18	982	370.09651950666887	289.64520965023695	21/02/24 15:39:21
18	982	369.6308755857877	289.5001349420167	21/02/24 15:39:21
18	982	369.6308755857877	289.5001349420167	21/02/24 15:39:21
18	982	369.4807302715986	289.4533560909036	21/02/24 15:39:21
18	982	369.26430494819596	289.3859272268379	21/02/24 15:39:21
18	982	369.0186710890867	289.30939823367106	21/02/24 15:39:21
18	982	368.5438427220248	289.16146204527234	21/02/24 15:39:21
18	982	368.5438427220248	289.16146204527234	21/02/24 15:39:21
18	982	368.32833914785897	289.09432035880224	21/02/24 15:39:21
18	982	368.1492509330925	289.0385241391205	21/02/24 15:39:22
18	982	368.1492509330925	289.0385241391205	21/02/24 15:39:22
18	982	367.865667196039	288.9501715888903	21/02/24 15:39:22
18	982	367.63349026994	288.87783519986255	21/02/24 15:39:22
18	982	367.3587013133929	288.79222272667107	21/02/24 15:39:22
18	982	367.1220621425883	288.7184960932534	21/02/24 15:39:22
18	982	366.89665985733956	288.64827039224406	21/02/24 15:39:22
18	982	366.4756801681894	288.51711114623794	21/02/24 15:39:22
18	982	366.3280685655866	288.4711216911689	21/02/24 15:39:22
18	982	366.14212398201687	288.413189320538	21/02/24 15:39:22
18	982	365.9001318637969	288.3377949379034	21/02/24 15:39:23
18	982	365.61452852144157	288.24881316513483	21/02/24 15:39:23
18	982	365.4334776198103	288.19240545626263	21/02/24 15:39:23
18	982	365.19228017507965	288.11725865986176	21/02/24 15:39:23
18	982	364.99554231335406	288.05596356589444	21/02/24 15:39:23
18	982	364.814421239039	287.9995339942186	21/02/24 15:39:23
18	982	364.814421239039	287.9995339942186	21/02/24 15:39:23
18	982	364.26553797662484	287.82852547124463	21/02/24 15:39:23
18	982	364.26553797662484	287.82852547124463	21/02/24 15:39:23
18	982	364.0891977538202	287.77358540819716	21/02/24 15:39:24
18	982	363.9005179805731	287.7148008695757	21/02/24 15:39:24
18	982	363.70749087099404	287.6546618870936	21/02/24 15:39:24
18	982	363.48066662455346	287.5839931638611	21/02/24 15:39:24
18	982	363.2298310390873	287.50584353548436	21/02/24 15:39:24
18	982	363.07724547502596	287.4583044069955	21/02/24 15:39:24
18	982	362.6908884930824	287.33793211411074	21/02/24 15:39:24
18	982	362.6908884930824	287.33793211411074	21/02/24 15:39:24
18	982	362.2960156824436	287.2149066536277	21/02/24 15:39:24
18	982	362.2960156824436	287.2149066536277	21/02/24 15:39:24
18	982	362.05979173597086	287.14130938633315	21/02/24 15:39:25
18	982	361.897218361	287.09065848361405	21/02/24 15:39:25
18	982	361.5462929662773	286.9813251562292	21/02/24 15:39:25
18	982	361.33144345062294	286.91438724638635	21/02/24 15:39:25
18	982	361.0688308697686	286.83256841050354	21/02/24 15:39:25
18	982	360.8456478795976	286.7630341468166	21/02/24 15:39:25
18	982	360.69514712157314	286.7161445546235	21/02/24 15:39:25
18	982	360.69514712157314	286.7161445546235	21/02/24 15:39:25
18	982	360.4233758217873	286.63147225407147	21/02/24 15:39:25
18	982	360.18608966184905	286.557544046542	21/02/24 15:39:25
18	982	359.9479548677994	286.48335144095944	21/02/24 15:39:26
18	982	359.47526808039754	286.3360824770865	21/02/24 15:39:26
18	982	359.24968885387375	286.2658016487519	21/02/24 15:39:26
18	982	359.04932812651896	286.2033778249752	21/02/24 15:39:26
18	982	359.04932812651896	286.2033778249752	21/02/24 15:39:26
18	982	358.79286884304724	286.1234760930904	21/02/24 15:39:26
18	982	358.32571910275544	285.97793223601667	21/02/24 15:39:26
18	982	358.32571910275544	285.97793223601667	21/02/24 15:39:26
18	982	357.87872197669503	285.83866707066073	21/02/24 15:39:26
18	982	357.641264800653	285.76468558183575	21/02/24 15:39:27
18	982	357.4422294037122	285.7026746742692	21/02/24 15:39:27
18	982	357.24296676400286	285.64059296758586	21/02/24 15:39:27
18	982	357.0643584071336	285.5849462510788	21/02/24 15:39:27
18	982	356.8167520205874	285.5078027028205	21/02/24 15:39:27
18	982	356.6086370598281	285.4429629919288	21/02/24 15:39:27
18	982	356.37015457515224	285.36866206083425	21/02/24 15:39:27
18	982	356.2163340182926	285.3207381614683	21/02/24 15:39:27
18	982	355.94840087895113	285.2372616673718	21/02/24 15:39:27
18	982	355.73931125662847	285.1721182936691	21/02/24 15:39:27
18	982	355.52184871788603	285.10436627771406	21/02/24 15:39:28
18	982	355.31993535387346	285.0414587188342	21/02/24 15:39:28
18	982	355.0842940713968	284.96804298469283	21/02/24 15:39:28
18	982	354.8415218050142	284.8924055412945	21/02/24 15:39:28
18	982	354.5840104213247	284.8121760200297	21/02/24 15:39:28
18	982	354.309487609234	284.7266464660553	21/02/24 15:39:28
18	982	354.1506641604726	284.6771638797821	21/02/24 15:39:28
18	982	353.8922323000267	284.59664757737215	21/02/24 15:39:28
18	982	353.6908284641092	284.53389876563017	21/02/24 15:39:28
18	982	353.4474266112588	284.45806517004553	21/02/24 15:39:29
18	982	353.2679757471753	284.4021559643642	21/02/24 15:39:29
18	982	352.993130803223	284.3165260478945	21/02/24 15:39:29
18	982	352.8395822645539	284.26868689774966	21/02/24 15:39:29
18	982	352.6613213740781	284.21314843689333	21/02/24 15:39:29
18	982	352.43408369340943	284.14235090525744	21/02/24 15:39:29
18	982	352.24172382973563	284.08241980802984	21/02/24 15:39:29
18	982	351.9634717236594	283.99572836572713	21/02/24 15:39:29
18	982	351.81535901686794	283.94958278804876	21/02/24 15:39:29
18	982	351.5470398776581	283.86598603292066	21/02/24 15:39:29
18	982	351.3314003038892	283.7988019747973	21/02/24 15:39:30
18	982	351.0521009624832	283.71178425880544	21/02/24 15:39:30
18	982	350.7968757080813	283.63226699754125	21/02/24 15:39:30
18	982	350.5204505245901	283.54614474609247	21/02/24 15:39:30
18	982	350.3765226710785	283.5013029895128	21/02/24 15:39:30
18	982	350.11537778203433	283.4199414235557	21/02/24 15:39:30
18	982	349.8806077683697	283.346797139471	21/02/24 15:39:30
18	982	349.6145154311734	283.2638941605051	21/02/24 15:39:30
18	982	349.35412317309545	283.1827670821316	21/02/24 15:39:30
18	982	349.1860937311222	283.1304163025476	21/02/24 15:39:30
18	982	348.9330016720521	283.05156365361154	21/02/24 15:39:31
18	982	348.68819692718523	282.97529297694234	21/02/24 15:39:31
18	982	348.4188576436732	282.89137838852935	21/02/24 15:39:31
18	982	348.24710659775667	282.8378681165049	21/02/24 15:39:31
18	982	348.24710659775667	282.8378681165049	21/02/24 15:39:31
18	982	348.077030803302	282.7848797811066	21/02/24 15:39:31
18	982	347.843842472335	282.71222828162735	21/02/24 15:39:31
18	982	347.6933384266517	282.6653376651405	21/02/24 15:39:31
18	982	347.47789563213877	282.5982149150078	21/02/24 15:39:31
18	982	347.30472193565305	282.54426140597985	21/02/24 15:39:32
18	982	347.30472193565305	282.54426140597985	21/02/24 15:39:32
18	982	347.0764271328497	282.4731345203497	21/02/24 15:39:32
18	982	346.89443100217505	282.41643231857955	21/02/24 15:39:32
18	982	346.68281677730306	282.3505023868187	21/02/24 15:39:32
18	982	346.52621979997076	282.3017134737117	21/02/24 15:39:32
18	982	346.31996677011784	282.23745386076786	21/02/24 15:39:32
18	982	346.1724676334258	282.1914994452612	21/02/24 15:39:32
18	982	345.95931906952165	282.12509147915387	21/02/24 15:39:32
18	982	345.69832790271283	282.04377780646337	21/02/24 15:39:32
18	982	345.50474481922754	281.9834656063172	21/02/24 15:39:33
18	982	345.25737404552757	281.9063954649336	21/02/24 15:39:33
18	982	344.98170936047245	281.8205101522352	21/02/24 15:39:33
18	982	344.7599682047474	281.7514251024264	21/02/24 15:39:33
18	982	344.5415458006868	281.6833740335369	21/02/24 15:39:33
18	982	344.2689394908072	281.59844157959236	21/02/24 15:39:33
18	982	344.0894548200186	281.5425218411893	21/02/24 15:39:33
18	982	343.8772802771131	281.47641733832035	21/02/24 15:39:33
18	982	343.8772802771131	281.47641733832035	21/02/24 15:39:33
18	982	343.38549424838203	281.32319786862354	21/02/24 15:39:33
18	982	343.38549424838203	281.32319786862354	21/02/24 15:39:34
18	982	342.9992645069344	281.2028652184293	21/02/24 15:39:34
18	982	342.9992645069344	281.2028652184293	21/02/24 15:39:34
18	982	342.77708703221504	281.1336442303038	21/02/24 15:39:34
18	982	342.5706453748908	281.0693258491164	21/02/24 15:39:34
18	982	342.09503546159914	280.921146164376	21/02/24 15:39:34
18	982	342.09503546159914	280.921146164376	21/02/24 15:39:34
18	982	341.7740700694392	280.82114709098903	21/02/24 15:39:34
18	982	341.6257081033974	280.7749238548008	21/02/24 15:39:34
18	982	341.43656208325973	280.7159940536116	21/02/24 15:39:35
18	982	341.43656208325973	280.7159940536116	21/02/24 15:39:35
18	979	341.49897011328727	280.66247224501615	21/02/24 15:39:35
18	979	341.67350937001254	280.66247224501615	21/02/24 15:39:35
18	979	341.834041565718	280.66247224501615	21/02/24 15:39:35
18	979	342.09634762636017	280.66247224501615	21/02/24 15:39:35
18	979	342.28242292281845	280.66247224501615	21/02/24 15:39:35
18	982	342.3105334325351	280.66247224501615	21/02/24 15:39:35
18	982	342.1832216993876	280.62205287357364	21/02/24 15:39:35
18	982	341.8414475979936	280.51354524421254	21/02/24 15:39:35
18	982	341.6381581361328	280.4490041994388	21/02/24 15:39:36
18	982	341.44387856159926	280.3873236450026	21/02/24 15:39:36
18	982	341.23124214219297	280.31981509566697	21/02/24 15:39:36
18	982	341.08530789361646	280.2734833833136	21/02/24 15:39:36
18	982	340.8947660686224	280.2129895025897	21/02/24 15:39:36
18	982	340.71592394744147	280.1562100844884	21/02/24 15:39:36
18	982	340.439718774068	280.06851950624457	21/02/24 15:39:36
18	982	340.2335414057664	280.00306159889857	21/02/24 15:39:36
18	982	339.9783273183225	279.9220353435588	21/02/24 15:39:36
18	982	339.7915543606662	279.862738015934	21/02/24 15:39:36
18	982	339.58213292554683	279.7962501709817	21/02/24 15:39:37
18	982	339.3160423637017	279.7117708147537	21/02/24 15:39:37
18	982	339.0951003714033	279.6416253832748	21/02/24 15:39:37
18	982	338.8459925994142	279.5625377821848	21/02/24 15:39:37
18	982	338.661938904238	279.5041037754615	21/02/24 15:39:37
18	982	338.39107370192403	279.4181085497858	21/02/24 15:39:37
18	979	338.18313157746167	279.3520903615215	21/02/24 15:39:37
18	979	338.0943969553604	279.2956068178419	21/02/24 15:39:37
18	979	337.874630537953	279.22920194270483	21/02/24 15:39:37
18	979	337.9056518275144	279.4263427973949	21/02/24 15:39:38
18	979	337.9128073608102	279.448202889671	21/02/24 15:39:38
18	979	338.1035865023549	279.4969556574093	21/02/24 15:39:38
18	979	338.1652666794231	279.4794555516406	21/02/24 15:39:38
18	979	338.1693729250335	279.4960654696843	21/02/24 15:39:38
18	979	338.3598911190978	279.6569921217967	21/02/24 15:39:38
18	979	338.6227995894903	279.7797986855606	21/02/24 15:39:38
18	979	338.8057178165816	279.5716599804645	21/02/24 15:39:38
18	979	338.80119814789606	279.4373318078316	21/02/24 15:39:38
18	979	338.75620395106824	279.18357221511604	21/02/24 15:39:38
18	979	338.73215542151314	278.9380923041138	21/02/24 15:39:39
18	979	338.49776542297616	278.8683889805295	21/02/24 15:39:39
18	979	338.39061032972694	278.81762178714587	21/02/24 15:39:39
18	979	338.42006363100575	278.8406511620575	21/02/24 15:39:39
18	979	338.4073534417039	278.92270019403475	21/02/24 15:39:39
18	979	338.51425588484426	278.99369833397105	21/02/24 15:39:39
18	979	338.4239361921734	278.94646266828806	21/02/24 15:39:39
18	979	338.6621568382306	279.02508457749803	21/02/24 15:39:39
18	979	338.4110263268847	279.11352788095434	21/02/24 15:39:39
18	979	338.4067970245766	279.08363861477693	21/02/24 15:39:39
18	979	338.1262787429335	279.17331847144357	21/02/24 15:39:40
18	979	338.1516998679348	279.09265045163824	21/02/24 15:39:40
18	979	338.253635684624	279.29103839711945	21/02/24 15:39:40
18	979	338.2535570621302	279.30704814115927	21/02/24 15:39:40
18	979	337.98583176174577	279.34388329790147	21/02/24 15:39:40
18	979	338.1647903085865	279.2410429373977	21/02/24 15:39:40
18	979	337.9118001111516	279.12751659444683	21/02/24 15:39:40
18	979	337.94087638889755	279.21498677680086	21/02/24 15:39:40
18	979	337.95056746453673	279.19577494597974	21/02/24 15:39:40
18	979	337.97087406180253	279.11859154088523	21/02/24 15:39:41
18	979	338.0406598366476	279.0989450903755	21/02/24 15:39:41
18	979	338.1053937809203	279.12078141190983	21/02/24 15:39:41
18	979	338.0788779635219	279.1485059667433	21/02/24 15:39:41
18	979	338.1342692337217	279.2633920695581	21/02/24 15:39:41
18	979	338.21153060906374	279.40409634404716	21/02/24 15:39:41
18	979	338.3038975100892	279.28481646013637	21/02/24 15:39:41
18	979	338.3010979379647	279.40306825696314	21/02/24 15:39:41
18	979	338.26333468540395	279.40116746061926	21/02/24 15:39:41
18	979	338.05968675903637	279.61288136430284	21/02/24 15:39:41
18	979	337.97580854346285	279.70481889676233	21/02/24 15:39:42
18	979	337.97580854346285	279.70481889676233	21/02/24 15:39:42
18	979	338.017473567001	279.42370867059486	21/02/24 15:39:42
18	979	338.1001122631618	279.60194718770464	21/02/24 15:39:42
18	979	338.1001122631618	279.60194718770464	21/02/24 15:39:42
18	979	338.10857627266495	279.5572372796508	21/02/24 15:39:42
18	979	338.10239689322674	279.58298939805405	21/02/24 15:39:42
18	979	337.97544990901145	279.44297203753615	21/02/24 15:39:42
18	979	337.9281473567551	279.2460172461349	21/02/24 15:39:42
18	979	337.705526126169	279.17887829808467	21/02/24 15:39:42
18	979	337.7644297619777	278.9217355826211	21/02/24 15:39:43
18	979	337.86303272489204	279.0732493673506	21/02/24 15:39:43
18	979	337.88812796313954	279.0664334953184	21/02/24 15:39:43
18	979	337.85941748537414	279.0485611243938	21/02/24 15:39:43
18	979	338.04103315589606	279.00579624752424	21/02/24 15:39:43
18	979	338.123358728278	278.84476897968113	21/02/24 15:39:43
18	979	337.9242526602214	278.73139554006093	21/02/24 15:39:43
18	979	338.0207886813069	278.78081890075396	21/02/24 15:39:43
18	979	338.24844206586226	278.7253499449403	21/02/24 15:39:43
18	979	338.3145743852043	278.698989373306	21/02/24 15:39:44
18	979	338.3234617844407	278.690588939273	21/02/24 15:39:44
18	979	338.31096598610014	278.5877651788635	21/02/24 15:39:44
18	979	338.35905363782115	278.6508777902774	21/02/24 15:39:44
18	979	338.49189609047056	278.6861022956262	21/02/24 15:39:44
18	979	338.38260177235037	278.68156868823456	21/02/24 15:39:44
18	979	338.38260177235037	278.68156868823456	21/02/24 15:39:44
18	979	338.18869148704846	278.84783125407114	21/02/24 15:39:44
18	979	338.27617775565835	278.81923968997796	21/02/24 15:39:44
18	979	338.27617775565835	278.81923968997796	21/02/24 15:39:44
18	979	338.2511215523435	279.04529297819386	21/02/24 15:39:45
18	979	338.2511215523435	279.04529297819386	21/02/24 15:39:45
18	979	338.2341439751254	279.04477896955177	21/02/24 15:39:45
18	979	338.2961202140539	278.82324975094355	21/02/24 15:39:45
18	979	338.16047846890916	278.86944889110254	21/02/24 15:39:45
18	979	338.17304575418706	278.8990743885193	21/02/24 15:39:45
18	979	338.1413572105215	278.93652479773147	21/02/24 15:39:45
18	979	338.1499313902735	278.8701427806726	21/02/24 15:39:45
18	979	338.1711732682494	278.8786862225119	21/02/24 15:39:45
18	979	338.24999793029895	279.13280152571394	21/02/24 15:39:46
18	979	338.4088927810723	279.1774371097741	21/02/24 15:39:46
18	979	338.2786913091277	279.18597946287906	21/02/24 15:39:46
18	979	338.2577226939736	279.2207826352944	21/02/24 15:39:46
18	979	338.0603716736627	279.3964946509071	21/02/24 15:39:46
18	979	338.0340052254468	279.3703161388125	21/02/24 15:39:46
18	979	337.9466850033777	279.65609739151006	21/02/24 15:39:46
18	979	337.91126269051847	279.5395899783782	21/02/24 15:39:46
18	979	337.9862774012392	279.7808675833458	21/02/24 15:39:46
18	979	337.985157525959	279.7608102700495	21/02/24 15:39:46
18	979	338.15337670109665	279.6795310045423	21/02/24 15:39:47
18	979	338.19214113522895	279.7506811897185	21/02/24 15:39:47
18	979	338.0672039592157	279.5418364161915	21/02/24 15:39:47
18	979	337.9980191775836	279.5596071479704	21/02/24 15:39:47
18	979	337.8741854547329	279.70222234904855	21/02/24 15:39:47
18	979	338.08614167154116	279.8295596213166	21/02/24 15:39:47
18	979	338.2661712359856	279.92331756107495	21/02/24 15:39:47
18	979	338.3642045923102	279.6476317904306	21/02/24 15:39:47
18	979	338.10713789285666	279.62741764515494	21/02/24 15:39:47
18	979	338.09309090434755	279.6310102783099	21/02/24 15:39:47
18	979	338.2181218525855	279.85551570728444	21/02/24 15:39:48
18	979	337.9441908947938	279.86360985061845	21/02/24 15:39:48
18	979	337.65916083388015	279.8274726405602	21/02/24 15:39:48
18	979	337.6207034115514	279.96525706254255	21/02/24 15:39:48
18	979	337.5651177817601	279.8870931251669	21/02/24 15:39:48
18	979	337.46755799536834	279.72560837638906	21/02/24 15:39:48
18	979	337.20469561904656	279.6088597672352	21/02/24 15:39:48
18	979	337.16370619430216	279.5566644916804	21/02/24 15:39:48
18	979	337.02153296486466	279.41771454208384	21/02/24 15:39:48
18	979	336.86695778845746	279.339342200132	21/02/24 15:39:48
18	979	336.6302926762483	279.30329165899855	21/02/24 15:39:49
18	979	336.54645785658346	279.1994635864029	21/02/24 15:39:49
18	979	336.37420931280485	279.4433644522655	21/02/24 15:39:49
18	979	336.4550257718802	279.7106091871817	21/02/24 15:39:49
18	979	336.54743788477833	279.65986449132754	21/02/24 15:39:49
18	979	336.53804902578264	279.5372693954069	21/02/24 15:39:49
18	979	336.48315875536684	279.5478278090423	21/02/24 15:39:49
18	979	336.41968437731293	279.44572449387516	21/02/24 15:39:49
18	979	336.3995372519189	279.4434627153588	21/02/24 15:39:49
18	979	336.39170139419497	279.4339995057137	21/02/24 15:39:50
18	979	336.42216595268957	279.4073637546474	21/02/24 15:39:50
18	979	336.50501366414176	279.4533585780247	21/02/24 15:39:50
18	979	336.3398964551922	279.4190151378978	21/02/24 15:39:50
18	979	336.3508923481718	279.40158145176747	21/02/24 15:39:50
18	979	336.34469006895813	279.4770124378143	21/02/24 15:39:50
18	979	336.41719830612163	279.37718480493265	21/02/24 15:39:50
18	979	336.34969290425033	279.39112740115684	21/02/24 15:39:50
18	979	336.2098259833109	279.3966562725569	21/02/24 15:39:50
18	979	336.24808567004345	279.43300832530207	21/02/24 15:39:50
18	979	336.3147287045036	279.26361613294284	21/02/24 15:39:51
18	979	336.46576726263396	279.377178229685	21/02/24 15:39:51
18	979	336.3389670859262	279.5674817093674	21/02/24 15:39:51
18	979	336.41463232922706	279.49534775701903	21/02/24 15:39:51
18	979	336.4276928567475	279.4788304550345	21/02/24 15:39:51
18	979	336.3781550970804	279.44293490422547	21/02/24 15:39:51
18	979	336.3817769345729	279.6725076435083	21/02/24 15:39:51
18	979	336.253890218911	279.63527444767885	21/02/24 15:39:51
18	979	336.0337937384423	279.5206612372657	21/02/24 15:39:51
18	979	335.79613474254427	279.5846266943348	21/02/24 15:39:51
18	979	335.6343317151467	279.4677730143251	21/02/24 15:39:52
18	979	335.65785321880094	279.49346742792034	21/02/24 15:39:52
18	979	335.64008889453197	279.4862640517998	21/02/24 15:39:52
18	979	335.68112349285923	279.6237021179227	21/02/24 15:39:52
18	979	335.83037564331073	279.5236469605949	21/02/24 15:39:52
18	979	335.8245184231412	279.5560631353506	21/02/24 15:39:52
18	979	335.7548224492541	279.60529423773704	21/02/24 15:39:52
18	979	335.7378722792314	279.753863932797	21/02/24 15:39:52
18	979	335.84935150475775	279.6268300983299	21/02/24 15:39:52
18	979	335.74824413563067	279.3849127906097	21/02/24 15:39:53
18	979	335.74824413563067	279.3849127906097	21/02/24 15:39:53
18	979	335.7695331830981	278.93448364820523	21/02/24 15:39:53
18	979	335.7695331830981	278.93448364820523	21/02/24 15:39:53
18	979	335.78405995923976	278.8659765325472	21/02/24 15:39:53
18	979	335.7733238980361	278.88973350048127	21/02/24 15:39:53
18	979	335.97330451775593	279.0661594141168	21/02/24 15:39:53
18	979	336.3995427064993	279.25399953367224	21/02/24 15:39:53
18	979	336.20086683248024	279.37275814928137	21/02/24 15:39:53
18	979	336.2501327323377	279.58628643537054	21/02/24 15:39:53
18	979	336.36057117319433	279.5826919064328	21/02/24 15:39:54
18	979	336.353513543777	279.58106654897074	21/02/24 15:39:54
18	979	336.365927903735	279.87341428646704	21/02/24 15:39:54
18	979	336.3910614631756	279.97351828551695	21/02/24 15:39:54
18	979	336.3732597738564	280.06695491595576	21/02/24 15:39:54
18	979	336.33286329763143	280.0523202376012	21/02/24 15:39:54
18	979	336.4805550099895	280.2754698029165	21/02/24 15:39:54
18	979	336.34489335299696	280.19551697561343	21/02/24 15:39:54
18	979	336.30078661971254	280.1324660838676	21/02/24 15:39:54
18	979	336.3721504673144	279.9027065438822	21/02/24 15:39:54
18	979	336.37875865329096	280.1523286001667	21/02/24 15:39:55
18	979	336.3695309711158	280.1988174665028	21/02/24 15:39:55
18	979	336.6323098575386	280.1588874886983	21/02/24 15:39:55
18	979	336.66492644976574	280.13681616365676	21/02/24 15:39:55
18	979	336.74370401058906	280.06304465213543	21/02/24 15:39:55
18	979	336.8553735504016	280.17512106412113	21/02/24 15:39:55
18	979	336.8474199826729	280.17288562816265	21/02/24 15:39:55
18	979	336.93506827199394	280.0638621557066	21/02/24 15:39:55
18	979	337.18162709335735	280.1626492778563	21/02/24 15:39:55
18	979	337.367049000486	280.0987392200215	21/02/24 15:39:56
18	979	337.40848067551246	280.3909637999762	21/02/24 15:39:56
18	979	337.43043950270686	280.4224214684056	21/02/24 15:39:56
18	979	337.5439856789089	280.43910098720823	21/02/24 15:39:56
18	979	337.52258994690663	280.37759834042396	21/02/24 15:39:56
18	979	337.52258994690663	280.37759834042396	21/02/24 15:39:56
18	979	337.52258994690663	280.37759834042396	21/02/24 15:39:56
18	979	337.7893050161799	280.2415126409656	21/02/24 15:39:56
18	979	337.95838565336845	280.1552428368658	21/02/24 15:39:56
18	979	338.15603942052513	280.0543942000513	21/02/24 15:39:56
18	979	338.3872863385567	279.93640537147235	21/02/24 15:39:57
18	979	338.56972289044023	279.84332099555957	21/02/24 15:39:57
18	979	338.79144048333103	279.73019430274474	21/02/24 15:39:57
18	979	338.79144048333103	279.73019430274474	21/02/24 15:39:57
18	979	339.1845964735864	279.5295948087757	21/02/24 15:39:57
18	979	339.4135839791511	279.41275879742136	21/02/24 15:39:57
18	979	339.5863718104022	279.3245974762865	21/02/24 15:39:57
18	979	339.76781737934374	279.23201872837285	21/02/24 15:39:57
18	979	339.9644831300623	279.1316742059619	21/02/24 15:39:57
18	979	340.21459618923063	279.00405932955715	21/02/24 15:39:58
18	979	340.45539713984084	278.8811957587686	21/02/24 15:39:58
18	979	340.62553256881495	278.7943877695625	21/02/24 15:39:58
18	979	340.8656041430757	278.6718963475654	21/02/24 15:39:58
18	979	341.0242510712358	278.5909501219006	21/02/24 15:39:58
18	979	341.26351631346955	278.46887011369495	21/02/24 15:39:58
18	979	341.5044597911562	278.34593382149274	21/02/24 15:39:58
18	979	341.69410019685586	278.2491738321696	21/02/24 15:39:58
18	979	341.86968740021257	278.15958419087247	21/02/24 15:39:58
18	979	341.9897832080023	278.09830785560723	21/02/24 15:39:58
18	979	341.9294117366317	278.10975128023085	21/02/24 15:39:59
18	979	341.86440934826913	278.07539443411355	21/02/24 15:39:59
18	979	341.8438293082196	278.0527138756265	21/02/24 15:39:59
18	979	342.11178707018763	278.13678743004726	21/02/24 15:39:59
18	979	342.18558942658154	278.17170376317193	21/02/24 15:39:59
18	979	342.1971751870639	278.1897360762496	21/02/24 15:39:59
18	979	342.02002393391706	278.1542873477067	21/02/24 15:39:59
18	979	342.0419257506722	278.2939134758679	21/02/24 15:39:59
18	979	341.8714181020489	278.2355273154743	21/02/24 15:39:59
18	979	341.6919581455032	278.1906960991654	21/02/24 15:39:59
18	979	341.9076683719022	278.1769324751933	21/02/24 15:40:00
18	979	341.88537521934023	278.02463212668493	21/02/24 15:40:00
18	979	341.7527442657929	277.8040564742435	21/02/24 15:40:00
18	979	341.8140454355862	277.66702038296364	21/02/24 15:40:00
18	979	341.7082151187257	277.56924284140115	21/02/24 15:40:00
18	979	341.6570259171699	277.6923103765849	21/02/24 15:40:00
18	979	341.7806887304414	277.75751479690956	21/02/24 15:40:00
18	979	341.8393723877793	277.86438138009504	21/02/24 15:40:00
18	979	341.78627748936094	277.859966791306	21/02/24 15:40:00
18	979	341.6483336182493	277.9125879181412	21/02/24 15:40:00
18	979	341.65920450033514	277.7413475979033	21/02/24 15:40:01
18	979	341.68096020005834	277.7267209923044	21/02/24 15:40:01
18	979	341.64405857071904	277.9874764970623	21/02/24 15:40:01
18	979	341.58137376137927	277.93626380635686	21/02/24 15:40:01
18	979	341.63532563915095	277.96136571883136	21/02/24 15:40:01
18	979	341.4845900822644	278.0126859907175	21/02/24 15:40:01
18	979	341.4970528076374	278.11246821369554	21/02/24 15:40:01
18	979	341.5719175972737	278.21007209783824	21/02/24 15:40:01
18	979	341.61457423103604	278.1331398892029	21/02/24 15:40:01
18	979	341.5542547737612	278.1511367596073	21/02/24 15:40:02
18	979	341.4411086518637	278.2763809896374	21/02/24 15:40:02
18	979	341.2764202600615	278.4192263422462	21/02/24 15:40:02
18	979	341.24617315271576	278.43405677122547	21/02/24 15:40:02
18	979	341.0358927470322	278.54760061258094	21/02/24 15:40:02
18	979	340.7856299938088	278.69560683255537	21/02/24 15:40:02
18	979	340.9466305756163	278.5271077397066	21/02/24 15:40:02
18	979	341.0767524503529	278.4992212770158	21/02/24 15:40:02
18	979	341.2727925190993	278.53583474040965	21/02/24 15:40:02
18	979	341.26374866380917	278.62544481217884	21/02/24 15:40:02
18	979	341.1021574121179	278.65874202291167	21/02/24 15:40:03
18	979	341.1138300934077	278.67369711113713	21/02/24 15:40:03
18	979	341.05077645595696	278.7756722980314	21/02/24 15:40:03
18	979	340.92323670020727	278.9584427795904	21/02/24 15:40:03
18	979	340.92560871997887	279.1821416682093	21/02/24 15:40:03
18	979	340.9274859205506	279.1733313087758	21/02/24 15:40:03
18	979	340.82463176529114	279.2527263463511	21/02/24 15:40:03
18	979	340.88586957470653	279.31712235409174	21/02/24 15:40:03
18	979	340.7803907231606	279.3892781267441	21/02/24 15:40:03
18	979	340.8352143526336	279.2474493548618	21/02/24 15:40:03
18	979	340.9029077177049	279.3276806805425	21/02/24 15:40:04
18	979	341.00623633215184	279.3758545994137	21/02/24 15:40:04
18	979	341.1106491118096	279.34344802404314	21/02/24 15:40:04
18	979	340.9689563475771	279.3588483663517	21/02/24 15:40:04
18	979	340.93621501956693	279.58660364212125	21/02/24 15:40:04
18	979	340.9276204639839	279.52978137242064	21/02/24 15:40:04
18	979	340.9489478467144	279.43932342358886	21/02/24 15:40:04
18	979	340.8844503986269	279.39461876026814	21/02/24 15:40:04
18	979	340.9774298915627	279.57901217381095	21/02/24 15:40:04
18	979	340.98135575946094	279.53696089995594	21/02/24 15:40:05
18	979	341.0974638252257	279.7499811136617	21/02/24 15:40:05
18	979	341.0907735455939	279.7732951897076	21/02/24 15:40:05
18	979	340.95493009494766	280.0037474935757	21/02/24 15:40:05
18	979	341.02074466181904	279.71479119600997	21/02/24 15:40:05
18	979	341.01711931010504	279.6989336170113	21/02/24 15:40:05
18	979	341.01711931010504	279.6989336170113	21/02/24 15:40:05
18	979	340.961552950091	279.62268765347835	21/02/24 15:40:05
18	979	340.9801522042221	279.6792087520321	21/02/24 15:40:05
18	979	340.805110927258	279.74940647490945	21/02/24 15:40:05
18	979	341.0907060704882	279.7006067617941	21/02/24 15:40:06
18	979	341.0907060704882	279.7006067617941	21/02/24 15:40:06
18	979	341.0905340839201	279.68447870599874	21/02/24 15:40:06
18	979	340.8547023904645	279.7538593511633	21/02/24 15:40:06
18	979	340.8547023904645	279.7538593511633	21/02/24 15:40:06
18	979	340.9174932928687	279.8141572156028	21/02/24 15:40:06
18	979	341.1728199753268	279.87942156633704	21/02/24 15:40:06
18	979	341.1728199753268	279.87942156633704	21/02/24 15:40:06
18	979	341.19869168582863	279.7633442219773	21/02/24 15:40:06
18	979	341.10139722950623	279.97503759334563	21/02/24 15:40:06
18	979	341.14882502127153	279.94508332222637	21/02/24 15:40:07
18	979	340.9744963191479	279.9661272373582	21/02/24 15:40:07
18	979	340.87826097265014	279.8670421017759	21/02/24 15:40:07
18	979	341.06961666374053	279.8415456190135	21/02/24 15:40:07
18	979	341.06961666374053	279.8415456190135	21/02/24 15:40:07
18	979	341.12275654145645	279.8685034049028	21/02/24 15:40:07
18	979	341.3197965078283	279.7368001787537	21/02/24 15:40:07
18	979	341.4995109083768	279.659207963401	21/02/24 15:40:07
18	979	341.4995109083768	279.659207963401	21/02/24 15:40:07
18	979	341.4165016257636	279.7205460529943	21/02/24 15:40:08
18	979	341.2544169860661	279.72402675941015	21/02/24 15:40:08
18	979	341.2462859635589	279.6965671905413	21/02/24 15:40:08
18	979	341.02898180061254	279.5082261641684	21/02/24 15:40:08
18	979	340.92358504489283	279.2902441696513	21/02/24 15:40:08
18	979	341.004661320663	279.25677115426413	21/02/24 15:40:08
18	979	341.0952919512021	279.4146409987298	21/02/24 15:40:08
18	979	341.07974576948067	279.3182471968827	21/02/24 15:40:08
18	979	340.91724992924503	279.34413158650636	21/02/24 15:40:08
18	979	341.16341089676985	279.322783293618	21/02/24 15:40:08
18	979	341.32119468400555	279.197824664458	21/02/24 15:40:09
18	979	341.4758278335546	279.37477268114066	21/02/24 15:40:09
18	979	341.41843023387315	279.08980731053197	21/02/24 15:40:09
18	979	341.3795395902932	279.13669973783595	21/02/24 15:40:09
18	979	341.5693533897843	279.01474459629196	21/02/24 15:40:09
18	979	341.4814805929522	278.9598627152131	21/02/24 15:40:09
18	979	341.2261119374714	278.9883178761637	21/02/24 15:40:09
18	979	340.9955440981586	279.10455981072744	21/02/24 15:40:09
18	979	341.03642635225293	278.96889940619747	21/02/24 15:40:09
18	979	341.03642635225293	278.96889940619747	21/02/24 15:40:09
18	979	340.98475594262794	278.8946732837021	21/02/24 15:40:10
18	979	340.98475594262794	278.8946732837021	21/02/24 15:40:10
18	979	341.0644941257097	278.62630850206386	21/02/24 15:40:10
18	979	340.8925835632431	278.5624269900343	21/02/24 15:40:10
18	979	340.97352264402195	278.6243880433469	21/02/24 15:40:10
18	979	340.89792389153484	278.71563300988356	21/02/24 15:40:10
18	979	341.1406682669357	278.978652807825	21/02/24 15:40:10
18	979	341.1406682669357	278.978652807825	21/02/24 15:40:10
18	979	341.14813773370906	278.9522601711724	21/02/24 15:40:10
18	979	341.14224152579504	278.9496439325365	21/02/24 15:40:11
18	979	341.0257672275211	278.8338981191411	21/02/24 15:40:11
18	979	340.82020536502944	278.84127255795255	21/02/24 15:40:11
18	979	340.82020536502944	278.84127255795255	21/02/24 15:40:11
18	979	340.82020536502944	278.84127255795255	21/02/24 15:40:11
18	979	341.160536333924	278.5681949666268	21/02/24 15:40:11
18	979	341.160536333924	278.5681949666268	21/02/24 15:40:11
18	979	341.51417352216333	278.28444062043457	21/02/24 15:40:11
18	979	341.66018354416303	278.16728388548734	21/02/24 15:40:11
18	979	341.66018354416303	278.16728388548734	21/02/24 15:40:11
18	979	341.81765606324655	278.04092977686474	21/02/24 15:40:12
18	979	342.1815264047495	277.74896446810874	21/02/24 15:40:12
18	979	342.36459753819327	277.6020703305447	21/02/24 15:40:12
18	979	342.5064496440062	277.488249858944	21/02/24 15:40:12
18	979	342.65391562027	277.36992488331384	21/02/24 15:40:12
18	979	342.65391562027	277.36992488331384	21/02/24 15:40:12
18	979	342.9887859812522	277.10122881994806	21/02/24 15:40:12
18	979	342.9887859812522	277.10122881994806	21/02/24 15:40:12
18	979	343.3208149543213	276.8348126530309	21/02/24 15:40:12
18	979	343.4394386465699	276.73963038895823	21/02/24 15:40:13
18	979	343.65477672012037	276.5668456358195	21/02/24 15:40:13
18	979	343.85471195195043	276.406419942834	21/02/24 15:40:13
18	979	344.03129705228287	276.2647301224235	21/02/24 15:40:13
18	979	344.2642341389104	276.0778241269059	21/02/24 15:40:13
18	979	344.39336387292116	275.974211937728	21/02/24 15:40:13
18	979	344.39336387292116	275.974211937728	21/02/24 15:40:13
18	979	344.6053036455247	275.80415394154653	21/02/24 15:40:13
18	979	344.7735293160904	275.66917162986783	21/02/24 15:40:13
18	979	344.99479104791317	275.49163380257284	21/02/24 15:40:13
18	979	345.2182676031459	275.3123188268627	21/02/24 15:40:14
18	979	345.38140476926213	275.1814194716749	21/02/24 15:40:14
18	979	345.5624052762603	275.0361867805673	21/02/24 15:40:14
18	979	345.7938655148502	274.85046579065227	21/02/24 15:40:14
18	979	345.948468512422	274.72641415254895	21/02/24 15:40:14
18	979	346.3233073349613	274.42564786281946	21/02/24 15:40:14
18	979	346.3233073349613	274.42564786281946	21/02/24 15:40:14
18	979	346.51886482848556	274.2687348158794	21/02/24 15:40:14
18	979	346.7435555462854	274.08844561031765	21/02/24 15:40:14
18	979	346.75153259636	274.0957245064213	21/02/24 15:40:14
18	979	346.69776642176856	274.13217823703496	21/02/24 15:40:15
18	979	346.60579215801636	274.24276496660997	21/02/24 15:40:15
18	979	346.71230450935377	274.1728873879394	21/02/24 15:40:15
18	979	346.8691613386946	274.0028954519982	21/02/24 15:40:15
18	979	346.99050846787014	274.18860849516307	21/02/24 15:40:15
18	979	347.01680405155594	274.19079790818466	21/02/24 15:40:15
18	979	347.17823458273926	274.1757377919946	21/02/24 15:40:15
18	979	347.3736971186786	274.285152242973	21/02/24 15:40:15
18	979	347.40123959852014	274.5167968037123	21/02/24 15:40:15
18	979	347.16708221835023	274.46030894212777	21/02/24 15:40:15
18	979	347.35718984684223	274.4359064463931	21/02/24 15:40:16
18	979	347.4978870048092	274.2796803783427	21/02/24 15:40:16
18	979	347.524936415007	274.5414051206685	21/02/24 15:40:16
18	979	347.50985548268284	274.5750339635254	21/02/24 15:40:16
18	979	347.65090334916425	274.61258599267234	21/02/24 15:40:16
18	979	347.4337840973667	274.51093134422325	21/02/24 15:40:16
18	979	347.59470985436053	274.53737282781685	21/02/24 15:40:16
18	979	347.33342640217273	274.4045981105814	21/02/24 15:40:16
18	979	347.31632819053164	274.454673602185	21/02/24 15:40:16
18	979	347.33812568008034	274.4074825660576	21/02/24 15:40:17
18	979	347.33274914622933	274.3541133873151	21/02/24 15:40:17
18	979	347.47589643361806	274.60460052629793	21/02/24 15:40:17
18	979	347.5494581375688	274.3436824546443	21/02/24 15:40:17
18	979	347.4640148824111	274.3313441957977	21/02/24 15:40:17
18	979	347.18256320643957	274.3598267934244	21/02/24 15:40:17
18	979	347.5334160973931	274.14879510838904	21/02/24 15:40:17
18	979	347.51970295090416	274.1458189655286	21/02/24 15:40:17
18	979	347.3424114362173	274.0682669547298	21/02/24 15:40:17
18	979	347.3424114362173	274.0682669547298	21/02/24 15:40:17
18	979	347.50697225198655	273.97390278747974	21/02/24 15:40:18
18	979	347.77523399934506	274.05084980358936	21/02/24 15:40:18
18	979	347.77523399934506	274.05084980358936	21/02/24 15:40:18
18	979	347.75101225169914	274.0756569965836	21/02/24 15:40:18
18	979	347.62389793831596	274.1579558189807	21/02/24 15:40:18
18	979	347.5860894441213	274.1410481302237	21/02/24 15:40:18
18	979	347.6128092983999	274.1792532251014	21/02/24 15:40:18
18	979	347.60499666692226	274.3789334147112	21/02/24 15:40:18
18	979	347.77473050818014	274.3555672417369	21/02/24 15:40:18
18	979	347.77473050818014	274.3555672417369	21/02/24 15:40:18
18	979	347.73886574931566	274.5142151417672	21/02/24 15:40:19
18	979	347.7755812069943	274.5919521641994	21/02/24 15:40:19
18	979	347.8318692857499	274.80226305517215	21/02/24 15:40:19
18	979	347.8318692857499	274.80226305517215	21/02/24 15:40:19
18	979	347.8986832245935	274.5393725191251	21/02/24 15:40:19
18	979	347.8986832245935	274.5393725191251	21/02/24 15:40:19
