floorId	partitionId	location_x	location_y	timeStamp
1	50	325.001351551218	289.2701281432007	20/04/28 05:13:25
1	50	325.07834446062606	289.0972416981146	20/04/28 05:13:25
1	50	325.05037354758036	289.0910906035055	20/04/28 05:13:25
1	50	324.8041623113136	289.1964237690068	20/04/28 05:13:25
1	50	324.91576561382783	289.1376758266512	20/04/28 05:13:26
1	50	324.8790191652512	289.1164000656959	20/04/28 05:13:26
1	50	325.0320966901867	288.98496295819086	20/04/28 05:13:26
1	50	324.9153246761859	289.22186410345233	20/04/28 05:13:26
1	50	325.13564597621837	289.21903968862273	20/04/28 05:13:26
1	50	325.13564597621837	289.21903968862273	20/04/28 05:13:26
1	50	324.86406698266524	289.1025107563949	20/04/28 05:13:26
1	50	324.74971414680715	289.07180861869784	20/04/28 05:13:26
1	50	324.65670042701964	289.1397532204707	20/04/28 05:13:26
1	50	324.81375324827985	289.3217573462267	20/04/28 05:13:26
1	50	324.86001758962766	289.52819466745063	20/04/28 05:13:27
1	50	325.0054527805305	289.63046171642685	20/04/28 05:13:27
1	50	324.8781180689152	289.6550020388983	20/04/28 05:13:27
1	50	324.97050655118557	289.69092455590277	20/04/28 05:13:27
1	50	324.93641320341226	289.73918769429156	20/04/28 05:13:27
1	50	324.6578872480917	289.83818321227614	20/04/28 05:13:27
1	50	324.6578872480917	289.83818321227614	20/04/28 05:13:27
1	50	324.49728562980994	289.91437964475216	20/04/28 05:13:27
1	50	324.4914087078556	289.92794596845874	20/04/28 05:13:27
1	50	324.59184724211804	289.91258706077815	20/04/28 05:13:28
1	50	324.4049944474387	289.9934071148515	20/04/28 05:13:28
1	50	324.2823606171204	289.7313599797882	20/04/28 05:13:28
1	50	324.2823606171204	289.7313599797882	20/04/28 05:13:28
1	50	324.27633424400983	289.68316770662256	20/04/28 05:13:28
1	50	324.27633424400983	289.68316770662256	20/04/28 05:13:28
1	50	324.2958053808067	289.6924369206523	20/04/28 05:13:28
1	50	324.27317420929364	289.7843687257006	20/04/28 05:13:28
1	50	324.36251454586943	289.7958156090981	20/04/28 05:13:28
1	50	324.36842431971706	289.7916366746086	20/04/28 05:13:28
1	50	324.44918565945267	290.07349177319816	20/04/28 05:13:29
1	50	324.65548395866097	290.1893411207321	20/04/28 05:13:29
1	50	324.5296205786439	290.02375558072583	20/04/28 05:13:29
1	50	324.5339358013165	290.1027202953034	20/04/28 05:13:29
1	50	324.40513856691757	290.1737452941942	20/04/28 05:13:29
1	50	324.26707921498723	290.29596214890563	20/04/28 05:13:29
1	50	324.33377852767825	290.3672881532443	20/04/28 05:13:29
1	50	324.3415418974439	290.3430290018337	20/04/28 05:13:29
1	50	324.3258368751517	290.30860144545676	20/04/28 05:13:29
1	50	324.37154080590324	290.31275214149775	20/04/28 05:13:30
1	50	324.2533906599355	290.1456354247393	20/04/28 05:13:30
1	50	324.21864750629925	290.18384711306015	20/04/28 05:13:30
1	50	324.3471145262233	290.1062695845519	20/04/28 05:13:30
1	50	324.18597093067785	290.15167357110994	20/04/28 05:13:30
1	50	324.17487898326436	290.1702851378956	20/04/28 05:13:30
1	50	324.08997832975024	290.09380878759634	20/04/28 05:13:30
1	50	324.07099154481205	289.98148685375196	20/04/28 05:13:30
1	50	324.126212190837	289.88064631799915	20/04/28 05:13:30
1	50	324.09979952156596	289.98262358498584	20/04/28 05:13:30
1	50	324.1583467338402	289.9962095431877	20/04/28 05:13:31
1	50	324.0399509200682	289.9747276218962	20/04/28 05:13:31
1	50	324.19781783112177	289.9912764439467	20/04/28 05:13:31
1	50	324.2259576697672	290.100232675923	20/04/28 05:13:31
1	50	324.13659060628385	290.23538208418756	20/04/28 05:13:31
1	50	324.0361312889711	290.14676367105915	20/04/28 05:13:31
1	50	323.9866346821225	290.00938747895964	20/04/28 05:13:31
1	50	323.892420511482	290.22294582241676	20/04/28 05:13:31
1	50	324.0254857052083	290.3307079339159	20/04/28 05:13:31
1	50	323.99703892224835	290.32714233166155	20/04/28 05:13:31
1	50	323.7524997165202	290.48604591909975	20/04/28 05:13:32
1	50	323.5251619779467	290.5215553826267	20/04/28 05:13:32
1	50	323.5073815518055	290.6910023097663	20/04/28 05:13:32
1	50	323.7090891306481	290.7155378692049	20/04/28 05:13:32
1	50	323.7580872550466	290.42908990988275	20/04/28 05:13:32
1	50	323.7557496100091	290.32588879617526	20/04/28 05:13:32
1	50	323.64407864059604	290.3778067094027	20/04/28 05:13:32
1	50	323.64407864059604	290.3778067094027	20/04/28 05:13:32
1	50	323.64407864059604	290.3778067094027	20/04/28 05:13:32
1	50	323.3920063809561	290.38249950869016	20/04/28 05:13:33
1	50	323.42458053953004	290.38410864011166	20/04/28 05:13:33
1	50	323.4932602032812	290.43547151466475	20/04/28 05:13:33
1	50	323.59273344158913	290.21760738303743	20/04/28 05:13:33
1	50	323.6466958924255	290.03338438822277	20/04/28 05:13:33
1	50	323.63456781858514	289.8152832456947	20/04/28 05:13:33
1	50	323.90519108953083	289.68926693491716	20/04/28 05:13:33
1	50	323.84892349640523	289.6770003092464	20/04/28 05:13:33
1	50	324.00204959753063	289.57450509678483	20/04/28 05:13:33
1	50	324.049478528391	289.5743520839603	20/04/28 05:13:33
1	50	323.78584633811477	289.5356891710109	20/04/28 05:13:34
1	50	323.78779495881645	289.4107670088346	20/04/28 05:13:34
1	50	323.85489666121595	289.2725391083537	20/04/28 05:13:34
1	50	323.9203644099616	289.153369759436	20/04/28 05:13:34
1	50	323.8178390848375	289.0263697451622	20/04/28 05:13:34
1	50	323.7199823262564	289.05558811520876	20/04/28 05:13:34
1	50	323.5007026316793	289.024747593083	20/04/28 05:13:34
1	50	323.6001790445229	289.0290284424414	20/04/28 05:13:34
1	50	323.4194641863031	289.21410797542615	20/04/28 05:13:34
1	50	323.3274916526457	288.9320891406655	20/04/28 05:13:34
1	50	323.18072500278447	288.85843932862366	20/04/28 05:13:35
1	50	323.33299110689074	288.8205476059521	20/04/28 05:13:35
1	50	323.2735446408532	288.84333533370767	20/04/28 05:13:35
1	50	323.28008784370485	288.85594376649755	20/04/28 05:13:35
1	50	323.4025514142871	288.7501308914657	20/04/28 05:13:35
1	50	323.42104245299385	288.7418405189803	20/04/28 05:13:35
1	50	323.42375609766816	288.72500333337103	20/04/28 05:13:35
1	50	323.6441800067917	288.71414418973086	20/04/28 05:13:35
1	50	323.68791767477774	288.80053665593215	20/04/28 05:13:35
1	50	323.7296284076185	288.7887278055186	20/04/28 05:13:36
1	50	323.770244297972	288.90095597523856	20/04/28 05:13:36
1	50	323.78290032695514	289.00839534356584	20/04/28 05:13:36
1	50	323.8717124444918	288.8644098952551	20/04/28 05:13:36
1	50	323.71867759218304	289.10561688303835	20/04/28 05:13:36
1	50	323.95995973294987	289.021915323361	20/04/28 05:13:36
1	50	323.8632514654882	288.9137298432634	20/04/28 05:13:36
1	50	324.0865904777022	288.8812635903705	20/04/28 05:13:36
1	50	324.1620504715296	288.99280559992985	20/04/28 05:13:36
1	50	324.1379628598203	289.00563469421087	20/04/28 05:13:36
1	50	324.2407995677821	288.9217482254541	20/04/28 05:13:37
1	50	324.1023098218641	288.88268115319295	20/04/28 05:13:37
1	50	324.108411909798	288.8491983356708	20/04/28 05:13:37
1	50	324.1367935854252	289.07998366788735	20/04/28 05:13:37
1	50	324.16204455683345	289.07609022996667	20/04/28 05:13:37
1	50	324.1727168723877	289.0142845085334	20/04/28 05:13:37
1	50	324.21838975516175	288.98831177642126	20/04/28 05:13:37
1	50	324.21543690240685	288.97723099730524	20/04/28 05:13:37
1	50	324.2475993995783	288.9624311491644	20/04/28 05:13:37
1	50	324.16406526692776	289.19275025870746	20/04/28 05:13:38
1	50	324.11923468910544	289.17080255091594	20/04/28 05:13:38
1	50	324.28078338473466	289.31321520063625	20/04/28 05:13:38
1	50	324.21296442943003	289.2496928038664	20/04/28 05:13:38
1	50	324.20824175982915	289.24218919007285	20/04/28 05:13:38
1	50	324.231944678982	289.401638702256	20/04/28 05:13:38
1	50	324.34235224601923	289.3940779269212	20/04/28 05:13:38
1	50	324.4139065418901	289.10743386779626	20/04/28 05:13:38
1	50	324.1874343724853	289.1971242610876	20/04/28 05:13:38
1	50	324.2991868558253	289.2695405993509	20/04/28 05:13:38
1	50	324.1731893404336	289.510373482437	20/04/28 05:13:39
1	50	324.158917153908	289.49295176380355	20/04/28 05:13:39
1	50	324.1693919128719	289.69594692703765	20/04/28 05:13:39
1	50	324.19618306262953	289.77056456610944	20/04/28 05:13:39
1	50	324.46886409774925	289.8754108884664	20/04/28 05:13:39
1	50	324.512731787572	290.1271450829333	20/04/28 05:13:39
1	50	324.61967773871515	289.87684354970327	20/04/28 05:13:39
1	50	324.59398107209495	289.66211975604193	20/04/28 05:13:39
1	50	324.63227909974074	289.47447355984104	20/04/28 05:13:39
1	50	324.8367953041893	289.3033880290197	20/04/28 05:13:39
1	50	324.8310440692564	289.22873989271733	20/04/28 05:13:40
1	50	324.88008269397625	289.1322362377849	20/04/28 05:13:40
1	50	324.98253409243915	289.05265102892776	20/04/28 05:13:40
1	50	324.8741104217076	289.08823360214365	20/04/28 05:13:40
1	50	324.87808637355596	289.06872527234844	20/04/28 05:13:40
1	50	324.8763611000995	289.0669798351461	20/04/28 05:13:40
1	50	324.8518709620419	289.27480215558	20/04/28 05:13:40
1	50	324.81309373400757	289.5052042101037	20/04/28 05:13:40
1	50	324.8723130904629	289.4088616584608	20/04/28 05:13:40
1	50	324.873822688881	289.41013115877263	20/04/28 05:13:41
1	50	324.8791658961451	289.3540167841631	20/04/28 05:13:41
1	50	325.0726698664471	289.21049031502105	20/04/28 05:13:41
1	50	325.066521808832	289.42671812289	20/04/28 05:13:41
1	50	325.0241675555947	289.25118466834743	20/04/28 05:13:41
1	50	325.1680773167548	289.3944332090339	20/04/28 05:13:41
1	50	325.1391577364408	289.24395321290785	20/04/28 05:13:41
1	50	325.12548047741524	289.25423212517757	20/04/28 05:13:41
1	50	325.2121887249743	289.34870437932585	20/04/28 05:13:41
1	50	325.4787123827415	289.21656366851	20/04/28 05:13:41
1	50	325.4794614533117	289.2010662368106	20/04/28 05:13:42
1	50	325.49843143669204	289.1876481530718	20/04/28 05:13:42
1	50	325.32466208479696	289.12367996576796	20/04/28 05:13:42
1	50	325.24808406344914	289.20892999861974	20/04/28 05:13:42
1	50	325.2897322266368	289.24021053361776	20/04/28 05:13:42
1	50	325.02172348527745	289.2415217049473	20/04/28 05:13:42
1	50	325.10354303319076	289.0616816589337	20/04/28 05:13:42
1	50	325.31845199351585	288.88926482458197	20/04/28 05:13:42
1	50	325.425247648627	288.85888430086396	20/04/28 05:13:42
1	50	325.1977776637659	288.7644381023044	20/04/28 05:13:42
1	50	325.1311865816192	289.02915706803134	20/04/28 05:13:43
1	50	325.14081913393386	289.11697082500706	20/04/28 05:13:43
1	50	325.26022929492643	288.87811424861144	20/04/28 05:13:43
1	50	325.39190005864583	288.9423633420134	20/04/28 05:13:43
1	50	325.38282344168806	288.94003750214904	20/04/28 05:13:43
1	50	325.4740886456994	288.96126799580406	20/04/28 05:13:43
1	50	325.2587780293051	289.11433340688626	20/04/28 05:13:43
1	50	325.4164154088629	289.1626312753427	20/04/28 05:13:43
1	50	325.6658454667928	289.0030873727404	20/04/28 05:13:43
1	50	325.70474693518815	289.01055186701643	20/04/28 05:13:44
1	50	325.7427632539026	289.0181542041955	20/04/28 05:13:44
1	50	325.8249156956305	289.0182797676498	20/04/28 05:13:44
1	50	325.68155584008207	289.27822710214616	20/04/28 05:13:44
1	50	325.67189836448784	289.2847361581911	20/04/28 05:13:44
1	50	325.55573552569837	289.3366894641495	20/04/28 05:13:44
1	50	325.58609457891833	289.05762774433776	20/04/28 05:13:44
1	50	325.85399644126505	288.9569832981478	20/04/28 05:13:44
1	50	326.13631693443887	288.9982236977539	20/04/28 05:13:44
1	50	326.14212141046676	288.99842926655634	20/04/28 05:13:44
1	50	326.1567317333316	289.14963302824873	20/04/28 05:13:45
1	50	326.2712736150624	289.01368964180557	20/04/28 05:13:45
1	50	326.2656199317266	289.01882870252246	20/04/28 05:13:45
1	50	326.0824806540301	289.0095524089446	20/04/28 05:13:45
1	50	325.880614669176	289.1867248810549	20/04/28 05:13:45
1	50	325.87251226906284	289.1963392188002	20/04/28 05:13:45
1	50	326.0847190456527	289.3591722296816	20/04/28 05:13:45
1	50	326.05870610238657	289.40571955163307	20/04/28 05:13:45
1	50	325.9963216527053	289.24781087118873	20/04/28 05:13:45
1	50	326.0771849851919	289.33167581565306	20/04/28 05:13:45
1	50	326.15726362531825	289.4750623149061	20/04/28 05:13:46
1	50	326.22775726429285	289.61249497119513	20/04/28 05:13:46
1	50	326.04201963781605	289.79641866673666	20/04/28 05:13:46
1	50	326.08102194053487	289.80289755747924	20/04/28 05:13:46
1	50	326.37165474699236	289.77676816324424	20/04/28 05:13:46
1	50	326.4274054015952	289.6022576639156	20/04/28 05:13:46
1	50	326.24587292484864	289.3829721749849	20/04/28 05:13:46
1	50	326.2531617020661	289.35888964128554	20/04/28 05:13:46
1	50	326.2466716963156	289.3956217458794	20/04/28 05:13:46
1	50	326.0878213594094	289.24477639513407	20/04/28 05:13:47
1	50	325.923115220257	289.19965547784255	20/04/28 05:13:47
1	50	325.8929333617251	289.1111099281759	20/04/28 05:13:47
1	50	325.76053892592154	288.9057651503439	20/04/28 05:13:47
1	50	325.7054786467975	288.96972562097943	20/04/28 05:13:47
1	50	325.67266586587834	289.0433591522396	20/04/28 05:13:47
1	50	325.81997524798646	289.0253853580385	20/04/28 05:13:47
1	50	325.8910802953085	288.9358733168654	20/04/28 05:13:47
1	50	325.9857831122919	289.0329510740897	20/04/28 05:13:47
1	50	326.02015531238965	289.1756813047198	20/04/28 05:13:47
1	50	325.8972447319121	289.1189261049942	20/04/28 05:13:48
1	50	325.8244443795837	289.0420127915684	20/04/28 05:13:48
1	50	325.614526226456	289.21384486990183	20/04/28 05:13:48
1	50	325.7165793463307	289.4204237139714	20/04/28 05:13:48
1	50	325.6720977685284	289.45906373799306	20/04/28 05:13:48
1	50	325.6912075408395	289.54017626428595	20/04/28 05:13:48
1	50	325.58633858992425	289.66868673637146	20/04/28 05:13:48
1	50	325.71126512473666	289.8881622602338	20/04/28 05:13:48
1	50	325.74092915841936	289.6378727924388	20/04/28 05:13:48
1	50	325.6520133438363	289.5593812948208	20/04/28 05:13:48
1	50	325.6054028156666	289.56782066238657	20/04/28 05:13:49
1	50	325.62270462103874	289.55540502874555	20/04/28 05:13:49
1	50	325.5722606310161	289.5424020579571	20/04/28 05:13:49
1	50	325.59601683945925	289.4373473683538	20/04/28 05:13:49
1	50	325.7547369683853	289.56136413965476	20/04/28 05:13:49
1	50	325.9544754124898	289.5095115470869	20/04/28 05:13:49
1	50	325.92194730022686	289.4320656654509	20/04/28 05:13:49
1	50	325.7720437762828	289.2559366011123	20/04/28 05:13:49
1	50	325.99867443383414	289.16402039325624	20/04/28 05:13:49
1	50	325.8588416680522	289.231633762407	20/04/28 05:13:50
1	50	325.8459068262013	289.0315291428961	20/04/28 05:13:50
1	50	326.1052261104361	289.02474827596654	20/04/28 05:13:50
1	50	325.949146053694	288.7935347794664	20/04/28 05:13:50
1	50	325.8177440043985	288.6913905242772	20/04/28 05:13:50
1	50	325.82281547872395	288.62259486248104	20/04/28 05:13:50
1	50	325.81908207111206	288.63971499642264	20/04/28 05:13:50
1	50	325.9927074081135	288.7630042328852	20/04/28 05:13:50
1	50	325.73650934413627	288.6551200916374	20/04/28 05:13:50
1	50	325.80896870636036	288.7332437952354	20/04/28 05:13:50
1	50	325.7776224618661	288.7551111018316	20/04/28 05:13:51
1	50	325.7435318859347	288.7591783359783	20/04/28 05:13:51
1	50	325.73892619583296	288.70722517539264	20/04/28 05:13:51
1	50	325.8927738892303	288.7202059517612	20/04/28 05:13:51
1	50	326.0332533973148	288.490129182382	20/04/28 05:13:51
1	50	325.7936242435778	288.48005687326366	20/04/28 05:13:51
1	50	325.6979951423934	288.3631972090731	20/04/28 05:13:51
1	50	325.81244742996626	288.3240220394293	20/04/28 05:13:51
1	50	325.84336916134123	288.23781776209086	20/04/28 05:13:51
1	50	325.66703529574784	288.16256871701745	20/04/28 05:13:52
1	50	325.77188870191287	287.9319719214717	20/04/28 05:13:52
1	50	325.7080288394789	287.9284999237746	20/04/28 05:13:52
1	50	325.61831152150586	288.1923018941314	20/04/28 05:13:52
1	50	325.60614321344815	288.2145482232671	20/04/28 05:13:52
1	50	325.7435615924011	288.1667869926539	20/04/28 05:13:52
1	50	325.7419819075936	288.1681591499235	20/04/28 05:13:52
1	50	325.56907778803	288.03130688092176	20/04/28 05:13:52
1	50	325.57071045766475	288.06273697839316	20/04/28 05:13:52
1	50	325.56258625343185	288.0549976299882	20/04/28 05:13:52
1	50	325.71712058954466	288.0874228610115	20/04/28 05:13:53
1	50	325.72198050414136	288.02643291152543	20/04/28 05:13:53
1	50	325.6296948463374	287.97848553189885	20/04/28 05:13:53
1	50	325.6741214713047	287.9894327768789	20/04/28 05:13:53
1	50	325.6558103598057	288.1263770889856	20/04/28 05:13:53
1	50	325.4368688437029	288.0090029271938	20/04/28 05:13:53
1	50	325.5462155055177	288.1667355143827	20/04/28 05:13:53
1	50	325.7629293226014	288.2764563009985	20/04/28 05:13:53
1	50	325.7422697180048	288.06352433184486	20/04/28 05:13:53
1	50	325.6024547365415	288.3269226700422	20/04/28 05:13:53
1	50	325.37558626183215	288.2659786424204	20/04/28 05:13:54
1	50	325.3875134559857	288.2507500059845	20/04/28 05:13:54
1	50	325.65155193502596	288.3141970646668	20/04/28 05:13:54
1	50	325.85967090711324	288.3408614090298	20/04/28 05:13:54
1	50	325.7074139815082	288.45682853080956	20/04/28 05:13:54
1	50	325.88030263788966	288.63278397917526	20/04/28 05:13:54
1	50	326.1182731315359	288.75546803837574	20/04/28 05:13:54
1	50	325.95549588770405	288.7561583909832	20/04/28 05:13:54
1	50	326.0660897217736	288.66242285046366	20/04/28 05:13:54
1	50	325.9072402035355	288.73673406581224	20/04/28 05:13:55
1	50	325.8416315298624	288.89586851130986	20/04/28 05:13:55
1	50	325.8082470553906	288.86826775189473	20/04/28 05:13:55
1	50	325.9415074046925	289.11272664019896	20/04/28 05:13:55
1	50	325.9406088908085	289.1960972517972	20/04/28 05:13:55
1	50	325.7465848391058	289.2428553908583	20/04/28 05:13:55
1	50	325.78205369438297	289.421302437753	20/04/28 05:13:55
1	50	325.7788238268324	289.42384487623275	20/04/28 05:13:55
1	50	325.79738912425495	289.4507479439133	20/04/28 05:13:55
1	50	325.7515276962052	289.59516482286017	20/04/28 05:13:55
1	50	325.76674127519976	289.4581122942426	20/04/28 05:13:56
1	50	325.8711919668013	289.60293200755757	20/04/28 05:13:56
1	50	326.13404502505745	289.67640426611365	20/04/28 05:13:56
1	50	326.0577411055258	289.9641298223654	20/04/28 05:13:56
1	50	326.12766609857175	289.89214876782376	20/04/28 05:13:56
1	50	326.0813610217423	289.98003212393365	20/04/28 05:13:56
1	50	326.14583272051146	290.0101701164565	20/04/28 05:13:56
1	50	326.30012848671146	289.9206848586396	20/04/28 05:13:56
1	50	326.20405890297656	290.0596912720095	20/04/28 05:13:56
1	50	325.93311102750846	289.9351865358	20/04/28 05:13:56
1	50	325.8917780451534	289.72341112453324	20/04/28 05:13:57
1	50	325.7952203596296	289.9965930253	20/04/28 05:13:57
1	50	325.65082220191397	289.78764336555264	20/04/28 05:13:57
1	50	325.69131985518845	289.78775995211043	20/04/28 05:13:57
1	50	325.6723720626769	289.7714949712608	20/04/28 05:13:57
1	50	325.5950285342146	289.7954800430124	20/04/28 05:13:57
1	50	325.5638962827371	289.9255969330369	20/04/28 05:13:57
1	50	325.6427222250922	290.04559803383165	20/04/28 05:13:57
1	50	325.5955296747689	289.99325617306687	20/04/28 05:13:57
1	50	325.7244319432109	289.98857670712647	20/04/28 05:13:58
1	50	325.8301346309975	289.94241136844107	20/04/28 05:13:58
1	50	325.7636385955163	289.9270674366844	20/04/28 05:13:58
1	50	325.9277984405383	290.00134178458904	20/04/28 05:13:58
1	50	325.92028364755276	289.9792286863043	20/04/28 05:13:58
1	50	325.9080524074458	289.818786556548	20/04/28 05:13:58
1	50	325.9051944689912	289.65611547765485	20/04/28 05:13:58
1	50	325.73982246548235	289.6193974301371	20/04/28 05:13:58
1	50	325.6094682054908	289.7554455821491	20/04/28 05:13:58
1	50	325.6718793698694	289.88310792993184	20/04/28 05:13:58
1	50	325.4200192137681	290.0331643957609	20/04/28 05:13:59
1	50	325.6229412174931	290.09840214073034	20/04/28 05:13:59
1	50	325.57807627512415	289.97570305528706	20/04/28 05:13:59
1	50	325.83201375707915	290.08082014207025	20/04/28 05:13:59
1	50	325.95239207342445	290.2451662394107	20/04/28 05:13:59
1	50	325.74204106267945	290.38491431673043	20/04/28 05:13:59
1	50	325.7239113132499	290.4619056684713	20/04/28 05:13:59
1	50	325.7704406858685	290.43697761232835	20/04/28 05:13:59
1	50	325.703868573457	290.38700339492317	20/04/28 05:13:59
1	50	325.80193563057446	290.5294436065122	20/04/28 05:13:59
1	50	325.93708350305536	290.68065314522414	20/04/28 05:14:00
1	50	325.9560471760309	290.60615001896315	20/04/28 05:14:00
1	50	326.10316327758756	290.3681068591923	20/04/28 05:14:00
1	50	326.05026528754183	290.35295765591894	20/04/28 05:14:00
1	50	326.0383589250661	290.3425645939162	20/04/28 05:14:00
1	50	325.8779637059969	290.260171502183	20/04/28 05:14:00
1	50	325.9805276210044	290.28366237218694	20/04/28 05:14:00
1	50	326.1737861047235	290.06799659731547	20/04/28 05:14:00
1	50	326.1259278912405	290.06145944228734	20/04/28 05:14:00
1	50	326.16432962386386	290.106926242586	20/04/28 05:14:01
1	50	326.16371384896297	290.15020926202305	20/04/28 05:14:01
1	50	326.26247521022333	290.18130989408127	20/04/28 05:14:01
1	50	326.4251087543237	290.2540005894469	20/04/28 05:14:01
1	50	326.38153315673947	290.2084860312502	20/04/28 05:14:01
1	50	326.49755141597933	290.37878875874907	20/04/28 05:14:01
1	50	326.4601219139203	290.16831773544754	20/04/28 05:14:01
1	50	326.5843569698897	290.327054378567	20/04/28 05:14:01
1	50	326.5620943176189	290.2320470449691	20/04/28 05:14:01
1	50	326.58525004510125	290.2674076501942	20/04/28 05:14:01
1	50	326.4243521246978	290.20375063297035	20/04/28 05:14:02
1	50	326.5037539709875	290.21824098439396	20/04/28 05:14:02
1	50	326.5037539709875	290.21824098439396	20/04/28 05:14:02
1	50	326.5037539709875	290.21824098439396	20/04/28 05:14:02
1	50	326.5440610772516	290.26963746248754	20/04/28 05:14:02
1	50	326.63690335848224	290.26414804388895	20/04/28 05:14:02
1	50	326.6435265832642	290.20303359798106	20/04/28 05:14:02
1	50	326.6404505908364	290.2212167812204	20/04/28 05:14:02
1	50	326.44876870717286	290.04249423594075	20/04/28 05:14:02
1	50	326.4312606660556	290.04517985298327	20/04/28 05:14:02
1	50	326.62355366330894	290.050059629359	20/04/28 05:14:03
1	50	326.41123135691953	289.9921785038225	20/04/28 05:14:03
1	50	326.3980104127422	289.75281980431976	20/04/28 05:14:03
1	50	326.5107247607797	289.82420871944436	20/04/28 05:14:03
1	50	326.69004106469	289.61379714560593	20/04/28 05:14:03
1	50	326.67487323833245	289.53766680350964	20/04/28 05:14:03
1	50	326.65828341945536	289.5564289908068	20/04/28 05:14:03
1	50	326.68139974011774	289.5597091037734	20/04/28 05:14:03
1	50	326.63591719207284	289.5817621320235	20/04/28 05:14:03
1	50	326.5619167376293	289.4600007961852	20/04/28 05:14:04
1	50	326.5619167376293	289.4600007961852	20/04/28 05:14:04
1	50	326.492321403005	289.6470140002847	20/04/28 05:14:04
1	50	326.6462118074172	289.86980841758333	20/04/28 05:14:04
1	50	326.3824036942934	289.80638212575303	20/04/28 05:14:04
1	50	326.3346725253763	289.7173200477012	20/04/28 05:14:04
1	50	326.34136798518034	289.8419497074105	20/04/28 05:14:04
1	50	326.5368677327516	289.94470581126814	20/04/28 05:14:04
1	50	326.52732264430006	290.0292328064024	20/04/28 05:14:04
1	50	326.7187326550883	290.20456786948506	20/04/28 05:14:04
1	50	326.80831676187387	290.41837042650445	20/04/28 05:14:05
1	50	327.0277362656712	290.45626508069415	20/04/28 05:14:05
1	50	326.87936367333225	290.66944461463373	20/04/28 05:14:05
1	50	326.9808849954131	290.5909502359255	20/04/28 05:14:05
1	50	326.9169442716814	290.6878064234512	20/04/28 05:14:05
1	50	327.1395937173179	290.6980913839745	20/04/28 05:14:05
1	50	327.3287413633047	290.91119815644134	20/04/28 05:14:05
1	50	327.24562343036916	290.721339434661	20/04/28 05:14:05
1	50	327.06471369132424	290.79274453383357	20/04/28 05:14:05
1	50	327.22654315445124	291.031198406559	20/04/28 05:14:06
1	50	327.36792996315586	291.1177507390097	20/04/28 05:14:06
1	50	327.2892739257788	291.3144329406224	20/04/28 05:14:06
1	50	327.1486105864737	291.36507408758325	20/04/28 05:14:06
1	50	327.15546104136973	291.36079612829695	20/04/28 05:14:06
1	50	327.06826138690076	291.4183019557323	20/04/28 05:14:06
1	50	326.89992337492555	291.27703837124324	20/04/28 05:14:06
1	50	327.04319566431525	291.3838587266993	20/04/28 05:14:06
1	50	327.057721931396	291.3636891980249	20/04/28 05:14:06
1	50	327.0122947512373	291.3090768366656	20/04/28 05:14:06
1	50	326.88990848403745	291.4700954398472	20/04/28 05:14:07
1	50	326.8910291072246	291.4645476668553	20/04/28 05:14:07
1	50	326.7376038731145	291.3307005696868	20/04/28 05:14:07
1	50	326.6056011145587	291.50891971148803	20/04/28 05:14:07
1	50	326.5847316684233	291.3422327361749	20/04/28 05:14:07
1	50	326.540903366561	291.2821190718811	20/04/28 05:14:07
1	50	326.7537476652962	291.0739891518521	20/04/28 05:14:07
1	50	326.6204413819836	291.2987489729957	20/04/28 05:14:07
1	50	326.6806426205182	291.3146311117046	20/04/28 05:14:07
1	50	326.67900515081703	291.2616872976295	20/04/28 05:14:07
1	50	326.64274393834165	291.23307034051254	20/04/28 05:14:08
1	50	326.47459166944043	291.1571413143971	20/04/28 05:14:08
1	50	326.4129742034228	291.2730602481746	20/04/28 05:14:08
1	50	326.42782859371994	291.2557368851711	20/04/28 05:14:08
1	50	326.5630946132795	291.4673616648666	20/04/28 05:14:08
1	50	326.6233082339497	291.4589017460354	20/04/28 05:14:08
1	50	326.6162944453137	291.459438479051	20/04/28 05:14:08
1	50	326.57822205134937	291.21399778303334	20/04/28 05:14:08
1	50	326.6498708025852	291.2379049678951	20/04/28 05:14:08
1	50	326.6608917194488	291.2637744416712	20/04/28 05:14:09
1	50	326.53053215901383	291.37523354979066	20/04/28 05:14:09
1	50	326.5443235279075	291.2617702088538	20/04/28 05:14:09
1	50	326.5462078706244	291.25770969259736	20/04/28 05:14:09
1	50	326.34967260157026	291.42471183249074	20/04/28 05:14:09
1	50	326.17149724162334	291.518599865787	20/04/28 05:14:09
1	50	326.18761142303936	291.2526132150148	20/04/28 05:14:09
1	50	326.3203127652039	291.16487472514984	20/04/28 05:14:09
1	50	326.0711928914578	291.03416088436256	20/04/28 05:14:09
1	50	325.9472943803088	291.0828807509564	20/04/28 05:14:09
1	50	325.98307867094576	291.1194738234606	20/04/28 05:14:10
1	50	325.81023400770977	291.0700069526074	20/04/28 05:14:10
1	50	325.755436279147	291.0732584610647	20/04/28 05:14:10
1	50	325.62658630200184	291.25993439093696	20/04/28 05:14:10
1	50	325.55018349140477	290.9965057684762	20/04/28 05:14:10
1	50	325.452982633009	291.00110995645434	20/04/28 05:14:10
1	50	325.3763201520071	291.18583332749466	20/04/28 05:14:10
1	50	325.16915418452913	290.9762185298021	20/04/28 05:14:10
1	50	325.16915418452913	290.9762185298021	20/04/28 05:14:10
1	50	325.10406521082547	290.974830841333	20/04/28 05:14:10
1	50	325.12409247123645	291.21347259342537	20/04/28 05:14:11
1	50	325.3241967715641	291.4019036023236	20/04/28 05:14:11
1	50	325.51191692893036	291.60305531344636	20/04/28 05:14:11
1	50	325.284559184663	291.4025646292199	20/04/28 05:14:11
1	50	325.284559184663	291.4025646292199	20/04/28 05:14:11
1	50	325.1122888050241	291.49086024124836	20/04/28 05:14:11
1	50	325.3544719968578	291.3291032085435	20/04/28 05:14:11
1	50	325.3197523435323	291.33473284342625	20/04/28 05:14:11
1	50	325.28121790047646	291.08657019640196	20/04/28 05:14:11
1	50	325.2809960482042	291.08792376422207	20/04/28 05:14:12
1	50	325.2891763488811	291.044879084074	20/04/28 05:14:12
1	50	325.1327065354597	290.91353790529956	20/04/28 05:14:12
1	50	325.154634649209	291.104416083902	20/04/28 05:14:12
1	50	325.096638592684	291.15854593227124	20/04/28 05:14:12
1	50	325.15888829941264	291.37312832288524	20/04/28 05:14:12
1	50	324.95836325756886	291.18945274618875	20/04/28 05:14:12
1	50	324.9421947309388	291.1922360288561	20/04/28 05:14:12
1	50	324.80412445675853	291.2158977198906	20/04/28 05:14:12
1	50	324.5686040259195	291.14143010478494	20/04/28 05:14:12
1	50	324.58595979774503	290.8969908831717	20/04/28 05:14:13
1	50	324.5662914890366	290.91982746827637	20/04/28 05:14:13
1	50	324.4955979707532	290.8680865195179	20/04/28 05:14:13
1	50	324.46654524371917	291.1089375429692	20/04/28 05:14:13
1	50	324.574629369173	291.21615524173995	20/04/28 05:14:13
1	50	324.4992311852452	291.4487168239541	20/04/28 05:14:13
1	50	324.43648944877935	291.4152588027998	20/04/28 05:14:13
1	50	324.3419544870601	291.4038581975974	20/04/28 05:14:13
1	50	324.2740190259977	291.6397506173971	20/04/28 05:14:13
1	50	324.3264364844538	291.6148397311405	20/04/28 05:14:13
1	50	324.2246828378739	291.48137086541294	20/04/28 05:14:14
1	50	323.96553694596724	291.3820046838724	20/04/28 05:14:14
1	50	323.80141700456505	291.6028112551126	20/04/28 05:14:14
1	50	323.92344228975674	291.70334735397535	20/04/28 05:14:14
1	50	323.95072660600783	291.5938246838567	20/04/28 05:14:14
1	50	324.0232705838441	291.73520674610086	20/04/28 05:14:14
1	50	324.02008664709814	291.6539465736024	20/04/28 05:14:14
1	50	324.0727659279235	291.5633549247874	20/04/28 05:14:14
1	50	324.1401154411657	291.4860656254853	20/04/28 05:14:14
1	50	324.3363584053018	291.41881983998087	20/04/28 05:14:15
1	50	324.2125926576582	291.6289613823944	20/04/28 05:14:15
1	50	324.3810575299219	291.52059219358944	20/04/28 05:14:15
1	50	324.6009123730948	291.4886760731414	20/04/28 05:14:15
1	50	324.62197743368955	291.4310424327519	20/04/28 05:14:15
1	50	324.74146896027975	291.50266995551647	20/04/28 05:14:15
1	50	324.73139140222617	291.56416173489487	20/04/28 05:14:15
1	50	324.79059782257536	291.5483620107595	20/04/28 05:14:15
1	50	324.8280536705812	291.47727622933303	20/04/28 05:14:15
1	50	324.8679607356147	291.508659414248	20/04/28 05:14:15
1	50	325.001647868425	291.28505955019546	20/04/28 05:14:16
1	50	324.9565191996694	291.3069975424676	20/04/28 05:14:16
1	50	324.9553303048523	291.2512925232372	20/04/28 05:14:16
1	50	324.9902398452666	291.2325415275401	20/04/28 05:14:16
1	50	325.00119219508844	291.25861950373354	20/04/28 05:14:16
1	50	325.11630523955483	291.30885151527553	20/04/28 05:14:16
1	50	325.1555076909808	291.3688073448968	20/04/28 05:14:16
1	50	325.32802106640855	291.52793542751095	20/04/28 05:14:16
1	50	325.2426954951263	291.33041674334817	20/04/28 05:14:16
1	50	325.31302435285534	291.35162664145645	20/04/28 05:14:16
1	50	325.32939078723086	291.10618185764696	20/04/28 05:14:17
1	50	325.4370192927546	291.2064656450757	20/04/28 05:14:17
1	50	325.36757570459	291.18800360291914	20/04/28 05:14:17
1	50	325.250459807328	291.2144531368088	20/04/28 05:14:17
1	50	325.19700076393946	291.40405005613434	20/04/28 05:14:17
1	50	325.0670881181018	291.23548178143	20/04/28 05:14:17
1	50	325.06618481080426	291.26336700141627	20/04/28 05:14:17
1	50	325.0986419641523	291.4131734823201	20/04/28 05:14:17
1	50	325.36126299863287	291.3264362649266	20/04/28 05:14:17
1	50	325.4545499600666	291.1387734037344	20/04/28 05:14:18
1	50	325.29968635182473	291.30904128994314	20/04/28 05:14:18
1	50	325.43177665294354	291.5758300338958	20/04/28 05:14:18
1	50	325.4591333388547	291.50506088031125	20/04/28 05:14:18
1	50	325.46668943176115	291.49764638051954	20/04/28 05:14:18
1	50	325.5086982752611	291.77013743513737	20/04/28 05:14:18
1	50	325.49455160086825	291.7925957543667	20/04/28 05:14:18
1	50	325.30958696101976	291.70071196799773	20/04/28 05:14:18
1	50	325.30958696101976	291.70071196799773	20/04/28 05:14:18
1	50	325.32807190965684	291.6679988197521	20/04/28 05:14:18
1	50	325.457751415151	291.9368159467178	20/04/28 05:14:19
1	50	325.457751415151	291.9368159467178	20/04/28 05:14:19
1	50	325.47548230059226	291.9756002781398	20/04/28 05:14:19
1	50	325.5232856292178	291.966417546283	20/04/28 05:14:19
1	50	325.5232856292178	291.966417546283	20/04/28 05:14:19
1	50	325.43477104427143	292.1155189052218	20/04/28 05:14:19
1	50	325.63972840781423	292.2781147511073	20/04/28 05:14:19
1	50	325.6971912938953	292.1108890504605	20/04/28 05:14:19
1	50	325.6818686516202	292.2816738978362	20/04/28 05:14:19
1	50	325.67316758252343	292.2913648900355	20/04/28 05:14:19
1	50	325.7042647589952	292.38242116106557	20/04/28 05:14:20
1	50	325.66103675398546	292.396539807252	20/04/28 05:14:20
1	50	325.87579032953533	292.2612395790995	20/04/28 05:14:20
1	50	325.88954086031976	292.10856800651385	20/04/28 05:14:20
1	50	326.1845720165401	292.0599869911806	20/04/28 05:14:20
1	50	326.4475664177426	292.1219815700339	20/04/28 05:14:20
1	50	326.60425980333326	292.09751618827903	20/04/28 05:14:20
1	50	326.67754287895406	291.9076695775033	20/04/28 05:14:20
1	50	326.91357870578526	292.018775185836	20/04/28 05:14:20
1	50	327.10970222860425	291.93951597343295	20/04/28 05:14:21
1	50	327.0762094101746	291.8818629565473	20/04/28 05:14:21
1	50	327.0632197817211	292.13621620050714	20/04/28 05:14:21
1	50	327.1322321126625	292.0709623188472	20/04/28 05:14:21
1	50	327.40347300833986	292.16153361661867	20/04/28 05:14:21
1	50	327.3338171492572	292.15645426967694	20/04/28 05:14:21
1	50	327.0590210952689	292.2408527808791	20/04/28 05:14:21
1	50	327.28514133539426	292.3335618260717	20/04/28 05:14:21
1	50	327.2999956041335	292.4654704469937	20/04/28 05:14:21
1	50	327.3945281559872	292.22054305195434	20/04/28 05:14:21
1	50	327.3882460358259	292.0066985744406	20/04/28 05:14:22
1	50	327.3644059126155	291.8748287566359	20/04/28 05:14:22
1	50	327.5027072073709	291.8744882353872	20/04/28 05:14:22
1	50	327.4772776378094	291.7729174897331	20/04/28 05:14:22
1	50	327.6543560507661	292.01373169136116	20/04/28 05:14:22
1	50	327.581936691062	292.0410557228611	20/04/28 05:14:22
1	50	327.581936691062	292.0410557228611	20/04/28 05:14:22
1	50	327.581936691062	292.0410557228611	20/04/28 05:14:22
1	50	327.5759470945993	292.03884511022716	20/04/28 05:14:22
1	50	327.5618805997234	292.031868762272	20/04/28 05:14:22
1	50	327.4388454866501	292.1062727285667	20/04/28 05:14:23
1	50	327.3771778596555	291.8436305543986	20/04/28 05:14:23
1	50	327.3140721198837	292.0005337435095	20/04/28 05:14:23
1	50	327.2789384266215	292.0955452153806	20/04/28 05:14:23
1	50	327.27444595878825	292.10774442407035	20/04/28 05:14:23
1	50	327.35096625534476	292.11478530371653	20/04/28 05:14:23
1	50	327.34964712125674	291.94385721557893	20/04/28 05:14:23
1	50	327.3238254024071	291.9076517916344	20/04/28 05:14:23
1	50	327.20866709147987	291.7086535607289	20/04/28 05:14:23
1	50	327.3349340821721	291.59098617757365	20/04/28 05:14:24
1	50	327.3371908632113	291.7069914228698	20/04/28 05:14:24
1	50	327.26567091032484	291.76183338066556	20/04/28 05:14:24
1	50	327.53908782037445	291.8347912657343	20/04/28 05:14:24
1	50	327.5872464790654	291.7167366571601	20/04/28 05:14:24
1	50	327.48650558760676	291.79335501944934	20/04/28 05:14:24
1	50	327.38150544269075	291.9775896232374	20/04/28 05:14:24
1	50	327.3314136826149	291.7785435251532	20/04/28 05:14:24
1	50	327.3848849416125	291.8924143125531	20/04/28 05:14:24
1	50	327.47470370299436	291.8225775661217	20/04/28 05:14:24
1	50	327.457564239	291.98015917130033	20/04/28 05:14:25
1	50	327.33547038693797	291.76984724377087	20/04/28 05:14:25
1	50	327.33468832554917	291.76874878807496	20/04/28 05:14:25
1	50	327.3139580403216	291.85830859302155	20/04/28 05:14:25
1	50	327.3732586129513	291.6684443834774	20/04/28 05:14:25
1	50	327.3604402110895	291.6291961298829	20/04/28 05:14:25
1	50	327.23337409056086	291.64737584423693	20/04/28 05:14:25
1	50	327.4795881600917	291.75825823756344	20/04/28 05:14:25
1	50	327.33559509309606	291.7676855542479	20/04/28 05:14:25
1	50	327.4201271311734	291.6902131860176	20/04/28 05:14:25
1	50	327.22674367638837	291.69220746616224	20/04/28 05:14:26
1	50	327.27180189792847	291.6927535037479	20/04/28 05:14:26
1	50	327.13016575556463	291.6148226943746	20/04/28 05:14:26
1	50	327.0873945472425	291.5996805230405	20/04/28 05:14:26
1	50	327.19783581013616	291.66976178321875	20/04/28 05:14:26
1	50	327.0538496946445	291.6378899107189	20/04/28 05:14:26
1	50	326.9691109672827	291.60491136329966	20/04/28 05:14:26
1	50	326.9281918339965	291.5659136753593	20/04/28 05:14:26
1	50	326.6977679645861	291.49437630691284	20/04/28 05:14:26
1	50	326.7041607080262	291.58415380626445	20/04/28 05:14:26
1	50	326.73464736231494	291.56245060505483	20/04/28 05:14:27
1	50	327.0153663958822	291.58892276991673	20/04/28 05:14:27
1	50	326.78359383204776	291.55023615104983	20/04/28 05:14:27
1	50	326.7196399387345	291.58419987814887	20/04/28 05:14:27
1	50	326.6735628145795	291.86539751743953	20/04/28 05:14:27
1	50	326.6985309648187	291.77916466159166	20/04/28 05:14:27
1	50	326.8651919218721	291.57335533026225	20/04/28 05:14:27
1	50	326.93100198197635	291.58233249491366	20/04/28 05:14:27
1	50	326.97155220846435	291.6862650978371	20/04/28 05:14:27
1	50	327.04081033151147	291.7881955018765	20/04/28 05:14:28
1	50	327.22389545380366	291.7881241469176	20/04/28 05:14:28
1	50	327.3795181153611	291.8297266476034	20/04/28 05:14:28
1	50	327.4110922897447	291.7116288152388	20/04/28 05:14:28
1	50	327.55051928006054	291.7014748790618	20/04/28 05:14:28
1	50	327.6785451812683	291.57781325176023	20/04/28 05:14:28
1	50	327.86234370933767	291.61320243532333	20/04/28 05:14:28
1	50	327.84231647016446	291.63001647301536	20/04/28 05:14:28
1	50	327.97679811835417	291.74377977239146	20/04/28 05:14:28
1	50	327.93516868592087	291.86359824924887	20/04/28 05:14:28
1	50	327.78941852116543	291.8954500771698	20/04/28 05:14:29
1	50	327.9781447659612	291.9001241116923	20/04/28 05:14:29
1	50	327.90502796582064	291.87183067255853	20/04/28 05:14:29
1	50	327.9606981631753	291.654358429605	20/04/28 05:14:29
1	50	327.7695696847985	291.5756516967368	20/04/28 05:14:29
1	50	327.8147962636243	291.566083762775	20/04/28 05:14:29
1	50	327.86717488644837	291.6690924249954	20/04/28 05:14:29
1	50	328.04279241108435	291.85139012243064	20/04/28 05:14:29
1	50	327.9837726914516	291.94458471850237	20/04/28 05:14:29
1	50	327.89856475542615	292.03170559068536	20/04/28 05:14:29
1	50	327.61747995293206	292.08310453139484	20/04/28 05:14:30
1	50	327.55557971962776	292.1609401253838	20/04/28 05:14:30
1	50	327.50045951265423	292.21783197711994	20/04/28 05:14:30
1	50	327.3178901281701	292.29195786816706	20/04/28 05:14:30
1	50	327.29856962130884	292.22907145085424	20/04/28 05:14:30
1	50	327.45505311380487	292.29271377862676	20/04/28 05:14:30
1	50	327.3361815431048	292.11985602191936	20/04/28 05:14:30
1	50	327.16677814087484	292.0868977849903	20/04/28 05:14:30
1	50	327.3522968944845	292.2594886029721	20/04/28 05:14:30
1	50	327.42782726862254	292.39838813610305	20/04/28 05:14:31
1	50	327.4846930948847	292.3562991718353	20/04/28 05:14:31
1	50	327.4996479254177	292.3699070547851	20/04/28 05:14:31
1	50	327.3738103283466	292.47042423004586	20/04/28 05:14:31
1	50	327.45886343523864	292.5438034722387	20/04/28 05:14:31
1	50	327.510253421852	292.62486802389446	20/04/28 05:14:31
1	50	327.3376783933786	292.6693951083981	20/04/28 05:14:31
1	50	327.1946173267556	292.65902854737055	20/04/28 05:14:31
1	50	327.1895998659334	292.6383204209508	20/04/28 05:14:31
1	50	327.40067741002025	292.8228998970588	20/04/28 05:14:31
1	50	327.3820906167114	293.0211434620688	20/04/28 05:14:32
1	50	327.331579023405	293.1041636709246	20/04/28 05:14:32
1	50	327.1707571503837	293.19796979249367	20/04/28 05:14:32
1	50	327.336217129501	293.15284761490756	20/04/28 05:14:32
1	50	327.1831484248017	293.0080365747469	20/04/28 05:14:32
1	50	327.1347191836886	293.064940296897	20/04/28 05:14:32
1	50	327.2054212737922	293.0294239502721	20/04/28 05:14:32
1	50	327.06268478255447	292.8275282133279	20/04/28 05:14:32
1	50	326.98639476135713	293.1013990982998	20/04/28 05:14:32
1	50	327.0243848001396	292.93460043868987	20/04/28 05:14:32
1	50	326.9327921796972	292.92999836972683	20/04/28 05:14:33
1	50	326.8272711168759	292.769496218662	20/04/28 05:14:33
1	50	326.8054977940594	292.75346576341144	20/04/28 05:14:33
1	50	326.80316516549203	292.75447979246024	20/04/28 05:14:33
1	50	326.8779916687615	292.60559099529365	20/04/28 05:14:33
1	50	327.15378452600703	292.4941100637722	20/04/28 05:14:33
1	50	327.13471158967747	292.46196693442465	20/04/28 05:14:33
1	50	327.05389716922895	292.2819594643673	20/04/28 05:14:33
1	50	327.12612507955254	292.2399016327176	20/04/28 05:14:33
1	50	327.2646446076499	292.42906279394384	20/04/28 05:14:34
1	50	327.464975043332	292.3733077137982	20/04/28 05:14:34
1	50	327.43275101759554	292.42320444436587	20/04/28 05:14:34
1	50	327.45611192989594	292.4746412325849	20/04/28 05:14:34
1	50	327.7213376984161	292.60723313441923	20/04/28 05:14:34
1	50	327.780003616777	292.8052614362905	20/04/28 05:14:34
1	50	327.6463153594354	292.9892055686282	20/04/28 05:14:34
1	50	327.60140304709336	293.04799550591724	20/04/28 05:14:34
1	50	327.60391743073905	293.15724356362745	20/04/28 05:14:34
1	50	327.72317309110963	293.03055307383784	20/04/28 05:14:34
1	50	327.79711783454076	293.2927791862139	20/04/28 05:14:35
1	50	327.7953271183415	293.28720475704813	20/04/28 05:14:35
1	50	328.0196155031425	293.1177924488975	20/04/28 05:14:35
1	50	327.96030942037976	293.23727438452414	20/04/28 05:14:35
1	50	327.98903834832754	293.2210919420824	20/04/28 05:14:35
1	50	327.9519518650089	293.23451481767586	20/04/28 05:14:35
1	50	327.8993477793681	293.47617356398314	20/04/28 05:14:35
1	50	327.9501641087682	293.4584951331553	20/04/28 05:14:35
1	50	327.94370540449296	293.4395404372961	20/04/28 05:14:35
1	50	328.00255309971357	293.3922176952364	20/04/28 05:14:35
1	50	328.1771113942203	293.4377926957403	20/04/28 05:14:36
1	50	328.18364197972113	293.43536113561134	20/04/28 05:14:36
1	50	328.24839712552114	293.3708136821195	20/04/28 05:14:36
1	50	328.3023699536932	293.3556352731697	20/04/28 05:14:36
1	50	328.192237014535	293.34151049410127	20/04/28 05:14:36
1	50	328.0931819008548	293.2424262038103	20/04/28 05:14:36
1	50	328.2919454559511	293.1043317307891	20/04/28 05:14:36
1	50	328.26712036938284	292.8536060549322	20/04/28 05:14:36
1	50	328.27535208562955	292.66083302567097	20/04/28 05:14:36
1	50	328.2662099787374	292.7380836293711	20/04/28 05:14:37
1	50	328.25932704957023	292.75420848344845	20/04/28 05:14:37
1	50	328.25680247301864	292.7507251023341	20/04/28 05:14:37
1	50	328.2998792031785	292.6757682912485	20/04/28 05:14:37
1	50	328.5139358278418	292.7137251097524	20/04/28 05:14:37
1	50	328.7149181118452	292.83230988101667	20/04/28 05:14:37
1	50	328.9780813896494	292.8844818580445	20/04/28 05:14:37
1	50	329.2266796146309	292.93881575146304	20/04/28 05:14:37
1	50	329.31118830264205	293.079851231381	20/04/28 05:14:37
1	50	329.3181092508657	293.06857385871933	20/04/28 05:14:37
1	50	329.3633981081109	292.9454181950979	20/04/28 05:14:38
1	50	329.36224874365723	292.93884310934754	20/04/28 05:14:38
1	50	329.28445885225835	293.12079748664746	20/04/28 05:14:38
1	50	329.3742134501453	293.0837380823741	20/04/28 05:14:38
1	50	329.32722288393643	292.93100445264264	20/04/28 05:14:38
1	50	329.375328794542	292.98058367112094	20/04/28 05:14:38
1	50	329.3712305639405	292.9959303981782	20/04/28 05:14:38
1	50	329.19655239942955	293.18627273662753	20/04/28 05:14:38
1	50	329.30216168898085	293.2829073797071	20/04/28 05:14:38
1	50	329.2651449397934	293.21296109531727	20/04/28 05:14:38
1	50	329.2595192721519	293.33943532083555	20/04/28 05:14:39
1	50	329.2054664589497	293.30795940936895	20/04/28 05:14:39
1	50	329.2815735121236	293.11007471952024	20/04/28 05:14:39
1	50	329.1794288884484	293.0033730718102	20/04/28 05:14:39
1	50	329.2211649873202	292.81074847916335	20/04/28 05:14:39
1	50	329.1968484994962	292.6324608870654	20/04/28 05:14:39
1	50	329.1820795573249	292.6496910303998	20/04/28 05:14:39
1	50	329.06382439574287	292.37766421959697	20/04/28 05:14:39
1	50	329.06382439574287	292.37766421959697	20/04/28 05:14:39
1	50	329.26611860537207	292.5529012129749	20/04/28 05:14:39
1	50	329.0295289405775	292.60988759679276	20/04/28 05:14:40
1	50	329.15636583546603	292.7309277250558	20/04/28 05:14:40
1	50	329.25643228840823	292.88224547787956	20/04/28 05:14:40
1	50	329.1148685312096	293.02405348867387	20/04/28 05:14:40
1	50	329.03316257770587	293.0488626317345	20/04/28 05:14:40
1	50	329.00982349749216	293.0424133363738	20/04/28 05:14:40
1	50	328.94405627260403	292.88046786341994	20/04/28 05:14:40
1	50	328.989888365216	292.870990004445	20/04/28 05:14:40
1	50	328.99891308167633	292.58384681228284	20/04/28 05:14:40
1	50	328.92122797276704	292.50768908321254	20/04/28 05:14:41
1	50	328.73081701865567	292.435812531364	20/04/28 05:14:41
1	50	328.7050377682267	292.4328221527273	20/04/28 05:14:41
1	50	328.5800782265726	292.2124222051175	20/04/28 05:14:41
1	50	328.50984048319833	292.1730999652958	20/04/28 05:14:41
1	50	328.49458753084775	292.1840886721688	20/04/28 05:14:41
1	50	328.6204986673315	292.4174417079869	20/04/28 05:14:41
1	50	328.5453359730569	292.4062363357132	20/04/28 05:14:41
1	50	328.5813166675993	292.39537818440436	20/04/28 05:14:41
1	50	328.64411650383374	292.372315674346	20/04/28 05:14:41
1	50	328.61876283536776	292.29139729093106	20/04/28 05:14:42
1	50	328.38869293916497	292.13293609374267	20/04/28 05:14:42
1	50	328.347983631742	292.13598931252733	20/04/28 05:14:42
1	50	328.112331673943	292.23646598940076	20/04/28 05:14:42
1	50	328.13490866282035	292.146132787375	20/04/28 05:14:42
1	50	328.4087504688559	292.03833501048274	20/04/28 05:14:42
1	50	328.63080898943053	292.08674256442623	20/04/28 05:14:42
1	50	328.69896477811477	292.2947083106935	20/04/28 05:14:42
1	50	328.6058658067119	292.3823880332158	20/04/28 05:14:42
1	50	328.5347163954019	292.2417145658189	20/04/28 05:14:43
1	50	328.5248114467639	292.018453752429	20/04/28 05:14:43
1	50	328.74184974858497	292.08836219634975	20/04/28 05:14:43
1	50	328.4887656173483	292.0030499461718	20/04/28 05:14:43
1	50	328.4165547115625	292.05868452649094	20/04/28 05:14:43
1	50	328.444770155897	292.0207489080601	20/04/28 05:14:43
1	50	328.2682403393405	292.14669407062416	20/04/28 05:14:43
1	50	328.12478120529147	292.1768456468286	20/04/28 05:14:43
1	50	328.3409288413882	292.02609866740863	20/04/28 05:14:43
1	50	328.48912718264614	291.8286676317843	20/04/28 05:14:43
1	50	328.3938231545026	291.8259911676672	20/04/28 05:14:44
1	50	328.3930046883318	291.82062378443186	20/04/28 05:14:44
1	50	328.40624245078743	291.80589136410003	20/04/28 05:14:44
1	50	328.3722376232996	291.6177278485197	20/04/28 05:14:44
1	50	328.3961793182902	291.6050706554155	20/04/28 05:14:44
1	50	328.2221176304919	291.4692838416811	20/04/28 05:14:44
1	50	328.3839906493787	291.5509492218098	20/04/28 05:14:44
1	50	328.38433196779414	291.5827281354145	20/04/28 05:14:44
1	50	328.13325100145664	291.7440306026203	20/04/28 05:14:44
1	50	328.0999928577016	291.8231938120983	20/04/28 05:14:44
1	50	328.3208291774287	291.9681098387356	20/04/28 05:14:45
1	50	328.4660786154904	292.1135711691845	20/04/28 05:14:45
1	50	328.4660786154904	292.1135711691845	20/04/28 05:14:45
1	50	328.4660786154904	292.1135711691845	20/04/28 05:14:45
1	50	328.451007739031	292.1805440057132	20/04/28 05:14:45
1	50	328.5392778238368	292.07228606996574	20/04/28 05:14:45
1	50	328.5431426035012	292.0714371836075	20/04/28 05:14:45
1	50	328.6680208905687	292.08635887900004	20/04/28 05:14:45
1	50	328.82266812284405	292.1976553763613	20/04/28 05:14:45
1	50	328.66870468104713	292.0180718106259	20/04/28 05:14:46
1	50	328.7791167418188	292.00698314387546	20/04/28 05:14:46
1	50	328.5275501732825	291.920786145435	20/04/28 05:14:46
1	50	328.39007045251867	291.92927912969776	20/04/28 05:14:46
1	50	328.4249582545126	292.0675809913121	20/04/28 05:14:46
1	50	328.4183201674209	291.9878090241252	20/04/28 05:14:46
1	50	328.32782556124386	291.91746888709486	20/04/28 05:14:46
1	50	328.33816920154095	291.9299709300973	20/04/28 05:14:46
1	50	328.44474845018686	291.9666652980869	20/04/28 05:14:46
1	50	328.2761633167025	291.96616238615064	20/04/28 05:14:46
1	50	328.1033040133009	292.00756572773696	20/04/28 05:14:47
1	50	328.2559171265511	291.8109362023543	20/04/28 05:14:47
1	50	328.35727824287744	291.8463209471576	20/04/28 05:14:47
1	50	328.3594570452419	291.9284318989458	20/04/28 05:14:47
1	50	328.2626300536265	292.0196594240752	20/04/28 05:14:47
1	50	328.4969916928888	291.85838995997227	20/04/28 05:14:47
1	50	328.3812283856463	292.04877124137255	20/04/28 05:14:47
1	50	328.61553295145694	292.21652201702256	20/04/28 05:14:47
1	50	328.36912073243815	292.0626985055314	20/04/28 05:14:47
1	50	328.10738826530456	292.01977383781326	20/04/28 05:14:47
1	50	328.0552946749809	291.9975477876957	20/04/28 05:14:48
1	50	328.1578228123439	291.88958538259647	20/04/28 05:14:48
1	50	328.1740111803136	291.8719178435108	20/04/28 05:14:48
1	50	328.00908795912386	292.0424413179203	20/04/28 05:14:48
1	50	328.1495350631672	292.2418674047656	20/04/28 05:14:48
1	50	328.13625666692116	292.18615592945207	20/04/28 05:14:48
1	50	328.1148009739239	292.1389150842859	20/04/28 05:14:48
1	50	328.11267035081283	292.13497474423406	20/04/28 05:14:48
1	50	328.02964715612404	291.9155920618357	20/04/28 05:14:48
1	50	328.0664151298876	291.97330591636387	20/04/28 05:14:49
1	50	328.10284474061154	292.0098586112393	20/04/28 05:14:49
1	50	328.031622646889	292.08257647501165	20/04/28 05:14:49
1	50	328.13655113522526	291.9721524044146	20/04/28 05:14:49
1	50	328.0683024012458	291.96756224090797	20/04/28 05:14:49
1	50	327.93191912429904	291.9033063415278	20/04/28 05:14:49
1	50	327.8892358279951	291.6346481256602	20/04/28 05:14:49
1	50	327.83224538865574	291.8302413997076	20/04/28 05:14:49
1	50	328.00769020015963	291.6694094736893	20/04/28 05:14:49
1	50	327.8003230820588	291.5610065563911	20/04/28 05:14:49
1	50	327.8176335492002	291.5488894055617	20/04/28 05:14:50
1	50	327.67367406796035	291.3467392925521	20/04/28 05:14:50
1	50	327.79723354162365	291.27690521568024	20/04/28 05:14:50
1	50	327.73737621094784	291.3513263970872	20/04/28 05:14:50
1	50	327.79841860476375	291.43935753066097	20/04/28 05:14:50
1	50	328.0866003508689	291.3650317481452	20/04/28 05:14:50
1	50	328.07671638501307	291.18746628059955	20/04/28 05:14:50
1	50	328.0141364200076	291.04520629267097	20/04/28 05:14:50
1	50	327.9201358821443	291.29784999454495	20/04/28 05:14:50
1	50	327.92777295709874	291.33575393340885	20/04/28 05:14:51
1	50	327.7411944402813	291.19492665440066	20/04/28 05:14:51
1	50	327.70449771664545	291.25066014869594	20/04/28 05:14:51
1	50	327.55423922519924	291.27704667017827	20/04/28 05:14:51
1	50	327.61991640842734	291.3542527313832	20/04/28 05:14:51
1	50	327.36633771048747	291.28647204896805	20/04/28 05:14:51
1	50	327.5911344208046	291.13189703463473	20/04/28 05:14:51
1	50	327.38577656557493	290.9189932523642	20/04/28 05:14:51
1	50	327.42614130328417	290.8978174912262	20/04/28 05:14:51
1	50	327.48818664607893	291.02681838449905	20/04/28 05:14:51
1	50	327.51078581196555	290.9504805801069	20/04/28 05:14:52
1	50	327.6952982784627	291.044503022202	20/04/28 05:14:52
1	50	327.7144129424579	291.0694542702265	20/04/28 05:14:52
1	50	327.69274981235696	291.02871505078474	20/04/28 05:14:52
1	50	327.73458321846044	291.0524795521111	20/04/28 05:14:52
1	50	327.5968547038679	290.99695522661574	20/04/28 05:14:52
1	50	327.662901269776	290.82991695464324	20/04/28 05:14:52
1	50	327.52686883522557	290.8785418883208	20/04/28 05:14:52
1	50	327.6762126190636	291.1275734473469	20/04/28 05:14:52
1	50	327.608838556598	291.1381644833694	20/04/28 05:14:52
1	50	327.66588675539595	291.1200238384234	20/04/28 05:14:53
1	50	327.6620981184694	291.31151641458314	20/04/28 05:14:53
1	50	327.65699384864735	291.3045218446942	20/04/28 05:14:53
1	50	327.571018790668	291.4033795500424	20/04/28 05:14:53
1	50	327.69286740696975	291.2979358672167	20/04/28 05:14:53
1	50	327.4479337365945	291.3163233737775	20/04/28 05:14:53
1	50	327.4680425674845	291.4334641581911	20/04/28 05:14:53
1	50	327.6116221494321	291.64304286682346	20/04/28 05:14:53
1	50	327.6280969896788	291.6237155947126	20/04/28 05:14:53
1	50	327.6190646309241	291.69876488744853	20/04/28 05:14:54
1	50	327.4425929683755	291.49435338166444	20/04/28 05:14:54
1	50	327.6277866348375	291.5479669381053	20/04/28 05:14:54
1	50	327.50515398030944	291.3984761018065	20/04/28 05:14:54
1	50	327.4244541009993	291.6187955259937	20/04/28 05:14:54
1	50	327.4082415957445	291.671881550886	20/04/28 05:14:54
1	50	327.58629806441314	291.6004520888027	20/04/28 05:14:54
1	50	327.5864633708212	291.56209635521355	20/04/28 05:14:54
1	50	327.58286771705923	291.7613375218645	20/04/28 05:14:54
1	50	327.7165258591298	291.956038550322	20/04/28 05:14:54
1	50	327.69425520056365	292.24656662552013	20/04/28 05:14:55
1	50	327.67127583077036	292.09548458905186	20/04/28 05:14:55
1	50	327.7625438186145	291.8917697819305	20/04/28 05:14:55
1	50	327.81002723759497	291.87847630381003	20/04/28 05:14:55
1	50	327.8398854694559	291.8748747197188	20/04/28 05:14:55
1	50	327.86261814879066	291.7550455723377	20/04/28 05:14:55
1	50	327.8968559776878	291.6816863081142	20/04/28 05:14:55
1	50	327.8275753791208	291.7557800918128	20/04/28 05:14:55
1	50	327.92882220231934	291.5379694800119	20/04/28 05:14:55
1	50	327.8911358228055	291.5278200914678	20/04/28 05:14:55
1	50	327.78787276358196	291.2558790255736	20/04/28 05:14:56
1	50	327.6840145395785	290.982339870943	20/04/28 05:14:56
1	50	327.64584965434676	291.02468580413773	20/04/28 05:14:56
1	50	327.79140085915003	290.9593430858787	20/04/28 05:14:56
1	50	328.0839198928181	290.9818674475207	20/04/28 05:14:56
1	50	327.85317493543545	290.89945704862066	20/04/28 05:14:56
1	50	327.831700928631	290.7717204668854	20/04/28 05:14:56
1	50	327.5737127998361	291.08835926962246	20/04/28 05:14:56
1	50	327.7757747116021	290.958831980968	20/04/28 05:14:56
1	50	327.760860489239	290.97127624520533	20/04/28 05:14:57
1	50	327.7049339266791	290.8645616112254	20/04/28 05:14:57
1	50	327.7049339266791	290.8645616112254	20/04/28 05:14:57
1	50	327.5887043874426	290.7570681500899	20/04/28 05:14:57
1	50	327.72734463853493	290.91326021797596	20/04/28 05:14:57
1	50	327.8922476645133	290.9478704089743	20/04/28 05:14:57
1	50	328.00219215681625	291.027426757894	20/04/28 05:14:57
1	50	327.9200336769844	291.2420452120126	20/04/28 05:14:57
1	50	327.88854770357574	291.25002131017817	20/04/28 05:14:57
1	50	327.87808171132195	291.10205248812764	20/04/28 05:14:57
1	50	327.77013375120885	291.2505669792623	20/04/28 05:14:58
1	50	327.8044573175719	291.2931624877599	20/04/28 05:14:58
1	50	327.82100210873193	291.34163761919285	20/04/28 05:14:58
1	50	327.94828955288	291.38687143068415	20/04/28 05:14:58
1	50	328.1506799062549	291.2825167013689	20/04/28 05:14:58
1	50	328.1741008243949	291.2831449188081	20/04/28 05:14:58
1	50	328.1497034273664	291.55050254767394	20/04/28 05:14:58
1	50	328.35139083466566	291.693568095718	20/04/28 05:14:58
1	50	328.3237592864191	291.69952414425927	20/04/28 05:14:58
1	50	328.12213214106055	291.55104015091536	20/04/28 05:14:58
1	50	328.08587452903225	291.5027596720321	20/04/28 05:14:59
1	50	328.0670936636884	291.56970203259664	20/04/28 05:14:59
1	50	327.87877523152804	291.3548405601974	20/04/28 05:14:59
1	50	327.79023322358347	291.58448062480363	20/04/28 05:14:59
1	50	327.724048660397	291.5577142567793	20/04/28 05:14:59
1	50	327.7819367391296	291.29498819140315	20/04/28 05:14:59
1	50	327.7123932343044	291.57803301220844	20/04/28 05:14:59
1	50	327.79296283049825	291.6169835800011	20/04/28 05:14:59
1	50	327.54492111142287	291.744556433681	20/04/28 05:14:59
1	50	327.3142573876676	291.7346694780162	20/04/28 05:15:00
1	50	327.4378419941672	291.7687290235204	20/04/28 05:15:00
1	50	327.41944976822276	291.7531605998992	20/04/28 05:15:00
1	50	327.5151184424822	291.88375504248796	20/04/28 05:15:00
1	50	327.46343051907127	292.08403752949147	20/04/28 05:15:00
1	50	327.5219274271987	291.97196001424516	20/04/28 05:15:00
1	50	327.6733409037797	291.76691630678147	20/04/28 05:15:00
1	50	327.5512792963186	291.5886035840616	20/04/28 05:15:00
1	50	327.3874371203194	291.6116968891204	20/04/28 05:15:00
1	50	327.2265270004782	291.4667239104209	20/04/28 05:15:00
1	50	327.2351257135639	291.4127483967193	20/04/28 05:15:01
1	50	327.3211645458837	291.22401745449974	20/04/28 05:15:01
1	50	327.2273500726144	291.161056808038	20/04/28 05:15:01
1	50	327.10683548340177	291.34656664401064	20/04/28 05:15:01
1	50	327.11906310949354	291.56066202900814	20/04/28 05:15:01
1	50	327.14847064308475	291.3490882378371	20/04/28 05:15:01
1	50	327.0928207884361	291.3395312098716	20/04/28 05:15:01
1	50	326.9413812188138	291.40811919035286	20/04/28 05:15:01
1	50	327.1103080288975	291.5441046106568	20/04/28 05:15:01
1	50	327.1955661452976	291.70274932170105	20/04/28 05:15:02
1	50	327.41309332786835	291.8528024894555	20/04/28 05:15:02
1	50	327.5479546198429	291.63141057117207	20/04/28 05:15:02
1	50	327.73572550661913	291.71797418806864	20/04/28 05:15:02
1	50	327.72157757637984	291.71654573159765	20/04/28 05:15:02
1	50	328.00765110496457	291.669326613097	20/04/28 05:15:02
1	50	327.8261448262842	291.6135296287374	20/04/28 05:15:02
1	50	327.8055887680522	291.476724819887	20/04/28 05:15:02
1	50	327.5515417530813	291.36591857707054	20/04/28 05:15:02
1	50	327.55018663409123	291.3661443730792	20/04/28 05:15:02
1	50	327.64391002286925	291.6113497708333	20/04/28 05:15:03
1	50	327.71760331860276	291.5789838204333	20/04/28 05:15:03
1	50	327.60333929686027	291.33797006171494	20/04/28 05:15:03
1	50	327.37473875654734	291.52928436409326	20/04/28 05:15:03
1	50	327.34820753174006	291.47605221758613	20/04/28 05:15:03
1	50	327.52137910272353	291.6240803403966	20/04/28 05:15:03
1	50	327.53880835660806	291.6570627548934	20/04/28 05:15:03
1	50	327.4725506468187	291.74243092190727	20/04/28 05:15:03
1	50	327.30827383173727	291.81378800466916	20/04/28 05:15:03
1	50	327.21711539477474	291.77663507576796	20/04/28 05:15:03
1	50	327.0021378519062	291.7344433759891	20/04/28 05:15:04
1	50	327.1997694340914	291.68659792488876	20/04/28 05:15:04
1	50	327.1873163064579	291.6940888841849	20/04/28 05:15:04
1	50	327.1165830080093	291.9398900159585	20/04/28 05:15:04
1	50	327.11678381146373	291.94285636620975	20/04/28 05:15:04
1	50	327.17742187817015	292.08869629393126	20/04/28 05:15:04
1	50	327.11003615296295	292.0741640045186	20/04/28 05:15:04
1	50	326.8515286465371	292.2245306332974	20/04/28 05:15:04
1	50	326.7678106080877	292.19715436554003	20/04/28 05:15:04
1	50	326.65763695621627	292.20684979392644	20/04/28 05:15:05
1	50	326.8469372699582	292.1684457180357	20/04/28 05:15:05
1	50	326.9795742506066	291.93916059207794	20/04/28 05:15:05
1	50	327.11848945819844	291.75270278550045	20/04/28 05:15:05
1	50	327.2706180669649	291.8606961018033	20/04/28 05:15:05
1	50	327.5052547929727	291.9130025770178	20/04/28 05:15:05
1	50	327.4700384573225	291.86557965448293	20/04/28 05:15:05
1	50	327.59485380087506	291.8087579008514	20/04/28 05:15:05
1	50	327.4959767440067	291.8536208973935	20/04/28 05:15:05
1	50	327.47655462730467	291.99070287462905	20/04/28 05:15:05
1	50	327.56651645222513	292.0482273518518	20/04/28 05:15:06
1	50	327.50532324342345	292.04370797350754	20/04/28 05:15:06
1	50	327.47202260421454	292.31134963225253	20/04/28 05:15:06
1	50	327.2122381646272	292.3025297642145	20/04/28 05:15:06
1	50	327.16356427575994	292.015654742236	20/04/28 05:15:06
1	50	327.15563834877133	292.0290902219345	20/04/28 05:15:06
1	50	327.06381409249974	292.26832222497427	20/04/28 05:15:06
1	50	327.22552310429285	292.3850727068806	20/04/28 05:15:06
1	50	327.22552310429285	292.3850727068806	20/04/28 05:15:06
1	50	327.22552310429285	292.3850727068806	20/04/28 05:15:07
1	50	327.3674839534226	292.3860153639339	20/04/28 05:15:07
1	50	327.20349671670795	292.20748358806054	20/04/28 05:15:07
1	50	327.05189035492634	292.25511654935815	20/04/28 05:15:07
1	50	327.12976153979446	292.3592606534333	20/04/28 05:15:07
1	50	327.2403562973026	292.4785815868402	20/04/28 05:15:07
1	50	327.26082534835473	292.60742920452157	20/04/28 05:15:07
1	50	327.25525261507494	292.60380780073905	20/04/28 05:15:07
1	50	327.22229369586756	292.86640394002023	20/04/28 05:15:07
1	50	327.0980408726595	292.9228172369604	20/04/28 05:15:07
1	50	327.10404585931957	292.9148328411435	20/04/28 05:15:08
1	50	327.15366520559314	293.1793670774175	20/04/28 05:15:08
1	50	327.0923910333821	293.19569867463747	20/04/28 05:15:08
1	50	327.08406963898153	293.1479211311952	20/04/28 05:15:08
1	50	327.1826964942612	293.4299666721034	20/04/28 05:15:08
1	50	326.9819919313147	293.25639424125274	20/04/28 05:15:08
1	50	327.05666247556303	293.25907678289246	20/04/28 05:15:08
1	50	327.0426571715911	293.2095476559688	20/04/28 05:15:08
1	50	326.8965334636207	293.4286234791317	20/04/28 05:15:08
1	50	327.06041960496225	293.3288272022685	20/04/28 05:15:08
1	50	327.14788137344385	293.3820843751286	20/04/28 05:15:09
1	50	327.15607405244594	293.3252942134316	20/04/28 05:15:09
1	50	327.01195174859873	293.1617092068678	20/04/28 05:15:09
1	50	326.9765389285542	293.16026519347895	20/04/28 05:15:09
1	50	326.9995839374637	293.10229909850983	20/04/28 05:15:09
1	50	327.0560046852045	293.07467632535486	20/04/28 05:15:09
1	50	327.10439765635016	293.16688513306843	20/04/28 05:15:09
1	50	327.06117593342094	293.0716240500038	20/04/28 05:15:09
1	50	327.09875402455634	293.1637986669919	20/04/28 05:15:09
1	50	326.9048318681044	293.38415384004554	20/04/28 05:15:10
1	50	326.69764064721716	293.17360186338516	20/04/28 05:15:10
1	50	326.68460082197305	292.92556693147316	20/04/28 05:15:10
1	50	326.67843752793027	292.9086663114733	20/04/28 05:15:10
1	50	326.5437320493226	292.9119584927953	20/04/28 05:15:10
1	50	326.5582088573952	292.93127184134664	20/04/28 05:15:10
1	50	326.5153252930207	292.92848112724437	20/04/28 05:15:10
1	50	326.5707268286809	292.8646888773901	20/04/28 05:15:10
1	50	326.61366200184784	292.840648002328	20/04/28 05:15:10
1	50	326.59538121992307	292.6488707431254	20/04/28 05:15:10
1	50	326.5439120018952	292.5851736875161	20/04/28 05:15:11
1	50	326.68817269627965	292.5580657049554	20/04/28 05:15:11
1	50	326.4557318627967	292.47808445963415	20/04/28 05:15:11
1	50	326.43966372215385	292.49275100175765	20/04/28 05:15:11
1	50	326.5964365400204	292.5165815000634	20/04/28 05:15:11
1	50	326.6785408260094	292.5593725465648	20/04/28 05:15:11
1	50	326.78333274263565	292.67165699039526	20/04/28 05:15:11
1	50	326.8215884915708	292.7015544129837	20/04/28 05:15:11
1	50	326.706009412916	292.78476595008976	20/04/28 05:15:11
1	50	326.9675459993388	292.84101505279085	20/04/28 05:15:11
1	50	327.1599345808189	292.8904123695712	20/04/28 05:15:12
1	50	327.17880460739923	292.87816768038715	20/04/28 05:15:12
1	50	327.39029515243647	292.93247577832466	20/04/28 05:15:12
1	50	327.5327686120265	293.05790402483063	20/04/28 05:15:12
1	50	327.6342982557769	293.2047050800295	20/04/28 05:15:12
1	50	327.68442049107796	293.10044712902976	20/04/28 05:15:12
1	50	327.4958618234516	293.18385408940117	20/04/28 05:15:12
1	50	327.5301580552674	293.34202508766936	20/04/28 05:15:12
1	50	327.5541887259372	293.3302837771934	20/04/28 05:15:12
1	50	327.29084616126005	293.2618087647263	20/04/28 05:15:13
1	50	327.2609712562366	293.2249685963978	20/04/28 05:15:13
1	50	327.22163809358136	293.2724031882621	20/04/28 05:15:13
1	50	327.2024964749285	293.1093475195748	20/04/28 05:15:13
1	50	327.1359233895833	293.1956241483251	20/04/28 05:15:13
1	50	327.13114154157887	293.1578291633834	20/04/28 05:15:13
1	50	327.13114154157887	293.1578291633834	20/04/28 05:15:13
1	50	327.1719601282754	293.190729102863	20/04/28 05:15:13
1	50	327.1746869627607	293.20700977761675	20/04/28 05:15:13
1	50	327.1256388984102	293.1571660629479	20/04/28 05:15:13
1	50	327.3079385176394	293.30333481020165	20/04/28 05:15:14
1	50	327.1958347924451	293.27329726987296	20/04/28 05:15:14
1	50	327.2370603017638	293.4764388484846	20/04/28 05:15:14
1	50	327.12176746671304	293.2275253553316	20/04/28 05:15:14
1	50	327.1341217467329	293.2214778825682	20/04/28 05:15:14
1	50	327.14291240839793	293.3421268848952	20/04/28 05:15:14
1	50	327.028166102986	293.1687448216188	20/04/28 05:15:14
1	50	326.7824356977174	293.0735086978553	20/04/28 05:15:14
1	50	326.78050888365203	292.8447300390849	20/04/28 05:15:14
1	50	326.77664369585807	292.8549929268263	20/04/28 05:15:15
1	50	326.8436508798672	292.76848991114366	20/04/28 05:15:15
1	50	326.9074412945067	292.98519488705045	20/04/28 05:15:15
1	50	326.8005568722961	293.17264437276737	20/04/28 05:15:15
1	50	326.73675331263615	293.2669811294132	20/04/28 05:15:15
1	50	326.6418182465497	293.3242248034477	20/04/28 05:15:15
1	50	326.51198917226907	293.3699069848955	20/04/28 05:15:15
1	50	326.4543784015555	293.3689232539742	20/04/28 05:15:15
1	50	326.37347197437526	293.1791096673998	20/04/28 05:15:15
1	50	326.56954235539143	293.2571531440269	20/04/28 05:15:15
1	50	326.60711801338664	293.2907047221419	20/04/28 05:15:16
1	50	326.76619002364095	293.2867218887863	20/04/28 05:15:16
1	50	327.0256616999852	293.1717946262123	20/04/28 05:15:16
1	50	327.01230372104476	292.98689841395685	20/04/28 05:15:16
1	50	326.9969498331547	292.98218377867556	20/04/28 05:15:16
1	50	326.84510396964384	292.8922912822822	20/04/28 05:15:16
1	50	326.91961666754287	292.7320679800718	20/04/28 05:15:16
1	50	326.96715824051233	292.72630532502217	20/04/28 05:15:16
1	50	326.8418302466122	292.7601881620017	20/04/28 05:15:16
1	50	326.74706795339563	292.51503318702413	20/04/28 05:15:16
1	50	326.7737804689641	292.60126035779973	20/04/28 05:15:17
1	50	326.55893268305533	292.62079867667444	20/04/28 05:15:17
1	50	326.71140864519606	292.47599194943575	20/04/28 05:15:17
1	50	326.9207363860974	292.5096546240447	20/04/28 05:15:17
1	50	326.9337245176669	292.46069999755747	20/04/28 05:15:17
1	50	326.7745411462053	292.25574149489574	20/04/28 05:15:17
1	50	326.77582248363376	292.2623366820629	20/04/28 05:15:17
1	50	326.74171704998923	292.36439755222585	20/04/28 05:15:17
1	50	326.649679338317	292.4213039780586	20/04/28 05:15:17
1	50	326.4240915252802	292.59303556429046	20/04/28 05:15:18
1	50	326.34584828127964	292.34529130790884	20/04/28 05:15:18
1	50	326.34584828127964	292.34529130790884	20/04/28 05:15:18
1	50	326.38285648383203	292.28688797986536	20/04/28 05:15:18
1	50	326.56209623161794	292.3451440238952	20/04/28 05:15:18
1	50	326.52422602333485	292.4248973156305	20/04/28 05:15:18
1	50	326.5306699251295	292.3350816322977	20/04/28 05:15:18
1	50	326.52681189156095	292.4788580000885	20/04/28 05:15:18
1	50	326.7364611810959	292.5487274736991	20/04/28 05:15:18
1	50	326.69464740079786	292.53182007923243	20/04/28 05:15:18
1	50	326.70315078307965	292.6446682268183	20/04/28 05:15:19
1	50	326.70315078307965	292.6446682268183	20/04/28 05:15:19
1	50	326.8883458302224	292.5262780395238	20/04/28 05:15:19
1	50	326.9101271460356	292.6581115365986	20/04/28 05:15:19
1	50	326.9251264907238	292.6053155478221	20/04/28 05:15:19
1	50	326.8577014581183	292.5282545380613	20/04/28 05:15:19
1	50	326.8637111723834	292.65216211016764	20/04/28 05:15:19
1	50	326.7698415961513	292.762919011943	20/04/28 05:15:19
1	50	326.80031289167533	292.77976270368106	20/04/28 05:15:19
1	50	326.79223314813447	292.7117954174435	20/04/28 05:15:20
1	50	326.9175636149991	292.7530409558669	20/04/28 05:15:20
1	50	326.78378695949016	292.7131259261064	20/04/28 05:15:20
1	50	326.99004791799024	292.5834467667129	20/04/28 05:15:20
1	50	326.99004791799024	292.5834467667129	20/04/28 05:15:20
1	50	327.06203155043994	292.6947586497419	20/04/28 05:15:20
1	50	327.0635979368394	292.6890616336156	20/04/28 05:15:20
1	50	327.2730597928875	292.65818217981547	20/04/28 05:15:20
1	50	327.2730597928875	292.65818217981547	20/04/28 05:15:20
