stationId	t_start	t_end	t_max	timeStamp
49	20/04/28 05:17:35	20/04/28 05:12:09	20/04/28 05:10:00
111	20/04/28 05:12:11	20/04/28 05:12:14	20/04/28 05:12:11
56	20/04/28 05:12:16	20/04/28 05:12:16	20/04/28 05:12:16
49	20/04/28 05:12:18	20/04/28 05:12:18	20/04/28 05:12:18
111	20/04/28 05:12:20	20/04/28 05:12:21	20/04/28 05:12:21
56	20/04/28 05:12:23	20/04/28 05:12:24	20/04/28 05:12:24
111	20/04/28 05:12:26	20/04/28 05:12:26	20/04/28 05:12:26
111	20/04/28 05:12:28	20/04/28 05:12:28	20/04/28 05:12:28
56	20/04/28 05:12:30	20/04/28 05:12:30	20/04/28 05:12:30
56	20/04/28 05:12:32	20/04/28 05:12:32	20/04/28 05:12:32
111	20/04/28 05:12:34	20/04/28 05:12:36	20/04/28 05:12:35
111	20/04/28 05:12:38	20/04/28 05:12:39	20/04/28 05:12:39
56	20/04/28 05:12:41	20/04/28 05:12:41	20/04/28 05:12:41
111	20/04/28 05:12:43	20/04/28 05:12:44	20/04/28 05:12:43
56	20/04/28 05:12:46	20/04/28 05:12:46	20/04/28 05:12:46
111	20/04/28 05:12:48	20/04/28 05:12:48	20/04/28 05:12:48
56	20/04/28 05:12:50	20/04/28 05:12:50	20/04/28 05:12:50
111	20/04/28 05:12:52	20/04/28 05:12:52	20/04/28 05:12:52
111	20/04/28 05:12:54	20/04/28 05:12:57	20/04/28 05:12:56
56	20/04/28 05:12:59	20/04/28 05:12:59	20/04/28 05:12:59
111	20/04/28 05:13:01	20/04/28 05:13:04	20/04/28 05:13:03
111	20/04/28 05:13:06	20/04/28 05:13:07	20/04/28 05:13:07
56	20/04/28 05:13:09	20/04/28 05:13:10	20/04/28 05:13:09
111	20/04/28 05:13:12	20/04/28 05:13:12	20/04/28 05:13:12
56	20/04/28 05:13:14	20/04/28 05:13:16	20/04/28 05:13:15
111	20/04/28 05:13:18	20/04/28 05:13:19	20/04/28 05:13:18
56	20/04/28 05:13:21	20/04/28 05:13:21	20/04/28 05:13:21
111	20/04/28 05:13:23	20/04/28 05:13:30	20/04/28 05:13:30
56	20/04/28 05:13:32	20/04/28 05:13:34	20/04/28 05:13:34
111	20/04/28 05:13:36	20/04/28 05:13:36	20/04/28 05:13:36
111	20/04/28 05:13:38	20/04/28 05:13:38	20/04/28 05:13:38
111	20/04/28 05:13:40	20/04/28 05:13:40	20/04/28 05:13:40
