floorId	partitionId	location_x	location_y	timeStamp
1	93	328.39418969472985	295.878375056185	20/04/28 05:08:49
1	93	328.5991714873696	296.07939901785045	20/04/28 05:08:49
1	93	328.56104098868184	296.1725384432244	20/04/28 05:08:49
1	93	328.5743751256559	296.22523549489904	20/04/28 05:08:49
1	93	328.41608961935435	296.43001060439394	20/04/28 05:08:49
1	93	328.23615574923423	296.41266696961	20/04/28 05:08:49
1	93	328.24624953675	296.34307566877646	20/04/28 05:08:49
1	93	328.23634519619475	296.1158814889008	20/04/28 05:08:49
1	93	328.26630165460693	296.06757855347996	20/04/28 05:08:49
1	93	328.16048771239247	296.3043309493145	20/04/28 05:08:50
1	93	328.07005054995295	296.3318405990548	20/04/28 05:08:50
1	93	328.0642664001523	296.32750910929366	20/04/28 05:08:50
1	93	328.1028230694087	296.344403470039	20/04/28 05:08:50
1	93	328.2014493354283	296.5728121521652	20/04/28 05:08:50
1	93	328.0093453906577	296.4717238212998	20/04/28 05:08:50
1	93	328.01799457681904	296.47406265838293	20/04/28 05:08:50
1	93	328.1420960630428	296.3245632508076	20/04/28 05:08:50
1	93	328.12778431910255	296.4291311465371	20/04/28 05:08:50
1	93	328.1279973074114	296.42830212566133	20/04/28 05:08:50
1	93	328.1747610660138	296.66332303230456	20/04/28 05:08:51
1	93	328.2219157520076	296.6361679571922	20/04/28 05:08:51
1	93	328.0846655761645	296.73641148643713	20/04/28 05:08:51
1	93	328.01654146014397	296.90156637261197	20/04/28 05:08:51
1	93	327.89393292605865	296.94975756380063	20/04/28 05:08:51
1	93	327.8371825446234	296.99963531668055	20/04/28 05:08:51
1	93	327.8204487234254	296.9164146217437	20/04/28 05:08:51
1	93	328.030112795602	296.84405269330006	20/04/28 05:08:51
1	93	328.2351045143035	296.76021763248156	20/04/28 05:08:51
1	93	328.2511209493598	296.7515929921024	20/04/28 05:08:51
1	93	328.2703344471479	296.6861568377888	20/04/28 05:08:52
1	93	328.2514956495542	296.58573219218556	20/04/28 05:08:52
1	93	327.96920560857546	296.6640048842199	20/04/28 05:08:52
1	93	327.86094357589434	296.6991789376987	20/04/28 05:08:52
1	93	327.8626746820791	296.69292800290754	20/04/28 05:08:52
1	93	327.76022736731557	296.67704955511863	20/04/28 05:08:52
1	93	327.56635096021563	296.5118011877043	20/04/28 05:08:52
1	93	327.7571145062549	296.3289810654112	20/04/28 05:08:52
1	93	327.90309835342714	296.3866693170525	20/04/28 05:08:52
1	93	327.8805614050389	296.3000770946902	20/04/28 05:08:53
1	93	327.9487907369024	296.1933215007695	20/04/28 05:08:53
1	93	327.81870024499557	296.2974025102579	20/04/28 05:08:53
1	93	327.78122981789073	296.1879889324544	20/04/28 05:08:53
1	93	327.88578500993447	296.231561725669	20/04/28 05:08:53
1	93	327.94318601240224	296.2086995952271	20/04/28 05:08:53
1	93	327.74402468076687	296.11655140976177	20/04/28 05:08:53
1	93	327.74254023354956	296.1177640380136	20/04/28 05:08:53
1	93	327.7498857903425	296.3100893889764	20/04/28 05:08:53
1	93	327.82003680409457	296.31342172050114	20/04/28 05:08:53
1	93	327.8372792480373	296.3245669541536	20/04/28 05:08:54
1	93	327.8491786901197	296.311783285419	20/04/28 05:08:54
1	93	327.9566406393595	296.4810987509253	20/04/28 05:08:54
1	93	328.0861866419546	296.2696446902884	20/04/28 05:08:54
1	93	328.11886103603956	296.2193833570218	20/04/28 05:08:54
1	93	328.23432501119873	296.35644339112315	20/04/28 05:08:54
1	93	328.27347099273385	296.2820416509749	20/04/28 05:08:54
1	93	328.21165409052793	296.1242753702296	20/04/28 05:08:54
1	93	328.12051476326025	296.28035486202793	20/04/28 05:08:54
1	93	328.03513891052324	296.43042033214266	20/04/28 05:08:54
1	93	327.90941424105387	296.2536202688535	20/04/28 05:08:55
1	93	327.8577097636163	296.1990990789712	20/04/28 05:08:55
1	93	327.8854340696652	296.2591741535351	20/04/28 05:08:55
1	93	328.03285392258294	296.5043452119161	20/04/28 05:08:55
1	93	328.035244024562	296.49415485302234	20/04/28 05:08:55
1	93	327.9214353003244	296.59877692472475	20/04/28 05:08:55
1	93	327.870616562246	296.65429732203756	20/04/28 05:08:55
1	93	327.7044565412816	296.690600625917	20/04/28 05:08:55
1	93	327.7285528584519	296.74841819607485	20/04/28 05:08:55
1	93	327.9578671754063	296.7323810400312	20/04/28 05:08:56
1	93	327.80547835906356	296.81250604286436	20/04/28 05:08:56
1	93	327.6895582316724	297.06631413695885	20/04/28 05:08:56
1	93	327.88621671106836	296.8777238366055	20/04/28 05:08:56
1	93	328.07319502973115	296.7339932485908	20/04/28 05:08:56
1	93	327.9451982964925	296.715698570387	20/04/28 05:08:56
1	93	327.9451982964925	296.715698570387	20/04/28 05:08:56
1	93	328.02358500576406	296.52324628817234	20/04/28 05:08:56
1	93	328.02474663472947	296.8146567174728	20/04/28 05:08:56
1	93	327.8027489561697	296.7133517216845	20/04/28 05:08:56
1	93	327.87620654266465	296.8263575509599	20/04/28 05:08:57
1	93	328.1153247849493	296.7473503745163	20/04/28 05:08:57
1	93	328.019726821293	296.85383824155025	20/04/28 05:08:57
1	93	327.9606024946081	296.89270341159926	20/04/28 05:08:57
1	93	327.92461505549807	296.7495580544021	20/04/28 05:08:57
1	93	327.90975202502216	296.7189266641624	20/04/28 05:08:57
1	93	327.9196358054782	296.81200927303735	20/04/28 05:08:57
1	93	327.6361509161185	296.75832599599266	20/04/28 05:08:57
1	93	327.61280880537635	296.87629247802374	20/04/28 05:08:57
1	93	327.66887369322103	297.04235465781085	20/04/28 05:08:57
1	93	327.6696374457967	297.0443911207025	20/04/28 05:08:58
1	93	327.6747988172041	297.05429349682856	20/04/28 05:08:58
1	93	327.5823759856196	297.1557922971702	20/04/28 05:08:58
1	93	327.44670333393947	297.3456536418637	20/04/28 05:08:58
1	93	327.5227812054985	297.58760934567414	20/04/28 05:08:58
1	93	327.5547059085024	297.618383863922	20/04/28 05:08:58
1	93	327.7239145196178	297.7165306767267	20/04/28 05:08:58
1	93	327.79290220367795	297.57499627129465	20/04/28 05:08:58
1	93	327.93741227371004	297.57615262036677	20/04/28 05:08:58
1	93	327.87499319887655	297.6651189433196	20/04/28 05:08:59
1	93	327.87320523390775	297.6455909153238	20/04/28 05:08:59
1	93	328.0464811471402	297.59512917192575	20/04/28 05:08:59
1	93	328.2238780315187	297.7680552770697	20/04/28 05:08:59
1	93	328.1058304677026	297.59815590535476	20/04/28 05:08:59
1	93	328.2049462799072	297.62470268939046	20/04/28 05:08:59
1	93	328.3116548409923	297.83155082279836	20/04/28 05:08:59
1	93	328.54104433960947	297.94482234921566	20/04/28 05:08:59
1	93	328.4019179443694	298.1869790441754	20/04/28 05:08:59
1	93	328.4699433736255	298.17298036446243	20/04/28 05:08:59
1	93	328.4699433736255	298.17298036446243	20/04/28 05:09:00
1	93	328.5439982339293	298.4431049361561	20/04/28 05:09:00
1	93	328.5647986386378	298.46324772697716	20/04/28 05:09:00
1	93	328.60149249706626	298.5151723327799	20/04/28 05:09:00
1	93	328.6452001341264	298.4820033234143	20/04/28 05:09:00
1	93	328.6547561015759	298.45451162194007	20/04/28 05:09:00
1	93	328.6592408048043	298.43658536271624	20/04/28 05:09:00
1	93	328.7173343998031	298.3812127706672	20/04/28 05:09:00
1	93	328.7142252942131	298.11593411548984	20/04/28 05:09:00
1	93	328.6707702558899	297.87773851351915	20/04/28 05:09:00
1	93	328.84562788930987	298.06153492072787	20/04/28 05:09:01
1	93	328.84572729472416	298.06187689730683	20/04/28 05:09:01
1	93	328.72433612730003	298.1311540946275	20/04/28 05:09:01
1	93	328.9438918378805	298.30883544323973	20/04/28 05:09:01
1	93	329.14446736451436	298.12500865625606	20/04/28 05:09:01
1	93	329.2335068489658	298.2961140199991	20/04/28 05:09:01
1	93	329.1941867569759	298.5308671351906	20/04/28 05:09:01
1	93	329.1521027068009	298.6043510082408	20/04/28 05:09:01
1	93	329.1521027068009	298.6043510082408	20/04/28 05:09:01
1	93	329.1373558852187	298.61107865626093	20/04/28 05:09:02
1	93	329.1798738740001	298.67695596497396	20/04/28 05:09:02
1	93	329.2584999116042	298.73419829558276	20/04/28 05:09:02
1	93	329.1899825489693	298.67310238909107	20/04/28 05:09:02
1	93	329.24156167508954	298.9360982528617	20/04/28 05:09:02
1	93	329.5310406517025	298.9557934485462	20/04/28 05:09:02
1	93	329.4930897491691	299.0810665419871	20/04/28 05:09:02
1	93	329.28750891718295	299.2843764218274	20/04/28 05:09:02
1	93	329.2207166868207	299.37154004218877	20/04/28 05:09:02
1	93	329.21214205499865	299.36982441433224	20/04/28 05:09:02
1	93	329.2214093133428	299.37349484352245	20/04/28 05:09:03
1	93	329.36454737536644	299.29453765669786	20/04/28 05:09:03
1	93	329.25860935013736	299.0581430045386	20/04/28 05:09:03
1	93	329.18652174768056	298.83731611782474	20/04/28 05:09:03
1	93	328.9964580744911	298.92107360744166	20/04/28 05:09:03
1	93	328.87311611587756	298.9748269893004	20/04/28 05:09:03
1	93	328.6644092090495	298.88573457985325	20/04/28 05:09:03
1	93	328.8322795712377	298.79742019303933	20/04/28 05:09:03
1	93	328.9641536507795	298.80516177328	20/04/28 05:09:03
1	93	329.0379819916668	298.75305415847515	20/04/28 05:09:04
1	93	329.0352626932901	298.61565250945057	20/04/28 05:09:04
1	93	328.9389849568684	298.4491344726851	20/04/28 05:09:04
1	93	329.095946900491	298.6236693403759	20/04/28 05:09:04
1	93	329.23925986684134	298.42941087031977	20/04/28 05:09:04
1	93	329.17189390779464	298.61046451061424	20/04/28 05:09:04
1	93	329.21101688960607	298.7746311985432	20/04/28 05:09:04
1	93	329.4158184338911	298.86432446512976	20/04/28 05:09:04
1	93	329.3483852656936	298.8946790595117	20/04/28 05:09:04
1	93	329.4066560416419	298.9205066724122	20/04/28 05:09:04
1	93	329.2216223191712	298.87156726125716	20/04/28 05:09:05
1	93	329.03134163308397	298.989279673875	20/04/28 05:09:05
1	93	328.8951294017729	299.1737919678583	20/04/28 05:09:05
1	93	328.7089949460969	299.1615790453087	20/04/28 05:09:05
1	93	328.75782548187874	299.1310490155961	20/04/28 05:09:05
1	93	328.73803828049853	298.8488147287488	20/04/28 05:09:05
1	93	328.7454085886659	298.841685124319	20/04/28 05:09:05
1	93	328.8551498426221	299.3053443043001	20/04/28 05:09:05
1	93	328.8551498426221	299.3053443043001	20/04/28 05:09:05
1	93	328.8297651507359	299.19987144463425	20/04/28 05:09:06
1	93	328.83556161217643	299.1039689668251	20/04/28 05:09:06
1	93	328.855658887322	299.1851343791289	20/04/28 05:09:06
1	93	328.855658887322	299.1851343791289	20/04/28 05:09:06
1	93	328.78959225294096	299.36662028963525	20/04/28 05:09:06
1	93	328.91601864484784	299.3198394149316	20/04/28 05:09:06
1	93	328.7868164625478	299.40652062552834	20/04/28 05:09:06
1	93	328.89343351037525	299.35788857778664	20/04/28 05:09:06
1	93	329.0327779227725	299.359885907344	20/04/28 05:09:06
1	93	328.9105183996911	299.3569646898764	20/04/28 05:09:06
1	93	328.8562426640909	299.3096603417468	20/04/28 05:09:07
1	93	328.9248546619964	299.2949857865663	20/04/28 05:09:07
1	93	328.83238582495767	299.2395974294191	20/04/28 05:09:07
1	93	328.8360930422178	299.2354408868653	20/04/28 05:09:07
1	93	328.96933147658734	299.0406112451313	20/04/28 05:09:07
1	93	328.97833154751726	299.0762540847501	20/04/28 05:09:07
1	93	328.8061792791748	298.9525257188063	20/04/28 05:09:07
1	93	329.0442793984681	298.85413016338043	20/04/28 05:09:07
1	93	329.16122050814073	298.6796522430321	20/04/28 05:09:07
1	93	329.04378919162053	298.9416892911046	20/04/28 05:09:07
1	93	329.2191929706009	298.97064672723275	20/04/28 05:09:08
1	93	329.11213632042114	298.9974349543945	20/04/28 05:09:08
1	93	329.3442123143445	299.02137818635265	20/04/28 05:09:08
1	93	329.4854342084893	298.9788131746465	20/04/28 05:09:08
1	93	329.3742448954936	298.9955934317615	20/04/28 05:09:08
1	93	329.2951546471729	298.7395579157442	20/04/28 05:09:08
1	93	329.24349216081976	298.60047306991964	20/04/28 05:09:08
1	93	329.09558201533156	298.7386692299742	20/04/28 05:09:08
1	93	329.1358298668711	298.6228634614533	20/04/28 05:09:08
1	93	329.16333822120686	298.51272735405496	20/04/28 05:09:09
1	93	329.06751900870165	298.7499184409593	20/04/28 05:09:09
1	93	328.7970986978892	298.74590983025126	20/04/28 05:09:09
1	93	328.6950441011424	298.7175423917812	20/04/28 05:09:09
1	93	328.6920475286483	298.71919533645655	20/04/28 05:09:09
1	93	328.80582026634625	298.74556007885303	20/04/28 05:09:09
1	93	328.86450720043536	298.65370654662	20/04/28 05:09:09
1	93	328.66467096420666	298.6696850405996	20/04/28 05:09:09
1	93	328.94923590663143	298.67516760989645	20/04/28 05:09:09
1	93	328.80813857785364	298.64442507317267	20/04/28 05:09:09
1	93	328.9892301118309	298.4496415966585	20/04/28 05:09:10
1	93	328.9574437416241	298.26780693188294	20/04/28 05:09:10
1	93	329.03840012112465	297.9920909266234	20/04/28 05:09:10
1	93	329.02062023664115	298.0012334989519	20/04/28 05:09:10
1	93	329.00962623882526	298.003996540936	20/04/28 05:09:10
1	93	328.9839941894908	297.9985016178605	20/04/28 05:09:10
1	93	329.0186977758665	297.9399477096665	20/04/28 05:09:10
1	93	329.07360006932413	297.7034489655601	20/04/28 05:09:10
1	93	329.1538346366259	297.5232119214612	20/04/28 05:09:10
1	93	329.15430040368557	297.3510484732959	20/04/28 05:09:10
1	93	329.2411519579662	297.2501048505711	20/04/28 05:09:11
1	93	329.23717192185194	297.2236931665837	20/04/28 05:09:11
1	93	329.29126337256076	297.139083863874	20/04/28 05:09:11
1	93	329.2942385827303	296.96840372855155	20/04/28 05:09:11
1	93	329.2456040806678	296.8631322504095	20/04/28 05:09:11
1	93	329.3813703159643	296.9514139015485	20/04/28 05:09:11
1	93	329.2773209767905	297.1982737475369	20/04/28 05:09:11
1	93	329.2822534060205	297.2132303586095	20/04/28 05:09:11
1	93	329.2822534060205	297.2132303586095	20/04/28 05:09:11
1	93	329.31758559347907	297.26044903412475	20/04/28 05:09:12
1	93	329.31758559347907	297.26044903412475	20/04/28 05:09:12
1	93	329.2718633282549	297.2428867222411	20/04/28 05:09:12
1	93	329.0805487130961	297.1726231013066	20/04/28 05:09:12
1	93	329.2310626309102	297.2128910761557	20/04/28 05:09:12
1	93	329.19334104887196	297.37424357787097	20/04/28 05:09:12
1	93	329.19923300149134	297.37939297685296	20/04/28 05:09:12
1	93	329.1662189337947	297.4318946538114	20/04/28 05:09:12
1	93	329.1926276662714	297.5694102836563	20/04/28 05:09:12
1	93	329.0439301604354	297.67807330214947	20/04/28 05:09:12
1	93	329.137003576104	297.75622191130833	20/04/28 05:09:13
1	93	329.137003576104	297.75622191130833	20/04/28 05:09:13
1	93	329.137003576104	297.75622191130833	20/04/28 05:09:13
1	93	329.0660048727513	297.8790420012936	20/04/28 05:09:13
1	93	329.0637057640834	298.073396691303	20/04/28 05:09:13
1	93	329.29868708095387	298.16897678003596	20/04/28 05:09:13
1	93	329.36248250461296	297.96377176402797	20/04/28 05:09:13
1	93	329.39456122784657	297.93527389652667	20/04/28 05:09:13
1	93	329.5080838496387	297.8433441781827	20/04/28 05:09:13
1	93	329.51219451006256	297.8508922871891	20/04/28 05:09:13
1	93	329.30393609096103	297.81681353587936	20/04/28 05:09:14
1	93	329.31580382426955	297.77744997122494	20/04/28 05:09:14
1	93	329.4860196526338	297.98091404246657	20/04/28 05:09:14
1	93	329.5165655545705	297.8365152421198	20/04/28 05:09:14
1	93	329.67746142026374	297.6625452308817	20/04/28 05:09:14
1	93	329.6443373767875	297.5654703648795	20/04/28 05:09:14
1	93	329.40651405670036	297.5993211903936	20/04/28 05:09:14
1	93	329.5430337759493	297.75792402938026	20/04/28 05:09:14
1	93	329.4983992606152	297.7913186298851	20/04/28 05:09:14
1	93	329.430008284128	297.9761433024676	20/04/28 05:09:15
1	93	329.6377452379805	298.1204413833259	20/04/28 05:09:15
1	93	329.51376830379235	298.01286180915423	20/04/28 05:09:15
1	93	329.4249364836809	298.1993720893523	20/04/28 05:09:15
1	93	329.31366103303975	298.1824824955673	20/04/28 05:09:15
1	93	329.0408192100606	298.26689533404544	20/04/28 05:09:15
1	93	328.98725102044347	298.13909700871216	20/04/28 05:09:15
1	93	329.0477082792665	298.09737703903403	20/04/28 05:09:15
1	93	329.034355291323	298.22420570891336	20/04/28 05:09:15
1	93	329.09702252390053	298.130512088005	20/04/28 05:09:15
1	93	329.12653577149365	298.1776234452554	20/04/28 05:09:16
1	93	329.1376910185557	298.05028035274796	20/04/28 05:09:16
1	93	328.90790130850496	298.169296651841	20/04/28 05:09:16
1	93	328.8056215523599	298.3161316249762	20/04/28 05:09:16
1	93	328.67252840340797	298.5272497992933	20/04/28 05:09:16
1	93	328.6587853632336	298.5725221332385	20/04/28 05:09:16
1	93	328.42802693608365	298.48743095022064	20/04/28 05:09:16
1	93	328.43270509430965	298.3453805077629	20/04/28 05:09:16
1	93	328.34749165814316	298.1987851153013	20/04/28 05:09:16
1	93	328.4031035125802	298.0941147004323	20/04/28 05:09:17
1	93	328.3694139201987	298.0928634267623	20/04/28 05:09:17
1	93	328.39911535548123	297.92063511496605	20/04/28 05:09:17
1	93	328.3990325196747	297.92049848090204	20/04/28 05:09:17
1	93	328.21516012793666	298.11610382766645	20/04/28 05:09:17
1	93	327.96625275663956	297.95584909774175	20/04/28 05:09:17
1	93	327.96121564818293	297.9404614334597	20/04/28 05:09:17
1	93	328.2098468015885	298.03215404398014	20/04/28 05:09:17
1	93	328.2673350095988	298.0132377185783	20/04/28 05:09:17
1	93	328.2673350095988	298.0132377185783	20/04/28 05:09:17
1	93	328.3387901033722	298.0922775094606	20/04/28 05:09:18
1	93	328.21556808139223	297.9162539091735	20/04/28 05:09:18
1	93	328.42282178529945	297.7752687702191	20/04/28 05:09:18
1	93	328.42282178529945	297.7752687702191	20/04/28 05:09:18
1	93	328.39563508530165	297.958869029756	20/04/28 05:09:18
1	93	328.45810625608476	298.0516720076719	20/04/28 05:09:18
1	93	328.3145532123505	298.14167379487975	20/04/28 05:09:18
1	93	328.54062087790186	297.9668518162226	20/04/28 05:09:18
1	93	328.44054530716875	297.9413766325515	20/04/28 05:09:18
1	93	328.44054530716875	297.9413766325515	20/04/28 05:09:19
1	93	328.357406987812	297.9025443062218	20/04/28 05:09:19
1	93	328.357406987812	297.9025443062218	20/04/28 05:09:19
1	93	328.46317651096797	297.8227806715813	20/04/28 05:09:19
1	93	328.4974089753356	297.8817825629807	20/04/28 05:09:19
1	93	328.4974089753356	297.8817825629807	20/04/28 05:09:19
1	93	328.3567705189075	297.8505392548662	20/04/28 05:09:19
1	93	328.2527467289288	297.88405470050907	20/04/28 05:09:19
1	93	328.3581324581646	297.93266793021087	20/04/28 05:09:19
1	93	328.283643176502	298.2101389515269	20/04/28 05:09:19
1	93	328.27797076677143	298.20199632101895	20/04/28 05:09:20
1	93	328.2711343462951	298.1967808479467	20/04/28 05:09:20
1	93	328.0736350227779	297.9873250426432	20/04/28 05:09:20
1	93	328.14969330135784	297.9996440990063	20/04/28 05:09:20
1	93	328.0194589117988	297.9714286887742	20/04/28 05:09:20
1	93	328.0194589117988	297.9714286887742	20/04/28 05:09:20
1	93	327.95303808696417	297.7135941625205	20/04/28 05:09:20
1	93	327.7661554044974	297.6642307420583	20/04/28 05:09:20
1	93	328.0033011687514	297.5886828635671	20/04/28 05:09:20
1	93	328.0019595617448	297.5879821127601	20/04/28 05:09:21
1	93	327.97138365244456	297.6164353705117	20/04/28 05:09:21
1	93	327.7154707129102	297.48623559867644	20/04/28 05:09:21
1	93	327.4388387710024	297.55069891464234	20/04/28 05:09:21
1	93	327.73738144481877	297.6739718630598	20/04/28 05:09:21
1	93	327.73738144481877	297.6739718630598	20/04/28 05:09:21
1	93	327.64957024511307	297.59654925343045	20/04/28 05:09:21
1	93	327.7520501835488	297.5249754526035	20/04/28 05:09:21
1	93	327.7102695980992	297.6731034414407	20/04/28 05:09:21
1	93	327.6272992596938	297.5529873211229	20/04/28 05:09:21
1	93	327.6272992596938	297.5529873211229	20/04/28 05:09:22
1	93	327.70539855933254	297.45968644269243	20/04/28 05:09:22
1	93	327.9191236734428	297.27921429766536	20/04/28 05:09:22
1	93	327.8398463836731	297.2867859893371	20/04/28 05:09:22
1	93	327.8398463836731	297.2867859893371	20/04/28 05:09:22
1	93	327.97363043116695	297.3341303408715	20/04/28 05:09:22
1	93	328.1428142079845	297.48605247406886	20/04/28 05:09:22
1	93	328.1428142079845	297.48605247406886	20/04/28 05:09:22
1	93	327.9941168509073	297.42729401990346	20/04/28 05:09:22
1	93	327.9652150920573	297.3238306520981	20/04/28 05:09:22
1	93	328.0427786446336	297.4288242420303	20/04/28 05:09:23
1	93	327.8779888136166	297.34181898269554	20/04/28 05:09:23
1	93	327.8779888136166	297.34181898269554	20/04/28 05:09:23
1	93	327.88543305665877	297.41732036592146	20/04/28 05:09:23
1	93	327.87937424884893	297.4412815740641	20/04/28 05:09:23
1	93	327.6920983379092	297.5188709886753	20/04/28 05:09:23
1	93	327.7157336693623	297.4625712696621	20/04/28 05:09:23
1	93	327.9394537739443	297.3454200711986	20/04/28 05:09:23
1	93	327.7466514357857	297.3550553654683	20/04/28 05:09:23
1	93	327.6673669368934	297.3510589512188	20/04/28 05:09:24
1	93	327.7570627423982	297.29304943104387	20/04/28 05:09:24
1	93	327.72709153079086	297.3399642571165	20/04/28 05:09:24
1	93	327.8457968638959	297.36947894209544	20/04/28 05:09:24
1	93	328.025876341848	297.4719928044088	20/04/28 05:09:24
1	93	328.1844996784262	297.2885986983696	20/04/28 05:09:24
1	93	328.0484449736593	297.06431586090685	20/04/28 05:09:24
1	93	328.16444013590217	297.0323115663151	20/04/28 05:09:24
1	93	328.3435909329591	297.2165496902656	20/04/28 05:09:24
1	93	328.0898682779494	297.24773437950205	20/04/28 05:09:24
1	93	327.80706139411257	297.18038400189187	20/04/28 05:09:25
1	93	327.7643429325439	297.463096557925	20/04/28 05:09:25
1	93	327.75330636964964	297.46011254416067	20/04/28 05:09:25
1	93	327.51199207929824	297.4155259850528	20/04/28 05:09:25
1	93	327.4541438941544	297.39432870393654	20/04/28 05:09:25
1	93	327.4549777608812	297.39519708533334	20/04/28 05:09:25
1	93	327.5342555931327	297.24437590221595	20/04/28 05:09:25
1	93	327.5029731966464	297.0167744073267	20/04/28 05:09:25
1	93	327.5958173363812	296.95704142495947	20/04/28 05:09:25
1	93	327.5958173363812	296.95704142495947	20/04/28 05:09:25
1	93	327.62283334803055	296.91755281209987	20/04/28 05:09:26
1	93	327.83406082853645	296.8846406384005	20/04/28 05:09:26
1	93	327.7980922734662	296.9354624510725	20/04/28 05:09:26
1	93	327.54310622769776	297.0651907333641	20/04/28 05:09:26
1	93	327.6810560342628	297.11457548401796	20/04/28 05:09:26
1	93	327.7769980851769	296.95741171238683	20/04/28 05:09:26
1	93	327.8527124548204	296.9208116254709	20/04/28 05:09:26
1	93	327.8606568028725	296.7640866095376	20/04/28 05:09:26
1	93	327.8485304249926	296.7547214853823	20/04/28 05:09:26
1	93	327.79772016255737	296.83432365476716	20/04/28 05:09:27
1	93	327.97206971755116	296.76941282110795	20/04/28 05:09:27
1	93	328.01152312278333	296.7117217059105	20/04/28 05:09:27
1	93	328.0255856966033	296.7027761600518	20/04/28 05:09:27
1	93	328.0781713255106	296.78316956614395	20/04/28 05:09:27
1	93	327.8822344566399	296.77897995716404	20/04/28 05:09:27
1	93	327.8383604675228	296.77786956230193	20/04/28 05:09:27
1	93	327.80101254356003	296.69066223205317	20/04/28 05:09:27
1	93	327.78240820280104	296.73274113640787	20/04/28 05:09:27
1	93	327.83247363433657	296.84295678510426	20/04/28 05:09:27
1	93	327.9969333026477	297.0623455681878	20/04/28 05:09:28
1	93	327.8079390144403	296.93663204238584	20/04/28 05:09:28
1	93	327.58133558675235	297.08268790860495	20/04/28 05:09:28
1	93	327.5928920253954	297.0713635489546	20/04/28 05:09:28
1	93	327.5290743121301	296.98905027508397	20/04/28 05:09:28
1	93	327.5552012851672	296.82726673610847	20/04/28 05:09:28
1	93	327.54294894741935	296.78155283659595	20/04/28 05:09:28
1	93	327.4482578501527	296.7704615697584	20/04/28 05:09:28
1	93	327.37242378930557	296.7705254217989	20/04/28 05:09:28
1	93	327.292793868675	296.7868092724482	20/04/28 05:09:29
1	93	327.4449667040594	296.70252126580624	20/04/28 05:09:29
1	93	327.29907197270234	296.5045207486558	20/04/28 05:09:29
1	93	327.06261220744597	296.4021263262861	20/04/28 05:09:29
1	93	327.0016147296523	296.61770161636684	20/04/28 05:09:29
1	93	327.04631466191665	296.59310767644655	20/04/28 05:09:29
1	93	327.0056321534601	296.56360960995954	20/04/28 05:09:29
1	93	326.9072671453729	296.67993354797534	20/04/28 05:09:29
1	93	327.0315488068301	296.7186782620922	20/04/28 05:09:29
1	93	327.17620615544513	296.5572141585149	20/04/28 05:09:29
1	93	327.01801000603626	296.6811849510067	20/04/28 05:09:30
1	93	327.0147275756377	296.49590526552254	20/04/28 05:09:30
1	93	326.99777092411796	296.49397934601024	20/04/28 05:09:30
1	93	327.0643945858186	296.482914806827	20/04/28 05:09:30
1	93	327.16009782969206	296.41518589389125	20/04/28 05:09:30
1	93	327.1920171686203	296.3784354053452	20/04/28 05:09:30
1	93	327.08949411297334	296.34709901630765	20/04/28 05:09:30
1	93	327.0807825026712	296.33176285614456	20/04/28 05:09:30
1	93	327.02255287198545	296.4328231984555	20/04/28 05:09:30
1	93	326.8237507065368	296.46154974335275	20/04/28 05:09:30
1	93	326.5938462368944	296.4000007712738	20/04/28 05:09:31
1	93	326.4753455798776	296.2941425187024	20/04/28 05:09:31
1	93	326.4095490814243	296.1064069947385	20/04/28 05:09:31
1	93	326.4220619642776	296.1523387479113	20/04/28 05:09:31
1	93	326.4651943973974	296.1829420973521	20/04/28 05:09:31
1	93	326.509805906021	296.153049962782	20/04/28 05:09:31
1	93	326.70579654537386	296.1838197612815	20/04/28 05:09:31
1	93	326.75024630638734	296.172850867131	20/04/28 05:09:31
1	93	326.46425152264607	296.2353909779702	20/04/28 05:09:31
1	93	326.41384279402416	296.1969713078386	20/04/28 05:09:32
1	93	326.4757285534914	296.18403221848894	20/04/28 05:09:32
1	93	326.71220645064454	296.01657412658165	20/04/28 05:09:32
1	93	326.7050386099753	296.003225437513	20/04/28 05:09:32
1	93	326.74792904130067	296.1488837655137	20/04/28 05:09:32
1	93	326.60903722310167	295.90837219757344	20/04/28 05:09:32
1	93	326.7403308146691	296.05457822906357	20/04/28 05:09:32
1	93	326.71768617913824	296.0056255953767	20/04/28 05:09:32
1	93	326.8805745138957	295.90906555807095	20/04/28 05:09:32
1	93	327.0578494085449	295.94994938338584	20/04/28 05:09:32
1	93	326.9622330154258	296.0305560503707	20/04/28 05:09:33
1	93	326.87971038766017	296.29502547675906	20/04/28 05:09:33
1	93	326.8235768938946	296.2577207170786	20/04/28 05:09:33
1	93	326.9242970254843	296.28746474954636	20/04/28 05:09:33
1	93	326.88562460484724	296.38275292530534	20/04/28 05:09:33
1	93	326.9223742699816	296.2591904289823	20/04/28 05:09:33
1	93	326.92180992771773	296.2357129134128	20/04/28 05:09:33
1	93	326.75652923640916	296.32687308893486	20/04/28 05:09:33
1	93	326.6106817145195	296.14067400567984	20/04/28 05:09:33
1	93	326.5709662903179	296.1090741942757	20/04/28 05:09:34
1	93	326.67274599933774	295.99944315399205	20/04/28 05:09:34
1	93	326.94290149785076	296.0719395228013	20/04/28 05:09:34
1	93	326.825167822316	296.0582718191041	20/04/28 05:09:34
1	93	326.9148518213724	295.82652627675475	20/04/28 05:09:34
1	93	326.962878170883	295.7903368843763	20/04/28 05:09:34
1	93	326.9000972334968	295.7365123465657	20/04/28 05:09:34
1	93	326.9723848270086	295.5882269225148	20/04/28 05:09:34
1	93	327.145063933829	295.80841848182354	20/04/28 05:09:34
1	93	327.0495607031535	295.60508811060197	20/04/28 05:09:34
1	93	326.8021323687309	295.57728879730996	20/04/28 05:09:35
1	93	326.65883485233314	295.63125042728296	20/04/28 05:09:35
1	93	326.517722977806	295.5518181036108	20/04/28 05:09:35
1	93	326.4589259420986	295.5611114457282	20/04/28 05:09:35
1	93	326.7053205205815	295.5126932608325	20/04/28 05:09:35
1	93	326.8925240134919	295.60016950351326	20/04/28 05:09:35
1	93	326.8516055574865	295.680661114389	20/04/28 05:09:35
1	93	326.89239774220647	295.5201762858685	20/04/28 05:09:35
1	93	326.8803591700188	295.5340313404517	20/04/28 05:09:35
1	93	326.78629782704763	295.2631094312046	20/04/28 05:09:35
1	93	326.73291849071086	294.98346636186346	20/04/28 05:09:36
1	93	326.5678125165979	294.83058879233874	20/04/28 05:09:36
1	93	326.5689867733734	294.8302471443585	20/04/28 05:09:36
1	93	326.7262141844527	294.7092879964989	20/04/28 05:09:36
1	93	326.85565252092	294.5327734711728	20/04/28 05:09:36
1	93	326.921902735742	294.5707999769708	20/04/28 05:09:36
1	93	326.8771834812329	294.68619002068664	20/04/28 05:09:36
1	93	326.9235314538771	294.55210847819563	20/04/28 05:09:36
1	93	326.9271553080825	294.78979837836425	20/04/28 05:09:36
1	93	327.2055093306001	294.6848076565405	20/04/28 05:09:37
1	93	327.1743659533819	294.6802258565967	20/04/28 05:09:37
1	93	327.2642715013238	294.53324251574526	20/04/28 05:09:37
1	93	327.296599769415	294.65859597043834	20/04/28 05:09:37
1	93	327.2908968316224	294.64808758882174	20/04/28 05:09:37
1	93	327.2881085903252	294.7001763756565	20/04/28 05:09:37
1	93	327.2067578080891	294.881892060733	20/04/28 05:09:37
1	93	327.1813238473163	294.86511678507475	20/04/28 05:09:37
1	93	327.1801670609975	294.70145996999617	20/04/28 05:09:37
1	93	326.9584664080625	294.8807058578407	20/04/28 05:09:37
1	93	326.9544359046343	294.8392221318652	20/04/28 05:09:38
1	93	326.7732646423639	294.65023188082364	20/04/28 05:09:38
1	93	326.49700556840736	294.57737131297375	20/04/28 05:09:38
1	93	326.3808618070586	294.31816887937794	20/04/28 05:09:38
1	93	326.3471953472332	294.2823065743391	20/04/28 05:09:38
1	93	326.23159806781405	294.2571207472936	20/04/28 05:09:38
1	93	326.3429129180017	294.1795358673189	20/04/28 05:09:38
1	93	326.4030777501902	294.1968623215146	20/04/28 05:09:38
1	93	326.3929432317204	294.0988280555813	20/04/28 05:09:38
1	93	326.51912458798864	294.2826217293713	20/04/28 05:09:38
1	93	326.5242129361553	294.34089551148446	20/04/28 05:09:39
1	93	326.4411043383838	294.2174502045032	20/04/28 05:09:39
1	93	326.47562008395835	294.15561335969255	20/04/28 05:09:39
1	93	326.36179308659723	294.2251778944556	20/04/28 05:09:39
1	93	326.64919875873795	294.2023349745604	20/04/28 05:09:39
1	93	326.5834133494281	294.2287247120498	20/04/28 05:09:39
1	93	326.6543065150045	294.4219741361309	20/04/28 05:09:39
1	93	326.82056257160474	294.3273052479242	20/04/28 05:09:39
1	93	326.9556856017512	294.4632710446443	20/04/28 05:09:39
1	93	326.93143785774583	294.7342728195815	20/04/28 05:09:40
1	93	327.11058744384616	294.7957054056088	20/04/28 05:09:40
1	93	327.02581724641	294.90692251052246	20/04/28 05:09:40
1	93	326.83107237872105	294.79982157932096	20/04/28 05:09:40
1	93	326.70378560613375	294.76148408420204	20/04/28 05:09:40
1	93	326.4158718291393	294.7932350202171	20/04/28 05:09:40
1	93	326.4970733343244	294.71403424247166	20/04/28 05:09:40
1	93	326.4938928697475	294.7111181996948	20/04/28 05:09:40
1	93	326.32389738367056	294.6162417109205	20/04/28 05:09:40
1	93	326.3257317265745	294.6612875794579	20/04/28 05:09:40
1	93	326.08011972792656	294.61568014819846	20/04/28 05:09:41
1	93	326.1431301219356	294.53402630679534	20/04/28 05:09:41
1	93	326.1419819919419	294.52553502724055	20/04/28 05:09:41
1	93	326.15967156655415	294.7721692798912	20/04/28 05:09:41
1	93	326.13705688995503	294.6312334891342	20/04/28 05:09:41
1	93	326.02919312018	294.7677546569223	20/04/28 05:09:41
1	93	325.7782438376218	294.8461063317206	20/04/28 05:09:41
1	93	325.7965411803344	294.74573626229716	20/04/28 05:09:41
1	93	325.7789813368454	294.768330676946	20/04/28 05:09:41
1	93	325.806576254394	294.7826336413737	20/04/28 05:09:42
1	93	325.65972688748036	294.766821525466	20/04/28 05:09:42
1	93	325.8154603106351	294.9526319402228	20/04/28 05:09:42
1	93	325.815009180559	294.7653110831173	20/04/28 05:09:42
1	93	325.80673373301516	294.63730859994337	20/04/28 05:09:42
1	93	325.81487267801754	294.6748948307313	20/04/28 05:09:42
1	93	325.7044319631212	294.7574726044168	20/04/28 05:09:42
1	93	325.82011164637237	294.61577815053045	20/04/28 05:09:42
1	93	325.84338080523054	294.8702620194388	20/04/28 05:09:42
1	93	325.9177114101778	294.9033975466546	20/04/28 05:09:42
1	93	325.8244593344606	294.66784847089133	20/04/28 05:09:43
1	93	325.7585483189633	294.74713463435353	20/04/28 05:09:43
1	93	325.8002561374916	294.7131145165944	20/04/28 05:09:43
1	93	325.9448698009892	294.74397965078754	20/04/28 05:09:43
1	93	326.1774628318708	294.87421353724545	20/04/28 05:09:43
1	93	326.1774628318708	294.87421353724545	20/04/28 05:09:43
1	93	326.1774628318708	294.87421353724545	20/04/28 05:09:43
1	93	326.1629952670471	294.880052437096	20/04/28 05:09:43
1	93	326.19318768595207	295.1719359067885	20/04/28 05:09:43
1	93	326.4791011232599	295.1065488325564	20/04/28 05:09:43
1	93	326.52698263706543	295.0431718334861	20/04/28 05:09:44
1	93	326.4703521069487	294.91304734657	20/04/28 05:09:44
1	93	326.2413973888371	294.9433934112653	20/04/28 05:09:44
1	93	325.9901925499933	294.99212481566275	20/04/28 05:09:44
1	93	326.08611660276586	295.0154042598669	20/04/28 05:09:44
1	93	326.070990788749	295.04664972422836	20/04/28 05:09:44
1	93	326.06140866200724	295.0563388988553	20/04/28 05:09:44
1	93	326.3651520568007	295.2443412217086	20/04/28 05:09:44
1	93	326.3167783350788	295.48559945836035	20/04/28 05:09:44
1	93	326.2710735004289	295.39144276406796	20/04/28 05:09:45
1	93	326.26540523250435	295.3994982450119	20/04/28 05:09:45
1	93	326.35101458365403	295.3866751296361	20/04/28 05:09:45
1	93	326.33972695312417	295.355647016488	20/04/28 05:09:45
1	93	326.33972695312417	295.355647016488	20/04/28 05:09:45
1	93	326.52301534306645	295.2788987202064	20/04/28 05:09:45
1	93	326.5634769626291	295.31317985552033	20/04/28 05:09:45
1	93	326.356348248662	295.44388025760696	20/04/28 05:09:45
1	93	326.36294675578114	295.43266480741045	20/04/28 05:09:45
1	93	326.3379823052302	295.3853946885653	20/04/28 05:09:45
1	93	326.38293563429323	295.6047970794318	20/04/28 05:09:46
1	93	326.38293563429323	295.6047970794318	20/04/28 05:09:46
1	93	326.0944625304935	295.70871960432424	20/04/28 05:09:46
1	93	326.0235488331644	295.687854098959	20/04/28 05:09:46
1	93	326.0235488331644	295.687854098959	20/04/28 05:09:46
1	93	326.07400147627976	295.6149410161582	20/04/28 05:09:46
1	93	326.0645486061216	295.6416958856849	20/04/28 05:09:46
1	93	325.96011438723997	295.68504329068134	20/04/28 05:09:46
1	93	326.0645082798308	295.7073903710883	20/04/28 05:09:46
1	93	326.0645082798308	295.7073903710883	20/04/28 05:09:47
1	93	326.10863327674315	295.5368355786688	20/04/28 05:09:47
1	93	325.94980569676613	295.61838192928917	20/04/28 05:09:47
1	93	325.9826909973618	295.61418095571474	20/04/28 05:09:47
1	93	325.83837372773263	295.3785452613106	20/04/28 05:09:47
1	93	325.82981538959194	295.41373096973734	20/04/28 05:09:47
1	93	325.9170048369537	295.52229341705004	20/04/28 05:09:47
1	93	325.63365271417354	295.4883197743639	20/04/28 05:09:47
1	93	325.67231944902306	295.2827025767483	20/04/28 05:09:47
1	93	325.4905199784441	295.22780583475355	20/04/28 05:09:47
1	93	325.4641239115407	295.3327967157829	20/04/28 05:09:48
1	93	325.702556012177	295.2476997440504	20/04/28 05:09:48
1	93	325.7040084865025	295.11389110798183	20/04/28 05:09:48
1	93	325.6113290993364	295.08779568121236	20/04/28 05:09:48
1	93	325.6328152193066	295.1697529289788	20/04/28 05:09:48
1	93	325.4893869798161	295.2062240838575	20/04/28 05:09:48
1	93	325.6871298931254	295.1456354569493	20/04/28 05:09:48
1	93	325.49744669013694	295.1389581967833	20/04/28 05:09:48
1	93	325.45332313917066	295.2422784499879	20/04/28 05:09:48
1	93	325.21969303526384	295.21895171342504	20/04/28 05:09:48
1	93	324.98767369497574	295.3634317163499	20/04/28 05:09:49
1	93	324.81876200710207	295.4758749123382	20/04/28 05:09:49
1	93	325.02400879892156	295.37949253092114	20/04/28 05:09:49
1	93	325.03086469349756	295.12717691098436	20/04/28 05:09:49
1	93	325.06607661647547	295.13772303071175	20/04/28 05:09:49
1	93	325.0541818221256	295.1772549725438	20/04/28 05:09:49
1	93	325.1114504174095	295.18837076129824	20/04/28 05:09:49
1	93	325.10930286644884	295.217523660922	20/04/28 05:09:49
1	93	324.92602068982495	295.4314804668972	20/04/28 05:09:49
1	93	325.1294817942326	295.32755007287096	20/04/28 05:09:50
1	93	325.26139078545583	295.1995781835937	20/04/28 05:09:50
1	93	325.5153014402909	295.196123013527	20/04/28 05:09:50
1	93	325.4311837442511	295.1865401979193	20/04/28 05:09:50
1	93	325.4927852311237	295.20438989551457	20/04/28 05:09:50
1	93	325.50672667746704	295.0328099158121	20/04/28 05:09:50
1	93	325.51959551868003	295.0488975329379	20/04/28 05:09:50
1	93	325.72905039539535	295.07371028220757	20/04/28 05:09:50
1	93	325.6933045065197	294.94696733021703	20/04/28 05:09:50
1	93	325.5318061188893	294.84909089957983	20/04/28 05:09:50
1	93	325.2546163291171	294.9597588718946	20/04/28 05:09:51
1	93	325.39602138354604	295.05925211667153	20/04/28 05:09:51
1	93	325.4072460279233	295.05127971522813	20/04/28 05:09:51
1	93	325.5013886952163	294.98804118678953	20/04/28 05:09:51
1	93	325.53511344225814	295.0845215674797	20/04/28 05:09:51
1	93	325.52708290917036	295.0718599899431	20/04/28 05:09:51
1	93	325.5272660628965	295.0720278358415	20/04/28 05:09:51
1	93	325.5272617482299	295.0720363973173	20/04/28 05:09:51
1	93	325.6684894971424	294.954787732259	20/04/28 05:09:51
1	93	325.5092109378814	295.02897402271435	20/04/28 05:09:52
1	93	325.4694264912625	295.14920834634887	20/04/28 05:09:52
1	93	325.46713507342724	295.1419463157238	20/04/28 05:09:52
1	93	325.4484001375655	294.9304166711557	20/04/28 05:09:52
1	93	325.5018344232104	294.8173942997945	20/04/28 05:09:52
1	93	325.6678749670378	294.8165471048367	20/04/28 05:09:52
1	93	325.67612011924564	294.8136027859479	20/04/28 05:09:52
1	93	325.4856309738164	294.93216369100213	20/04/28 05:09:52
1	93	325.2492855196908	294.91470905700584	20/04/28 05:09:52
1	93	325.05151563113463	294.92971014406356	20/04/28 05:09:52
1	93	325.03379889771594	294.9649949602516	20/04/28 05:09:53
1	93	324.9496013344615	294.81717445830935	20/04/28 05:09:53
1	93	324.8863107147745	294.79694218271976	20/04/28 05:09:53
1	93	324.88921433696646	294.80210642271356	20/04/28 05:09:53
1	93	324.7736105616188	294.62836650652184	20/04/28 05:09:53
1	93	324.9415342731855	294.4711092182245	20/04/28 05:09:53
1	93	325.12112004453644	294.6569497940432	20/04/28 05:09:53
1	93	325.28461485518034	294.68240824069835	20/04/28 05:09:53
1	93	325.276302622755	294.41261314080066	20/04/28 05:09:53
1	93	325.2759923890028	294.2223510033412	20/04/28 05:09:54
1	93	325.4272073159051	294.1213851973857	20/04/28 05:09:54
1	93	325.39839504534865	293.8918884997708	20/04/28 05:09:54
1	93	325.3856024526472	293.93100385856417	20/04/28 05:09:54
1	93	325.38169414546786	293.96620040645354	20/04/28 05:09:54
1	93	325.29460015087926	293.9086450995895	20/04/28 05:09:54
1	93	325.0550005664333	293.7944403427581	20/04/28 05:09:54
1	93	325.2970653472947	293.7541098198115	20/04/28 05:09:54
1	93	325.37693787785423	293.8187962915542	20/04/28 05:09:54
1	93	325.5932820880441	293.7493851470549	20/04/28 05:09:54
1	93	325.55897423362734	293.7775244507726	20/04/28 05:09:55
1	93	325.6832795380086	293.7239439259765	20/04/28 05:09:55
1	93	325.6812376288193	293.74199764991056	20/04/28 05:09:55
1	93	325.7532094092739	293.8252155383788	20/04/28 05:09:55
1	93	325.4807986414106	293.92566830493826	20/04/28 05:09:55
1	93	325.40446992165556	293.9253420965595	20/04/28 05:09:55
1	93	325.4335413174309	293.98711827771047	20/04/28 05:09:55
1	93	325.4367650203772	293.9935851782134	20/04/28 05:09:55
1	93	325.4586631898524	294.0059867309224	20/04/28 05:09:55
1	93	325.64672196983605	293.79857515828905	20/04/28 05:09:56
1	93	325.6350583188105	293.9631368420495	20/04/28 05:09:56
1	93	325.4356355761333	293.8452514821882	20/04/28 05:09:56
1	93	325.2283169885031	293.73552780839555	20/04/28 05:09:56
1	93	325.16481910438273	293.69953605268245	20/04/28 05:09:56
1	93	325.10595889821684	293.95526069893214	20/04/28 05:09:56
1	93	325.1145369439414	293.9460083827627	20/04/28 05:09:56
1	93	325.24868767869623	293.91271300618797	20/04/28 05:09:56
1	93	325.1969563678782	293.75840141203423	20/04/28 05:09:56
1	93	325.15441102928816	293.7397695059577	20/04/28 05:09:56
1	93	325.3223881589257	293.7779015682773	20/04/28 05:09:57
1	93	325.4502386878218	293.8770687811422	20/04/28 05:09:57
1	93	325.15442141323325	293.8820080565375	20/04/28 05:09:57
1	93	325.15553951407753	293.819811089638	20/04/28 05:09:57
1	93	325.1375038667328	293.87084740917186	20/04/28 05:09:57
1	93	325.0609089682954	293.8645842992058	20/04/28 05:09:57
1	93	325.1972622006894	293.79651045477556	20/04/28 05:09:57
1	93	325.2651367181242	293.7724660414467	20/04/28 05:09:57
1	93	325.17268763056626	293.7089522379211	20/04/28 05:09:57
1	93	325.1088628162115	293.71635262091894	20/04/28 05:09:57
1	93	325.02814112078465	293.71841351220667	20/04/28 05:09:58
1	93	325.1950690841331	293.7733058538919	20/04/28 05:09:58
1	93	325.13213823822264	293.7733618108667	20/04/28 05:09:58
1	93	325.07980782571303	293.7696765801575	20/04/28 05:09:58
1	93	324.8017039871192	293.79686123404576	20/04/28 05:09:58
1	93	324.9679204265169	293.7351841751469	20/04/28 05:09:58
1	93	325.1153269808981	293.92773276016237	20/04/28 05:09:58
1	93	325.1196813443207	293.8819087453464	20/04/28 05:09:58
1	93	325.2692927180361	293.7148639000682	20/04/28 05:09:58
1	93	325.1688009495198	293.7153428810805	20/04/28 05:09:59
1	93	325.0391498569588	293.9072489903388	20/04/28 05:09:59
1	93	325.2662579275995	293.96024998098534	20/04/28 05:09:59
1	93	325.4383978200236	293.82340710398114	20/04/28 05:09:59
1	93	325.4192645776629	293.821867580522	20/04/28 05:09:59
1	93	325.4495978055338	293.87990111937745	20/04/28 05:09:59
1	93	325.4492666563287	293.8794263431754	20/04/28 05:09:59
1	93	325.4321922464306	293.89380140587804	20/04/28 05:09:59
1	93	325.4050616919649	294.03174139339654	20/04/28 05:09:59
1	93	325.2665247924341	294.05915992627826	20/04/28 05:09:59
1	93	325.15114489313356	293.9952684566462	20/04/28 05:10:00
1	93	324.9614871001723	294.00789527334695	20/04/28 05:10:00
1	93	324.9560170343356	294.0471730243999	20/04/28 05:10:00
1	93	325.1266031703739	294.2351382185739	20/04/28 05:10:00
1	93	325.2304639558221	294.2639625037305	20/04/28 05:10:00
1	93	325.3348651009155	294.1825117739302	20/04/28 05:10:00
1	93	325.39170327886876	294.39233441451665	20/04/28 05:10:00
1	93	325.40862108958765	294.28673694795197	20/04/28 05:10:00
1	93	325.5250179613904	294.26516247751044	20/04/28 05:10:00
1	93	325.5550859153603	294.245321628058	20/04/28 05:10:01
1	93	325.5813014341946	294.1929151255889	20/04/28 05:10:01
1	93	325.83911046640145	294.1213728920635	20/04/28 05:10:01
1	93	325.9423915379359	294.2419677338956	20/04/28 05:10:01
1	93	325.91855228933986	294.2191351732037	20/04/28 05:10:01
1	93	326.01007205042214	294.1767845810971	20/04/28 05:10:01
1	93	326.2413817766765	294.1578169038158	20/04/28 05:10:01
1	93	326.2376991479991	294.15827148868567	20/04/28 05:10:01
1	93	326.4598317142538	293.9574885066657	20/04/28 05:10:01
1	93	326.51993483273856	293.784940844512	20/04/28 05:10:01
1	93	326.3283083195446	293.8113105344279	20/04/28 05:10:02
1	93	326.3279859490918	293.8105210764186	20/04/28 05:10:02
1	93	326.29168366644745	293.84831846072785	20/04/28 05:10:02
1	93	326.3349661428109	293.8452648015431	20/04/28 05:10:02
1	93	326.3955872105948	293.8204885131509	20/04/28 05:10:02
1	93	326.27860562318483	293.9887951571186	20/04/28 05:10:02
1	93	326.3821922849964	293.90659729685683	20/04/28 05:10:02
1	93	326.3720089067229	293.95644360397387	20/04/28 05:10:02
1	93	326.40686630549783	293.9361846331456	20/04/28 05:10:02
1	93	326.45687223561765	294.0911819821519	20/04/28 05:10:03
1	93	326.5118689719937	294.1195392192374	20/04/28 05:10:03
1	93	326.75784024992583	294.04176507131973	20/04/28 05:10:03
1	93	326.78185523973997	293.91447080611294	20/04/28 05:10:03
1	93	326.9902484416198	293.93428423949433	20/04/28 05:10:03
1	93	326.95799682069713	294.0891210079775	20/04/28 05:10:03
1	93	327.015055044735	294.03390046895925	20/04/28 05:10:03
1	93	326.97178183386336	293.94476772172067	20/04/28 05:10:03
1	93	326.97784627633763	293.9789851494934	20/04/28 05:10:03
1	93	327.1256930309633	294.01858643188876	20/04/28 05:10:03
1	93	327.18052356869174	293.9854036889419	20/04/28 05:10:04
1	93	327.1737317071354	294.07332381727775	20/04/28 05:10:04
1	93	327.02171163912044	293.90142156396456	20/04/28 05:10:04
1	93	327.0606364587472	293.73312769253255	20/04/28 05:10:04
1	93	327.0258920759772	293.8783184598565	20/04/28 05:10:04
1	93	327.2173247205012	293.8455273811085	20/04/28 05:10:04
1	93	327.12335605176446	293.79072958123453	20/04/28 05:10:04
1	93	327.2553543481957	293.75459184719847	20/04/28 05:10:04
1	93	327.4811976737268	293.7872591421061	20/04/28 05:10:04
1	93	327.38517401682185	293.7217659377067	20/04/28 05:10:04
1	93	327.3659346857647	293.7328582445618	20/04/28 05:10:05
1	93	327.3375851816238	293.7595947534604	20/04/28 05:10:05
1	93	327.3098667540836	293.83219490638953	20/04/28 05:10:05
1	93	327.3355842235054	293.80770223212613	20/04/28 05:10:05
1	93	327.3429508501802	293.795434665744	20/04/28 05:10:05
1	93	327.5898798689698	293.90086232409345	20/04/28 05:10:05
1	93	327.7343899607391	293.8894114261706	20/04/28 05:10:05
1	93	327.93855134267403	293.8564982249931	20/04/28 05:10:05
1	93	328.00447037515386	294.07355615343425	20/04/28 05:10:05
1	93	328.1088334304204	293.8540926901009	20/04/28 05:10:06
1	93	328.0620465385132	293.95501207944176	20/04/28 05:10:06
1	93	328.02574853193636	294.05601145551003	20/04/28 05:10:06
1	93	328.1399608271032	293.8753035974822	20/04/28 05:10:06
1	93	328.3208483627968	293.8218899980933	20/04/28 05:10:06
1	93	328.3306837571463	293.8146873439996	20/04/28 05:10:06
1	93	328.3172902333721	293.82615976006934	20/04/28 05:10:06
1	93	328.2115830669226	293.97047453284944	20/04/28 05:10:06
1	93	327.9729140391544	294.14703334495164	20/04/28 05:10:06
1	93	327.9729140391544	294.14703334495164	20/04/28 05:10:06
1	93	327.9729140391544	294.14703334495164	20/04/28 05:10:07
1	93	328.04215909141635	294.0679489300934	20/04/28 05:10:07
1	93	328.25173607284535	293.9913341838893	20/04/28 05:10:07
1	93	328.4056123755311	294.10691141242864	20/04/28 05:10:07
1	93	328.38222410088645	294.02873066760094	20/04/28 05:10:07
1	93	328.38953373281504	294.25496615118055	20/04/28 05:10:07
1	93	328.2976640588215	294.2464822841548	20/04/28 05:10:07
1	93	328.2541185742041	294.2486505496936	20/04/28 05:10:07
1	93	328.06501737200716	294.12783665206194	20/04/28 05:10:07
1	93	327.9885528094035	294.3760579187088	20/04/28 05:10:07
1	93	327.96916055210903	294.23676615063164	20/04/28 05:10:08
1	93	328.0915441034578	294.0646768022986	20/04/28 05:10:08
1	93	327.9916174009681	293.9363347324862	20/04/28 05:10:08
1	93	328.1761556200831	293.87991472702225	20/04/28 05:10:08
1	93	328.06118941389866	294.0287697370629	20/04/28 05:10:08
1	93	327.9211576633466	294.24562072522906	20/04/28 05:10:08
1	93	328.0183997315458	294.2048642832161	20/04/28 05:10:08
1	93	328.15891421765855	294.1414378225256	20/04/28 05:10:08
1	93	328.02931483331486	294.26782616404597	20/04/28 05:10:08
1	93	327.8134721202151	294.23083770608235	20/04/28 05:10:09
1	93	327.9463719450784	294.05369550324946	20/04/28 05:10:09
1	93	328.07170425016255	293.9144513150386	20/04/28 05:10:09
1	93	327.80673578267	293.85014486517684	20/04/28 05:10:09
1	93	328.0367373818714	293.81016302810497	20/04/28 05:10:09
1	93	327.9637821816671	293.9989768766011	20/04/28 05:10:09
1	93	327.896536918383	294.06772729982526	20/04/28 05:10:09
1	93	327.85018307042134	293.9712771512145	20/04/28 05:10:09
1	93	328.09659692270543	293.8278010568816	20/04/28 05:10:09
1	93	328.15135521498667	293.7455700815765	20/04/28 05:10:09
1	93	328.19500380341225	293.74012546873143	20/04/28 05:10:10
1	93	328.0054733186954	293.82101675698755	20/04/28 05:10:10
1	93	328.05721638339537	293.81298456800096	20/04/28 05:10:10
1	93	327.9139489125068	293.83108340150767	20/04/28 05:10:10
1	93	327.79866972743434	294.05962867299263	20/04/28 05:10:10
1	93	327.8631361978201	293.8913631322084	20/04/28 05:10:10
1	93	328.1097038171333	293.879344626101	20/04/28 05:10:10
1	93	328.1055196697781	293.8911182564112	20/04/28 05:10:10
1	93	328.0922625211558	293.90816381624296	20/04/28 05:10:10
1	93	328.07188662319464	293.83257756861485	20/04/28 05:10:10
1	93	328.0824310348131	293.77450250507894	20/04/28 05:10:11
1	93	328.26395324601685	294.0082925768846	20/04/28 05:10:11
1	93	328.509537547482	293.9421994447424	20/04/28 05:10:11
1	93	328.3141852746692	293.71648420251455	20/04/28 05:10:11
1	93	328.3251472015567	293.7161517151282	20/04/28 05:10:11
1	93	328.57510276171075	293.7841611411933	20/04/28 05:10:11
1	93	328.8162456839657	293.87724519108633	20/04/28 05:10:11
1	93	328.7238211123146	294.0056517684647	20/04/28 05:10:11
1	93	328.7470478980132	294.00684199821416	20/04/28 05:10:11
1	93	328.5723639357303	294.0268068703756	20/04/28 05:10:12
1	93	328.7606607095715	294.1144163790618	20/04/28 05:10:12
1	93	328.9815186817206	294.09335513071215	20/04/28 05:10:12
1	93	329.1729007255817	294.11108807785473	20/04/28 05:10:12
1	93	328.93027280081526	293.950811162285	20/04/28 05:10:12
1	93	328.84957519829993	293.95527349125456	20/04/28 05:10:12
1	93	329.01310614062794	293.8011431541078	20/04/28 05:10:12
1	93	329.01367383312265	293.7634244434614	20/04/28 05:10:12
1	93	329.05509874029804	293.7713299714355	20/04/28 05:10:12
1	93	328.8393981096063	293.9043807896842	20/04/28 05:10:12
1	93	328.6962317456694	294.1617624867148	20/04/28 05:10:13
1	93	328.4997216052129	294.25313004014777	20/04/28 05:10:13
1	93	328.48516002864187	294.39599601012657	20/04/28 05:10:13
1	93	328.31216976828694	294.3121688893426	20/04/28 05:10:13
1	93	328.2181886997816	294.1745051436037	20/04/28 05:10:13
1	93	328.1738797926592	294.0566664893613	20/04/28 05:10:13
1	93	327.9663646626385	294.1712050658927	20/04/28 05:10:13
1	93	327.9650266270005	294.19078399436785	20/04/28 05:10:13
1	93	327.91823859151407	294.24128365362947	20/04/28 05:10:13
1	93	328.06396834874363	294.4212447979687	20/04/28 05:10:14
1	93	328.0386057742942	294.56504846930886	20/04/28 05:10:14
1	93	328.1950222069896	294.3666427135571	20/04/28 05:10:14
1	93	328.16547778755125	294.34449620735796	20/04/28 05:10:14
1	93	328.1669659150643	294.4186061881296	20/04/28 05:10:14
1	93	328.2340300924306	294.3910406799843	20/04/28 05:10:14
1	93	328.4078143701035	294.5584185953988	20/04/28 05:10:14
1	93	328.316908697185	294.65983804840124	20/04/28 05:10:14
1	93	328.1901462084625	294.73200314261277	20/04/28 05:10:14
1	93	328.1539387878554	294.8006270694582	20/04/28 05:10:14
1	93	328.0536205418094	294.64863773803563	20/04/28 05:10:15
1	93	328.0325386892224	294.6448663336482	20/04/28 05:10:15
1	93	328.0880704229584	294.61783651573967	20/04/28 05:10:15
1	93	328.08834414847763	294.61767063436105	20/04/28 05:10:15
1	93	328.31441037015037	294.5359479589034	20/04/28 05:10:15
1	93	328.1781501611976	294.72317714851647	20/04/28 05:10:15
1	93	328.2006772106225	294.75009670278666	20/04/28 05:10:15
1	93	327.9829659230013	294.6401854613318	20/04/28 05:10:15
1	93	328.0725412504146	294.6744943565519	20/04/28 05:10:15
1	93	327.8952683300444	294.7526363676578	20/04/28 05:10:16
1	93	327.89593914182615	294.78630987938965	20/04/28 05:10:16
1	93	327.78536604301695	294.71091365533516	20/04/28 05:10:16
1	93	327.6704387955295	294.9873346209596	20/04/28 05:10:16
1	93	327.5523404177863	295.21874269598885	20/04/28 05:10:16
1	93	327.59429979769504	295.065850674045	20/04/28 05:10:16
1	93	327.3848711653919	294.99169014273184	20/04/28 05:10:16
1	93	327.16905457978055	294.8351054022781	20/04/28 05:10:16
1	93	327.32200562112695	294.7439492210133	20/04/28 05:10:16
1	93	327.51990171281835	294.643951807796	20/04/28 05:10:16
1	93	327.57925774271365	294.74523815803747	20/04/28 05:10:17
1	93	327.6427386804138	294.9182084114491	20/04/28 05:10:17
1	93	327.6068192419188	294.87890981761706	20/04/28 05:10:17
1	93	327.46550848797216	294.98843237371335	20/04/28 05:10:17
1	93	327.46869109275013	294.98652845661815	20/04/28 05:10:17
1	93	327.42381392919265	294.869409137067	20/04/28 05:10:17
1	93	327.19095859207357	294.70537332302763	20/04/28 05:10:17
1	93	327.1849656435602	294.51158065526647	20/04/28 05:10:17
1	93	327.1666753909527	294.4204471440251	20/04/28 05:10:17
1	93	327.10319233123744	294.2979674013035	20/04/28 05:10:17
1	93	327.255358582042	294.3329474621192	20/04/28 05:10:18
1	93	327.2350026940786	294.3352395518064	20/04/28 05:10:18
1	93	327.2871020732448	294.2900347196491	20/04/28 05:10:18
1	93	327.23888076147864	294.3495822309282	20/04/28 05:10:18
1	93	327.4148174328421	294.34821445218404	20/04/28 05:10:18
1	93	327.55754986789515	294.39547152204307	20/04/28 05:10:18
1	93	327.3013053274486	294.3211688562134	20/04/28 05:10:18
1	93	327.29158008087325	294.30880271774913	20/04/28 05:10:18
1	93	327.3351203722392	294.42461896724285	20/04/28 05:10:18
1	93	327.4889969893102	294.37531855647103	20/04/28 05:10:19
1	93	327.6692977990302	294.414918296902	20/04/28 05:10:19
1	93	327.71402065677654	294.17552651638624	20/04/28 05:10:19
1	93	327.88621226378683	294.20167991217244	20/04/28 05:10:19
1	93	327.82936540249204	294.0504277674211	20/04/28 05:10:19
1	93	327.9535871883393	294.0842751179677	20/04/28 05:10:19
1	93	327.95658776889405	294.05560420418107	20/04/28 05:10:19
1	93	327.94354766088605	294.05454329412566	20/04/28 05:10:19
1	93	328.0149783683186	294.118085788612	20/04/28 05:10:19
1	93	328.11560270162505	294.39656039837297	20/04/28 05:10:19
1	93	328.038511019612	294.4445330198902	20/04/28 05:10:20
1	93	328.13411936077506	294.65992073474246	20/04/28 05:10:20
1	93	327.921859188365	294.4921201280577	20/04/28 05:10:20
1	93	327.8013162135281	294.60811099431055	20/04/28 05:10:20
1	93	327.7963188929781	294.9007125137388	20/04/28 05:10:20
1	93	327.8726768487326	295.03240850917103	20/04/28 05:10:20
1	93	328.0049966432002	295.20261806968205	20/04/28 05:10:20
1	93	328.03240639106554	295.09421060507543	20/04/28 05:10:20
1	93	327.9572363675306	295.2879181969544	20/04/28 05:10:20
1	93	328.1718376550296	295.2574491560191	20/04/28 05:10:20
1	93	328.3695540817262	295.1919066050036	20/04/28 05:10:21
1	93	328.0909711770018	295.2254500889857	20/04/28 05:10:21
1	93	328.1048853845517	295.30588790782434	20/04/28 05:10:21
1	93	328.19737643589775	295.5508915819916	20/04/28 05:10:21
1	93	328.4134876651064	295.7155450804361	20/04/28 05:10:21
1	93	328.3533912675749	295.9246882243606	20/04/28 05:10:21
1	93	328.4056739926239	295.87945728152107	20/04/28 05:10:21
1	93	328.2473590773496	295.9646361184051	20/04/28 05:10:21
1	93	328.1445712553741	295.73400769569145	20/04/28 05:10:21
1	93	327.97356453016806	295.4912260312573	20/04/28 05:10:22
1	93	327.97385316580824	295.4971276250471	20/04/28 05:10:22
1	93	327.80220312989815	295.5021767933992	20/04/28 05:10:22
1	93	327.87857635114284	295.6418133354518	20/04/28 05:10:22
1	93	327.8729964593263	295.83635739731926	20/04/28 05:10:22
1	93	327.74281435390753	295.79447457988914	20/04/28 05:10:22
1	93	327.74281435390753	295.79447457988914	20/04/28 05:10:22
1	93	327.48128785605394	295.8378814542656	20/04/28 05:10:22
1	93	327.48128785605394	295.8378814542656	20/04/28 05:10:22
1	93	327.5634149948577	296.2505567407156	20/04/28 05:10:22
1	93	327.5254350394392	296.281074324077	20/04/28 05:10:23
1	93	327.6087637921838	296.2423930542603	20/04/28 05:10:23
1	93	327.8274363034147	296.12913222233107	20/04/28 05:10:23
1	93	327.95384363817135	295.98124731422763	20/04/28 05:10:23
1	93	328.1433342148389	295.77243953612486	20/04/28 05:10:23
1	93	328.2169859351472	295.74362978037726	20/04/28 05:10:23
1	93	328.208464212241	295.7406250594802	20/04/28 05:10:23
1	93	328.2107327828823	295.7337708316226	20/04/28 05:10:23
1	93	328.1772697809023	295.7668477394895	20/04/28 05:10:23
1	93	328.27893380741676	295.6910338281799	20/04/28 05:10:24
1	93	328.3285849347154	295.8523732232244	20/04/28 05:10:24
1	93	328.3117684042204	295.9986668013502	20/04/28 05:10:24
1	93	328.4177264726851	296.0644205261211	20/04/28 05:10:24
1	93	328.4173799444458	296.0723609509644	20/04/28 05:10:24
1	93	328.4342180118235	295.97657422804315	20/04/28 05:10:24
1	93	328.44057905510294	295.91489259662524	20/04/28 05:10:24
1	93	328.3709755933379	295.72117463258866	20/04/28 05:10:24
1	93	328.3747787074267	295.73057066900793	20/04/28 05:10:24
1	93	328.3912397916786	295.7935239452881	20/04/28 05:10:24
1	93	328.2104474466073	295.56626796556316	20/04/28 05:10:25
1	93	328.19524932127723	295.46164159165374	20/04/28 05:10:25
1	93	328.45190583875893	295.5942491212243	20/04/28 05:10:25
1	93	328.4817594257216	295.87641773814653	20/04/28 05:10:25
1	93	328.3598124319398	295.6438285529545	20/04/28 05:10:25
1	93	328.4068164233762	295.79781587579515	20/04/28 05:10:25
1	93	328.5287708735916	295.6643926646292	20/04/28 05:10:25
1	93	328.66263854728095	295.6426377579375	20/04/28 05:10:25
1	93	328.54673109838194	295.4788817341564	20/04/28 05:10:25
1	93	328.49368096930465	295.4305354467285	20/04/28 05:10:25
1	93	328.33910179093493	295.51655849333116	20/04/28 05:10:26
1	93	328.1897084647476	295.71908629795985	20/04/28 05:10:26
1	93	328.30231368401655	295.7703680856831	20/04/28 05:10:26
1	93	328.27110369162756	295.7824107049078	20/04/28 05:10:26
1	93	328.1962492676531	295.6750587353651	20/04/28 05:10:26
1	93	328.16113666136044	295.56721331155745	20/04/28 05:10:26
1	93	328.11324110739025	295.61427140825407	20/04/28 05:10:26
1	93	328.0899695403827	295.58756197534524	20/04/28 05:10:26
1	93	327.98974477546614	295.51409783853586	20/04/28 05:10:26
1	93	328.00987615974583	295.76517690813114	20/04/28 05:10:27
1	93	327.85708038872326	295.8686763726735	20/04/28 05:10:27
1	93	327.7172994551484	295.81397667728976	20/04/28 05:10:27
1	93	327.7784798618712	295.7389861721571	20/04/28 05:10:27
1	93	327.62294685335354	295.8715779763646	20/04/28 05:10:27
1	93	327.62294685335354	295.8715779763646	20/04/28 05:10:27
1	93	327.62294685335354	295.8715779763646	20/04/28 05:10:27
1	93	327.6346069194873	295.666544102833	20/04/28 05:10:27
1	93	327.6346069194873	295.666544102833	20/04/28 05:10:27
1	93	327.6026592300845	295.67570506984583	20/04/28 05:10:27
1	93	327.31656315143834	295.6788152278732	20/04/28 05:10:28
1	93	327.2885270556477	295.6923786111065	20/04/28 05:10:28
1	93	327.26852497758716	295.97403100125337	20/04/28 05:10:28
1	93	327.3157799586206	296.23023859765215	20/04/28 05:10:28
1	93	327.3157799586206	296.23023859765215	20/04/28 05:10:28
1	93	327.2928190258827	296.24848859926334	20/04/28 05:10:28
1	93	327.1735943880609	296.203016853751	20/04/28 05:10:28
1	93	327.18177280177883	296.1332513723948	20/04/28 05:10:28
1	93	327.0427327202478	296.3575646581988	20/04/28 05:10:28
1	93	327.0465170832565	296.3686367685667	20/04/28 05:10:29
1	93	327.0374304207887	296.1833554346124	20/04/28 05:10:29
1	93	326.8800265665398	296.1790306587121	20/04/28 05:10:29
1	93	326.69385817183064	296.23431270779486	20/04/28 05:10:29
1	93	326.6796744000885	296.18274575676384	20/04/28 05:10:29
1	93	326.65362441831326	296.39939575986847	20/04/28 05:10:29
1	93	326.653884768346	296.39918352545345	20/04/28 05:10:29
1	93	326.6873042989281	296.22520903335356	20/04/28 05:10:29
1	93	326.7273340853747	296.17794441373707	20/04/28 05:10:29
1	93	326.71412525180733	296.08275108572803	20/04/28 05:10:29
1	93	326.5153468708045	295.9575681400198	20/04/28 05:10:30
1	93	326.643807586526	295.85500339922265	20/04/28 05:10:30
1	93	326.837164991544	295.9552715543957	20/04/28 05:10:30
1	93	326.79295155263844	295.84463560930567	20/04/28 05:10:30
1	93	326.79109976850765	295.813733185955	20/04/28 05:10:30
1	93	326.73205132461965	295.8663332181624	20/04/28 05:10:30
1	93	326.99313828846397	295.8582715102137	20/04/28 05:10:30
1	93	327.0552767501762	295.8396657575884	20/04/28 05:10:30
1	93	327.2285732058073	296.0829764390326	20/04/28 05:10:30
1	93	327.27947649151844	295.948109374129	20/04/28 05:10:30
1	93	327.2969379874077	295.9604282149715	20/04/28 05:10:31
1	93	327.11821094007087	295.84940481484034	20/04/28 05:10:31
1	93	327.30937284439983	295.66619001831646	20/04/28 05:10:31
1	93	327.3488255423122	295.64356884339156	20/04/28 05:10:31
1	93	327.32507473485424	295.65818956348687	20/04/28 05:10:31
1	93	327.18858829211996	295.81048647881653	20/04/28 05:10:31
1	93	327.2135825524505	295.6078213603332	20/04/28 05:10:31
1	93	327.0922063001296	295.53999181831836	20/04/28 05:10:31
1	93	327.1050851591521	295.4778984616745	20/04/28 05:10:31
1	93	326.857902353063	295.3322802444949	20/04/28 05:10:32
1	93	326.95144520481193	295.1186851020877	20/04/28 05:10:32
1	93	326.6971580184763	295.19116061918675	20/04/28 05:10:32
1	93	326.71073266492294	295.2846978688018	20/04/28 05:10:32
1	93	326.70872522129224	295.5148975371113	20/04/28 05:10:32
1	93	326.7976071622912	295.55720989225466	20/04/28 05:10:32
1	93	326.63777737661246	295.5988842151702	20/04/28 05:10:32
1	93	326.5079637003713	295.61534994761536	20/04/28 05:10:32
1	93	326.70568168222894	295.5192590135623	20/04/28 05:10:32
1	93	326.96429931568065	295.4657648074277	20/04/28 05:10:32
1	93	326.9544798744109	295.4732554639005	20/04/28 05:10:33
1	93	326.917331155767	295.5044199116446	20/04/28 05:10:33
1	93	326.873326875849	295.4449507466598	20/04/28 05:10:33
1	93	326.94176388212514	295.3474522567014	20/04/28 05:10:33
1	93	326.90165160144966	295.37986722989064	20/04/28 05:10:33
1	93	326.9047424366521	295.40616544667046	20/04/28 05:10:33
1	93	326.9415605193182	295.39771396978136	20/04/28 05:10:33
1	93	327.2036169455921	295.5092000816765	20/04/28 05:10:33
1	93	327.3252231183145	295.30498465042893	20/04/28 05:10:33
1	93	327.057227230012	295.3137347105683	20/04/28 05:10:33
1	93	327.1596066043886	295.29120370706244	20/04/28 05:10:34
1	93	327.0760987426111	295.21678938774943	20/04/28 05:10:34
1	93	326.87439469902023	295.0355084544181	20/04/28 05:10:34
1	93	327.0406978951373	295.1901810366064	20/04/28 05:10:34
1	93	326.79080685627724	295.17647949011587	20/04/28 05:10:34
1	93	326.77638782203263	295.17197972014986	20/04/28 05:10:34
1	93	326.88412692115344	294.8962923120324	20/04/28 05:10:34
1	93	326.61223650044786	294.9691600965896	20/04/28 05:10:34
1	93	326.3599855092286	294.9029775290044	20/04/28 05:10:34
1	93	326.2089271983245	295.1055026503083	20/04/28 05:10:35
1	93	326.13652958486426	294.9371273906497	20/04/28 05:10:35
1	93	326.03232407862754	294.81883801487203	20/04/28 05:10:35
1	93	325.9977082670681	294.870807176812	20/04/28 05:10:35
1	93	325.9558768210749	295.0282500591876	20/04/28 05:10:35
1	93	325.9784588554043	295.05645001065886	20/04/28 05:10:35
1	93	326.2184011353898	295.09349945816325	20/04/28 05:10:35
1	93	326.0853771695693	294.8962861321835	20/04/28 05:10:35
1	93	326.02765462885037	295.00539001901916	20/04/28 05:10:35
1	93	326.02765462885037	295.00539001901916	20/04/28 05:10:35
1	93	326.02765462885037	295.00539001901916	20/04/28 05:10:36
1	93	325.9871840107137	295.05934009490795	20/04/28 05:10:36
1	93	326.14555414589825	295.0022918431967	20/04/28 05:10:36
1	93	326.2097662242574	295.0042324605816	20/04/28 05:10:36
1	93	326.43101397866616	295.0941063085197	20/04/28 05:10:36
1	93	326.4321864172407	295.0989097935351	20/04/28 05:10:36
1	93	326.19658887389835	295.22878504643444	20/04/28 05:10:36
1	93	326.2631697417671	295.2386866024931	20/04/28 05:10:36
1	93	326.2759773535468	295.2163554368185	20/04/28 05:10:36
1	93	326.2505473437575	295.2513522120097	20/04/28 05:10:36
1	93	326.286326942486	295.16187478652176	20/04/28 05:10:37
1	93	326.02357124571495	295.17330281417867	20/04/28 05:10:37
1	93	326.0041190646403	295.0537763713479	20/04/28 05:10:37
1	93	326.21629295659073	295.25812691069166	20/04/28 05:10:37
1	93	326.1479392704801	295.5185629444845	20/04/28 05:10:37
1	93	326.0694630322868	295.5002246468826	20/04/28 05:10:37
1	93	326.16929600985577	295.57566826220483	20/04/28 05:10:37
1	93	326.02767828968877	295.8280099224451	20/04/28 05:10:37
1	93	325.8783688000648	295.79720106051997	20/04/28 05:10:37
1	93	326.0758804015724	295.8640888942957	20/04/28 05:10:38
1	93	325.9730816747693	295.5840933486514	20/04/28 05:10:38
1	93	325.9730816747693	295.5840933486514	20/04/28 05:10:38
1	93	325.9730816747693	295.5840933486514	20/04/28 05:10:38
1	93	325.94344934812926	295.51852047622265	20/04/28 05:10:38
1	93	325.95241604714926	295.53874827358817	20/04/28 05:10:38
1	93	326.06815165815283	295.4190185558263	20/04/28 05:10:38
1	93	326.0693631862305	295.42080361305347	20/04/28 05:10:38
1	93	326.1020253663019	295.1341531228668	20/04/28 05:10:38
1	93	326.0051945139537	295.1164606131265	20/04/28 05:10:38
1	93	326.23386285115777	294.9771591550189	20/04/28 05:10:39
1	93	326.21027968402575	294.9960265104315	20/04/28 05:10:39
1	93	325.96977432270984	295.13573757911865	20/04/28 05:10:39
1	93	326.1707508562743	295.2076599261057	20/04/28 05:10:39
1	93	326.1752658610014	295.2092409470361	20/04/28 05:10:39
1	93	326.28594468900644	295.04815362989694	20/04/28 05:10:39
1	93	326.14515213903536	294.9748284694341	20/04/28 05:10:39
1	93	326.1337363027697	295.12783748739565	20/04/28 05:10:39
1	93	326.0270294369323	295.18691868263977	20/04/28 05:10:39
1	93	326.0669027882734	295.25844521487716	20/04/28 05:10:40
1	93	326.03562198026464	295.39033067302773	20/04/28 05:10:40
1	93	326.1526940746747	295.2335169040552	20/04/28 05:10:40
1	93	326.35798780607956	295.4483549626296	20/04/28 05:10:40
1	93	326.20920255699997	295.4290522509485	20/04/28 05:10:40
1	93	326.14378000683183	295.3941716582706	20/04/28 05:10:40
1	93	326.00510385474234	295.6092745146736	20/04/28 05:10:40
1	93	326.00475513604175	295.60808297856386	20/04/28 05:10:40
1	93	326.1178561031003	295.7583094132058	20/04/28 05:10:40
1	93	326.23062095024056	295.6889917946791	20/04/28 05:10:40
1	93	326.0347439334473	295.64505958454794	20/04/28 05:10:41
1	93	326.0176025173101	295.63226363097476	20/04/28 05:10:41
1	93	326.06618603757516	295.3458133189578	20/04/28 05:10:41
1	93	326.28951446384406	295.3427843366545	20/04/28 05:10:41
1	93	326.38492003320476	295.30003779817775	20/04/28 05:10:41
1	93	326.3198182379716	295.5131471426367	20/04/28 05:10:41
1	93	326.3389911917079	295.5158710172092	20/04/28 05:10:41
1	93	326.58321561164047	295.60901502758367	20/04/28 05:10:41
1	93	326.62859748430384	295.62096166302535	20/04/28 05:10:41
1	93	326.84356914995794	295.7017467455936	20/04/28 05:10:41
1	93	326.83004870572444	295.6983815147285	20/04/28 05:10:42
1	93	326.93471039733186	295.59460845623704	20/04/28 05:10:42
1	93	326.78442262693835	295.6579686319004	20/04/28 05:10:42
1	93	326.5584248367471	295.5256274221993	20/04/28 05:10:42
1	93	326.77267249874376	295.405363651142	20/04/28 05:10:42
1	93	326.5654996902268	295.55397756426373	20/04/28 05:10:42
1	93	326.5006206859824	295.5279696720483	20/04/28 05:10:42
1	93	326.4356879179586	295.4731855519049	20/04/28 05:10:42
1	93	326.3671417704996	295.2398156589189	20/04/28 05:10:42
1	93	326.1097762056888	295.3059144813107	20/04/28 05:10:43
1	93	325.8862072561489	295.3780756493897	20/04/28 05:10:43
1	93	326.01540914411737	295.23455020963564	20/04/28 05:10:43
1	93	326.0129769523958	295.23173737465055	20/04/28 05:10:43
1	93	326.05168927069667	295.26214031840954	20/04/28 05:10:43
1	93	326.0920335771662	295.1997692317623	20/04/28 05:10:43
1	93	325.84670787766294	295.2942189459703	20/04/28 05:10:43
1	93	325.7282664869581	295.1245608381766	20/04/28 05:10:43
1	93	325.7267550094757	295.1387217478756	20/04/28 05:10:43
1	93	325.7242855187948	295.1848050980037	20/04/28 05:10:43
1	93	325.8806156709252	295.2623586776702	20/04/28 05:10:44
1	93	325.6338093162695	295.24264166592366	20/04/28 05:10:44
1	93	325.6316577589543	295.246735587047	20/04/28 05:10:44
1	93	325.588173380281	295.18137119828395	20/04/28 05:10:44
1	93	325.3284099522096	295.04952556100653	20/04/28 05:10:44
1	93	325.3684121661542	295.2670557695298	20/04/28 05:10:44
1	93	325.21741855301866	295.0125367722692	20/04/28 05:10:44
1	93	325.2227707881744	294.986180290611	20/04/28 05:10:44
1	93	325.27526896361053	295.0082238118956	20/04/28 05:10:44
1	93	325.4698327976274	295.12657594462377	20/04/28 05:10:44
1	93	325.39832476572263	295.2834274800435	20/04/28 05:10:45
1	93	325.4402375763054	295.25672873203933	20/04/28 05:10:45
1	93	325.44233613112357	295.2413588163454	20/04/28 05:10:45
1	93	325.42705476796203	295.2530148964412	20/04/28 05:10:45
1	93	325.42705476796203	295.2530148964412	20/04/28 05:10:45
1	93	325.15488462373116	295.3492675665076	20/04/28 05:10:45
1	93	324.99402758692213	295.3290520889134	20/04/28 05:10:45
1	93	324.9758926630241	295.2967788538035	20/04/28 05:10:45
1	93	324.9758926630241	295.2967788538035	20/04/28 05:10:45
1	93	325.02930435876436	295.29715545811086	20/04/28 05:10:46
1	93	325.0665889496322	295.3189467280538	20/04/28 05:10:46
1	93	324.79813623689313	295.11847070318663	20/04/28 05:10:46
1	93	324.6524018775234	295.09984570689807	20/04/28 05:10:46
1	93	324.8373605713469	294.8851013892126	20/04/28 05:10:46
1	93	324.82559619260905	294.87616823548956	20/04/28 05:10:46
1	93	324.82559619260905	294.87616823548956	20/04/28 05:10:46
1	93	324.8593782871872	294.90478794468834	20/04/28 05:10:46
1	93	324.989649307492	294.9469924662193	20/04/28 05:10:46
1	93	324.81188356000206	295.06702675552856	20/04/28 05:10:46
1	93	324.9524908858729	295.3067530719639	20/04/28 05:10:47
1	93	324.9349485352359	295.2959893776205	20/04/28 05:10:47
1	93	324.6991256413138	295.3043448908079	20/04/28 05:10:47
1	93	324.76683949928497	295.3183567848968	20/04/28 05:10:47
1	93	324.8508993161798	295.3560100136954	20/04/28 05:10:47
1	93	324.81492646356355	295.3815673036253	20/04/28 05:10:47
1	93	324.92426231893984	295.3847611943802	20/04/28 05:10:47
1	93	324.89834098276634	295.41495018617945	20/04/28 05:10:47
1	93	324.6100925643414	295.3606453849652	20/04/28 05:10:47
1	93	324.56929893449944	295.35071504762067	20/04/28 05:10:48
1	93	324.4554395784853	295.4994438932379	20/04/28 05:10:48
1	93	324.49053295380645	295.502018838352	20/04/28 05:10:48
1	93	324.4906375532014	295.50282224751226	20/04/28 05:10:48
1	93	324.5670766624916	295.6454333209326	20/04/28 05:10:48
1	93	324.73273021073453	295.48390836102317	20/04/28 05:10:48
1	93	324.9204165725729	295.3622458223052	20/04/28 05:10:48
1	93	324.8562734871459	295.2789087475233	20/04/28 05:10:48
1	93	324.85296609582736	295.2824317045786	20/04/28 05:10:48
1	93	324.73440089874936	295.1915056826677	20/04/28 05:10:48
1	93	324.73176906947333	295.1925883183686	20/04/28 05:10:49
1	93	324.66859074044703	295.2486864704623	20/04/28 05:10:49
1	93	324.66429897223276	295.247399960146	20/04/28 05:10:49
1	93	324.6730781157344	295.1582678197141	20/04/28 05:10:49
1	93	324.6730896842101	295.157164637571	20/04/28 05:10:49
1	93	324.7951821644892	295.1527939560764	20/04/28 05:10:49
1	93	324.9570806712608	295.327857839879	20/04/28 05:10:49
1	93	325.0438738145712	295.4565890270224	20/04/28 05:10:49
1	93	325.2617744884097	295.46306123963956	20/04/28 05:10:49
1	93	325.4382658893347	295.49598496191777	20/04/28 05:10:50
1	93	325.4891245577037	295.4642020739571	20/04/28 05:10:50
1	93	325.5184469882719	295.4752080269017	20/04/28 05:10:50
1	93	325.6253778988015	295.5733548814951	20/04/28 05:10:50
1	93	325.58299698869513	295.79637514244126	20/04/28 05:10:50
1	93	325.5160740428551	295.6684772656491	20/04/28 05:10:50
1	93	325.66087875310546	295.6962291613143	20/04/28 05:10:50
1	93	325.5972093163021	295.69538900840956	20/04/28 05:10:50
1	93	325.64070987986685	295.6120755580567	20/04/28 05:10:50
1	93	325.5897993361701	295.7324961524648	20/04/28 05:10:50
1	93	325.5957422765621	295.6046712968642	20/04/28 05:10:51
1	93	325.41720661247405	295.68394890089695	20/04/28 05:10:51
1	93	325.4541687360504	295.68729019167694	20/04/28 05:10:51
1	93	325.5113892522836	295.53193313537514	20/04/28 05:10:51
1	93	325.4107206609245	295.56402069602314	20/04/28 05:10:51
1	93	325.2510116002844	295.7049602720879	20/04/28 05:10:51
1	93	325.187754597879	295.8420816919287	20/04/28 05:10:51
1	93	324.9911764606182	296.018437244838	20/04/28 05:10:51
1	93	324.9974871704242	296.0238063990692	20/04/28 05:10:51
1	93	325.2289085890049	296.04827434439034	20/04/28 05:10:51
1	93	325.0695134679573	296.207996028123	20/04/28 05:10:52
1	93	324.9596657297978	296.1482914302851	20/04/28 05:10:52
1	93	325.1802025329979	296.2719377226846	20/04/28 05:10:52
1	93	325.2573053186216	296.54426043674226	20/04/28 05:10:52
1	93	325.21914293674894	296.7982339186413	20/04/28 05:10:52
1	93	325.1694013989811	296.6744419135703	20/04/28 05:10:52
1	93	325.19277777557096	296.59616905464486	20/04/28 05:10:52
1	93	325.25252612011144	296.6640589415657	20/04/28 05:10:52
1	93	325.40957864214306	296.6988312605968	20/04/28 05:10:52
1	93	325.2734038701407	296.55737807437583	20/04/28 05:10:53
1	93	325.4890364673312	296.446821084661	20/04/28 05:10:53
1	93	325.53413343565205	296.43462529029097	20/04/28 05:10:53
1	93	325.4733755437597	296.68565655665793	20/04/28 05:10:53
1	93	325.50826136898615	296.8405290006368	20/04/28 05:10:53
1	93	325.573241592606	297.05677638484156	20/04/28 05:10:53
1	93	325.3681409673166	296.88673145101535	20/04/28 05:10:53
1	93	325.2091923979063	296.95710881444853	20/04/28 05:10:53
1	93	325.19452549641784	296.987317669576	20/04/28 05:10:53
1	93	325.2108792681881	296.9409684904413	20/04/28 05:10:53
1	93	325.20630037432	296.93649308347756	20/04/28 05:10:54
1	93	325.1299248220198	296.88126017204706	20/04/28 05:10:54
1	93	324.9590780376935	296.95277450654027	20/04/28 05:10:54
1	93	324.73940318644776	296.80751723373413	20/04/28 05:10:54
1	93	325.0151663040541	296.8705098871173	20/04/28 05:10:54
1	93	325.00880716059294	296.8431139627446	20/04/28 05:10:54
1	93	325.00344654640685	296.98994496639773	20/04/28 05:10:54
1	93	325.233619150644	296.9483275663826	20/04/28 05:10:54
1	93	325.41859023727864	296.89698046361707	20/04/28 05:10:54
1	93	325.4110900910209	296.877563169118	20/04/28 05:10:55
1	93	325.3048720564145	296.78928579026575	20/04/28 05:10:55
1	93	325.2142328983547	297.04119075228834	20/04/28 05:10:55
1	93	325.22857450942485	296.98190580355225	20/04/28 05:10:55
1	93	325.10982368238575	297.1209678125401	20/04/28 05:10:55
1	93	325.24983750569584	297.2013533149966	20/04/28 05:10:55
1	93	325.2686734308788	297.0785029804483	20/04/28 05:10:55
1	93	325.466248063514	297.14752964133197	20/04/28 05:10:55
1	93	325.53119336694516	297.1275981037297	20/04/28 05:10:55
1	93	325.31659403355087	297.09740152694815	20/04/28 05:10:55
1	93	325.1629651778211	296.84233246919575	20/04/28 05:10:56
1	93	325.2044118991889	296.7602434274209	20/04/28 05:10:56
1	93	325.2068662737329	296.7599628110654	20/04/28 05:10:56
1	93	325.2068662737329	296.7599628110654	20/04/28 05:10:56
