floorId	partitionId	location_x	location_y	timeStamp
19	958	366.0934949463719	285.26630486259984	21/02/24 15:45:59
19	958	366.0934949463719	285.26630486259984	21/02/24 15:45:59
19	958	366.0824787932478	284.7895205850422	21/02/24 15:45:59
19	958	366.0824787932478	284.7895205850422	21/02/24 15:45:59
19	958	366.0780817256915	284.59921343747686	21/02/24 15:45:59
19	958	366.07216000177857	284.34291844720747	21/02/24 15:46:00
19	958	366.06738859971705	284.136409926563	21/02/24 15:46:00
19	958	366.06249592236395	283.9246525543806	21/02/24 15:46:00
19	958	366.0564470310337	283.6628536986054	21/02/24 15:46:00
19	958	366.05136556311334	283.44292538206327	21/02/24 15:46:00
19	958	366.0463160371127	283.2243795267995	21/02/24 15:46:00
19	964	365.9784821287135	283.0848406524573	21/02/24 15:46:00
19	964	365.7341417811978	283.04592046271256	21/02/24 15:46:00
19	964	365.48360180276387	283.0060127536566	21/02/24 15:46:00
19	964	365.2583682469533	282.97013602343924	21/02/24 15:46:00
19	964	364.9995800537052	282.9289144827182	21/02/24 15:46:01
19	964	364.9995800537052	282.9289144827182	21/02/24 15:46:01
19	964	364.75203008087635	282.88948304205866	21/02/24 15:46:01
19	964	364.50305620867033	282.8498247930373	21/02/24 15:46:01
19	964	364.3109045483587	282.8192175717776	21/02/24 15:46:01
19	964	364.13601829277314	282.7913605014233	21/02/24 15:46:01
19	964	363.94586063032443	282.7610708976834	21/02/24 15:46:01
19	964	363.7662093034458	282.73245481441637	21/02/24 15:46:01
19	964	363.5342363880104	282.6955045932344	21/02/24 15:46:01
19	964	363.3735906577946	282.6699158504612	21/02/24 15:46:02
19	964	363.13688378645315	282.6322115726366	21/02/24 15:46:02
19	964	362.9280127623487	282.59894117757915	21/02/24 15:46:02
19	964	362.6509928519519	282.5548155651482	21/02/24 15:46:02
19	964	362.4398353093502	282.5211809578979	21/02/24 15:46:02
19	964	362.27274181058107	282.494565170766	21/02/24 15:46:02
19	964	361.73725628958573	282.40926940076895	21/02/24 15:46:02
19	964	361.44730179246835	282.3630834795329	21/02/24 15:46:02
19	964	361.2155217576047	282.3261639816782	21/02/24 15:46:02
19	964	360.9984607021209	282.29158902280824	21/02/24 15:46:03
19	964	360.9984607021209	282.29158902280824	21/02/24 15:46:03
19	964	360.4449868742557	282.20342795314343	21/02/24 15:46:03
19	964	360.2529180468799	282.1728339260762	21/02/24 15:46:03
19	964	360.2529180468799	282.1728339260762	21/02/24 15:46:03
19	964	359.70836974554703	282.08609457488615	21/02/24 15:46:03
19	964	359.53611377608684	282.05865647436684	21/02/24 15:46:03
19	964	359.53611377608684	282.05865647436684	21/02/24 15:46:03
19	964	359.3165771430831	282.0236871886991	21/02/24 15:46:03
19	964	359.05080278853467	281.98135284476666	21/02/24 15:46:03
19	964	358.7991364120044	281.9412657153731	21/02/24 15:46:04
19	964	358.4613364688779	281.88745864660234	21/02/24 15:46:04
19	964	358.2869053766641	281.8596740777607	21/02/24 15:46:04
19	964	358.1147207529784	281.83224734168084	21/02/24 15:46:04
19	964	358.1147207529784	281.83224734168084	21/02/24 15:46:04
19	964	357.9617552264684	281.80788195390636	21/02/24 15:46:04
19	964	357.7236119637586	281.7699488779108	21/02/24 15:46:04
19	964	357.7236119637586	281.7699488779108	21/02/24 15:46:04
19	964	357.45254679092346	281.72677177651434	21/02/24 15:46:04
19	964	357.2986132762242	281.7022522010079	21/02/24 15:46:05
19	964	357.14493421338307	281.67777315632134	21/02/24 15:46:05
19	964	356.74169975650943	281.6135432338681	21/02/24 15:46:05
19	964	356.74169975650943	281.6135432338681	21/02/24 15:46:05
19	909	356.4733685184374	281.55872790570737	21/02/24 15:46:05
19	909	356.3020668907195	281.4635953265614	21/02/24 15:46:05
19	909	356.084687600114	281.34287345810213	21/02/24 15:46:05
19	909	355.9470412565149	281.26643138425237	21/02/24 15:46:05
19	909	355.5765764256434	281.0606932642287	21/02/24 15:46:05
19	909	355.35769681957026	280.939138193646	21/02/24 15:46:06
19	909	355.1461284018004	280.82164340088536	21/02/24 15:46:06
19	909	354.9220606310682	280.69720707639027	21/02/24 15:46:06
19	909	354.9220606310682	280.69720707639027	21/02/24 15:46:06
19	909	354.76424207037826	280.6095623358496	21/02/24 15:46:06
19	909	354.51878924872335	280.47324979583607	21/02/24 15:46:06
19	909	354.0525492704297	280.2143228245812	21/02/24 15:46:06
19	909	353.89034226515355	280.12424095569855	21/02/24 15:46:06
19	909	353.6581785700407	279.99530854919215	21/02/24 15:46:06
19	909	353.4312273687404	279.86927090782467	21/02/24 15:46:07
19	909	353.21803314951677	279.75087322413685	21/02/24 15:46:07
19	909	353.00094254797784	279.6303116795218	21/02/24 15:46:07
19	909	352.74409642249435	279.487671853582	21/02/24 15:46:07
19	909	352.5327846492844	279.3703195887076	21/02/24 15:46:07
19	909	352.4012675250856	279.2972813847304	21/02/24 15:46:07
19	909	352.20613410989955	279.1889137917804	21/02/24 15:46:07
19	909	352.00936850530155	279.07963976034245	21/02/24 15:46:07
19	909	351.83553906620193	278.98310335789637	21/02/24 15:46:07
19	909	351.6438275202804	278.87663610444093	21/02/24 15:46:07
19	909	351.6438275202804	278.87663610444093	21/02/24 15:46:08
19	909	351.44756667876044	278.76764239382715	21/02/24 15:46:08
19	909	351.2546102230524	278.66048377812155	21/02/24 15:46:08
19	909	351.05977007051735	278.55227904896174	21/02/24 15:46:08
19	909	350.85708862559574	278.4397196479958	21/02/24 15:46:08
19	909	350.7149841410923	278.3608017398643	21/02/24 15:46:08
19	909	350.48721084027466	278.23430754447315	21/02/24 15:46:08
19	909	350.27476183639135	278.1163237170825	21/02/24 15:46:08
19	909	350.03318751933176	277.9821651095814	21/02/24 15:46:08
19	909	349.8113339776551	277.85895846003854	21/02/24 15:46:09
19	909	349.57373087577093	277.72700527198975	21/02/24 15:46:09
19	909	349.38962893633476	277.6247640232774	21/02/24 15:46:09
19	909	349.13076658515234	277.481004483804	21/02/24 15:46:09
19	909	348.99646949060264	277.406422419719	21/02/24 15:46:09
19	909	348.7746575131042	277.2832388528959	21/02/24 15:46:09
19	909	348.6211942316728	277.19801282228974	21/02/24 15:46:09
19	909	348.4737112332677	277.11610794954936	21/02/24 15:46:09
19	909	348.2459335865599	276.9896113406625	21/02/24 15:46:09
19	909	348.0188904650522	276.86352265128977	21/02/24 15:46:09
19	909	347.88501295591976	276.7891736045056	21/02/24 15:46:10
19	909	347.7530023331691	276.7158613354733	21/02/24 15:46:10
19	909	347.5929927601205	276.62699981340285	21/02/24 15:46:10
19	909	347.3975956032569	276.51848575117316	21/02/24 15:46:10
19	909	347.1631579671316	276.3882905086025	21/02/24 15:46:10
19	909	346.98205843669825	276.28771665158916	21/02/24 15:46:10
19	909	346.7279328937872	276.14658770467804	21/02/24 15:46:10
19	909	346.53301664416387	276.0383407149024	21/02/24 15:46:10
19	909	346.37834108410203	275.9524414438005	21/02/24 15:46:10
19	909	346.20101869904715	275.85396522932837	21/02/24 15:46:11
19	909	346.00312967881575	275.74406730757437	21/02/24 15:46:11
19	909	345.7714603501734	275.61540944812276	21/02/24 15:46:11
19	909	345.5538608505475	275.49456528630094	21/02/24 15:46:11
19	909	345.314422481686	275.36159288037726	21/02/24 15:46:11
19	909	345.0906172589857	275.2373023622692	21/02/24 15:46:11
19	909	344.93320065050824	275.14988084640635	21/02/24 15:46:11
19	909	344.73428089776877	275.039410506029	21/02/24 15:46:11
19	909	344.59904954213147	274.9643095988481	21/02/24 15:46:11
19	909	344.38174495624486	274.8436292177505	21/02/24 15:46:11
19	909	344.232372535809	274.7606750520567	21/02/24 15:46:12
19	909	344.091343602681	274.68235445276406	21/02/24 15:46:12
19	909	343.8955156017606	274.57360112073366	21/02/24 15:46:12
19	909	343.69020038735135	274.45957905249725	21/02/24 15:46:12
19	909	343.5286226638969	274.3698466560832	21/02/24 15:46:12
19	909	343.36469220092533	274.2788076627541	21/02/24 15:46:12
19	909	343.1399191439381	274.15397965663067	21/02/24 15:46:12
19	909	342.9790329898166	274.06463132413467	21/02/24 15:46:12
19	909	342.7347544444361	273.9289709199595	21/02/24 15:46:12
19	909	342.54202902083017	273.82194060822883	21/02/24 15:46:13
19	909	342.3621297023107	273.72203329044464	21/02/24 15:46:13
19	909	342.0691466016489	273.697236887614	21/02/24 15:46:13
19	909	341.7959212298808	273.697236887614	21/02/24 15:46:13
19	909	341.49864968874715	273.697236887614	21/02/24 15:46:13
19	909	341.30057128699775	273.697236887614	21/02/24 15:46:13
19	909	341.14872291427724	273.697236887614	21/02/24 15:46:13
19	909	340.9986339728238	273.697236887614	21/02/24 15:46:13
19	909	340.7430933825879	273.697236887614	21/02/24 15:46:13
19	909	340.5532394653036	273.697236887614	21/02/24 15:46:14
19	909	340.384624110113	273.697236887614	21/02/24 15:46:14
19	909	340.0984110662057	273.697236887614	21/02/24 15:46:14
19	909	339.8315849868054	273.697236887614	21/02/24 15:46:14
19	909	339.63325451862727	273.697236887614	21/02/24 15:46:14
19	909	339.4327437138753	273.697236887614	21/02/24 15:46:14
19	909	339.249684272148	273.697236887614	21/02/24 15:46:14
19	909	338.9855912953937	273.697236887614	21/02/24 15:46:14
19	909	338.72051349912743	273.697236887614	21/02/24 15:46:14
19	909	338.4805353734964	273.697236887614	21/02/24 15:46:14
19	909	338.235384439696	273.697236887614	21/02/24 15:46:15
19	909	338.02315959960384	273.697236887614	21/02/24 15:46:15
19	909	337.83327196722337	273.697236887614	21/02/24 15:46:15
19	909	337.628772215789	273.697236887614	21/02/24 15:46:15
19	909	337.3312684155731	273.697236887614	21/02/24 15:46:15
19	909	337.09303096262363	273.697236887614	21/02/24 15:46:15
19	909	336.8458525909113	273.697236887614	21/02/24 15:46:15
19	909	336.6173079749792	273.697236887614	21/02/24 15:46:15
19	909	336.4658302581991	273.697236887614	21/02/24 15:46:15
19	909	336.2811915412805	273.697236887614	21/02/24 15:46:15
19	909	336.06249769232573	273.697236887614	21/02/24 15:46:16
19	909	335.8957599993573	273.697236887614	21/02/24 15:46:16
19	909	335.7449269246132	273.697236887614	21/02/24 15:46:16
19	909	335.4880586456497	273.697236887614	21/02/24 15:46:16
19	909	335.27252301815184	273.697236887614	21/02/24 15:46:16
19	909	334.9734437031323	273.697236887614	21/02/24 15:46:16
19	909	334.69743120656545	273.697236887614	21/02/24 15:46:16
19	909	334.54672688499056	273.697236887614	21/02/24 15:46:16
19	909	334.36624226492034	273.697236887614	21/02/24 15:46:16
19	909	334.20855611920217	273.697236887614	21/02/24 15:46:17
19	909	334.0278088460003	273.697236887614	21/02/24 15:46:17
19	909	333.77333688723223	273.697236887614	21/02/24 15:46:17
19	909	333.77333688723223	273.697236887614	21/02/24 15:46:17
19	909	333.5529867735013	273.697236887614	21/02/24 15:46:17
19	909	333.31833792120966	273.697236887614	21/02/24 15:46:17
19	909	333.31833792120966	273.697236887614	21/02/24 15:46:17
19	909	333.0530688804015	273.697236887614	21/02/24 15:46:17
19	909	333.0530688804015	273.697236887614	21/02/24 15:46:17
19	909	332.7781360167488	273.697236887614	21/02/24 15:46:18
19	909	332.5564271320088	273.697236887614	21/02/24 15:46:18
19	909	332.3039692088862	273.697236887614	21/02/24 15:46:18
19	909	332.0656993903979	273.697236887614	21/02/24 15:46:18
19	909	331.84087842729645	273.697236887614	21/02/24 15:46:18
19	909	331.66300909481527	273.697236887614	21/02/24 15:46:18
19	909	331.66300909481527	273.697236887614	21/02/24 15:46:18
19	909	331.4147534888509	273.697236887614	21/02/24 15:46:18
19	909	330.9424154278848	273.697236887614	21/02/24 15:46:18
19	909	330.9424154278848	273.697236887614	21/02/24 15:46:19
19	909	330.5680026906322	273.697236887614	21/02/24 15:46:19
19	909	330.3153335869984	273.697236887614	21/02/24 15:46:19
19	955	330.35973933279905	273.8423746346726	21/02/24 15:46:19
19	955	330.4687634239624	274.0977120324332	21/02/24 15:46:19
19	955	330.56633797899866	274.3262343040226	21/02/24 15:46:19
19	955	330.6751473118287	274.58106873190394	21/02/24 15:46:19
19	955	330.7682702021359	274.7991650831716	21/02/24 15:46:19
19	955	330.83982494064526	274.96674823413815	21/02/24 15:46:19
19	955	330.92952615992493	275.17683093845085	21/02/24 15:46:19
19	955	331.0141821172217	275.3750975014686	21/02/24 15:46:20
19	955	331.0757079621404	275.5191927098665	21/02/24 15:46:20
19	955	331.1403501299313	275.6705864315036	21/02/24 15:46:20
19	955	331.1403501299313	275.6705864315036	21/02/24 15:46:20
19	955	331.2483022801313	275.92341331426525	21/02/24 15:46:20
19	955	331.3171708197278	276.0847053140471	21/02/24 15:46:20
19	955	331.41745522275613	276.3195741236103	21/02/24 15:46:20
19	955	331.51350568833874	276.54452693609295	21/02/24 15:46:20
19	955	331.6084832322183	276.7669669366573	21/02/24 15:46:20
19	955	331.43215701087337	276.9151145828469	21/02/24 15:46:21
19	955	331.62418776614476	277.02266413488246	21/02/24 15:46:21
19	955	331.8693347865115	277.11548049606193	21/02/24 15:46:21
19	955	331.94009601000596	277.1335882541179	21/02/24 15:46:21
19	955	331.9399377410651	277.1342930042107	21/02/24 15:46:21
19	955	331.80702888894297	277.1207757506538	21/02/24 15:46:21
19	955	331.7301799631638	276.8973435833385	21/02/24 15:46:21
19	955	331.7617735295815	276.8660717775476	21/02/24 15:46:21
19	955	331.7704283457374	276.97399438611814	21/02/24 15:46:21
19	955	331.62558559590144	276.9928473025738	21/02/24 15:46:22
19	955	331.69493296727575	276.81956781268065	21/02/24 15:46:22
19	955	331.6451895249507	276.90831823780474	21/02/24 15:46:22
19	955	331.4771719110012	276.90112642342825	21/02/24 15:46:22
19	955	331.47510993320816	276.8891731278502	21/02/24 15:46:22
19	955	331.47101985911587	276.67901561392796	21/02/24 15:46:22
19	955	331.51356407249096	276.71468697088966	21/02/24 15:46:22
19	955	331.5411693343569	276.6035468972113	21/02/24 15:46:22
19	955	331.7906483957174	276.53478807538716	21/02/24 15:46:22
19	955	331.71103823779083	276.51865800767325	21/02/24 15:46:22
19	955	331.71576797184247	276.5125448466721	21/02/24 15:46:23
19	955	331.62913588400215	276.5370684075202	21/02/24 15:46:23
19	955	331.63105389276586	276.47026434522667	21/02/24 15:46:23
19	955	331.56560623114706	276.4458047122664	21/02/24 15:46:23
19	955	331.6850390550124	276.3477849847642	21/02/24 15:46:23
19	955	331.5489791162986	276.25608086720683	21/02/24 15:46:23
19	955	331.5124811388311	276.2261387874579	21/02/24 15:46:23
19	955	331.52351009469464	276.3340691840376	21/02/24 15:46:23
19	955	331.37067666540446	276.34098736787075	21/02/24 15:46:23
19	955	331.4448659281237	276.14799156388733	21/02/24 15:46:24
19	955	331.4208310488628	276.12717352160206	21/02/24 15:46:24
19	955	331.4208310488628	276.12717352160206	21/02/24 15:46:24
19	955	331.4208310488628	276.12717352160206	21/02/24 15:46:24
19	955	331.29039707911596	275.8922016096453	21/02/24 15:46:24
19	955	331.1822803692846	275.6974334056809	21/02/24 15:46:24
19	955	331.0869759633862	275.52574608745147	21/02/24 15:46:24
19	955	330.96649380491743	275.30870199083284	21/02/24 15:46:24
19	955	330.8709065993983	275.13650521967713	21/02/24 15:46:24
19	955	330.7749337166102	274.9636136653642	21/02/24 15:46:24
19	955	330.6562799759798	274.74986339501027	21/02/24 15:46:25
19	955	330.5244385789325	274.5123560554776	21/02/24 15:46:25
19	955	330.4177285092858	274.32012186112934	21/02/24 15:46:25
19	955	330.2924862649907	274.09450264815223	21/02/24 15:46:25
19	955	330.18911323746806	273.9082800102237	21/02/24 15:46:25
19	955	330.10507605875557	273.7568901798302	21/02/24 15:46:25
19	909	330.1819156250284	273.697236887614	21/02/24 15:46:25
19	909	330.48135369443105	273.697236887614	21/02/24 15:46:25
19	909	330.7737897061203	273.697236887614	21/02/24 15:46:25
19	909	330.9881599769152	273.697236887614	21/02/24 15:46:26
19	909	331.2525972085553	273.697236887614	21/02/24 15:46:26
19	909	331.4055816463861	273.697236887614	21/02/24 15:46:26
19	909	331.58435398553087	273.697236887614	21/02/24 15:46:26
19	909	331.8717404737497	273.697236887614	21/02/24 15:46:26
19	909	332.13728162246304	273.697236887614	21/02/24 15:46:26
19	909	332.3566895354422	273.697236887614	21/02/24 15:46:26
19	909	332.65457087155653	273.697236887614	21/02/24 15:46:26
19	909	332.946283653754	273.697236887614	21/02/24 15:46:26
19	909	333.1444590188165	273.697236887614	21/02/24 15:46:27
19	909	333.41329130789705	273.697236887614	21/02/24 15:46:27
19	909	333.7010061948174	273.697236887614	21/02/24 15:46:27
19	909	333.89043517247615	273.697236887614	21/02/24 15:46:27
19	909	334.14596378393895	273.697236887614	21/02/24 15:46:27
19	909	334.3103778038092	273.697236887614	21/02/24 15:46:27
19	909	334.5221663742017	273.697236887614	21/02/24 15:46:27
19	909	334.7026125251823	273.697236887614	21/02/24 15:46:27
19	909	334.9831500256854	273.697236887614	21/02/24 15:46:27
19	909	335.16611693213787	273.697236887614	21/02/24 15:46:27
19	909	335.3964534376691	273.697236887614	21/02/24 15:46:28
19	909	335.68437242967	273.697236887614	21/02/24 15:46:28
19	909	335.84042282563547	273.697236887614	21/02/24 15:46:28
19	909	335.99342611577146	273.697236887614	21/02/24 15:46:28
19	909	336.266335228461	273.697236887614	21/02/24 15:46:28
19	909	336.4466529359309	273.697236887614	21/02/24 15:46:28
19	909	336.64045957475764	273.697236887614	21/02/24 15:46:28
19	909	336.85130076167076	273.697236887614	21/02/24 15:46:28
19	909	337.0590314691167	273.697236887614	21/02/24 15:46:28
19	909	337.3477453456049	273.697236887614	21/02/24 15:46:29
19	909	337.5724273448278	273.697236887614	21/02/24 15:46:29
19	909	337.8133112654635	273.697236887614	21/02/24 15:46:29
19	909	338.1024937597138	273.697236887614	21/02/24 15:46:29
19	909	338.26487627017104	273.697236887614	21/02/24 15:46:29
19	909	338.48463345182194	273.697236887614	21/02/24 15:46:29
19	909	338.7511573586488	273.697236887614	21/02/24 15:46:29
19	909	338.94338917353735	273.697236887614	21/02/24 15:46:29
19	909	339.16527925307594	273.697236887614	21/02/24 15:46:29
19	909	339.4516745621295	273.697236887614	21/02/24 15:46:29
19	909	339.73270045049975	273.697236887614	21/02/24 15:46:30
19	909	339.96854271370887	273.697236887614	21/02/24 15:46:30
19	909	340.26159658975706	273.697236887614	21/02/24 15:46:30
19	909	340.5405974272211	273.697236887614	21/02/24 15:46:30
19	909	340.69678474199264	273.697236887614	21/02/24 15:46:30
19	909	340.90698552324574	273.697236887614	21/02/24 15:46:30
19	909	341.1365560715499	273.697236887614	21/02/24 15:46:30
19	909	341.3189762667935	273.697236887614	21/02/24 15:46:30
19	909	341.61889216492386	273.697236887614	21/02/24 15:46:30
19	909	341.78345720162906	273.697236887614	21/02/24 15:46:31
19	909	342.03734218702334	273.697236887614	21/02/24 15:46:31
19	909	342.22372064544317	273.697236887614	21/02/24 15:46:31
19	895	342.36578681752917	273.7822666558471	21/02/24 15:46:31
19	895	342.41781120331615	273.97055744653386	21/02/24 15:46:31
19	895	342.4818805953852	274.2024424810038	21/02/24 15:46:31
19	895	342.5523302060905	274.4574193097085	21/02/24 15:46:31
19	895	342.62919173001615	274.7356026442047	21/02/24 15:46:31
19	895	342.6756946839008	274.90390982984	21/02/24 15:46:31
19	895	342.6756946839008	274.90390982984	21/02/24 15:46:32
19	895	342.7241140857366	275.07915317617307	21/02/24 15:46:32
19	895	342.76569913973856	275.2296611077966	21/02/24 15:46:32
19	895	342.8224237037992	275.4349631571484	21/02/24 15:46:32
19	895	342.8791283154557	275.6401929931739	21/02/24 15:46:32
19	895	342.9491743838788	275.893709289587	21/02/24 15:46:32
19	895	343.00094718518073	276.0810895257154	21/02/24 15:46:32
19	895	343.0516770093083	276.2646949359837	21/02/24 15:46:32
19	895	343.10355763831615	276.45246543071283	21/02/24 15:46:32
19	895	343.1744234656997	276.70894866389017	21/02/24 15:46:33
19	895	343.22864924761154	276.90520692234594	21/02/24 15:46:33
19	895	343.30042838502595	277.16499567975495	21/02/24 15:46:33
19	895	343.35192520107523	277.3513770481283	21/02/24 15:46:33
19	895	343.40249987343697	277.534420920798	21/02/24 15:46:33
19	895	343.51239757339636	277.93217140851596	21/02/24 15:46:33
19	895	343.51239757339636	277.93217140851596	21/02/24 15:46:33
19	895	343.65382321041113	278.4440303111068	21/02/24 15:46:33
19	895	343.7073472667979	278.63774882878596	21/02/24 15:46:33
19	895	343.7761621578964	278.88680915040146	21/02/24 15:46:33
19	895	343.8410323622742	279.1215925484084	21/02/24 15:46:34
19	895	343.89378754207615	279.31252828686013	21/02/24 15:46:34
19	964	344.09533102622345	279.34384061508456	21/02/24 15:46:34
19	964	344.09533102622345	279.34384061508456	21/02/24 15:46:34
19	964	344.3513496973056	279.3572652132919	21/02/24 15:46:34
19	895	344.5502881047098	279.3676967500861	21/02/24 15:46:34
19	895	344.5783079711783	279.36972661943173	21/02/24 15:46:34
19	895	344.3997853907982	279.2870056945587	21/02/24 15:46:34
19	895	344.2760545508874	279.55948587998483	21/02/24 15:46:34
19	895	344.2008320266674	279.4582208518916	21/02/24 15:46:35
19	895	344.2008320266674	279.4582208518916	21/02/24 15:46:35
19	895	344.2453904267716	279.61021162651735	21/02/24 15:46:35
19	895	344.18995049513507	279.6844237614663	21/02/24 15:46:35
19	895	344.14474981138596	279.7186582334142	21/02/24 15:46:35
19	895	344.13084242257764	279.95180327510656	21/02/24 15:46:35
19	895	344.2474217791007	280.18563036247656	21/02/24 15:46:35
19	895	344.15623584286703	280.2938230330898	21/02/24 15:46:35
19	895	344.24373996827785	280.37077337295295	21/02/24 15:46:35
19	895	344.36770964351916	280.3842823498755	21/02/24 15:46:36
19	895	344.3512382701555	280.2146505642639	21/02/24 15:46:36
19	895	344.3512382701555	280.2146505642639	21/02/24 15:46:36
19	895	344.3512382701555	280.2146505642639	21/02/24 15:46:36
19	895	344.3512382701555	280.2146505642639	21/02/24 15:46:36
19	895	344.20534411764027	280.0324068023706	21/02/24 15:46:36
19	895	344.01860381634515	279.79914005097316	21/02/24 15:46:36
19	911	343.8927775451701	279.65137058579796	21/02/24 15:46:36
19	911	343.60417943959186	279.6885769231875	21/02/24 15:46:36
19	911	343.1238062908358	279.75050707830644	21/02/24 15:46:36
19	911	342.97369729546	279.7698592702273	21/02/24 15:46:37
19	911	342.97369729546	279.7698592702273	21/02/24 15:46:37
19	911	342.8081316577188	279.79120414692204	21/02/24 15:46:37
19	911	342.630004729658	279.8141684369	21/02/24 15:46:37
19	911	342.3343581583987	279.85228346907	21/02/24 15:46:37
19	911	342.0573001255237	279.88800204950553	21/02/24 15:46:37
19	911	342.0573001255237	279.88800204950553	21/02/24 15:46:37
19	911	341.5410998802762	279.95455106737506	21/02/24 15:46:37
19	911	341.5410998802762	279.95455106737506	21/02/24 15:46:37
19	911	341.3849822506784	279.97467789803335	21/02/24 15:46:38
19	911	341.16279246932515	280.00332281222285	21/02/24 15:46:38
19	911	340.9884112937844	280.0258041962865	21/02/24 15:46:38
19	911	340.5260929341149	280.085406711129	21/02/24 15:46:38
19	911	340.230722914528	280.12348608999906	21/02/24 15:46:38
19	911	340.0633965489715	280.1450579613687	21/02/24 15:46:38
19	911	340.0633965489715	280.1450579613687	21/02/24 15:46:38
19	911	339.4989679876652	280.2178246188011	21/02/24 15:46:38
19	911	339.2783171225453	280.24627113447207	21/02/24 15:46:38
19	911	339.0575493077921	280.274732727399	21/02/24 15:46:39
19	911	338.8257588538737	280.30461536926487	21/02/24 15:46:39
19	911	338.67156139335106	280.3244946499321	21/02/24 15:46:39
19	911	338.5016645498768	280.3463979097163	21/02/24 15:46:39
19	911	338.30770704695976	280.3714030921942	21/02/24 15:46:39
19	911	338.08668016523563	280.3998980842771	21/02/24 15:46:39
19	911	337.8370330609345	280.43208282219257	21/02/24 15:46:39
19	911	337.8370330609345	280.43208282219257	21/02/24 15:46:39
19	911	337.64715481564104	280.45656210296664	21/02/24 15:46:39
19	911	337.282707474227	280.50354699470114	21/02/24 15:46:39
19	911	337.282707474227	280.50354699470114	21/02/24 15:46:40
19	911	336.9956003932872	280.5405611078013	21/02/24 15:46:40
19	911	336.7384506321273	280.57371309524825	21/02/24 15:46:40
19	911	336.58849938155794	280.5930449505613	21/02/24 15:46:40
19	911	336.3599145191375	280.62251432457646	21/02/24 15:46:40
19	911	336.1639764504123	280.64777484344864	21/02/24 15:46:40
19	911	336.1639764504123	280.64777484344864	21/02/24 15:46:40
19	911	335.9951062398707	280.6695457487561	21/02/24 15:46:40
19	911	335.54292716748273	280.72784109720976	21/02/24 15:46:40
19	911	335.54292716748273	280.72784109720976	21/02/24 15:46:41
19	911	335.2624269076036	280.7640034527665	21/02/24 15:46:41
19	911	334.9662697573776	280.8021843092539	21/02/24 15:46:41
19	911	334.79869340591364	280.8237884090403	21/02/24 15:46:41
19	911	334.54423147072293	280.85659387945225	21/02/24 15:46:41
19	911	334.2750956552104	280.89129112022414	21/02/24 15:46:41
19	911	334.02571677387493	280.92344127858433	21/02/24 15:46:41
19	911	333.5291006173947	280.98746549743385	21/02/24 15:46:41
19	911	333.26945066687756	281.0209398116285	21/02/24 15:46:41
19	911	333.26945066687756	281.0209398116285	21/02/24 15:46:42
19	911	333.02933816406767	281.05189533981223	21/02/24 15:46:42
19	911	332.799045401595	281.0815848978977	21/02/24 15:46:42
19	911	332.59957487920906	281.10730082399596	21/02/24 15:46:42
19	911	332.3921979912539	281.13403604612984	21/02/24 15:46:42
19	911	332.16164073605984	281.16375970286407	21/02/24 15:46:42
19	911	331.9810252793877	281.1870448162755	21/02/24 15:46:42
19	911	331.73953956214086	281.21817738054733	21/02/24 15:46:42
19	911	331.57074344701124	281.23993873340504	21/02/24 15:46:42
19	911	331.31648947857326	281.27271739254894	21/02/24 15:46:42
19	911	330.76295322365814	281.3440798036654	21/02/24 15:46:43
19	911	330.4898222321753	281.37929210625583	21/02/24 15:46:43
19	911	330.4898222321753	281.37929210625583	21/02/24 15:46:43
19	911	330.2886029592753	281.4052334829041	21/02/24 15:46:43
19	911	329.8288665522748	281.4621504010762	21/02/24 15:46:43
19	911	329.56960584111	281.49371762617477	21/02/24 15:46:43
19	911	329.35795744241466	281.5194876420532	21/02/24 15:46:43
19	911	329.112266791521	281.5494025954086	21/02/24 15:46:43
19	911	328.89189115719114	281.5762352274101	21/02/24 15:46:43
19	911	328.72542093602294	281.59650441096755	21/02/24 15:46:44
19	911	328.72542093602294	281.59650441096755	21/02/24 15:46:44
19	911	328.2780626410071	281.65097413734856	21/02/24 15:46:44
19	911	328.2780626410071	281.65097413734856	21/02/24 15:46:44
19	911	328.0659541417199	281.6768001744378	21/02/24 15:46:44
19	911	327.6979165337446	281.721611923829	21/02/24 15:46:44
19	911	327.6979165337446	281.721611923829	21/02/24 15:46:44
19	911	327.47565773786863	281.74867384697205	21/02/24 15:46:44
19	911	326.98407624935834	281.8085281281409	21/02/24 15:46:44
19	911	326.98407624935834	281.8085281281409	21/02/24 15:46:45
19	911	326.98407624935834	281.8085281281409	21/02/24 15:46:45
19	911	326.5030868110745	281.8670927359449	21/02/24 15:46:45
19	911	326.3036729800633	281.8913730878078	21/02/24 15:46:45
19	911	326.0330413085011	281.92432482529483	21/02/24 15:46:45
19	911	326.0330413085011	281.92432482529483	21/02/24 15:46:45
19	911	325.8072082116298	281.9518219503764	21/02/24 15:46:45
19	911	325.5547701695322	281.98255845673924	21/02/24 15:46:45
19	911	325.23329760078684	282.0217005114494	21/02/24 15:46:45
19	911	325.07104566588566	282.0414560823136	21/02/24 15:46:45
19	911	324.8432400343992	282.0691933804778	21/02/24 15:46:46
19	911	324.5990395470478	282.0989268935843	21/02/24 15:46:46
19	911	324.5990395470478	282.0989268935843	21/02/24 15:46:46
19	911	324.1589008217559	282.15251757515523	21/02/24 15:46:46
19	911	323.94227018973993	282.17889422086205	21/02/24 15:46:46
19	911	323.7295156455858	282.20479891947946	21/02/24 15:46:46
19	911	323.7295156455858	282.20479891947946	21/02/24 15:46:46
19	911	323.4898215388965	282.2339837419181	21/02/24 15:46:46
19	911	323.20433800373576	282.2687438217461	21/02/24 15:46:46
19	911	323.00983145302183	282.2924266699569	21/02/24 15:46:47
19	911	322.73881520119227	282.32542523340464	21/02/24 15:46:47
19	911	322.5675997436616	282.34627219036906	21/02/24 15:46:47
19	911	322.30632356807644	282.37808481562394	21/02/24 15:46:47
19	911	322.0632833092684	282.4076770609099	21/02/24 15:46:47
19	911	321.81841493230405	282.43749189533054	21/02/24 15:46:47
19	911	321.62074503132874	282.4615599086877	21/02/24 15:46:47
19	911	321.3808060822584	282.4907745427956	21/02/24 15:46:47
19	911	321.09808304541673	282.52519850817174	21/02/24 15:46:47
19	911	320.93876096187216	282.54459734439274	21/02/24 15:46:48
19	911	320.65101674375825	282.57963268184596	21/02/24 15:46:48
19	911	320.4093108014287	282.60906246260566	21/02/24 15:46:48
19	911	320.14810036703835	282.6408670833037	21/02/24 15:46:48
19	911	319.8902303397908	282.6722649806547	21/02/24 15:46:48
19	911	319.62285805951586	282.704819859173	21/02/24 15:46:48
19	911	319.34169779040803	282.7390535441144	21/02/24 15:46:48
19	911	319.10011047266113	282.7684688813092	21/02/24 15:46:48
19	911	318.8598655029277	282.7977207760691	21/02/24 15:46:48
19	911	318.6383867996452	282.8246877162185	21/02/24 15:46:48
19	911	318.3854110482256	282.85548969332353	21/02/24 15:46:49
19	911	318.14969486470613	282.8841901693467	21/02/24 15:46:49
19	911	317.90994554689405	282.9133817142152	21/02/24 15:46:49
19	911	317.90994554689405	282.9133817142152	21/02/24 15:46:49
19	911	317.64631947196244	282.9454804599597	21/02/24 15:46:49
19	911	317.46450060069407	282.96761847389445	21/02/24 15:46:49
19	897	317.32556688760457	283.08540151153613	21/02/24 15:46:49
19	897	317.36835776634985	283.28623012409474	21/02/24 15:46:49
19	897	317.4082910249245	283.47364718935836	21/02/24 15:46:49
19	897	317.46577204782585	283.7434204311383	21/02/24 15:46:50
19	897	317.51194147977685	283.9601054638653	21/02/24 15:46:50
19	897	317.54797203228316	284.12920612460744	21/02/24 15:46:50
19	897	317.59555573778454	284.3525287072802	21/02/24 15:46:50
19	897	317.65436690704956	284.62854466845624	21/02/24 15:46:50
19	897	317.7040282728364	284.8616182458442	21/02/24 15:46:50
19	897	317.7414782111289	285.03738044957106	21/02/24 15:46:50
19	897	317.7850642111509	285.24194077102413	21/02/24 15:46:50
19	897	317.8419636941798	285.50898469643687	21/02/24 15:46:50
19	897	317.88707410814396	285.72069948505555	21/02/24 15:46:51
19	897	317.9324081490268	285.9334638123871	21/02/24 15:46:51
19	897	317.97733626437235	286.14432302664693	21/02/24 15:46:51
19	897	318.02381827795415	286.3624750854567	21/02/24 15:46:51
19	897	318.06436944908614	286.5527921734636	21/02/24 15:46:51
19	897	318.1092922765501	286.76362657033354	21/02/24 15:46:51
19	897	318.1456879562438	286.93444086698605	21/02/24 15:46:51
19	897	318.19915402274313	287.18537088452416	21/02/24 15:46:51
19	897	318.2563186046531	287.45365898724816	21/02/24 15:46:51
19	897	318.29798230488666	287.64919746080403	21/02/24 15:46:51
19	897	318.34910184374536	287.8891146198961	21/02/24 15:46:52
19	897	318.4020967739272	288.1378334733792	21/02/24 15:46:52
19	897	318.43965028537565	288.3140817725969	21/02/24 15:46:52
19	897	318.47407913671174	288.47566523731064	21/02/24 15:46:52
19	897	318.52536686895127	288.71637177124876	21/02/24 15:46:52
19	897	318.5617657769955	288.8872012193815	21/02/24 15:46:52
19	897	318.6015077602227	289.0737205801864	21/02/24 15:46:52
19	897	318.65536056206366	289.3264656462666	21/02/24 15:46:52
19	897	318.68748049705147	289.4772127720143	21/02/24 15:46:52
19	897	318.5675303934153	289.6837072682853	21/02/24 15:46:52
19	897	318.4044585477321	289.61959559915425	21/02/24 15:46:53
19	897	318.6572378731294	289.6465977760766	21/02/24 15:46:53
19	897	318.90947477611195	289.6157671482432	21/02/24 15:46:53
19	897	318.7540152846741	289.50756293258985	21/02/24 15:46:53
19	897	318.83283970616685	289.57710573907985	21/02/24 15:46:53
19	897	318.8828619888296	289.61636296656695	21/02/24 15:46:53
19	897	318.8188592452524	289.4574334513654	21/02/24 15:46:53
19	897	318.68141042436196	289.26729960588875	21/02/24 15:46:53
19	897	318.70606084506284	289.45957219945893	21/02/24 15:46:53
19	897	318.6887645521369	289.32530493801994	21/02/24 15:46:54
19	897	318.66639092593243	289.3885399338343	21/02/24 15:46:54
19	897	318.55625948173497	289.4178075924671	21/02/24 15:46:54
19	897	318.37541189326396	289.51711171726333	21/02/24 15:46:54
19	897	318.23663036627846	289.51942133998705	21/02/24 15:46:54
19	897	318.14386105801094	289.43484013078177	21/02/24 15:46:54
19	897	318.10454795826877	289.3031371528633	21/02/24 15:46:54
19	897	317.8355222713	289.2370948286827	21/02/24 15:46:54
19	897	317.806773498345	289.2078308625546	21/02/24 15:46:54
19	897	317.67676063648014	288.945277377547	21/02/24 15:46:54
19	897	317.7697650295795	289.08557562564863	21/02/24 15:46:55
19	897	317.9148325791218	289.0137344457056	21/02/24 15:46:55
19	897	317.8202925084335	288.8601371623741	21/02/24 15:46:55
19	897	317.8154063869033	288.9499408722265	21/02/24 15:46:55
19	897	317.92467000225565	288.8815448726582	21/02/24 15:46:55
19	897	317.81839858806427	289.15088804123724	21/02/24 15:46:55
19	897	317.8472250143215	289.1464862877208	21/02/24 15:46:55
19	897	317.68992512275236	289.1203718032409	21/02/24 15:46:55
19	897	317.76564303293486	289.238416284202	21/02/24 15:46:55
19	897	317.8446200790446	289.42044567376223	21/02/24 15:46:55
19	897	317.76993673164935	289.6519211143774	21/02/24 15:46:56
19	897	317.9679107995219	289.8241700702423	21/02/24 15:46:56
19	897	317.81168484760786	289.7093296267657	21/02/24 15:46:56
19	897	317.930232248578	289.65763701074957	21/02/24 15:46:56
19	897	317.98804470962904	289.64656235063876	21/02/24 15:46:56
19	897	317.7451559802967	289.5068130686697	21/02/24 15:46:56
19	897	317.8379265990898	289.5564042002897	21/02/24 15:46:56
19	897	317.8361856788653	289.58394993672675	21/02/24 15:46:56
19	897	317.82972477920293	289.6501840378615	21/02/24 15:46:56
19	897	318.0511684513604	289.67248896821945	21/02/24 15:46:57
19	897	318.0332677090912	289.8884372870203	21/02/24 15:46:57
19	897	318.0093049446592	289.902141116188	21/02/24 15:46:57
19	897	318.15378273596417	289.76413040562795	21/02/24 15:46:57
19	897	318.1483023715732	289.7875373409564	21/02/24 15:46:57
19	897	317.91804737759327	289.9218034252503	21/02/24 15:46:57
19	897	317.87628626333594	289.6994963575892	21/02/24 15:46:57
19	897	317.88833200020514	289.9915415425842	21/02/24 15:46:57
19	897	317.8117459810447	289.9745001911502	21/02/24 15:46:57
19	897	317.78865028079366	290.076858925634	21/02/24 15:46:57
19	897	317.8443543701998	290.0454743802356	21/02/24 15:46:58
19	897	318.0602170178801	290.0514979023558	21/02/24 15:46:58
19	897	317.7957752118602	290.02935188578044	21/02/24 15:46:58
19	897	317.87539606422047	289.8453614769017	21/02/24 15:46:58
19	897	317.9057367157156	289.8509829871336	21/02/24 15:46:58
19	897	318.01421119354086	290.1298228609599	21/02/24 15:46:58
19	897	318.00268663252893	290.1594484318117	21/02/24 15:46:58
19	897	318.0182131775115	290.1884960109966	21/02/24 15:46:58
19	897	317.9439688996921	290.3875791482441	21/02/24 15:46:58
19	897	317.7222572067473	290.2531046534344	21/02/24 15:46:58
19	897	317.84219911690394	290.34055559356375	21/02/24 15:46:59
19	897	317.84219911690394	290.34055559356375	21/02/24 15:46:59
19	897	317.8471488988872	290.4144737772518	21/02/24 15:46:59
19	897	317.8471488988872	290.4144737772518	21/02/24 15:46:59
19	897	317.7658006605954	290.49425346741293	21/02/24 15:46:59
19	897	317.8702322856887	290.4487020140948	21/02/24 15:46:59
19	897	317.9714422478867	290.50174203563796	21/02/24 15:46:59
19	897	318.1353710101269	290.7448933991622	21/02/24 15:46:59
19	897	317.951660878333	290.66950653644466	21/02/24 15:46:59
19	897	317.9257669570782	290.71454250785416	21/02/24 15:47:00
19	897	317.9783240930917	290.4443670249	21/02/24 15:47:00
19	897	317.9783240930917	290.4443670249	21/02/24 15:47:00
19	897	317.9783240930917	290.4443670249	21/02/24 15:47:00
19	897	317.9783240930917	290.4443670249	21/02/24 15:47:00
19	897	317.97353788384606	290.22063554463296	21/02/24 15:47:00
19	897	317.96973154745245	290.04270824725995	21/02/24 15:47:00
19	897	317.96478364290516	289.8114183157546	21/02/24 15:47:00
19	897	317.9602225427644	289.5982095666658	21/02/24 15:47:00
19	897	317.9544455252987	289.32816272942836	21/02/24 15:47:00
19	897	317.9457881112345	288.92347167551344	21/02/24 15:47:01
19	897	317.9457881112345	288.92347167551344	21/02/24 15:47:01
19	897	317.9415347370913	288.724647586479	21/02/24 15:47:01
19	897	317.9365254963489	288.4904904928809	21/02/24 15:47:01
19	897	317.92392023544636	287.9012572320359	21/02/24 15:47:01
19	897	317.91842041449127	287.6441679531645	21/02/24 15:47:01
19	897	317.91392441952866	287.43400254738344	21/02/24 15:47:01
19	897	317.90852552937554	287.1816312815727	21/02/24 15:47:01
19	897	317.9046140220454	286.9987877659348	21/02/24 15:47:01
19	897	317.90137160275754	286.84722078887745	21/02/24 15:47:01
19	897	317.8964193240537	286.61572638730576	21/02/24 15:47:02
19	897	317.8928138497059	286.4471883916815	21/02/24 15:47:02
19	897	317.88894462320053	286.2663212943386	21/02/24 15:47:02
19	897	317.8831502734615	285.9954642595196	21/02/24 15:47:02
19	897	317.8781273539805	285.7606677529149	21/02/24 15:47:02
19	897	317.8742135077367	285.5777149046962	21/02/24 15:47:02
19	897	317.8742135077367	285.5777149046962	21/02/24 15:47:02
19	897	317.8681487872271	285.29421938091286	21/02/24 15:47:02
19	897	317.86250256888235	285.0302867521152	21/02/24 15:47:02
19	897	317.85919043793734	284.8754611017667	21/02/24 15:47:03
19	897	317.8543173333597	284.6476676968612	21/02/24 15:47:03
19	897	317.84808788678896	284.35647204891	21/02/24 15:47:03
19	897	317.84324405852055	284.13004716586863	21/02/24 15:47:03
19	897	317.8368456585222	283.8309537853833	21/02/24 15:47:03
19	897	317.83251790921713	283.62865302740175	21/02/24 15:47:03
19	897	317.82824295514774	283.4288201841364	21/02/24 15:47:03
19	897	317.82495035359324	283.27490743567193	21/02/24 15:47:03
19	911	317.82951059500493	282.9867085022434	21/02/24 15:47:03
19	911	318.01904344359326	282.980041647815	21/02/24 15:47:03
19	911	318.290644232292	282.9704880377977	21/02/24 15:47:04
19	911	318.57598610785885	282.96045108240503	21/02/24 15:47:04
19	911	319.0231092431769	282.94472344006266	21/02/24 15:47:04
19	911	319.0231092431769	282.94472344006266	21/02/24 15:47:04
19	911	319.27104008300967	282.93600242505244	21/02/24 15:47:04
19	911	319.4608553187747	282.92932563760075	21/02/24 15:47:04
19	911	319.61473405153333	282.923912923559	21/02/24 15:47:04
19	911	319.81799088594755	282.9167633252877	21/02/24 15:47:04
19	911	319.98354092153085	282.9109400709227	21/02/24 15:47:04
19	911	320.2650760366582	282.90103701906116	21/02/24 15:47:04
19	911	320.5301170667124	282.89171414981666	21/02/24 15:47:05
19	911	320.70909903701613	282.88541842456266	21/02/24 15:47:05
19	911	320.9823536690443	282.87580664028786	21/02/24 15:47:05
19	911	321.1413276300459	282.870214700612	21/02/24 15:47:05
19	911	321.3718388788364	282.8621064230694	21/02/24 15:47:05
19	911	321.6490181446435	282.8523565890461	21/02/24 15:47:05
19	911	321.8514304228413	282.8452366982023	21/02/24 15:47:05
19	911	322.04963913597095	282.83826466856885	21/02/24 15:47:05
19	911	322.3353793059068	282.8282137030951	21/02/24 15:47:05
19	911	322.61579839781854	282.818349907565	21/02/24 15:47:06
19	911	322.9056860340057	282.8081530541676	21/02/24 15:47:06
19	911	323.1815150471956	282.79845071553996	21/02/24 15:47:06
19	911	323.40864417333427	282.7904614048126	21/02/24 15:47:06
19	911	323.6256723379304	282.78282739735164	21/02/24 15:47:06
19	911	323.83703956798973	282.7753925143526	21/02/24 15:47:06
19	911	324.0891935806845	282.7665229484241	21/02/24 15:47:06
19	911	324.38187059421597	282.75622797814174	21/02/24 15:47:06
19	911	324.6066608534268	282.7483209375087	21/02/24 15:47:06
19	911	324.89873666090506	282.738047114765	21/02/24 15:47:06
19	911	325.1502648511826	282.7291995622605	21/02/24 15:47:07
19	911	325.4221693132303	282.7196352704746	21/02/24 15:47:07
19	911	325.63096798350114	282.71229073706047	21/02/24 15:47:07
19	911	325.85759639764035	282.70431903897406	21/02/24 15:47:07
19	911	326.0321644421619	282.698178574409	21/02/24 15:47:07
19	911	326.2250344034887	282.6913943363977	21/02/24 15:47:07
19	911	326.49512010088677	282.6818940200085	21/02/24 15:47:07
19	911	326.7014448258517	282.6746365080966	21/02/24 15:47:07
19	911	326.964573937783	282.6653808909401	21/02/24 15:47:07
19	911	327.1793655075326	282.65782555613333	21/02/24 15:47:07
19	911	327.3722112498939	282.65104217002886	21/02/24 15:47:08
19	911	327.6329049115039	282.64187222030614	21/02/24 15:47:08
19	911	327.90448902109375	282.63231919697967	21/02/24 15:47:08
19	911	328.1210772537803	282.62470066420826	21/02/24 15:47:08
19	911	328.35693999606383	282.61640414685206	21/02/24 15:47:08
19	911	328.5863426936378	282.6083348628119	21/02/24 15:47:08
19	911	328.7743565043754	282.60172144083225	21/02/24 15:47:08
19	911	329.0032193075	282.5936711476832	21/02/24 15:47:08
19	911	329.2802401354527	282.5839268867419	21/02/24 15:47:08
19	911	329.51027818620236	282.57583525403146	21/02/24 15:47:08
19	911	329.79658128143257	282.56576448755214	21/02/24 15:47:09
19	911	329.9811624102326	282.55927181082035	21/02/24 15:47:09
19	911	330.1424542861328	282.5535983380418	21/02/24 15:47:09
19	964	330.31804769707304	282.55110264223623	21/02/24 15:47:09
19	964	330.5981417399874	282.5476660737083	21/02/24 15:47:09
19	964	330.8977782379512	282.54398973219094	21/02/24 15:47:09
19	964	331.05675551335423	282.54203918623995	21/02/24 15:47:09
19	964	331.334048839009	282.53863698065913	21/02/24 15:47:09
19	964	331.55277484792595	282.53595335729227	21/02/24 15:47:09
19	964	331.75851632455317	282.53342904554285	21/02/24 15:47:10
19	964	331.9387835905764	282.5312172854976	21/02/24 15:47:10
19	964	332.17474777199953	282.52832216116303	21/02/24 15:47:10
19	964	332.32971216761945	282.5264208505911	21/02/24 15:47:10
19	964	332.59192130614144	282.523203718003	21/02/24 15:47:10
19	964	332.77120825154594	282.5210039858429	21/02/24 15:47:10
19	964	332.95562267233066	282.5187413429535	21/02/24 15:47:10
19	964	333.2494153558652	282.5151367011715	21/02/24 15:47:10
19	964	333.4313218106729	282.51290482936474	21/02/24 15:47:10
19	964	333.64204576155197	282.5103193859539	21/02/24 15:47:10
19	964	333.8499069197206	282.50776906711485	21/02/24 15:47:11
19	964	334.03862329474964	282.5054536420941	21/02/24 15:47:11
19	964	334.22625222198036	282.5031515593381	21/02/24 15:47:11
19	964	334.46546681667746	282.500216554584	21/02/24 15:47:11
19	964	334.64946088393896	282.4979590691541	21/02/24 15:47:11
19	964	334.8883475993206	282.49502808726214	21/02/24 15:47:11
19	964	335.0546480981287	282.4929876902068	21/02/24 15:47:11
19	964	335.31711623545044	282.4897673798749	21/02/24 15:47:11
19	964	335.4772009680272	282.4878032461573	21/02/24 15:47:11
19	964	335.7050416602609	282.48500779165863	21/02/24 15:47:11
19	964	335.8613204602322	282.4830903542152	21/02/24 15:47:12
19	964	336.0253395587079	282.481077948432	21/02/24 15:47:12
19	964	336.20719294268065	282.4788467277693	21/02/24 15:47:12
19	964	336.4066162588467	282.4763999356671	21/02/24 15:47:12
19	964	336.57546976163854	282.47432821494255	21/02/24 15:47:12
19	964	336.72571552169325	282.47248479890595	21/02/24 15:47:12
19	964	336.9489927641189	282.4697453349161	21/02/24 15:47:12
19	964	337.2132843458098	282.4665026521286	21/02/24 15:47:12
19	964	337.43104722259034	282.4638308457556	21/02/24 15:47:12
19	964	337.593841035621	282.46183347341383	21/02/24 15:47:12
19	964	337.74552213035963	282.4599724467706	21/02/24 15:47:13
19	964	337.99759787233506	282.45687964425144	21/02/24 15:47:13
19	964	338.1825719567892	282.4546101346592	21/02/24 15:47:13
19	964	338.3487495500084	282.4525712455741	21/02/24 15:47:13
19	964	338.54108319980105	282.45021143898606	21/02/24 15:47:13
19	964	338.7440720256835	282.44772090043944	21/02/24 15:47:13
19	964	339.01008427266544	282.4444571062276	21/02/24 15:47:13
19	964	339.27616032817144	282.4411925291275	21/02/24 15:47:13
19	964	339.56545154216724	282.43764311739744	21/02/24 15:47:13
19	964	339.7952079148246	282.43482415876787	21/02/24 15:47:14
19	964	340.0069953065432	282.4322256676417	21/02/24 15:47:14
19	964	340.20832676712985	282.4297554638704	21/02/24 15:47:14
19	964	340.48468227935615	282.42636476463963	21/02/24 15:47:14
19	964	340.63661521957295	282.4245006480191	21/02/24 15:47:14
19	964	340.8197685190527	282.4222534782534	21/02/24 15:47:14
19	964	341.0762378550532	282.41910676924346	21/02/24 15:47:14
19	964	341.3611511205826	282.4156110720436	21/02/24 15:47:14
19	964	341.59394413748817	282.4127548557989	21/02/24 15:47:14
19	964	341.74593812375576	282.4108899901837	21/02/24 15:47:14
19	964	342.0422436503295	282.40725451748074	21/02/24 15:47:15
19	964	342.20537210623837	282.40525303929235	21/02/24 15:47:15
19	964	342.4143159112186	282.4026894370935	21/02/24 15:47:15
19	964	342.65439651292536	282.39974380700653	21/02/24 15:47:15
19	964	342.9461139956541	282.396164626565	21/02/24 15:47:15
19	964	343.1938548565219	282.393125010168	21/02/24 15:47:15
19	964	343.3503228505793	282.39120525143835	21/02/24 15:47:15
19	964	343.56155804167554	282.38861353544837	21/02/24 15:47:15
19	964	343.7616842130577	282.38615811977786	21/02/24 15:47:15
19	964	343.9751397661	282.38353916141637	21/02/24 15:47:15
19	964	344.19588196504895	282.3808308007322	21/02/24 15:47:16
19	964	344.4882719224714	282.3772433694712	21/02/24 15:47:16
19	964	344.78264307228466	282.37363163029084	21/02/24 15:47:16
19	964	344.9717251481188	282.37131171836324	21/02/24 15:47:16
19	964	345.22990227378506	282.36814405590434	21/02/24 15:47:16
19	964	345.4533819081942	282.36540210869885	21/02/24 15:47:16
19	964	345.70919953564504	282.3622633957214	21/02/24 15:47:16
19	964	345.9761055577865	282.35898863547993	21/02/24 15:47:16
19	964	346.2389257251691	282.35576400597216	21/02/24 15:47:16
19	964	346.4811304788169	282.35279231394674	21/02/24 15:47:16
19	964	346.73747145403865	282.34964717983854	21/02/24 15:47:17
19	964	347.01506473252	282.34624129403505	21/02/24 15:47:17
19	964	347.20018675208104	282.343969969377	21/02/24 15:47:17
19	964	347.39303433510963	282.34160385716825	21/02/24 15:47:17
19	964	347.6757545198377	282.33813506761834	21/02/24 15:47:17
19	964	347.8700859570733	282.3357507495006	21/02/24 15:47:17
19	964	348.0914374863848	282.3330349127362	21/02/24 15:47:17
19	964	348.36316071341383	282.329701048579	21/02/24 15:47:17
19	964	348.54419275975977	282.3274799051853	21/02/24 15:47:17
19	964	348.7872249134402	282.3244980615091	21/02/24 15:47:18
19	964	349.03078643359976	282.3215097228565	21/02/24 15:47:18
19	964	349.26766526522994	282.31860337636925	21/02/24 15:47:18
19	964	349.53431607811206	282.3153317473765	21/02/24 15:47:18
19	964	349.6885659617492	282.31343920339367	21/02/24 15:47:18
19	964	349.98503169460815	282.30980176506563	21/02/24 15:47:18
19	964	350.27627139356656	282.3062284467147	21/02/24 15:47:18
19	964	350.437770246276	282.30424696267903	21/02/24 15:47:18
19	964	350.68671471124236	282.30119257885633	21/02/24 15:47:18
19	964	350.8605694805206	282.29905949590204	21/02/24 15:47:18
19	964	351.01977311153024	282.2971061727176	21/02/24 15:47:19
19	964	351.192268978165	282.29498976259936	21/02/24 15:47:19
19	964	351.4600608163829	282.2917041339809	21/02/24 15:47:19
19	964	351.62316260531253	282.28970298297867	21/02/24 15:47:19
19	964	351.8180379645071	282.28731199129845	21/02/24 15:47:19
19	964	352.0842777529816	282.2840454053031	21/02/24 15:47:19
19	964	352.375422619979	282.2804732504776	21/02/24 15:47:19
19	964	352.66783553800104	282.2768855375053	21/02/24 15:47:19
19	964	352.8370189263217	282.2748097693036	21/02/24 15:47:19
19	964	353.07683126419147	282.27186743063635	21/02/24 15:47:19
19	964	353.35500183020457	282.26845446189697	21/02/24 15:47:20
19	964	353.6173405242126	282.26523573974885	21/02/24 15:47:20
19	964	353.84898984372137	282.26239355591423	21/02/24 15:47:20
19	964	354.1214008722405	282.25905125288796	21/02/24 15:47:20
19	964	354.2791889368573	282.25711529776623	21/02/24 15:47:20
19	964	354.49243289742924	282.2544989355043	21/02/24 15:47:20
19	964	354.6822238680752	282.2521703259065	21/02/24 15:47:20
19	964	354.96427107356004	282.2487097933665	21/02/24 15:47:20
19	964	355.1554676540116	282.2463639378667	21/02/24 15:47:20
19	964	355.37544226667046	282.2436649949583	21/02/24 15:47:20
19	964	355.5655359033046	282.2413326718492	21/02/24 15:47:21
19	964	355.7707656070244	282.23881463921464	21/02/24 15:47:21
19	964	355.9644327453379	282.236438471605	21/02/24 15:47:21
19	964	356.1353794261985	282.23434106897093	21/02/24 15:47:21
19	964	356.3350057428902	282.2318917861866	21/02/24 15:47:21
19	959	356.60230722258103	282.2456585827868	21/02/24 15:47:21
19	959	356.85678084339025	282.286595909057	21/02/24 15:47:21
19	959	357.0382793841462	282.31579368978123	21/02/24 15:47:21
19	959	357.27320962930366	282.35358706131484	21/02/24 15:47:21
19	959	357.4350808612505	282.3796273849244	21/02/24 15:47:22
19	959	357.6898290747942	282.4206088850949	21/02/24 15:47:22
19	959	357.93009758867555	282.4592610271674	21/02/24 15:47:22
19	959	358.1503500024075	282.4946931670256	21/02/24 15:47:22
19	959	358.3920136609537	282.53356974686955	21/02/24 15:47:22
19	959	358.6703967772354	282.5783534082294	21/02/24 15:47:22
19	959	358.9024939097795	282.6156910152125	21/02/24 15:47:22
19	959	359.14884609967265	282.65532184194797	21/02/24 15:47:22
19	959	359.30502417540345	282.68044630405177	21/02/24 15:47:22
19	959	359.4591143497044	282.7052348841817	21/02/24 15:47:22
19	959	359.640393618888	282.73439739055465	21/02/24 15:47:23
19	959	359.80125088624794	282.7602745970639	21/02/24 15:47:23
19	959	359.96649591367986	282.7868576652067	21/02/24 15:47:23
19	959	360.19701464812954	282.82394135432764	21/02/24 15:47:23
19	959	360.37615048806305	282.8527590459325	21/02/24 15:47:23
19	959	360.6169754131424	282.89150069821306	21/02/24 15:47:23
19	959	360.8239524446765	282.9247972192568	21/02/24 15:47:23
19	959	361.07869436718744	282.9657777073851	21/02/24 15:47:23
19	959	361.3085091942046	283.0027481584889	21/02/24 15:47:23
19	959	361.57511607877984	283.04563737028633	21/02/24 15:47:23
19	959	361.76537963705624	283.07624518471414	21/02/24 15:47:24
19	990	361.9105298362138	283.1758473731017	21/02/24 15:47:24
19	990	361.9960307002476	283.4265988441772	21/02/24 15:47:24
19	990	362.08634865428513	283.69147756903413	21/02/24 15:47:24
19	990	362.1689812491391	283.9338171635233	21/02/24 15:47:24
19	990	362.2219484409665	284.08915595944717	21/02/24 15:47:24
19	990	362.29378747661633	284.2998408931424	21/02/24 15:47:24
19	990	362.34845813679567	284.460175512208	21/02/24 15:47:24
19	990	362.4146828174835	284.6543950243924	21/02/24 15:47:24
19	990	362.49224503731347	284.881864546976	21/02/24 15:47:25
19	990	362.5753392874454	285.1255580545675	21/02/24 15:47:25
19	959	362.62442044238503	285.2695001298001	21/02/24 15:47:25
19	959	362.6297752373526	285.0119559644977	21/02/24 15:47:25
19	959	362.6252890754741	285.1777188584048	21/02/24 15:47:25
19	959	362.5956067964752	285.26518874119193	21/02/24 15:47:25
19	959	362.4707209328126	285.19072922547423	21/02/24 15:47:25
19	959	362.4858743628848	285.2348508286991	21/02/24 15:47:25
19	959	362.36549670063545	285.448345167579	21/02/24 15:47:25
19	959	362.57426414156475	285.5649118443669	21/02/24 15:47:25
19	959	362.50927513361614	285.80331241708507	21/02/24 15:47:26
19	959	362.63564013055026	285.64181922413263	21/02/24 15:47:26
19	959	362.5874152466354	285.5946091263383	21/02/24 15:47:26
19	959	362.33442634338735	285.5755822573092	21/02/24 15:47:26
19	959	362.0899099563582	285.57156264995365	21/02/24 15:47:26
19	959	362.13951812386205	285.5699815706928	21/02/24 15:47:26
19	959	362.09480779170156	285.57419771513713	21/02/24 15:47:26
19	959	362.08852714283074	285.5896785308594	21/02/24 15:47:26
19	959	362.0349222101761	285.57636242092553	21/02/24 15:47:26
19	959	361.82222832899157	285.5580920847212	21/02/24 15:47:26
19	959	361.93018568957496	285.53237620000124	21/02/24 15:47:27
19	959	361.9254250545451	285.4094342163248	21/02/24 15:47:27
19	959	361.7107733435761	285.51340065510436	21/02/24 15:47:27
19	959	361.73051754558395	285.53957096527097	21/02/24 15:47:27
19	959	361.6488206113977	285.5316069332738	21/02/24 15:47:27
19	959	361.8284345061615	285.7163004847427	21/02/24 15:47:27
19	959	361.7780958097955	285.9035066726989	21/02/24 15:47:27
19	959	361.714460208735	286.0665698466398	21/02/24 15:47:27
19	959	361.68551639746306	285.96499255838063	21/02/24 15:47:27
19	959	361.6739498987572	285.96241047088546	21/02/24 15:47:27
19	959	361.6744710542118	286.0443672097113	21/02/24 15:47:28
19	959	361.89350485795256	286.1154880894873	21/02/24 15:47:28
19	959	361.8418691167312	286.0984401775089	21/02/24 15:47:28
19	959	362.06367152117735	286.05625451063	21/02/24 15:47:28
19	959	362.0449793190799	286.01903689870574	21/02/24 15:47:28
19	959	362.03073654086086	285.99500271296506	21/02/24 15:47:28
19	959	362.01225440976543	286.0049727502969	21/02/24 15:47:28
19	959	361.7379856096533	286.0279782334033	21/02/24 15:47:28
19	959	361.80833946741114	286.1199465028613	21/02/24 15:47:28
19	959	361.8611278157223	286.04277678090654	21/02/24 15:47:29
19	959	361.8918728099587	286.09156321081883	21/02/24 15:47:29
19	959	361.87445254794596	286.1682291164021	21/02/24 15:47:29
19	959	361.83288965332656	286.2255549649096	21/02/24 15:47:29
19	959	361.8117472172896	285.9560131874191	21/02/24 15:47:29
19	959	361.8189210319531	286.0220547123426	21/02/24 15:47:29
19	959	361.8109683041116	285.9933069941692	21/02/24 15:47:29
19	959	362.07501701241296	286.01696658414653	21/02/24 15:47:29
19	959	362.07220330995113	286.0149717748112	21/02/24 15:47:29
19	959	362.0731227119125	285.97066410789745	21/02/24 15:47:29
19	959	361.89412583856216	286.1132324356573	21/02/24 15:47:30
19	959	361.8955810742215	285.94024153167993	21/02/24 15:47:30
19	959	361.9329202589179	285.8889543685656	21/02/24 15:47:30
19	959	362.0408252378074	286.0951000066995	21/02/24 15:47:30
19	959	362.0904195301264	286.1503286146792	21/02/24 15:47:30
19	959	362.1319459127487	285.87405351534323	21/02/24 15:47:30
19	959	362.3867252368027	285.80050229298274	21/02/24 15:47:30
19	959	362.435352180936	285.7249426910754	21/02/24 15:47:30
19	959	362.63436825031283	285.57863133370483	21/02/24 15:47:30
19	959	362.37438285115815	285.6111563117839	21/02/24 15:47:30
19	959	362.40260788102375	285.54549439644137	21/02/24 15:47:31
19	959	362.37756115861714	285.43739617286786	21/02/24 15:47:31
19	959	362.4953097895095	285.51077805913667	21/02/24 15:47:31
19	959	362.4940455265756	285.51023010825236	21/02/24 15:47:31
19	959	362.38980445162167	285.54583525569376	21/02/24 15:47:31
19	959	362.40626096127676	285.579659335477	21/02/24 15:47:31
19	959	362.427750397672	285.4132573733347	21/02/24 15:47:31
19	959	362.5444113855456	285.4889180122437	21/02/24 15:47:31
19	959	362.5388239425195	285.4956261470934	21/02/24 15:47:31
19	959	362.64201930363555	285.5178895964048	21/02/24 15:47:31
19	959	362.64201930363555	285.5178895964048	21/02/24 15:47:32
19	959	362.5536361077363	285.3971166433851	21/02/24 15:47:32
19	959	362.39281694364803	285.2663612241555	21/02/24 15:47:32
19	959	362.39281694364803	285.2663612241555	21/02/24 15:47:32
19	959	362.44588301784387	285.28450218784917	21/02/24 15:47:32
19	959	362.3948917279709	285.01832756989194	21/02/24 15:47:32
19	959	362.6212728996871	285.04476471212615	21/02/24 15:47:32
19	959	362.6212728996871	285.04476471212615	21/02/24 15:47:32
19	959	362.51473692154605	285.0999324920907	21/02/24 15:47:32
19	959	362.7726659324807	285.04757355709717	21/02/24 15:47:33
19	959	362.7661586637356	285.246167257648	21/02/24 15:47:33
19	959	362.7935123867402	285.25388017448694	21/02/24 15:47:33
19	959	362.7935123867402	285.25388017448694	21/02/24 15:47:33
19	959	362.7018578431759	285.24406462004686	21/02/24 15:47:33
19	959	362.84285469280206	285.49684368422515	21/02/24 15:47:33
19	959	362.65030158834855	285.666644575875	21/02/24 15:47:33
19	959	362.65030158834855	285.666644575875	21/02/24 15:47:33
19	959	362.73418151602027	285.6123360199808	21/02/24 15:47:33
19	959	362.76369421337336	285.6311493017097	21/02/24 15:47:33
19	959	362.86922033351686	285.76714548250266	21/02/24 15:47:34
19	959	362.9827333133568	285.67819219025523	21/02/24 15:47:34
19	959	363.0844884388579	285.62013848303945	21/02/24 15:47:34
19	959	363.1889537920081	285.72704425082566	21/02/24 15:47:34
19	959	363.21456992123166	285.8765059956688	21/02/24 15:47:34
19	959	363.1441450035997	285.82008811271044	21/02/24 15:47:34
19	959	363.3994034152416	285.70494536705996	21/02/24 15:47:34
19	959	363.4443890376828	285.8057564249767	21/02/24 15:47:34
19	959	363.4518627517002	285.64441452284956	21/02/24 15:47:34
19	959	363.55729515756417	285.47916968904303	21/02/24 15:47:34
19	959	363.49472284936536	285.32292256798075	21/02/24 15:47:35
19	959	363.43789319107657	285.0931610708251	21/02/24 15:47:35
19	959	363.52770040078815	285.2438565237734	21/02/24 15:47:35
19	959	363.44911319999534	285.1833848746407	21/02/24 15:47:35
19	959	363.30987717463483	285.15764721367566	21/02/24 15:47:35
19	959	363.2659804788017	285.08702647454004	21/02/24 15:47:35
19	959	363.30643858310157	285.04299230253787	21/02/24 15:47:35
19	959	363.2307557652882	285.2302092197686	21/02/24 15:47:35
19	959	363.1321189681749	285.4474557766171	21/02/24 15:47:35
19	959	363.31568413894786	285.5505987559275	21/02/24 15:47:35
19	959	363.3128755634369	285.6015373733694	21/02/24 15:47:36
19	959	363.1406482222379	285.8482540090379	21/02/24 15:47:36
19	959	363.0638067049387	285.6840839851112	21/02/24 15:47:36
19	959	363.2298346597042	285.8812709562341	21/02/24 15:47:36
19	959	363.2215038620795	286.01219749555264	21/02/24 15:47:36
19	959	363.3524159430927	285.8491615653086	21/02/24 15:47:36
19	959	363.20444389941343	286.0553538002435	21/02/24 15:47:36
19	959	363.1700069290141	285.91620743405184	21/02/24 15:47:36
19	959	363.1700069290141	285.91620743405184	21/02/24 15:47:36
19	959	363.1455974173089	286.15009463392767	21/02/24 15:47:37
19	959	362.8068393205837	286.4150731931023	21/02/24 15:47:37
19	959	362.8286709135589	286.4424562138117	21/02/24 15:47:37
19	959	362.8222699091402	286.43832661785507	21/02/24 15:47:37
19	959	363.0089497182652	286.39999349006644	21/02/24 15:47:37
19	959	363.20838079220755	286.3296689087258	21/02/24 15:47:37
19	959	363.47373819550097	286.2796070555072	21/02/24 15:47:37
19	959	363.5085463974416	286.38019798449506	21/02/24 15:47:37
19	959	363.4935172937967	286.36798455116786	21/02/24 15:47:37
19	959	363.4675682247068	286.4838524558116	21/02/24 15:47:37
19	959	363.40313260104614	286.6106678883033	21/02/24 15:47:38
19	959	363.6001947951848	286.4951915951996	21/02/24 15:47:38
19	959	363.4728910019003	286.26641145332894	21/02/24 15:47:38
19	959	363.5231571811373	286.1817787542612	21/02/24 15:47:38
19	959	363.5529603544624	286.02549323414394	21/02/24 15:47:38
19	959	363.34079221644913	286.13059774216975	21/02/24 15:47:38
19	959	363.365065805319	286.383559306941	21/02/24 15:47:38
19	959	363.3919052259711	286.46208667674176	21/02/24 15:47:38
19	959	363.5085933066713	286.45907855944836	21/02/24 15:47:38
19	959	363.40293004774054	286.48766202918245	21/02/24 15:47:39
19	959	363.2155510531222	286.6163154281311	21/02/24 15:47:39
19	959	363.36053788848415	286.6499682363401	21/02/24 15:47:39
19	959	363.44962603317157	286.8393832395162	21/02/24 15:47:39
19	959	363.68127165645814	286.9704526573521	21/02/24 15:47:39
19	959	363.8301152993084	286.89802142958445	21/02/24 15:47:39
19	959	363.8326666415268	286.74728552641324	21/02/24 15:47:39
19	959	363.82578076456986	286.54361472743767	21/02/24 15:47:39
19	959	363.7068408340334	286.62056593221297	21/02/24 15:47:39
19	959	363.7388013906412	286.65343245751234	21/02/24 15:47:39
19	959	363.7161460043409	286.43727556027204	21/02/24 15:47:40
19	959	363.8776318593447	286.4022307025365	21/02/24 15:47:40
19	959	363.86223667703587	286.4627205205326	21/02/24 15:47:40
19	959	363.8756882639738	286.47189063892716	21/02/24 15:47:40
19	959	363.8756882639738	286.47189063892716	21/02/24 15:47:40
19	959	363.8353282881985	286.4012997673652	21/02/24 15:47:40
19	959	363.8843439435195	286.17393077422685	21/02/24 15:47:40
19	959	364.0388311390398	286.20776244455357	21/02/24 15:47:40
19	959	364.0254998197437	286.4107124026208	21/02/24 15:47:40
19	959	364.02044016544374	286.4088348701647	21/02/24 15:47:40
19	959	363.87960127903574	286.24116844588406	21/02/24 15:47:41
19	959	363.91931701445236	286.221358384301	21/02/24 15:47:41
19	959	363.7232299732993	286.2411143875963	21/02/24 15:47:41
19	959	363.7423414473202	286.24417901513993	21/02/24 15:47:41
19	959	363.9301464436043	286.14352754944053	21/02/24 15:47:41
19	959	363.9301464436043	286.14352754944053	21/02/24 15:47:41
19	959	363.9301464436043	286.14352754944053	21/02/24 15:47:41
19	959	363.82276930313174	285.96632530784956	21/02/24 15:47:41
19	959	363.7150520185465	285.78856173356746	21/02/24 15:47:41
19	959	363.632332310804	285.65205113576974	21/02/24 15:47:41
19	959	363.632332310804	285.65205113576974	21/02/24 15:47:42
19	959	363.4832512143373	285.4060257307677	21/02/24 15:47:42
19	959	363.3580754150206	285.1994507359947	21/02/24 15:47:42
19	959	363.2754396210992	285.06307861941497	21/02/24 15:47:42
19	959	363.19418733779105	284.9289896813671	21/02/24 15:47:42
19	959	363.0814915859545	284.7430102470543	21/02/24 15:47:42
19	959	362.93926959238235	284.5083042756194	21/02/24 15:47:42
19	959	362.8471146848747	284.35622296564895	21/02/24 15:47:42
19	959	362.7151743765478	284.138484643611	21/02/24 15:47:42
19	959	362.59858835278743	283.9460851751805	21/02/24 15:47:42
19	959	362.46093623336066	283.7189207711479	21/02/24 15:47:43
19	959	362.3122602409237	283.47356390082484	21/02/24 15:47:43
19	959	362.3122602409237	283.47356390082484	21/02/24 15:47:43
19	959	362.21268436600286	283.30923592406276	21/02/24 15:47:43
19	964	362.07606935767603	283.09330682247634	21/02/24 15:47:43
19	964	361.80207740672205	283.0193166845305	21/02/24 15:47:43
19	964	361.6476804650381	282.97762257280993	21/02/24 15:47:43
19	964	361.38471785640814	282.9066108528693	21/02/24 15:47:43
19	964	361.21410262641336	282.86053707457387	21/02/24 15:47:43
19	964	361.0458270590276	282.8150951103102	21/02/24 15:47:44
19	964	360.83331527411593	282.75770737966343	21/02/24 15:47:44
19	964	360.60305276669095	282.6955261563508	21/02/24 15:47:44
19	964	360.41171832642107	282.64385726031185	21/02/24 15:47:44
19	964	360.19911857462273	282.5864457746531	21/02/24 15:47:44
19	964	360.0191654213459	282.5378503374938	21/02/24 15:47:44
19	964	359.866241006209	282.4965538741055	21/02/24 15:47:44
19	964	359.6757496032258	282.4451126360138	21/02/24 15:47:44
19	964	359.3869099989697	282.3671129645317	21/02/24 15:47:44
19	964	359.1603456162256	282.3059304010495	21/02/24 15:47:44
19	964	358.89862907189115	282.2352551744577	21/02/24 15:47:45
19	964	358.67249707524644	282.17418937465055	21/02/24 15:47:45
19	964	358.46905180914	282.11925001146403	21/02/24 15:47:45
19	964	358.31827560369936	282.07853366121844	21/02/24 15:47:45
19	964	358.1287954613799	282.0273655089446	21/02/24 15:47:45
19	964	357.9120520829518	281.96883505791163	21/02/24 15:47:45
19	964	357.7065098573483	281.9133294214389	21/02/24 15:47:45
19	964	357.5079532826929	281.8597102246061	21/02/24 15:47:45
19	964	357.3228502765727	281.8097240957824	21/02/24 15:47:45
19	964	357.3228502765727	281.8097240957824	21/02/24 15:47:45
19	964	357.1587888748314	281.7654201455964	21/02/24 15:47:46
19	964	356.9107227509053	281.69843114586456	21/02/24 15:47:46
19	964	356.76300998880436	281.65854206296945	21/02/24 15:47:46
19	909	356.476954592989	281.5730718473644	21/02/24 15:47:46
19	909	356.2979275635492	281.47000026701227	21/02/24 15:47:46
19	909	356.0693078600837	281.3383765998512	21/02/24 15:47:46
19	909	355.9390913192938	281.26340677719816	21/02/24 15:47:46
19	909	355.7630406985604	281.16204881042773	21/02/24 15:47:46
19	909	355.53630414108136	281.0315093305732	21/02/24 15:47:46
19	909	355.3873005204918	280.9457231858753	21/02/24 15:47:47
19	909	355.12901950617754	280.79702255444755	21/02/24 15:47:47
19	909	354.9331939230905	280.6842795100854	21/02/24 15:47:47
19	909	354.74578131723314	280.5763800854897	21/02/24 15:47:47
19	909	354.54560414866194	280.4611316943411	21/02/24 15:47:47
19	909	354.299157147392	280.31924428229263	21/02/24 15:47:47
19	909	354.0749738860247	280.1901748165816	21/02/24 15:47:47
19	909	353.9136486089385	280.0972947005899	21/02/24 15:47:47
19	909	353.68426291594625	279.9652300287866	21/02/24 15:47:47
19	909	353.53875812919745	279.8814582745106	21/02/24 15:47:47
19	909	353.32496497071753	279.7583707229718	21/02/24 15:47:48
19	909	353.0700748987421	279.6116223653814	21/02/24 15:47:48
19	909	352.92312985457613	279.5270214088973	21/02/24 15:47:48
19	909	352.71161941485013	279.4052480914728	21/02/24 15:47:48
19	909	352.53871663844023	279.3057024392458	21/02/24 15:47:48
19	909	352.35528631162236	279.2000957399178	21/02/24 15:47:48
19	909	352.2046581839149	279.1133743145728	21/02/24 15:47:48
19	909	351.9572784298098	278.97094988691777	21/02/24 15:47:48
19	909	351.7583534292928	278.85642240892184	21/02/24 15:47:48
19	909	351.6000319091721	278.7652716517783	21/02/24 15:47:48
19	909	351.45945864969633	278.6843391353043	21/02/24 15:47:49
19	909	351.29852026859567	278.5916817676919	21/02/24 15:47:49
19	909	351.07149617962756	278.46097674677316	21/02/24 15:47:49
19	909	350.9145825187922	278.3706365391981	21/02/24 15:47:49
19	909	350.71706444123845	278.2569190717001	21/02/24 15:47:49
19	909	350.51056809601937	278.13803252867206	21/02/24 15:47:49
19	909	350.3424156043045	278.04122176710473	21/02/24 15:47:49
19	909	350.13306589863697	277.92069245330816	21/02/24 15:47:49
19	909	349.93906779945866	277.8090015498162	21/02/24 15:47:49
19	909	349.78848467597754	277.7223060348421	21/02/24 15:47:49
19	909	349.6098460148484	277.6194580505339	21/02/24 15:47:50
19	909	349.4622826128679	277.5345010857009	21/02/24 15:47:50
19	909	349.2245719729336	277.3976434759801	21/02/24 15:47:50
19	909	349.0077893204996	277.2728347772645	21/02/24 15:47:50
19	909	348.84014281616356	277.1763153287963	21/02/24 15:47:50
19	909	348.66106464861844	277.0732143066032	21/02/24 15:47:50
19	909	348.4762544241865	276.9668131561342	21/02/24 15:47:50
19	909	348.23172495826697	276.82602973044783	21/02/24 15:47:50
19	909	348.05327591473224	276.72329091504656	21/02/24 15:47:50
19	909	347.9183562232218	276.6456133382688	21/02/24 15:47:51
19	909	347.6592887719038	276.49645992993317	21/02/24 15:47:51
19	909	347.43424852772915	276.3668970718413	21/02/24 15:47:51
19	909	347.2290692483171	276.24876880567564	21/02/24 15:47:51
19	909	347.04550294668263	276.1430838213017	21/02/24 15:47:51
19	909	346.81679085149597	276.011406961275	21/02/24 15:47:51
19	909	346.6263565665328	275.90176785948233	21/02/24 15:47:51
19	909	346.44695355085696	275.7984798118422	21/02/24 15:47:51
19	909	346.24722235029884	275.68348817872635	21/02/24 15:47:51
19	909	346.02567575087005	275.55593672352865	21/02/24 15:47:51
19	909	345.8060250449815	275.4294767948115	21/02/24 15:47:52
19	909	345.57085382689945	275.2940812113797	21/02/24 15:47:52
19	909	345.35916239782784	275.17220369260673	21/02/24 15:47:52
19	909	345.1807329468777	275.06947615728234	21/02/24 15:47:52
19	909	344.9262255974756	274.9229481453045	21/02/24 15:47:52
19	909	344.75053285501036	274.8217962204864	21/02/24 15:47:52
19	909	344.4928444454878	274.6734367705696	21/02/24 15:47:52
19	909	344.32384552103395	274.57613869063283	21/02/24 15:47:52
19	909	344.07456023123046	274.43261718519875	21/02/24 15:47:52
19	909	343.82274132768686	274.28763699739136	21/02/24 15:47:52
19	909	343.65449463834005	274.1907720032379	21/02/24 15:47:53
19	909	343.46534149274964	274.0818704943116	21/02/24 15:47:53
19	909	343.32384005884785	274.0004035981675	21/02/24 15:47:53
19	909	342.8805396696094	273.7451814016506	21/02/24 15:47:53
19	909	342.7061420858876	273.5896045209369	21/02/24 15:47:53
19	909	342.54304508391795	273.3969556568925	21/02/24 15:47:53
19	909	342.39339005789725	273.2201843464867	21/02/24 15:47:53
19	909	342.39339005789725	273.2201843464867	21/02/24 15:47:53
19	909	342.2703036206548	273.07479563898335	21/02/24 15:47:53
19	909	342.1388003122798	272.9194649911445	21/02/24 15:47:53
19	909	341.83981430942595	272.56630513462125	21/02/24 15:47:54
19	909	341.83981430942595	272.56630513462125	21/02/24 15:47:54
19	909	341.70006637251197	272.40123599800984	21/02/24 15:47:54
19	909	341.40546740880643	272.05325807676576	21/02/24 15:47:54
19	909	341.29205030274545	271.91929070531205	21/02/24 15:47:54
19	909	341.29205030274545	271.91929070531205	21/02/24 15:47:54
19	909	341.1089499068939	271.70301399365644	21/02/24 15:47:54
19	909	341.008764586318	271.5846759005598	21/02/24 15:47:54
19	909	340.8567149271492	271.40507606878197	21/02/24 15:47:54
19	909	340.69154391920256	271.2099774055955	21/02/24 15:47:55
19	909	340.53180290133	271.0212926029149	21/02/24 15:47:55
19	909	340.3867350161458	270.8499395862894	21/02/24 15:47:55
19	909	340.2283547325464	270.6628620719637	21/02/24 15:47:55
19	909	340.0812709978349	270.4891279501258	21/02/24 15:47:55
19	919	339.9595577580631	270.28896556173834	21/02/24 15:47:55
19	919	340.0275311364816	270.1417153833651	21/02/24 15:47:55
19	919	340.11291898656447	269.95674037626475	21/02/24 15:47:55
19	919	340.18947854611747	269.7908900233377	21/02/24 15:47:55
19	919	340.25642125626536	269.6458725732799	21/02/24 15:47:55
19	919	340.3193187351737	269.5096182748478	21/02/24 15:47:56
19	919	340.43044542026746	269.2688854382169	21/02/24 15:47:56
19	919	340.51563183963566	269.08434678884004	21/02/24 15:47:56
19	919	340.6380022569457	268.81925674630077	21/02/24 15:47:56
19	919	340.73550563489925	268.6080359694365	21/02/24 15:47:56
19	919	340.85573249048906	268.3475895072665	21/02/24 15:47:56
19	919	340.9321300249582	268.1820901479645	21/02/24 15:47:56
19	919	341.0455849980299	267.9363135599706	21/02/24 15:47:56
19	919	341.11067865534073	267.795301698077	21/02/24 15:47:56
19	919	341.2335103231966	267.5292124522213	21/02/24 15:47:56
19	919	341.3479363664658	267.2813322427344	21/02/24 15:47:57
19	919	341.36927432741675	267.23510799098676	21/02/24 15:47:57
19	919	341.2899404566568	267.2398656697917	21/02/24 15:47:57
19	919	341.2251639798535	266.98703327833164	21/02/24 15:47:57
19	919	341.16369326242256	266.8349477505435	21/02/24 15:47:57
19	919	341.06467407505465	266.66698668446884	21/02/24 15:47:57
19	919	340.91542716046223	266.9063597914702	21/02/24 15:47:57
19	919	340.80258816772977	266.694296778282	21/02/24 15:47:57
19	919	340.8779458266338	266.5710631919979	21/02/24 15:47:57
19	919	340.84528628769004	266.7455161881828	21/02/24 15:47:57
19	919	340.8692292696812	266.65522695510333	21/02/24 15:47:58
19	919	340.6075295873184	266.7468931160046	21/02/24 15:47:58
19	919	340.63052102483107	266.7586369328279	21/02/24 15:47:58
19	919	340.6311879275199	266.90438688217563	21/02/24 15:47:58
19	919	340.7399445055746	267.1116148406605	21/02/24 15:47:58
19	919	340.5006359298511	267.08214632145655	21/02/24 15:47:58
19	919	340.47453783513686	266.9198331173628	21/02/24 15:47:58
19	919	340.2209547573859	267.0726972074402	21/02/24 15:47:58
19	919	340.0890246138194	267.084490714654	21/02/24 15:47:58
19	919	340.0403581554308	267.2123865759551	21/02/24 15:47:59
19	919	340.19275782388274	267.2828782297628	21/02/24 15:47:59
19	919	340.40194088646047	267.2439442808755	21/02/24 15:47:59
19	919	340.22240520776495	267.1344263094405	21/02/24 15:47:59
19	919	340.3571936924865	266.8856611428481	21/02/24 15:47:59
19	919	340.4079500918154	266.796422204471	21/02/24 15:47:59
19	919	340.54937243854977	266.65234948217324	21/02/24 15:47:59
19	919	340.52981535889614	266.5519396906737	21/02/24 15:47:59
19	919	340.5482018657385	266.64336370151784	21/02/24 15:47:59
19	919	340.5436146827302	266.63349091433685	21/02/24 15:47:59
19	919	340.40056577097727	266.8888906619967	21/02/24 15:48:00
