stationId	t_start	t_end	t_max	timeStamp
56	20/04/28 05:14:25	20/04/28 05:14:59	20/04/28 05:14:56
56	20/04/28 05:15:01	20/04/28 05:15:01	20/04/28 05:15:01
56	20/04/28 05:15:03	20/04/28 05:15:12	20/04/28 05:15:11
111	20/04/28 05:15:14	20/04/28 05:15:14	20/04/28 05:15:14
84	20/04/28 05:15:16	20/04/28 05:15:16	20/04/28 05:15:16
9	20/04/28 05:15:18	20/04/28 05:15:18	20/04/28 05:15:18
64	20/04/28 05:15:20	20/04/28 05:15:20	20/04/28 05:15:20
12	20/04/28 05:15:23	20/04/28 05:15:23	20/04/28 05:15:23
2	20/04/28 05:15:25	20/04/28 05:15:25	20/04/28 05:15:25
140	20/04/28 05:15:27	20/04/28 05:15:27	20/04/28 05:15:27
37	20/04/28 05:15:29	20/04/28 05:15:29	20/04/28 05:15:29
56	20/04/28 05:14:44	20/04/28 05:15:32	20/04/28 05:15:32
76	20/04/28 05:15:34	20/04/28 05:15:34	20/04/28 05:15:34
76	20/04/28 05:15:36	20/04/28 05:15:36	20/04/28 05:15:36
76	20/04/28 05:15:38	20/04/28 05:15:38	20/04/28 05:15:38
29	20/04/28 05:15:40	20/04/28 05:15:40	20/04/28 05:15:40
56	20/04/28 05:15:42	20/04/28 05:15:43	20/04/28 05:15:43
37	20/04/28 05:15:45	20/04/28 05:15:46	20/04/28 05:15:46
76	20/04/28 05:15:48	20/04/28 05:15:48	20/04/28 05:15:48
56	20/04/28 05:15:50	20/04/28 05:15:50	20/04/28 05:15:50
56	20/04/28 05:15:52	20/04/28 05:15:53	20/04/28 05:15:53
13	20/04/28 05:15:55	20/04/28 05:15:55	20/04/28 05:15:55
85	20/04/28 05:15:57	20/04/28 05:15:57	20/04/28 05:15:57
40	20/04/28 05:15:59	20/04/28 05:15:59	20/04/28 05:15:59
13	20/04/28 05:16:01	20/04/28 05:16:01	20/04/28 05:16:01
40	20/04/28 05:16:03	20/04/28 05:16:03	20/04/28 05:16:03
13	20/04/28 05:16:05	20/04/28 05:16:05	20/04/28 05:16:05
76	20/04/28 05:16:07	20/04/28 05:16:07	20/04/28 05:16:07
38	20/04/28 05:16:09	20/04/28 05:16:09	20/04/28 05:16:09
63	20/04/28 05:16:11	20/04/28 05:16:11	20/04/28 05:16:11
85	20/04/28 05:16:13	20/04/28 05:16:13	20/04/28 05:16:13
40	20/04/28 05:16:15	20/04/28 05:16:15	20/04/28 05:16:15
85	20/04/28 05:16:17	20/04/28 05:16:17	20/04/28 05:16:17
37	20/04/28 05:16:19	20/04/28 05:16:19	20/04/28 05:16:19
56	20/04/28 05:16:21	20/04/28 05:16:22	20/04/28 05:16:22
70	20/04/28 05:16:24	20/04/28 05:16:24	20/04/28 05:16:24
76	20/04/28 05:16:26	20/04/28 05:16:27	20/04/28 05:16:27
37	20/04/28 05:16:29	20/04/28 05:16:29	20/04/28 05:16:29
38	20/04/28 05:16:31	20/04/28 05:16:31	20/04/28 05:16:31
63	20/04/28 05:16:33	20/04/28 05:16:33	20/04/28 05:16:33
63	20/04/28 05:16:35	20/04/28 05:16:36	20/04/28 05:16:35
63	20/04/28 05:16:38	20/04/28 05:16:38	20/04/28 05:16:38
38	20/04/28 05:16:40	20/04/28 05:16:40	20/04/28 05:16:40
85	20/04/28 05:16:42	20/04/28 05:16:42	20/04/28 05:16:42
63	20/04/28 05:16:44	20/04/28 05:16:45	20/04/28 05:16:45
63	20/04/28 05:16:47	20/04/28 05:16:47	20/04/28 05:16:47
56	20/04/28 05:16:49	20/04/28 05:16:49	20/04/28 05:16:49
47	20/04/28 05:16:51	20/04/28 05:16:52	20/04/28 05:16:51
37	20/04/28 05:16:54	20/04/28 05:16:54	20/04/28 05:16:54
13	20/04/28 05:16:56	20/04/28 05:16:56	20/04/28 05:16:56
40	20/04/28 05:16:58	20/04/28 05:16:58	20/04/28 05:16:58
78	20/04/28 05:17:00	20/04/28 05:17:00	20/04/28 05:17:00
13	20/04/28 05:17:02	20/04/28 05:17:04	20/04/28 05:17:03
13	20/04/28 05:17:06	20/04/28 05:17:06	20/04/28 05:17:06
160	20/04/28 05:17:08	20/04/28 05:17:10	20/04/28 05:17:10
160	20/04/28 05:17:12	20/04/28 05:17:12	20/04/28 05:17:12
77	20/04/28 05:17:14	20/04/28 05:17:14	20/04/28 05:17:14
77	20/04/28 05:17:16	20/04/28 05:17:16	20/04/28 05:17:16
126	20/04/28 05:17:18	20/04/28 05:17:18	20/04/28 05:17:18
44	20/04/28 05:11:24	20/04/28 05:17:21	20/04/28 05:17:21
112	20/04/28 05:17:23	20/04/28 05:17:23	20/04/28 05:17:23
112	20/04/28 05:17:25	20/04/28 05:17:25	20/04/28 05:17:25
112	20/04/28 05:17:27	20/04/28 05:17:28	20/04/28 05:17:28
51	20/04/28 05:17:30	20/04/28 05:17:30	20/04/28 05:17:30
51	20/04/28 05:17:32	20/04/28 05:17:32	20/04/28 05:17:32
63	20/04/28 05:17:34	20/04/28 05:17:34	20/04/28 05:17:34
