stationId	t_start	t_end	t_max	timeStamp
136	20/04/28 05:16:45	20/04/28 05:16:45	20/04/28 05:16:45
92	20/04/28 05:16:47	20/04/28 05:16:47	20/04/28 05:16:47
148	20/04/28 05:16:49	20/04/28 05:16:49	20/04/28 05:16:49
4	20/04/28 05:16:51	20/04/28 05:16:51	20/04/28 05:16:51
49	20/04/28 05:16:53	20/04/28 05:16:53	20/04/28 05:16:53
148	20/04/28 05:16:55	20/04/28 05:16:55	20/04/28 05:16:55
40	20/04/28 05:16:57	20/04/28 05:16:57	20/04/28 05:16:57
2	20/04/28 05:16:59	20/04/28 05:17:00	20/04/28 05:17:00
4	20/04/28 05:17:02	20/04/28 05:17:02	20/04/28 05:17:02
148	20/04/28 05:17:04	20/04/28 05:17:04	20/04/28 05:17:04
148	20/04/28 05:17:06	20/04/28 05:17:07	20/04/28 05:17:07
141	20/04/28 05:17:09	20/04/28 05:17:09	20/04/28 05:17:09
136	20/04/28 05:17:11	20/04/28 05:17:11	20/04/28 05:17:11
49	20/04/28 05:17:13	20/04/28 05:17:14	20/04/28 05:17:14
148	20/04/28 05:17:16	20/04/28 05:17:17	20/04/28 05:17:17
121	20/04/28 05:17:19	20/04/28 05:17:19	20/04/28 05:17:19
148	20/04/28 05:17:21	20/04/28 05:17:21	20/04/28 05:17:21
136	20/04/28 05:17:23	20/04/28 05:17:24	20/04/28 05:17:24
69	20/04/28 05:17:26	20/04/28 05:17:27	20/04/28 05:17:27
132	20/04/28 05:17:29	20/04/28 05:17:29	20/04/28 05:17:29
149	20/04/28 05:17:31	20/04/28 05:17:31	20/04/28 05:17:31
136	20/04/28 05:17:33	20/04/28 05:17:33	20/04/28 05:17:33
149	20/04/28 05:17:35	20/04/28 05:17:35	20/04/28 05:17:35
136	20/04/28 05:17:37	20/04/28 05:17:37	20/04/28 05:17:37
4	20/04/28 05:17:39	20/04/28 05:17:39	20/04/28 05:17:39
136	20/04/28 05:17:41	20/04/28 05:17:41	20/04/28 05:17:41
3	20/04/28 05:17:43	20/04/28 05:17:43	20/04/28 05:17:43
4	20/04/28 05:17:45	20/04/28 05:17:45	20/04/28 05:17:45
136	20/04/28 05:17:47	20/04/28 05:17:47	20/04/28 05:17:47
69	20/04/28 05:17:49	20/04/28 05:17:49	20/04/28 05:17:49
136	20/04/28 05:17:51	20/04/28 05:17:51	20/04/28 05:17:51
15	20/04/28 05:16:19	20/04/28 05:17:53	20/04/28 05:16:19
132	20/04/28 05:17:55	20/04/28 05:17:55	20/04/28 05:17:55
36	20/04/28 05:17:57	20/04/28 05:17:57	20/04/28 05:17:57
132	20/04/28 05:17:59	20/04/28 05:17:59	20/04/28 05:17:59
132	20/04/28 05:18:01	20/04/28 05:18:02	20/04/28 05:18:02
69	20/04/28 05:18:04	20/04/28 05:18:04	20/04/28 05:18:04
69	20/04/28 05:18:06	20/04/28 05:18:06	20/04/28 05:18:06
149	20/04/28 05:18:08	20/04/28 05:18:08	20/04/28 05:18:08
128	20/04/28 05:18:10	20/04/28 05:18:10	20/04/28 05:18:10
3	20/04/28 05:18:12	20/04/28 05:18:12	20/04/28 05:18:12
4	20/04/28 05:18:14	20/04/28 05:18:14	20/04/28 05:18:14
3	20/04/28 05:18:16	20/04/28 05:18:16	20/04/28 05:18:16
92	20/04/28 05:18:18	20/04/28 05:18:19	20/04/28 05:18:19
128	20/04/28 05:18:21	20/04/28 05:18:22	20/04/28 05:18:21
