stationId	t_start	t_end	t_max	timeStamp
49	20/04/28 05:17:35	20/04/28 05:17:35	20/04/28 05:17:35
27	20/04/28 05:17:37	20/04/28 05:17:38	20/04/28 05:17:38
27	20/04/28 05:17:40	20/04/28 05:17:40	20/04/28 05:17:40
106	20/04/28 05:17:42	20/04/28 05:17:42	20/04/28 05:17:42
13	20/04/28 05:17:44	20/04/28 05:17:44	20/04/28 05:17:44
27	20/04/28 05:17:46	20/04/28 05:12:59	20/04/28 05:17:46
112	20/04/28 05:17:48	20/04/28 05:17:48	20/04/28 05:17:48
27	20/04/28 05:17:50	20/04/28 05:17:51	20/04/28 05:17:51
49	20/04/28 05:17:53	20/04/28 05:17:53	20/04/28 05:17:53
18	20/04/28 05:17:55	20/04/28 05:17:55	20/04/28 05:17:55
18	20/04/28 05:17:57	20/04/28 05:17:57	20/04/28 05:17:57
128	20/04/28 05:17:59	20/04/28 05:17:59	20/04/28 05:17:59
4	20/04/28 05:18:01	20/04/28 05:18:01	20/04/28 05:18:01
128	20/04/28 05:18:03	20/04/28 05:18:03	20/04/28 05:18:03
35	20/04/28 05:18:05	20/04/28 05:18:05	20/04/28 05:18:05
3	20/04/28 05:18:07	20/04/28 05:18:07	20/04/28 05:18:07
27	20/04/28 05:18:09	20/04/28 05:18:09	20/04/28 05:18:09
27	20/04/28 05:18:11	20/04/28 05:18:11	20/04/28 05:18:11
49	20/04/28 05:18:13	20/04/28 05:18:13	20/04/28 05:18:13
49	20/04/28 05:18:15	20/04/28 05:18:15	20/04/28 05:18:15
35	20/04/28 05:18:17	20/04/28 05:18:17	20/04/28 05:18:17
48	20/04/28 05:18:19	20/04/28 05:18:19	20/04/28 05:18:19
54	20/04/28 05:18:21	20/04/28 05:18:23	20/04/28 05:18:23
55	20/04/28 05:18:25	20/04/28 05:18:25	20/04/28 05:18:25
13	20/04/28 05:18:27	20/04/28 05:18:27	20/04/28 05:18:27
106	20/04/28 05:18:29	20/04/28 05:18:29	20/04/28 05:18:29
3	20/04/28 05:18:31	20/04/28 05:18:31	20/04/28 05:18:31
156	20/04/28 05:18:33	20/04/28 05:18:33	20/04/28 05:18:33
130	20/04/28 05:18:35	20/04/28 05:18:35	20/04/28 05:18:35
31	20/04/28 05:18:37	20/04/28 05:18:37	20/04/28 05:18:37
54	20/04/28 05:18:39	20/04/28 05:18:39	20/04/28 05:18:39
106	20/04/28 05:18:41	20/04/28 05:18:41	20/04/28 05:18:41
12	20/04/28 05:18:43	20/04/28 05:18:43	20/04/28 05:18:43
3	20/04/28 05:18:45	20/04/28 05:18:45	20/04/28 05:18:45
156	20/04/28 05:18:47	20/04/28 05:18:47	20/04/28 05:18:47
