floorId	partitionId	location_x	location_y	timeStamp
19	955	331.14052623366666	274.53372397223194	21/02/24 15:45:08
19	955	331.14052623366666	274.53372397223194	21/02/24 15:45:09
19	955	331.14052623366666	274.53372397223194	21/02/24 15:45:10
19	909	333.4071053969908	273.0002052198683	21/02/24 15:45:11
19	909	333.79691834538926	273.32229963118385	21/02/24 15:45:12
19	909	333.79691834538926	273.32229963118385	21/02/24 15:45:13
19	NULL	337.73701806888556	270.34580290420837	21/02/24 15:45:14
19	919	341.8507959684553	269.41861351939014	21/02/24 15:45:15
19	919	341.8507959684553	269.41861351939014	21/02/24 15:45:16
19	919	341.8507959684553	269.41861351939014	21/02/24 15:45:17
19	904	347.25758750563756	270.59329170523137	21/02/24 15:45:18
19	904	352.1597258472866	270.85810765218207	21/02/24 15:45:19
19	968	355.71807547868275	279.11092240486005	21/02/24 15:45:20
19	964	355.482293890607	282.3613173869535	21/02/24 15:45:21
19	968	355.71807547868275	279.11092240486005	21/02/24 15:45:22
19	964	355.482293890607	282.3613173869535	21/02/24 15:45:23
19	990	357.82242061436574	282.16385269148645	21/02/24 15:45:24
19	990	357.82242061436585	282.16385269148645	21/02/24 15:45:25
19	NULL	360.5547106147948	283.12207921272073	21/02/24 15:45:26
19	959	362.3530560401282	287.71527633822046	21/02/24 15:45:27
19	959	362.3530560401282	287.71527633822046	21/02/24 15:45:28
19	959	362.3530560401282	287.71527633822046	21/02/24 15:45:29
19	959	362.3530560401282	287.71527633822046	21/02/24 15:45:30
19	959	362.3530560401282	287.71527633822046	21/02/24 15:45:31
19	959	362.3530560401282	287.71527633822046	21/02/24 15:45:32
19	959	362.3530560401282	287.71527633822046	21/02/24 15:45:33
19	959	362.3530560401282	287.71527633822046	21/02/24 15:45:34
19	959	362.3530560401282	287.71527633822046	21/02/24 15:45:35
19	959	362.3530560401282	287.71527633822046	21/02/24 15:45:36
19	959	362.3530560401282	287.71527633822046	21/02/24 15:45:37
19	NULL	368.6441963719141	285.32200544753397	21/02/24 15:45:38
19	958	365.55243192741585	288.59648801263694	21/02/24 15:45:39
19	958	365.55243192741585	288.59648801263694	21/02/24 15:45:40
19	958	365.55243192741585	288.59648801263694	21/02/24 15:45:41
19	958	364.8238741505902	287.1482151372541	21/02/24 15:45:42
19	958	365.55243192741585	288.59648801263694	21/02/24 15:45:43
19	958	364.8238741505902	287.1482151372541	21/02/24 15:45:44
19	958	365.55243192741585	288.59648801263694	21/02/24 15:45:45
19	958	365.55243192741585	288.59648801263694	21/02/24 15:45:46
19	958	364.8238741505902	287.1482151372541	21/02/24 15:45:47
19	958	365.55243192741585	288.59648801263694	21/02/24 15:45:48
19	958	364.8238741505902	287.1482151372541	21/02/24 15:45:49
19	958	365.55243192741585	288.59648801263694	21/02/24 15:45:50
19	958	365.55243192741585	288.59648801263694	21/02/24 15:45:51
19	958	365.55243192741585	288.59648801263694	21/02/24 15:45:52
19	958	364.8238741505902	287.1482151372541	21/02/24 15:45:53
19	958	365.55243192741585	288.59648801263694	21/02/24 15:45:54
19	958	365.55243192741585	288.59648801263694	21/02/24 15:45:55
19	958	364.8238741505902	287.1482151372541	21/02/24 15:45:56
19	NULL	368.6441963719141	285.32200544753397	21/02/24 15:45:57
19	NULL	368.6441963719141	285.32200544753397	21/02/24 15:45:58
19	NULL	368.6441963719141	285.32200544753397	21/02/24 15:45:59
19	958	364.8238741505902	287.1482151372541	21/02/24 15:46:00
19	NULL	368.6441963719141	285.32200544753397	21/02/24 15:46:01
19	NULL	368.6441963719141	285.32200544753397	21/02/24 15:46:02
19	NULL	368.6441963719141	285.32200544753397	21/02/24 15:46:03
19	NULL	368.6441963719141	285.32200544753397	21/02/24 15:46:04
19	910	371.49991506597235	283.64243362381774	21/02/24 15:46:05
19	NULL	368.6441963719141	285.32200544753397	21/02/24 15:46:06
19	NULL	368.6441963719141	285.32200544753397	21/02/24 15:46:07
19	910	369.71371985805763	286.8114454569442	21/02/24 15:46:08
19	NULL	368.6441963719141	285.32200544753397	21/02/24 15:46:09
19	910	369.71371985805763	286.8114454569442	21/02/24 15:46:10
19	910	369.71371985805763	286.8114454569442	21/02/24 15:46:11
19	958	364.8238741505902	287.1482151372541	21/02/24 15:46:12
19	958	364.8238741505902	287.1482151372541	21/02/24 15:46:13
19	959	362.3530560401282	287.71527633822046	21/02/24 15:46:14
19	918	358.31519680311567	286.86252054896266	21/02/24 15:46:15
19	990	357.82242061436574	282.16385269148645	21/02/24 15:46:16
19	964	355.482293890607	282.3613173869535	21/02/24 15:46:17
19	964	355.482293890607	282.3613173869535	21/02/24 15:46:18
19	968	355.71807547868275	279.11092240486005	21/02/24 15:46:19
19	904	352.1597258472866	270.85810765218207	21/02/24 15:46:20
19	954	351.0914713947272	276.75392450645927	21/02/24 15:46:21
19	904	347.2575875056375	270.5932917052313	21/02/24 15:46:22
19	904	347.2575875056375	270.5932917052313	21/02/24 15:46:23
19	919	341.8507959684553	269.41861351939014	21/02/24 15:46:24
19	NULL	337.73701806888556	270.34580290420837	21/02/24 15:46:25
19	NULL	337.73701806888556	270.34580290420837	21/02/24 15:46:26
19	909	333.79691834538926	273.32229963118385	21/02/24 15:46:27
19	909	333.79691834538926	273.32229963118385	21/02/24 15:46:28
19	955	331.14052623366666	274.53372397223194	21/02/24 15:46:29
19	955	331.14052623366666	274.53372397223194	21/02/24 15:46:30
19	955	331.14052623366666	274.53372397223194	21/02/24 15:46:31
19	955	327.5892974082492	276.18391471006385	21/02/24 15:46:32
19	955	327.5892974082492	276.18391471006385	21/02/24 15:46:33
19	909	326.737153683381	273.3535535783339	21/02/24 15:46:34
19	955	327.5892974082492	276.18391471006385	21/02/24 15:46:35
19	955	327.5892974082492	276.18391471006385	21/02/24 15:46:36
19	955	327.5892974082492	276.18391471006385	21/02/24 15:46:37
19	955	327.5892974082492	276.18391471006385	21/02/24 15:46:38
19	955	327.5892974082492	276.18391471006385	21/02/24 15:46:39
19	955	327.5892974082492	276.18391471006385	21/02/24 15:46:40
19	955	327.5892974082492	276.18391471006385	21/02/24 15:46:42
19	955	327.5892974082492	276.18391471006385	21/02/24 15:46:43
19	955	327.5892974082492	276.18391471006385	21/02/24 15:46:44
19	955	327.5892974082492	276.18391471006385	21/02/24 15:46:45
19	955	327.5892974082492	276.18391471006385	21/02/24 15:46:46
19	955	327.5892974082492	276.1839147100638	21/02/24 15:46:47
19	955	327.5892974082492	276.18391471006385	21/02/24 15:46:48
19	955	327.5892974082492	276.18391471006385	21/02/24 15:46:49
19	955	327.5892974082492	276.18391471006385	21/02/24 15:46:50
19	955	327.5892974082492	276.18391471006385	21/02/24 15:46:51
19	955	327.5892974082492	276.18391471006385	21/02/24 15:46:52
19	955	327.5892974082492	276.18391471006385	21/02/24 15:46:53
19	955	327.5892974082492	276.18391471006385	21/02/24 15:46:54
19	955	327.5892974082492	276.18391471006385	21/02/24 15:46:55
19	955	327.5892974082492	276.18391471006385	21/02/24 15:46:56
19	955	327.5892974082492	276.18391471006385	21/02/24 15:46:57
19	955	327.5892974082492	276.18391471006385	21/02/24 15:46:58
19	955	331.14052623366666	274.53372397223194	21/02/24 15:46:59
19	955	331.14052623366666	274.53372397223194	21/02/24 15:47:00
19	909	333.79691834538926	273.32229963118385	21/02/24 15:47:01
19	909	333.79691834538926	273.32229963118385	21/02/24 15:47:02
19	NULL	337.73701806888556	270.34580290420837	21/02/24 15:47:03
19	NULL	337.73701806888556	270.34580290420837	21/02/24 15:47:04
19	919	341.8507959684553	269.41861351939014	21/02/24 15:47:05
19	919	341.8507959684553	269.41861351939014	21/02/24 15:47:06
19	904	345.5840669454654	272.03626967984314	21/02/24 15:47:07
19	904	347.25758750563756	270.59329170523137	21/02/24 15:47:08
19	945	357.7218077022862	278.62087605071156	21/02/24 15:47:09
19	968	355.71807547868275	279.11092240486005	21/02/24 15:47:10
19	968	355.71807547868275	279.11092240486005	21/02/24 15:47:11
19	964	355.482293890607	282.3613173869535	21/02/24 15:47:12
19	990	357.82242061436585	282.16385269148645	21/02/24 15:47:13
19	NULL	360.5547106147949	283.12207921272073	21/02/24 15:47:14
19	NULL	360.5547106147949	283.12207921272073	21/02/24 15:47:15
19	959	362.3530560401282	287.71527633822046	21/02/24 15:47:16
19	NULL	368.6441963719141	285.32200544753397	21/02/24 15:47:17
19	910	371.49991506597235	283.64243362381774	21/02/24 15:47:18
19	990	373.5702263177357	281.590961967497	21/02/24 15:47:19
19	990	373.5702263177357	281.5909619674969	21/02/24 15:47:20
19	905	375.09542798338026	284.54571340969284	21/02/24 15:47:21
19	905	375.1484764138781	287.03143447263193	21/02/24 15:47:22
19	905	375.1484764138781	287.03143447263193	21/02/24 15:47:23
19	905	375.1484764138781	287.03143447263193	21/02/24 15:47:24
19	905	373.45800659369826	288.2494158273584	21/02/24 15:47:25
19	905	375.1484764138781	287.03143447263193	21/02/24 15:47:26
19	905	375.1484764138781	287.03143447263193	21/02/24 15:47:27
19	905	375.1484764138781	287.03143447263193	21/02/24 15:47:28
19	905	375.1484764138781	287.03143447263193	21/02/24 15:47:29
19	905	375.1484764138781	287.03143447263193	21/02/24 15:47:30
19	905	375.1484764138781	287.03143447263193	21/02/24 15:47:31
19	905	375.1484764138781	287.03143447263193	21/02/24 15:47:32
19	905	375.1484764138781	287.03143447263193	21/02/24 15:47:33
19	905	375.1484764138781	287.03143447263193	21/02/24 15:47:34
19	905	375.1484764138781	287.03143447263193	21/02/24 15:47:35
19	905	375.1484764138781	287.03143447263193	21/02/24 15:47:36
19	905	375.1484764138781	287.03143447263193	21/02/24 15:47:37
19	905	375.1484764138781	287.03143447263193	21/02/24 15:47:38
19	905	375.1484764138781	287.03143447263193	21/02/24 15:47:39
19	905	375.1484764138781	287.03143447263193	21/02/24 15:47:40
19	905	375.1484764138781	287.03143447263193	21/02/24 15:47:41
19	905	375.1484764138781	287.03143447263193	21/02/24 15:47:42
19	905	373.45800659369826	288.2494158273584	21/02/24 15:47:43
19	905	373.45800659369826	288.2494158273584	21/02/24 15:47:44
19	905	373.45800659369826	288.2494158273584	21/02/24 15:47:45
19	905	375.1484764138781	287.03143447263193	21/02/24 15:47:46
19	905	375.1484764138781	287.03143447263193	21/02/24 15:47:47
19	905	375.1484764138781	287.03143447263193	21/02/24 15:47:48
19	905	375.1484764138781	287.03143447263193	21/02/24 15:47:49
19	905	373.45800659369826	288.2494158273584	21/02/24 15:47:50
19	905	373.45800659369826	288.2494158273584	21/02/24 15:47:51
19	905	375.1484764138781	287.03143447263193	21/02/24 15:47:52
19	905	375.1484764138781	287.03143447263193	21/02/24 15:47:53
19	905	375.09542798338026	284.54571340969284	21/02/24 15:47:54
19	990	373.5702263177357	281.5909619674969	21/02/24 15:47:55
19	910	371.49991506597235	283.6424336238178	21/02/24 15:47:56
19	NULL	368.6441963719141	285.32200544753397	21/02/24 15:47:57
19	958	367.33862713533057	285.42747617951045	21/02/24 15:47:58
19	959	363.5183049140067	287.25368586923065	21/02/24 15:47:59
