floorId	partitionId	location_x	location_y	timeStamp
1	93	335.2402237270433	298.1818898559834	20/04/28 05:17:35
1	93	331.26877625885106	298.28144854766873	20/04/28 05:17:36
1	93	335.2402237270433	298.1818898559834	20/04/28 05:17:37
1	93	335.2402237270433	298.1818898559834	20/04/28 05:17:38
1	93	331.26877625885106	298.28144854766873	20/04/28 05:17:39
1	93	331.8474126053513	298.3506628820678	20/04/28 05:17:40
1	93	331.26877625885106	298.28144854766873	20/04/28 05:17:41
1	93	331.2687762588511	298.2814485476688	20/04/28 05:17:42
1	93	329.1054114448696	297.79348008428315	20/04/28 05:17:43
1	93	328.52677509836946	297.7242657498841	20/04/28 05:17:44
1	93	331.5833413937988	299.0836549614874	20/04/28 05:17:45
1	93	331.26877625885106	298.28144854766873	20/04/28 05:17:46
1	93	331.2687762588511	298.2814485476688	20/04/28 05:17:47
1	93	328.52677509836946	297.7242657498841	20/04/28 05:17:48
1	93	331.2687762588511	298.2814485476688	20/04/28 05:17:49
1	93	331.2687762588511	298.2814485476688	20/04/28 05:17:50
1	93	331.26877625885106	298.28144854766873	20/04/28 05:17:51
1	93	331.2687762588511	298.2814485476688	20/04/28 05:17:52
1	93	335.2402237270433	298.1818898559834	20/04/28 05:17:53
1	93	331.5833413937988	299.0836549614874	20/04/28 05:17:54
1	93	331.26877625885106	298.28144854766873	20/04/28 05:17:55
1	93	331.26877625885106	298.28144854766873	20/04/28 05:17:56
1	93	331.8474126053512	298.3506628820678	20/04/28 05:17:57
1	93	333.89077080222825	296.36297843103466	20/04/28 05:17:58
1	93	335.2402237270433	298.1818898559834	20/04/28 05:17:59
1	93	335.2402237270433	298.1818898559834	20/04/28 05:18:00
1	93	335.2402237270433	298.1818898559834	20/04/28 05:18:01
1	93	335.2402237270433	298.1818898559834	20/04/28 05:18:02
1	93	331.26877625885106	298.28144854766873	20/04/28 05:18:03
1	93	331.26877625885106	298.28144854766873	20/04/28 05:18:04
1	93	335.2402237270433	298.1818898559834	20/04/28 05:18:05
1	93	335.2402237270433	298.1818898559834	20/04/28 05:18:06
1	93	331.26877625885106	298.28144854766873	20/04/28 05:18:07
1	93	331.26877625885106	298.28144854766873	20/04/28 05:18:08
1	93	331.2687762588511	298.2814485476688	20/04/28 05:18:09
1	93	331.5833413937988	299.0836549614874	20/04/28 05:18:10
1	93	331.8474126053512	298.3506628820678	20/04/28 05:18:11
1	93	328.52677509836946	297.7242657498841	20/04/28 05:18:12
1	93	328.79084630992185	296.9912736704645	20/04/28 05:18:13
1	93	328.52677509836946	297.7242657498841	20/04/28 05:18:14
1	93	331.26877625885106	298.28144854766873	20/04/28 05:18:15
1	93	328.79084630992185	296.99127367046447	20/04/28 05:18:16
1	93	331.2687762588511	298.2814485476688	20/04/28 05:18:17
1	93	331.8474126053512	298.3506628820678	20/04/28 05:18:18
1	93	331.2687762588511	298.2814485476688	20/04/28 05:18:19
1	93	331.2687762588511	298.2814485476688	20/04/28 05:18:20
1	93	331.2687762588511	298.2814485476688	20/04/28 05:18:21
1	93	328.8807185783794	295.3720814225117	20/04/28 05:18:22
1	93	328.79084630992185	296.9912736704645	20/04/28 05:18:23
1	93	328.79084630992185	296.9912736704645	20/04/28 05:18:24
1	93	331.2687762588511	298.2814485476688	20/04/28 05:18:25
1	93	331.8474126053512	298.3506628820678	20/04/28 05:18:26
1	93	335.2402237270433	298.1818898559834	20/04/28 05:18:27
1	93	328.79084630992185	296.99127367046447	20/04/28 05:18:28
1	93	331.26877625885106	298.28144854766873	20/04/28 05:18:29
1	93	328.52677509836946	297.7242657498841	20/04/28 05:18:30
1	93	328.79084630992185	296.9912736704645	20/04/28 05:18:31
1	93	331.2687762588511	298.2814485476688	20/04/28 05:18:32
1	93	331.26877625885106	298.28144854766873	20/04/28 05:18:33
1	93	331.2687762588511	298.2814485476688	20/04/28 05:18:34
1	93	328.79084630992185	296.9912736704645	20/04/28 05:18:35
1	93	328.52677509836946	297.72426574988407	20/04/28 05:18:36
1	93	328.88071857837946	295.3720814225117	20/04/28 05:18:37
1	93	331.2687762588511	298.2814485476688	20/04/28 05:18:38
1	93	328.8807185783794	295.3720814225117	20/04/28 05:18:39
1	93	328.8807185783794	295.3720814225117	20/04/28 05:18:40
1	93	330.6534892786758	294.8423808531664	20/04/28 05:18:41
1	93	331.26877625885106	298.28144854766873	20/04/28 05:18:42
1	16	330.74336154713336	293.2231886052136	20/04/28 05:18:43
1	93	333.131419227605	296.13255573037065	20/04/28 05:18:44
1	16	331.50271312175664	293.4536113058776	20/04/28 05:18:45
1	93	334.8056519749912	294.904030527746	20/04/28 05:18:46
1	16	331.50271312175664	293.4536113058776	20/04/28 05:18:47
1	93	331.8474126053512	298.3506628820678	20/04/28 05:18:48
