deviceId	device_location_x	device_location_y	rssi_measurement	timeStamp
8	337.0569612312978	272.24137590202855	-69	21/02/24 15:47:21
24	330.2572237413254	276.8419321591195	-58	21/02/24 15:47:21
25	329.08778489613	275.87564892517275	-59	21/02/24 15:47:21
16	327.98603409324727	290.8054485105832	-70	21/02/24 15:47:21
11	327.4246457091771	282.6323525733639	-61	21/02/24 15:47:21
17	323.82998850731616	295.6841920138939	-72	21/02/24 15:47:21
7	334.07657006354464	270.8835908324035	-67	21/02/24 15:47:21
30	327.70079256672074	268.3508487639297	-60	21/02/24 15:47:21
21	334.5994402908936	265.9434918767382	-67	21/02/24 15:47:21
20	334.99735462161357	264.77807460530994	-68	21/02/24 15:47:21
29	324.8804385762518	264.6870431160569	-65	21/02/24 15:47:21
23	323.42288358729223	275.8341630458992	-38	21/02/24 15:47:21
10	321.1177375667231	282.04747788327467	-54	21/02/24 15:47:21
28	319.76429243151256	284.17285383094054	-60	21/02/24 15:47:21
38	316.1636107796155	284.5723838925019	-62	21/02/24 15:47:21
42	315.6556041264745	266.0029600774402	-63	21/02/24 15:47:21
43	309.60031010266727	265.8998943182024	-66	21/02/24 15:47:21
39	309.2997043904728	289.36813114546595	-68	21/02/24 15:47:21
44	307.83683034460904	277.09769127798097	-65	21/02/24 15:47:21

8	337.0569612312978	272.24137590202855	-67	21/02/24 15:47:22
24	330.2572237413254	276.8419321591195	-55	21/02/24 15:47:22
25	329.08778489613	275.87564892517275	-52	21/02/24 15:47:22
16	327.98603409324727	290.8054485105832	-67	21/02/24 15:47:22
11	327.4246457091771	282.6323525733639	-60	21/02/24 15:47:22
7	334.07657006354464	270.8835908324035	-63	21/02/24 15:47:22
30	327.70079256672074	268.3508487639297	-59	21/02/24 15:47:22
13	342.0775229118143	267.91244197819304	-69	21/02/24 15:47:22
21	334.5994402908936	265.9434918767382	-68	21/02/24 15:47:22
20	334.99735462161357	264.77807460530994	-66	21/02/24 15:47:22
29	324.8804385762518	264.6870431160569	-62	21/02/24 15:47:22
23	323.42288358729223	275.8341630458992	-28	21/02/24 15:47:22
10	321.1177375667231	282.04747788327467	-57	21/02/24 15:47:22
28	319.76429243151256	284.17285383094054	-63	21/02/24 15:47:22
38	316.1636107796155	284.5723838925019	-66	21/02/24 15:47:22
42	315.6556041264745	266.0029600774402	-63	21/02/24 15:47:22
43	309.60031010266727	265.8998943182024	-70	21/02/24 15:47:22
44	307.83683034460904	277.09769127798097	-67	21/02/24 15:47:22

8	337.0569612312978	272.24137590202855	-65	21/02/24 15:47:23
24	330.2572237413254	276.8419321591195	-52	21/02/24 15:47:23
25	329.08778489613	275.87564892517275	-48	21/02/24 15:47:23
16	327.98603409324727	290.8054485105832	-68	21/02/24 15:47:23
11	327.4246457091771	282.6323525733639	-57	21/02/24 15:47:23
7	334.07657006354464	270.8835908324035	-59	21/02/24 15:47:23
30	327.70079256672074	268.3508487639297	-55	21/02/24 15:47:23
13	342.0775229118143	267.91244197819304	-71	21/02/24 15:47:23
21	334.5994402908936	265.9434918767382	-63	21/02/24 15:47:23
14	341.6082252010515	265.6547772450898	-70	21/02/24 15:47:23
20	334.99735462161357	264.77807460530994	-65	21/02/24 15:47:23
29	324.8804385762518	264.6870431160569	-62	21/02/24 15:47:23
23	323.42288358729223	275.8341630458992	-44	21/02/24 15:47:23
10	321.1177375667231	282.04747788327467	-61	21/02/24 15:47:23
28	319.76429243151256	284.17285383094054	-62	21/02/24 15:47:23
38	316.1636107796155	284.5723838925019	-67	21/02/24 15:47:23
42	315.6556041264745	266.0029600774402	-64	21/02/24 15:47:23
43	309.60031010266727	265.8998943182024	-69	21/02/24 15:47:23
44	307.83683034460904	277.09769127798097	-68	21/02/24 15:47:23

8	337.0569612312978	272.24137590202855	-60	21/02/24 15:47:24
24	330.2572237413254	276.8419321591195	-49	21/02/24 15:47:24
25	329.08778489613	275.87564892517275	-41	21/02/24 15:47:24
16	327.98603409324727	290.8054485105832	-66	21/02/24 15:47:24
11	327.4246457091771	282.6323525733639	-61	21/02/24 15:47:24
7	334.07657006354464	270.8835908324035	-57	21/02/24 15:47:24
30	327.70079256672074	268.3508487639297	-55	21/02/24 15:47:24
31	346.4179037622539	268.10202267794875	-69	21/02/24 15:47:24
13	342.0775229118143	267.91244197819304	-69	21/02/24 15:47:24
21	334.5994402908936	265.9434918767382	-63	21/02/24 15:47:24
14	341.6082252010515	265.6547772450898	-66	21/02/24 15:47:24
20	334.99735462161357	264.77807460530994	-65	21/02/24 15:47:24
29	324.8804385762518	264.6870431160569	-62	21/02/24 15:47:24
23	323.42288358729223	275.8341630458992	-52	21/02/24 15:47:24
10	321.1177375667231	282.04747788327467	-62	21/02/24 15:47:24
28	319.76429243151256	284.17285383094054	-64	21/02/24 15:47:24
38	316.1636107796155	284.5723838925019	-69	21/02/24 15:47:24
42	315.6556041264745	266.0029600774402	-65	21/02/24 15:47:24

8	337.0569612312978	272.24137590202855	-58	21/02/24 15:47:25
24	330.2572237413254	276.8419321591195	-47	21/02/24 15:47:25
25	329.08778489613	275.87564892517275	-43	21/02/24 15:47:25
16	327.98603409324727	290.8054485105832	-68	21/02/24 15:47:25
11	327.4246457091771	282.6323525733639	-59	21/02/24 15:47:25
7	334.07657006354464	270.8835908324035	-54	21/02/24 15:47:25
30	327.70079256672074	268.3508487639297	-53	21/02/24 15:47:25
31	346.4179037622539	268.10202267794875	-70	21/02/24 15:47:25
13	342.0775229118143	267.91244197819304	-65	21/02/24 15:47:25
21	334.5994402908936	265.9434918767382	-59	21/02/24 15:47:25
14	341.6082252010515	265.6547772450898	-66	21/02/24 15:47:25
20	334.99735462161357	264.77807460530994	-61	21/02/24 15:47:25
29	324.8804385762518	264.6870431160569	-61	21/02/24 15:47:25
23	323.42288358729223	275.8341630458992	-56	21/02/24 15:47:25
10	321.1177375667231	282.04747788327467	-65	21/02/24 15:47:25
28	319.76429243151256	284.17285383094054	-66	21/02/24 15:47:25
38	316.1636107796155	284.5723838925019	-70	21/02/24 15:47:25
42	315.6556041264745	266.0029600774402	-69	21/02/24 15:47:25

8	337.0569612312978	272.24137590202855	-52	21/02/24 15:47:26
24	330.2572237413254	276.8419321591195	-47	21/02/24 15:47:26
25	329.08778489613	275.87564892517275	-49	21/02/24 15:47:26
16	327.98603409324727	290.8054485105832	-68	21/02/24 15:47:26
11	327.4246457091771	282.6323525733639	-63	21/02/24 15:47:26
7	334.07657006354464	270.8835908324035	-47	21/02/24 15:47:26
30	327.70079256672074	268.3508487639297	-58	21/02/24 15:47:26
31	346.4179037622539	268.10202267794875	-65	21/02/24 15:47:26
13	342.0775229118143	267.91244197819304	-63	21/02/24 15:47:26
21	334.5994402908936	265.9434918767382	-57	21/02/24 15:47:26
14	341.6082252010515	265.6547772450898	-63	21/02/24 15:47:26
20	334.99735462161357	264.77807460530994	-60	21/02/24 15:47:26
29	324.8804385762518	264.6870431160569	-62	21/02/24 15:47:26
23	323.42288358729223	275.8341630458992	-58	21/02/24 15:47:26
10	321.1177375667231	282.04747788327467	-65	21/02/24 15:47:26
28	319.76429243151256	284.17285383094054	-67	21/02/24 15:47:26
38	316.1636107796155	284.5723838925019	-71	21/02/24 15:47:26
42	315.6556041264745	266.0029600774402	-70	21/02/24 15:47:26

22	353.27733584284437	275.76541045955213	-72	21/02/24 15:47:27
8	337.0569612312978	272.24137590202855	-47	21/02/24 15:47:27
24	330.2572237413254	276.8419321591195	-52	21/02/24 15:47:27
25	329.08778489613	275.87564892517275	-53	21/02/24 15:47:27
16	327.98603409324727	290.8054485105832	-70	21/02/24 15:47:27
11	327.4246457091771	282.6323525733639	-61	21/02/24 15:47:27
7	334.07657006354464	270.8835908324035	-47	21/02/24 15:47:27
30	327.70079256672074	268.3508487639297	-59	21/02/24 15:47:27
31	346.4179037622539	268.10202267794875	-64	21/02/24 15:47:27
13	342.0775229118143	267.91244197819304	-62	21/02/24 15:47:27
21	334.5994402908936	265.9434918767382	-57	21/02/24 15:47:27
14	341.6082252010515	265.6547772450898	-64	21/02/24 15:47:27
20	334.99735462161357	264.77807460530994	-61	21/02/24 15:47:27
29	324.8804385762518	264.6870431160569	-64	21/02/24 15:47:27
23	323.42288358729223	275.8341630458992	-64	21/02/24 15:47:27
10	321.1177375667231	282.04747788327467	-67	21/02/24 15:47:27
28	319.76429243151256	284.17285383094054	-70	21/02/24 15:47:27
42	315.6556041264745	266.0029600774402	-71	21/02/24 15:47:27

22	353.27733584284437	275.76541045955213	-68	21/02/24 15:47:28
45	342.3105096677226	291.9842245930836	-71	21/02/24 15:47:28
8	337.0569612312978	272.24137590202855	-41	21/02/24 15:47:28
24	330.2572237413254	276.8419321591195	-55	21/02/24 15:47:28
25	329.08778489613	275.87564892517275	-58	21/02/24 15:47:28
16	327.98603409324727	290.8054485105832	-71	21/02/24 15:47:28
11	327.4246457091771	282.6323525733639	-64	21/02/24 15:47:28
7	334.07657006354464	270.8835908324035	-47	21/02/24 15:47:28
30	327.70079256672074	268.3508487639297	-61	21/02/24 15:47:28
31	346.4179037622539	268.10202267794875	-65	21/02/24 15:47:28
13	342.0775229118143	267.91244197819304	-60	21/02/24 15:47:28
21	334.5994402908936	265.9434918767382	-58	21/02/24 15:47:28
14	341.6082252010515	265.6547772450898	-60	21/02/24 15:47:28
20	334.99735462161357	264.77807460530994	-59	21/02/24 15:47:28
29	324.8804385762518	264.6870431160569	-68	21/02/24 15:47:28
23	323.42288358729223	275.8341630458992	-64	21/02/24 15:47:28
10	321.1177375667231	282.04747788327467	-69	21/02/24 15:47:28
28	319.76429243151256	284.17285383094054	-71	21/02/24 15:47:28

47	353.57917457908314	286.3943403818769	-72	21/02/24 15:47:29
22	353.27733584284437	275.76541045955213	-65	21/02/24 15:47:29
45	342.3105096677226	291.9842245930836	-68	21/02/24 15:47:29
8	337.0569612312978	272.24137590202855	-42	21/02/24 15:47:29
24	330.2572237413254	276.8419321591195	-59	21/02/24 15:47:29
25	329.08778489613	275.87564892517275	-59	21/02/24 15:47:29
16	327.98603409324727	290.8054485105832	-71	21/02/24 15:47:29
11	327.4246457091771	282.6323525733639	-68	21/02/24 15:47:29
7	334.07657006354464	270.8835908324035	-53	21/02/24 15:47:29
32	356.7839379367616	268.70688981904533	-71	21/02/24 15:47:29
30	327.70079256672074	268.3508487639297	-64	21/02/24 15:47:29
31	346.4179037622539	268.10202267794875	-62	21/02/24 15:47:29
13	342.0775229118143	267.91244197819304	-58	21/02/24 15:47:29
21	334.5994402908936	265.9434918767382	-60	21/02/24 15:47:29
14	341.6082252010515	265.6547772450898	-60	21/02/24 15:47:29
20	334.99735462161357	264.77807460530994	-59	21/02/24 15:47:29
29	324.8804385762518	264.6870431160569	-69	21/02/24 15:47:29
23	323.42288358729223	275.8341630458992	-65	21/02/24 15:47:29
10	321.1177375667231	282.04747788327467	-68	21/02/24 15:47:29

47	353.57917457908314	286.3943403818769	-71	21/02/24 15:47:30
22	353.27733584284437	275.76541045955213	-63	21/02/24 15:47:30
45	342.3105096677226	291.9842245930836	-68	21/02/24 15:47:30
8	337.0569612312978	272.24137590202855	-46	21/02/24 15:47:30
24	330.2572237413254	276.8419321591195	-62	21/02/24 15:47:30
25	329.08778489613	275.87564892517275	-64	21/02/24 15:47:30
11	327.4246457091771	282.6323525733639	-69	21/02/24 15:47:30
7	334.07657006354464	270.8835908324035	-55	21/02/24 15:47:30
32	356.7839379367616	268.70688981904533	-68	21/02/24 15:47:30
30	327.70079256672074	268.3508487639297	-67	21/02/24 15:47:30
31	346.4179037622539	268.10202267794875	-58	21/02/24 15:47:30
13	342.0775229118143	267.91244197819304	-53	21/02/24 15:47:30
21	334.5994402908936	265.9434918767382	-60	21/02/24 15:47:30
14	341.6082252010515	265.6547772450898	-61	21/02/24 15:47:30
20	334.99735462161357	264.77807460530994	-62	21/02/24 15:47:30
29	324.8804385762518	264.6870431160569	-68	21/02/24 15:47:30
23	323.42288358729223	275.8341630458992	-67	21/02/24 15:47:30

40	360.29771601412074	275.17301637315114	-67	21/02/24 15:47:31
47	353.57917457908314	286.3943403818769	-68	21/02/24 15:47:31
22	353.27733584284437	275.76541045955213	-64	21/02/24 15:47:31
45	342.3105096677226	291.9842245930836	-69	21/02/24 15:47:31
8	337.0569612312978	272.24137590202855	-55	21/02/24 15:47:31
24	330.2572237413254	276.8419321591195	-65	21/02/24 15:47:31
25	329.08778489613	275.87564892517275	-65	21/02/24 15:47:31
11	327.4246457091771	282.6323525733639	-67	21/02/24 15:47:31
7	334.07657006354464	270.8835908324035	-59	21/02/24 15:47:31
33	361.5531569646988	270.2693072733871	-72	21/02/24 15:47:31
32	356.7839379367616	268.70688981904533	-67	21/02/24 15:47:31
30	327.70079256672074	268.3508487639297	-68	21/02/24 15:47:31
31	346.4179037622539	268.10202267794875	-56	21/02/24 15:47:31
13	342.0775229118143	267.91244197819304	-53	21/02/24 15:47:31
21	334.5994402908936	265.9434918767382	-63	21/02/24 15:47:31
14	341.6082252010515	265.6547772450898	-59	21/02/24 15:47:31
20	334.99735462161357	264.77807460530994	-62	21/02/24 15:47:31
29	324.8804385762518	264.6870431160569	-70	21/02/24 15:47:31
23	323.42288358729223	275.8341630458992	-71	21/02/24 15:47:31

37	359.5903712498935	284.92420131943135	-71	21/02/24 15:47:32
40	360.29771601412074	275.17301637315114	-66	21/02/24 15:47:32
47	353.57917457908314	286.3943403818769	-66	21/02/24 15:47:32
22	353.27733584284437	275.76541045955213	-58	21/02/24 15:47:32
45	342.3105096677226	291.9842245930836	-70	21/02/24 15:47:32
8	337.0569612312978	272.24137590202855	-59	21/02/24 15:47:32
24	330.2572237413254	276.8419321591195	-68	21/02/24 15:47:32
25	329.08778489613	275.87564892517275	-67	21/02/24 15:47:32
11	327.4246457091771	282.6323525733639	-69	21/02/24 15:47:32
7	334.07657006354464	270.8835908324035	-63	21/02/24 15:47:32
33	361.5531569646988	270.2693072733871	-70	21/02/24 15:47:32
32	356.7839379367616	268.70688981904533	-67	21/02/24 15:47:32
30	327.70079256672074	268.3508487639297	-70	21/02/24 15:47:32
31	346.4179037622539	268.10202267794875	-55	21/02/24 15:47:32
13	342.0775229118143	267.91244197819304	-58	21/02/24 15:47:32
21	334.5994402908936	265.9434918767382	-66	21/02/24 15:47:32
14	341.6082252010515	265.6547772450898	-61	21/02/24 15:47:32
20	334.99735462161357	264.77807460530994	-67	21/02/24 15:47:32

37	359.5903712498935	284.92420131943135	-70	21/02/24 15:47:33
40	360.29771601412074	275.17301637315114	-64	21/02/24 15:47:33
47	353.57917457908314	286.3943403818769	-67	21/02/24 15:47:33
22	353.27733584284437	275.76541045955213	-55	21/02/24 15:47:33
45	342.3105096677226	291.9842245930836	-70	21/02/24 15:47:33
8	337.0569612312978	272.24137590202855	-63	21/02/24 15:47:33
24	330.2572237413254	276.8419321591195	-69	21/02/24 15:47:33
25	329.08778489613	275.87564892517275	-69	21/02/24 15:47:33
7	334.07657006354464	270.8835908324035	-64	21/02/24 15:47:33
33	361.5531569646988	270.2693072733871	-67	21/02/24 15:47:33
32	356.7839379367616	268.70688981904533	-62	21/02/24 15:47:33
30	327.70079256672074	268.3508487639297	-69	21/02/24 15:47:33
31	346.4179037622539	268.10202267794875	-55	21/02/24 15:47:33
13	342.0775229118143	267.91244197819304	-59	21/02/24 15:47:33
21	334.5994402908936	265.9434918767382	-66	21/02/24 15:47:33
14	341.6082252010515	265.6547772450898	-63	21/02/24 15:47:33
20	334.99735462161357	264.77807460530994	-65	21/02/24 15:47:33

37	359.5903712498935	284.92420131943135	-68	21/02/24 15:47:34
40	360.29771601412074	275.17301637315114	-67	21/02/24 15:47:34
47	353.57917457908314	286.3943403818769	-68	21/02/24 15:47:34
22	353.27733584284437	275.76541045955213	-57	21/02/24 15:47:34
45	342.3105096677226	291.9842245930836	-68	21/02/24 15:47:34
8	337.0569612312978	272.24137590202855	-62	21/02/24 15:47:34
24	330.2572237413254	276.8419321591195	-67	21/02/24 15:47:34
25	329.08778489613	275.87564892517275	-69	21/02/24 15:47:34
7	334.07657006354464	270.8835908324035	-64	21/02/24 15:47:34
33	361.5531569646988	270.2693072733871	-67	21/02/24 15:47:34
32	356.7839379367616	268.70688981904533	-65	21/02/24 15:47:34
31	346.4179037622539	268.10202267794875	-55	21/02/24 15:47:34
13	342.0775229118143	267.91244197819304	-59	21/02/24 15:47:34
21	334.5994402908936	265.9434918767382	-66	21/02/24 15:47:34
14	341.6082252010515	265.6547772450898	-60	21/02/24 15:47:34
20	334.99735462161357	264.77807460530994	-67	21/02/24 15:47:34

37	359.5903712498935	284.92420131943135	-66	21/02/24 15:47:35
40	360.29771601412074	275.17301637315114	-64	21/02/24 15:47:35
47	353.57917457908314	286.3943403818769	-67	21/02/24 15:47:35
22	353.27733584284437	275.76541045955213	-55	21/02/24 15:47:35
45	342.3105096677226	291.9842245930836	-70	21/02/24 15:47:35
8	337.0569612312978	272.24137590202855	-60	21/02/24 15:47:35
24	330.2572237413254	276.8419321591195	-69	21/02/24 15:47:35
25	329.08778489613	275.87564892517275	-69	21/02/24 15:47:35
7	334.07657006354464	270.8835908324035	-64	21/02/24 15:47:35
33	361.5531569646988	270.2693072733871	-65	21/02/24 15:47:35
32	356.7839379367616	268.70688981904533	-62	21/02/24 15:47:35
30	327.70079256672074	268.3508487639297	-70	21/02/24 15:47:35
31	346.4179037622539	268.10202267794875	-55	21/02/24 15:47:35
13	342.0775229118143	267.91244197819304	-57	21/02/24 15:47:35
21	334.5994402908936	265.9434918767382	-68	21/02/24 15:47:35
14	341.6082252010515	265.6547772450898	-61	21/02/24 15:47:35
20	334.99735462161357	264.77807460530994	-67	21/02/24 15:47:35

37	359.5903712498935	284.92420131943135	-69	21/02/24 15:47:36
40	360.29771601412074	275.17301637315114	-64	21/02/24 15:47:36
47	353.57917457908314	286.3943403818769	-66	21/02/24 15:47:36
22	353.27733584284437	275.76541045955213	-55	21/02/24 15:47:36
45	342.3105096677226	291.9842245930836	-71	21/02/24 15:47:36
8	337.0569612312978	272.24137590202855	-64	21/02/24 15:47:36
24	330.2572237413254	276.8419321591195	-68	21/02/24 15:47:36
25	329.08778489613	275.87564892517275	-69	21/02/24 15:47:36
7	334.07657006354464	270.8835908324035	-64	21/02/24 15:47:36
33	361.5531569646988	270.2693072733871	-65	21/02/24 15:47:36
32	356.7839379367616	268.70688981904533	-64	21/02/24 15:47:36
31	346.4179037622539	268.10202267794875	-55	21/02/24 15:47:36
13	342.0775229118143	267.91244197819304	-59	21/02/24 15:47:36
21	334.5994402908936	265.9434918767382	-68	21/02/24 15:47:36
14	341.6082252010515	265.6547772450898	-61	21/02/24 15:47:36
20	334.99735462161357	264.77807460530994	-68	21/02/24 15:47:36

37	359.5903712498935	284.92420131943135	-67	21/02/24 15:47:37
40	360.29771601412074	275.17301637315114	-66	21/02/24 15:47:37
47	353.57917457908314	286.3943403818769	-64	21/02/24 15:47:37
22	353.27733584284437	275.76541045955213	-55	21/02/24 15:47:37
45	342.3105096677226	291.9842245930836	-69	21/02/24 15:47:37
8	337.0569612312978	272.24137590202855	-61	21/02/24 15:47:37
24	330.2572237413254	276.8419321591195	-70	21/02/24 15:47:37
25	329.08778489613	275.87564892517275	-68	21/02/24 15:47:37
7	334.07657006354464	270.8835908324035	-67	21/02/24 15:47:37
33	361.5531569646988	270.2693072733871	-66	21/02/24 15:47:37
32	356.7839379367616	268.70688981904533	-61	21/02/24 15:47:37
31	346.4179037622539	268.10202267794875	-59	21/02/24 15:47:37
13	342.0775229118143	267.91244197819304	-58	21/02/24 15:47:37
21	334.5994402908936	265.9434918767382	-66	21/02/24 15:47:37
14	341.6082252010515	265.6547772450898	-63	21/02/24 15:47:37
20	334.99735462161357	264.77807460530994	-68	21/02/24 15:47:37

37	359.5903712498935	284.92420131943135	-67	21/02/24 15:47:38
40	360.29771601412074	275.17301637315114	-66	21/02/24 15:47:38
47	353.57917457908314	286.3943403818769	-67	21/02/24 15:47:38
22	353.27733584284437	275.76541045955213	-56	21/02/24 15:47:38
45	342.3105096677226	291.9842245930836	-68	21/02/24 15:47:38
8	337.0569612312978	272.24137590202855	-63	21/02/24 15:47:38
24	330.2572237413254	276.8419321591195	-68	21/02/24 15:47:38
25	329.08778489613	275.87564892517275	-71	21/02/24 15:47:38
7	334.07657006354464	270.8835908324035	-67	21/02/24 15:47:38
33	361.5531569646988	270.2693072733871	-67	21/02/24 15:47:38
32	356.7839379367616	268.70688981904533	-63	21/02/24 15:47:38
31	346.4179037622539	268.10202267794875	-56	21/02/24 15:47:38
13	342.0775229118143	267.91244197819304	-61	21/02/24 15:47:38
21	334.5994402908936	265.9434918767382	-66	21/02/24 15:47:38
14	341.6082252010515	265.6547772450898	-61	21/02/24 15:47:38
20	334.99735462161357	264.77807460530994	-69	21/02/24 15:47:38

37	359.5903712498935	284.92420131943135	-69	21/02/24 15:47:39
40	360.29771601412074	275.17301637315114	-64	21/02/24 15:47:39
47	353.57917457908314	286.3943403818769	-63	21/02/24 15:47:39
22	353.27733584284437	275.76541045955213	-57	21/02/24 15:47:39
45	342.3105096677226	291.9842245930836	-67	21/02/24 15:47:39
8	337.0569612312978	272.24137590202855	-64	21/02/24 15:47:39
24	330.2572237413254	276.8419321591195	-69	21/02/24 15:47:39
25	329.08778489613	275.87564892517275	-69	21/02/24 15:47:39
7	334.07657006354464	270.8835908324035	-65	21/02/24 15:47:39
33	361.5531569646988	270.2693072733871	-66	21/02/24 15:47:39
32	356.7839379367616	268.70688981904533	-64	21/02/24 15:47:39
31	346.4179037622539	268.10202267794875	-55	21/02/24 15:47:39
13	342.0775229118143	267.91244197819304	-60	21/02/24 15:47:39
21	334.5994402908936	265.9434918767382	-66	21/02/24 15:47:39
14	341.6082252010515	265.6547772450898	-64	21/02/24 15:47:39
20	334.99735462161357	264.77807460530994	-66	21/02/24 15:47:39

37	359.5903712498935	284.92420131943135	-69	21/02/24 15:47:40
40	360.29771601412074	275.17301637315114	-66	21/02/24 15:47:40
47	353.57917457908314	286.3943403818769	-64	21/02/24 15:47:40
22	353.27733584284437	275.76541045955213	-55	21/02/24 15:47:40
45	342.3105096677226	291.9842245930836	-70	21/02/24 15:47:40
8	337.0569612312978	272.24137590202855	-61	21/02/24 15:47:40
24	330.2572237413254	276.8419321591195	-70	21/02/24 15:47:40
25	329.08778489613	275.87564892517275	-69	21/02/24 15:47:40
7	334.07657006354464	270.8835908324035	-66	21/02/24 15:47:40
33	361.5531569646988	270.2693072733871	-65	21/02/24 15:47:40
32	356.7839379367616	268.70688981904533	-64	21/02/24 15:47:40
31	346.4179037622539	268.10202267794875	-55	21/02/24 15:47:40
13	342.0775229118143	267.91244197819304	-59	21/02/24 15:47:40
21	334.5994402908936	265.9434918767382	-68	21/02/24 15:47:40
14	341.6082252010515	265.6547772450898	-62	21/02/24 15:47:40
20	334.99735462161357	264.77807460530994	-69	21/02/24 15:47:40

37	359.5903712498935	284.92420131943135	-69	21/02/24 15:47:41
40	360.29771601412074	275.17301637315114	-65	21/02/24 15:47:41
47	353.57917457908314	286.3943403818769	-67	21/02/24 15:47:41
22	353.27733584284437	275.76541045955213	-54	21/02/24 15:47:41
45	342.3105096677226	291.9842245930836	-70	21/02/24 15:47:41
8	337.0569612312978	272.24137590202855	-62	21/02/24 15:47:41
24	330.2572237413254	276.8419321591195	-67	21/02/24 15:47:41
25	329.08778489613	275.87564892517275	-71	21/02/24 15:47:41
7	334.07657006354464	270.8835908324035	-66	21/02/24 15:47:41
33	361.5531569646988	270.2693072733871	-68	21/02/24 15:47:41
32	356.7839379367616	268.70688981904533	-62	21/02/24 15:47:41
31	346.4179037622539	268.10202267794875	-55	21/02/24 15:47:41
13	342.0775229118143	267.91244197819304	-59	21/02/24 15:47:41
21	334.5994402908936	265.9434918767382	-68	21/02/24 15:47:41
14	341.6082252010515	265.6547772450898	-60	21/02/24 15:47:41
20	334.99735462161357	264.77807460530994	-68	21/02/24 15:47:41

37	359.5903712498935	284.92420131943135	-69	21/02/24 15:47:42
40	360.29771601412074	275.17301637315114	-67	21/02/24 15:47:42
47	353.57917457908314	286.3943403818769	-67	21/02/24 15:47:42
22	353.27733584284437	275.76541045955213	-57	21/02/24 15:47:42
45	342.3105096677226	291.9842245930836	-68	21/02/24 15:47:42
46	340.76419739931424	294.4321023101609	-71	21/02/24 15:47:42
8	337.0569612312978	272.24137590202855	-61	21/02/24 15:47:42
24	330.2572237413254	276.8419321591195	-68	21/02/24 15:47:42
25	329.08778489613	275.87564892517275	-70	21/02/24 15:47:42
7	334.07657006354464	270.8835908324035	-65	21/02/24 15:47:42
33	361.5531569646988	270.2693072733871	-67	21/02/24 15:47:42
32	356.7839379367616	268.70688981904533	-65	21/02/24 15:47:42
30	327.70079256672074	268.3508487639297	-72	21/02/24 15:47:42
31	346.4179037622539	268.10202267794875	-57	21/02/24 15:47:42
13	342.0775229118143	267.91244197819304	-58	21/02/24 15:47:42
21	334.5994402908936	265.9434918767382	-68	21/02/24 15:47:42
14	341.6082252010515	265.6547772450898	-62	21/02/24 15:47:42
20	334.99735462161357	264.77807460530994	-66	21/02/24 15:47:42

37	359.5903712498935	284.92420131943135	-67	21/02/24 15:47:43
40	360.29771601412074	275.17301637315114	-67	21/02/24 15:47:43
47	353.57917457908314	286.3943403818769	-68	21/02/24 15:47:43
22	353.27733584284437	275.76541045955213	-61	21/02/24 15:47:43
45	342.3105096677226	291.9842245930836	-66	21/02/24 15:47:43
46	340.76419739931424	294.4321023101609	-69	21/02/24 15:47:43
8	337.0569612312978	272.24137590202855	-60	21/02/24 15:47:43
24	330.2572237413254	276.8419321591195	-66	21/02/24 15:47:43
25	329.08778489613	275.87564892517275	-68	21/02/24 15:47:43
11	327.4246457091771	282.6323525733639	-67	21/02/24 15:47:43
7	334.07657006354464	270.8835908324035	-63	21/02/24 15:47:43
33	361.5531569646988	270.2693072733871	-69	21/02/24 15:47:43
32	356.7839379367616	268.70688981904533	-67	21/02/24 15:47:43
30	327.70079256672074	268.3508487639297	-68	21/02/24 15:47:43
31	346.4179037622539	268.10202267794875	-60	21/02/24 15:47:43
13	342.0775229118143	267.91244197819304	-61	21/02/24 15:47:43
21	334.5994402908936	265.9434918767382	-64	21/02/24 15:47:43
14	341.6082252010515	265.6547772450898	-61	21/02/24 15:47:43
20	334.99735462161357	264.77807460530994	-66	21/02/24 15:47:43

37	359.5903712498935	284.92420131943135	-68	21/02/24 15:47:44
40	360.29771601412074	275.17301637315114	-71	21/02/24 15:47:44
47	353.57917457908314	286.3943403818769	-68	21/02/24 15:47:44
22	353.27733584284437	275.76541045955213	-62	21/02/24 15:47:44
45	342.3105096677226	291.9842245930836	-66	21/02/24 15:47:44
46	340.76419739931424	294.4321023101609	-69	21/02/24 15:47:44
8	337.0569612312978	272.24137590202855	-57	21/02/24 15:47:44
24	330.2572237413254	276.8419321591195	-64	21/02/24 15:47:44
25	329.08778489613	275.87564892517275	-64	21/02/24 15:47:44
16	327.98603409324727	290.8054485105832	-69	21/02/24 15:47:44
11	327.4246457091771	282.6323525733639	-66	21/02/24 15:47:44
7	334.07657006354464	270.8835908324035	-59	21/02/24 15:47:44
32	356.7839379367616	268.70688981904533	-68	21/02/24 15:47:44
30	327.70079256672074	268.3508487639297	-70	21/02/24 15:47:44
31	346.4179037622539	268.10202267794875	-63	21/02/24 15:47:44
13	342.0775229118143	267.91244197819304	-59	21/02/24 15:47:44
21	334.5994402908936	265.9434918767382	-64	21/02/24 15:47:44
14	341.6082252010515	265.6547772450898	-63	21/02/24 15:47:44
20	334.99735462161357	264.77807460530994	-68	21/02/24 15:47:44
23	323.42288358729223	275.8341630458992	-71	21/02/24 15:47:44

47	353.57917457908314	286.3943403818769	-67	21/02/24 15:47:45
22	353.27733584284437	275.76541045955213	-65	21/02/24 15:47:45
45	342.3105096677226	291.9842245930836	-68	21/02/24 15:47:45
46	340.76419739931424	294.4321023101609	-69	21/02/24 15:47:45
8	337.0569612312978	272.24137590202855	-54	21/02/24 15:47:45
24	330.2572237413254	276.8419321591195	-60	21/02/24 15:47:45
25	329.08778489613	275.87564892517275	-61	21/02/24 15:47:45
16	327.98603409324727	290.8054485105832	-70	21/02/24 15:47:45
11	327.4246457091771	282.6323525733639	-66	21/02/24 15:47:45
7	334.07657006354464	270.8835908324035	-61	21/02/24 15:47:45
32	356.7839379367616	268.70688981904533	-70	21/02/24 15:47:45
30	327.70079256672074	268.3508487639297	-69	21/02/24 15:47:45
31	346.4179037622539	268.10202267794875	-64	21/02/24 15:47:45
13	342.0775229118143	267.91244197819304	-61	21/02/24 15:47:45
21	334.5994402908936	265.9434918767382	-65	21/02/24 15:47:45
14	341.6082252010515	265.6547772450898	-66	21/02/24 15:47:45
20	334.99735462161357	264.77807460530994	-65	21/02/24 15:47:45
29	324.8804385762518	264.6870431160569	-71	21/02/24 15:47:45
23	323.42288358729223	275.8341630458992	-68	21/02/24 15:47:45
10	321.1177375667231	282.04747788327467	-70	21/02/24 15:47:45

47	353.57917457908314	286.3943403818769	-70	21/02/24 15:47:46
22	353.27733584284437	275.76541045955213	-67	21/02/24 15:47:46
45	342.3105096677226	291.9842245930836	-66	21/02/24 15:47:46
46	340.76419739931424	294.4321023101609	-67	21/02/24 15:47:46
8	337.0569612312978	272.24137590202855	-57	21/02/24 15:47:46
24	330.2572237413254	276.8419321591195	-58	21/02/24 15:47:46
25	329.08778489613	275.87564892517275	-62	21/02/24 15:47:46
16	327.98603409324727	290.8054485105832	-68	21/02/24 15:47:46
11	327.4246457091771	282.6323525733639	-62	21/02/24 15:47:46
7	334.07657006354464	270.8835908324035	-60	21/02/24 15:47:46
30	327.70079256672074	268.3508487639297	-65	21/02/24 15:47:46
31	346.4179037622539	268.10202267794875	-65	21/02/24 15:47:46
13	342.0775229118143	267.91244197819304	-64	21/02/24 15:47:46
21	334.5994402908936	265.9434918767382	-64	21/02/24 15:47:46
14	341.6082252010515	265.6547772450898	-65	21/02/24 15:47:46
20	334.99735462161357	264.77807460530994	-68	21/02/24 15:47:46
29	324.8804385762518	264.6870431160569	-68	21/02/24 15:47:46
23	323.42288358729223	275.8341630458992	-65	21/02/24 15:47:46
10	321.1177375667231	282.04747788327467	-69	21/02/24 15:47:46
28	319.76429243151256	284.17285383094054	-70	21/02/24 15:47:46

47	353.57917457908314	286.3943403818769	-70	21/02/24 15:47:47
22	353.27733584284437	275.76541045955213	-71	21/02/24 15:47:47
45	342.3105096677226	291.9842245930836	-67	21/02/24 15:47:47
46	340.76419739931424	294.4321023101609	-67	21/02/24 15:47:47
8	337.0569612312978	272.24137590202855	-58	21/02/24 15:47:47
24	330.2572237413254	276.8419321591195	-57	21/02/24 15:47:47
25	329.08778489613	275.87564892517275	-57	21/02/24 15:47:47
16	327.98603409324727	290.8054485105832	-65	21/02/24 15:47:47
11	327.4246457091771	282.6323525733639	-59	21/02/24 15:47:47
7	334.07657006354464	270.8835908324035	-58	21/02/24 15:47:47
30	327.70079256672074	268.3508487639297	-65	21/02/24 15:47:47
31	346.4179037622539	268.10202267794875	-66	21/02/24 15:47:47
13	342.0775229118143	267.91244197819304	-65	21/02/24 15:47:47
21	334.5994402908936	265.9434918767382	-66	21/02/24 15:47:47
14	341.6082252010515	265.6547772450898	-66	21/02/24 15:47:47
20	334.99735462161357	264.77807460530994	-66	21/02/24 15:47:47
29	324.8804385762518	264.6870431160569	-70	21/02/24 15:47:47
23	323.42288358729223	275.8341630458992	-63	21/02/24 15:47:47
10	321.1177375667231	282.04747788327467	-67	21/02/24 15:47:47
28	319.76429243151256	284.17285383094054	-68	21/02/24 15:47:47

45	342.3105096677226	291.9842245930836	-65	21/02/24 15:47:48
46	340.76419739931424	294.4321023101609	-69	21/02/24 15:47:48
8	337.0569612312978	272.24137590202855	-60	21/02/24 15:47:48
24	330.2572237413254	276.8419321591195	-53	21/02/24 15:47:48
25	329.08778489613	275.87564892517275	-55	21/02/24 15:47:48
16	327.98603409324727	290.8054485105832	-64	21/02/24 15:47:48
11	327.4246457091771	282.6323525733639	-54	21/02/24 15:47:48
17	323.82998850731616	295.6841920138939	-69	21/02/24 15:47:48
7	334.07657006354464	270.8835908324035	-61	21/02/24 15:47:48
30	327.70079256672074	268.3508487639297	-64	21/02/24 15:47:48
31	346.4179037622539	268.10202267794875	-68	21/02/24 15:47:48
13	342.0775229118143	267.91244197819304	-66	21/02/24 15:47:48
21	334.5994402908936	265.9434918767382	-65	21/02/24 15:47:48
14	341.6082252010515	265.6547772450898	-70	21/02/24 15:47:48
20	334.99735462161357	264.77807460530994	-67	21/02/24 15:47:48
29	324.8804385762518	264.6870431160569	-71	21/02/24 15:47:48
23	323.42288358729223	275.8341630458992	-64	21/02/24 15:47:48
10	321.1177375667231	282.04747788327467	-64	21/02/24 15:47:48
28	319.76429243151256	284.17285383094054	-68	21/02/24 15:47:48
38	316.1636107796155	284.5723838925019	-71	21/02/24 15:47:48

45	342.3105096677226	291.9842245930836	-66	21/02/24 15:47:49
46	340.76419739931424	294.4321023101609	-66	21/02/24 15:47:49
8	337.0569612312978	272.24137590202855	-64	21/02/24 15:47:49
24	330.2572237413254	276.8419321591195	-50	21/02/24 15:47:49
25	329.08778489613	275.87564892517275	-53	21/02/24 15:47:49
16	327.98603409324727	290.8054485105832	-63	21/02/24 15:47:49
11	327.4246457091771	282.6323525733639	-52	21/02/24 15:47:49
17	323.82998850731616	295.6841920138939	-67	21/02/24 15:47:49
7	334.07657006354464	270.8835908324035	-63	21/02/24 15:47:49
30	327.70079256672074	268.3508487639297	-65	21/02/24 15:47:49
31	346.4179037622539	268.10202267794875	-72	21/02/24 15:47:49
13	342.0775229118143	267.91244197819304	-68	21/02/24 15:47:49
21	334.5994402908936	265.9434918767382	-66	21/02/24 15:47:49
14	341.6082252010515	265.6547772450898	-70	21/02/24 15:47:49
20	334.99735462161357	264.77807460530994	-67	21/02/24 15:47:49
29	324.8804385762518	264.6870431160569	-69	21/02/24 15:47:49
23	323.42288358729223	275.8341630458992	-63	21/02/24 15:47:49
10	321.1177375667231	282.04747788327467	-62	21/02/24 15:47:49
28	319.76429243151256	284.17285383094054	-64	21/02/24 15:47:49
38	316.1636107796155	284.5723838925019	-69	21/02/24 15:47:49

45	342.3105096677226	291.9842245930836	-68	21/02/24 15:47:50
46	340.76419739931424	294.4321023101609	-69	21/02/24 15:47:50
8	337.0569612312978	272.24137590202855	-66	21/02/24 15:47:50
24	330.2572237413254	276.8419321591195	-54	21/02/24 15:47:50
25	329.08778489613	275.87564892517275	-57	21/02/24 15:47:50
16	327.98603409324727	290.8054485105832	-61	21/02/24 15:47:50
11	327.4246457091771	282.6323525733639	-41	21/02/24 15:47:50
17	323.82998850731616	295.6841920138939	-68	21/02/24 15:47:50
7	334.07657006354464	270.8835908324035	-63	21/02/24 15:47:50
30	327.70079256672074	268.3508487639297	-67	21/02/24 15:47:50
13	342.0775229118143	267.91244197819304	-69	21/02/24 15:47:50
21	334.5994402908936	265.9434918767382	-67	21/02/24 15:47:50
20	334.99735462161357	264.77807460530994	-67	21/02/24 15:47:50
29	324.8804385762518	264.6870431160569	-68	21/02/24 15:47:50
23	323.42288358729223	275.8341630458992	-61	21/02/24 15:47:50
15	321.20664919882535	299.5482975369317	-71	21/02/24 15:47:50
10	321.1177375667231	282.04747788327467	-59	21/02/24 15:47:50
28	319.76429243151256	284.17285383094054	-60	21/02/24 15:47:50
38	316.1636107796155	284.5723838925019	-66	21/02/24 15:47:50

45	342.3105096677226	291.9842245930836	-70	21/02/24 15:47:51
46	340.76419739931424	294.4321023101609	-70	21/02/24 15:47:51
8	337.0569612312978	272.24137590202855	-66	21/02/24 15:47:51
24	330.2572237413254	276.8419321591195	-56	21/02/24 15:47:51
25	329.08778489613	275.87564892517275	-55	21/02/24 15:47:51
16	327.98603409324727	290.8054485105832	-61	21/02/24 15:47:51
11	327.4246457091771	282.6323525733639	-25	21/02/24 15:47:51
17	323.82998850731616	295.6841920138939	-66	21/02/24 15:47:51
7	334.07657006354464	270.8835908324035	-65	21/02/24 15:47:51
30	327.70079256672074	268.3508487639297	-67	21/02/24 15:47:51
21	334.5994402908936	265.9434918767382	-71	21/02/24 15:47:51
20	334.99735462161357	264.77807460530994	-69	21/02/24 15:47:51
29	324.8804385762518	264.6870431160569	-69	21/02/24 15:47:51
23	323.42288358729223	275.8341630458992	-59	21/02/24 15:47:51
15	321.20664919882535	299.5482975369317	-71	21/02/24 15:47:51
10	321.1177375667231	282.04747788327467	-56	21/02/24 15:47:51
28	319.76429243151256	284.17285383094054	-61	21/02/24 15:47:51
38	316.1636107796155	284.5723838925019	-64	21/02/24 15:47:51
42	315.6556041264745	266.0029600774402	-69	21/02/24 15:47:51
39	309.2997043904728	289.36813114546595	-71	21/02/24 15:47:51

45	342.3105096677226	291.9842245930836	-71	21/02/24 15:47:52
46	340.76419739931424	294.4321023101609	-72	21/02/24 15:47:52
8	337.0569612312978	272.24137590202855	-66	21/02/24 15:47:52
24	330.2572237413254	276.8419321591195	-57	21/02/24 15:47:52
25	329.08778489613	275.87564892517275	-59	21/02/24 15:47:52
16	327.98603409324727	290.8054485105832	-61	21/02/24 15:47:52
11	327.4246457091771	282.6323525733639	-40	21/02/24 15:47:52
17	323.82998850731616	295.6841920138939	-66	21/02/24 15:47:52
7	334.07657006354464	270.8835908324035	-66	21/02/24 15:47:52
30	327.70079256672074	268.3508487639297	-66	21/02/24 15:47:52
21	334.5994402908936	265.9434918767382	-70	21/02/24 15:47:52
20	334.99735462161357	264.77807460530994	-70	21/02/24 15:47:52
29	324.8804385762518	264.6870431160569	-67	21/02/24 15:47:52
23	323.42288358729223	275.8341630458992	-56	21/02/24 15:47:52
15	321.20664919882535	299.5482975369317	-69	21/02/24 15:47:52
10	321.1177375667231	282.04747788327467	-51	21/02/24 15:47:52
28	319.76429243151256	284.17285383094054	-53	21/02/24 15:47:52
38	316.1636107796155	284.5723838925019	-60	21/02/24 15:47:52
42	315.6556041264745	266.0029600774402	-70	21/02/24 15:47:52
39	309.2997043904728	289.36813114546595	-69	21/02/24 15:47:52
44	307.83683034460904	277.09769127798097	-70	21/02/24 15:47:52

8	337.0569612312978	272.24137590202855	-68	21/02/24 15:47:53
24	330.2572237413254	276.8419321591195	-59	21/02/24 15:47:53
25	329.08778489613	275.87564892517275	-58	21/02/24 15:47:53
16	327.98603409324727	290.8054485105832	-62	21/02/24 15:47:53
11	327.4246457091771	282.6323525733639	-51	21/02/24 15:47:53
17	323.82998850731616	295.6841920138939	-64	21/02/24 15:47:53
7	334.07657006354464	270.8835908324035	-66	21/02/24 15:47:53
30	327.70079256672074	268.3508487639297	-65	21/02/24 15:47:53
21	334.5994402908936	265.9434918767382	-69	21/02/24 15:47:53
29	324.8804385762518	264.6870431160569	-68	21/02/24 15:47:53
23	323.42288358729223	275.8341630458992	-57	21/02/24 15:47:53
15	321.20664919882535	299.5482975369317	-68	21/02/24 15:47:53
10	321.1177375667231	282.04747788327467	-41	21/02/24 15:47:53
28	319.76429243151256	284.17285383094054	-50	21/02/24 15:47:53
38	316.1636107796155	284.5723838925019	-57	21/02/24 15:47:53
42	315.6556041264745	266.0029600774402	-70	21/02/24 15:47:53
39	309.2997043904728	289.36813114546595	-67	21/02/24 15:47:53
44	307.83683034460904	277.09769127798097	-67	21/02/24 15:47:53
18	305.6388344486073	288.8275841605686	-68	21/02/24 15:47:53

8	337.0569612312978	272.24137590202855	-71	21/02/24 15:47:54
24	330.2572237413254	276.8419321591195	-61	21/02/24 15:47:54
25	329.08778489613	275.87564892517275	-61	21/02/24 15:47:54
16	327.98603409324727	290.8054485105832	-64	21/02/24 15:47:54
11	327.4246457091771	282.6323525733639	-55	21/02/24 15:47:54
17	323.82998850731616	295.6841920138939	-66	21/02/24 15:47:54
7	334.07657006354464	270.8835908324035	-67	21/02/24 15:47:54
30	327.70079256672074	268.3508487639297	-68	21/02/24 15:47:54
29	324.8804385762518	264.6870431160569	-69	21/02/24 15:47:54
23	323.42288358729223	275.8341630458992	-56	21/02/24 15:47:54
15	321.20664919882535	299.5482975369317	-70	21/02/24 15:47:54
10	321.1177375667231	282.04747788327467	-20	21/02/24 15:47:54
28	319.76429243151256	284.17285383094054	-40	21/02/24 15:47:54
38	316.1636107796155	284.5723838925019	-54	21/02/24 15:47:54
42	315.6556041264745	266.0029600774402	-71	21/02/24 15:47:54
39	309.2997043904728	289.36813114546595	-67	21/02/24 15:47:54
44	307.83683034460904	277.09769127798097	-66	21/02/24 15:47:54
18	305.6388344486073	288.8275841605686	-67	21/02/24 15:47:54

24	330.2572237413254	276.8419321591195	-66	21/02/24 15:47:55
25	329.08778489613	275.87564892517275	-63	21/02/24 15:47:55
16	327.98603409324727	290.8054485105832	-65	21/02/24 15:47:55
11	327.4246457091771	282.6323525733639	-59	21/02/24 15:47:55
17	323.82998850731616	295.6841920138939	-65	21/02/24 15:47:55
7	334.07657006354464	270.8835908324035	-70	21/02/24 15:47:55
30	327.70079256672074	268.3508487639297	-67	21/02/24 15:47:55
29	324.8804385762518	264.6870431160569	-69	21/02/24 15:47:55
23	323.42288358729223	275.8341630458992	-56	21/02/24 15:47:55
15	321.20664919882535	299.5482975369317	-69	21/02/24 15:47:55
10	321.1177375667231	282.04747788327467	-38	21/02/24 15:47:55
28	319.76429243151256	284.17285383094054	-40	21/02/24 15:47:55
38	316.1636107796155	284.5723838925019	-48	21/02/24 15:47:55
42	315.6556041264745	266.0029600774402	-69	21/02/24 15:47:55
43	309.60031010266727	265.8998943182024	-72	21/02/24 15:47:55
39	309.2997043904728	289.36813114546595	-62	21/02/24 15:47:55
44	307.83683034460904	277.09769127798097	-64	21/02/24 15:47:55
18	305.6388344486073	288.8275841605686	-68	21/02/24 15:47:55

24	330.2572237413254	276.8419321591195	-65	21/02/24 15:47:56
25	329.08778489613	275.87564892517275	-65	21/02/24 15:47:56
16	327.98603409324727	290.8054485105832	-64	21/02/24 15:47:56
11	327.4246457091771	282.6323525733639	-62	21/02/24 15:47:56
17	323.82998850731616	295.6841920138939	-68	21/02/24 15:47:56
30	327.70079256672074	268.3508487639297	-67	21/02/24 15:47:56
29	324.8804385762518	264.6870431160569	-70	21/02/24 15:47:56
23	323.42288358729223	275.8341630458992	-60	21/02/24 15:47:56
15	321.20664919882535	299.5482975369317	-67	21/02/24 15:47:56
10	321.1177375667231	282.04747788327467	-49	21/02/24 15:47:56
28	319.76429243151256	284.17285383094054	-46	21/02/24 15:47:56
38	316.1636107796155	284.5723838925019	-42	21/02/24 15:47:56
42	315.6556041264745	266.0029600774402	-68	21/02/24 15:47:56
43	309.60031010266727	265.8998943182024	-70	21/02/24 15:47:56
39	309.2997043904728	289.36813114546595	-62	21/02/24 15:47:56
44	307.83683034460904	277.09769127798097	-61	21/02/24 15:47:56
18	305.6388344486073	288.8275841605686	-63	21/02/24 15:47:56

24	330.2572237413254	276.8419321591195	-66	21/02/24 15:47:57
25	329.08778489613	275.87564892517275	-68	21/02/24 15:47:57
16	327.98603409324727	290.8054485105832	-67	21/02/24 15:47:57
11	327.4246457091771	282.6323525733639	-63	21/02/24 15:47:57
17	323.82998850731616	295.6841920138939	-65	21/02/24 15:47:57
30	327.70079256672074	268.3508487639297	-70	21/02/24 15:47:57
23	323.42288358729223	275.8341630458992	-61	21/02/24 15:47:57
15	321.20664919882535	299.5482975369317	-68	21/02/24 15:47:57
10	321.1177375667231	282.04747788327467	-57	21/02/24 15:47:57
28	319.76429243151256	284.17285383094054	-50	21/02/24 15:47:57
38	316.1636107796155	284.5723838925019	-39	21/02/24 15:47:57
42	315.6556041264745	266.0029600774402	-68	21/02/24 15:47:57
43	309.60031010266727	265.8998943182024	-70	21/02/24 15:47:57
39	309.2997043904728	289.36813114546595	-60	21/02/24 15:47:57
44	307.83683034460904	277.09769127798097	-59	21/02/24 15:47:57
18	305.6388344486073	288.8275841605686	-65	21/02/24 15:47:57

24	330.2572237413254	276.8419321591195	-69	21/02/24 15:47:58
25	329.08778489613	275.87564892517275	-67	21/02/24 15:47:58
16	327.98603409324727	290.8054485105832	-65	21/02/24 15:47:58
11	327.4246457091771	282.6323525733639	-66	21/02/24 15:47:58
17	323.82998850731616	295.6841920138939	-68	21/02/24 15:47:58
23	323.42288358729223	275.8341630458992	-63	21/02/24 15:47:58
15	321.20664919882535	299.5482975369317	-69	21/02/24 15:47:58
10	321.1177375667231	282.04747788327467	-57	21/02/24 15:47:58
28	319.76429243151256	284.17285383094054	-55	21/02/24 15:47:58
38	316.1636107796155	284.5723838925019	-42	21/02/24 15:47:58
42	315.6556041264745	266.0029600774402	-69	21/02/24 15:47:58
43	309.60031010266727	265.8998943182024	-71	21/02/24 15:47:58
39	309.2997043904728	289.36813114546595	-56	21/02/24 15:47:58
44	307.83683034460904	277.09769127798097	-59	21/02/24 15:47:58
18	305.6388344486073	288.8275841605686	-62	21/02/24 15:47:58

24	330.2572237413254	276.8419321591195	-69	21/02/24 15:47:59
25	329.08778489613	275.87564892517275	-68	21/02/24 15:47:59
16	327.98603409324727	290.8054485105832	-67	21/02/24 15:47:59
11	327.4246457091771	282.6323525733639	-64	21/02/24 15:47:59
17	323.82998850731616	295.6841920138939	-67	21/02/24 15:47:59
23	323.42288358729223	275.8341630458992	-66	21/02/24 15:47:59
15	321.20664919882535	299.5482975369317	-68	21/02/24 15:47:59
10	321.1177375667231	282.04747788327467	-59	21/02/24 15:47:59
28	319.76429243151256	284.17285383094054	-54	21/02/24 15:47:59
38	316.1636107796155	284.5723838925019	-39	21/02/24 15:47:59
42	315.6556041264745	266.0029600774402	-71	21/02/24 15:47:59
43	309.60031010266727	265.8998943182024	-70	21/02/24 15:47:59
39	309.2997043904728	289.36813114546595	-56	21/02/24 15:47:59
44	307.83683034460904	277.09769127798097	-63	21/02/24 15:47:59
18	305.6388344486073	288.8275841605686	-63	21/02/24 15:47:59

