floorId	partitionId	location_x	location_y	timeStamp
20	903	326.2277545593437	264.93722518722115	21/02/21 12:24:02
20	903	327.33038812175056	266.16871193188854	21/02/21 12:24:03
20	903	327.6380754019837	266.9902274241022	21/02/21 12:24:04
20	903	328.6124846336026	269.5720637071543	21/02/21 12:24:05
20	903	328.6124846336026	269.5720637071543	21/02/21 12:24:06
20	913	331.2453502405629	264.72849209942825	21/02/21 12:24:07
20	913	334.7105270463214	264.7624571054217	21/02/21 12:24:08
20	971	340.1871973011652	265.61077842202786	21/02/21 12:24:09
20	925	344.24854272370027	267.70814532683374	21/02/21 12:24:10
20	967	345.62598948586157	269.4194065703784	21/02/21 12:24:11
20	967	345.62598948586157	269.4194065703784	21/02/21 12:24:12
20	967	345.62598948586157	269.4194065703784	21/02/21 12:24:13
