deviceId	device_location_x	device_location_y	rssi_measurement	timeStamp
8	337.0569612312978	272.24137590202855	-66	21/02/24 15:47:21
24	330.2572237413254	276.8419321591195	-57	21/02/24 15:47:21
25	329.08778489613	275.87564892517275	-54	21/02/24 15:47:21
16	327.98603409324727	290.8054485105832	-65	21/02/24 15:47:21
11	327.4246457091771	282.6323525733639	-56	21/02/24 15:47:21
17	323.82998850731616	295.6841920138939	-70	21/02/24 15:47:21
7	334.07657006354464	270.8835908324035	-66	21/02/24 15:47:21
30	327.70079256672074	268.3508487639297	-62	21/02/24 15:47:21
21	334.5994402908936	265.9434918767382	-69	21/02/24 15:47:21
20	334.99735462161357	264.77807460530994	-68	21/02/24 15:47:21
29	324.8804385762518	264.6870431160569	-64	21/02/24 15:47:21
23	323.42288358729223	275.8341630458992	-41	21/02/24 15:47:21
10	321.1177375667231	282.04747788327467	-51	21/02/24 15:47:21
28	319.76429243151256	284.17285383094054	-57	21/02/24 15:47:21
38	316.1636107796155	284.5723838925019	-61	21/02/24 15:47:21
42	315.6556041264745	266.0029600774402	-68	21/02/24 15:47:21
43	309.60031010266727	265.8998943182024	-68	21/02/24 15:47:21
39	309.2997043904728	289.36813114546595	-70	21/02/24 15:47:21
44	307.83683034460904	277.09769127798097	-68	21/02/24 15:47:21

8	337.0569612312978	272.24137590202855	-65	21/02/24 15:47:22
24	330.2572237413254	276.8419321591195	-55	21/02/24 15:47:22
25	329.08778489613	275.87564892517275	-55	21/02/24 15:47:22
16	327.98603409324727	290.8054485105832	-65	21/02/24 15:47:22
11	327.4246457091771	282.6323525733639	-46	21/02/24 15:47:22
17	323.82998850731616	295.6841920138939	-69	21/02/24 15:47:22
7	334.07657006354464	270.8835908324035	-66	21/02/24 15:47:22
30	327.70079256672074	268.3508487639297	-62	21/02/24 15:47:22
21	334.5994402908936	265.9434918767382	-66	21/02/24 15:47:22
20	334.99735462161357	264.77807460530994	-68	21/02/24 15:47:22
29	324.8804385762518	264.6870431160569	-68	21/02/24 15:47:22
23	323.42288358729223	275.8341630458992	-51	21/02/24 15:47:22
10	321.1177375667231	282.04747788327467	-51	21/02/24 15:47:22
28	319.76429243151256	284.17285383094054	-58	21/02/24 15:47:22
38	316.1636107796155	284.5723838925019	-64	21/02/24 15:47:22
42	315.6556041264745	266.0029600774402	-67	21/02/24 15:47:22
39	309.2997043904728	289.36813114546595	-68	21/02/24 15:47:22
44	307.83683034460904	277.09769127798097	-70	21/02/24 15:47:22

45	342.3105096677226	291.9842245930836	-71	21/02/24 15:47:23
46	340.76419739931424	294.4321023101609	-71	21/02/24 15:47:23
8	337.0569612312978	272.24137590202855	-66	21/02/24 15:47:23
24	330.2572237413254	276.8419321591195	-54	21/02/24 15:47:23
25	329.08778489613	275.87564892517275	-52	21/02/24 15:47:23
16	327.98603409324727	290.8054485105832	-64	21/02/24 15:47:23
11	327.4246457091771	282.6323525733639	-41	21/02/24 15:47:23
17	323.82998850731616	295.6841920138939	-67	21/02/24 15:47:23
7	334.07657006354464	270.8835908324035	-63	21/02/24 15:47:23
30	327.70079256672074	268.3508487639297	-65	21/02/24 15:47:23
13	342.0775229118143	267.91244197819304	-71	21/02/24 15:47:23
21	334.5994402908936	265.9434918767382	-68	21/02/24 15:47:23
20	334.99735462161357	264.77807460530994	-68	21/02/24 15:47:23
29	324.8804385762518	264.6870431160569	-67	21/02/24 15:47:23
23	323.42288358729223	275.8341630458992	-56	21/02/24 15:47:23
15	321.20664919882535	299.5482975369317	-69	21/02/24 15:47:23
10	321.1177375667231	282.04747788327467	-53	21/02/24 15:47:23
28	319.76429243151256	284.17285383094054	-61	21/02/24 15:47:23
38	316.1636107796155	284.5723838925019	-65	21/02/24 15:47:23
42	315.6556041264745	266.0029600774402	-70	21/02/24 15:47:23
39	309.2997043904728	289.36813114546595	-69	21/02/24 15:47:23
44	307.83683034460904	277.09769127798097	-68	21/02/24 15:47:23

45	342.3105096677226	291.9842245930836	-68	21/02/24 15:47:24
46	340.76419739931424	294.4321023101609	-71	21/02/24 15:47:24
8	337.0569612312978	272.24137590202855	-65	21/02/24 15:47:24
24	330.2572237413254	276.8419321591195	-52	21/02/24 15:47:24
25	329.08778489613	275.87564892517275	-53	21/02/24 15:47:24
16	327.98603409324727	290.8054485105832	-63	21/02/24 15:47:24
11	327.4246457091771	282.6323525733639	-44	21/02/24 15:47:24
17	323.82998850731616	295.6841920138939	-68	21/02/24 15:47:24
7	334.07657006354464	270.8835908324035	-64	21/02/24 15:47:24
30	327.70079256672074	268.3508487639297	-65	21/02/24 15:47:24
13	342.0775229118143	267.91244197819304	-69	21/02/24 15:47:24
21	334.5994402908936	265.9434918767382	-67	21/02/24 15:47:24
14	341.6082252010515	265.6547772450898	-70	21/02/24 15:47:24
20	334.99735462161357	264.77807460530994	-67	21/02/24 15:47:24
29	324.8804385762518	264.6870431160569	-67	21/02/24 15:47:24
23	323.42288358729223	275.8341630458992	-58	21/02/24 15:47:24
10	321.1177375667231	282.04747788327467	-60	21/02/24 15:47:24
28	319.76429243151256	284.17285383094054	-63	21/02/24 15:47:24
38	316.1636107796155	284.5723838925019	-64	21/02/24 15:47:24

45	342.3105096677226	291.9842245930836	-66	21/02/24 15:47:25
46	340.76419739931424	294.4321023101609	-69	21/02/24 15:47:25
8	337.0569612312978	272.24137590202855	-62	21/02/24 15:47:25
24	330.2572237413254	276.8419321591195	-53	21/02/24 15:47:25
25	329.08778489613	275.87564892517275	-53	21/02/24 15:47:25
16	327.98603409324727	290.8054485105832	-61	21/02/24 15:47:25
11	327.4246457091771	282.6323525733639	-52	21/02/24 15:47:25
17	323.82998850731616	295.6841920138939	-69	21/02/24 15:47:25
7	334.07657006354464	270.8835908324035	-61	21/02/24 15:47:25
30	327.70079256672074	268.3508487639297	-66	21/02/24 15:47:25
31	346.4179037622539	268.10202267794875	-69	21/02/24 15:47:25
13	342.0775229118143	267.91244197819304	-68	21/02/24 15:47:25
21	334.5994402908936	265.9434918767382	-66	21/02/24 15:47:25
14	341.6082252010515	265.6547772450898	-69	21/02/24 15:47:25
20	334.99735462161357	264.77807460530994	-68	21/02/24 15:47:25
29	324.8804385762518	264.6870431160569	-69	21/02/24 15:47:25
23	323.42288358729223	275.8341630458992	-61	21/02/24 15:47:25
10	321.1177375667231	282.04747788327467	-64	21/02/24 15:47:25
28	319.76429243151256	284.17285383094054	-64	21/02/24 15:47:25
38	316.1636107796155	284.5723838925019	-69	21/02/24 15:47:25

45	342.3105096677226	291.9842245930836	-67	21/02/24 15:47:26
46	340.76419739931424	294.4321023101609	-68	21/02/24 15:47:26
8	337.0569612312978	272.24137590202855	-60	21/02/24 15:47:26
24	330.2572237413254	276.8419321591195	-54	21/02/24 15:47:26
25	329.08778489613	275.87564892517275	-58	21/02/24 15:47:26
16	327.98603409324727	290.8054485105832	-62	21/02/24 15:47:26
11	327.4246457091771	282.6323525733639	-56	21/02/24 15:47:26
17	323.82998850731616	295.6841920138939	-71	21/02/24 15:47:26
7	334.07657006354464	270.8835908324035	-63	21/02/24 15:47:26
30	327.70079256672074	268.3508487639297	-67	21/02/24 15:47:26
31	346.4179037622539	268.10202267794875	-67	21/02/24 15:47:26
13	342.0775229118143	267.91244197819304	-65	21/02/24 15:47:26
21	334.5994402908936	265.9434918767382	-66	21/02/24 15:47:26
14	341.6082252010515	265.6547772450898	-68	21/02/24 15:47:26
20	334.99735462161357	264.77807460530994	-66	21/02/24 15:47:26
29	324.8804385762518	264.6870431160569	-71	21/02/24 15:47:26
23	323.42288358729223	275.8341630458992	-62	21/02/24 15:47:26
10	321.1177375667231	282.04747788327467	-65	21/02/24 15:47:26
28	319.76429243151256	284.17285383094054	-67	21/02/24 15:47:26
38	316.1636107796155	284.5723838925019	-68	21/02/24 15:47:26

47	353.57917457908314	286.3943403818769	-70	21/02/24 15:47:27
22	353.27733584284437	275.76541045955213	-68	21/02/24 15:47:27
45	342.3105096677226	291.9842245930836	-65	21/02/24 15:47:27
46	340.76419739931424	294.4321023101609	-66	21/02/24 15:47:27
8	337.0569612312978	272.24137590202855	-60	21/02/24 15:47:27
24	330.2572237413254	276.8419321591195	-57	21/02/24 15:47:27
25	329.08778489613	275.87564892517275	-61	21/02/24 15:47:27
16	327.98603409324727	290.8054485105832	-63	21/02/24 15:47:27
11	327.4246457091771	282.6323525733639	-59	21/02/24 15:47:27
17	323.82998850731616	295.6841920138939	-70	21/02/24 15:47:27
7	334.07657006354464	270.8835908324035	-62	21/02/24 15:47:27
30	327.70079256672074	268.3508487639297	-67	21/02/24 15:47:27
31	346.4179037622539	268.10202267794875	-67	21/02/24 15:47:27
13	342.0775229118143	267.91244197819304	-66	21/02/24 15:47:27
21	334.5994402908936	265.9434918767382	-68	21/02/24 15:47:27
14	341.6082252010515	265.6547772450898	-68	21/02/24 15:47:27
20	334.99735462161357	264.77807460530994	-68	21/02/24 15:47:27
23	323.42288358729223	275.8341630458992	-65	21/02/24 15:47:27
10	321.1177375667231	282.04747788327467	-66	21/02/24 15:47:27
28	319.76429243151256	284.17285383094054	-69	21/02/24 15:47:27

47	353.57917457908314	286.3943403818769	-69	21/02/24 15:47:28
22	353.27733584284437	275.76541045955213	-68	21/02/24 15:47:28
45	342.3105096677226	291.9842245930836	-63	21/02/24 15:47:28
46	340.76419739931424	294.4321023101609	-65	21/02/24 15:47:28
8	337.0569612312978	272.24137590202855	-62	21/02/24 15:47:28
24	330.2572237413254	276.8419321591195	-61	21/02/24 15:47:28
25	329.08778489613	275.87564892517275	-62	21/02/24 15:47:28
16	327.98603409324727	290.8054485105832	-65	21/02/24 15:47:28
11	327.4246457091771	282.6323525733639	-61	21/02/24 15:47:28
7	334.07657006354464	270.8835908324035	-64	21/02/24 15:47:28
30	327.70079256672074	268.3508487639297	-69	21/02/24 15:47:28
31	346.4179037622539	268.10202267794875	-68	21/02/24 15:47:28
13	342.0775229118143	267.91244197819304	-67	21/02/24 15:47:28
21	334.5994402908936	265.9434918767382	-69	21/02/24 15:47:28
14	341.6082252010515	265.6547772450898	-68	21/02/24 15:47:28
20	334.99735462161357	264.77807460530994	-70	21/02/24 15:47:28
23	323.42288358729223	275.8341630458992	-68	21/02/24 15:47:28
10	321.1177375667231	282.04747788327467	-69	21/02/24 15:47:28
28	319.76429243151256	284.17285383094054	-69	21/02/24 15:47:28

37	359.5903712498935	284.92420131943135	-69	21/02/24 15:47:29
47	353.57917457908314	286.3943403818769	-68	21/02/24 15:47:29
22	353.27733584284437	275.76541045955213	-67	21/02/24 15:47:29
45	342.3105096677226	291.9842245930836	-62	21/02/24 15:47:29
46	340.76419739931424	294.4321023101609	-65	21/02/24 15:47:29
8	337.0569612312978	272.24137590202855	-63	21/02/24 15:47:29
24	330.2572237413254	276.8419321591195	-63	21/02/24 15:47:29
25	329.08778489613	275.87564892517275	-66	21/02/24 15:47:29
16	327.98603409324727	290.8054485105832	-68	21/02/24 15:47:29
11	327.4246457091771	282.6323525733639	-66	21/02/24 15:47:29
7	334.07657006354464	270.8835908324035	-63	21/02/24 15:47:29
30	327.70079256672074	268.3508487639297	-68	21/02/24 15:47:29
31	346.4179037622539	268.10202267794875	-67	21/02/24 15:47:29
13	342.0775229118143	267.91244197819304	-67	21/02/24 15:47:29
21	334.5994402908936	265.9434918767382	-67	21/02/24 15:47:29
14	341.6082252010515	265.6547772450898	-68	21/02/24 15:47:29
20	334.99735462161357	264.77807460530994	-70	21/02/24 15:47:29
23	323.42288358729223	275.8341630458992	-68	21/02/24 15:47:29
10	321.1177375667231	282.04747788327467	-70	21/02/24 15:47:29

37	359.5903712498935	284.92420131943135	-71	21/02/24 15:47:30
40	360.29771601412074	275.17301637315114	-72	21/02/24 15:47:30
47	353.57917457908314	286.3943403818769	-66	21/02/24 15:47:30
22	353.27733584284437	275.76541045955213	-64	21/02/24 15:47:30
45	342.3105096677226	291.9842245930836	-61	21/02/24 15:47:30
46	340.76419739931424	294.4321023101609	-63	21/02/24 15:47:30
8	337.0569612312978	272.24137590202855	-62	21/02/24 15:47:30
24	330.2572237413254	276.8419321591195	-66	21/02/24 15:47:30
25	329.08778489613	275.87564892517275	-64	21/02/24 15:47:30
16	327.98603409324727	290.8054485105832	-69	21/02/24 15:47:30
11	327.4246457091771	282.6323525733639	-67	21/02/24 15:47:30
7	334.07657006354464	270.8835908324035	-64	21/02/24 15:47:30
32	356.7839379367616	268.70688981904533	-68	21/02/24 15:47:30
30	327.70079256672074	268.3508487639297	-71	21/02/24 15:47:30
31	346.4179037622539	268.10202267794875	-67	21/02/24 15:47:30
13	342.0775229118143	267.91244197819304	-67	21/02/24 15:47:30
21	334.5994402908936	265.9434918767382	-70	21/02/24 15:47:30
14	341.6082252010515	265.6547772450898	-67	21/02/24 15:47:30
20	334.99735462161357	264.77807460530994	-69	21/02/24 15:47:30
23	323.42288358729223	275.8341630458992	-71	21/02/24 15:47:30

27	361.7760445803703	289.2690199455797	-70	21/02/24 15:47:31
37	359.5903712498935	284.92420131943135	-68	21/02/24 15:47:31
40	360.29771601412074	275.17301637315114	-70	21/02/24 15:47:31
47	353.57917457908314	286.3943403818769	-63	21/02/24 15:47:31
22	353.27733584284437	275.76541045955213	-61	21/02/24 15:47:31
45	342.3105096677226	291.9842245930836	-64	21/02/24 15:47:31
46	340.76419739931424	294.4321023101609	-65	21/02/24 15:47:31
8	337.0569612312978	272.24137590202855	-62	21/02/24 15:47:31
24	330.2572237413254	276.8419321591195	-66	21/02/24 15:47:31
25	329.08778489613	275.87564892517275	-68	21/02/24 15:47:31
16	327.98603409324727	290.8054485105832	-70	21/02/24 15:47:31
11	327.4246457091771	282.6323525733639	-67	21/02/24 15:47:31
7	334.07657006354464	270.8835908324035	-67	21/02/24 15:47:31
32	356.7839379367616	268.70688981904533	-68	21/02/24 15:47:31
31	346.4179037622539	268.10202267794875	-64	21/02/24 15:47:31
13	342.0775229118143	267.91244197819304	-64	21/02/24 15:47:31
21	334.5994402908936	265.9434918767382	-69	21/02/24 15:47:31
14	341.6082252010515	265.6547772450898	-67	21/02/24 15:47:31
20	334.99735462161357	264.77807460530994	-71	21/02/24 15:47:31

27	361.7760445803703	289.2690199455797	-69	21/02/24 15:47:32
37	359.5903712498935	284.92420131943135	-67	21/02/24 15:47:32
40	360.29771601412074	275.17301637315114	-68	21/02/24 15:47:32
47	353.57917457908314	286.3943403818769	-59	21/02/24 15:47:32
22	353.27733584284437	275.76541045955213	-60	21/02/24 15:47:32
45	342.3105096677226	291.9842245930836	-63	21/02/24 15:47:32
46	340.76419739931424	294.4321023101609	-65	21/02/24 15:47:32
8	337.0569612312978	272.24137590202855	-67	21/02/24 15:47:32
24	330.2572237413254	276.8419321591195	-69	21/02/24 15:47:32
25	329.08778489613	275.87564892517275	-71	21/02/24 15:47:32
11	327.4246457091771	282.6323525733639	-69	21/02/24 15:47:32
7	334.07657006354464	270.8835908324035	-68	21/02/24 15:47:32
33	361.5531569646988	270.2693072733871	-71	21/02/24 15:47:32
32	356.7839379367616	268.70688981904533	-66	21/02/24 15:47:32
31	346.4179037622539	268.10202267794875	-65	21/02/24 15:47:32
13	342.0775229118143	267.91244197819304	-67	21/02/24 15:47:32
21	334.5994402908936	265.9434918767382	-70	21/02/24 15:47:32
14	341.6082252010515	265.6547772450898	-69	21/02/24 15:47:32

27	361.7760445803703	289.2690199455797	-65	21/02/24 15:47:33
26	365.69275229012084	288.9526077496502	-71	21/02/24 15:47:33
37	359.5903712498935	284.92420131943135	-62	21/02/24 15:47:33
40	360.29771601412074	275.17301637315114	-65	21/02/24 15:47:33
47	353.57917457908314	286.3943403818769	-56	21/02/24 15:47:33
22	353.27733584284437	275.76541045955213	-57	21/02/24 15:47:33
45	342.3105096677226	291.9842245930836	-63	21/02/24 15:47:33
46	340.76419739931424	294.4321023101609	-66	21/02/24 15:47:33
8	337.0569612312978	272.24137590202855	-65	21/02/24 15:47:33
24	330.2572237413254	276.8419321591195	-69	21/02/24 15:47:33
7	334.07657006354464	270.8835908324035	-68	21/02/24 15:47:33
33	361.5531569646988	270.2693072733871	-69	21/02/24 15:47:33
32	356.7839379367616	268.70688981904533	-69	21/02/24 15:47:33
31	346.4179037622539	268.10202267794875	-67	21/02/24 15:47:33
13	342.0775229118143	267.91244197819304	-68	21/02/24 15:47:33
14	341.6082252010515	265.6547772450898	-71	21/02/24 15:47:33

27	361.7760445803703	289.2690199455797	-67	21/02/24 15:47:34
26	365.69275229012084	288.9526077496502	-68	21/02/24 15:47:34
9	369.1884989117563	287.5678363426809	-69	21/02/24 15:47:34
37	359.5903712498935	284.92420131943135	-59	21/02/24 15:47:34
12	371.0513379138651	279.4455722502708	-69	21/02/24 15:47:34
40	360.29771601412074	275.17301637315114	-65	21/02/24 15:47:34
47	353.57917457908314	286.3943403818769	-52	21/02/24 15:47:34
22	353.27733584284437	275.76541045955213	-56	21/02/24 15:47:34
45	342.3105096677226	291.9842245930836	-67	21/02/24 15:47:34
46	340.76419739931424	294.4321023101609	-69	21/02/24 15:47:34
8	337.0569612312978	272.24137590202855	-68	21/02/24 15:47:34
33	361.5531569646988	270.2693072733871	-68	21/02/24 15:47:34
32	356.7839379367616	268.70688981904533	-66	21/02/24 15:47:34
31	346.4179037622539	268.10202267794875	-68	21/02/24 15:47:34
13	342.0775229118143	267.91244197819304	-66	21/02/24 15:47:34
14	341.6082252010515	265.6547772450898	-69	21/02/24 15:47:34

27	361.7760445803703	289.2690199455797	-62	21/02/24 15:47:35
26	365.69275229012084	288.9526077496502	-65	21/02/24 15:47:35
9	369.1884989117563	287.5678363426809	-68	21/02/24 15:47:35
37	359.5903712498935	284.92420131943135	-59	21/02/24 15:47:35
12	371.0513379138651	279.4455722502708	-70	21/02/24 15:47:35
40	360.29771601412074	275.17301637315114	-63	21/02/24 15:47:35
47	353.57917457908314	286.3943403818769	-52	21/02/24 15:47:35
22	353.27733584284437	275.76541045955213	-53	21/02/24 15:47:35
45	342.3105096677226	291.9842245930836	-66	21/02/24 15:47:35
46	340.76419739931424	294.4321023101609	-71	21/02/24 15:47:35
8	337.0569612312978	272.24137590202855	-69	21/02/24 15:47:35
33	361.5531569646988	270.2693072733871	-65	21/02/24 15:47:35
32	356.7839379367616	268.70688981904533	-64	21/02/24 15:47:35
31	346.4179037622539	268.10202267794875	-68	21/02/24 15:47:35
13	342.0775229118143	267.91244197819304	-70	21/02/24 15:47:35
14	341.6082252010515	265.6547772450898	-70	21/02/24 15:47:35

27	361.7760445803703	289.2690199455797	-60	21/02/24 15:47:36
26	365.69275229012084	288.9526077496502	-65	21/02/24 15:47:36
9	369.1884989117563	287.5678363426809	-67	21/02/24 15:47:36
37	359.5903712498935	284.92420131943135	-52	21/02/24 15:47:36
34	374.2599083722957	283.9138922785015	-71	21/02/24 15:47:36
12	371.0513379138651	279.4455722502708	-66	21/02/24 15:47:36
40	360.29771601412074	275.17301637315114	-59	21/02/24 15:47:36
47	353.57917457908314	286.3943403818769	-53	21/02/24 15:47:36
22	353.27733584284437	275.76541045955213	-56	21/02/24 15:47:36
45	342.3105096677226	291.9842245930836	-70	21/02/24 15:47:36
46	340.76419739931424	294.4321023101609	-69	21/02/24 15:47:36
33	361.5531569646988	270.2693072733871	-65	21/02/24 15:47:36
32	356.7839379367616	268.70688981904533	-64	21/02/24 15:47:36
31	346.4179037622539	268.10202267794875	-66	21/02/24 15:47:36
13	342.0775229118143	267.91244197819304	-69	21/02/24 15:47:36

27	361.7760445803703	289.2690199455797	-59	21/02/24 15:47:37
26	365.69275229012084	288.9526077496502	-63	21/02/24 15:47:37
36	375.5585779585396	288.8705845625357	-70	21/02/24 15:47:37
35	375.6269429107988	288.30982657685854	-72	21/02/24 15:47:37
9	369.1884989117563	287.5678363426809	-64	21/02/24 15:47:37
37	359.5903712498935	284.92420131943135	-49	21/02/24 15:47:37
34	374.2599083722957	283.9138922785015	-68	21/02/24 15:47:37
41	375.39943266704637	281.4134213737185	-69	21/02/24 15:47:37
12	371.0513379138651	279.4455722502708	-66	21/02/24 15:47:37
40	360.29771601412074	275.17301637315114	-58	21/02/24 15:47:37
47	353.57917457908314	286.3943403818769	-56	21/02/24 15:47:37
22	353.27733584284437	275.76541045955213	-58	21/02/24 15:47:37
45	342.3105096677226	291.9842245930836	-71	21/02/24 15:47:37
33	361.5531569646988	270.2693072733871	-62	21/02/24 15:47:37
32	356.7839379367616	268.70688981904533	-64	21/02/24 15:47:37
31	346.4179037622539	268.10202267794875	-68	21/02/24 15:47:37

27	361.7760445803703	289.2690199455797	-55	21/02/24 15:47:38
26	365.69275229012084	288.9526077496502	-60	21/02/24 15:47:38
36	375.5585779585396	288.8705845625357	-70	21/02/24 15:47:38
35	375.6269429107988	288.30982657685854	-67	21/02/24 15:47:38
9	369.1884989117563	287.5678363426809	-63	21/02/24 15:47:38
37	359.5903712498935	284.92420131943135	-42	21/02/24 15:47:38
34	374.2599083722957	283.9138922785015	-66	21/02/24 15:47:38
41	375.39943266704637	281.4134213737185	-68	21/02/24 15:47:38
12	371.0513379138651	279.4455722502708	-64	21/02/24 15:47:38
19	377.44631063296276	276.33039616173164	-69	21/02/24 15:47:38
40	360.29771601412074	275.17301637315114	-58	21/02/24 15:47:38
47	353.57917457908314	286.3943403818769	-59	21/02/24 15:47:38
22	353.27733584284437	275.76541045955213	-59	21/02/24 15:47:38
45	342.3105096677226	291.9842245930836	-69	21/02/24 15:47:38
33	361.5531569646988	270.2693072733871	-64	21/02/24 15:47:38
32	356.7839379367616	268.70688981904533	-64	21/02/24 15:47:38
31	346.4179037622539	268.10202267794875	-69	21/02/24 15:47:38

27	361.7760445803703	289.2690199455797	-54	21/02/24 15:47:39
26	365.69275229012084	288.9526077496502	-56	21/02/24 15:47:39
36	375.5585779585396	288.8705845625357	-67	21/02/24 15:47:39
35	375.6269429107988	288.30982657685854	-65	21/02/24 15:47:39
9	369.1884989117563	287.5678363426809	-60	21/02/24 15:47:39
37	359.5903712498935	284.92420131943135	-44	21/02/24 15:47:39
34	374.2599083722957	283.9138922785015	-65	21/02/24 15:47:39
41	375.39943266704637	281.4134213737185	-67	21/02/24 15:47:39
12	371.0513379138651	279.4455722502708	-64	21/02/24 15:47:39
19	377.44631063296276	276.33039616173164	-70	21/02/24 15:47:39
40	360.29771601412074	275.17301637315114	-58	21/02/24 15:47:39
47	353.57917457908314	286.3943403818769	-62	21/02/24 15:47:39
22	353.27733584284437	275.76541045955213	-63	21/02/24 15:47:39
33	361.5531569646988	270.2693072733871	-63	21/02/24 15:47:39
32	356.7839379367616	268.70688981904533	-69	21/02/24 15:47:39

27	361.7760445803703	289.2690199455797	-49	21/02/24 15:47:40
26	365.69275229012084	288.9526077496502	-52	21/02/24 15:47:40
36	375.5585779585396	288.8705845625357	-65	21/02/24 15:47:40
35	375.6269429107988	288.30982657685854	-66	21/02/24 15:47:40
9	369.1884989117563	287.5678363426809	-57	21/02/24 15:47:40
37	359.5903712498935	284.92420131943135	-43	21/02/24 15:47:40
34	374.2599083722957	283.9138922785015	-63	21/02/24 15:47:40
41	375.39943266704637	281.4134213737185	-66	21/02/24 15:47:40
12	371.0513379138651	279.4455722502708	-62	21/02/24 15:47:40
19	377.44631063296276	276.33039616173164	-70	21/02/24 15:47:40
40	360.29771601412074	275.17301637315114	-63	21/02/24 15:47:40
47	353.57917457908314	286.3943403818769	-57	21/02/24 15:47:40
22	353.27733584284437	275.76541045955213	-65	21/02/24 15:47:40
33	361.5531569646988	270.2693072733871	-69	21/02/24 15:47:40
32	356.7839379367616	268.70688981904533	-68	21/02/24 15:47:40

27	361.7760445803703	289.2690199455797	-37	21/02/24 15:47:41
26	365.69275229012084	288.9526077496502	-51	21/02/24 15:47:41
36	375.5585779585396	288.8705845625357	-66	21/02/24 15:47:41
35	375.6269429107988	288.30982657685854	-65	21/02/24 15:47:41
9	369.1884989117563	287.5678363426809	-58	21/02/24 15:47:41
37	359.5903712498935	284.92420131943135	-48	21/02/24 15:47:41
34	374.2599083722957	283.9138922785015	-63	21/02/24 15:47:41
41	375.39943266704637	281.4134213737185	-66	21/02/24 15:47:41
12	371.0513379138651	279.4455722502708	-64	21/02/24 15:47:41
19	377.44631063296276	276.33039616173164	-71	21/02/24 15:47:41
40	360.29771601412074	275.17301637315114	-66	21/02/24 15:47:41
47	353.57917457908314	286.3943403818769	-58	21/02/24 15:47:41
22	353.27733584284437	275.76541045955213	-65	21/02/24 15:47:41
45	342.3105096677226	291.9842245930836	-70	21/02/24 15:47:41
33	361.5531569646988	270.2693072733871	-68	21/02/24 15:47:41
32	356.7839379367616	268.70688981904533	-69	21/02/24 15:47:41

27	361.7760445803703	289.2690199455797	-24	21/02/24 15:47:42
26	365.69275229012084	288.9526077496502	-50	21/02/24 15:47:42
36	375.5585779585396	288.8705845625357	-66	21/02/24 15:47:42
35	375.6269429107988	288.30982657685854	-65	21/02/24 15:47:42
9	369.1884989117563	287.5678363426809	-58	21/02/24 15:47:42
37	359.5903712498935	284.92420131943135	-55	21/02/24 15:47:42
34	374.2599083722957	283.9138922785015	-67	21/02/24 15:47:42
41	375.39943266704637	281.4134213737185	-69	21/02/24 15:47:42
12	371.0513379138651	279.4455722502708	-67	21/02/24 15:47:42
40	360.29771601412074	275.17301637315114	-65	21/02/24 15:47:42
47	353.57917457908314	286.3943403818769	-61	21/02/24 15:47:42
22	353.27733584284437	275.76541045955213	-67	21/02/24 15:47:42
45	342.3105096677226	291.9842245930836	-72	21/02/24 15:47:42
33	361.5531569646988	270.2693072733871	-72	21/02/24 15:47:42

27	361.7760445803703	289.2690199455797	-22	21/02/24 15:47:43
26	365.69275229012084	288.9526077496502	-51	21/02/24 15:47:43
36	375.5585779585396	288.8705845625357	-65	21/02/24 15:47:43
35	375.6269429107988	288.30982657685854	-66	21/02/24 15:47:43
9	369.1884989117563	287.5678363426809	-59	21/02/24 15:47:43
37	359.5903712498935	284.92420131943135	-52	21/02/24 15:47:43
34	374.2599083722957	283.9138922785015	-64	21/02/24 15:47:43
41	375.39943266704637	281.4134213737185	-67	21/02/24 15:47:43
12	371.0513379138651	279.4455722502708	-67	21/02/24 15:47:43
40	360.29771601412074	275.17301637315114	-67	21/02/24 15:47:43
47	353.57917457908314	286.3943403818769	-61	21/02/24 15:47:43
22	353.27733584284437	275.76541045955213	-67	21/02/24 15:47:43
45	342.3105096677226	291.9842245930836	-72	21/02/24 15:47:43
33	361.5531569646988	270.2693072733871	-71	21/02/24 15:47:43

27	361.7760445803703	289.2690199455797	-31	21/02/24 15:47:44
26	365.69275229012084	288.9526077496502	-48	21/02/24 15:47:44
36	375.5585779585396	288.8705845625357	-66	21/02/24 15:47:44
35	375.6269429107988	288.30982657685854	-66	21/02/24 15:47:44
9	369.1884989117563	287.5678363426809	-58	21/02/24 15:47:44
37	359.5903712498935	284.92420131943135	-53	21/02/24 15:47:44
34	374.2599083722957	283.9138922785015	-64	21/02/24 15:47:44
41	375.39943266704637	281.4134213737185	-69	21/02/24 15:47:44
12	371.0513379138651	279.4455722502708	-66	21/02/24 15:47:44
40	360.29771601412074	275.17301637315114	-69	21/02/24 15:47:44
47	353.57917457908314	286.3943403818769	-63	21/02/24 15:47:44
22	353.27733584284437	275.76541045955213	-67	21/02/24 15:47:44
33	361.5531569646988	270.2693072733871	-72	21/02/24 15:47:44

27	361.7760445803703	289.2690199455797	-31	21/02/24 15:47:45
26	365.69275229012084	288.9526077496502	-51	21/02/24 15:47:45
36	375.5585779585396	288.8705845625357	-67	21/02/24 15:47:45
35	375.6269429107988	288.30982657685854	-66	21/02/24 15:47:45
9	369.1884989117563	287.5678363426809	-58	21/02/24 15:47:45
37	359.5903712498935	284.92420131943135	-54	21/02/24 15:47:45
34	374.2599083722957	283.9138922785015	-66	21/02/24 15:47:45
41	375.39943266704637	281.4134213737185	-67	21/02/24 15:47:45
12	371.0513379138651	279.4455722502708	-66	21/02/24 15:47:45
40	360.29771601412074	275.17301637315114	-68	21/02/24 15:47:45
47	353.57917457908314	286.3943403818769	-60	21/02/24 15:47:45
22	353.27733584284437	275.76541045955213	-69	21/02/24 15:47:45
45	342.3105096677226	291.9842245930836	-70	21/02/24 15:47:45
33	361.5531569646988	270.2693072733871	-71	21/02/24 15:47:45

27	361.7760445803703	289.2690199455797	-30	21/02/24 15:47:46
26	365.69275229012084	288.9526077496502	-50	21/02/24 15:47:46
36	375.5585779585396	288.8705845625357	-66	21/02/24 15:47:46
35	375.6269429107988	288.30982657685854	-66	21/02/24 15:47:46
9	369.1884989117563	287.5678363426809	-59	21/02/24 15:47:46
37	359.5903712498935	284.92420131943135	-55	21/02/24 15:47:46
34	374.2599083722957	283.9138922785015	-65	21/02/24 15:47:46
41	375.39943266704637	281.4134213737185	-66	21/02/24 15:47:46
12	371.0513379138651	279.4455722502708	-66	21/02/24 15:47:46
40	360.29771601412074	275.17301637315114	-66	21/02/24 15:47:46
47	353.57917457908314	286.3943403818769	-59	21/02/24 15:47:46
22	353.27733584284437	275.76541045955213	-67	21/02/24 15:47:46
45	342.3105096677226	291.9842245930836	-71	21/02/24 15:47:46
33	361.5531569646988	270.2693072733871	-71	21/02/24 15:47:46

27	361.7760445803703	289.2690199455797	-30	21/02/24 15:47:47
26	365.69275229012084	288.9526077496502	-52	21/02/24 15:47:47
36	375.5585779585396	288.8705845625357	-67	21/02/24 15:47:47
35	375.6269429107988	288.30982657685854	-67	21/02/24 15:47:47
9	369.1884989117563	287.5678363426809	-60	21/02/24 15:47:47
37	359.5903712498935	284.92420131943135	-54	21/02/24 15:47:47
34	374.2599083722957	283.9138922785015	-65	21/02/24 15:47:47
41	375.39943266704637	281.4134213737185	-67	21/02/24 15:47:47
12	371.0513379138651	279.4455722502708	-64	21/02/24 15:47:47
40	360.29771601412074	275.17301637315114	-68	21/02/24 15:47:47
47	353.57917457908314	286.3943403818769	-58	21/02/24 15:47:47
22	353.27733584284437	275.76541045955213	-67	21/02/24 15:47:47
45	342.3105096677226	291.9842245930836	-69	21/02/24 15:47:47
33	361.5531569646988	270.2693072733871	-72	21/02/24 15:47:47

27	361.7760445803703	289.2690199455797	-35	21/02/24 15:47:48
26	365.69275229012084	288.9526077496502	-50	21/02/24 15:47:48
36	375.5585779585396	288.8705845625357	-67	21/02/24 15:47:48
35	375.6269429107988	288.30982657685854	-65	21/02/24 15:47:48
9	369.1884989117563	287.5678363426809	-61	21/02/24 15:47:48
37	359.5903712498935	284.92420131943135	-53	21/02/24 15:47:48
34	374.2599083722957	283.9138922785015	-67	21/02/24 15:47:48
41	375.39943266704637	281.4134213737185	-66	21/02/24 15:47:48
12	371.0513379138651	279.4455722502708	-66	21/02/24 15:47:48
40	360.29771601412074	275.17301637315114	-67	21/02/24 15:47:48
47	353.57917457908314	286.3943403818769	-61	21/02/24 15:47:48
22	353.27733584284437	275.76541045955213	-68	21/02/24 15:47:48
45	342.3105096677226	291.9842245930836	-68	21/02/24 15:47:48

27	361.7760445803703	289.2690199455797	-32	21/02/24 15:47:49
26	365.69275229012084	288.9526077496502	-50	21/02/24 15:47:49
36	375.5585779585396	288.8705845625357	-66	21/02/24 15:47:49
35	375.6269429107988	288.30982657685854	-66	21/02/24 15:47:49
9	369.1884989117563	287.5678363426809	-57	21/02/24 15:47:49
37	359.5903712498935	284.92420131943135	-56	21/02/24 15:47:49
34	374.2599083722957	283.9138922785015	-64	21/02/24 15:47:49
41	375.39943266704637	281.4134213737185	-67	21/02/24 15:47:49
12	371.0513379138651	279.4455722502708	-66	21/02/24 15:47:49
40	360.29771601412074	275.17301637315114	-69	21/02/24 15:47:49
47	353.57917457908314	286.3943403818769	-61	21/02/24 15:47:49
22	353.27733584284437	275.76541045955213	-66	21/02/24 15:47:49
45	342.3105096677226	291.9842245930836	-70	21/02/24 15:47:49

27	361.7760445803703	289.2690199455797	-31	21/02/24 15:47:50
26	365.69275229012084	288.9526077496502	-54	21/02/24 15:47:50
36	375.5585779585396	288.8705845625357	-68	21/02/24 15:47:50
35	375.6269429107988	288.30982657685854	-67	21/02/24 15:47:50
9	369.1884989117563	287.5678363426809	-59	21/02/24 15:47:50
37	359.5903712498935	284.92420131943135	-53	21/02/24 15:47:50
34	374.2599083722957	283.9138922785015	-65	21/02/24 15:47:50
41	375.39943266704637	281.4134213737185	-67	21/02/24 15:47:50
12	371.0513379138651	279.4455722502708	-66	21/02/24 15:47:50
40	360.29771601412074	275.17301637315114	-68	21/02/24 15:47:50
47	353.57917457908314	286.3943403818769	-58	21/02/24 15:47:50
22	353.27733584284437	275.76541045955213	-69	21/02/24 15:47:50
45	342.3105096677226	291.9842245930836	-68	21/02/24 15:47:50
33	361.5531569646988	270.2693072733871	-70	21/02/24 15:47:50

27	361.7760445803703	289.2690199455797	-23	21/02/24 15:47:51
26	365.69275229012084	288.9526077496502	-52	21/02/24 15:47:51
36	375.5585779585396	288.8705845625357	-65	21/02/24 15:47:51
35	375.6269429107988	288.30982657685854	-68	21/02/24 15:47:51
9	369.1884989117563	287.5678363426809	-61	21/02/24 15:47:51
37	359.5903712498935	284.92420131943135	-53	21/02/24 15:47:51
34	374.2599083722957	283.9138922785015	-66	21/02/24 15:47:51
41	375.39943266704637	281.4134213737185	-67	21/02/24 15:47:51
12	371.0513379138651	279.4455722502708	-65	21/02/24 15:47:51
40	360.29771601412074	275.17301637315114	-66	21/02/24 15:47:51
47	353.57917457908314	286.3943403818769	-59	21/02/24 15:47:51
22	353.27733584284437	275.76541045955213	-66	21/02/24 15:47:51
45	342.3105096677226	291.9842245930836	-70	21/02/24 15:47:51
33	361.5531569646988	270.2693072733871	-71	21/02/24 15:47:51

27	361.7760445803703	289.2690199455797	-22	21/02/24 15:47:52
26	365.69275229012084	288.9526077496502	-49	21/02/24 15:47:52
36	375.5585779585396	288.8705845625357	-63	21/02/24 15:47:52
35	375.6269429107988	288.30982657685854	-64	21/02/24 15:47:52
9	369.1884989117563	287.5678363426809	-58	21/02/24 15:47:52
37	359.5903712498935	284.92420131943135	-51	21/02/24 15:47:52
34	374.2599083722957	283.9138922785015	-67	21/02/24 15:47:52
41	375.39943266704637	281.4134213737185	-66	21/02/24 15:47:52
12	371.0513379138651	279.4455722502708	-65	21/02/24 15:47:52
40	360.29771601412074	275.17301637315114	-66	21/02/24 15:47:52
47	353.57917457908314	286.3943403818769	-60	21/02/24 15:47:52
22	353.27733584284437	275.76541045955213	-67	21/02/24 15:47:52
33	361.5531569646988	270.2693072733871	-72	21/02/24 15:47:52

27	361.7760445803703	289.2690199455797	-35	21/02/24 15:47:53
26	365.69275229012084	288.9526077496502	-46	21/02/24 15:47:53
36	375.5585779585396	288.8705845625357	-63	21/02/24 15:47:53
35	375.6269429107988	288.30982657685854	-64	21/02/24 15:47:53
9	369.1884989117563	287.5678363426809	-57	21/02/24 15:47:53
37	359.5903712498935	284.92420131943135	-52	21/02/24 15:47:53
34	374.2599083722957	283.9138922785015	-64	21/02/24 15:47:53
41	375.39943266704637	281.4134213737185	-65	21/02/24 15:47:53
12	371.0513379138651	279.4455722502708	-65	21/02/24 15:47:53
19	377.44631063296276	276.33039616173164	-69	21/02/24 15:47:53
40	360.29771601412074	275.17301637315114	-66	21/02/24 15:47:53
47	353.57917457908314	286.3943403818769	-61	21/02/24 15:47:53
22	353.27733584284437	275.76541045955213	-69	21/02/24 15:47:53
33	361.5531569646988	270.2693072733871	-68	21/02/24 15:47:53

27	361.7760445803703	289.2690199455797	-34	21/02/24 15:47:54
26	365.69275229012084	288.9526077496502	-43	21/02/24 15:47:54
36	375.5585779585396	288.8705845625357	-65	21/02/24 15:47:54
35	375.6269429107988	288.30982657685854	-66	21/02/24 15:47:54
9	369.1884989117563	287.5678363426809	-56	21/02/24 15:47:54
37	359.5903712498935	284.92420131943135	-53	21/02/24 15:47:54
34	374.2599083722957	283.9138922785015	-64	21/02/24 15:47:54
41	375.39943266704637	281.4134213737185	-65	21/02/24 15:47:54
12	371.0513379138651	279.4455722502708	-65	21/02/24 15:47:54
19	377.44631063296276	276.33039616173164	-71	21/02/24 15:47:54
40	360.29771601412074	275.17301637315114	-67	21/02/24 15:47:54
47	353.57917457908314	286.3943403818769	-61	21/02/24 15:47:54
22	353.27733584284437	275.76541045955213	-70	21/02/24 15:47:54
33	361.5531569646988	270.2693072733871	-70	21/02/24 15:47:54

27	361.7760445803703	289.2690199455797	-32	21/02/24 15:47:55
26	365.69275229012084	288.9526077496502	-45	21/02/24 15:47:55
36	375.5585779585396	288.8705845625357	-65	21/02/24 15:47:55
35	375.6269429107988	288.30982657685854	-67	21/02/24 15:47:55
9	369.1884989117563	287.5678363426809	-57	21/02/24 15:47:55
37	359.5903712498935	284.92420131943135	-55	21/02/24 15:47:55
34	374.2599083722957	283.9138922785015	-64	21/02/24 15:47:55
41	375.39943266704637	281.4134213737185	-67	21/02/24 15:47:55
12	371.0513379138651	279.4455722502708	-64	21/02/24 15:47:55
19	377.44631063296276	276.33039616173164	-72	21/02/24 15:47:55
40	360.29771601412074	275.17301637315114	-66	21/02/24 15:47:55
47	353.57917457908314	286.3943403818769	-62	21/02/24 15:47:55
22	353.27733584284437	275.76541045955213	-67	21/02/24 15:47:55
33	361.5531569646988	270.2693072733871	-71	21/02/24 15:47:55

27	361.7760445803703	289.2690199455797	-34	21/02/24 15:47:56
26	365.69275229012084	288.9526077496502	-48	21/02/24 15:47:56
36	375.5585779585396	288.8705845625357	-64	21/02/24 15:47:56
35	375.6269429107988	288.30982657685854	-64	21/02/24 15:47:56
9	369.1884989117563	287.5678363426809	-55	21/02/24 15:47:56
37	359.5903712498935	284.92420131943135	-56	21/02/24 15:47:56
34	374.2599083722957	283.9138922785015	-66	21/02/24 15:47:56
41	375.39943266704637	281.4134213737185	-66	21/02/24 15:47:56
12	371.0513379138651	279.4455722502708	-66	21/02/24 15:47:56
19	377.44631063296276	276.33039616173164	-69	21/02/24 15:47:56
40	360.29771601412074	275.17301637315114	-67	21/02/24 15:47:56
47	353.57917457908314	286.3943403818769	-62	21/02/24 15:47:56
22	353.27733584284437	275.76541045955213	-67	21/02/24 15:47:56
33	361.5531569646988	270.2693072733871	-69	21/02/24 15:47:56

27	361.7760445803703	289.2690199455797	-29	21/02/24 15:47:57
26	365.69275229012084	288.9526077496502	-48	21/02/24 15:47:57
36	375.5585779585396	288.8705845625357	-66	21/02/24 15:47:57
35	375.6269429107988	288.30982657685854	-66	21/02/24 15:47:57
9	369.1884989117563	287.5678363426809	-55	21/02/24 15:47:57
37	359.5903712498935	284.92420131943135	-55	21/02/24 15:47:57
34	374.2599083722957	283.9138922785015	-66	21/02/24 15:47:57
41	375.39943266704637	281.4134213737185	-68	21/02/24 15:47:57
12	371.0513379138651	279.4455722502708	-67	21/02/24 15:47:57
19	377.44631063296276	276.33039616173164	-70	21/02/24 15:47:57
40	360.29771601412074	275.17301637315114	-65	21/02/24 15:47:57
47	353.57917457908314	286.3943403818769	-62	21/02/24 15:47:57
22	353.27733584284437	275.76541045955213	-69	21/02/24 15:47:57
33	361.5531569646988	270.2693072733871	-71	21/02/24 15:47:57

27	361.7760445803703	289.2690199455797	-27	21/02/24 15:47:58
26	365.69275229012084	288.9526077496502	-48	21/02/24 15:47:58
36	375.5585779585396	288.8705845625357	-64	21/02/24 15:47:58
35	375.6269429107988	288.30982657685854	-63	21/02/24 15:47:58
9	369.1884989117563	287.5678363426809	-56	21/02/24 15:47:58
37	359.5903712498935	284.92420131943135	-54	21/02/24 15:47:58
34	374.2599083722957	283.9138922785015	-67	21/02/24 15:47:58
41	375.39943266704637	281.4134213737185	-68	21/02/24 15:47:58
12	371.0513379138651	279.4455722502708	-66	21/02/24 15:47:58
40	360.29771601412074	275.17301637315114	-65	21/02/24 15:47:58
47	353.57917457908314	286.3943403818769	-60	21/02/24 15:47:58
22	353.27733584284437	275.76541045955213	-68	21/02/24 15:47:58
33	361.5531569646988	270.2693072733871	-72	21/02/24 15:47:58

27	361.7760445803703	289.2690199455797	-31	21/02/24 15:47:59
26	365.69275229012084	288.9526077496502	-48	21/02/24 15:47:59
36	375.5585779585396	288.8705845625357	-67	21/02/24 15:47:59
35	375.6269429107988	288.30982657685854	-66	21/02/24 15:47:59
9	369.1884989117563	287.5678363426809	-58	21/02/24 15:47:59
37	359.5903712498935	284.92420131943135	-56	21/02/24 15:47:59
34	374.2599083722957	283.9138922785015	-66	21/02/24 15:47:59
41	375.39943266704637	281.4134213737185	-67	21/02/24 15:47:59
12	371.0513379138651	279.4455722502708	-66	21/02/24 15:47:59
40	360.29771601412074	275.17301637315114	-65	21/02/24 15:47:59
47	353.57917457908314	286.3943403818769	-62	21/02/24 15:47:59
22	353.27733584284437	275.76541045955213	-70	21/02/24 15:47:59
45	342.3105096677226	291.9842245930836	-70	21/02/24 15:47:59
33	361.5531569646988	270.2693072733871	-69	21/02/24 15:47:59

