floorId	partitionId	location_x	location_y	timeStamp
3	42	347.9455483531808	258.6717142733518	20/04/28 05:17:35
3	42	346.3242319400108	259.3686329834299	20/04/28 05:17:36
3	42	346.3242319400108	259.3686329834299	20/04/28 05:17:37
3	42	346.3242319400108	259.3686329834299	20/04/28 05:17:38
3	54	345.98250818917177	261.859258749847	20/04/28 05:17:39
3	42	346.74117802337514	260.17816018841967	20/04/28 05:17:40
3	42	346.7411780233751	260.17816018841967	20/04/28 05:17:41
3	42	343.19179870246967	259.9647561276533	20/04/28 05:17:42
3	42	347.9455483531808	258.6717142733518	20/04/28 05:17:43
3	42	344.3961690322754	258.45831021258545	20/04/28 05:17:44
3	42	343.53091080698397	256.9812934275402	20/04/28 05:17:45
3	42	344.3961690322754	258.45831021258545	20/04/28 05:17:46
3	42	346.3242319400108	259.3686329834299	20/04/28 05:17:47
3	42	347.94554835318087	258.6717142733518	20/04/28 05:17:48
3	42	347.9455483531808	258.6717142733518	20/04/28 05:17:49
3	42	347.94554835318087	258.6717142733518	20/04/28 05:17:50
3	42	347.94554835318087	258.6717142733518	20/04/28 05:17:51
3	42	349.5164949594119	259.9901464221112	20/04/28 05:17:52
3	42	347.94554835318087	258.6717142733518	20/04/28 05:17:53
3	42	347.94554835318087	258.6717142733518	20/04/28 05:17:54
3	54	345.98250818917177	261.859258749847	20/04/28 05:17:55
3	42	347.1868785189775	260.3528128347792	20/04/28 05:17:56
3	42	347.94554835318087	258.6717142733518	20/04/28 05:17:57
3	42	347.9455483531808	258.6717142733518	20/04/28 05:17:58
3	42	347.94554835318087	258.6717142733518	20/04/28 05:17:59
3	42	346.3242319400108	259.3686329834299	20/04/28 05:18:00
3	42	347.9455483531808	258.6717142733518	20/04/28 05:18:01
3	42	347.9455483531808	258.6717142733518	20/04/28 05:18:02
3	42	347.9455483531808	258.6717142733518	20/04/28 05:18:03
3	42	347.94554835318087	258.6717142733518	20/04/28 05:18:04
3	42	352.0898782617341	257.6816897320676	20/04/28 05:18:05
3	42	352.0898782617341	257.6816897320676	20/04/28 05:18:06
3	68	354.0813137420346	255.73290488058717	20/04/28 05:18:07
3	84	357.1311797592782	253.49332104078317	20/04/28 05:18:08
3	84	357.1311797592782	253.49332104078317	20/04/28 05:18:09
3	30	360.46690033995947	246.70758975930266	20/04/28 05:18:10
3	30	360.46690033995947	246.70758975930266	20/04/28 05:18:11
3	23	362.7432195844349	240.9347338855629	20/04/28 05:18:12
3	23	361.39171706234237	243.1777661478346	20/04/28 05:18:13
3	23	361.39171706234237	243.1777661478346	20/04/28 05:18:14
3	23	361.39171706234237	243.1777661478346	20/04/28 05:18:15
3	23	360.23406947147583	243.86796499322614	20/04/28 05:18:16
3	23	361.39171706234237	243.1777661478346	20/04/28 05:18:17
3	23	362.7432195844349	240.9347338855629	20/04/28 05:18:18
3	23	361.39171706234237	243.1777661478346	20/04/28 05:18:19
3	23	361.39171706234237	243.1777661478346	20/04/28 05:18:20
3	23	361.39171706234237	243.1777661478346	20/04/28 05:18:21
3	23	361.39171706234237	243.1777661478346	20/04/28 05:18:22
3	23	361.39171706234237	243.1777661478346	20/04/28 05:18:23
3	23	361.39171706234237	243.1777661478346	20/04/28 05:18:24
3	23	360.23406947147583	243.86796499322614	20/04/28 05:18:25
3	30	360.46690033995947	246.70758975930266	20/04/28 05:18:26
3	84	357.1311797592782	253.49332104078317	20/04/28 05:18:27
3	84	357.1311797592782	253.49332104078317	20/04/28 05:18:28
3	68	354.0813137420346	255.73290488058717	20/04/28 05:18:29
3	68	354.08131374203464	255.73290488058714	20/04/28 05:18:30
3	42	352.0898782617341	257.6816897320676	20/04/28 05:18:31
3	42	352.0898782617341	257.6816897320676	20/04/28 05:18:32
3	42	351.2362894892158	259.98472696547645	20/04/28 05:18:33
3	54	350.37914153837863	260.97432627346046	20/04/28 05:18:34
3	42	346.7411780233751	260.17816018841967	20/04/28 05:18:35
3	42	346.32423194001075	259.3686329834299	20/04/28 05:18:36
3	42	343.1917987024697	259.9647561276533	20/04/28 05:18:37
3	99	339.59375125487367	258.8166372045796	20/04/28 05:18:38
3	NULL	337.70753542622793	260.4595329480968	20/04/28 05:18:39
3	54	334.4407240787428	261.4032786809491	20/04/28 05:18:40
3	54	334.4407240787428	261.4032786809491	20/04/28 05:18:41
3	54	334.4407240787428	261.4032786809491	20/04/28 05:18:42
3	54	327.3540763805351	261.1072377077433	20/04/28 05:18:43
3	54	327.3540763805351	261.1072377077433	20/04/28 05:18:44
3	54	324.0151806674323	262.76750572012435	20/04/28 05:18:45
3	54	324.0151806674323	262.76750572012435	20/04/28 05:18:46
3	54	324.01518066743233	262.76750572012435	20/04/28 05:18:47
3	NULL	321.58852487636045	259.59988007603243	20/04/28 05:18:48
