129.082697131361/35.23540386862928
129.082697131361/35.23540386862928
129.082697131361/35.23540386862928
129.08269733738481/35.235403863303674
129.08269782041788/35.23540385081752
129.08270345422804/35.23540370518551
129.08271255492545/35.23540346993575
129.08272819406926/35.235403145935706
129.0827434079419/35.23540129058462
129.08275208230563/35.23539919058959
129.08275572363175/35.23539853020463
129.0827589702312/35.23539972782921
129.08276791840748/35.23540332358905
129.0827769292798/35.23540878654729
129.0827800694724/35.23541758653727
129.08277317372324/35.23542540732316
129.08275838122333/35.23542942695426
129.0827449719342/35.23543116092211
129.08273162231106/35.235431578722206
129.0827138000536/35.23543066326576
129.08270001673887/35.23542983025514
129.0826872558978/35.235429542718336
129.08267030277042/35.235429560759194
129.0826504487729/35.23542958359969
129.0826295316841/35.235429839931896
129.08260818686344/35.235430069292185
129.0825867917817/35.235430053378025
129.08256403233597/35.23542982793278
129.0825419820979/35.2354294138386
129.08251461986168/35.2354295764653
129.08248757154448/35.23543100710211
129.082463644826/35.23543182962751
129.08245464329747/35.23543615074553
129.08245889156902/35.23543812017252
129.08246870893785/35.2354384958451
129.08248372584566/35.23543826577211
129.08251271295944/35.23543767346468
129.08253802896488/35.23543743660641
129.0825654949255/35.235436954895775
129.0825947950281/35.235436922709866
129.08262070834652/35.235437443177744
129.08264050447883/35.23543653800788
129.08265843607086/35.23543492742363
129.08267951655924/35.23543389149749
129.08270198226455/35.23543376813788
129.0827242679562/35.23543376689532
129.0827468977379/35.23543334879343
129.08278807378383/35.23541435784838
129.08281848159552/35.23540458111335
129.08284518148713/35.23540012907594
129.08286387366033/35.235399493577624
129.08287813109578/35.23539476153894
129.08288255338815/35.23538361342487
129.08288320273002/35.23537050760715
129.08285738418994/35.23537618572502
129.08284656411212/35.23537280539768
129.08284418686182/35.235384164547085
129.0828400996849/35.23539769720357
129.08283743401824/35.23540363509055
129.08283530476962/35.23540616822785
129.08283313140376/35.23540767193578
129.0828321173387/35.235408311266596
129.08283102104028/35.2354081963252
129.08283128490828/35.23540815504521
129.08283913650217/35.23540867475883
129.08284680255036/35.23541392271889
129.08285159760683/35.23542478045356
129.08285161059538/35.23543753520716