deviceId	device_location_x	device_location_y	rssi_measurement	timeStamp
51	325.7355139096782	278.0932066266133	-71	21/02/21 12:33:05
76	322.8122862148216	270.34769777745714	-69	21/02/21 12:33:05
56	322.2516392927648	279.48868682081735	-69	21/02/21 12:33:05
87	316.7754558564986	283.3435273986795	-64	21/02/21 12:33:05
80	319.50438552760113	266.6532375434548	-71	21/02/21 12:33:05
63	316.1845617273695	266.1427544980059	-69	21/02/21 12:33:05
85	313.592506279435	288.9508043358895	-62	21/02/21 12:33:05
82	310.7343024876997	289.9885281058247	-63	21/02/21 12:33:05
67	308.6687909404943	269.3159542687186	-63	21/02/21 12:33:05
54	308.4167510170523	285.31774122436696	-57	21/02/21 12:33:05
72	308.3782577378165	279.0389065249484	-43	21/02/21 12:33:05
79	308.3126945352996	266.84191839250167	-63	21/02/21 12:33:05
83	304.39664002154746	273.1089612991749	-57	21/02/21 12:33:05
71	303.7334461133063	278.9617445552159	-43	21/02/21 12:33:05
84	302.4589736847336	273.8327768701395	-57	21/02/21 12:33:05

51	325.7355139096782	278.0932066266133	-69	21/02/21 12:33:06
76	322.8122862148216	270.34769777745714	-70	21/02/21 12:33:06
56	322.2516392927648	279.48868682081735	-68	21/02/21 12:33:06
87	316.7754558564986	283.3435273986795	-61	21/02/21 12:33:06
80	319.50438552760113	266.6532375434548	-67	21/02/21 12:33:06
63	316.1845617273695	266.1427544980059	-68	21/02/21 12:33:06
85	313.592506279435	288.9508043358895	-65	21/02/21 12:33:06
82	310.7343024876997	289.9885281058247	-66	21/02/21 12:33:06
67	308.6687909404943	269.3159542687186	-60	21/02/21 12:33:06
54	308.4167510170523	285.31774122436696	-60	21/02/21 12:33:06
72	308.3782577378165	279.0389065249484	-38	21/02/21 12:33:06
79	308.3126945352996	266.84191839250167	-60	21/02/21 12:33:06
83	304.39664002154746	273.1089612991749	-54	21/02/21 12:33:06
71	303.7334461133063	278.9617445552159	-50	21/02/21 12:33:06
84	302.4589736847336	273.8327768701395	-54	21/02/21 12:33:06

51	325.7355139096782	278.0932066266133	-66	21/02/21 12:33:07
76	322.8122862148216	270.34769777745714	-67	21/02/21 12:33:07
56	322.2516392927648	279.48868682081735	-65	21/02/21 12:33:07
87	316.7754558564986	283.3435273986795	-63	21/02/21 12:33:07
80	319.50438552760113	266.6532375434548	-65	21/02/21 12:33:07
63	316.1845617273695	266.1427544980059	-64	21/02/21 12:33:07
85	313.592506279435	288.9508043358895	-64	21/02/21 12:33:07
82	310.7343024876997	289.9885281058247	-67	21/02/21 12:33:07
67	308.6687909404943	269.3159542687186	-57	21/02/21 12:33:07
54	308.4167510170523	285.31774122436696	-63	21/02/21 12:33:07
72	308.3782577378165	279.0389065249484	-47	21/02/21 12:33:07
79	308.3126945352996	266.84191839250167	-61	21/02/21 12:33:07
83	304.39664002154746	273.1089612991749	-52	21/02/21 12:33:07
71	303.7334461133063	278.9617445552159	-55	21/02/21 12:33:07
84	302.4589736847336	273.8327768701395	-57	21/02/21 12:33:07

51	325.7355139096782	278.0932066266133	-67	21/02/21 12:33:08
76	322.8122862148216	270.34769777745714	-67	21/02/21 12:33:08
56	322.2516392927648	279.48868682081735	-64	21/02/21 12:33:08
87	316.7754558564986	283.3435273986795	-61	21/02/21 12:33:08
80	319.50438552760113	266.6532375434548	-62	21/02/21 12:33:08
63	316.1845617273695	266.1427544980059	-62	21/02/21 12:33:08
85	313.592506279435	288.9508043358895	-66	21/02/21 12:33:08
82	310.7343024876997	289.9885281058247	-68	21/02/21 12:33:08
67	308.6687909404943	269.3159542687186	-55	21/02/21 12:33:08
54	308.4167510170523	285.31774122436696	-61	21/02/21 12:33:08
72	308.3782577378165	279.0389065249484	-51	21/02/21 12:33:08
79	308.3126945352996	266.84191839250167	-58	21/02/21 12:33:08
83	304.39664002154746	273.1089612991749	-56	21/02/21 12:33:08
71	303.7334461133063	278.9617445552159	-60	21/02/21 12:33:08
84	302.4589736847336	273.8327768701395	-59	21/02/21 12:33:08

51	325.7355139096782	278.0932066266133	-68	21/02/21 12:33:09
76	322.8122862148216	270.34769777745714	-62	21/02/21 12:33:09
56	322.2516392927648	279.48868682081735	-63	21/02/21 12:33:09
87	316.7754558564986	283.3435273986795	-61	21/02/21 12:33:09
80	319.50438552760113	266.6532375434548	-62	21/02/21 12:33:09
78	328.9028398411137	264.37460626325225	-69	21/02/21 12:33:09
63	316.1845617273695	266.1427544980059	-58	21/02/21 12:33:09
85	313.592506279435	288.9508043358895	-68	21/02/21 12:33:09
82	310.7343024876997	289.9885281058247	-67	21/02/21 12:33:09
67	308.6687909404943	269.3159542687186	-53	21/02/21 12:33:09
54	308.4167510170523	285.31774122436696	-65	21/02/21 12:33:09
72	308.3782577378165	279.0389065249484	-59	21/02/21 12:33:09
79	308.3126945352996	266.84191839250167	-60	21/02/21 12:33:09
83	304.39664002154746	273.1089612991749	-58	21/02/21 12:33:09
71	303.7334461133063	278.9617445552159	-62	21/02/21 12:33:09
84	302.4589736847336	273.8327768701395	-60	21/02/21 12:33:09

51	325.7355139096782	278.0932066266133	-67	21/02/21 12:33:10
76	322.8122862148216	270.34769777745714	-59	21/02/21 12:33:10
56	322.2516392927648	279.48868682081735	-64	21/02/21 12:33:10
87	316.7754558564986	283.3435273986795	-62	21/02/21 12:33:10
80	319.50438552760113	266.6532375434548	-56	21/02/21 12:33:10
52	331.19910015001574	266.24837823159737	-70	21/02/21 12:33:10
78	328.9028398411137	264.37460626325225	-70	21/02/21 12:33:10
77	330.2760383093163	263.7838317549563	-68	21/02/21 12:33:10
63	316.1845617273695	266.1427544980059	-56	21/02/21 12:33:10
85	313.592506279435	288.9508043358895	-69	21/02/21 12:33:10
82	310.7343024876997	289.9885281058247	-68	21/02/21 12:33:10
67	308.6687909404943	269.3159542687186	-57	21/02/21 12:33:10
54	308.4167510170523	285.31774122436696	-67	21/02/21 12:33:10
72	308.3782577378165	279.0389065249484	-61	21/02/21 12:33:10
79	308.3126945352996	266.84191839250167	-59	21/02/21 12:33:10
83	304.39664002154746	273.1089612991749	-59	21/02/21 12:33:10
71	303.7334461133063	278.9617445552159	-65	21/02/21 12:33:10
84	302.4589736847336	273.8327768701395	-63	21/02/21 12:33:10

51	325.7355139096782	278.0932066266133	-65	21/02/21 12:33:11
76	322.8122862148216	270.34769777745714	-60	21/02/21 12:33:11
56	322.2516392927648	279.48868682081735	-64	21/02/21 12:33:11
87	316.7754558564986	283.3435273986795	-65	21/02/21 12:33:11
80	319.50438552760113	266.6532375434548	-55	21/02/21 12:33:11
52	331.19910015001574	266.24837823159737	-67	21/02/21 12:33:11
78	328.9028398411137	264.37460626325225	-69	21/02/21 12:33:11
77	330.2760383093163	263.7838317549563	-67	21/02/21 12:33:11
53	333.6341107305594	263.56249180343514	-69	21/02/21 12:33:11
63	316.1845617273695	266.1427544980059	-49	21/02/21 12:33:11
85	313.592506279435	288.9508043358895	-71	21/02/21 12:33:11
67	308.6687909404943	269.3159542687186	-56	21/02/21 12:33:11
54	308.4167510170523	285.31774122436696	-70	21/02/21 12:33:11
72	308.3782577378165	279.0389065249484	-63	21/02/21 12:33:11
79	308.3126945352996	266.84191839250167	-58	21/02/21 12:33:11
83	304.39664002154746	273.1089612991749	-62	21/02/21 12:33:11
71	303.7334461133063	278.9617445552159	-68	21/02/21 12:33:11
84	302.4589736847336	273.8327768701395	-63	21/02/21 12:33:11

51	325.7355139096782	278.0932066266133	-66	21/02/21 12:33:12
76	322.8122862148216	270.34769777745714	-59	21/02/21 12:33:12
56	322.2516392927648	279.48868682081735	-64	21/02/21 12:33:12
87	316.7754558564986	283.3435273986795	-67	21/02/21 12:33:12
80	319.50438552760113	266.6532375434548	-54	21/02/21 12:33:12
52	331.19910015001574	266.24837823159737	-69	21/02/21 12:33:12
78	328.9028398411137	264.37460626325225	-68	21/02/21 12:33:12
77	330.2760383093163	263.7838317549563	-69	21/02/21 12:33:12
53	333.6341107305594	263.56249180343514	-69	21/02/21 12:33:12
63	316.1845617273695	266.1427544980059	-45	21/02/21 12:33:12
67	308.6687909404943	269.3159542687186	-55	21/02/21 12:33:12
54	308.4167510170523	285.31774122436696	-68	21/02/21 12:33:12
72	308.3782577378165	279.0389065249484	-65	21/02/21 12:33:12
79	308.3126945352996	266.84191839250167	-55	21/02/21 12:33:12
83	304.39664002154746	273.1089612991749	-65	21/02/21 12:33:12
71	303.7334461133063	278.9617445552159	-65	21/02/21 12:33:12
84	302.4589736847336	273.8327768701395	-64	21/02/21 12:33:12

51	325.7355139096782	278.0932066266133	-67	21/02/21 12:33:13
76	322.8122862148216	270.34769777745714	-62	21/02/21 12:33:13
56	322.2516392927648	279.48868682081735	-66	21/02/21 12:33:13
87	316.7754558564986	283.3435273986795	-70	21/02/21 12:33:13
80	319.50438552760113	266.6532375434548	-52	21/02/21 12:33:13
52	331.19910015001574	266.24837823159737	-68	21/02/21 12:33:13
78	328.9028398411137	264.37460626325225	-66	21/02/21 12:33:13
77	330.2760383093163	263.7838317549563	-69	21/02/21 12:33:13
53	333.6341107305594	263.56249180343514	-69	21/02/21 12:33:13
63	316.1845617273695	266.1427544980059	-40	21/02/21 12:33:13
67	308.6687909404943	269.3159542687186	-53	21/02/21 12:33:13
54	308.4167510170523	285.31774122436696	-69	21/02/21 12:33:13
72	308.3782577378165	279.0389065249484	-64	21/02/21 12:33:13
79	308.3126945352996	266.84191839250167	-56	21/02/21 12:33:13
83	304.39664002154746	273.1089612991749	-65	21/02/21 12:33:13
71	303.7334461133063	278.9617445552159	-66	21/02/21 12:33:13
84	302.4589736847336	273.8327768701395	-65	21/02/21 12:33:13

