floorId	partitionId	location_x	location_y	timeStamp
3	42	347.6803999528746	258.8951938710204	20/04/28 05:13:53
3	42	347.736793405268	258.8078569702685	20/04/28 05:13:53
3	42	347.6207676596623	258.6569303055235	20/04/28 05:13:53
3	42	347.55269595838286	258.5597882003683	20/04/28 05:13:53
3	42	347.6568746290522	258.3035848377174	20/04/28 05:13:53
3	42	347.3780656231233	258.33957076247276	20/04/28 05:13:53
3	42	347.2612675123806	258.2043459705573	20/04/28 05:13:53
3	42	347.1764848891344	258.37257476919257	20/04/28 05:13:53
3	42	347.1718444717427	258.3696102781944	20/04/28 05:13:53
3	42	347.22214000510627	258.33925471718385	20/04/28 05:13:54
3	42	347.2372966725215	258.4952986518238	20/04/28 05:13:54
3	42	347.10421290322876	258.5836453649221	20/04/28 05:13:54
3	42	346.96223908766865	258.52196547052233	20/04/28 05:13:54
3	42	346.982643230604	258.6551700203957	20/04/28 05:13:54
3	42	346.9031005359847	258.74121355748156	20/04/28 05:13:54
3	42	346.89857070913666	258.7361635422867	20/04/28 05:13:54
3	42	346.84829033272536	258.8262507280434	20/04/28 05:13:54
3	42	346.8409733861116	258.6439465703374	20/04/28 05:13:54
3	42	346.82629298138846	258.58407669391454	20/04/28 05:13:55
3	42	346.7098274984105	258.71861906119705	20/04/28 05:13:55
3	42	346.5435226305788	258.6752176028872	20/04/28 05:13:55
3	42	346.3926035664126	258.5970617166647	20/04/28 05:13:55
3	42	346.5529535867045	258.5808328080591	20/04/28 05:13:55
3	42	346.8034575798167	258.51687911455053	20/04/28 05:13:55
3	42	346.8479677627202	258.6145042949158	20/04/28 05:13:55
3	42	346.73032921442314	258.3766001204303	20/04/28 05:13:55
3	42	346.9448885406503	258.3176983185193	20/04/28 05:13:55
3	42	346.8106911974111	258.1518935985384	20/04/28 05:13:55
3	42	346.8711045498565	258.1134318058297	20/04/28 05:13:56
3	42	346.7307797955712	258.2892850894533	20/04/28 05:13:56
3	42	346.67411808025196	258.2389269664381	20/04/28 05:13:56
3	42	346.84348542062264	258.1765256313927	20/04/28 05:13:56
3	42	347.08667911996133	258.3010033652954	20/04/28 05:13:56
3	42	347.1154244586299	258.27815649959547	20/04/28 05:13:56
3	42	347.1154244586299	258.27815649959547	20/04/28 05:13:56
3	42	347.2148481211667	258.23979301559126	20/04/28 05:13:56
3	42	347.10722179944275	258.21971075975006	20/04/28 05:13:56
3	42	347.1498920225235	258.4040070480694	20/04/28 05:13:56
3	42	347.18393570425104	258.4911503653968	20/04/28 05:13:57
3	42	347.18393570425104	258.4911503653968	20/04/28 05:13:57
3	42	347.4019527957886	258.5815595871281	20/04/28 05:13:57
3	42	347.65186084044456	258.6851936263788	20/04/28 05:13:57
3	42	347.8023392636882	258.74759532634124	20/04/28 05:13:57
3	42	347.96818867344837	258.8163712005411	20/04/28 05:13:57
3	42	348.1755227453226	258.9023502948604	20/04/28 05:13:57
3	42	348.40625491688155	258.99803231644825	20/04/28 05:13:57
3	42	348.60606378644235	259.0808907944905	20/04/28 05:13:57
3	42	348.8073788571432	259.1643738771079	20/04/28 05:13:58
3	42	348.9527280867516	259.2246485584894	20/04/28 05:13:58
3	42	349.12340289019966	259.29542546886853	20/04/28 05:13:58
3	42	349.12340289019966	259.29542546886853	20/04/28 05:13:58
3	42	349.3571170773793	259.3923440986028	20/04/28 05:13:58
3	42	349.50617155122353	259.45415530285646	20/04/28 05:13:58
3	42	349.69713228763146	259.53334456016705	20/04/28 05:13:58
3	42	349.8776886576837	259.6082192444403	20/04/28 05:13:58
3	42	350.1858607362564	259.73601471949496	20/04/28 05:13:58
3	42	350.1858607362564	259.73601471949496	20/04/28 05:13:58
3	42	350.34603898475024	259.8024388272678	20/04/28 05:13:59
3	42	350.5902008668813	259.9036899979179	20/04/28 05:13:59
3	42	351.0125553230002	260.0788356133518	20/04/28 05:13:59
3	42	351.252403641771	260.1782979980699	20/04/28 05:13:59
3	42	351.4532381205937	260.26158178467176	20/04/28 05:13:59
3	42	351.60934789948294	260.32631874412056	20/04/28 05:13:59
3	42	351.8602156551211	260.4303507646597	20/04/28 05:13:59
3	42	352.0505857064942	260.509295071568	20/04/28 05:13:59
3	25	352.18460594849705	260.588410000001	20/04/28 05:13:59
3	25	351.97641449574854	260.588410000001	20/04/28 05:14:00
3	25	351.7124413707493	260.588410000001	20/04/28 05:14:00
3	25	351.5108897333996	260.588410000001	20/04/28 05:14:00
3	25	351.2305110555528	260.588410000001	20/04/28 05:14:00
3	25	351.0777214821602	260.588410000001	20/04/28 05:14:00
3	25	350.8620824082653	260.588410000001	20/04/28 05:14:00
3	25	350.71032885704267	260.588410000001	20/04/28 05:14:00
3	25	350.4650800040278	260.588410000001	20/04/28 05:14:00
3	25	350.4650800040278	260.588410000001	20/04/28 05:14:00
3	25	350.12190190655963	260.588410000001	20/04/28 05:14:00
3	25	349.93698838469237	260.588410000001	20/04/28 05:14:01
3	25	349.66197835634074	260.588410000001	20/04/28 05:14:01
3	25	349.43632646131886	260.588410000001	20/04/28 05:14:01
3	25	349.24586829248494	260.588410000001	20/04/28 05:14:01
3	25	348.960415331296	260.588410000001	20/04/28 05:14:01
3	25	348.77038964285055	260.588410000001	20/04/28 05:14:01
3	25	348.61835760767883	260.588410000001	20/04/28 05:14:01
3	25	348.3689646155377	260.588410000001	20/04/28 05:14:01
3	25	348.1649906623611	260.588410000001	20/04/28 05:14:01
3	25	347.92088919645124	260.588410000001	20/04/28 05:14:01
3	25	347.92088919645124	260.588410000001	20/04/28 05:14:02
3	25	347.7167179143197	260.588410000001	20/04/28 05:14:02
3	25	347.5098430077347	260.588410000001	20/04/28 05:14:02
3	25	347.2847509108387	260.588410000001	20/04/28 05:14:02
3	25	347.1023128848751	260.588410000001	20/04/28 05:14:02
3	25	346.93555806595475	260.588410000001	20/04/28 05:14:02
3	25	346.93555806595475	260.588410000001	20/04/28 05:14:02
3	25	346.70851696981117	260.588410000001	20/04/28 05:14:02
3	25	346.4909271229655	260.588410000001	20/04/28 05:14:02
3	25	346.25590388316556	260.588410000001	20/04/28 05:14:03
3	25	346.1035240346842	260.588410000001	20/04/28 05:14:03
3	25	345.88990431197635	260.588410000001	20/04/28 05:14:03
3	25	345.6445221702873	260.588410000001	20/04/28 05:14:03
3	25	345.4322906455596	260.588410000001	20/04/28 05:14:03
3	25	345.1651563149613	260.588410000001	20/04/28 05:14:03
3	25	344.93273708140623	260.588410000001	20/04/28 05:14:03
3	25	344.6609318675611	260.588410000001	20/04/28 05:14:03
3	25	344.4458563913095	260.588410000001	20/04/28 05:14:03
3	25	344.22480076946397	260.588410000001	20/04/28 05:14:03
3	25	344.0588827052374	260.588410000001	20/04/28 05:14:04
3	25	343.8640570006061	260.588410000001	20/04/28 05:14:04
3	25	343.5996565839144	260.588410000001	20/04/28 05:14:04
3	25	343.5996565839144	260.588410000001	20/04/28 05:14:04
3	25	343.3011049166859	260.588410000001	20/04/28 05:14:04
3	25	343.05127867925086	260.588410000001	20/04/28 05:14:04
3	25	342.7854146032999	260.588410000001	20/04/28 05:14:04
3	25	342.4997480400946	260.588410000001	20/04/28 05:14:04
3	25	342.2262890694927	260.588410000001	20/04/28 05:14:04
3	25	341.9291941161105	260.588410000001	20/04/28 05:14:04
3	25	341.67883997835514	260.588410000001	20/04/28 05:14:05
3	25	341.49854434971917	260.588410000001	20/04/28 05:14:05
3	25	341.32893264292824	260.588410000001	20/04/28 05:14:05
3	25	341.1553231936639	260.588410000001	20/04/28 05:14:05
3	25	340.7660554027243	260.588410000001	20/04/28 05:14:05
3	25	340.5374813596025	260.588410000001	20/04/28 05:14:05
3	25	340.5374813596025	260.588410000001	20/04/28 05:14:05
3	25	340.1076931662676	260.588410000001	20/04/28 05:14:05
3	25	339.81958804071326	260.588410000001	20/04/28 05:14:05
3	25	339.5442476872931	260.588410000001	20/04/28 05:14:06
3	25	339.5442476872931	260.588410000001	20/04/28 05:14:06
3	25	339.34350286814555	260.588410000001	20/04/28 05:14:06
3	25	339.12092026746836	260.588410000001	20/04/28 05:14:06
3	25	338.90127763659774	260.588410000001	20/04/28 05:14:06
3	25	338.6769560331482	260.588410000001	20/04/28 05:14:06
3	25	338.4820714952868	260.588410000001	20/04/28 05:14:06
3	25	338.29193723422367	260.588410000001	20/04/28 05:14:06
3	25	337.9984251120531	260.588410000001	20/04/28 05:14:06
3	25	337.79559783464606	260.588410000001	20/04/28 05:14:06
3	25	337.52656160846703	260.588410000001	20/04/28 05:14:07
3	25	337.25047934417523	260.588410000001	20/04/28 05:14:07
3	25	336.9646483443881	260.588410000001	20/04/28 05:14:07
3	25	336.7878768922557	260.588410000001	20/04/28 05:14:07
3	25	336.5716941431359	260.588410000001	20/04/28 05:14:07
3	25	336.2874490812791	260.588410000001	20/04/28 05:14:07
3	25	336.1215938492276	260.588410000001	20/04/28 05:14:07
3	25	335.84487422803505	260.588410000001	20/04/28 05:14:07
3	25	335.6919474436558	260.588410000001	20/04/28 05:14:07
3	25	335.5398033865735	260.588410000001	20/04/28 05:14:07
3	25	335.32564020905346	260.588410000001	20/04/28 05:14:08
3	25	335.10359211777245	260.588410000001	20/04/28 05:14:08
3	25	334.8174136726658	260.588410000001	20/04/28 05:14:08
3	25	334.62936613022026	260.588410000001	20/04/28 05:14:08
3	25	334.4074012479093	260.588410000001	20/04/28 05:14:08
3	25	334.20881494687774	260.588410000001	20/04/28 05:14:08
3	25	333.9531734473615	260.588410000001	20/04/28 05:14:08
3	25	333.7317962112305	260.588410000001	20/04/28 05:14:08
3	25	333.4865185506698	260.588410000001	20/04/28 05:14:08
3	25	333.3125076057081	260.588410000001	20/04/28 05:14:09
3	25	333.1361417737657	260.588410000001	20/04/28 05:14:09
3	25	332.8689596633689	260.588410000001	20/04/28 05:14:09
3	25	332.7080476778335	260.588410000001	20/04/28 05:14:09
3	25	332.45885998985904	260.588410000001	20/04/28 05:14:09
3	25	332.2343206728942	260.588410000001	20/04/28 05:14:09
3	25	331.98303532673884	260.588410000001	20/04/28 05:14:09
3	25	331.98303532673884	260.588410000001	20/04/28 05:14:09
3	25	331.7957196312997	260.588410000001	20/04/28 05:14:09
3	25	331.5175447385793	260.588410000001	20/04/28 05:14:09
3	25	331.29562254350213	260.588410000001	20/04/28 05:14:10
3	54	331.10251762364976	260.5576256577422	20/04/28 05:14:10
3	54	331.10251762364976	260.5576256577422	20/04/28 05:14:10
3	54	330.97091495776635	260.338193596228	20/04/28 05:14:10
3	54	330.840062185083	260.1200118939653	20/04/28 05:14:10
3	54	330.7109278180946	259.9046954323239	20/04/28 05:14:10
3	54	330.576670050822	259.68083629961427	20/04/28 05:14:10
3	25	330.4631655780509	259.4915808595056	20/04/28 05:14:10
3	25	330.4681091381405	259.4799256238933	20/04/28 05:14:10
3	25	330.5288491982879	259.62682140330094	20/04/28 05:14:11
3	25	330.2337556395189	259.61113840669293	20/04/28 05:14:11
3	25	330.1129029360951	259.8020150285741	20/04/28 05:14:11
3	25	330.244492479584	259.6384360331949	20/04/28 05:14:11
3	25	330.0934769064802	259.6573432693809	20/04/28 05:14:11
3	25	330.15733017142315	259.6766122696758	20/04/28 05:14:11
3	25	330.12220603957934	259.9684306542567	20/04/28 05:14:11
3	25	330.19903317854846	259.9649389267891	20/04/28 05:14:11
3	25	330.2029673179467	259.96393012186235	20/04/28 05:14:11
3	25	330.31640711841357	260.08734813683674	20/04/28 05:14:11
3	25	330.3349662903092	260.06192373782534	20/04/28 05:14:12
3	25	330.3610645754136	259.96580666789725	20/04/28 05:14:12
3	25	330.52482938975913	260.0297913380892	20/04/28 05:14:12
3	25	330.52482938975913	260.0297913380892	20/04/28 05:14:12
3	25	330.52482938975913	260.0297913380892	20/04/28 05:14:12
3	25	330.33516223789957	260.2088930916694	20/04/28 05:14:12
3	25	330.3012168264061	260.0229732139328	20/04/28 05:14:12
3	25	330.239869655232	260.03502702162666	20/04/28 05:14:12
3	25	330.2072793393012	260.0833571824766	20/04/28 05:14:12
3	25	330.20935715993755	260.3349845776657	20/04/28 05:14:12
3	25	330.12159427544174	260.08458340525203	20/04/28 05:14:13
3	25	330.00015295419473	259.8636063662605	20/04/28 05:14:13
3	25	329.77136138379797	260.0232374676464	20/04/28 05:14:13
3	25	329.63645851201636	260.0465128744027	20/04/28 05:14:13
3	25	329.6301330382454	260.0443954907472	20/04/28 05:14:13
3	25	329.4475666360182	259.9492372051898	20/04/28 05:14:13
3	25	329.3008920521833	259.90893834420206	20/04/28 05:14:13
3	25	329.503097543644	259.71409580873905	20/04/28 05:14:13
3	25	329.5309865337223	259.69226128638604	20/04/28 05:14:13
3	25	329.71149107090605	259.85495141291665	20/04/28 05:14:13
3	25	329.8697059894294	260.04279299414833	20/04/28 05:14:14
3	25	329.8342015836075	260.07821787793495	20/04/28 05:14:14
3	25	330.0578920160541	260.17208996416235	20/04/28 05:14:14
3	25	330.2828663390904	260.18862754089895	20/04/28 05:14:14
3	25	330.1510982132088	260.0510407251422	20/04/28 05:14:14
3	25	330.0806345305284	260.0607407799846	20/04/28 05:14:14
3	25	330.1112871452246	259.96091560453635	20/04/28 05:14:14
3	25	330.26522067750216	260.1757264938024	20/04/28 05:14:14
3	25	330.1578800557032	260.2477372717702	20/04/28 05:14:14
3	25	330.2124668302947	260.37915860025686	20/04/28 05:14:15
3	25	330.2662720109503	260.22050078209577	20/04/28 05:14:15
3	25	330.2776028188916	260.224192237123	20/04/28 05:14:15
3	25	330.31812171503464	260.05118872036724	20/04/28 05:14:15
3	25	330.32032920440497	260.0483818695366	20/04/28 05:14:15
3	25	330.3572601302616	260.1173777331394	20/04/28 05:14:15
3	25	330.3832575401429	260.0440636480559	20/04/28 05:14:15
3	25	330.4274229550001	260.31564165242526	20/04/28 05:14:15
3	25	330.3805316032699	260.26186632610785	20/04/28 05:14:15
3	25	330.26069296894985	260.1227541321898	20/04/28 05:14:15
3	25	330.4399129698868	259.8908597691262	20/04/28 05:14:16
3	25	330.5943721708867	259.76401560443094	20/04/28 05:14:16
3	25	330.5547828126284	259.7763577809953	20/04/28 05:14:16
3	25	330.7945055707992	259.87415919647566	20/04/28 05:14:16
3	25	330.7255351316604	259.8868931010524	20/04/28 05:14:16
3	25	330.7575509216125	259.92719760311815	20/04/28 05:14:16
3	25	330.6655274227981	259.8953004499752	20/04/28 05:14:16
3	25	330.6583662743352	259.88700116067344	20/04/28 05:14:16
3	25	330.70807730810884	260.0331923118349	20/04/28 05:14:16
3	25	330.73985366789776	260.23372992778496	20/04/28 05:14:16
3	25	330.8959829665348	260.29107405183186	20/04/28 05:14:17
3	25	331.0499339139656	260.068176140239	20/04/28 05:14:17
3	25	331.05057919934325	260.1675173225575	20/04/28 05:14:17
3	25	330.82843846241695	260.11430509195907	20/04/28 05:14:17
3	25	331.0728939423039	260.22839092334925	20/04/28 05:14:17
3	25	331.0624739987488	260.2515726592952	20/04/28 05:14:17
3	25	331.0633790448144	260.2508561045973	20/04/28 05:14:17
3	25	330.8226359896576	260.12907400683844	20/04/28 05:14:17
3	25	330.8455836352081	260.0930582285757	20/04/28 05:14:17
3	25	330.89257329417103	260.1883536071246	20/04/28 05:14:18
3	25	330.8377011849798	260.0766999446666	20/04/28 05:14:18
3	25	330.8324877722845	260.1239233548632	20/04/28 05:14:18
3	25	330.9399252294007	259.8878092818314	20/04/28 05:14:18
3	25	330.7749893193302	259.93348784921045	20/04/28 05:14:18
3	25	330.7048958098673	259.7113216424026	20/04/28 05:14:18
3	25	330.60564733190336	259.6742005919896	20/04/28 05:14:18
3	25	330.5895826054921	259.69300221674547	20/04/28 05:14:18
3	25	330.4988875420164	259.57446242861914	20/04/28 05:14:18
3	25	330.73076649136016	259.4298520021377	20/04/28 05:14:18
3	25	330.7518376987032	259.5294870113337	20/04/28 05:14:19
3	25	330.7957482149713	259.32793529948606	20/04/28 05:14:19
3	25	330.6882812642783	259.366125392841	20/04/28 05:14:19
3	25	330.49311506699587	259.4644427448491	20/04/28 05:14:19
3	25	330.5249926623549	259.18836658647217	20/04/28 05:14:19
3	25	330.65805132185886	259.18957744383016	20/04/28 05:14:19
3	25	330.86588621244226	259.1624382900979	20/04/28 05:14:19
3	25	331.14282609055783	259.2751004483372	20/04/28 05:14:19
3	25	331.0858418079559	259.3306039088424	20/04/28 05:14:19
3	25	331.19677083170444	259.08730863679943	20/04/28 05:14:19
3	25	331.11542388414085	259.151594385178	20/04/28 05:14:20
3	25	331.042607482339	258.8929190897341	20/04/28 05:14:20
3	25	331.12288466658725	258.9756278844022	20/04/28 05:14:20
3	25	331.1765847788793	258.90162737544665	20/04/28 05:14:20
3	25	331.0099633533799	258.9552272860593	20/04/28 05:14:20
3	25	331.0116712669333	258.9536722565616	20/04/28 05:14:20
3	25	331.00494332294596	258.9306590935589	20/04/28 05:14:20
3	25	331.156817119967	258.7837334849102	20/04/28 05:14:20
3	25	331.19821209858515	258.71863370382476	20/04/28 05:14:20
3	25	331.17394682446314	258.6577201797618	20/04/28 05:14:21
3	25	331.3794579367794	258.74728873965614	20/04/28 05:14:21
3	25	331.41196220903913	258.7000115569303	20/04/28 05:14:21
3	25	331.23273483952227	258.85090481165906	20/04/28 05:14:21
3	25	331.22933337445613	258.8055967199775	20/04/28 05:14:21
3	25	331.3322822985176	258.66574146692165	20/04/28 05:14:21
3	25	331.1309733772786	258.5637680125803	20/04/28 05:14:21
3	25	331.0850104507613	258.48061046317133	20/04/28 05:14:21
3	25	330.94099874338553	258.3992761646551	20/04/28 05:14:21
3	25	330.8828009887978	258.2188474362972	20/04/28 05:14:21
3	25	330.8457224376864	258.24222877015444	20/04/28 05:14:22
3	25	330.7745310526565	258.0872408734404	20/04/28 05:14:22
3	25	330.6827077934217	258.0036495272961	20/04/28 05:14:22
3	25	330.95660302136173	257.9257272731426	20/04/28 05:14:22
3	25	330.7490370958931	258.01967090859404	20/04/28 05:14:22
3	25	330.66337740882346	257.7728931770583	20/04/28 05:14:22
3	25	330.6093477974455	257.91010748073745	20/04/28 05:14:22
3	25	330.6101596081948	257.9095632322195	20/04/28 05:14:22
3	25	330.900711277283	257.9830639350718	20/04/28 05:14:22
3	25	330.87250208297934	257.9269511897935	20/04/28 05:14:23
3	25	330.8617091610563	257.9374910938398	20/04/28 05:14:23
3	25	330.8299626380434	258.08532438267326	20/04/28 05:14:23
3	25	330.77681115338373	258.13752284938147	20/04/28 05:14:23
3	25	330.7697953024932	258.22559095505295	20/04/28 05:14:23
3	25	330.7956601460759	258.1021924176935	20/04/28 05:14:23
3	25	330.7304501690109	258.2040157511539	20/04/28 05:14:23
3	25	330.8310967706449	258.17450731740524	20/04/28 05:14:23
3	25	330.8533517999733	258.41721572776993	20/04/28 05:14:23
3	25	330.8596513760893	258.41268349857444	20/04/28 05:14:23
3	25	330.7897849308964	258.487149527881	20/04/28 05:14:24
3	25	330.825627032255	258.43922674227525	20/04/28 05:14:24
3	25	330.777562221239	258.28282585968924	20/04/28 05:14:24
3	25	330.9564020920489	258.42516208351117	20/04/28 05:14:24
3	25	330.7843756517587	258.4164800370622	20/04/28 05:14:24
3	25	330.79029807159804	258.4477063996036	20/04/28 05:14:24
3	25	330.7958316517845	258.341100417125	20/04/28 05:14:24
3	25	330.5745022405186	258.4771895309439	20/04/28 05:14:24
3	25	330.48156573760735	258.356876410497	20/04/28 05:14:24
3	25	330.27349596499386	258.3477337119045	20/04/28 05:14:24
3	25	330.32816096830925	258.4297148170068	20/04/28 05:14:25
3	25	330.09679386489734	258.2968771758879	20/04/28 05:14:25
3	25	329.9466470073988	258.3206934178533	20/04/28 05:14:25
3	25	329.95378588229903	258.35719493064073	20/04/28 05:14:25
3	25	329.95619724258376	258.3003255675311	20/04/28 05:14:25
3	25	330.0157354367819	258.2659781023466	20/04/28 05:14:25
3	25	330.0109997355391	258.3274417995425	20/04/28 05:14:25
3	25	329.9699181350872	258.24891653135893	20/04/28 05:14:25
3	25	329.76995748545977	258.19043501279475	20/04/28 05:14:25
3	25	329.4704828958997	258.2004276557915	20/04/28 05:14:26
3	25	329.6418577966333	258.06433203743296	20/04/28 05:14:26
3	25	329.5838723663631	258.2019231654991	20/04/28 05:14:26
3	25	329.5693092388313	258.12416311358425	20/04/28 05:14:26
3	25	329.53245894492284	258.18891924136966	20/04/28 05:14:26
3	25	329.79505521952126	258.09079550719827	20/04/28 05:14:26
3	25	329.80208755238925	257.9595238819394	20/04/28 05:14:26
3	25	329.6462678019926	258.02324391788886	20/04/28 05:14:26
3	25	329.4311576933715	258.18841707325896	20/04/28 05:14:26
3	25	329.5486465595104	258.4115317107942	20/04/28 05:14:26
3	25	329.592019018254	258.3357669024609	20/04/28 05:14:27
3	25	329.713369687426	258.6078912965813	20/04/28 05:14:27
3	25	329.9405770708933	258.6102074314058	20/04/28 05:14:27
3	25	329.91865627775707	258.6363494857178	20/04/28 05:14:27
3	25	329.91537156971333	258.6092256408674	20/04/28 05:14:27
3	25	330.08934002267756	258.63728055004276	20/04/28 05:14:27
3	25	330.15816161475965	258.81519986516463	20/04/28 05:14:27
3	25	330.42757354620437	258.8383926552763	20/04/28 05:14:27
3	25	330.2539638084899	258.73098751167794	20/04/28 05:14:27
3	25	330.3035750171514	258.8985721944165	20/04/28 05:14:27
3	25	330.2801493757695	258.89495269741997	20/04/28 05:14:28
3	25	330.1586553459063	258.9500912985205	20/04/28 05:14:28
3	25	329.94927426889865	258.775422082731	20/04/28 05:14:28
3	25	330.10208104497934	258.87435590243854	20/04/28 05:14:28
3	25	330.14903865755093	258.79215214635747	20/04/28 05:14:28
3	25	329.9939917843851	258.7388236210022	20/04/28 05:14:28
3	25	329.87943398917366	258.804510890809	20/04/28 05:14:28
3	25	329.9192289886155	258.7860182401969	20/04/28 05:14:28
3	25	329.9360308388707	258.7890105822213	20/04/28 05:14:28
3	25	330.09719610055527	258.9060061556656	20/04/28 05:14:29
3	25	330.09945214017256	258.8600931806741	20/04/28 05:14:29
3	25	330.0999981507577	259.12009243331056	20/04/28 05:14:29
3	25	330.32873986454604	259.2638393490121	20/04/28 05:14:29
3	25	330.49153311485685	259.1176092596953	20/04/28 05:14:29
3	25	330.3498624913016	259.0386752438146	20/04/28 05:14:29
3	25	330.38308341874114	258.7589743604586	20/04/28 05:14:29
3	25	330.1744700594487	258.7604159901581	20/04/28 05:14:29
3	25	330.24390663501794	259.0067690638617	20/04/28 05:14:29
3	25	330.35711762941986	259.008213453243	20/04/28 05:14:29
3	25	330.48019947340333	259.0098642642385	20/04/28 05:14:30
3	25	330.77140175495174	259.02491628110323	20/04/28 05:14:30
3	25	330.80878276493644	259.08079327416067	20/04/28 05:14:30
3	25	330.8076628095734	259.0779011617465	20/04/28 05:14:30
3	25	330.68014774281363	259.15146849184765	20/04/28 05:14:30
3	25	330.7243124926755	259.3748798162768	20/04/28 05:14:30
3	25	330.6724097359847	259.40426579536825	20/04/28 05:14:30
3	25	330.6423257455856	259.3248472068625	20/04/28 05:14:30
3	25	330.83073450764397	259.3131773481248	20/04/28 05:14:30
3	25	330.89479534370537	259.0591711246563	20/04/28 05:14:30
3	25	330.67969065071065	258.98371594867683	20/04/28 05:14:31
3	25	330.76832884918014	258.85838038633176	20/04/28 05:14:31
3	25	330.8135938485376	258.62009714970526	20/04/28 05:14:31
3	25	330.8451443360119	258.82868456062175	20/04/28 05:14:31
3	25	330.6672408849729	258.80432442954566	20/04/28 05:14:31
3	25	330.706889838469	258.88040772219847	20/04/28 05:14:31
3	25	330.7157867950759	259.0359747358236	20/04/28 05:14:31
3	25	330.8173931565975	258.85127456235193	20/04/28 05:14:31
3	25	330.83936093946033	258.9947288369209	20/04/28 05:14:31
3	25	330.84927211591474	258.9979127298813	20/04/28 05:14:32
3	25	330.84927211591474	258.9979127298813	20/04/28 05:14:32
3	25	330.84927211591474	258.9979127298813	20/04/28 05:14:32
3	25	330.79265541045834	259.28724001819376	20/04/28 05:14:32
3	25	330.74927495658676	259.50892633821604	20/04/28 05:14:32
3	25	330.74927495658676	259.50892633821604	20/04/28 05:14:32
3	25	330.7114437342604	259.70225452432294	20/04/28 05:14:32
3	25	330.6571372670362	259.97977584551495	20/04/28 05:14:32
3	25	330.6259207095907	260.13930123370835	20/04/28 05:14:32
3	25	330.59043907218495	260.3206223800505	20/04/28 05:14:32
3	25	330.55292939097853	260.512307400601	20/04/28 05:14:33
3	47	330.406080382577	260.5902380217895	20/04/28 05:14:33
3	47	330.1897484607382	260.59323490419945	20/04/28 05:14:33
3	47	329.9474964373588	260.59659086212497	20/04/28 05:14:33
3	47	329.77092266606434	260.5990369682047	20/04/28 05:14:33
3	47	329.582807664751	260.6016429568803	20/04/28 05:14:33
3	47	329.42493972897984	260.60382992788203	20/04/28 05:14:33
3	47	329.22200952994734	260.60664115397736	20/04/28 05:14:33
3	47	329.001605521362	260.60969444768824	20/04/28 05:14:33
3	47	328.7809650920801	260.6127510165747	20/04/28 05:14:33
3	47	328.5775362264149	260.61556915078256	20/04/28 05:14:34
3	47	328.34709949242216	260.61876142952184	20/04/28 05:14:34
3	47	328.1393374141813	260.62163959245055	20/04/28 05:14:34
3	47	327.9649593666076	260.6240552808012	20/04/28 05:14:34
3	47	327.76603846310695	260.6268109654528	20/04/28 05:14:34
3	47	327.46887060815766	260.630927681607	20/04/28 05:14:34
3	47	327.21987113218006	260.6343771131254	20/04/28 05:14:34
3	47	327.03917750436807	260.63688029226876	20/04/28 05:14:34
3	47	326.86854201204375	260.6392441343736	20/04/28 05:14:34
3	47	326.6485566637679	260.64229162831293	20/04/28 05:14:35
3	47	326.4127436389855	260.64555838571056	20/04/28 05:14:35
3	47	326.16925207475	260.6489315152035	20/04/28 05:14:35
3	47	325.93551632704964	260.6521694957332	20/04/28 05:14:35
3	47	325.74027454696846	260.6548742128708	20/04/28 05:14:35
3	47	325.5206700380643	260.65791643097845	20/04/28 05:14:35
3	47	325.25676350616084	260.6615723724438	20/04/28 05:14:35
3	47	325.0756221115471	260.66408175457576	20/04/28 05:14:35
3	47	324.87946300202003	260.6667991796321	20/04/28 05:14:35
3	47	324.64286672712154	260.670076787525	20/04/28 05:14:35
3	47	324.34755326325853	260.6741678144883	20/04/28 05:14:36
3	47	324.12245245608915	260.677286173738	20/04/28 05:14:36
3	47	323.87377545941274	260.68073113789666	20/04/28 05:14:36
3	47	323.72032585554797	260.68285690100515	20/04/28 05:14:36
3	47	323.5041189166287	260.68585205200577	20/04/28 05:14:36
3	47	323.22181656565857	260.68976283383915	20/04/28 05:14:36
3	47	322.9219401706877	260.6939170718527	20/04/28 05:14:36
3	47	322.6738900753762	260.6973533514415	20/04/28 05:14:36
3	47	322.47991962820595	260.700040456591	20/04/28 05:14:36
3	47	322.25285007108477	260.70318608926414	20/04/28 05:14:36
3	47	322.06661438583427	260.705766043459	20/04/28 05:14:37
3	47	321.9151970016367	260.70786365388744	20/04/28 05:14:37
3	47	321.7475902496039	260.71018553834483	20/04/28 05:14:37
3	47	321.4935020854002	260.71370546431507	20/04/28 05:14:37
3	47	321.28052344968063	260.7166558930898	20/04/28 05:14:37
3	47	321.01624972255996	260.7203169213721	20/04/28 05:14:37
3	47	320.79831587140455	260.72333599557766	20/04/28 05:14:37
3	47	320.544409983022	260.7268533964504	20/04/28 05:14:37
3	47	320.29329875077303	260.7303320824828	20/04/28 05:14:37
3	47	320.0910953046312	260.7331332407484	20/04/28 05:14:38
3	47	319.91400775771825	260.73558646424794	20/04/28 05:14:38
3	47	319.75929754611803	260.7377296907669	20/04/28 05:14:38
3	47	319.49506748409124	260.74139011414934	20/04/28 05:14:38
3	47	319.3390854628639	260.74355095926046	20/04/28 05:14:38
3	47	319.09218143952097	260.746971362122	20/04/28 05:14:38
3	47	318.84216046247303	260.7504349446662	20/04/28 05:14:38
3	47	318.65339424209935	260.7530499547887	20/04/28 05:14:38
3	47	318.368501418603	260.75699662287263	20/04/28 05:14:38
3	47	318.11463689454024	260.7605134507185	20/04/28 05:14:38
3	47	317.8871368822921	260.76366504655874	20/04/28 05:14:39
3	47	317.5991858946322	260.76765407990393	20/04/28 05:14:39
3	47	317.3951390235049	260.77048077544515	20/04/28 05:14:39
3	47	317.1234889836613	260.77424398902525	20/04/28 05:14:39
3	47	316.9177407752971	260.77709425347666	20/04/28 05:14:39
3	47	316.7063562964692	260.7800225981285	20/04/28 05:14:39
3	47	316.41287762555504	260.78408820739725	20/04/28 05:14:39
3	47	316.2271753465398	260.786660772226	20/04/28 05:14:39
3	47	315.9539550411839	260.7904457389577	20/04/28 05:14:39
3	47	315.691811804931	260.7940772531926	20/04/28 05:14:39
3	47	315.50611866619215	260.7966496913996	20/04/28 05:14:40
3	47	315.30019466101527	260.79950239119376	20/04/28 05:14:40
3	47	315.03770108391683	260.80313875875913	20/04/28 05:14:40
3	47	314.4775142695972	260.81089912068745	20/04/28 05:14:40
3	47	314.2860761888225	260.8135511445404	20/04/28 05:14:40
3	47	314.0061519284233	260.8174289822861	20/04/28 05:14:40
3	47	313.70901622673153	260.8215452530158	20/04/28 05:14:40
3	47	313.4499812859525	260.82513370751195	20/04/28 05:14:40
3	47	313.20513830478706	260.82852555841043	20/04/28 05:14:40
3	47	312.93177384741546	260.8323125221042	20/04/28 05:14:41
3	47	312.64939444533803	260.8362243713395	20/04/28 05:14:41
3	47	312.4793541909404	260.83857996751345	20/04/28 05:14:41
3	47	312.22046064094104	260.8421664632994	20/04/28 05:14:41
3	47	312.0556830072142	260.84444915550625	20/04/28 05:14:41
3	47	311.89941866704646	260.846613911629	20/04/28 05:14:41
3	47	311.71247389218905	260.84920368896115	20/04/28 05:14:41
3	47	311.54081948590425	260.85158164625204	20/04/28 05:14:41
3	47	311.37763264272184	260.85384230097054	20/04/28 05:14:41
3	47	311.08831853009104	260.8578502179147	20/04/28 05:14:41
3	47	310.8690874893715	260.8608872623049	20/04/28 05:14:42
3	47	310.64592737021223	260.863978736878	20/04/28 05:14:42
3	47	310.39697652918966	260.86742749464827	20/04/28 05:14:42
3	47	310.17355259060713	260.8705226239561	20/04/28 05:14:42
3	47	309.87826064381045	260.8746133528399	20/04/28 05:14:42
3	47	309.6638425574483	260.8775837225659	20/04/28 05:14:42
3	47	309.3964563957425	260.8812878679267	20/04/28 05:14:42
3	47	309.2339642176187	260.8835388993336	20/04/28 05:14:42
3	47	309.03500804490244	260.8862950725756	20/04/28 05:14:42
3	47	308.84671123540295	260.8889035798705	20/04/28 05:14:43
3	47	308.6939729206002	260.89101948937224	20/04/28 05:14:43
3	47	308.51810384342366	260.89345583320613	20/04/28 05:14:43
3	47	308.32825556093235	260.8960858333167	20/04/28 05:14:43
3	47	308.06830619008645	260.899686955566	20/04/28 05:14:43
3	47	307.80867912805434	260.9032836128172	20/04/28 05:14:43
3	47	307.5206238003956	260.9072740916019	20/04/28 05:14:43
3	47	307.2798385524084	260.9106097300418	20/04/28 05:14:43
3	47	307.0527057583161	260.9137562387473	20/04/28 05:14:43
3	47	306.8302118486172	260.91683848420894	20/04/28 05:14:43
3	47	306.6238968976127	260.91969659984125	20/04/28 05:14:44
3	47	306.3546107526025	260.9234270659896	20/04/28 05:14:44
3	47	306.0876503400201	260.9271253133764	20/04/28 05:14:44
3	47	305.83744634156625	260.9305914313468	20/04/28 05:14:44
3	47	305.6081681905849	260.9926017422977	20/04/28 05:14:44
3	47	305.4915888083808	261.13443591105596	20/04/28 05:14:44
3	47	305.38617251235297	261.26268871560853	20/04/28 05:14:44
3	47	305.27451204329554	261.39853837883794	20/04/28 05:14:44
3	47	305.12051238023747	261.5858992464797	20/04/28 05:14:44
3	47	304.95776969811743	261.7838971480261	20/04/28 05:14:44
3	47	304.8283019370112	261.9414117267648	20/04/28 05:14:45
3	47	304.6905476666665	262.1090079350981	20/04/28 05:14:45
3	47	304.5033979482986	262.33670020997715	20/04/28 05:14:45
3	47	304.363054508682	262.5074464836522	20/04/28 05:14:45
3	47	304.2542452598019	262.63982726210844	20/04/28 05:14:45
3	47	304.09611027735775	262.83221929029145	20/04/28 05:14:45
3	47	303.9980669326798	262.9515019287115	20/04/28 05:14:45
3	47	303.8577769930022	263.1221831126664	20/04/28 05:14:45
3	47	303.75267550344915	263.250052913691	20/04/28 05:14:45
3	47	303.5786479270359	263.4617803750561	20/04/28 05:14:46
3	47	303.42995973266693	263.64267914166277	20/04/28 05:14:46
3	47	303.2935353035773	263.8086574230056	20/04/28 05:14:46
3	47	303.1910690126315	263.93332115794124	20/04/28 05:14:46
3	47	303.0748264386419	264.0747455551582	20/04/28 05:14:46
3	47	302.8886248754735	264.3012842743911	20/04/28 05:14:46
3	47	302.73328369181576	264.4902772784838	20/04/28 05:14:46
3	47	302.62377475188015	264.62350932323915	20/04/28 05:14:46
3	47	302.50252907342906	264.77102065580516	20/04/28 05:14:46
1	98	302.4340098358651	264.81267052651464	20/04/28 05:14:46
1	98	302.5360665675243	264.5922307936781	20/04/28 05:14:47
1	98	302.64378243011055	264.3595674937199	20/04/28 05:14:47
1	98	302.71856448475023	264.19804031292813	20/04/28 05:14:47
1	98	302.81995875121976	263.9790314866771	20/04/28 05:14:47
1	98	302.9447388368203	263.7095099344392	20/04/28 05:14:47
1	98	303.01537561339734	263.55693644022745	20/04/28 05:14:47
1	98	303.1248850728665	263.3203990203434	20/04/28 05:14:47
1	98	303.23567266890007	263.08110086064147	20/04/28 05:14:47
1	98	303.3014587168765	262.9390048067651	20/04/28 05:14:47
1	98	303.3724880096355	262.7855834883983	20/04/28 05:14:47
1	98	303.452962524046	262.6117607510993	20/04/28 05:14:48
1	98	303.54729845468535	262.4079977360688	20/04/28 05:14:48
1	98	303.63883990297916	262.2102707260295	20/04/28 05:14:48
1	98	303.7055988423107	262.06607325358993	20/04/28 05:14:48
1	98	303.80704085544346	261.8469612958597	20/04/28 05:14:48
1	98	303.9046131303877	261.6362078661616	20/04/28 05:14:48
1	98	303.8851879612461	261.8921004494635	20/04/28 05:14:48
1	98	303.9420119631606	261.8654618749063	20/04/28 05:14:48
1	98	303.7179110895131	261.7083877774702	20/04/28 05:14:48
1	98	303.77206807416974	261.69198014814134	20/04/28 05:14:49
1	98	303.7181705657145	261.9202443345081	20/04/28 05:14:49
1	98	303.83775107215024	261.71824629845344	20/04/28 05:14:49
1	98	303.673865288176	261.5554086602796	20/04/28 05:14:49
1	98	303.6929200759635	261.61053598247776	20/04/28 05:14:49
1	98	303.6504726760199	261.627543824172	20/04/28 05:14:49
1	98	303.6892030464113	261.41863220450796	20/04/28 05:14:49
1	98	303.6501469410168	261.28857361894524	20/04/28 05:14:49
1	98	303.5495253303252	261.1142055948708	20/04/28 05:14:49
1	98	303.354724526609	261.08315729508786	20/04/28 05:14:49
1	98	303.4551669279381	261.01751617950794	20/04/28 05:14:50
1	98	303.3175344277888	261.069096315272	20/04/28 05:14:50
1	98	303.06535369412194	260.95560698571086	20/04/28 05:14:50
1	98	302.81834401326984	261.0442400479931	20/04/28 05:14:50
1	98	302.8280805743216	261.0113371136292	20/04/28 05:14:50
1	98	302.7477295124506	260.82636401146203	20/04/28 05:14:50
1	98	302.9944051985263	260.87939424491157	20/04/28 05:14:50
1	98	303.00811252695325	260.878109976914	20/04/28 05:14:50
1	98	303.01117724781875	260.81109592167377	20/04/28 05:14:50
1	98	303.0937593080649	260.7730761117375	20/04/28 05:14:51
1	98	303.0399254036918	260.7968842607874	20/04/28 05:14:51
1	98	303.16473296584854	260.9271017086363	20/04/28 05:14:51
1	98	303.1811345770844	261.1437185097597	20/04/28 05:14:51
1	98	303.14858327896144	261.1679848683913	20/04/28 05:14:51
1	98	303.0161933633459	261.05884856188567	20/04/28 05:14:51
1	98	303.0290043524898	261.0493102551913	20/04/28 05:14:51
1	98	303.02384453175404	261.0647320551271	20/04/28 05:14:51
1	98	303.04060512036745	261.0917095400685	20/04/28 05:14:51
1	98	302.9907105988766	261.06417270756367	20/04/28 05:14:51
1	98	303.2732104098136	261.1240453156261	20/04/28 05:14:52
1	98	303.2664920480168	261.07193879250457	20/04/28 05:14:52
1	98	303.0658832198275	261.28747255652104	20/04/28 05:14:52
1	98	303.07521244856815	261.2950121017109	20/04/28 05:14:52
1	98	303.0929417916775	261.12652813266095	20/04/28 05:14:52
1	98	302.91355578717173	260.964949465658	20/04/28 05:14:52
1	98	302.79508558354405	260.78455933365206	20/04/28 05:14:52
1	98	302.93070144364566	260.60640454632625	20/04/28 05:14:52
1	98	303.0559657706216	260.68283406418607	20/04/28 05:14:52
1	98	302.8660628659261	260.625727261211	20/04/28 05:14:52
1	98	302.9354227889409	260.6047284714574	20/04/28 05:14:53
1	98	302.6592041958371	260.5249631354659	20/04/28 05:14:53
1	98	302.6764688333643	260.5300950813646	20/04/28 05:14:53
1	98	302.66903592451973	260.57202903583607	20/04/28 05:14:53
1	98	302.680651653547	260.5777990152376	20/04/28 05:14:53
1	98	302.72794098313597	260.84123741846986	20/04/28 05:14:53
1	98	302.8475967631849	261.0569741324869	20/04/28 05:14:53
1	98	303.0706834507862	261.1754118071115	20/04/28 05:14:53
1	98	303.1102510674337	261.10792696791543	20/04/28 05:14:53
1	98	302.9080633025946	260.98092768384754	20/04/28 05:14:54
1	98	302.73480917517014	261.0739811647239	20/04/28 05:14:54
1	98	302.7722646573337	261.02513679281645	20/04/28 05:14:54
1	98	302.57451080171825	260.8973124214652	20/04/28 05:14:54
1	98	302.7204156313257	261.07790313301473	20/04/28 05:14:54
1	98	302.83400464172394	261.0332907802561	20/04/28 05:14:54
1	98	302.63278883402694	261.009491310125	20/04/28 05:14:54
1	98	302.8830015247138	260.9188557894496	20/04/28 05:14:54
1	98	302.75428615764326	261.12794985898046	20/04/28 05:14:54
1	98	302.9698088204048	261.02259646755977	20/04/28 05:14:54
1	98	302.84474692695005	261.10366267608924	20/04/28 05:14:55
1	98	302.74207384835097	261.0783224080945	20/04/28 05:14:55
1	98	302.7376500342493	261.1035918041234	20/04/28 05:14:55
1	98	302.72532086881546	260.9399948446956	20/04/28 05:14:55
1	98	302.7611852512696	260.82964304756655	20/04/28 05:14:55
1	98	302.8860182652682	260.6580615180621	20/04/28 05:14:55
1	98	302.7143050940145	260.8721459015353	20/04/28 05:14:55
1	98	302.6700958661253	260.95670231820833	20/04/28 05:14:55
1	98	302.8446021061592	261.11007563972976	20/04/28 05:14:55
1	98	303.08515268183305	260.9350981165497	20/04/28 05:14:56
1	98	303.2502618044804	261.04386119481507	20/04/28 05:14:56
1	98	303.27135814206815	261.04533214808293	20/04/28 05:14:56
1	98	303.36893275678386	260.9528995499037	20/04/28 05:14:56
1	98	303.13476847064027	261.0065273619952	20/04/28 05:14:56
1	98	303.073426863207	260.84360205083755	20/04/28 05:14:56
1	98	303.1451567995112	260.6540029213812	20/04/28 05:14:56
1	98	303.17940231744035	260.6330090580072	20/04/28 05:14:56
1	98	303.2024726427597	260.6715094675136	20/04/28 05:14:56
1	98	303.33763767725566	260.5623943192487	20/04/28 05:14:56
1	98	303.44630499030205	260.5310628330961	20/04/28 05:14:57
1	98	303.24225852727136	260.519802011729	20/04/28 05:14:57
1	98	303.3148073673521	260.7415076378155	20/04/28 05:14:57
1	98	303.4458187103698	260.7608628422182	20/04/28 05:14:57
1	98	303.2960593652762	260.90656148956054	20/04/28 05:14:57
1	98	303.35088436281416	260.9371754062372	20/04/28 05:14:57
1	98	303.45742366156765	261.13108465159155	20/04/28 05:14:57
1	98	303.7120121345272	261.1746553549351	20/04/28 05:14:57
1	98	303.99281310987374	261.22020125924547	20/04/28 05:14:57
1	98	303.95734020347226	261.2064963705522	20/04/28 05:14:57
1	98	303.9991760471715	261.1909836333784	20/04/28 05:14:58
1	98	303.79183497402227	261.18913645642874	20/04/28 05:14:58
1	98	303.7406685954953	261.36945092040185	20/04/28 05:14:58
1	98	303.75150956052477	261.4151658439799	20/04/28 05:14:58
1	98	303.84241893854806	261.39296484396976	20/04/28 05:14:58
1	98	303.9361702491296	261.41202010626074	20/04/28 05:14:58
1	98	303.71131368070365	261.61023559987285	20/04/28 05:14:58
1	98	303.72863865318055	261.61923499137646	20/04/28 05:14:58
1	98	303.8607773617983	261.67939195487526	20/04/28 05:14:58
1	98	303.63146760560033	261.66482374089037	20/04/28 05:14:59
1	98	303.5818284569807	261.38022606338984	20/04/28 05:14:59
1	98	303.68896159042924	261.3392195143083	20/04/28 05:14:59
1	98	303.68785432706215	261.3741268891443	20/04/28 05:14:59
1	98	303.6339460911582	261.3529829422523	20/04/28 05:14:59
1	98	303.53355499477647	261.45709777811146	20/04/28 05:14:59
1	98	303.53411627702457	261.4672607954984	20/04/28 05:14:59
1	98	303.5079717233556	261.4333448357046	20/04/28 05:14:59
1	98	303.63062157891335	261.4483832029259	20/04/28 05:14:59
1	98	303.55106601513125	261.22759361925404	20/04/28 05:14:59
1	98	303.6932089714843	261.16813599417037	20/04/28 05:15:00
1	98	303.5091400040138	261.18816514351585	20/04/28 05:15:00
1	98	303.54207192701074	261.2204105222303	20/04/28 05:15:00
1	98	303.60032356409243	261.1259817379364	20/04/28 05:15:00
1	98	303.44533522378646	261.17825625923575	20/04/28 05:15:00
1	98	303.4527365727941	261.18022258970143	20/04/28 05:15:00
1	98	303.5412453574582	261.0191040108429	20/04/28 05:15:00
1	98	303.50167657536406	260.9563059909715	20/04/28 05:15:00
1	98	303.52336807105394	260.9747403309404	20/04/28 05:15:00
1	98	303.667039034744	261.0405953836116	20/04/28 05:15:00
1	98	303.7132490946134	261.0220199117084	20/04/28 05:15:01
1	98	303.7427204465206	261.10134532544595	20/04/28 05:15:01
1	98	303.4742443884047	261.2271786401658	20/04/28 05:15:01
1	98	303.5049320454791	261.19507625238475	20/04/28 05:15:01
1	98	303.4711456750825	261.2673039993579	20/04/28 05:15:01
1	98	303.4071246951968	261.02800515675744	20/04/28 05:15:01
1	98	303.5199652925171	261.1273066578665	20/04/28 05:15:01
1	98	303.55217583725897	261.35967233876863	20/04/28 05:15:01
1	98	303.3532176482585	261.5032059887512	20/04/28 05:15:01
1	98	303.31068987021405	261.6026894862423	20/04/28 05:15:02
1	98	303.4552930783785	261.77384374900475	20/04/28 05:15:02
1	98	303.46218754189346	261.4900312629158	20/04/28 05:15:02
1	98	303.4339728540983	261.459560558869	20/04/28 05:15:02
1	98	303.6424994391119	261.63436743124987	20/04/28 05:15:02
1	98	303.85597471224503	261.4697063796934	20/04/28 05:15:02
1	98	303.9273503581875	261.180068771995	20/04/28 05:15:02
1	98	303.83118006356085	261.12863787740486	20/04/28 05:15:02
1	98	303.83875884770794	261.04074851429795	20/04/28 05:15:02
1	98	303.83875884770794	261.04074851429795	20/04/28 05:15:02
1	98	303.83875884770794	261.04074851429795	20/04/28 05:15:03
1	98	303.78775478463314	261.11251304346285	20/04/28 05:15:03
1	98	303.582145024022	261.0960533906496	20/04/28 05:15:03
1	98	303.6747022751657	261.0070800873163	20/04/28 05:15:03
1	98	303.68390406637224	261.0106553168472	20/04/28 05:15:03
1	98	303.7251926436937	261.03507516173767	20/04/28 05:15:03
1	98	303.86160654117697	260.77373146454374	20/04/28 05:15:03
1	98	303.8182766374612	261.039817102635	20/04/28 05:15:03
1	98	303.8732286215249	261.0861844817638	20/04/28 05:15:03
1	98	303.85249542172846	261.191889993145	20/04/28 05:15:03
1	98	304.0999475986321	261.1736587885172	20/04/28 05:15:04
1	98	304.19682005149366	261.13687500601327	20/04/28 05:15:04
1	98	304.2397225192792	261.1913496083993	20/04/28 05:15:04
1	98	304.3058504146087	261.2618544561619	20/04/28 05:15:04
1	98	304.1336190810768	261.21342812237214	20/04/28 05:15:04
1	98	304.20594932962	261.2272650851586	20/04/28 05:15:04
1	98	304.31384267258784	261.2192930918585	20/04/28 05:15:04
1	98	304.4708407986718	261.0877880338609	20/04/28 05:15:04
1	98	304.45799432064285	261.0729352867587	20/04/28 05:15:04
1	98	304.4389376853132	261.3601978608806	20/04/28 05:15:05
1	98	304.42888584692315	261.3744412241012	20/04/28 05:15:05
1	98	304.30050839804653	261.37392816717824	20/04/28 05:15:05
1	98	304.25066332450916	261.40458053737353	20/04/28 05:15:05
1	98	304.2405950339967	261.4989513246128	20/04/28 05:15:05
1	98	304.2380833962361	261.5211086525991	20/04/28 05:15:05
1	98	304.0042440055946	261.60453008557084	20/04/28 05:15:05
1	98	304.00276933571035	261.6174221996219	20/04/28 05:15:05
1	98	304.13082192188284	261.65438278425586	20/04/28 05:15:05
1	98	303.98057333577816	261.6067253640689	20/04/28 05:15:05
1	98	304.1577731347668	261.4395371224062	20/04/28 05:15:06
1	98	304.16974522114964	261.4249594732775	20/04/28 05:15:06
1	98	304.36209830234924	261.0149519423273	20/04/28 05:15:06
1	98	304.49472593869496	261.22373065420567	20/04/28 05:15:06
1	98	304.49472593869496	261.22373065420567	20/04/28 05:15:06
1	98	304.4830061617533	261.3087801733129	20/04/28 05:15:06
1	98	304.48030676850414	261.345534277201	20/04/28 05:15:06
1	98	304.5539565720469	261.3829795087632	20/04/28 05:15:06
1	98	304.662882142384	261.29497065408793	20/04/28 05:15:06
1	98	304.6629686860426	261.2838822704943	20/04/28 05:15:07
1	98	304.8902136567355	261.4319458261797	20/04/28 05:15:07
1	98	304.8902136567355	261.4319458261797	20/04/28 05:15:07
1	98	305.1337222696929	261.36136873465915	20/04/28 05:15:07
1	98	305.27473369325855	261.4797611621567	20/04/28 05:15:07
1	98	305.10373576402947	261.35525828741976	20/04/28 05:15:07
1	98	305.12274884364126	261.6381048722011	20/04/28 05:15:07
1	98	305.23251594575777	261.4016985838166	20/04/28 05:15:07
1	98	305.1517836357382	261.52066207571784	20/04/28 05:15:07
1	98	305.1398973172208	261.24761351780506	20/04/28 05:15:07
1	98	305.17352960088255	261.3332147415912	20/04/28 05:15:08
1	98	305.31836214814837	261.23803283849486	20/04/28 05:15:08
1	98	305.3322823821252	261.3137155587961	20/04/28 05:15:08
1	98	305.2023002876109	261.3831523265813	20/04/28 05:15:08
1	98	304.9922951932865	261.39091417332145	20/04/28 05:15:08
1	98	304.71925119952925	261.3974924650075	20/04/28 05:15:08
1	98	304.5087416301257	261.3256503968322	20/04/28 05:15:08
1	98	304.35397382814665	261.39486433046767	20/04/28 05:15:08
1	98	304.37257274534784	261.33853001299366	20/04/28 05:15:08
1	98	304.2405031790947	261.4118814546933	20/04/28 05:15:08
1	98	304.11476584805166	261.28578277964834	20/04/28 05:15:09
1	98	304.1296382990262	261.27842250778065	20/04/28 05:15:09
1	98	303.9911270608531	261.2234777214081	20/04/28 05:15:09
1	98	303.70142949955795	261.25415956661965	20/04/28 05:15:09
1	98	303.6530757189451	261.27380133472076	20/04/28 05:15:09
1	98	303.488062739627	261.1544942413327	20/04/28 05:15:09
1	98	303.68486055331266	261.1064014221551	20/04/28 05:15:09
1	98	303.6859265550282	261.04102403400134	20/04/28 05:15:09
1	98	303.67939574356996	260.96317816823154	20/04/28 05:15:09
1	98	303.94233739564777	261.08358449097585	20/04/28 05:15:10
1	98	303.9901578675344	261.1233099836214	20/04/28 05:15:10
1	98	303.8355621489708	261.3406881578607	20/04/28 05:15:10
1	98	303.85627838356385	261.31915835932216	20/04/28 05:15:10
1	98	303.7528251163326	261.2857842550587	20/04/28 05:15:10
1	98	303.9211629999835	261.08971087792077	20/04/28 05:15:10
1	98	303.7837727626403	261.07681300582703	20/04/28 05:15:10
1	98	303.84263212619135	261.06430701798774	20/04/28 05:15:10
1	98	303.8109086067115	261.2840741264728	20/04/28 05:15:10
1	98	304.0135844077334	261.40998406554957	20/04/28 05:15:10
1	98	303.7835512232795	261.58538884284775	20/04/28 05:15:11
1	98	303.61250419364205	261.527457434422	20/04/28 05:15:11
1	98	303.3677785967737	261.6103114769473	20/04/28 05:15:11
1	98	303.3987862773676	261.6189451304637	20/04/28 05:15:11
1	98	303.270204767446	261.6533002463987	20/04/28 05:15:11
1	98	303.276744823401	261.6601796778059	20/04/28 05:15:11
1	98	303.42117293087176	261.4167962912308	20/04/28 05:15:11
1	98	303.51075887061126	261.681012217955	20/04/28 05:15:11
1	98	303.31760665669236	261.87548532311786	20/04/28 05:15:11
1	98	303.3103568485099	261.89996337686404	20/04/28 05:15:11
1	98	303.5134818062042	262.02820161601943	20/04/28 05:15:12
1	98	303.54176374177956	262.069136979097	20/04/28 05:15:12
1	98	303.3306742079629	262.03845217445894	20/04/28 05:15:12
1	98	303.2976437429635	262.08442484629575	20/04/28 05:15:12
1	98	303.20355430186424	262.29595453340664	20/04/28 05:15:12
1	98	303.4861794590163	262.3177585386312	20/04/28 05:15:12
1	98	303.4926268986769	262.3405820591297	20/04/28 05:15:12
1	98	303.387718651471	262.25221718150834	20/04/28 05:15:12
1	98	303.35516855039907	262.3021262776122	20/04/28 05:15:12
1	98	303.3047805940118	262.2433481639445	20/04/28 05:15:13
1	98	303.44157454259044	262.21866111376977	20/04/28 05:15:13
1	98	303.4255129283954	262.2165214262485	20/04/28 05:15:13
1	98	303.45250914838397	262.24275328481195	20/04/28 05:15:13
1	98	303.45620964715295	262.23392449789316	20/04/28 05:15:13
1	98	303.37387433883856	262.4441710076145	20/04/28 05:15:13
1	98	303.36490017091563	262.27049742549656	20/04/28 05:15:13
1	98	303.0853936151985	262.2950994383268	20/04/28 05:15:13
1	98	303.3556225039241	262.309123461683	20/04/28 05:15:13
1	98	303.27821348125406	262.3445792260566	20/04/28 05:15:13
1	98	303.25537984772006	262.3821751710024	20/04/28 05:15:14
1	98	303.3178066946255	262.31277023445944	20/04/28 05:15:14
1	98	303.3251466753808	262.3240119259856	20/04/28 05:15:14
1	98	303.07123088041567	262.309755522572	20/04/28 05:15:14
1	98	303.2159248200208	262.1254476245652	20/04/28 05:15:14
1	98	303.20797832540217	262.14471726678346	20/04/28 05:15:14
1	98	303.20048580050155	262.01201749344597	20/04/28 05:15:14
1	98	303.27394230888183	261.77713699267207	20/04/28 05:15:14
1	98	303.2085942104033	261.70868618116094	20/04/28 05:15:14
1	98	303.2190835290013	261.70016130646263	20/04/28 05:15:15
1	98	303.2478381554144	261.9045622715207	20/04/28 05:15:15
1	98	303.182505747664	262.13276572493805	20/04/28 05:15:15
1	98	303.182505747664	262.13276572493805	20/04/28 05:15:15
1	98	303.3303405750443	261.99541721841456	20/04/28 05:15:15
1	98	303.2576011681603	262.06526895061114	20/04/28 05:15:15
1	98	303.22377227596905	262.0105527719343	20/04/28 05:15:15
1	98	303.3675945924274	261.98500978758597	20/04/28 05:15:15
1	98	303.2480588245608	262.0867913442086	20/04/28 05:15:15
1	98	303.2631061561825	262.14200471102987	20/04/28 05:15:15
1	98	303.23950413285513	262.3599078853217	20/04/28 05:15:16
1	98	303.2969447075036	262.3237502952914	20/04/28 05:15:16
1	98	303.22358574204026	262.5967409274601	20/04/28 05:15:16
1	98	303.09181833788955	262.7299997481984	20/04/28 05:15:16
1	98	302.9044944502934	262.52284244318463	20/04/28 05:15:16
1	98	302.9573225838979	262.7131307866497	20/04/28 05:15:16
1	98	303.0235603219334	262.70567513811784	20/04/28 05:15:16
1	98	303.0158046886516	262.6941208024266	20/04/28 05:15:16
1	98	303.0969922177189	262.7199356325462	20/04/28 05:15:16
1	98	302.96922720255645	262.7258689601152	20/04/28 05:15:17
1	98	302.96922720255645	262.7258689601152	20/04/28 05:15:17
1	98	303.22301349521535	262.8540551315216	20/04/28 05:15:17
1	98	303.5052538061057	262.9547050489126	20/04/28 05:15:17
1	98	303.45172011655717	263.1100147982021	20/04/28 05:15:17
1	98	303.45172011655717	263.1100147982021	20/04/28 05:15:17
1	98	303.3921720684918	263.3302638369384	20/04/28 05:15:17
1	98	303.3921720684918	263.3302638369384	20/04/28 05:15:17
1	98	303.55895900386685	263.53890374032784	20/04/28 05:15:17
1	98	303.5278134558712	263.6917253257039	20/04/28 05:15:17
1	98	303.5278134558712	263.6917253257039	20/04/28 05:15:18
1	98	303.7484827559197	263.5898857804145	20/04/28 05:15:18
1	98	303.7484827559197	263.5898857804145	20/04/28 05:15:18
1	98	303.8749263894611	263.4022724637179	20/04/28 05:15:18
1	98	303.8828330069835	263.4315300314224	20/04/28 05:15:18
1	98	303.7243614961758	263.5667708809651	20/04/28 05:15:18
1	98	303.7962590267164	263.4713003057144	20/04/28 05:15:18
1	98	303.9820034940895	263.39282770426394	20/04/28 05:15:18
1	98	303.9190196426836	263.6623767979964	20/04/28 05:15:18
1	98	303.8103646232006	263.83846745970556	20/04/28 05:15:18
1	98	304.03440788900934	263.87452355507224	20/04/28 05:15:19
1	98	304.0515927081516	263.8854983298157	20/04/28 05:15:19
1	98	304.0424965795569	263.88331471347135	20/04/28 05:15:19
1	98	304.18575196603507	263.8710670606459	20/04/28 05:15:19
1	98	304.5589189049161	263.81217930316535	20/04/28 05:15:19
1	98	304.55513598607405	263.76215249219507	20/04/28 05:15:19
1	98	304.51263472547134	263.67781190893083	20/04/28 05:15:19
1	98	304.5770400089691	263.50969164124115	20/04/28 05:15:19
1	98	304.37436359138627	263.59242501981294	20/04/28 05:15:19
1	98	304.3236327819975	263.5988146458375	20/04/28 05:15:20
1	98	304.3048816158498	263.73336243836616	20/04/28 05:15:20
1	98	304.29285177778263	263.95298671421347	20/04/28 05:15:20
1	98	304.07675513796755	264.05267788134705	20/04/28 05:15:20
1	98	304.2875128322764	264.2529271127908	20/04/28 05:15:20
1	98	304.39810412517943	264.2470980685008	20/04/28 05:15:20
1	98	304.4880518691203	264.39549668464605	20/04/28 05:15:20
1	98	304.4811683517891	264.3991350557584	20/04/28 05:15:20
1	98	304.4971862272584	264.3995364906705	20/04/28 05:15:20
1	98	304.68811723160223	264.2632306207613	20/04/28 05:15:20
1	98	304.5967418208338	264.5296601008144	20/04/28 05:15:21
1	98	304.71956729809307	264.49715889995264	20/04/28 05:15:21
1	98	304.71956729809307	264.49715889995264	20/04/28 05:15:21
1	98	304.64786033414447	264.02365303380395	20/04/28 05:15:21
1	98	304.64786033414447	264.02365303380395	20/04/28 05:15:21
1	98	304.8277974725414	264.0930693707117	20/04/28 05:15:21
1	98	304.99252219809625	263.84369999704165	20/04/28 05:15:21
1	98	305.0428210113824	263.85073780702504	20/04/28 05:15:21
1	98	304.9503744917762	264.0239017921349	20/04/28 05:15:21
1	98	304.9503744917762	264.0239017921349	20/04/28 05:15:21
1	98	305.205067747502	264.06639378416304	20/04/28 05:15:22
1	98	305.2044415774149	264.2203180638153	20/04/28 05:15:22
1	98	305.00100114354154	264.19780524956894	20/04/28 05:15:22
1	98	305.00100114354154	264.19780524956894	20/04/28 05:15:22
1	98	304.8399913538992	264.297391758488	20/04/28 05:15:22
1	98	304.84671291701835	264.29704386825483	20/04/28 05:15:22
1	98	304.84261476734423	264.2978026299099	20/04/28 05:15:22
1	98	304.7529949601133	264.22939271718656	20/04/28 05:15:22
1	98	304.656121208746	264.1963866361713	20/04/28 05:15:22
1	98	304.74211575753424	264.1020600761254	20/04/28 05:15:23
1	98	304.776754180804	263.918677846183	20/04/28 05:15:23
1	98	304.5392728600936	263.9755654747898	20/04/28 05:15:23
1	98	304.77003695900515	263.9047683231936	20/04/28 05:15:23
1	98	304.7864767492535	263.9158411583229	20/04/28 05:15:23
1	98	304.8903328608098	263.922605965199	20/04/28 05:15:23
1	98	304.8665949825563	263.88463743440957	20/04/28 05:15:23
1	98	304.91488882511607	263.8167762750964	20/04/28 05:15:23
1	98	305.1956619029456	263.7697679496999	20/04/28 05:15:23
1	98	305.21215411657397	263.78850483289375	20/04/28 05:15:23
1	98	305.10384452366344	263.76174180587003	20/04/28 05:15:24
1	98	305.10298464940007	263.93085258976737	20/04/28 05:15:24
1	98	305.07169387007934	263.9224461642966	20/04/28 05:15:24
1	98	305.0972280133392	263.90362955989514	20/04/28 05:15:24
1	98	305.0970863523801	263.90335988070973	20/04/28 05:15:24
1	98	305.0909220921675	263.8045972341675	20/04/28 05:15:24
1	98	305.1311706414661	264.0088245234038	20/04/28 05:15:24
1	98	305.259435496007	263.94156054220906	20/04/28 05:15:24
1	98	305.3606545633519	264.0972387947304	20/04/28 05:15:24
1	98	305.3655025155793	264.11114222761864	20/04/28 05:15:25
1	98	305.3729074685489	264.1086166925907	20/04/28 05:15:25
1	98	305.39799517361865	263.9432258229818	20/04/28 05:15:25
1	98	305.33586227784434	264.18615949171755	20/04/28 05:15:25
1	98	305.3495577075554	263.97389672073007	20/04/28 05:15:25
1	98	305.3391868684138	264.0437916464142	20/04/28 05:15:25
1	98	305.06460586984264	264.10361196961776	20/04/28 05:15:25
1	98	305.17832249682175	264.1931218786466	20/04/28 05:15:25
1	98	305.06038228861996	264.39814114440986	20/04/28 05:15:25
1	98	305.0877742989323	264.53747853483765	20/04/28 05:15:25
1	98	304.8957198079692	264.5531980082935	20/04/28 05:15:26
1	98	304.92431997886797	264.4948230812165	20/04/28 05:15:26
1	98	304.76628526477833	264.7370945616007	20/04/28 05:15:26
1	98	304.7460098956261	264.81735156023035	20/04/28 05:15:26
1	98	304.82584012281455	264.74716365253204	20/04/28 05:15:26
1	98	304.8266831488989	264.742002400421	20/04/28 05:15:26
1	98	304.82726889737256	264.87097046647676	20/04/28 05:15:26
1	98	304.9296201618062	265.07859225435686	20/04/28 05:15:26
1	98	304.98039694774735	264.9147234118506	20/04/28 05:15:26
1	98	305.10921652759066	265.0695427152959	20/04/28 05:15:26
1	98	304.97955833249233	265.0438341515946	20/04/28 05:15:27
1	98	304.8422735829163	264.9298870318843	20/04/28 05:15:27
1	98	305.0017274496751	264.92270643865936	20/04/28 05:15:27
1	98	305.1699234453119	264.7867055370119	20/04/28 05:15:27
1	98	305.1717267773682	264.74405300364793	20/04/28 05:15:27
1	98	305.1717267773682	264.74405300364793	20/04/28 05:15:27
1	98	305.1717267773682	264.74405300364793	20/04/28 05:15:27
1	98	305.16724764183283	264.7944892889684	20/04/28 05:15:27
1	98	305.113690503215	264.8691508910657	20/04/28 05:15:27
1	98	305.2878569143883	264.78954767422977	20/04/28 05:15:28
1	98	305.3546670185184	264.85463428843275	20/04/28 05:15:28
1	98	305.3668618615721	264.8828591092784	20/04/28 05:15:28
1	98	305.3222097929223	265.00538966825843	20/04/28 05:15:28
1	98	305.3401025975642	264.908834210606	20/04/28 05:15:28
1	98	305.18889426868975	264.7822362278722	20/04/28 05:15:28
1	98	305.17375436815996	264.71824637591243	20/04/28 05:15:28
1	98	305.35364553679807	264.9035329802616	20/04/28 05:15:28
1	98	305.36911170298777	264.66192133722734	20/04/28 05:15:28
1	98	305.35823641264204	264.45857391051646	20/04/28 05:15:28
1	98	305.1884297739629	264.58657073032964	20/04/28 05:15:29
1	98	305.08288467518787	264.6383587597149	20/04/28 05:15:29
1	98	305.07708796605147	264.4834443775042	20/04/28 05:15:29
1	98	304.80108670914836	264.3793559555184	20/04/28 05:15:29
1	98	304.78725283664306	264.29803975427535	20/04/28 05:15:29
1	98	304.92795239318997	264.073396705579	20/04/28 05:15:29
1	98	305.08748069473677	264.2925753182072	20/04/28 05:15:29
1	98	305.0249237078674	264.2564019936549	20/04/28 05:15:29
1	98	305.2110810020381	264.14952057901644	20/04/28 05:15:29
1	98	305.20109501257303	264.1036553022245	20/04/28 05:15:30
1	98	305.1303163497037	264.0119117642343	20/04/28 05:15:30
1	98	305.2288543375681	264.0293836530314	20/04/28 05:15:30
1	98	305.2530191031206	263.97293929129387	20/04/28 05:15:30
1	98	305.3732356478645	264.21118136206945	20/04/28 05:15:30
1	98	305.24790377022634	264.2789013608745	20/04/28 05:15:30
1	98	305.33844005085973	264.03754068261384	20/04/28 05:15:30
1	98	305.25896592881276	264.0971069503994	20/04/28 05:15:30
1	98	305.05585174742134	264.21589653570544	20/04/28 05:15:30
1	98	304.97498742384727	264.32650273497603	20/04/28 05:15:30
1	98	305.16523798046285	264.32304863584653	20/04/28 05:15:31
1	98	305.1369839813187	264.4745773904461	20/04/28 05:15:31
1	98	305.1738170245601	264.4056923358974	20/04/28 05:15:31
1	98	305.3341010035556	264.48925274356367	20/04/28 05:15:31
1	98	305.33723279338557	264.5557855951132	20/04/28 05:15:31
1	98	305.3115880139588	264.50133567533396	20/04/28 05:15:31
1	98	305.2487217595274	264.47703692217243	20/04/28 05:15:31
1	98	304.9717779775916	264.555057286985	20/04/28 05:15:31
1	98	304.97445679016	264.5833081168587	20/04/28 05:15:31
1	98	304.77479795633275	264.800648661984	20/04/28 05:15:31
1	98	304.76650275808856	264.7664659074791	20/04/28 05:15:32
1	98	304.7766499930147	264.727908367134	20/04/28 05:15:32
1	98	304.8409995903137	264.8842015452985	20/04/28 05:15:32
1	98	304.8322268587373	264.87321005937014	20/04/28 05:15:32
1	98	304.882357164042	264.8378443903628	20/04/28 05:15:32
1	98	304.9190480197864	264.82156454917083	20/04/28 05:15:32
1	98	304.84071969871377	264.7984894673741	20/04/28 05:15:32
1	98	304.76659306111725	264.6137938630561	20/04/28 05:15:32
1	98	304.82391149481145	264.7467117467718	20/04/28 05:15:32
1	98	304.60261176912223	264.6117216105425	20/04/28 05:15:33
1	98	304.59749455262283	264.6103151154543	20/04/28 05:15:33
1	98	304.38571122084903	264.5509581408758	20/04/28 05:15:33
1	98	304.3318564642474	264.6069117932973	20/04/28 05:15:33
1	98	304.3152034521829	264.32722953601495	20/04/28 05:15:33
1	98	304.17536124652435	264.4187327899397	20/04/28 05:15:33
1	98	304.114115361896	264.63495661344683	20/04/28 05:15:33
1	98	304.00590531014365	264.8666062690149	20/04/28 05:15:33
1	98	304.208277266858	264.6715524646018	20/04/28 05:15:33
1	98	304.43559913085227	264.76778385442026	20/04/28 05:15:33
1	98	304.6289542927321	264.6303092655492	20/04/28 05:15:34
1	98	304.6382649133696	264.5144603068043	20/04/28 05:15:34
1	98	304.43912632989077	264.56269270960627	20/04/28 05:15:34
1	98	304.48825296474604	264.5325110990763	20/04/28 05:15:34
1	98	304.5952043610625	264.55509212196966	20/04/28 05:15:34
1	98	304.41301037363286	264.46510972260916	20/04/28 05:15:34
1	98	304.4250425805487	264.5282574148429	20/04/28 05:15:34
1	98	304.3113028109423	264.5280216296224	20/04/28 05:15:34
1	98	304.41179181565076	264.4620283662937	20/04/28 05:15:34
1	98	304.55187579214106	264.3425568819529	20/04/28 05:15:34
1	98	304.3920046757714	264.30469532510483	20/04/28 05:15:35
1	98	304.3423161938992	264.3649458474519	20/04/28 05:15:35
1	98	304.1776883136192	264.3707534341503	20/04/28 05:15:35
1	98	304.10488044538585	264.44936967295	20/04/28 05:15:35
1	98	304.14371723774866	264.40153419932307	20/04/28 05:15:35
1	98	304.05494157831436	264.18257455938334	20/04/28 05:15:35
1	98	303.9638326046264	263.97692149617245	20/04/28 05:15:35
1	98	303.9594121278983	263.85468438122166	20/04/28 05:15:35
1	98	304.12731151253814	263.9440229985344	20/04/28 05:15:35
1	98	304.1443504283918	263.8882277180974	20/04/28 05:15:36
1	98	304.15312726091486	264.0713464075104	20/04/28 05:15:36
1	98	304.179805331975	264.0551548271397	20/04/28 05:15:36
1	98	304.30027958659196	264.14213727114463	20/04/28 05:15:36
1	98	304.38329706467204	263.9970299759938	20/04/28 05:15:36
1	98	304.6065661554048	263.90039819456337	20/04/28 05:15:36
1	98	304.47001279162765	263.9506263067976	20/04/28 05:15:36
1	98	304.5644589423157	264.11923243098846	20/04/28 05:15:36
1	98	304.56120865353626	264.1252250108309	20/04/28 05:15:36
1	98	304.305222343395	264.2065140931828	20/04/28 05:15:36
1	98	304.2295016107893	264.0105940521132	20/04/28 05:15:37
1	98	304.1064417471348	263.976515477112	20/04/28 05:15:37
1	98	303.883072330261	264.0243666292391	20/04/28 05:15:37
1	98	303.82341084417186	263.75394391389284	20/04/28 05:15:37
1	98	303.8558247393098	263.5361635093759	20/04/28 05:15:37
1	98	304.0161169796496	263.3954682812919	20/04/28 05:15:37
1	98	303.99970780775175	263.36500720436766	20/04/28 05:15:37
1	98	303.9517108241712	263.6111671100543	20/04/28 05:15:37
1	98	303.9583571660832	263.6472325842554	20/04/28 05:15:37
1	98	303.9511084077238	263.7156445966252	20/04/28 05:15:37
1	98	304.01459474021453	263.96331416843935	20/04/28 05:15:38
1	98	304.0166522789359	263.95120050215417	20/04/28 05:15:38
1	98	304.0704603497658	263.8259372263119	20/04/28 05:15:38
1	98	303.85217450257494	263.8784966804661	20/04/28 05:15:38
1	98	303.8465221805743	263.8878798072936	20/04/28 05:15:38
1	98	303.7929662598249	263.59758999109386	20/04/28 05:15:38
1	98	303.7600238291409	263.39303774834593	20/04/28 05:15:38
1	98	304.0061032614679	263.55206660685093	20/04/28 05:15:38
1	98	304.0550104617439	263.6868006155035	20/04/28 05:15:38
1	98	304.00884169037516	263.58972475352226	20/04/28 05:15:38
1	98	303.89138526810956	263.4219751883282	20/04/28 05:15:39
1	98	304.1793519313576	263.3451318434871	20/04/28 05:15:39
1	98	303.9209014986013	263.2902095102717	20/04/28 05:15:39
1	98	303.9138774880439	263.2890228489419	20/04/28 05:15:39
1	98	304.10686911379753	263.1716074643416	20/04/28 05:15:39
1	98	304.33836903573155	263.3258724931918	20/04/28 05:15:39
1	98	304.19892431996027	263.53918668348587	20/04/28 05:15:39
1	98	304.41179159054144	263.58156962208534	20/04/28 05:15:39
1	98	304.13531445217	263.6912977810527	20/04/28 05:15:39
1	98	304.09604872039114	263.8186752741073	20/04/28 05:15:40
1	98	304.26777632346335	263.61554038745703	20/04/28 05:15:40
1	98	304.33120442309246	263.60193414813267	20/04/28 05:15:40
1	98	304.0515606977287	263.5993917965817	20/04/28 05:15:40
1	98	303.8401497403396	263.7934616823921	20/04/28 05:15:40
1	98	303.7696709172313	263.9988830832241	20/04/28 05:15:40
1	98	303.78496337926333	263.95815759761916	20/04/28 05:15:40
1	98	303.58007663534073	264.0864481553548	20/04/28 05:15:40
1	98	303.5693547246014	264.1042298402747	20/04/28 05:15:40
1	98	303.6456435584002	264.04122850021764	20/04/28 05:15:40
1	98	303.5701085061537	263.953363421531	20/04/28 05:15:41
1	98	303.5800130615268	264.1785567987223	20/04/28 05:15:41
1	98	303.6133557593282	264.35660785084997	20/04/28 05:15:41
1	98	303.5861816874614	264.3494337459717	20/04/28 05:15:41
1	98	303.58607913247766	264.3094814320993	20/04/28 05:15:41
1	98	303.7110280650305	264.3173558233375	20/04/28 05:15:41
1	98	303.6031896390915	264.1624233642937	20/04/28 05:15:41
1	98	303.56729552680287	264.2334578064743	20/04/28 05:15:41
1	98	303.7572468712566	264.04149367249846	20/04/28 05:15:41
1	98	303.9059492746258	264.16441332706825	20/04/28 05:15:41
1	98	303.91999678073	263.8842664096664	20/04/28 05:15:42
1	98	304.0061283409796	263.6735447628855	20/04/28 05:15:42
1	98	304.19207948698215	263.6091030352473	20/04/28 05:15:42
1	98	304.4306582558379	263.4661779728113	20/04/28 05:15:42
1	98	304.717381982939	263.3781787779828	20/04/28 05:15:42
1	98	304.64566552081044	263.17684946708425	20/04/28 05:15:42
1	98	304.7523878047175	263.36289642741207	20/04/28 05:15:42
1	98	304.76760590033933	263.36745721097145	20/04/28 05:15:42
1	98	304.83956167021506	263.3152723135166	20/04/28 05:15:42
1	98	304.9125035726831	263.23281488258647	20/04/28 05:15:43
1	98	304.9901087162719	263.2474000614104	20/04/28 05:15:43
1	98	304.71973772513405	263.31322650208597	20/04/28 05:15:43
1	98	304.7298035516235	263.3303705998288	20/04/28 05:15:43
1	98	304.9710764164329	263.5026640437602	20/04/28 05:15:43
1	98	304.97393711984375	263.56642216514933	20/04/28 05:15:43
1	98	304.9381413790438	263.7995956398417	20/04/28 05:15:43
1	98	305.0544946462194	263.9720411485351	20/04/28 05:15:43
1	98	305.1354454454415	264.0268610213924	20/04/28 05:15:43
1	98	305.32754032084836	263.98302937723923	20/04/28 05:15:43
1	98	305.44292971005433	264.1114109338059	20/04/28 05:15:44
1	98	305.29799747426483	263.9569604339494	20/04/28 05:15:44
1	98	305.2471983532154	263.988675032593	20/04/28 05:15:44
1	98	305.2516033677366	263.7362880480143	20/04/28 05:15:44
1	98	305.4354027622873	263.83030764171514	20/04/28 05:15:44
1	98	305.39150352200227	263.66715897363184	20/04/28 05:15:44
1	98	305.3447126694469	263.6835146792294	20/04/28 05:15:44
1	98	305.3947456967458	263.71110495061953	20/04/28 05:15:44
1	98	305.3878111226812	263.90624294502504	20/04/28 05:15:44
1	98	305.2895068143701	263.98779238988794	20/04/28 05:15:44
1	98	305.1990308048799	263.7482575793453	20/04/28 05:15:45
1	98	305.4402676237036	263.8243075070443	20/04/28 05:15:45
1	98	305.4282641423732	263.998265504972	20/04/28 05:15:45
1	98	305.2324807075782	263.971706264964	20/04/28 05:15:45
1	98	305.26334700226704	263.9860860099254	20/04/28 05:15:45
1	98	305.31245338178485	263.85436076752273	20/04/28 05:15:45
1	98	305.43393079907776	263.7755509684255	20/04/28 05:15:45
1	98	305.36808118756375	263.61760323709274	20/04/28 05:15:45
1	98	305.23980680391765	263.8327800046682	20/04/28 05:15:45
1	98	305.1892993595183	263.65400848023415	20/04/28 05:15:46
1	98	305.3181715261316	263.6068521773379	20/04/28 05:15:46
1	98	305.2857797054909	263.90476476057535	20/04/28 05:15:46
1	98	305.3238789101659	263.80151436037585	20/04/28 05:15:46
1	98	305.2730886743207	263.7498076964432	20/04/28 05:15:46
1	98	305.4248867590584	263.77294816248144	20/04/28 05:15:46
1	98	305.3465633904075	263.76852150810157	20/04/28 05:15:46
1	98	305.2958628760629	263.6445819432174	20/04/28 05:15:46
1	98	305.1025971899218	263.6310619202227	20/04/28 05:15:46
1	98	305.06119875435905	263.6058467100121	20/04/28 05:15:46
1	98	305.0202658790769	263.54617922983255	20/04/28 05:15:47
1	98	305.0250002591811	263.50037564441226	20/04/28 05:15:47
1	98	305.045100465693	263.5212607664182	20/04/28 05:15:47
1	98	305.0915468135163	263.41857289130337	20/04/28 05:15:47
1	98	305.0915468135163	263.41857289130337	20/04/28 05:15:47
