floorId	partitionId	location_x	location_y	timeStamp
1	98	304.3833937200568	269.7260813249671	20/04/28 05:15:28
1	98	303.09198391936934	268.2744374844447	20/04/28 05:15:29
1	98	303.28594423312194	264.61216223098285	20/04/28 05:15:30
3	47	302.8570592601016	265.6207358146814	20/04/28 05:15:31
3	47	302.8570592601016	265.6207358146814	20/04/28 05:15:32
3	47	304.8792110754439	265.60841896302344	20/04/28 05:15:33
3	NULL	309.29436722642214	263.9851754886793	20/04/28 05:15:34
1	56	309.29436722642214	263.9851754886794	20/04/28 05:15:35
1	81	313.37765885306834	261.0920988121665	20/04/28 05:15:36
1	81	315.74240883925677	260.5181275582284	20/04/28 05:15:37
1	81	315.74240883925677	260.5181275582284	20/04/28 05:15:38
3	54	318.718225726321	262.2630310087092	20/04/28 05:15:39
3	54	323.9157841659309	261.7732112006131	20/04/28 05:15:40
3	54	324.0151806674323	262.76750572012435	20/04/28 05:15:41
3	54	324.6837666112415	261.38954335341236	20/04/28 05:15:42
3	54	327.3540763805351	261.1072377077433	20/04/28 05:15:43
3	54	327.3540763805351	261.1072377077433	20/04/28 05:15:44
3	54	334.4407240787428	261.4032786809491	20/04/28 05:15:45
3	54	334.4407240787428	261.4032786809491	20/04/28 05:15:46
3	54	334.4407240787428	261.4032786809491	20/04/28 05:15:47
3	NULL	337.70753542622793	260.45953294809686	20/04/28 05:15:48
3	NULL	337.70753542622793	260.4595329480968	20/04/28 05:15:49
3	99	339.59375125487367	258.8166372045796	20/04/28 05:15:50
3	42	343.19179870246967	259.9647561276533	20/04/28 05:15:51
3	42	347.1868785189775	260.3528128347792	20/04/28 05:15:52
3	54	350.37914153837863	260.97432627346046	20/04/28 05:15:53
3	54	350.37914153837863	260.97432627346046	20/04/28 05:15:54
3	54	350.37914153837863	260.97432627346046	20/04/28 05:15:55
3	42	352.0898782617341	257.6816897320676	20/04/28 05:15:56
3	54	354.3948115151741	261.6556623953523	20/04/28 05:15:57
3	54	358.23287936641947	263.0061707425011	20/04/28 05:15:58
3	34	362.2167196060361	259.70189758364177	20/04/28 05:15:59
3	34	362.2167196060361	259.70189758364177	20/04/28 05:16:00
3	34	361.2642468288334	255.55936173685845	20/04/28 05:16:01
3	34	361.2642468288334	255.55936173685845	20/04/28 05:16:02
3	17	363.0633788732786	253.76883669815365	20/04/28 05:16:03
3	17	363.0633788732786	253.76883669815368	20/04/28 05:16:04
3	17	362.3945272480641	251.57317905073432	20/04/28 05:16:05
3	30	365.5344509753579	248.80973562593917	20/04/28 05:16:06
3	6	370.63064515039724	245.89555531802912	20/04/28 05:16:07
3	6	370.63064515039724	245.89555531802912	20/04/28 05:16:08
3	6	374.6648195618352	245.76470510583655	20/04/28 05:16:09
3	6	374.6648195618352	245.76470510583655	20/04/28 05:16:10
3	6	374.6648195618352	245.76470510583655	20/04/28 05:16:11
3	6	371.6459156222339	242.1946659303275	20/04/28 05:16:12
3	6	371.6459156222339	242.1946659303275	20/04/28 05:16:13
3	6	371.6459156222339	242.1946659303275	20/04/28 05:16:14
3	6	371.6459156222339	242.1946659303275	20/04/28 05:16:15
3	6	371.6459156222339	242.1946659303275	20/04/28 05:16:16
3	6	371.6459156222339	242.1946659303275	20/04/28 05:16:17
3	6	371.6459156222339	242.1946659303275	20/04/28 05:16:18
3	6	371.6459156222339	242.1946659303275	20/04/28 05:16:19
3	6	374.6648195618352	245.76470510583655	20/04/28 05:16:20
3	6	371.6459156222339	242.1946659303275	20/04/28 05:16:21
3	6	371.6459156222339	242.1946659303275	20/04/28 05:16:22
3	6	371.6459156222339	242.1946659303275	20/04/28 05:16:23
3	6	371.6459156222339	242.1946659303275	20/04/28 05:16:24
3	6	371.6459156222339	242.1946659303275	20/04/28 05:16:25
3	6	371.6459156222339	242.1946659303275	20/04/28 05:16:26
3	6	371.6459156222339	242.1946659303275	20/04/28 05:16:27
3	6	371.6459156222339	242.1946659303275	20/04/28 05:16:28
3	6	371.6459156222339	242.1946659303275	20/04/28 05:16:29
3	6	371.6459156222339	242.1946659303275	20/04/28 05:16:30
3	6	371.6459156222339	242.1946659303275	20/04/28 05:16:31
3	6	371.6459156222339	242.1946659303275	20/04/28 05:16:32
3	6	371.6459156222339	242.1946659303275	20/04/28 05:16:33
3	6	371.6459156222339	242.1946659303275	20/04/28 05:16:34
3	6	370.63064515039724	245.89555531802912	20/04/28 05:16:35
3	6	370.63064515039724	245.89555531802912	20/04/28 05:16:36
3	30	365.5344509753579	248.80973562593917	20/04/28 05:16:37
3	17	362.3945272480641	251.57317905073432	20/04/28 05:16:38
3	17	363.0633788732786	253.76883669815368	20/04/28 05:16:39
3	17	361.9057312824121	254.45903554354518	20/04/28 05:16:40
3	17	361.9057312824121	254.45903554354518	20/04/28 05:16:41
3	34	361.2642468288334	255.55936173685845	20/04/28 05:16:42
3	34	362.2167196060361	259.70189758364177	20/04/28 05:16:43
3	57	365.8336784609425	258.95489486040736	20/04/28 05:16:44
3	57	365.8336784609425	258.95489486040736	20/04/28 05:16:45
3	57	365.8336784609425	258.9548948604074	20/04/28 05:16:46
3	54	372.48785670166836	262.3595943162643	20/04/28 05:16:47
3	57	374.26377240687094	258.097817872792	20/04/28 05:16:48
3	54	376.35656519674916	261.5624468270555	20/04/28 05:16:49
3	57	374.26377240687094	258.097817872792	20/04/28 05:16:50
3	15	379.8755906118027	262.6421307240284	20/04/28 05:16:51
3	15	380.97239583354167	266.94453563659977	20/04/28 05:16:52
1	33	381.6109766893215	266.73786054806715	20/04/28 05:16:53
1	33	381.6109766893215	266.73786054806715	20/04/28 05:16:54
1	33	381.6109766893215	266.73786054806715	20/04/28 05:16:55
1	69	376.3565651967492	261.56244682705545	20/04/28 05:16:56
1	69	376.18075636557654	261.96517202151136	20/04/28 05:16:57
1	69	372.48785670166836	262.3595943162643	20/04/28 05:16:58
1	69	372.48785670166836	262.3595943162643	20/04/28 05:16:59
1	69	367.80245440868674	262.5455232582413	20/04/28 05:17:00
3	57	365.6578696297699	259.3576200548633	20/04/28 05:17:01
3	34	362.2167196060361	259.70189758364177	20/04/28 05:17:02
3	68	357.91989747494364	257.0685403803136	20/04/28 05:17:03
1	69	357.91989747494364	257.0685403803136	20/04/28 05:17:04
1	69	353.67723544133537	258.9507399026464	20/04/28 05:17:05
1	41	352.7251685521831	260.56227788261185	20/04/28 05:17:06
1	64	354.49328963180795	262.3471616487957	20/04/28 05:17:07
1	64	354.49328963180795	262.3471616487957	20/04/28 05:17:08
1	64	354.49328963180795	262.3471616487957	20/04/28 05:17:09
1	64	354.49328963180795	262.3471616487957	20/04/28 05:17:10
1	64	354.49328963180795	262.3471616487957	20/04/28 05:17:11
1	64	354.49328963180795	262.3471616487957	20/04/28 05:17:12
1	64	354.3333978239378	262.53426333928064	20/04/28 05:17:13
1	64	354.49328963180795	262.3471616487957	20/04/28 05:17:14
1	64	354.3333978239379	262.53426333928064	20/04/28 05:17:15
1	64	354.49328963180795	262.3471616487957	20/04/28 05:17:16
1	64	354.49328963180795	262.3471616487957	20/04/28 05:17:17
1	64	354.49328963180795	262.3471616487957	20/04/28 05:17:18
1	64	354.49328963180795	262.3471616487957	20/04/28 05:17:19
1	64	356.00304078692875	263.6276478520211	20/04/28 05:17:20
1	64	354.49328963180795	262.3471616487957	20/04/28 05:17:21
1	64	354.49328963180795	262.3471616487957	20/04/28 05:17:22
1	64	355.66907680968643	262.75602887791473	20/04/28 05:17:23
1	64	354.49328963180795	262.3471616487957	20/04/28 05:17:24
1	64	354.3333978239379	262.53426333928064	20/04/28 05:17:25
1	64	354.3333978239378	262.53426333928064	20/04/28 05:17:26
1	64	354.3333978239379	262.53426333928064	20/04/28 05:17:27
1	64	354.49328963180795	262.3471616487957	20/04/28 05:17:28
1	64	354.49328963180795	262.3471616487957	20/04/28 05:17:29
1	64	356.00304078692875	263.6276478520211	20/04/28 05:17:30
1	64	354.49328963180795	262.3471616487957	20/04/28 05:17:31
1	64	354.3333978239379	262.53426333928064	20/04/28 05:17:32
1	64	354.49328963180795	262.3471616487957	20/04/28 05:17:33
1	64	354.3333978239378	262.53426333928064	20/04/28 05:17:34
1	64	354.3333978239378	262.53426333928064	20/04/28 05:17:35
1	64	354.49328963180795	262.3471616487957	20/04/28 05:17:36
1	64	355.66907680968643	262.75602887791473	20/04/28 05:17:37
1	64	354.49328963180795	262.3471616487957	20/04/28 05:17:38
1	64	354.49328963180795	262.3471616487957	20/04/28 05:17:39
1	64	354.3333978239379	262.53426333928064	20/04/28 05:17:40
1	64	354.3333978239378	262.53426333928064	20/04/28 05:17:41
1	64	354.49328963180795	262.3471616487957	20/04/28 05:17:42
1	64	354.49328963180795	262.3471616487957	20/04/28 05:17:43
1	64	354.49328963180795	262.3471616487957	20/04/28 05:17:44
1	64	354.3333978239378	262.53426333928064	20/04/28 05:17:45
1	64	356.00304078692875	263.6276478520211	20/04/28 05:17:46
1	64	354.49328963180795	262.3471616487957	20/04/28 05:17:47
1	64	354.49328963180795	262.3471616487957	20/04/28 05:17:48
1	64	354.3333978239378	262.53426333928064	20/04/28 05:17:49
1	64	354.49328963180795	262.3471616487957	20/04/28 05:17:50
1	64	354.49328963180795	262.3471616487957	20/04/28 05:17:51
1	64	354.49328963180795	262.3471616487957	20/04/28 05:17:52
1	64	354.49328963180795	262.3471616487957	20/04/28 05:17:53
1	64	354.3333978239378	262.53426333928064	20/04/28 05:17:54
1	64	354.49328963180795	262.3471616487957	20/04/28 05:17:55
1	64	354.49328963180795	262.3471616487957	20/04/28 05:17:56
1	64	354.3333978239378	262.53426333928064	20/04/28 05:17:57
1	64	354.49328963180795	262.3471616487957	20/04/28 05:17:58
1	41	352.7251685521831	260.56227788261185	20/04/28 05:17:59
1	41	351.1038521390131	261.25919659268993	20/04/28 05:18:00
1	41	349.2732493252067	263.17227144197165	20/04/28 05:18:01
1	22	346.48253983850464	261.2777688197779	20/04/28 05:18:02
1	22	343.1917987024697	259.9647561276533	20/04/28 05:18:03
1	NULL	341.75641581596034	259.4998576241711	20/04/28 05:18:04
1	69	338.1583683683643	258.3517387010974	20/04/28 05:18:05
1	53	337.94213707957925	260.2324305968438	20/04/28 05:18:06
1	5	334.1462631566674	262.73191187269805	20/04/28 05:18:07
1	5	332.9065526505472	263.50534437986465	20/04/28 05:18:08
1	37	329.2127636639186	262.6803906369539	20/04/28 05:18:09
1	37	325.93617404217133	264.20930050997885	20/04/28 05:18:10
1	37	325.93617404217133	264.20930050997885	20/04/28 05:18:11
1	37	323.6597216964546	264.1572674834102	20/04/28 05:18:12
1	72	321.10779110724695	264.3050039939337	20/04/28 05:18:13
1	72	321.1077911072469	264.3050039939337	20/04/28 05:18:14
1	81	317.4633882763735	263.93806291016494	20/04/28 05:18:15
1	81	314.50318194109644	265.02915212402996	20/04/28 05:18:16
1	81	313.2523840549325	264.4074609667819	20/04/28 05:18:17
1	56	309.29436722642214	263.9851754886793	20/04/28 05:18:18
1	56	309.29436722642214	263.9851754886793	20/04/28 05:18:19
1	56	307.159840217744	263.3357311024059	20/04/28 05:18:20
1	98	303.28594423312194	264.61216223098285	20/04/28 05:18:21
1	98	303.28594423312194	264.61216223098285	20/04/28 05:18:22
3	47	302.3157990937455	265.96754816044853	20/04/28 05:18:23
3	47	304.4503261024236	266.616992546722	20/04/28 05:18:24
1	98	305.42047124180004	265.2616066172563	20/04/28 05:18:25
3	20	305.9869589747227	265.41867447014755	20/04/28 05:18:26
3	51	312.6019130172586	265.6450929868838	20/04/28 05:18:27
1	81	313.2523840549326	264.4074609667819	20/04/28 05:18:28
1	81	315.74240883925677	260.5181275582284	20/04/28 05:18:29
3	54	318.718225726321	262.2630310087092	20/04/28 05:18:30
3	18	321.1448815173929	265.43065665280113	20/04/28 05:18:31
3	18	323.5974156050991	264.28862562276623	20/04/28 05:18:32
3	54	324.0151806674323	262.76750572012435	20/04/28 05:18:33
3	54	324.01518066743233	262.76750572012435	20/04/28 05:18:34
3	54	327.3540763805351	261.10723770774325	20/04/28 05:18:35
3	54	332.9065526505472	263.50534437986465	20/04/28 05:18:36
3	54	334.4407240787428	261.4032786809491	20/04/28 05:18:37
3	54	334.4407240787428	261.4032786809491	20/04/28 05:18:38
3	54	334.4407240787428	261.4032786809491	20/04/28 05:18:39
3	NULL	337.70753542622793	260.45953294809686	20/04/28 05:18:40
3	99	339.59375125487367	258.8166372045796	20/04/28 05:18:41
3	54	339.37751996608864	260.69732910032604	20/04/28 05:18:42
3	42	346.3242319400108	259.3686329834299	20/04/28 05:18:43
3	54	346.4430525315224	260.8310953822582	20/04/28 05:18:44
3	54	350.37914153837863	260.97432627346046	20/04/28 05:18:46
3	54	350.37914153837863	260.97432627346046	20/04/28 05:18:47
3	54	350.37914153837863	260.97432627346046	20/04/28 05:18:48
3	54	352.9059324522066	261.07811147821695	20/04/28 05:18:49
