stationId	t_start	t_end	t_max	timeStamp
66	20/04/28 05:08:49	20/04/28 05:08:49	20/04/28 05:08:49
11	20/04/28 05:08:51	20/04/28 05:08:52	20/04/28 05:08:52
67	20/04/28 05:08:54	20/04/28 05:08:54	20/04/28 05:08:54
158	20/04/28 05:08:56	20/04/28 05:08:56	20/04/28 05:08:56
103	20/04/28 05:08:58	20/04/28 05:08:58	20/04/28 05:08:58
62	20/04/28 05:09:00	20/04/28 05:09:00	20/04/28 05:09:00
28	20/04/28 05:09:02	20/04/28 05:09:02	20/04/28 05:09:02
98	20/04/28 05:09:04	20/04/28 05:09:04	20/04/28 05:09:04
97	20/04/28 05:09:06	20/04/28 05:09:06	20/04/28 05:09:06
91	20/04/28 05:09:08	20/04/28 05:09:08	20/04/28 05:09:08
66	20/04/28 05:09:10	20/04/28 05:09:10	20/04/28 05:09:10
120	20/04/28 05:09:12	20/04/28 05:09:12	20/04/28 05:09:12
99	20/04/28 05:09:14	20/04/28 05:09:14	20/04/28 05:09:14
66	20/04/28 05:09:16	20/04/28 05:09:17	20/04/28 05:09:17
32	20/04/28 05:09:19	20/04/28 05:09:20	20/04/28 05:09:20
32	20/04/28 05:09:22	20/04/28 05:09:23	20/04/28 05:09:23
32	20/04/28 05:09:25	20/04/28 05:09:26	20/04/28 05:09:26
99	20/04/28 05:09:28	20/04/28 05:09:28	20/04/28 05:09:28
143	20/04/28 05:09:30	20/04/28 05:09:30	20/04/28 05:09:30
143	20/04/28 05:09:32	20/04/28 05:09:32	20/04/28 05:09:32
143	20/04/28 05:09:34	20/04/28 05:09:34	20/04/28 05:09:34
143	20/04/28 05:09:36	20/04/28 05:09:38	20/04/28 05:09:38
143	20/04/28 05:09:40	20/04/28 05:09:40	20/04/28 05:09:40
32	20/04/28 05:09:42	20/04/28 05:09:52	20/04/28 05:09:47
32	20/04/28 05:09:54	20/04/28 05:09:59	20/04/28 05:09:56
99	20/04/28 05:10:01	20/04/28 05:10:01	20/04/28 05:10:01
32	20/04/28 05:10:03	20/04/28 05:10:03	20/04/28 05:10:03
32	20/04/28 05:10:05	20/04/28 05:10:09	20/04/28 05:10:08
32	20/04/28 05:10:11	20/04/28 05:10:11	20/04/28 05:10:11
120	20/04/28 05:10:13	20/04/28 05:10:13	20/04/28 05:10:13
91	20/04/28 05:10:15	20/04/28 05:10:15	20/04/28 05:10:15
119	20/04/28 05:10:17	20/04/28 05:10:17	20/04/28 05:10:17
119	20/04/28 05:10:19	20/04/28 05:10:21	20/04/28 05:10:21
32	20/04/28 05:10:23	20/04/28 05:10:24	20/04/28 05:10:24
101	20/04/28 05:10:26	20/04/28 05:10:26	20/04/28 05:10:26
28	20/04/28 05:10:28	20/04/28 05:10:28	20/04/28 05:10:28
5	20/04/28 05:10:30	20/04/28 05:10:30	20/04/28 05:10:30
62	20/04/28 05:10:32	20/04/28 05:10:32	20/04/28 05:10:32
10	20/04/28 05:10:34	20/04/28 05:10:34	20/04/28 05:10:34
67	20/04/28 05:10:36	20/04/28 05:10:36	20/04/28 05:10:36
11	20/04/28 05:10:38	20/04/28 05:16:18	20/04/28 05:10:38
5	20/04/28 05:10:40	20/04/28 05:10:40	20/04/28 05:10:40
23	20/04/28 05:10:42	20/04/28 05:10:42	20/04/28 05:10:42
66	20/04/28 05:10:44	20/04/28 05:10:44	20/04/28 05:10:44
125	20/04/28 05:10:46	20/04/28 05:10:46	20/04/28 05:10:46
143	20/04/28 05:10:48	20/04/28 05:10:48	20/04/28 05:10:48
143	20/04/28 05:10:50	20/04/28 05:10:50	20/04/28 05:10:50
125	20/04/28 05:10:52	20/04/28 05:10:53	20/04/28 05:10:52
11	20/04/28 05:10:55	20/04/28 05:10:56	20/04/28 05:10:56
125	20/04/28 05:10:58	20/04/28 05:10:59	20/04/28 05:10:59
