stationId	t_start	t_end	t_max	timeStamp
56	20/04/28 05:08:49	20/04/28 05:08:50	20/04/28 05:08:50
70	20/04/28 05:08:52	20/04/28 05:08:52	20/04/28 05:08:52
108	20/04/28 05:08:54	20/04/28 05:08:54	20/04/28 05:08:54
155	20/04/28 05:08:56	20/04/28 05:08:56	20/04/28 05:08:56
14	20/04/28 05:08:58	20/04/28 05:08:58	20/04/28 05:08:58
89	20/04/28 05:09:00	20/04/28 05:09:00	20/04/28 05:09:00
128	20/04/28 05:09:02	20/04/28 05:09:02	20/04/28 05:09:02
128	20/04/28 05:09:04	20/04/28 05:09:04	20/04/28 05:09:04
32	20/04/28 05:09:06	20/04/28 05:09:06	20/04/28 05:09:06
134	20/04/28 05:09:08	20/04/28 05:09:08	20/04/28 05:09:08
12	20/04/28 05:09:10	20/04/28 05:09:10	20/04/28 05:09:10
87	20/04/28 05:09:12	20/04/28 05:09:12	20/04/28 05:09:12
147	20/04/28 05:09:14	20/04/28 05:09:14	20/04/28 05:09:14
143	20/04/28 05:09:16	20/04/28 05:09:16	20/04/28 05:09:16
19	20/04/28 05:09:18	20/04/28 05:09:18	20/04/28 05:09:18
19	20/04/28 05:09:20	20/04/28 05:09:20	20/04/28 05:09:20
25	20/04/28 05:09:22	20/04/28 05:09:22	20/04/28 05:09:22
67	20/04/28 05:09:24	20/04/28 05:09:24	20/04/28 05:09:24
87	20/04/28 05:09:26	20/04/28 05:09:26	20/04/28 05:09:26
118	20/04/28 05:09:28	20/04/28 05:09:28	20/04/28 05:09:28
117	20/04/28 05:09:30	20/04/28 05:09:30	20/04/28 05:09:30
87	20/04/28 05:09:32	20/04/28 05:09:32	20/04/28 05:09:32
25	20/04/28 05:09:34	20/04/28 05:09:34	20/04/28 05:09:34
23	20/04/28 05:09:36	20/04/28 05:09:37	20/04/28 05:09:37
23	20/04/28 05:09:39	20/04/28 05:09:39	20/04/28 05:09:39
96	20/04/28 05:09:41	20/04/28 05:09:41	20/04/28 05:09:41
24	20/04/28 05:09:43	20/04/28 05:09:44	20/04/28 05:09:44
19	20/04/28 05:09:46	20/04/28 05:09:46	20/04/28 05:09:46
114	20/04/28 05:09:48	20/04/28 05:09:48	20/04/28 05:09:48
85	20/04/28 05:09:50	20/04/28 05:09:50	20/04/28 05:09:50
150	20/04/28 05:09:52	20/04/28 05:09:52	20/04/28 05:09:52
131	20/04/28 05:09:54	20/04/28 05:09:54	20/04/28 05:09:54
76	20/04/28 05:09:56	20/04/28 05:09:56	20/04/28 05:09:56
43	20/04/28 05:09:58	20/04/28 05:09:58	20/04/28 05:09:58
130	20/04/28 05:10:00	20/04/28 05:10:00	20/04/28 05:10:00
99	20/04/28 05:10:02	20/04/28 05:10:03	20/04/28 05:10:03
143	20/04/28 05:10:05	20/04/28 05:10:05	20/04/28 05:10:05
88	20/04/28 05:10:07	20/04/28 05:10:07	20/04/28 05:10:07
89	20/04/28 05:10:09	20/04/28 05:10:09	20/04/28 05:10:09
109	20/04/28 05:10:11	20/04/28 05:10:11	20/04/28 05:10:11
13	20/04/28 05:10:13	20/04/28 05:10:13	20/04/28 05:10:13
13	20/04/28 05:10:15	20/04/28 05:10:15	20/04/28 05:10:15
86	20/04/28 05:10:17	20/04/28 05:10:17	20/04/28 05:10:17
14	20/04/28 05:10:19	20/04/28 05:10:19	20/04/28 05:10:19
62	20/04/28 05:10:21	20/04/28 05:10:22	20/04/28 05:10:22
14	20/04/28 05:10:24	20/04/28 05:10:24	20/04/28 05:10:24
156	20/04/28 05:10:26	20/04/28 05:10:26	20/04/28 05:10:26
156	20/04/28 05:10:28	20/04/28 05:10:31	20/04/28 05:10:31
14	20/04/28 05:10:33	20/04/28 05:10:33	20/04/28 05:10:33
156	20/04/28 05:10:35	20/04/28 05:10:35	20/04/28 05:10:35
106	20/04/28 05:10:37	20/04/28 05:10:37	20/04/28 05:10:37
156	20/04/28 05:10:39	20/04/28 05:10:39	20/04/28 05:10:39
13	20/04/28 05:10:41	20/04/28 05:10:41	20/04/28 05:10:41
89	20/04/28 05:10:43	20/04/28 05:10:44	20/04/28 05:10:43
79	20/04/28 05:10:46	20/04/28 05:10:46	20/04/28 05:10:46
89	20/04/28 05:10:48	20/04/28 05:10:48	20/04/28 05:10:48
132	20/04/28 05:10:50	20/04/28 05:10:50	20/04/28 05:10:50
53	20/04/28 05:10:52	20/04/28 05:10:52	20/04/28 05:10:52
152	20/04/28 05:10:54	20/04/28 05:10:54	20/04/28 05:10:54
90	20/04/28 05:10:56	20/04/28 05:10:59	20/04/28 05:10:59
89	20/04/28 05:11:01	20/04/28 05:11:01	20/04/28 05:11:01
88	20/04/28 05:11:03	20/04/28 05:11:04	20/04/28 05:11:04
89	20/04/28 05:11:06	20/04/28 05:11:06	20/04/28 05:11:06
156	20/04/28 05:11:08	20/04/28 05:11:08	20/04/28 05:11:08
86	20/04/28 05:11:10	20/04/28 05:11:10	20/04/28 05:11:10
111	20/04/28 05:11:12	20/04/28 05:11:12	20/04/28 05:11:12
155	20/04/28 05:11:14	20/04/28 05:11:14	20/04/28 05:11:14
85	20/04/28 05:11:16	20/04/28 05:11:16	20/04/28 05:11:16
111	20/04/28 05:11:18	20/04/28 05:11:18	20/04/28 05:11:18
111	20/04/28 05:11:20	20/04/28 05:11:21	20/04/28 05:11:21
111	20/04/28 05:11:23	20/04/28 05:11:24	20/04/28 05:11:24
155	20/04/28 05:11:26	20/04/28 05:11:26	20/04/28 05:11:26
109	20/04/28 05:11:28	20/04/28 05:11:28	20/04/28 05:11:28
114	20/04/28 05:11:30	20/04/28 05:11:31	20/04/28 05:11:31
85	20/04/28 05:11:33	20/04/28 05:11:33	20/04/28 05:11:33
114	20/04/28 05:11:35	20/04/28 05:11:35	20/04/28 05:11:35
