floorId	partitionId	location_x	location_y	timeStamp
3	68	357.80003138449274	255.6889786882025	20/04/28 05:15:51
3	68	354.4982598253989	256.5424320855769	20/04/28 05:15:52
3	68	354.27494542472317	260.2761007032412	20/04/28 05:15:53
3	68	357.576716983817	259.4226473058668	20/04/28 05:15:54
3	34	359.79187275284386	259.4942676634709	20/04/28 05:15:55
3	54	359.408666544298	263.4150379716201	20/04/28 05:15:56
3	34	363.08940602427793	260.2393220879455	20/04/28 05:15:57
3	34	361.2642468288334	255.55936173685845	20/04/28 05:15:58
3	34	361.2642468288334	255.55936173685845	20/04/28 05:15:59
3	17	363.0633788732786	253.76883669815365	20/04/28 05:16:00
3	17	363.0633788732786	253.76883669815368	20/04/28 05:16:01
3	30	365.53445097535786	248.80973562593917	20/04/28 05:16:02
3	57	367.9225813006244	252.20998711858013	20/04/28 05:16:03
3	57	372.1191876279541	254.90991466941398	20/04/28 05:16:04
3	57	373.47574895563434	250.83851513113464	20/04/28 05:16:05
3	57	376.87914975273753	250.537877236074	20/04/28 05:16:06
3	57	376.87914975273753	250.537877236074	20/04/28 05:16:07
3	57	376.87914975273753	250.53787723607397	20/04/28 05:16:08
3	57	376.87914975273753	250.53787723607397	20/04/28 05:16:09
3	57	376.87914975273753	250.53787723607397	20/04/28 05:16:10
3	57	376.87914975273753	250.53787723607397	20/04/28 05:16:11
3	57	376.87914975273753	250.53787723607397	20/04/28 05:16:12
3	57	376.87914975273753	250.53787723607397	20/04/28 05:16:13
3	57	376.87914975273753	250.53787723607397	20/04/28 05:16:14
3	57	376.87914975273753	250.53787723607397	20/04/28 05:16:15
3	57	376.87914975273753	250.537877236074	20/04/28 05:16:16
3	57	373.47574895563434	250.83851513113464	20/04/28 05:16:17
3	57	373.47574895563434	250.83851513113464	20/04/28 05:16:18
3	30	365.53445097535786	248.80973562593917	20/04/28 05:16:19
3	17	362.3945272480641	251.57317905073432	20/04/28 05:16:20
3	17	362.3945272480641	251.57317905073432	20/04/28 05:16:21
3	17	363.0633788732786	253.76883669815365	20/04/28 05:16:22
3	34	361.2642468288334	255.55936173685845	20/04/28 05:16:23
3	34	361.2642468288334	255.55936173685845	20/04/28 05:16:24
3	34	362.2167196060361	259.70189758364177	20/04/28 05:16:25
3	34	363.08940602427793	260.2393220879455	20/04/28 05:16:26
3	57	365.8336784609425	258.9548948604074	20/04/28 05:16:27
3	54	372.48785670166836	262.3595943162643	20/04/28 05:16:28
3	54	372.48785670166836	262.3595943162643	20/04/28 05:16:29
3	54	372.48785670166836	262.3595943162643	20/04/28 05:16:30
3	54	376.18269094789457	263.03655301878126	20/04/28 05:16:31
3	15	378.8796771581538	263.378721128207	20/04/28 05:16:32
3	15	380.97239583354167	266.94453563659977	20/04/28 05:16:33
3	15	380.4411889868181	268.9485571439715	20/04/28 05:16:34
1	33	381.6109766893215	266.73786054806715	20/04/28 05:16:35
1	33	381.6109766893215	266.73786054806715	20/04/28 05:16:36
1	86	377.91614244309534	266.0609018455502	20/04/28 05:16:37
1	69	372.48785670166836	262.3595943162643	20/04/28 05:16:38
1	69	372.48785670166836	262.3595943162643	20/04/28 05:16:39
1	69	372.48785670166836	262.3595943162643	20/04/28 05:16:40
1	69	368.9169651830857	261.65782172430613	20/04/28 05:16:41
1	69	367.80245440868674	262.5455232582413	20/04/28 05:16:42
3	54	365.2339908031949	263.4272252913235	20/04/28 05:16:43
3	54	358.87237025214637	261.21107622709695	20/04/28 05:16:44
1	64	358.87237025214637	261.21107622709695	20/04/28 05:16:45
1	64	356.02694011127693	259.70882448523747	20/04/28 05:16:46
1	64	354.49328963180795	262.3471616487957	20/04/28 05:16:47
1	41	352.7251685521831	260.56227788261185	20/04/28 05:16:48
1	41	352.7251685521831	260.56227788261185	20/04/28 05:16:49
1	41	351.1038521390131	261.25919659268993	20/04/28 05:16:50
1	22	346.48253983850464	261.2777688197779	20/04/28 05:16:51
1	22	343.1917987024697	259.9647561276533	20/04/28 05:16:52
1	22	343.1917987024697	259.9647561276533	20/04/28 05:16:53
1	69	340.1854692097293	258.18142547541174	20/04/28 05:16:54
1	69	340.1854692097293	258.18142547541174	20/04/28 05:16:55
1	69	338.1583683683643	258.3517387010974	20/04/28 05:16:56
1	5	333.7145018941879	260.98944075495035	20/04/28 05:16:57
1	5	333.7145018941879	260.9894407549504	20/04/28 05:16:58
3	54	329.2127636639186	262.68039063695386	20/04/28 05:16:59
1	37	329.2127636639186	262.68039063695386	20/04/28 05:17:00
1	37	323.9780902572864	261.641853061257	20/04/28 05:17:01
1	37	323.9780902572864	261.641853061257	20/04/28 05:17:02
1	72	322.13183602203384	261.5372798639359	20/04/28 05:17:03
1	72	321.1077911072469	264.3050039939337	20/04/28 05:17:04
1	81	318.06966812882723	262.69145868280907	20/04/28 05:17:05
1	81	317.4633882763735	263.938062910165	20/04/28 05:17:06
1	81	317.4633882763735	263.93806291016494	20/04/28 05:17:07
1	81	317.4633882763735	263.93806291016494	20/04/28 05:17:08
1	81	317.4633882763735	263.93806291016494	20/04/28 05:17:09
1	81	317.4633882763735	263.93806291016494	20/04/28 05:17:10
1	81	318.06966812882723	262.69145868280907	20/04/28 05:17:11
1	81	318.06966812882723	262.69145868280907	20/04/28 05:17:12
1	81	318.06966812882723	262.69145868280907	20/04/28 05:17:13
1	81	317.4633882763735	263.93806291016494	20/04/28 05:17:14
1	81	318.06966812882723	262.69145868280907	20/04/28 05:17:15
1	81	317.4633882763735	263.93806291016494	20/04/28 05:17:16
1	81	317.4633882763735	263.93806291016494	20/04/28 05:17:17
1	81	317.4633882763735	263.93806291016494	20/04/28 05:17:18
1	81	317.4633882763735	263.93806291016494	20/04/28 05:17:19
1	81	317.4633882763735	263.93806291016494	20/04/28 05:17:20
1	81	317.4633882763735	263.93806291016494	20/04/28 05:17:21
1	81	317.4633882763735	263.93806291016494	20/04/28 05:17:22
1	81	317.4633882763735	263.93806291016494	20/04/28 05:17:23
1	81	318.06966812882723	262.69145868280907	20/04/28 05:17:24
1	81	318.06966812882723	262.69145868280907	20/04/28 05:17:25
1	81	315.74240883925677	260.5181275582284	20/04/28 05:17:26
1	81	318.06966812882723	262.69145868280907	20/04/28 05:17:27
1	37	323.9780902572864	261.641853061257	20/04/28 05:17:28
1	37	323.9780902572864	261.641853061257	20/04/28 05:17:29
1	37	323.9780902572864	261.641853061257	20/04/28 05:17:30
1	37	326.9602189569582	261.44157637998103	20/04/28 05:17:31
1	37	329.2127636639186	262.68039063695386	20/04/28 05:17:32
1	37	329.2127636639186	262.6803906369539	20/04/28 05:17:33
1	5	333.7145018941879	260.9894407549504	20/04/28 05:17:34
1	5	335.03244203359844	260.7680669517812	20/04/28 05:17:35
1	69	338.1583683683643	258.3517387010974	20/04/28 05:17:36
1	69	340.1854692097293	258.18142547541174	20/04/28 05:17:37
1	NULL	341.7564158159603	259.49985762417106	20/04/28 05:17:38
1	22	343.1917987024697	259.9647561276533	20/04/28 05:17:39
1	22	346.48253983850464	261.2777688197779	20/04/28 05:17:40
1	22	346.48253983850464	261.2777688197779	20/04/28 05:17:41
1	41	349.6149730760457	260.6816456755546	20/04/28 05:17:42
1	41	351.1038521390131	261.25919659268993	20/04/28 05:17:43
1	41	351.1038521390131	261.25919659269	20/04/28 05:17:44
1	64	354.49328963180795	262.3471616487957	20/04/28 05:17:45
1	64	355.66907680968643	262.75602887791473	20/04/28 05:17:46
1	64	357.3387197726773	263.8494133906552	20/04/28 05:17:47
1	64	359.3871933687978	264.79570512407787	20/04/28 05:17:48
3	46	364.70031867043167	266.8771548784566	20/04/28 05:17:49
1	13	368.31727752533806	266.1301521552222	20/04/28 05:17:50
1	13	368.31727752533806	266.1301521552222	20/04/28 05:17:51
1	13	368.31727752533806	266.1301521552222	20/04/28 05:17:52
1	13	368.31727752533806	266.1301521552222	20/04/28 05:17:53
1	13	368.31727752533806	266.1301521552222	20/04/28 05:17:54
1	13	368.31727752533806	266.1301521552222	20/04/28 05:17:55
1	13	368.31727752533806	266.1301521552222	20/04/28 05:17:56
1	13	368.31727752533806	266.1301521552222	20/04/28 05:17:57
1	13	368.31727752533806	266.1301521552222	20/04/28 05:17:58
1	13	368.31727752533806	266.1301521552222	20/04/28 05:17:59
1	13	368.31727752533806	266.1301521552222	20/04/28 05:18:00
1	13	368.31727752533806	266.1301521552222	20/04/28 05:18:01
1	13	368.31727752533806	266.1301521552222	20/04/28 05:18:02
1	13	368.31727752533806	266.1301521552222	20/04/28 05:18:03
1	13	368.31727752533806	266.1301521552222	20/04/28 05:18:04
1	13	368.31727752533806	266.1301521552222	20/04/28 05:18:05
1	13	368.31727752533806	266.1301521552222	20/04/28 05:18:06
1	13	368.31727752533806	266.1301521552222	20/04/28 05:18:07
1	13	368.31727752533806	266.1301521552222	20/04/28 05:18:08
1	13	368.31727752533806	266.1301521552222	20/04/28 05:18:09
1	13	368.31727752533806	266.1301521552222	20/04/28 05:18:10
1	13	368.31727752533806	266.1301521552222	20/04/28 05:18:11
1	13	368.31727752533806	266.1301521552222	20/04/28 05:18:12
1	13	368.31727752533806	266.1301521552222	20/04/28 05:18:13
1	13	368.31727752533806	266.1301521552222	20/04/28 05:18:14
1	13	368.31727752533806	266.1301521552222	20/04/28 05:18:15
1	13	368.31727752533806	266.1301521552222	20/04/28 05:18:16
1	13	368.31727752533806	266.1301521552222	20/04/28 05:18:17
1	13	368.31727752533806	266.1301521552222	20/04/28 05:18:18
1	13	368.31727752533806	266.1301521552222	20/04/28 05:18:19
1	13	368.31727752533806	266.1301521552222	20/04/28 05:18:20
1	13	368.31727752533806	266.1301521552222	20/04/28 05:18:21
1	13	368.31727752533806	266.1301521552222	20/04/28 05:18:22
1	13	368.31727752533806	266.1301521552222	20/04/28 05:18:23
1	13	368.31727752533806	266.1301521552222	20/04/28 05:18:24
1	13	368.31727752533806	266.1301521552222	20/04/28 05:18:25
1	13	368.31727752533806	266.1301521552222	20/04/28 05:18:26
1	13	368.31727752533806	266.1301521552222	20/04/28 05:18:27
1	13	368.31727752533806	266.1301521552222	20/04/28 05:18:28
1	13	367.4445911070962	265.59272765091856	20/04/28 05:18:29
1	13	368.31727752533806	266.1301521552222	20/04/28 05:18:30
1	13	368.31727752533806	266.1301521552222	20/04/28 05:18:31
1	13	368.31727752533806	266.1301521552222	20/04/28 05:18:32
1	13	368.31727752533806	266.1301521552222	20/04/28 05:18:33
1	13	368.31727752533806	266.1301521552222	20/04/28 05:18:34
1	13	368.31727752533806	266.1301521552222	20/04/28 05:18:35
1	13	368.31727752533806	266.1301521552222	20/04/28 05:18:36
1	13	368.31727752533806	266.1301521552222	20/04/28 05:18:37
1	13	368.31727752533806	266.1301521552222	20/04/28 05:18:38
1	13	368.31727752533806	266.1301521552222	20/04/28 05:18:39
1	13	368.31727752533806	266.1301521552222	20/04/28 05:18:40
1	13	368.31727752533806	266.1301521552222	20/04/28 05:18:41
1	13	368.31727752533806	266.1301521552222	20/04/28 05:18:42
1	13	368.31727752533806	266.1301521552222	20/04/28 05:18:43
1	13	368.31727752533806	266.1301521552222	20/04/28 05:18:44
1	13	368.31727752533806	266.1301521552222	20/04/28 05:18:45
1	NULL	369.15505395524525	268.76260300101654	20/04/28 05:18:46
