floorId	partitionId	location_x	location_y	timeStamp
21	923	365.99860419572286	285.98377779442256	21/02/24 15:39:54
21	923	369.79761165068265	288.39473374905793	21/02/24 15:39:55
21	923	367.6690072746235	285.5368953074619	21/02/24 15:39:56
21	923	369.79761165068265	288.39473374905793	21/02/24 15:39:57
21	923	369.79761165068265	288.39473374905793	21/02/24 15:39:58
21	923	369.79761165068265	288.39473374905793	21/02/24 15:39:59
21	923	369.79761165068265	288.39473374905793	21/02/24 15:40:00
21	923	369.79761165068265	288.39473374905793	21/02/24 15:40:01
21	923	369.79761165068265	288.39473374905793	21/02/24 15:40:02
21	923	369.7976116506827	288.39473374905793	21/02/24 15:40:03
21	923	369.79761165068265	288.39473374905793	21/02/24 15:40:04
21	923	367.6690072746235	285.5368953074619	21/02/24 15:40:05
21	923	369.7976116506827	288.39473374905793	21/02/24 15:40:06
21	923	369.79761165068265	288.39473374905793	21/02/24 15:40:07
21	923	367.6690072746235	285.5368953074619	21/02/24 15:40:08
21	923	365.99860419572286	285.98377779442256	21/02/24 15:40:09
21	973	364.2217162982468	283.5880466093505	21/02/24 15:40:10
21	923	367.6690072746235	285.5368953074619	21/02/24 15:40:11
21	923	369.79761165068265	288.39473374905793	21/02/24 15:40:12
21	923	369.79761165068265	288.39473374905793	21/02/24 15:40:13
21	923	369.79761165068265	288.39473374905793	21/02/24 15:40:14
21	923	367.6690072746235	285.5368953074619	21/02/24 15:40:15
21	923	367.6690072746235	285.5368953074619	21/02/24 15:40:16
21	923	367.6690072746235	285.5368953074619	21/02/24 15:40:17
21	923	367.6690072746235	285.5368953074619	21/02/24 15:40:18
21	923	367.6690072746235	285.5368953074619	21/02/24 15:40:19
21	923	367.6690072746235	285.5368953074619	21/02/24 15:40:20
21	923	369.79761165068265	288.39473374905793	21/02/24 15:40:21
21	923	367.6690072746235	285.5368953074619	21/02/24 15:40:22
21	923	369.79761165068265	288.39473374905793	21/02/24 15:40:23
21	923	369.79761165068265	288.39473374905793	21/02/24 15:40:24
21	923	369.7976116506827	288.39473374905793	21/02/24 15:40:25
21	923	369.79761165068265	288.39473374905793	21/02/24 15:40:26
21	923	369.79761165068265	288.39473374905793	21/02/24 15:40:27
21	923	369.79761165068265	288.39473374905793	21/02/24 15:40:28
21	923	369.7976116506827	288.39473374905793	21/02/24 15:40:29
21	923	369.79761165068265	288.39473374905793	21/02/24 15:40:30
21	923	369.79761165068265	288.39473374905793	21/02/24 15:40:31
21	923	367.6690072746235	285.5368953074619	21/02/24 15:40:32
21	923	369.7976116506827	288.39473374905793	21/02/24 15:40:33
21	923	365.99860419572286	285.98377779442256	21/02/24 15:40:34
21	923	369.79761165068265	288.39473374905793	21/02/24 15:40:35
21	923	369.79761165068265	288.39473374905793	21/02/24 15:40:36
21	923	369.79761165068265	288.39473374905793	21/02/24 15:40:37
21	923	369.79761165068265	288.39473374905793	21/02/24 15:40:38
21	923	367.6690072746235	285.5368953074619	21/02/24 15:40:39
21	923	367.6690072746235	285.5368953074619	21/02/24 15:40:40
21	923	369.79761165068265	288.39473374905793	21/02/24 15:40:41
21	923	369.79761165068265	288.39473374905793	21/02/24 15:40:42
21	923	369.79761165068265	288.39473374905793	21/02/24 15:40:43
21	923	369.79761165068265	288.39473374905793	21/02/24 15:40:44
21	923	369.79761165068265	288.39473374905793	21/02/24 15:40:45
21	923	367.6690072746235	285.5368953074619	21/02/24 15:40:46
21	923	369.79761165068265	288.39473374905793	21/02/24 15:40:47
21	923	369.7976116506827	288.39473374905793	21/02/24 15:40:48
21	923	369.79761165068265	288.39473374905793	21/02/24 15:40:49
21	923	367.6690072746235	285.5368953074619	21/02/24 15:40:50
21	923	365.99860419572286	285.98377779442256	21/02/24 15:40:51
21	923	367.6690072746235	285.5368953074619	21/02/24 15:40:52
21	923	367.6690072746235	285.5368953074619	21/02/24 15:40:53
21	923	367.6690072746235	285.5368953074619	21/02/24 15:40:54
21	923	369.79761165068265	288.39473374905793	21/02/24 15:40:55
21	923	369.79761165068265	288.39473374905793	21/02/24 15:40:56
21	923	369.79761165068265	288.39473374905793	21/02/24 15:40:57
21	923	367.6690072746235	285.5368953074619	21/02/24 15:40:58
21	923	369.7976116506827	288.39473374905793	21/02/24 15:40:59
21	923	369.7976116506827	288.39473374905793	21/02/24 15:41:00
21	923	369.79761165068265	288.39473374905793	21/02/24 15:41:01
21	923	369.7976116506827	288.39473374905793	21/02/24 15:41:02
21	923	369.79761165068265	288.39473374905793	21/02/24 15:41:03
21	923	369.79761165068265	288.39473374905793	21/02/24 15:41:04
21	923	369.79761165068265	288.39473374905793	21/02/24 15:41:05
21	923	369.79761165068265	288.39473374905793	21/02/24 15:41:06
21	923	367.6690072746235	285.5368953074619	21/02/24 15:41:07
21	923	369.79761165068265	288.39473374905793	21/02/24 15:41:08
21	923	369.79761165068265	288.39473374905793	21/02/24 15:41:09
21	923	369.79761165068265	288.39473374905793	21/02/24 15:41:10
21	923	369.79761165068265	288.39473374905793	21/02/24 15:41:11
21	923	369.79761165068265	288.39473374905793	21/02/24 15:41:12
21	923	369.79761165068265	288.39473374905793	21/02/24 15:41:13
21	923	369.79761165068265	288.39473374905793	21/02/24 15:41:14
21	923	369.79761165068265	288.39473374905793	21/02/24 15:41:15
21	923	369.79761165068265	288.39473374905793	21/02/24 15:41:16
21	923	369.79761165068265	288.39473374905793	21/02/24 15:41:17
21	923	369.79761165068265	288.39473374905793	21/02/24 15:41:18
21	923	369.7976116506827	288.39473374905793	21/02/24 15:41:19
21	923	369.79761165068265	288.39473374905793	21/02/24 15:41:20
21	923	369.79761165068265	288.39473374905793	21/02/24 15:41:21
21	923	369.79761165068265	288.39473374905793	21/02/24 15:41:22
21	923	369.79761165068265	288.39473374905793	21/02/24 15:41:23
21	923	369.7976116506827	288.39473374905793	21/02/24 15:41:24
21	923	369.79761165068265	288.39473374905793	21/02/24 15:41:25
21	923	369.7976116506827	288.39473374905793	21/02/24 15:41:26
21	923	369.7976116506827	288.39473374905793	21/02/24 15:41:27
21	923	369.7976116506827	288.39473374905793	21/02/24 15:41:28
21	923	369.79761165068265	288.39473374905793	21/02/24 15:41:29
