floorId	partitionId	location_x	location_y	timeStamp
3	42	352.0898782617341	257.6816897320676	20/04/28 05:08:49
3	42	352.0898782617341	257.6816897320676	20/04/28 05:08:50
3	42	352.0898782617341	257.6816897320676	20/04/28 05:08:51
3	42	352.0898782617341	257.6816897320676	20/04/28 05:08:52
3	42	352.0898782617341	257.6816897320676	20/04/28 05:08:53
3	42	352.0898782617341	257.6816897320676	20/04/28 05:08:54
3	42	352.0898782617341	257.6816897320676	20/04/28 05:08:55
3	42	352.0898782617341	257.6816897320676	20/04/28 05:08:56
3	54	350.37914153837863	260.97432627346046	20/04/28 05:08:57
3	54	350.37914153837863	260.97432627346046	20/04/28 05:08:58
3	42	346.3242319400108	259.3686329834299	20/04/28 05:08:59
3	54	344.0544452814365	260.94893597900256	20/04/28 05:09:00
3	NULL	337.70753542622793	260.4595329480968	20/04/28 05:09:01
3	NULL	337.70753542622793	260.4595329480968	20/04/28 05:09:02
3	54	334.4407240787428	261.4032786809491	20/04/28 05:09:03
3	54	334.4407240787428	261.4032786809491	20/04/28 05:09:04
3	54	334.4407240787428	261.4032786809491	20/04/28 05:09:05
3	54	333.1227839393323	261.62465248411826	20/04/28 05:09:06
3	54	329.63052872625184	261.159270734312	20/04/28 05:09:07
3	54	327.3540763805351	261.1072377077433	20/04/28 05:09:08
3	54	324.6837666112415	261.38954335341236	20/04/28 05:09:09
3	54	324.01518066743233	262.76750572012435	20/04/28 05:09:10
3	18	323.5974156050991	264.28862562276623	20/04/28 05:09:11
3	54	318.718225726321	262.2630310087092	20/04/28 05:09:12
3	54	317.5263569831538	260.75405889490565	20/04/28 05:09:13
1	81	315.0919378015828	261.7557595783303	20/04/28 05:09:14
1	81	313.37765885306834	261.0920988121665	20/04/28 05:09:15
1	81	312.6019130172586	265.6450929868838	20/04/28 05:09:16
1	56	309.29436722642214	263.9851754886793	20/04/28 05:09:17
1	98	303.28594423312194	264.61216223098285	20/04/28 05:09:18
3	47	303.2859442331219	264.61216223098285	20/04/28 05:09:19
3	47	302.3157990937455	265.96754816044853	20/04/28 05:09:20
1	98	303.28594423312194	264.61216223098285	20/04/28 05:09:21
1	98	303.28594423312194	264.61216223098285	20/04/28 05:09:22
1	98	303.28594423312194	264.61216223098285	20/04/28 05:09:23
1	98	303.28594423312194	264.61216223098285	20/04/28 05:09:24
1	98	303.28594423312194	264.61216223098285	20/04/28 05:09:25
1	98	305.14384176673207	266.22087392439636	20/04/28 05:09:26
1	98	303.28594423312194	264.61216223098285	20/04/28 05:09:27
1	98	303.28594423312194	264.61216223098285	20/04/28 05:09:28
1	98	303.28594423312194	264.61216223098285	20/04/28 05:09:29
1	98	303.28594423312194	264.61216223098285	20/04/28 05:09:30
1	98	303.28594423312194	264.61216223098285	20/04/28 05:09:31
1	98	303.28594423312194	264.61216223098285	20/04/28 05:09:32
1	98	303.28594423312194	264.61216223098285	20/04/28 05:09:33
1	98	303.28594423312194	264.61216223098285	20/04/28 05:09:34
1	98	303.28594423312194	264.61216223098285	20/04/28 05:09:35
1	98	303.28594423312194	264.61216223098285	20/04/28 05:09:36
1	98	303.28594423312194	264.61216223098285	20/04/28 05:09:37
1	98	303.28594423312194	264.61216223098285	20/04/28 05:09:38
1	98	303.28594423312194	264.61216223098285	20/04/28 05:09:39
1	98	303.28594423312194	264.61216223098285	20/04/28 05:09:40
1	98	303.28594423312194	264.61216223098285	20/04/28 05:09:41
1	98	303.28594423312194	264.61216223098285	20/04/28 05:09:42
1	98	303.28594423312194	264.61216223098285	20/04/28 05:09:43
1	98	303.28594423312194	264.61216223098285	20/04/28 05:09:44
1	98	303.28594423312194	264.61216223098285	20/04/28 05:09:45
1	56	307.159840217744	263.3357311024059	20/04/28 05:09:46
1	56	307.159840217744	263.3357311024059	20/04/28 05:09:47
1	56	307.159840217744	263.3357311024059	20/04/28 05:09:48
1	98	303.28594423312194	264.61216223098285	20/04/28 05:09:49
1	98	303.28594423312194	264.61216223098285	20/04/28 05:09:50
1	98	303.28594423312194	264.61216223098285	20/04/28 05:09:51
1	98	303.28594423312194	264.61216223098285	20/04/28 05:09:52
1	98	303.28594423312194	264.61216223098285	20/04/28 05:09:53
1	98	303.28594423312194	264.61216223098285	20/04/28 05:09:54
1	98	305.14384176673207	266.22087392439636	20/04/28 05:09:55
1	56	307.159840217744	263.3357311024059	20/04/28 05:09:56
1	56	307.159840217744	263.3357311024059	20/04/28 05:09:57
1	56	307.159840217744	263.3357311024059	20/04/28 05:09:58
1	81	311.6591172126105	263.4112042347413	20/04/28 05:09:59
1	81	314.50318194109644	265.02915212402996	20/04/28 05:10:00
1	81	316.8584991431141	264.5437756453438	20/04/28 05:10:01
1	56	319.89662212153377	266.1573209564685	20/04/28 05:10:02
1	56	319.89662212153377	266.1573209564685	20/04/28 05:10:03
1	72	322.34915620924	265.0152899264337	20/04/28 05:10:04
1	37	323.6597216964546	264.1572674834102	20/04/28 05:10:05
1	37	325.93617404217133	264.20930050997885	20/04/28 05:10:06
1	37	326.6418503961265	263.9569908021342	20/04/28 05:10:07
1	56	332.3533251581634	266.3650631324579	20/04/28 05:10:08
1	56	333.50170633168455	266.97796434330365	20/04/28 05:10:09
1	56	333.50170633168455	266.97796434330365	20/04/28 05:10:10
1	83	337.2720802919978	268.9776784695725	20/04/28 05:10:11
1	53	339.58662165684126	264.96942215119606	20/04/28 05:10:12
1	NULL	344.77216199423657	268.7257539392073	20/04/28 05:10:13
1	NULL	344.77216199423657	268.7257539392073	20/04/28 05:10:14
1	NULL	344.77216199423657	268.7257539392073	20/04/28 05:10:15
1	88	345.6348085732032	269.7099337905566	20/04/28 05:10:16
1	56	348.71644801848555	266.7508534318112	20/04/28 05:10:17
3	43	354.63984137361604	268.2155443398704	20/04/28 05:10:18
1	10	356.9884669306864	271.1056044765582	20/04/28 05:10:19
1	45	352.26376018335503	274.6083542217253	20/04/28 05:10:20
1	45	352.26376018335503	274.6083542217253	20/04/28 05:10:21
3	40	348.65557854846685	274.12559453304283	20/04/28 05:10:22
3	40	352.2637601833551	274.60835422172534	20/04/28 05:10:23
3	40	352.26376018335503	274.6083542217253	20/04/28 05:10:24
1	45	352.2637601833551	274.60835422172534	20/04/28 05:10:25
3	40	350.5106868279581	273.4278672788951	20/04/28 05:10:26
3	40	348.65557854846685	274.12559453304283	20/04/28 05:10:27
3	40	348.65557854846685	274.12559453304283	20/04/28 05:10:28
1	45	348.65557854846685	274.12559453304283	20/04/28 05:10:29
3	40	352.2637601833551	274.60835422172534	20/04/28 05:10:30
3	40	352.2637601833551	274.60835422172534	20/04/28 05:10:31
1	45	352.2637601833551	274.60835422172534	20/04/28 05:10:32
3	40	352.26376018335503	274.6083542217253	20/04/28 05:10:33
3	62	348.87875438547894	266.7721234618829	20/04/28 05:10:34
1	45	348.65557854846685	274.12559453304283	20/04/28 05:10:35
1	45	350.3816592865578	274.5925036482883	20/04/28 05:10:36
3	40	352.2637601833551	274.60835422172534	20/04/28 05:10:37
3	40	348.65557854846685	274.12559453304283	20/04/28 05:10:38
3	40	348.65557854846685	274.12559453304283	20/04/28 05:10:39
1	45	348.65557854846685	274.12559453304283	20/04/28 05:10:40
3	40	350.5106868279581	273.4278672788951	20/04/28 05:10:41
1	45	350.3816592865578	274.5925036482883	20/04/28 05:10:42
1	88	345.6348085732032	269.7099337905566	20/04/28 05:10:43
1	78	350.93846059327893	271.0139216584488	20/04/28 05:10:44
1	88	348.3219530787578	270.35070545172243	20/04/28 05:10:45
3	62	349.17910102959496	269.3611061437384	20/04/28 05:10:46
1	88	348.3219530787578	270.35070545172243	20/04/28 05:10:47
1	88	349.17910102959496	269.3611061437384	20/04/28 05:10:48
1	78	351.93013471364594	270.83346514040494	20/04/28 05:10:49
3	62	348.3219530787578	270.35070545172243	20/04/28 05:10:50
3	62	350.0750264341547	271.5311923945526	20/04/28 05:10:51
1	45	350.5106868279581	273.4278672788951	20/04/28 05:10:52
3	40	348.65557854846685	274.12559453304283	20/04/28 05:10:53
3	62	350.59854891528283	266.7667040052482	20/04/28 05:10:54
3	40	348.65557854846685	274.12559453304283	20/04/28 05:10:55
1	83	339.77047839801435	270.8697224952789	20/04/28 05:10:56
1	45	348.65557854846685	274.12559453304283	20/04/28 05:10:57
1	45	348.65557854846685	274.12559453304283	20/04/28 05:10:58
1	45	350.3816592865578	274.5925036482883	20/04/28 05:10:59
1	45	352.26376018335503	274.6083542217253	20/04/28 05:11:00
1	56	354.83784735563466	267.95314652065605	20/04/28 05:11:01
1	78	352.78728266448314	269.84386583242093	20/04/28 05:11:02
1	56	346.99665348868166	266.7562728884459	20/04/28 05:11:03
1	NULL	344.77216199423657	268.7257539392073	20/04/28 05:11:04
1	NULL	344.77216199423657	268.7257539392073	20/04/28 05:11:05
1	NULL	344.77216199423657	268.7257539392073	20/04/28 05:11:06
1	22	343.40090039322234	264.23684917852336	20/04/28 05:11:07
3	26	337.2720802919978	268.9776784695725	20/04/28 05:11:08
1	56	333.50170633168455	266.97796434330365	20/04/28 05:11:09
1	56	333.50170633168455	266.9779643433037	20/04/28 05:11:10
1	NULL	331.9249996219656	268.7304237073172	20/04/28 05:11:11
1	NULL	331.9249996219656	268.7304237073172	20/04/28 05:11:12
1	37	325.93617404217133	264.20930050997885	20/04/28 05:11:13
1	72	322.34915620924	265.0152899264337	20/04/28 05:11:14
1	72	322.34915620924	265.0152899264337	20/04/28 05:11:15
1	72	322.34915620924	265.0152899264337	20/04/28 05:11:16
1	56	319.89662212153377	266.1573209564685	20/04/28 05:11:17
1	56	319.89662212153377	266.1573209564685	20/04/28 05:11:18
1	81	314.50318194109644	265.02915212402996	20/04/28 05:11:19
1	81	314.50318194109644	265.02915212402996	20/04/28 05:11:20
1	81	314.50318194109644	265.02915212402996	20/04/28 05:11:21
1	56	308.4512500184315	264.78737494292824	20/04/28 05:11:22
1	56	307.159840217744	263.3357311024059	20/04/28 05:11:23
1	56	305.9869589747227	265.41867447014755	20/04/28 05:11:24
1	98	303.28594423312194	264.61216223098285	20/04/28 05:11:25
1	98	303.28594423312194	264.61216223098285	20/04/28 05:11:26
3	47	302.3157990937455	265.96754816044853	20/04/28 05:11:27
3	47	303.28594423312194	264.61216223098285	20/04/28 05:11:28
3	47	305.42047124180004	265.2616066172563	20/04/28 05:11:29
3	20	305.9869589747227	265.41867447014755	20/04/28 05:11:30
1	81	312.6019130172586	265.6450929868838	20/04/28 05:11:31
1	81	312.6019130172586	265.6450929868838	20/04/28 05:11:32
1	81	315.0919378015828	261.7557595783303	20/04/28 05:11:33
3	NULL	320.17355074377616	260.48945145548413	20/04/28 05:11:34
3	18	322.99113575264545	265.5352298501222	20/04/28 05:11:35
3	54	324.01518066743233	262.76750572012435	20/04/28 05:11:36
3	54	324.01518066743233	262.76750572012435	20/04/28 05:11:37
3	54	324.6837666112415	261.38954335341236	20/04/28 05:11:38
3	54	327.3540763805351	261.10723770774325	20/04/28 05:11:39
3	54	329.63052872625184	261.159270734312	20/04/28 05:11:40
3	54	334.4407240787428	261.4032786809491	20/04/28 05:11:41
3	54	334.4407240787428	261.4032786809491	20/04/28 05:11:42
3	54	334.4407240787428	261.4032786809491	20/04/28 05:11:43
3	NULL	337.70753542622793	260.45953294809686	20/04/28 05:11:44
3	99	339.59375125487367	258.8166372045796	20/04/28 05:11:45
3	42	343.1917987024697	259.9647561276533	20/04/28 05:11:46
3	54	345.98250818917177	261.859258749847	20/04/28 05:11:47
3	54	349.17477120857285	262.4807721885283	20/04/28 05:11:48
3	54	350.37914153837863	260.97432627346046	20/04/28 05:11:49
3	54	350.37914153837863	260.97432627346046	20/04/28 05:11:50
3	54	352.9059324522066	261.07811147821695	20/04/28 05:11:51
3	54	354.93110780732565	263.85962413987545	20/04/28 05:11:52
3	54	356.0030407869288	263.6276478520211	20/04/28 05:11:53
3	54	359.56855835216805	263.2279362811352	20/04/28 05:11:54
3	54	359.408666544298	263.4150379716201	20/04/28 05:11:55
3	34	362.2167196060361	259.70189758364177	20/04/28 05:11:56
3	54	365.2339908031949	263.4272252913235	20/04/28 05:11:57
3	57	365.8336784609425	258.9548948604074	20/04/28 05:11:58
3	54	372.48785670166836	262.3595943162643	20/04/28 05:11:59
3	54	372.48785670166836	262.3595943162643	20/04/28 05:12:00
3	54	375.1867774942457	263.7731434229599	20/04/28 05:12:01
3	54	375.1867774942457	263.7731434229599	20/04/28 05:12:02
1	33	379.8755906118027	262.6421307240284	20/04/28 05:12:03
3	15	380.97239583354167	266.94453563659977	20/04/28 05:12:04
3	15	380.97239583354167	266.94453563659977	20/04/28 05:12:05
1	33	380.6150632356726	267.4744509522458	20/04/28 05:12:06
1	33	381.6109766893215	266.73786054806715	20/04/28 05:12:07
1	74	374.7544496259108	264.4513026329313	20/04/28 05:12:08
3	54	372.48785670166836	262.35959431626424	20/04/28 05:12:09
1	69	372.48785670166836	262.3595943162643	20/04/28 05:12:10
1	69	372.48785670166836	262.3595943162643	20/04/28 05:12:11
1	69	372.48785670166836	262.3595943162643	20/04/28 05:12:12
1	69	368.9169651830857	261.6578217243062	20/04/28 05:12:13
3	57	365.6578696297699	259.3576200548633	20/04/28 05:12:14
3	54	357.6965830742679	260.8022089979779	20/04/28 05:12:15
1	64	357.53669126639784	260.98931068846287	20/04/28 05:12:16
1	64	354.3333978239378	262.53426333928064	20/04/28 05:12:17
1	41	352.7251685521831	260.56227788261185	20/04/28 05:12:18
1	41	352.7251685521831	260.56227788261185	20/04/28 05:12:19
1	41	351.1038521390131	261.25919659269	20/04/28 05:12:20
1	41	350.03191915941005	261.4911728805443	20/04/28 05:12:21
1	41	349.6149730760457	260.6816456755546	20/04/28 05:12:22
1	22	343.1917987024697	259.9647561276533	20/04/28 05:12:24
1	22	343.1917987024697	259.9647561276533	20/04/28 05:12:25
1	69	340.1854692097293	258.18142547541174	20/04/28 05:12:26
1	69	338.1583683683643	258.3517387010974	20/04/28 05:12:27
1	69	338.1583683683643	258.3517387010974	20/04/28 05:12:28
1	5	333.7145018941879	260.98944075495035	20/04/28 05:12:29
3	54	333.7145018941879	260.98944075495035	20/04/28 05:12:30
1	37	329.2127636639186	262.6803906369539	20/04/28 05:12:31
1	5	332.9065526505472	263.50534437986465	20/04/28 05:12:32
1	5	332.9065526505472	263.50534437986465	20/04/28 05:12:33
1	5	332.9065526505472	263.50534437986465	20/04/28 05:12:34
1	5	332.9065526505472	263.50534437986465	20/04/28 05:12:35
1	5	332.9065526505472	263.50534437986465	20/04/28 05:12:36
1	5	332.9065526505472	263.50534437986465	20/04/28 05:12:37
1	5	332.9065526505472	263.50534437986465	20/04/28 05:12:38
1	5	334.73798111152297	262.0967001435302	20/04/28 05:12:39
1	5	332.9065526505472	263.50534437986465	20/04/28 05:12:40
1	56	333.50170633168455	266.9779643433037	20/04/28 05:12:41
1	5	332.9065526505472	263.50534437986465	20/04/28 05:12:42
1	5	332.9065526505472	263.50534437986465	20/04/28 05:12:43
1	5	334.73798111152297	262.0967001435302	20/04/28 05:12:44
1	5	334.73798111152297	262.0967001435302	20/04/28 05:12:45
1	5	332.9065526505472	263.50534437986465	20/04/28 05:12:46
1	5	332.9065526505472	263.50534437986465	20/04/28 05:12:47
1	5	332.9065526505472	263.50534437986465	20/04/28 05:12:48
1	5	334.1462631566674	262.7319118726981	20/04/28 05:12:49
3	54	333.1227839393323	261.62465248411826	20/04/28 05:12:50
1	5	333.1227839393323	261.62465248411826	20/04/28 05:12:51
3	54	333.7145018941879	260.98944075495035	20/04/28 05:12:52
1	69	335.24867332238347	258.8873750560348	20/04/28 05:12:53
1	69	338.1583683683643	258.3517387010974	20/04/28 05:12:54
1	69	340.1854692097293	258.18142547541174	20/04/28 05:12:55
1	69	340.1854692097293	258.18142547541174	20/04/28 05:12:56
1	NULL	341.7564158159603	259.49985762417106	20/04/28 05:12:57
1	69	340.1854692097293	258.18142547541174	20/04/28 05:12:58
1	22	343.1917987024697	259.9647561276533	20/04/28 05:12:59
1	NULL	341.75641581596034	259.4998576241711	20/04/28 05:13:00
1	69	340.1854692097293	258.18142547541174	20/04/28 05:13:01
1	69	340.1854692097293	258.18142547541174	20/04/28 05:13:02
1	NULL	341.75641581596034	259.4998576241711	20/04/28 05:13:03
1	69	340.1854692097293	258.18142547541174	20/04/28 05:13:04
1	69	340.1854692097293	258.18142547541174	20/04/28 05:13:05
1	69	340.1854692097293	258.18142547541174	20/04/28 05:13:06
1	NULL	341.75641581596034	259.4998576241711	20/04/28 05:13:07
