stationId	t_start	t_end	t_max	timeStamp
11	20/04/28 05:12:07	20/04/28 05:12:07	20/04/28 05:12:07
66	20/04/28 05:12:09	20/04/28 05:12:09	20/04/28 05:12:09
5	20/04/28 05:12:11	20/04/28 05:12:11	20/04/28 05:12:11
6	20/04/28 05:12:13	20/04/28 05:12:13	20/04/28 05:12:13
17	20/04/28 05:12:15	20/04/28 05:12:15	20/04/28 05:12:15
17	20/04/28 05:12:17	20/04/28 05:12:17	20/04/28 05:12:17
11	20/04/28 05:12:19	20/04/28 05:12:19	20/04/28 05:12:19
16	20/04/28 05:12:21	20/04/28 05:12:21	20/04/28 05:12:21
81	20/04/28 05:12:23	20/04/28 05:12:23	20/04/28 05:12:23
16	20/04/28 05:12:25	20/04/28 05:12:25	20/04/28 05:12:25
94	20/04/28 05:12:27	20/04/28 05:12:29	20/04/28 05:12:28
41	20/04/28 05:12:31	20/04/28 05:12:31	20/04/28 05:12:31
16	20/04/28 05:12:33	20/04/28 05:12:33	20/04/28 05:12:33
94	20/04/28 05:12:35	20/04/28 05:12:35	20/04/28 05:12:35
98	20/04/28 05:12:37	20/04/28 05:12:37	20/04/28 05:12:37
6	20/04/28 05:12:39	20/04/28 05:12:39	20/04/28 05:12:39
6	20/04/28 05:12:41	20/04/28 05:12:41	20/04/28 05:12:41
81	20/04/28 05:12:43	20/04/28 05:12:44	20/04/28 05:12:44
41	20/04/28 05:12:46	20/04/28 05:12:46	20/04/28 05:12:46
96	20/04/28 05:12:48	20/04/28 05:12:48	20/04/28 05:12:48
25	20/04/28 05:12:50	20/04/28 05:12:50	20/04/28 05:12:50
65	20/04/28 05:12:52	20/04/28 05:12:52	20/04/28 05:12:52
68	20/04/28 05:12:54	20/04/28 05:12:55	20/04/28 05:12:54
118	20/04/28 05:12:57	20/04/28 05:12:57	20/04/28 05:12:57
105	20/04/28 05:12:59	20/04/28 05:12:59	20/04/28 05:12:59
118	20/04/28 05:13:01	20/04/28 05:13:08	20/04/28 05:13:01
66	20/04/28 05:13:10	20/04/28 05:13:15	20/04/28 05:13:10
66	20/04/28 05:13:17	20/04/28 05:13:17	20/04/28 05:13:17
117	20/04/28 05:13:19	20/04/28 05:13:19	20/04/28 05:13:19
113	20/04/28 05:13:21	20/04/28 05:13:21	20/04/28 05:13:21
120	20/04/28 05:13:23	20/04/28 05:13:24	20/04/28 05:13:24
119	20/04/28 05:13:26	20/04/28 05:13:27	20/04/28 05:13:27
101	20/04/28 05:13:29	20/04/28 05:13:29	20/04/28 05:13:29
119	20/04/28 05:13:31	20/04/28 05:13:31	20/04/28 05:13:31
96	20/04/28 05:13:33	20/04/28 05:13:33	20/04/28 05:13:33
119	20/04/28 05:13:35	20/04/28 05:13:35	20/04/28 05:13:35
94	20/04/28 05:13:37	20/04/28 05:13:37	20/04/28 05:13:37
92	20/04/28 05:13:39	20/04/28 05:13:39	20/04/28 05:13:39
91	20/04/28 05:13:41	20/04/28 05:13:41	20/04/28 05:13:41
94	20/04/28 05:13:43	20/04/28 05:13:43	20/04/28 05:13:43
21	20/04/28 05:13:45	20/04/28 05:13:45	20/04/28 05:13:45
68	20/04/28 05:13:47	20/04/28 05:13:48	20/04/28 05:13:48
74	20/04/28 05:13:50	20/04/28 05:13:50	20/04/28 05:13:50
6	20/04/28 05:13:18	20/04/28 05:13:52	20/04/28 05:13:52
20	20/04/28 05:13:54	20/04/28 05:13:54	20/04/28 05:13:54
147	20/04/28 05:13:56	20/04/28 05:13:56	20/04/28 05:13:56
147	20/04/28 05:13:58	20/04/28 05:13:59	20/04/28 05:13:59
1	20/04/28 05:14:01	20/04/28 05:14:01	20/04/28 05:14:01
95	20/04/28 05:14:03	20/04/28 05:14:03	20/04/28 05:14:03
74	20/04/28 05:14:06	20/04/28 05:14:06	20/04/28 05:14:06
147	20/04/28 05:14:08	20/04/28 05:14:08	20/04/28 05:14:08
147	20/04/28 05:14:10	20/04/28 05:14:10	20/04/28 05:10:45
14	20/04/28 05:14:12	20/04/28 05:14:12	20/04/28 05:14:12
136	20/04/28 05:14:14	20/04/28 05:14:14	20/04/28 05:14:14
147	20/04/28 05:14:16	20/04/28 05:14:16	20/04/28 05:14:16
14	20/04/28 05:14:18	20/04/28 05:14:18	20/04/28 05:14:18
85	20/04/28 05:14:20	20/04/28 05:14:20	20/04/28 05:14:20
143	20/04/28 05:14:22	20/04/28 05:14:22	20/04/28 05:14:22
85	20/04/28 05:14:24	20/04/28 05:14:24	20/04/28 05:14:24
