stationId	t_start	t_end	t_max	timeStamp
160	20/04/28 05:08:49	20/04/28 05:08:49	20/04/28 05:08:49
44	20/04/28 05:08:51	20/04/28 05:08:51	20/04/28 05:08:51
34	20/04/28 05:08:53	20/04/28 05:08:53	20/04/28 05:08:53
160	20/04/28 05:08:55	20/04/28 05:08:55	20/04/28 05:08:55
24	20/04/28 05:08:57	20/04/28 05:08:57	20/04/28 05:08:57
144	20/04/28 05:08:59	20/04/28 05:08:59	20/04/28 05:08:59
86	20/04/28 05:09:01	20/04/28 05:09:01	20/04/28 05:09:01
18	20/04/28 05:09:03	20/04/28 05:09:04	20/04/28 05:09:04
77	20/04/28 05:09:06	20/04/28 05:09:06	20/04/28 05:09:06
47	20/04/28 05:09:08	20/04/28 05:09:08	20/04/28 05:09:08
24	20/04/28 05:09:10	20/04/28 05:09:10	20/04/28 05:09:10
44	20/04/28 05:09:12	20/04/28 05:09:12	20/04/28 05:09:12
86	20/04/28 05:09:14	20/04/28 05:09:14	20/04/28 05:09:14
51	20/04/28 05:09:16	20/04/28 05:09:16	20/04/28 05:09:16
49	20/04/28 05:09:18	20/04/28 05:09:18	20/04/28 05:09:18
128	20/04/28 05:09:20	20/04/28 05:09:20	20/04/28 05:09:20
1	20/04/28 05:09:22	20/04/28 05:09:22	20/04/28 05:09:22
1	20/04/28 05:09:24	20/04/28 05:09:24	20/04/28 05:09:24
85	20/04/28 05:09:26	20/04/28 05:09:27	20/04/28 05:09:27
55	20/04/28 05:09:29	20/04/28 05:09:29	20/04/28 05:09:29
85	20/04/28 05:09:31	20/04/28 05:09:32	20/04/28 05:09:32
83	20/04/28 05:09:34	20/04/28 05:09:34	20/04/28 05:09:34
85	20/04/28 05:09:36	20/04/28 05:09:37	20/04/28 05:09:37
135	20/04/28 05:09:39	20/04/28 05:09:39	20/04/28 05:09:39
31	20/04/28 05:09:41	20/04/28 05:09:41	20/04/28 05:09:41
135	20/04/28 05:09:43	20/04/28 05:09:44	20/04/28 05:09:44
55	20/04/28 05:09:46	20/04/28 05:09:46	20/04/28 05:09:46
85	20/04/28 05:09:48	20/04/28 05:09:48	20/04/28 05:09:48
31	20/04/28 05:09:50	20/04/28 05:09:51	20/04/28 05:09:51
4	20/04/28 05:09:53	20/04/28 05:09:54	20/04/28 05:09:54
107	20/04/28 05:09:56	20/04/28 05:09:56	20/04/28 05:09:56
129	20/04/28 05:09:58	20/04/28 05:09:58	20/04/28 05:09:58
13	20/04/28 05:10:00	20/04/28 05:10:00	20/04/28 05:10:00
84	20/04/28 05:10:02	20/04/28 05:10:02	20/04/28 05:10:02
79	20/04/28 05:10:04	20/04/28 05:10:04	20/04/28 05:10:04
45	20/04/28 05:10:06	20/04/28 05:10:06	20/04/28 05:10:06
57	20/04/28 05:10:08	20/04/28 05:10:08	20/04/28 05:10:08
57	20/04/28 05:10:10	20/04/28 05:10:10	20/04/28 05:10:10
111	20/04/28 05:10:12	20/04/28 05:10:19	20/04/28 05:10:17
56	20/04/28 05:10:21	20/04/28 05:10:21	20/04/28 05:10:21
57	20/04/28 05:10:23	20/04/28 05:10:30	20/04/28 05:10:27
111	20/04/28 05:10:32	20/04/28 05:10:37	20/04/28 05:10:36
111	20/04/28 05:10:39	20/04/28 05:10:42	20/04/28 05:10:41
57	20/04/28 05:10:44	20/04/28 05:10:51	20/04/28 05:10:49
57	20/04/28 05:10:53	20/04/28 05:10:53	20/04/28 05:10:53
31	20/04/28 05:10:55	20/04/28 05:10:56	20/04/28 05:10:56
31	20/04/28 05:10:58	20/04/28 05:10:58	20/04/28 05:10:51
