floorId	partitionId	location_x	location_y	timeStamp
1	98	305.14384176673207	266.22087392439636	20/04/28 05:17:35
1	98	303.28594423312194	264.61216223098285	20/04/28 05:17:36
3	47	302.8570592601016	265.6207358146814	20/04/28 05:17:37
3	47	305.42047124180004	265.2616066172563	20/04/28 05:17:38
3	47	305.42047124180004	265.2616066172563	20/04/28 05:17:39
3	20	308.1866193271433	264.1749199815553	20/04/28 05:17:40
1	81	312.6019130172586	265.6450929868838	20/04/28 05:17:41
1	81	312.6019130172586	265.6450929868838	20/04/28 05:17:42
3	NULL	315.74240883925677	260.5181275582284	20/04/28 05:17:43
3	NULL	319.9530127742257	263.92168453899757	20/04/28 05:17:44
3	18	323.5974156050991	264.28862562276623	20/04/28 05:17:45
3	18	323.5974156050991	264.28862562276623	20/04/28 05:17:46
3	54	324.0151806674323	262.76750572012435	20/04/28 05:17:47
3	54	324.6837666112415	261.38954335341236	20/04/28 05:17:48
3	54	327.3540763805351	261.1072377077433	20/04/28 05:17:49
3	54	334.4407240787428	261.4032786809491	20/04/28 05:17:50
3	54	334.4407240787428	261.4032786809491	20/04/28 05:17:51
3	54	334.4407240787428	261.4032786809491	20/04/28 05:17:52
3	54	334.4407240787428	261.4032786809491	20/04/28 05:17:53
3	NULL	337.70753542622793	260.4595329480968	20/04/28 05:17:54
3	99	339.59375125487367	258.8166372045796	20/04/28 05:17:55
3	42	343.19179870246967	259.9647561276533	20/04/28 05:17:56
3	42	346.7411780233751	260.17816018841967	20/04/28 05:17:57
3	54	350.37914153837863	260.97432627346046	20/04/28 05:17:58
3	54	350.37914153837863	260.97432627346046	20/04/28 05:17:59
3	54	350.37914153837863	260.97432627346046	20/04/28 05:18:00
3	54	352.9059324522066	261.07811147821695	20/04/28 05:18:01
3	68	354.27494542472317	260.2761007032412	20/04/28 05:18:02
3	54	358.23287936641947	263.0061707425011	20/04/28 05:18:03
3	54	359.5685583521681	263.2279362811352	20/04/28 05:18:04
3	34	363.08940602427793	260.2393220879455	20/04/28 05:18:05
3	34	362.2167196060361	259.70189758364177	20/04/28 05:18:06
3	34	361.2642468288334	255.55936173685845	20/04/28 05:18:07
3	17	363.0633788732786	253.76883669815365	20/04/28 05:18:08
3	17	363.0633788732786	253.76883669815368	20/04/28 05:18:09
3	17	362.3945272480641	251.57317905073432	20/04/28 05:18:10
3	30	365.53445097535786	248.80973562593917	20/04/28 05:18:11
3	23	366.2602386887035	244.5685484047918	20/04/28 05:18:12
3	23	366.2602386887035	244.5685484047918	20/04/28 05:18:13
3	6	371.6459156222339	242.1946659303275	20/04/28 05:18:14
3	23	366.2602386887035	244.5685484047918	20/04/28 05:18:15
3	6	370.63064515039724	245.89555531802912	20/04/28 05:18:16
3	57	367.9225813006244	252.20998711858013	20/04/28 05:18:17
3	17	363.0633788732786	253.76883669815368	20/04/28 05:18:18
3	17	363.0633788732786	253.76883669815368	20/04/28 05:18:19
3	17	363.0633788732786	253.76883669815365	20/04/28 05:18:20
3	17	363.0633788732786	253.76883669815365	20/04/28 05:18:21
3	34	361.2642468288334	255.55936173685845	20/04/28 05:18:22
3	34	362.2167196060361	259.70189758364177	20/04/28 05:18:23
3	57	365.8336784609425	258.95489486040736	20/04/28 05:18:24
3	57	365.8336784609425	258.95489486040736	20/04/28 05:18:25
3	57	370.51908075392413	258.7689659184303	20/04/28 05:18:26
3	54	372.48785670166836	262.3595943162643	20/04/28 05:18:27
3	57	374.26377240687094	258.097817872792	20/04/28 05:18:28
3	54	372.48785670166836	262.3595943162643	20/04/28 05:18:29
3	15	379.8755906118027	262.6421307240284	20/04/28 05:18:30
1	33	379.8755906118027	262.6421307240284	20/04/28 05:18:31
3	15	380.97239583354167	266.94453563659977	20/04/28 05:18:32
1	33	381.6109766893215	266.73786054806715	20/04/28 05:18:33
1	33	381.6109766893215	266.7378605480671	20/04/28 05:18:34
1	86	377.91614244309534	266.0609018455502	20/04/28 05:18:35
1	69	372.48785670166836	262.3595943162643	20/04/28 05:18:36
1	69	372.48785670166836	262.3595943162643	20/04/28 05:18:37
1	69	372.48785670166836	262.3595943162643	20/04/28 05:18:38
1	69	372.48785670166836	262.3595943162643	20/04/28 05:18:39
1	69	368.9169651830857	261.65782172430613	20/04/28 05:18:40
1	69	367.80245440868674	262.5455232582413	20/04/28 05:18:41
3	34	362.2167196060361	259.70189758364177	20/04/28 05:18:42
3	54	358.87237025214637	261.21107622709695	20/04/28 05:18:43
1	64	354.49328963180795	262.3471616487957	20/04/28 05:18:44
1	64	354.49328963180795	262.3471616487957	20/04/28 05:18:45
1	64	354.49328963180795	262.3471616487957	20/04/28 05:18:46
1	41	351.1038521390131	261.25919659269	20/04/28 05:18:47
1	41	352.7251685521831	260.56227788261185	20/04/28 05:18:48
