floorId	partitionId	location_x	location_y	timeStamp
3	42	347.3080875320364	259.15027631328513	20/04/28 05:08:49
3	42	347.3216657340532	259.159888151821	20/04/28 05:08:49
3	42	347.52873231463536	259.02157578622086	20/04/28 05:08:49
3	42	347.47080587643137	258.7992356480331	20/04/28 05:08:49
3	42	347.48938364375715	258.88331950564395	20/04/28 05:08:49
3	42	347.6584007675914	258.7988979793844	20/04/28 05:08:49
3	42	347.77186548867076	258.7617788706459	20/04/28 05:08:49
3	42	347.970456607597	258.80095658678147	20/04/28 05:08:49
3	42	347.9086847618048	258.92512084232993	20/04/28 05:08:50
3	42	347.78494964911147	259.02699055991275	20/04/28 05:08:50
3	42	347.8343527985986	258.8617650423605	20/04/28 05:08:50
3	42	347.8343527985986	258.8617650423605	20/04/28 05:08:50
3	42	347.8515415911824	258.93259019513044	20/04/28 05:08:50
3	42	347.8311436280961	259.02189921347195	20/04/28 05:08:50
3	42	347.91747829437696	258.82795293645034	20/04/28 05:08:50
3	42	347.69355316317706	258.7713179209689	20/04/28 05:08:50
3	42	347.6376304878438	258.98073919030213	20/04/28 05:08:50
3	42	347.5775005106371	258.72808277175494	20/04/28 05:08:51
3	42	347.48045861015487	258.76665246636344	20/04/28 05:08:51
3	42	347.7240365552663	258.83150638120026	20/04/28 05:08:51
3	42	347.6122961635662	258.62416364317215	20/04/28 05:08:51
3	42	347.6743884922399	258.8755396799036	20/04/28 05:08:51
3	42	347.7713858843218	258.9456832337303	20/04/28 05:08:51
3	42	347.7167186440805	258.91179964974657	20/04/28 05:08:51
3	42	347.51559592048113	258.9412140092909	20/04/28 05:08:51
3	42	347.5216977887662	258.9659032284472	20/04/28 05:08:51
3	42	347.50940235409405	258.94815380447073	20/04/28 05:08:51
3	42	347.52719326163594	259.00415612206956	20/04/28 05:08:52
3	42	347.33910698118694	259.15007268508964	20/04/28 05:08:52
3	42	347.1549505103456	259.07512523894064	20/04/28 05:08:52
3	42	347.2331272347591	259.06700036726676	20/04/28 05:08:52
3	42	347.3698556067746	259.09847965555076	20/04/28 05:08:52
3	42	347.5299782836305	259.3117616263943	20/04/28 05:08:52
3	42	347.38877322409775	259.56192860574896	20/04/28 05:08:52
3	42	347.6719225119457	259.4773924099826	20/04/28 05:08:52
3	42	347.8269480371627	259.4973355438877	20/04/28 05:08:52
3	42	347.81059303916606	259.4241809661401	20/04/28 05:08:53
3	42	347.5969575029847	259.58250434462394	20/04/28 05:08:53
3	42	347.62395042332923	259.5289480464428	20/04/28 05:08:53
3	42	347.8997746400644	259.60071905975406	20/04/28 05:08:53
3	42	347.88417233755973	259.7084511199433	20/04/28 05:08:53
3	42	347.6991357615328	259.8057428215642	20/04/28 05:08:53
3	42	347.8605532625473	259.8022732366593	20/04/28 05:08:53
3	42	347.88471038844466	259.7911660830889	20/04/28 05:08:53
3	42	347.7854601276156	259.77934947280283	20/04/28 05:08:53
3	42	347.65378939446816	259.9358616233269	20/04/28 05:08:53
3	42	347.41861982867937	259.82494984797654	20/04/28 05:08:54
3	42	347.2920800334396	259.9411324270672	20/04/28 05:08:54
3	42	347.35988432136287	260.00336119425276	20/04/28 05:08:54
3	42	347.31371303625116	260.20913417456046	20/04/28 05:08:54
3	42	347.3379029418566	260.22790775216265	20/04/28 05:08:54
3	42	347.62521092292235	260.20346478208774	20/04/28 05:08:54
3	42	347.71218669887986	260.1283767710136	20/04/28 05:08:54
3	42	347.4415829220966	260.2242485556538	20/04/28 05:08:54
3	42	347.5530380994029	260.1752415064067	20/04/28 05:08:54
3	42	347.57026295716315	260.19489292782947	20/04/28 05:08:54
3	42	347.4206980296773	260.263039325205	20/04/28 05:08:55
3	42	347.36543760793313	260.25060562135144	20/04/28 05:08:55
3	42	347.33952476931717	259.9748289048052	20/04/28 05:08:55
3	42	347.22811088512873	260.2323847039533	20/04/28 05:08:55
3	42	347.17264812879625	260.23448944970374	20/04/28 05:08:55
3	42	347.17524395278247	260.2384527515291	20/04/28 05:08:55
3	42	347.21524503853095	260.19622069077485	20/04/28 05:08:55
3	42	347.1168633576985	260.1373782271436	20/04/28 05:08:55
3	42	347.16124584495617	260.09998572691046	20/04/28 05:08:55
3	42	347.26026814917753	259.95960229488287	20/04/28 05:08:56
3	42	347.2335667524025	259.867751848011	20/04/28 05:08:56
3	42	347.148289755808	259.8543358326388	20/04/28 05:08:56
3	42	347.05108376942485	260.097207738619	20/04/28 05:08:56
3	42	347.1973971917534	260.144007952159	20/04/28 05:08:56
3	42	347.18889740430654	260.2212139404787	20/04/28 05:08:56
3	42	347.2957848284834	260.34006574557674	20/04/28 05:08:56
3	42	347.2955184252698	260.33985327555513	20/04/28 05:08:56
3	42	347.25304443798353	260.3062513632939	20/04/28 05:08:56
3	42	347.1988468308252	260.2847919995279	20/04/28 05:08:56
3	42	347.1988468308252	260.2847919995279	20/04/28 05:08:57
3	42	346.9944393284045	260.3243241233741	20/04/28 05:08:57
3	42	346.938056262362	260.2493728665818	20/04/28 05:08:57
3	42	346.92647540534404	260.26553806601004	20/04/28 05:08:57
3	42	346.9863654499684	260.08474702763596	20/04/28 05:08:57
3	42	346.9982521147342	260.0712214713498	20/04/28 05:08:57
3	42	346.87050615650656	260.12784480009014	20/04/28 05:08:57
3	42	346.634661778233	260.1676735178965	20/04/28 05:08:57
3	42	346.55271459701294	259.99367423740057	20/04/28 05:08:57
3	42	346.38402357284957	259.75997687229346	20/04/28 05:08:57
3	42	346.38675900212036	259.7603993906198	20/04/28 05:08:58
3	42	346.46510413375546	259.5223674459038	20/04/28 05:08:58
3	42	346.2616138050479	259.4151210348311	20/04/28 05:08:58
3	42	346.24530190534995	259.2247662044543	20/04/28 05:08:58
3	42	346.40709684801885	259.1514562584233	20/04/28 05:08:58
3	42	346.47429435834147	259.1237849998666	20/04/28 05:08:58
3	42	346.43894993070626	259.1519618922702	20/04/28 05:08:58
3	42	346.24474586564475	259.27052877309563	20/04/28 05:08:58
3	42	346.3333460835684	259.2373314777577	20/04/28 05:08:58
3	42	346.35141986446774	259.2892994487844	20/04/28 05:08:59
3	42	346.1064753301352	259.27465043188596	20/04/28 05:08:59
3	42	346.05731100326386	259.18779646299475	20/04/28 05:08:59
3	42	346.11576076517935	259.1751373429058	20/04/28 05:08:59
3	42	346.1957138797543	259.4180732219399	20/04/28 05:08:59
3	42	346.22951966847774	259.39957235544966	20/04/28 05:08:59
3	42	346.19773018788186	259.31594131285465	20/04/28 05:08:59
3	42	346.36264679579614	259.20822144254305	20/04/28 05:08:59
3	42	346.17645867195034	259.10331636372894	20/04/28 05:08:59
3	42	346.20386552487776	258.9950028931157	20/04/28 05:08:59
3	42	346.0547303938787	259.00784129058576	20/04/28 05:09:00
3	42	345.9066658523577	259.262834895419	20/04/28 05:09:00
3	42	346.05712128165516	259.4281460197569	20/04/28 05:09:00
3	42	345.94308776420826	259.3438355314325	20/04/28 05:09:00
3	42	345.9410539638096	259.2681990502254	20/04/28 05:09:00
3	42	346.04888461417704	259.4025177779544	20/04/28 05:09:00
3	42	346.20878309440343	259.2144847236953	20/04/28 05:09:00
3	42	346.444120666829	259.3933092103195	20/04/28 05:09:00
3	42	346.50555467418013	259.35173801260487	20/04/28 05:09:00
3	42	346.48501724987887	259.17511434788537	20/04/28 05:09:00
3	42	346.7536070090196	259.28080379558673	20/04/28 05:09:01
3	42	346.97398801636194	259.10542233869955	20/04/28 05:09:01
3	42	346.97827387263317	259.10341492555494	20/04/28 05:09:01
3	42	347.04317247553917	259.0816443979235	20/04/28 05:09:01
3	42	347.04728547537974	259.0985239970388	20/04/28 05:09:01
3	42	347.0412090327909	259.07011612530596	20/04/28 05:09:01
3	42	347.0935503443731	259.1990371364484	20/04/28 05:09:01
3	42	347.0913659506602	259.18063785569655	20/04/28 05:09:01
3	42	346.9899599828602	259.35294918715033	20/04/28 05:09:01
3	42	346.9899599828602	259.35294918715033	20/04/28 05:09:02
3	42	346.9072589854133	259.5039340017472	20/04/28 05:09:02
3	42	346.8311466031018	259.4414586138133	20/04/28 05:09:02
3	42	346.8135392543836	259.3914495955317	20/04/28 05:09:02
3	42	346.6692462955068	259.38815853285945	20/04/28 05:09:02
3	42	346.6308386294552	259.1833616764471	20/04/28 05:09:02
3	42	346.4957538055902	258.9788052157216	20/04/28 05:09:02
3	42	346.3586407504237	259.01381652568125	20/04/28 05:09:02
3	42	346.12369806857146	259.0748653337087	20/04/28 05:09:02
3	42	346.14453382282045	259.2132530249342	20/04/28 05:09:02
3	42	346.12074673619594	259.15925471420934	20/04/28 05:09:03
3	42	345.9334756274296	258.95196620392136	20/04/28 05:09:03
3	42	345.9112089604078	259.0110320723817	20/04/28 05:09:03
3	42	345.62853242294557	258.9612697313874	20/04/28 05:09:03
3	42	345.62853242294557	258.9612697313874	20/04/28 05:09:03
3	42	345.62853242294557	258.9612697313874	20/04/28 05:09:03
3	42	345.51766781964864	259.1963461503472	20/04/28 05:09:03
3	42	345.4931653322142	258.9778272821129	20/04/28 05:09:03
3	42	345.2185471549825	259.0172817940674	20/04/28 05:09:03
3	42	345.38113517546674	258.9377961374392	20/04/28 05:09:04
3	42	345.3235588828674	258.89688000888435	20/04/28 05:09:04
3	42	345.3903900464375	259.0255964611618	20/04/28 05:09:04
3	42	345.4020940801745	259.0283351126694	20/04/28 05:09:04
3	42	345.40842627829966	258.8985081743773	20/04/28 05:09:04
3	42	345.5875325481786	258.8455043968252	20/04/28 05:09:04
3	42	345.72851635020567	258.78145214265965	20/04/28 05:09:04
3	42	345.679198103914	258.80064377705327	20/04/28 05:09:04
3	42	345.7024942467316	258.7094386250325	20/04/28 05:09:04
3	42	345.7732017594029	258.61272631830684	20/04/28 05:09:04
3	42	345.8121783346173	258.76656144057887	20/04/28 05:09:05
3	42	345.57510720845397	258.6928246605975	20/04/28 05:09:05
3	42	345.8077730629141	258.5804044075221	20/04/28 05:09:05
3	42	345.7094136900958	258.3689113274602	20/04/28 05:09:05
3	42	345.86524228908314	258.23830429545853	20/04/28 05:09:05
3	42	345.8291939105378	258.0254395145713	20/04/28 05:09:05
3	42	345.9655828026034	257.85616469991186	20/04/28 05:09:05
3	42	345.94650897156055	257.7467583855076	20/04/28 05:09:05
3	42	345.53578595761235	257.7716924619213	20/04/28 05:09:05
3	42	345.53578595761235	257.7716924619213	20/04/28 05:09:06
3	42	345.2803532432088	257.91858874648693	20/04/28 05:09:06
3	42	345.19384805411397	257.9756845331609	20/04/28 05:09:06
3	42	345.28822343141053	257.7095689961764	20/04/28 05:09:06
3	42	345.06408640085834	257.9555050506325	20/04/28 05:09:06
3	42	344.9938246159364	258.08922484625816	20/04/28 05:09:06
3	42	344.88808333483837	258.2371505635337	20/04/28 05:09:06
3	42	344.8279777092599	258.24616815973076	20/04/28 05:09:06
3	42	344.6877283848871	258.36749654423187	20/04/28 05:09:06
3	42	344.65257573208146	258.1751381067121	20/04/28 05:09:06
3	42	344.71833868507775	258.4400512972276	20/04/28 05:09:07
3	42	344.89997447583283	258.5478677770198	20/04/28 05:09:07
3	42	345.0745664566409	258.6266465793594	20/04/28 05:09:07
3	42	344.9951295680579	258.61684243432245	20/04/28 05:09:07
3	42	344.98060049061695	258.62102112943097	20/04/28 05:09:07
3	42	344.70897045839	258.7318464935946	20/04/28 05:09:07
3	42	344.4702362227727	258.62466677348965	20/04/28 05:09:07
3	42	344.48676969123653	258.8592301136649	20/04/28 05:09:07
3	42	344.44821265778455	258.95852959519846	20/04/28 05:09:07
3	42	344.4445489106421	258.91709727680563	20/04/28 05:09:07
3	42	344.3164109070102	259.08770533543697	20/04/28 05:09:08
3	42	344.2921374064007	259.0686943870901	20/04/28 05:09:08
3	42	344.46498264515145	259.24931362747174	20/04/28 05:09:08
3	42	344.6382547484996	259.15655157797795	20/04/28 05:09:08
3	42	344.69860877899436	259.18136743521075	20/04/28 05:09:08
3	42	344.78427520398526	259.1340323806923	20/04/28 05:09:08
3	42	344.78239924303824	258.9327863658851	20/04/28 05:09:08
3	42	345.07372142850517	258.8989345632087	20/04/28 05:09:08
3	42	345.18702514195303	258.8332938784761	20/04/28 05:09:08
3	42	345.1594118565248	258.97531307458974	20/04/28 05:09:09
3	42	345.3497505108478	258.8842977845424	20/04/28 05:09:09
3	42	345.54267130490075	258.8896031963894	20/04/28 05:09:09
3	42	345.75570024402055	258.9004728337308	20/04/28 05:09:09
3	42	346.0053845757434	259.0616973968331	20/04/28 05:09:09
3	42	346.065286747317	258.908657678049	20/04/28 05:09:09
3	42	346.0737968073264	258.8918365185397	20/04/28 05:09:09
3	42	345.9608016503761	258.74032994800683	20/04/28 05:09:09
3	42	345.9216771078924	258.4796370642542	20/04/28 05:09:09
3	42	345.92261973335985	258.50209579548437	20/04/28 05:09:09
3	42	345.8619174032175	258.4777757691456	20/04/28 05:09:10
3	42	345.8812149088113	258.46221846729	20/04/28 05:09:10
3	42	345.82453697471703	258.6360383220979	20/04/28 05:09:10
3	42	345.8321835447032	258.489587158012	20/04/28 05:09:10
3	42	345.71198739125634	258.59128487878496	20/04/28 05:09:10
3	42	345.4750862991666	258.5500815928694	20/04/28 05:09:10
3	42	345.5896445450501	258.30778786697886	20/04/28 05:09:10
3	42	345.73718708261987	258.2441838085759	20/04/28 05:09:10
3	42	345.94560025541057	258.23887514096964	20/04/28 05:09:10
3	42	345.9405439130836	258.2185142837332	20/04/28 05:09:11
3	42	345.7941448257643	258.03574452075236	20/04/28 05:09:11
3	42	345.85519188869114	258.12941534363705	20/04/28 05:09:11
3	42	345.9129687668885	258.18136272135615	20/04/28 05:09:11
3	42	345.72738360613715	258.2030570821	20/04/28 05:09:11
3	42	345.7895839911193	258.04433805821327	20/04/28 05:09:11
3	42	345.7853642735163	258.06147361427134	20/04/28 05:09:11
3	42	345.83608858438413	258.28037252447103	20/04/28 05:09:11
3	42	345.85995191073965	258.2664271930154	20/04/28 05:09:11
3	42	346.06779965090584	258.2169258552375	20/04/28 05:09:11
3	42	346.2982227397383	258.2215050238984	20/04/28 05:09:12
3	42	346.2144123054275	258.366346154901	20/04/28 05:09:12
3	42	346.2264571550386	258.288152834129	20/04/28 05:09:12
3	42	346.3109212861989	258.34228758109106	20/04/28 05:09:12
3	42	346.20581372839365	258.31564558092094	20/04/28 05:09:12
3	42	346.04758690095	258.2093699365979	20/04/28 05:09:12
3	42	345.84703900337	257.98970004150067	20/04/28 05:09:12
3	42	345.86458659673315	257.79863688718206	20/04/28 05:09:12
3	42	345.841701603148	257.79682027393227	20/04/28 05:09:12
3	42	346.02812138104	257.65328183310027	20/04/28 05:09:13
3	42	345.8768406386239	257.6459715699765	20/04/28 05:09:13
3	42	345.8598796462183	257.6877352160129	20/04/28 05:09:13
3	42	346.0059290430037	257.7068174410931	20/04/28 05:09:13
3	42	345.85662276442264	257.92842023321987	20/04/28 05:09:13
3	42	345.88556219523844	257.88346736955225	20/04/28 05:09:13
3	42	345.7212297604972	257.7038400544118	20/04/28 05:09:13
3	42	345.68699858897077	257.6797931696073	20/04/28 05:09:13
3	42	345.59084857978456	257.49973201294904	20/04/28 05:09:13
3	42	345.5576575875512	257.2426078654836	20/04/28 05:09:13
3	42	345.18362665229654	257.1564224063839	20/04/28 05:09:14
3	42	345.1439519207033	257.1510140694951	20/04/28 05:09:14
3	42	345.1412321367609	257.1351056866424	20/04/28 05:09:14
3	42	345.1412321367609	257.1351056866424	20/04/28 05:09:14
3	42	344.986928872351	257.32666540727416	20/04/28 05:09:14
3	42	345.0017561904806	257.27212181274245	20/04/28 05:09:14
3	42	345.07176803569484	257.04544830210466	20/04/28 05:09:14
3	42	344.826972630707	257.01520704946034	20/04/28 05:09:14
3	42	344.8333595165765	257.0456973015176	20/04/28 05:09:14
3	42	344.6832887921683	257.03344527398485	20/04/28 05:09:15
3	42	344.67111937531945	256.843459286326	20/04/28 05:09:15
3	42	344.573550681009	256.8427999911013	20/04/28 05:09:15
3	42	344.57966639625823	256.88446103898127	20/04/28 05:09:15
3	42	344.7513639047584	257.1081366331276	20/04/28 05:09:15
3	42	344.63406363062046	257.31766983910717	20/04/28 05:09:15
3	42	344.61464584626543	257.4191427498519	20/04/28 05:09:15
3	42	344.78973473767013	257.1966379195568	20/04/28 05:09:15
3	42	344.7344169527566	257.10428053677356	20/04/28 05:09:15
3	42	344.70643200659856	257.21012673433717	20/04/28 05:09:15
3	42	344.7761618153158	257.2189277806178	20/04/28 05:09:16
3	42	344.63895764463786	257.06970213098936	20/04/28 05:09:16
3	42	344.6681548068313	257.13667356904307	20/04/28 05:09:16
3	42	344.6988709720362	257.1740409549495	20/04/28 05:09:16
3	42	344.62254841833675	257.18186034025723	20/04/28 05:09:16
3	42	344.5979360943306	257.2145388661664	20/04/28 05:09:16
3	42	344.51481460695607	257.20777063619244	20/04/28 05:09:16
3	42	344.55647718472443	257.13585863440846	20/04/28 05:09:16
3	42	344.6130300963349	257.12841968035775	20/04/28 05:09:16
3	42	344.6465759534415	256.85152839340185	20/04/28 05:09:17
3	42	344.7614629472851	256.8647128207265	20/04/28 05:09:17
3	42	344.49761445939026	256.91197573721234	20/04/28 05:09:17
3	42	344.75852685392545	257.0572271373399	20/04/28 05:09:17
3	42	344.6219491428516	257.05393978248975	20/04/28 05:09:17
3	42	344.674879940716	257.2584103399259	20/04/28 05:09:17
3	42	344.77968915729326	257.47776582221474	20/04/28 05:09:17
3	42	345.04495828278186	257.53428774741127	20/04/28 05:09:17
3	42	344.9799492061848	257.5011765144531	20/04/28 05:09:17
3	42	344.9799492061848	257.5011765144531	20/04/28 05:09:17
3	42	344.8881305896072	257.38083136357204	20/04/28 05:09:18
3	42	344.85626697165117	257.6125028068891	20/04/28 05:09:18
3	42	344.63792240715526	257.7410429886573	20/04/28 05:09:18
3	42	344.6379889246772	257.74125428559404	20/04/28 05:09:18
3	42	344.8174198748014	257.722413014765	20/04/28 05:09:18
3	42	344.88191261941876	257.49410768947996	20/04/28 05:09:18
3	42	344.63394302391475	257.5684168080194	20/04/28 05:09:18
3	42	344.36473653107566	257.6345744580206	20/04/28 05:09:18
3	42	344.38800436792576	257.5739855403285	20/04/28 05:09:18
3	42	344.4015414803969	257.78151536152535	20/04/28 05:09:19
3	42	344.3944861337752	257.79655254514677	20/04/28 05:09:19
3	42	344.33251914342355	257.88031180188835	20/04/28 05:09:19
3	42	344.3684621362243	257.620606478121	20/04/28 05:09:19
3	42	344.2526157040991	257.766809780006	20/04/28 05:09:19
3	42	344.11646275070694	257.6526999923815	20/04/28 05:09:19
3	42	343.9806188786103	257.8871324782348	20/04/28 05:09:19
3	42	343.9758470269291	257.8659827465176	20/04/28 05:09:19
3	42	343.96678580478186	257.62064243094335	20/04/28 05:09:19
3	42	343.90788879280166	257.6366590062847	20/04/28 05:09:19
3	42	343.7955867535101	257.88726048947433	20/04/28 05:09:20
3	42	343.8856797460684	257.89382332692986	20/04/28 05:09:20
3	42	344.091043211714	257.74526555715295	20/04/28 05:09:20
3	42	343.88892896090937	257.5916493266568	20/04/28 05:09:20
3	42	344.02250870202465	257.5293739396121	20/04/28 05:09:20
3	42	343.9679850261742	257.5044278474257	20/04/28 05:09:20
3	42	343.9269588591989	257.61364222215184	20/04/28 05:09:20
3	42	343.7785855525312	257.583064254653	20/04/28 05:09:20
3	42	343.7366222762923	257.6058802254911	20/04/28 05:09:20
3	42	343.78127573838213	257.6010098299956	20/04/28 05:09:21
3	42	343.65703250325174	257.5318404789207	20/04/28 05:09:21
3	42	343.66763846586156	257.53522433943016	20/04/28 05:09:21
3	42	343.94548291592275	257.52185966509023	20/04/28 05:09:21
3	42	343.94548291592275	257.52185966509023	20/04/28 05:09:21
3	42	344.075736966395	257.61536340400835	20/04/28 05:09:21
3	42	344.00735706079246	257.7389294073455	20/04/28 05:09:21
3	42	344.23314789458266	257.5680741654301	20/04/28 05:09:21
3	42	344.2176982206245	257.5671884775862	20/04/28 05:09:21
3	42	344.22166528836556	257.4717170868273	20/04/28 05:09:21
3	42	344.3119011931004	257.46507725147046	20/04/28 05:09:22
3	42	344.1257310130117	257.4047801119494	20/04/28 05:09:22
3	42	344.12880304930104	257.4027675565803	20/04/28 05:09:22
3	42	344.1267246809062	257.4432446497832	20/04/28 05:09:22
3	42	344.1421988223698	257.47882054652143	20/04/28 05:09:22
3	42	343.9609314001778	257.4389668296206	20/04/28 05:09:22
3	42	344.06879292812414	257.41854656856674	20/04/28 05:09:22
3	42	344.022380419985	257.5780753086671	20/04/28 05:09:22
3	42	344.0246227982464	257.5671723612566	20/04/28 05:09:22
3	42	343.8067385398128	257.42212490086143	20/04/28 05:09:22
3	42	343.6999685977325	257.2510424150064	20/04/28 05:09:23
3	42	343.641044761384	257.2706499539706	20/04/28 05:09:23
3	42	343.641044761384	257.2706499539706	20/04/28 05:09:23
3	42	343.641044761384	257.2706499539706	20/04/28 05:09:23
3	42	343.90971970318714	257.3859041582836	20/04/28 05:09:23
3	42	344.13782643006704	257.4837557075519	20/04/28 05:09:23
3	42	344.32026567432683	257.5620171553502	20/04/28 05:09:23
3	42	344.5307472586579	257.65230800034607	20/04/28 05:09:23
3	42	344.7172083993353	257.7322947317466	20/04/28 05:09:23
3	42	344.91040684936524	257.8151715846577	20/04/28 05:09:24
3	42	345.11947189305465	257.9048547724473	20/04/28 05:09:24
3	42	345.30481850127336	257.9843633998951	20/04/28 05:09:24
3	42	345.5083524612257	258.07167390398433	20/04/28 05:09:24
3	42	345.7641917692203	258.1814219723268	20/04/28 05:09:24
3	42	345.99728389421296	258.2814121210819	20/04/28 05:09:24
3	42	346.214178540782	258.37445399444124	20/04/28 05:09:24
3	42	346.4568468922481	258.4785520825342	20/04/28 05:09:24
3	42	346.69142931334017	258.5791815275704	20/04/28 05:09:24
3	42	346.924913735729	258.67933996118285	20/04/28 05:09:24
3	42	347.07195737777613	258.7424176633671	20/04/28 05:09:25
3	42	347.33718372575305	258.8561925152152	20/04/28 05:09:25
3	42	347.5087988241208	258.9298107003639	20/04/28 05:09:25
3	42	347.6724422782054	259.0000092680642	20/04/28 05:09:25
3	42	347.8662798968519	259.0831603068366	20/04/28 05:09:25
3	42	348.0751230578232	259.17274831300654	20/04/28 05:09:25
3	42	348.31098053408584	259.2739247218503	20/04/28 05:09:25
3	42	348.49089197712254	259.3511018120353	20/04/28 05:09:25
3	42	348.714600382066	259.4470666014454	20/04/28 05:09:25
3	42	348.95644384846224	259.5508108363961	20/04/28 05:09:26
3	42	349.1323429135539	259.62626672614334	20/04/28 05:09:26
3	42	349.4020606127988	259.74196824488934	20/04/28 05:09:26
3	42	349.6650156451885	259.8547687644495	20/04/28 05:09:26
3	42	349.91917043539854	259.963794220718	20/04/28 05:09:26
3	42	350.14123224515015	260.0590526658096	20/04/28 05:09:26
3	42	350.30405727261166	260.12890015086487	20/04/28 05:09:26
3	42	350.46642121785874	260.19854984425643	20/04/28 05:09:26
3	42	350.64869699615167	260.2767411696242	20/04/28 05:09:26
3	42	350.9201909809924	260.39320466632614	20/04/28 05:09:26
3	42	351.1635843551308	260.497613769323	20/04/28 05:09:27
3	34	351.41190883878375	260.588410000001	20/04/28 05:09:27
3	34	351.60283908880433	260.588410000001	20/04/28 05:09:27
3	34	351.77957720603223	260.588410000001	20/04/28 05:09:27
3	34	352.01347390552075	260.588410000001	20/04/28 05:09:27
3	34	352.29395881880845	260.588410000001	20/04/28 05:09:27
3	34	352.55865730233154	260.588410000001	20/04/28 05:09:27
3	34	352.79357734558516	260.588410000001	20/04/28 05:09:27
3	34	352.96939124089005	260.588410000001	20/04/28 05:09:27
3	34	353.1243136581365	260.588410000001	20/04/28 05:09:27
3	34	353.2895628147991	260.588410000001	20/04/28 05:09:28
3	34	353.4536501172529	260.588410000001	20/04/28 05:09:28
3	34	353.62920116979046	260.588410000001	20/04/28 05:09:28
3	34	353.8374681547019	260.588410000001	20/04/28 05:09:28
3	34	354.06554696692297	260.588410000001	20/04/28 05:09:28
3	34	354.2391375468531	260.588410000001	20/04/28 05:09:28
3	34	354.4463057152506	260.588410000001	20/04/28 05:09:28
3	34	354.6957487032716	260.588410000001	20/04/28 05:09:28
3	34	354.92348415606136	260.588410000001	20/04/28 05:09:28
3	34	355.09373287229846	260.588410000001	20/04/28 05:09:29
3	34	355.3506162045136	260.588410000001	20/04/28 05:09:29
3	34	355.53562562340886	260.588410000001	20/04/28 05:09:29
3	34	355.7704769691794	260.588410000001	20/04/28 05:09:29
3	34	356.05385613555507	260.588410000001	20/04/28 05:09:29
3	34	356.2379648741361	260.588410000001	20/04/28 05:09:29
3	34	356.3968189377472	260.588410000001	20/04/28 05:09:29
3	34	356.55814071409134	260.588410000001	20/04/28 05:09:29
3	34	356.73597653209106	260.588410000001	20/04/28 05:09:29
3	34	356.97791433349295	260.588410000001	20/04/28 05:09:29
3	34	357.21115683875985	260.588410000001	20/04/28 05:09:30
3	34	357.43449039521954	260.588410000001	20/04/28 05:09:30
3	34	357.71441925329697	260.588410000001	20/04/28 05:09:30
3	34	357.90973311406634	260.588410000001	20/04/28 05:09:30
3	34	358.14931575162996	260.588410000001	20/04/28 05:09:30
3	34	358.38890026461064	260.588410000001	20/04/28 05:09:30
3	34	358.68580173518967	260.588410000001	20/04/28 05:09:30
3	34	358.8493577138737	260.588410000001	20/04/28 05:09:30
3	34	358.8493577138737	260.588410000001	20/04/28 05:09:30
3	34	359.1281994306169	260.588410000001	20/04/28 05:09:30
3	34	359.27856438444877	260.588410000001	20/04/28 05:09:31
3	34	359.4795423010888	260.588410000001	20/04/28 05:09:31
3	34	359.6553292918315	260.588410000001	20/04/28 05:09:31
3	34	359.83219537951135	260.588410000001	20/04/28 05:09:31
3	34	360.0829581306255	260.588410000001	20/04/28 05:09:31
3	34	360.3336889526391	260.588410000001	20/04/28 05:09:31
3	34	360.58476876506666	260.588410000001	20/04/28 05:09:31
3	34	360.85750201074865	260.588410000001	20/04/28 05:09:31
3	34	361.03066740465226	260.588410000001	20/04/28 05:09:31
3	34	361.2191206320105	260.588410000001	20/04/28 05:09:32
3	34	361.44142365321386	260.58841000000103	20/04/28 05:09:32
3	34	361.6675190097285	260.58841000000103	20/04/28 05:09:32
3	34	361.95074617268716	260.5884100000011	20/04/28 05:09:32
3	34	362.1596917801355	260.5884100000011	20/04/28 05:09:32
3	34	362.43090474918426	260.58841000000115	20/04/28 05:09:32
3	54	362.2548840400751	260.4469561606692	20/04/28 05:09:32
3	54	362.0105555818861	260.2756281610358	20/04/28 05:09:32
3	54	361.77955982760403	260.1136493199369	20/04/28 05:09:32
3	54	361.64106700717105	260.01653538542337	20/04/28 05:09:32
3	54	361.45348796898884	259.88500121366496	20/04/28 05:09:33
3	54	361.21670269415927	259.71896264501083	20/04/28 05:09:33
3	54	361.0800877568323	259.62316551967496	20/04/28 05:09:33
3	54	360.89897130882684	259.49616304535215	20/04/28 05:09:33
3	54	360.65653772328386	259.32616376830157	20/04/28 05:09:33
3	54	360.4732933009959	259.1976691158683	20/04/28 05:09:33
3	54	360.27243247125415	259.0568214863313	20/04/28 05:09:33
3	54	360.14083090110415	258.9645398342899	20/04/28 05:09:33
3	54	359.9041782874659	258.79859429031535	20/04/28 05:09:33
3	54	359.75363192885453	258.69302817385005	20/04/28 05:09:34
3	54	359.5927152696309	258.5801901952666	20/04/28 05:09:34
3	54	359.3524713040981	258.4117263235433	20/04/28 05:09:34
3	54	359.1966833077058	258.30248466587227	20/04/28 05:09:34
3	54	359.0609793827712	258.20732636063934	20/04/28 05:09:34
3	54	358.892417818948	258.08912762210946	20/04/28 05:09:34
3	34	358.6551007749927	257.9227161663129	20/04/28 05:09:34
3	34	358.85142019322154	258.09417644962724	20/04/28 05:09:34
3	34	358.5818438362537	258.07213392727516	20/04/28 05:09:34
3	34	358.60581458207224	258.0986270000544	20/04/28 05:09:34
3	34	358.59510921501885	258.12699088782915	20/04/28 05:09:35
3	34	358.61627854257677	258.36413059931255	20/04/28 05:09:35
3	34	358.8738052143929	258.3067292351374	20/04/28 05:09:35
3	34	358.83095935564853	258.18193602640275	20/04/28 05:09:35
3	34	358.9295906061678	258.1991878685474	20/04/28 05:09:35
3	34	358.96247713099416	258.28211016701715	20/04/28 05:09:35
3	34	358.87549234553956	258.1644916079321	20/04/28 05:09:35
3	34	358.88242960933826	258.16100698218736	20/04/28 05:09:35
3	34	359.03944567038883	258.14874425630893	20/04/28 05:09:35
3	34	359.0180418839971	258.1299176932852	20/04/28 05:09:36
3	34	358.9381398007836	258.0923379545241	20/04/28 05:09:36
3	34	358.88365315069564	258.13977979512083	20/04/28 05:09:36
3	34	358.74709430785106	258.2648058551143	20/04/28 05:09:36
3	34	358.85582329031234	258.04789020888944	20/04/28 05:09:36
3	34	358.8656424600611	258.0187317888704	20/04/28 05:09:36
3	34	358.91472159065074	258.2220310653422	20/04/28 05:09:36
3	34	358.9850341104597	258.33875994771864	20/04/28 05:09:36
3	34	359.06318230215356	258.3862915797405	20/04/28 05:09:36
3	34	359.0785582342934	258.3964450464009	20/04/28 05:09:36
3	34	359.23210066737977	258.32109910593135	20/04/28 05:09:37
3	34	359.3032601684356	258.51900029027325	20/04/28 05:09:37
3	34	359.20753729998137	258.358802467155	20/04/28 05:09:37
3	34	359.3066499317207	258.58655990121724	20/04/28 05:09:37
3	34	359.2917059143598	258.4713433597558	20/04/28 05:09:37
3	34	359.15631909133384	258.44835339629196	20/04/28 05:09:37
3	34	359.3136790909616	258.3167400732101	20/04/28 05:09:37
3	34	359.2150731348423	258.27513972325113	20/04/28 05:09:37
3	34	359.3538321791884	258.2741681643352	20/04/28 05:09:37
3	34	359.30461279772004	258.0932095703803	20/04/28 05:09:37
3	34	359.3989947216155	257.9282338125193	20/04/28 05:09:38
3	34	359.62664938058083	257.91811360892456	20/04/28 05:09:38
3	34	359.5551693525238	257.9877093021189	20/04/28 05:09:38
3	34	359.5581212645254	258.0177151526377	20/04/28 05:09:38
3	34	359.4966199774107	258.1720629200997	20/04/28 05:09:38
3	34	359.67376975736244	258.1857016123637	20/04/28 05:09:38
3	34	359.6415008400291	258.2193263768279	20/04/28 05:09:38
3	34	359.5774588069102	258.2812154136188	20/04/28 05:09:38
3	34	359.81768926710777	258.42094403102817	20/04/28 05:09:38
3	34	360.1117433843208	258.3624096712607	20/04/28 05:09:39
3	34	360.300607188643	258.5192986289701	20/04/28 05:09:39
3	34	360.32582464966345	258.49151747510706	20/04/28 05:09:39
3	34	360.35469504025076	258.6481215773315	20/04/28 05:09:39
3	34	360.2994397229549	258.6374764300713	20/04/28 05:09:39
3	34	360.0168553871864	258.6238418384451	20/04/28 05:09:39
3	34	359.7846900947921	258.7340022862714	20/04/28 05:09:39
3	34	359.7682982378739	258.6132258952809	20/04/28 05:09:39
3	34	359.50839985895146	258.51819070365895	20/04/28 05:09:39
3	34	359.5090774098581	258.519104259331	20/04/28 05:09:39
3	34	359.5057899236643	258.7366420177369	20/04/28 05:09:40
3	34	359.5890645090478	258.7642729463621	20/04/28 05:09:40
3	34	359.51847342201546	258.85717832573613	20/04/28 05:09:40
3	34	359.47273444671265	258.6406856601214	20/04/28 05:09:40
3	34	359.4553184096462	258.6532114133962	20/04/28 05:09:40
3	34	359.4770162942155	258.6407087691538	20/04/28 05:09:40
3	34	359.5991040182167	258.3884957773348	20/04/28 05:09:40
3	34	359.5769039221606	258.19425329661897	20/04/28 05:09:40
3	34	359.58777183654456	258.19656587617845	20/04/28 05:09:40
3	34	359.66558129234625	258.0923455863443	20/04/28 05:09:41
3	34	359.60396081456753	258.0921110955202	20/04/28 05:09:41
3	34	359.5982255003997	258.0779569340306	20/04/28 05:09:41
3	34	359.75157025215066	258.335081447611	20/04/28 05:09:41
3	34	359.7304739895324	258.30774631249255	20/04/28 05:09:41
3	34	359.59086275509145	258.2048389597477	20/04/28 05:09:41
3	34	359.4767890809898	258.08496388588566	20/04/28 05:09:41
3	34	359.28425272452193	258.2339868780581	20/04/28 05:09:41
3	34	359.34659818918396	258.1644309010932	20/04/28 05:09:41
3	34	359.4068218735297	258.17841074773406	20/04/28 05:09:41
3	34	359.251424772178	258.2507295192178	20/04/28 05:09:42
3	34	359.39558640702654	258.13713928247535	20/04/28 05:09:42
3	34	359.26501762868776	258.2361986118276	20/04/28 05:09:42
3	34	359.43632364264477	258.165980927221	20/04/28 05:09:42
3	34	359.42492345332164	258.0897873432115	20/04/28 05:09:42
3	34	359.2927583310051	258.2274936238754	20/04/28 05:09:42
3	34	359.13631358958247	258.30161182754046	20/04/28 05:09:42
3	34	359.1404279345823	258.2825058857682	20/04/28 05:09:42
3	34	359.12258751078184	258.27346063387745	20/04/28 05:09:42
3	34	359.12350395040977	258.25788137590575	20/04/28 05:09:42
3	34	358.90715506700985	258.0856887450361	20/04/28 05:09:43
3	34	358.87818415113526	258.0836143674357	20/04/28 05:09:43
3	34	358.80814807531493	258.0053596468855	20/04/28 05:09:43
3	34	358.6738694252854	258.07083790157435	20/04/28 05:09:43
3	34	358.64893286893704	257.9915389782365	20/04/28 05:09:43
3	34	358.86715221234874	258.03332175336124	20/04/28 05:09:43
3	34	358.9526515030988	257.946953660543	20/04/28 05:09:43
3	34	358.9628232425633	257.90596507989505	20/04/28 05:09:43
3	34	359.1203899682048	257.8612476644115	20/04/28 05:09:43
3	34	359.2089862443592	257.6701815772584	20/04/28 05:09:44
3	34	359.26266555894716	257.5371073689194	20/04/28 05:09:44
3	34	359.26534233010636	257.5348456001617	20/04/28 05:09:44
3	34	359.2824246991933	257.4574444760624	20/04/28 05:09:44
3	34	359.27539293380914	257.49758872344415	20/04/28 05:09:44
3	34	359.3248541767994	257.3351938052285	20/04/28 05:09:44
3	34	359.42412331933946	257.25518471264155	20/04/28 05:09:44
3	34	359.37484215462064	257.24698857699843	20/04/28 05:09:44
3	34	359.381630614346	257.1107585415434	20/04/28 05:09:44
3	34	359.2683198153648	257.1092623289262	20/04/28 05:09:44
3	34	359.24346362411814	257.40251773406663	20/04/28 05:09:45
3	34	359.2760324655953	257.274643989843	20/04/28 05:09:45
3	34	359.24447350190684	257.1477103279944	20/04/28 05:09:45
3	34	359.33010100640536	257.1566493823141	20/04/28 05:09:45
3	34	359.4370549934716	256.99560412872347	20/04/28 05:09:45
3	34	359.33765767465076	256.87618026732116	20/04/28 05:09:45
3	34	359.37191246268753	257.02126747622833	20/04/28 05:09:45
3	34	359.5343195779694	256.928176331019	20/04/28 05:09:45
3	34	359.5411352189948	257.0840689707844	20/04/28 05:09:45
3	34	359.5544122606356	257.09684022270784	20/04/28 05:09:46
3	34	359.5905317505331	257.31110749518143	20/04/28 05:09:46
3	34	359.41322242794854	257.2396644846538	20/04/28 05:09:46
3	34	359.32920079577025	257.3586712659498	20/04/28 05:09:46
3	34	359.4705947304151	257.51770759104926	20/04/28 05:09:46
3	34	359.4624479535165	257.33296142781035	20/04/28 05:09:46
3	34	359.5271740852154	257.38375625094596	20/04/28 05:09:46
3	34	359.56971484082794	257.5350962081901	20/04/28 05:09:46
3	34	359.6780990735522	257.67011012509096	20/04/28 05:09:46
3	34	359.5695318422739	257.4655009756783	20/04/28 05:09:46
3	34	359.4332683041424	257.56684852351435	20/04/28 05:09:47
3	34	359.4266227880752	257.56579646934983	20/04/28 05:09:47
3	34	359.23873548575494	257.4244784654515	20/04/28 05:09:47
3	34	359.40936694300495	257.4273539916481	20/04/28 05:09:47
3	34	359.41960773441116	257.34708762081794	20/04/28 05:09:47
3	34	359.5573003305297	257.1736991718085	20/04/28 05:09:47
3	34	359.35929389937735	257.1570441390748	20/04/28 05:09:47
3	34	359.5997346268323	257.32954565911956	20/04/28 05:09:47
3	34	359.61099588177416	257.2337144360929	20/04/28 05:09:47
3	34	359.4404023211916	257.0308644809406	20/04/28 05:09:48
3	34	359.5454141438963	256.79691973305137	20/04/28 05:09:48
3	34	359.5398357357323	256.80198047012937	20/04/28 05:09:48
3	34	359.2735598593257	256.9014425884264	20/04/28 05:09:48
3	34	359.01861897806026	256.9591684571008	20/04/28 05:09:48
3	34	359.0477216277474	257.00538591318656	20/04/28 05:09:48
3	34	358.86422913610573	257.1807375567584	20/04/28 05:09:48
3	34	358.84709485121385	257.1851129029365	20/04/28 05:09:48
3	34	358.87486895846985	257.3262660861457	20/04/28 05:09:48
3	34	358.97319774476017	257.35335119648676	20/04/28 05:09:48
3	34	358.7800527716823	257.31216811948843	20/04/28 05:09:49
3	34	358.78669652005453	257.2920344483666	20/04/28 05:09:49
3	34	358.86943467258226	257.24374007685327	20/04/28 05:09:49
3	34	358.86757469372577	257.2460981855451	20/04/28 05:09:49
3	34	358.8303875027796	257.3084523672725	20/04/28 05:09:49
3	34	358.6196612161504	257.25309608528937	20/04/28 05:09:49
3	34	358.6452532448461	257.5195919674997	20/04/28 05:09:49
3	34	358.6187271581666	257.6329000578344	20/04/28 05:09:49
3	34	358.5866601328925	257.59951357641063	20/04/28 05:09:49
3	34	358.79985846971726	257.66231124413144	20/04/28 05:09:49
3	34	359.0094302938923	257.83996708316675	20/04/28 05:09:50
3	34	359.242123063803	257.9880473510345	20/04/28 05:09:50
3	34	359.29214063049653	258.18529918567395	20/04/28 05:09:50
3	34	359.2396902990451	258.0981947833239	20/04/28 05:09:50
3	34	359.4222842564636	258.01844956024297	20/04/28 05:09:50
3	34	359.37443270478576	258.0608762054688	20/04/28 05:09:50
3	34	359.47544960051795	258.16537007525966	20/04/28 05:09:50
3	34	359.55690260040586	258.06661764115273	20/04/28 05:09:50
3	34	359.7576651996097	258.2283375904163	20/04/28 05:09:50
3	34	359.7686046340301	258.22663964263273	20/04/28 05:09:51
3	34	359.78068182088157	257.94632022475713	20/04/28 05:09:51
3	34	359.7808020039082	257.95005674209466	20/04/28 05:09:51
3	34	360.01427322395244	257.99154937105806	20/04/28 05:09:51
3	34	360.0016589637994	257.98436265589527	20/04/28 05:09:51
3	34	359.99632080091214	258.00042460040765	20/04/28 05:09:51
3	34	359.94721874546497	258.0163835426879	20/04/28 05:09:51
3	34	359.6761347014628	257.9372245651268	20/04/28 05:09:51
3	34	359.5912850818502	257.96601732620655	20/04/28 05:09:51
3	34	359.5546269520576	258.1961620710604	20/04/28 05:09:51
3	34	359.46389051720763	258.16595326676224	20/04/28 05:09:52
3	34	359.44892376757343	258.0342799156235	20/04/28 05:09:52
3	34	359.4680206213982	258.0761479253055	20/04/28 05:09:52
3	34	359.6163507390683	257.93062979939	20/04/28 05:09:52
3	34	359.6723857115292	257.8892585489855	20/04/28 05:09:52
3	34	359.66447720275806	257.9792324709627	20/04/28 05:09:52
3	34	359.61680627856083	257.7017508104637	20/04/28 05:09:52
3	34	359.84680569515984	257.6229602717509	20/04/28 05:09:52
3	34	359.5890211719947	257.744430129543	20/04/28 05:09:52
3	34	359.8248714411895	257.6276259454845	20/04/28 05:09:52
3	34	359.7993428309301	257.91632573001664	20/04/28 05:09:53
3	34	359.8067854273271	257.9022187151419	20/04/28 05:09:53
3	34	359.81950170811047	257.88266505425514	20/04/28 05:09:53
3	34	359.6254056564186	257.74888644307805	20/04/28 05:09:53
3	34	359.72454149306304	257.5463645200847	20/04/28 05:09:53
3	34	359.77439388244363	257.5601430681936	20/04/28 05:09:53
3	34	359.8947576602508	257.62205223305153	20/04/28 05:09:53
3	34	359.97908771761985	257.404861217991	20/04/28 05:09:53
3	34	359.98148419909467	257.1985443226678	20/04/28 05:09:53
3	34	359.93602668568155	256.9501364771321	20/04/28 05:09:54
3	34	359.7234155333688	256.7887503021762	20/04/28 05:09:54
3	34	359.77902986036605	256.9685379354119	20/04/28 05:09:54
3	34	359.9503434246784	256.85824166429376	20/04/28 05:09:54
3	34	360.2453435013319	256.828584866669	20/04/28 05:09:54
3	34	360.4547255288497	256.7989101023368	20/04/28 05:09:54
3	34	360.1915572113113	256.7326422603077	20/04/28 05:09:54
3	34	360.0255540322962	256.5312871007667	20/04/28 05:09:54
3	34	359.94089218144285	256.45636369594916	20/04/28 05:09:54
3	34	359.7625855981006	256.5066323026726	20/04/28 05:09:54
3	34	359.73043756498225	256.52922687407164	20/04/28 05:09:55
3	34	359.7867696265636	256.4514613691688	20/04/28 05:09:55
3	34	359.98789492760415	256.4271204134244	20/04/28 05:09:55
3	34	359.91246700838013	256.4266722934313	20/04/28 05:09:55
3	34	359.80451398746186	256.2559942157493	20/04/28 05:09:55
3	34	359.93863815199984	256.30962634076775	20/04/28 05:09:55
3	34	359.9212505888741	256.21553926547614	20/04/28 05:09:55
3	34	359.6828596440106	256.14267049335706	20/04/28 05:09:55
3	34	359.7375735589602	255.98280926738505	20/04/28 05:09:55
3	34	359.74653442211894	255.96404307000668	20/04/28 05:09:56
3	34	359.7567532399188	255.96630283145026	20/04/28 05:09:56
3	34	359.7856540785971	255.90627537111322	20/04/28 05:09:56
3	34	359.7821121931577	255.89950812601265	20/04/28 05:09:56
3	34	359.95119173009573	255.66280291688278	20/04/28 05:09:56
3	34	359.7566606586459	255.5960677604178	20/04/28 05:09:56
3	34	359.74624881461807	255.56470407754153	20/04/28 05:09:56
3	34	359.6794313258185	255.48149041859938	20/04/28 05:09:56
3	34	359.61205625912953	255.33052112539022	20/04/28 05:09:56
3	34	359.582074932221	255.44171944711815	20/04/28 05:09:56
3	34	359.5699763341591	255.3922491352996	20/04/28 05:09:57
3	34	359.6848454898611	255.52766731539	20/04/28 05:09:57
3	34	359.60376664501257	255.5167442580068	20/04/28 05:09:57
3	34	359.60932131612327	255.22538381243854	20/04/28 05:09:57
3	34	359.7467817466823	255.13636473632693	20/04/28 05:09:57
3	34	359.6447730648293	255.22753582312995	20/04/28 05:09:57
3	34	359.5966777129982	255.26648510899278	20/04/28 05:09:57
3	34	359.56962684551536	255.30925208213327	20/04/28 05:09:57
3	34	359.6717152754158	255.31372732886697	20/04/28 05:09:57
3	34	359.6297364167775	255.27935819082262	20/04/28 05:09:58
3	34	359.70261525992464	255.47323476408724	20/04/28 05:09:58
3	34	359.5866932342416	255.5397376146942	20/04/28 05:09:58
3	34	359.7920487754231	255.55680485248195	20/04/28 05:09:58
3	34	359.9158565275718	255.40394571744076	20/04/28 05:09:58
3	34	359.8478035945159	255.40908906202444	20/04/28 05:09:58
3	34	359.83503802748595	255.34364653740818	20/04/28 05:09:58
3	34	359.85153317795897	255.40152936774564	20/04/28 05:09:58
3	34	359.8265767216656	255.3916127384752	20/04/28 05:09:58
3	34	359.77680615140787	255.37478342443495	20/04/28 05:09:58
3	34	359.5982694191824	255.3395520680651	20/04/28 05:09:59
3	34	359.73805460953326	255.33513425607796	20/04/28 05:09:59
3	34	359.73805460953326	255.33513425607796	20/04/28 05:09:59
3	34	359.73805460953326	255.33513425607796	20/04/28 05:09:59
3	34	359.67412922597885	255.4261449902404	20/04/28 05:09:59
3	34	359.5173685418168	255.1762687744374	20/04/28 05:09:59
3	34	359.5174678122552	255.1763269588967	20/04/28 05:09:59
3	34	359.476663593312	255.44886574788868	20/04/28 05:09:59
3	34	359.41676133912983	255.38393451944694	20/04/28 05:09:59
3	34	359.1609187739617	255.4940235136811	20/04/28 05:10:00
3	34	359.2263436050515	255.4055155032256	20/04/28 05:10:00
3	34	359.21296537447313	255.6671524945446	20/04/28 05:10:00
3	34	359.03894327129404	255.54914164752404	20/04/28 05:10:00
3	34	359.04744412680543	255.66084661203809	20/04/28 05:10:00
3	34	358.92322219009804	255.61314848856097	20/04/28 05:10:00
3	34	358.91838555717567	255.36837645914878	20/04/28 05:10:00
3	34	358.90839749685557	255.34526449167006	20/04/28 05:10:00
3	34	358.9015890956712	255.60701687910583	20/04/28 05:10:00
3	34	358.90892519872284	255.67901944635923	20/04/28 05:10:00
3	34	358.89728107076826	255.67865578937185	20/04/28 05:10:01
3	34	358.8949923346884	255.68988100712133	20/04/28 05:10:01
3	34	358.8917163339788	255.69026307857337	20/04/28 05:10:01
3	34	358.8999304147632	255.68126806212172	20/04/28 05:10:01
3	34	358.8746756588928	255.64239027503478	20/04/28 05:10:01
3	34	358.89695734183766	255.63263393082815	20/04/28 05:10:01
3	34	358.89695734183766	255.63263393082815	20/04/28 05:10:01
3	34	358.89695734183766	255.63263393082815	20/04/28 05:10:01
3	34	358.91372744445226	255.62380937257092	20/04/28 05:10:01
3	34	358.90035000319125	255.6331380235339	20/04/28 05:10:01
3	34	358.8470224693568	255.4642852356967	20/04/28 05:10:02
3	34	358.7799474084309	255.4645195887885	20/04/28 05:10:02
3	34	358.9155581998002	255.66970032896205	20/04/28 05:10:02
3	34	358.86582999899923	255.72245613597246	20/04/28 05:10:02
3	34	358.82420277611243	255.73013441690426	20/04/28 05:10:02
3	34	358.5913034788901	255.55652770563503	20/04/28 05:10:02
3	34	358.7173536460474	255.32705804659034	20/04/28 05:10:02
3	34	358.5059957578622	255.38618876225323	20/04/28 05:10:02
3	34	358.5462728787865	255.26267252191852	20/04/28 05:10:02
3	34	358.5282199795537	255.17052150870856	20/04/28 05:10:03
3	34	358.63027648771936	255.16406633731538	20/04/28 05:10:03
3	34	358.63830388980375	255.27028041729645	20/04/28 05:10:03
3	34	358.62075010550154	255.34937779420588	20/04/28 05:10:03
3	34	358.68605777948034	255.46716769544088	20/04/28 05:10:03
3	34	358.65333271453125	255.4745807179386	20/04/28 05:10:03
3	34	358.78845398593364	255.65887534036628	20/04/28 05:10:03
3	34	358.58271780816557	255.56564096075252	20/04/28 05:10:03
3	34	358.5826263971273	255.56591596194494	20/04/28 05:10:03
3	34	358.5450352886327	255.6203804759775	20/04/28 05:10:03
3	34	358.6039932150068	255.45805769933364	20/04/28 05:10:04
3	34	358.79665286176817	255.50772346012403	20/04/28 05:10:04
3	34	358.8045554318148	255.52686015154472	20/04/28 05:10:04
3	34	358.7040918719407	255.26645524447437	20/04/28 05:10:04
3	34	358.6364424340633	255.29575955754342	20/04/28 05:10:04
3	34	358.53247230167887	255.36806395460798	20/04/28 05:10:04
3	34	358.7814692230163	255.2458364786342	20/04/28 05:10:04
3	34	358.7814692230163	255.2458364786342	20/04/28 05:10:04
3	34	358.7882762960718	255.2137834360006	20/04/28 05:10:04
3	34	359.0219471292073	255.1774840985523	20/04/28 05:10:05
3	34	358.9981495434068	255.22516954866163	20/04/28 05:10:05
3	34	358.8966680137704	255.3254001275889	20/04/28 05:10:05
3	34	358.7862172700182	255.3222962561476	20/04/28 05:10:05
3	34	358.89220398553357	255.39060092383735	20/04/28 05:10:05
3	34	358.72838702378743	255.33477092468638	20/04/28 05:10:05
3	34	358.6530425089106	255.17395139009662	20/04/28 05:10:05
3	34	358.8654575215872	255.2271985757991	20/04/28 05:10:05
3	34	358.9031932145551	255.16269680594	20/04/28 05:10:05
3	34	358.9270576892991	255.13430938050476	20/04/28 05:10:05
3	34	359.06120747077733	255.14347995755494	20/04/28 05:10:06
3	34	359.22413613179634	255.3569363066791	20/04/28 05:10:06
3	34	359.4493441434867	255.22724363119593	20/04/28 05:10:06
3	34	359.41506742673846	255.28031306499832	20/04/28 05:10:06
3	34	359.5330762001745	255.1324942145242	20/04/28 05:10:06
3	34	359.5614430280795	255.15456480200362	20/04/28 05:10:06
3	34	359.5432952434987	255.28904311118234	20/04/28 05:10:06
3	34	359.2435282619647	255.29189169676013	20/04/28 05:10:06
3	34	359.22705610186597	255.26532285521938	20/04/28 05:10:06
3	34	359.21087683422684	255.43830778859802	20/04/28 05:10:07
3	34	359.183761792017	255.42780868293178	20/04/28 05:10:07
3	34	359.11950388259146	255.46565757349063	20/04/28 05:10:07
3	34	359.11950388259146	255.46565757349063	20/04/28 05:10:07
3	34	359.11950388259146	255.46565757349063	20/04/28 05:10:07
3	34	359.22814681605126	255.6199495770422	20/04/28 05:10:07
3	34	359.34447807244146	255.7851603464178	20/04/28 05:10:07
3	34	359.49454301993376	255.99827886847993	20/04/28 05:10:07
3	34	359.72358242925435	256.3235549654238	20/04/28 05:10:07
3	34	359.865850481208	256.5256005295324	20/04/28 05:10:07
3	34	360.0164397230481	256.73946364144314	20/04/28 05:10:08
3	34	360.1505461910718	256.9299183261765	20/04/28 05:10:08
3	34	360.2448551859727	257.0638536251675	20/04/28 05:10:08
3	34	360.36241971276434	257.2308158546252	20/04/28 05:10:08
3	34	360.5209815340637	257.4560014264426	20/04/28 05:10:08
3	34	360.63263063779726	257.61456271856895	20/04/28 05:10:08
3	34	360.7891468213221	257.83684312627923	20/04/28 05:10:08
3	34	360.932450239613	258.0403590920191	20/04/28 05:10:08
3	34	361.0281563658781	258.17627856237345	20/04/28 05:10:08
3	34	361.16250182336483	258.3670726540237	20/04/28 05:10:09
3	34	361.28968218237355	258.54769105025946	20/04/28 05:10:09
3	34	361.3779569686028	258.6730567155324	20/04/28 05:10:09
3	34	361.47876996573586	258.8162288374216	20/04/28 05:10:09
3	34	361.64173157839815	259.04766288397155	20/04/28 05:10:09
3	34	361.77160061979674	259.23209968035206	20/04/28 05:10:09
3	34	361.89271800931476	259.4041075974669	20/04/28 05:10:09
3	34	362.05069308766025	259.6284598914719	20/04/28 05:10:09
3	34	362.1501228900928	259.76966763450224	20/04/28 05:10:09
3	34	362.26267220288725	259.9295073812431	20/04/28 05:10:09
3	34	362.38976863653323	260.11000658875713	20/04/28 05:10:10
3	34	362.5053777185141	260.27419174392134	20/04/28 05:10:10
3	34	362.67511438387135	260.51524755252404	20/04/28 05:10:10
3	15	362.88706151236005	260.5972774387144	20/04/28 05:10:10
3	15	363.14209447974054	260.6113738062847	20/04/28 05:10:10
3	15	363.39126538597424	260.6251461617498	20/04/28 05:10:10
3	15	363.6148624302886	260.6375049801279	20/04/28 05:10:10
3	15	363.8709810055428	260.6516613522058	20/04/28 05:10:10
3	15	364.1387498351381	260.66646166561077	20/04/28 05:10:10
3	15	364.3190881720452	260.67642945726595	20/04/28 05:10:10
3	15	364.5098047567322	260.68697088297694	20/04/28 05:10:11
3	15	364.67735687779424	260.69623194561495	20/04/28 05:10:11
3	15	364.8369455424142	260.70505284629945	20/04/28 05:10:11
3	15	365.026677311965	260.71553983859235	20/04/28 05:10:11
3	15	365.20065089537843	260.7251558329656	20/04/28 05:10:11
3	15	365.36244083094675	260.73409840389814	20/04/28 05:10:11
3	15	365.64277329324875	260.7495931435433	20/04/28 05:10:11
3	15	365.7996942144329	260.75826659077325	20/04/28 05:10:11
3	15	366.05098673564805	260.77215621368396	20/04/28 05:10:11
3	15	366.2236169226982	260.7816979548768	20/04/28 05:10:12
3	15	366.5189957619375	260.79802434880605	20/04/28 05:10:12
3	15	366.6880181902495	260.80736667933525	20/04/28 05:10:12
3	15	366.91520537139394	260.8199239343661	20/04/28 05:10:12
3	15	367.1304145016222	260.8318191298592	20/04/28 05:10:12
3	15	367.3628850769768	260.8446684124956	20/04/28 05:10:12
3	15	367.636357877576	260.85978399993246	20/04/28 05:10:12
3	15	367.82257332258905	260.8700766353793	20/04/28 05:10:12
3	15	368.0818881457526	260.88440967279513	20/04/28 05:10:12
3	15	368.3179454476406	260.89745720358786	20/04/28 05:10:12
3	15	368.4815129480214	260.90649802537496	20/04/28 05:10:13
3	15	368.7596861286021	260.9218734156311	20/04/28 05:10:13
3	15	368.99679188588397	260.9349788974126	20/04/28 05:10:13
3	15	369.16188868831205	260.94410424789413	20/04/28 05:10:13
3	15	369.39225917311717	260.956837452799	20/04/28 05:10:13
3	15	369.6743273844052	260.9724281320239	20/04/28 05:10:13
3	15	369.86196228151834	260.98279922445903	20/04/28 05:10:13
3	15	370.10128353138094	260.99602716255697	20/04/28 05:10:13
3	15	370.3744541673027	261.0111260485281	20/04/28 05:10:13
3	15	370.55343716102806	261.0210189266697	20/04/28 05:10:14
3	15	370.7074009526115	261.02952892528265	20/04/28 05:10:14
3	15	370.869329552687	261.03847916058066	20/04/28 05:10:14
3	15	371.13594774347695	261.05321587504113	20/04/28 05:10:14
3	15	371.4145599770804	261.0686155329551	20/04/28 05:10:14
3	15	371.6509301730702	261.0816803582581	20/04/28 05:10:14
3	15	371.8067701333689	261.0902940578322	20/04/28 05:10:14
3	15	372.0218990027371	261.1021848170887	20/04/28 05:10:14
3	15	372.32102576871404	261.1187183691492	20/04/28 05:10:14
3	15	372.5312922762185	261.130340372406	20/04/28 05:10:14
3	15	372.8290742889183	261.14679959628575	20/04/28 05:10:15
3	15	373.0712940685234	261.1601877440267	20/04/28 05:10:15
3	15	373.3237373898078	261.1741409747954	20/04/28 05:10:15
3	15	373.53701794152045	261.18592957249484	20/04/28 05:10:15
3	15	373.7993187669536	261.2004276543988	20/04/28 05:10:15
3	15	374.06391484325616	261.2150526010774	20/04/28 05:10:15
3	15	374.2795582424187	261.2269717997987	20/04/28 05:10:15
3	15	374.4787283300245	261.23798047366836	20/04/28 05:10:15
3	15	374.71271615471153	261.25091361881283	20/04/28 05:10:15
3	15	374.9338947866881	261.2631387649461	20/04/28 05:10:16
3	15	375.2006472560999	261.2778829013522	20/04/28 05:10:16
3	15	375.4364579227276	261.29091679994156	20/04/28 05:10:16
3	15	375.4364579227276	261.29091679994156	20/04/28 05:10:16
3	15	375.6605052625012	261.3033005073776	20/04/28 05:10:16
3	15	375.8396290594452	261.31320116809707	20/04/28 05:10:16
3	15	376.0665508609878	261.3257437548736	20/04/28 05:10:16
3	15	376.31923488105525	261.3397102897204	20/04/28 05:10:16
3	15	376.5165889512613	261.35061858735617	20/04/28 05:10:16
3	15	376.69655335087305	261.3605657104773	20/04/28 05:10:16
3	15	376.90330056795835	261.37199319295576	20/04/28 05:10:17
3	15	377.13945777608654	261.38504624583885	20/04/28 05:10:17
3	15	377.4389317755849	261.40159899044295	20/04/28 05:10:17
3	15	377.6488761095924	261.4132031862921	20/04/28 05:10:17
3	15	377.83739315597984	261.4236230375232	20/04/28 05:10:17
3	15	378.0611790490205	261.4359922940854	20/04/28 05:10:17
3	15	378.22010208997284	261.4447764039346	20/04/28 05:10:17
3	15	378.43705593866366	261.4567680347749	20/04/28 05:10:17
3	15	378.6073128624087	261.50868361698053	20/04/28 05:10:17
3	15	378.71845635871216	261.6266953734262	20/04/28 05:10:18
3	15	378.914186295603	261.8345207020303	20/04/28 05:10:18
3	15	379.0959579043268	262.0275251290179	20/04/28 05:10:18
3	15	379.22265686095295	262.16205361614107	20/04/28 05:10:18
3	15	379.4081860074923	262.3590477829899	20/04/28 05:10:18
3	15	379.5929722778354	262.55525316662005	20/04/28 05:10:18
3	15	379.69604793478516	262.6646985208513	20/04/28 05:10:18
3	15	379.8943515732222	262.875256596311	20/04/28 05:10:18
3	15	380.0504381394425	263.04098873944	20/04/28 05:10:18
3	15	380.16357733567787	263.16111952274855	20/04/28 05:10:18
3	15	380.30138127947276	263.30743924448893	20/04/28 05:10:19
3	15	380.42560655891094	263.439341190253	20/04/28 05:10:19
3	15	380.5288935384837	263.5490109260697	20/04/28 05:10:19
3	15	380.66069206372487	263.6889541164313	20/04/28 05:10:19
3	15	380.81184534365843	263.8494481142877	20/04/28 05:10:19
3	15	380.99636055668697	264.04536569025623	20/04/28 05:10:19
3	15	381.1191321212848	264.17572408693843	20/04/28 05:10:19
3	15	381.25453218936383	264.31949138226656	20/04/28 05:10:19
3	15	381.4052068346345	264.4794771675946	20/04/28 05:10:19
3	15	381.5958538652196	264.68190548493914	20/04/28 05:10:19
3	15	381.80025756567335	264.89894058385903	20/04/28 05:10:20
1	33	381.73143111477583	264.82172697879474	20/04/28 05:10:20
1	33	381.5956182861744	264.671908533467	20/04/28 05:10:20
1	33	381.411194623023	264.4684662903482	20/04/28 05:10:20
1	33	381.2469739916682	264.2873105045976	20/04/28 05:10:20
1	33	381.090379583894	264.1145673921734	20/04/28 05:10:20
1	33	381.090379583894	264.1145673921734	20/04/28 05:10:20
1	33	380.92330404817227	263.9302622917504	20/04/28 05:10:20
1	33	380.81275790626347	263.80831614506974	20/04/28 05:10:20
1	33	380.63581133590776	263.61312206546955	20/04/28 05:10:21
1	33	380.4885618316561	263.45068754415496	20/04/28 05:10:21
1	33	380.3594130236966	263.3082203426125	20/04/28 05:10:21
1	33	380.21867601948975	263.152969919015	20/04/28 05:10:21
1	33	380.03448921238294	262.94978895757873	20/04/28 05:10:21
1	33	379.8673451690002	262.76540828468313	20/04/28 05:10:21
1	33	379.6700133177033	262.54772670423614	20/04/28 05:10:21
1	33	379.48034162296966	262.3384952294168	20/04/28 05:10:21
1	33	379.2985744104865	262.13798338185273	20/04/28 05:10:21
1	33	379.16568848801427	261.9913936780984	20/04/28 05:10:21
1	33	379.050852472557	261.8647152672251	20/04/28 05:10:22
1	33	378.86594436275675	261.6607386191866	20/04/28 05:10:22
1	33	378.6938110288903	261.47085413821003	20/04/28 05:10:22
1	69	378.53592576680813	261.3277980137005	20/04/28 05:10:22
1	69	378.38595482495566	261.3223795663713	20/04/28 05:10:22
1	69	378.1448035595632	261.31366677565495	20/04/28 05:10:22
1	69	377.85327008159106	261.3031336765387	20/04/28 05:10:22
1	69	377.6130461347331	261.29445438982367	20/04/28 05:10:22
1	69	377.3530963316122	261.2850624082902	20/04/28 05:10:22
1	69	377.1393963592721	261.2773414322793	20/04/28 05:10:23
1	69	376.8414384162668	261.2665762173613	20/04/28 05:10:23
1	69	376.6541801881179	261.2598105810744	20/04/28 05:10:23
1	69	376.43544265333566	261.25190759802655	20/04/28 05:10:23
1	69	376.1514142091109	261.2416456556395	20/04/28 05:10:23
1	69	375.85916387042295	261.23108665635897	20/04/28 05:10:23
1	69	375.56083119741675	261.2203079024531	20/04/28 05:10:23
1	69	375.2727202869539	261.2098984606371	20/04/28 05:10:23
1	69	375.0775244369223	261.2028460382197	20/04/28 05:10:23
1	69	374.86626828665334	261.19521335745463	20/04/28 05:10:23
1	69	374.59417670885983	261.1853826938289	20/04/28 05:10:24
1	69	374.43987614408456	261.1798078173043	20/04/28 05:10:24
1	69	374.22372661837085	261.17199833897575	20/04/28 05:10:24
1	69	373.98174631087153	261.1632555949835	20/04/28 05:10:24
1	69	373.71001262570155	261.1534378620116	20/04/28 05:10:24
1	69	373.55458764040867	261.1478223601947	20/04/28 05:10:24
1	69	373.35926182651343	261.1407652421854	20/04/28 05:10:24
1	69	373.08430554465895	261.13083107685543	20/04/28 05:10:24
1	69	372.86669479029695	261.1229688043631	20/04/28 05:10:24
1	69	372.6012786482672	261.11337932410686	20/04/28 05:10:24
1	69	372.6012786482672	261.11337932410686	20/04/28 05:10:25
1	69	372.4331984675825	261.10730659031674	20/04/28 05:10:25
1	69	372.2069719872015	261.0991330318042	20/04/28 05:10:25
1	69	371.9233026901384	261.08888406539734	20/04/28 05:10:25
1	69	371.6536432881806	261.0791412762391	20/04/28 05:10:25
1	69	371.396048983599	261.06983439882384	20/04/28 05:10:25
1	69	371.1595095140543	261.06128823220536	20/04/28 05:10:25
1	69	371.0068589211765	261.05577296913464	20/04/28 05:10:25
1	69	370.76860735180156	261.0471649443813	20/04/28 05:10:25
1	69	370.56804126278945	261.0399184953298	20/04/28 05:10:26
1	69	370.36676974261513	261.0326465590636	20/04/28 05:10:26
1	69	370.1518949463849	261.0248831366875	20/04/28 05:10:26
1	69	369.8642431090763	261.01449028117594	20/04/28 05:10:26
1	69	369.6139322667683	261.00544655511663	20/04/28 05:10:26
1	69	369.38448791675535	260.99715673503437	20/04/28 05:10:26
1	69	369.1146101972314	260.98740605806654	20/04/28 05:10:26
1	69	368.9420614803802	260.98117187614815	20/04/28 05:10:26
1	69	368.7395954139518	260.9738567809481	20/04/28 05:10:26
1	69	368.50233873577446	260.9652847015951	20/04/28 05:10:26
1	69	368.2540768803401	260.9563150053933	20/04/28 05:10:27
1	69	368.03920033509263	260.94855151982523	20/04/28 05:10:27
1	69	367.79997731473816	260.93990839656607	20/04/28 05:10:27
1	69	367.52209392096927	260.92986847473725	20/04/28 05:10:27
1	69	367.3206330308455	260.92258969653835	20/04/28 05:10:27
1	69	367.1203964913655	260.9153551541053	20/04/28 05:10:27
1	69	366.8839551946191	260.9068125344682	20/04/28 05:10:27
1	69	366.5956609955854	260.8963964704395	20/04/28 05:10:27
1	69	366.32550134902783	260.88663560745323	20/04/28 05:10:27
1	69	366.14334920079614	260.88005445373835	20/04/28 05:10:28
1	69	365.9580971947675	260.87336130221917	20/04/28 05:10:28
1	69	365.74011473333354	260.86548559995725	20/04/28 05:10:28
1	69	365.57285839269997	260.8594426314928	20/04/28 05:10:28
1	69	365.4100898228339	260.85356180610245	20/04/28 05:10:28
1	69	365.17337641590643	260.84500935512955	20/04/28 05:10:28
1	69	364.98340400360007	260.8381456554197	20/04/28 05:10:28
1	69	364.73892401219956	260.8293125978948	20/04/28 05:10:28
1	69	364.52565633124004	260.8216072405634	20/04/28 05:10:28
1	69	364.3318670476333	260.81460563736476	20/04/28 05:10:28
1	69	364.13665012906824	260.80755245374166	20/04/28 05:10:29
1	69	363.8954502660347	260.79883790719344	20/04/28 05:10:29
1	69	363.8954502660347	260.79883790719344	20/04/28 05:10:29
1	69	363.7430559479955	260.7933319033279	20/04/28 05:10:29
1	69	363.5024573796874	260.78463908154686	20/04/28 05:10:29
1	69	363.3162780964023	260.7779124275177	20/04/28 05:10:29
1	69	363.0500613232843	260.7682940204752	20/04/28 05:10:29
1	69	362.88341007623643	260.76227291403075	20/04/28 05:10:29
1	69	362.6394081608243	260.7534571293824	20/04/28 05:10:29
1	69	362.48638668583203	260.74792846634784	20/04/28 05:10:29
1	69	362.3213635927419	260.74196618507546	20/04/28 05:10:30
1	69	362.16422139894394	260.73628864054734	20/04/28 05:10:30
1	69	361.9056761177003	260.72694740436305	20/04/28 05:10:30
1	69	361.64433747613646	260.7175052441225	20/04/28 05:10:30
1	69	361.3722728104896	260.7076755528321	20/04/28 05:10:30
1	69	361.10192908643995	260.69790803912946	20/04/28 05:10:30
1	69	360.8317974901883	260.6881481896002	20/04/28 05:10:30
1	69	360.55068208246956	260.6779914951677	20/04/28 05:10:30
1	69	360.38823964583	260.6721224529647	20/04/28 05:10:30
1	69	360.21954572270613	260.6660275446717	20/04/28 05:10:31
1	69	359.922608652593	260.6552992138723	20/04/28 05:10:31
1	69	359.6449144377661	260.6452661270751	20/04/28 05:10:31
1	69	359.42633258768035	260.6373687689124	20/04/28 05:10:31
1	69	359.19866243938696	260.6291430507051	20/04/28 05:10:31
1	69	359.0412696318653	260.6234564515079	20/04/28 05:10:31
1	69	358.77530881644265	260.61384729221214	20/04/28 05:10:31
1	69	358.54334215560044	260.6054663410867	20/04/28 05:10:31
1	69	358.3175273049194	260.5973076547475	20/04/28 05:10:31
1	69	358.1676059148459	260.59189099772317	20/04/28 05:10:31
1	69	358.01075073821147	260.58622382311984	20/04/28 05:10:32
1	69	357.7351761899128	260.57626731983476	20/04/28 05:10:32
1	69	357.48456727773174	260.5672128245165	20/04/28 05:10:32
1	69	357.2766187993512	260.559699649875	20/04/28 05:10:32
1	69	357.0105066041639	260.55008502123115	20/04/28 05:10:32
1	69	356.85383522892624	260.5444244873689	20/04/28 05:10:32
1	69	356.67851549713157	260.5380901887323	20/04/28 05:10:32
1	69	356.5078299417145	260.5319233228018	20/04/28 05:10:32
1	69	356.2842076014396	260.5238438518227	20/04/28 05:10:32
1	69	356.0980729771615	260.51711881132263	20/04/28 05:10:33
1	69	355.84398786655896	260.5079387210203	20/04/28 05:10:33
1	69	355.6777714286977	260.5019333242236	20/04/28 05:10:33
1	69	355.46844677912406	260.4943704285426	20/04/28 05:10:33
1	69	355.21265340663444	260.4851286187702	20/04/28 05:10:33
1	69	354.95551820619687	260.4758383287791	20/04/28 05:10:33
1	69	354.7116180151275	260.4670262194294	20/04/28 05:10:33
1	69	354.5114110396733	260.45979274514406	20/04/28 05:10:33
1	69	354.3445491845181	260.4537640294326	20/04/28 05:10:33
1	69	354.09924139043375	260.4449010634122	20/04/28 05:10:33
1	69	353.9210369211732	260.4384625392649	20/04/28 05:10:34
1	69	353.7697083898515	260.43299504225354	20/04/28 05:10:34
1	69	353.59868047847266	260.4268158070085	20/04/28 05:10:34
1	69	353.3143972660704	260.4165446598519	20/04/28 05:10:34
1	69	353.0214227883275	260.4059594974409	20/04/28 05:10:34
1	69	352.8211023086939	260.3987219222517	20/04/28 05:10:34
1	69	352.61455093094304	260.39125922482987	20/04/28 05:10:34
1	69	352.33079250141543	260.3810070380688	20/04/28 05:10:34
1	69	352.06672645262836	260.37146633665617	20/04/28 05:10:34
1	69	352.06672645262836	260.37146633665617	20/04/28 05:10:34
1	69	351.87106641862476	260.3643971432806	20/04/28 05:10:35
1	69	351.6716594679591	260.357192573876	20/04/28 05:10:35
1	69	351.4978308757341	260.35091215008424	20/04/28 05:10:35
1	69	351.341229518408	260.3452541459678	20/04/28 05:10:35
1	69	351.16584660432454	260.3389175645563	20/04/28 05:10:35
1	69	351.00312274724797	260.3330383546382	20/04/28 05:10:35
1	69	350.84546898645283	260.327342327204	20/04/28 05:10:35
1	69	350.84546898645283	260.327342327204	20/04/28 05:10:35
1	69	350.61541206227594	260.3190303748286	20/04/28 05:10:35
1	69	350.43901361028327	260.3126571020515	20/04/28 05:10:36
1	69	350.14267923780824	260.3019505467065	20/04/28 05:10:36
1	69	349.9027577027893	260.29328218612557	20/04/28 05:10:36
1	69	349.73894772814026	260.2873637347998	20/04/28 05:10:36
1	69	349.5150601953394	260.27927468241967	20/04/28 05:10:36
1	69	349.2675966709963	260.27033382990527	20/04/28 05:10:36
1	69	349.1003633240562	260.26429169220256	20/04/28 05:10:36
1	69	348.8265087735433	260.25439733240535	20/04/28 05:10:36
1	69	348.5487573097327	260.24436217720347	20/04/28 05:10:36
1	69	348.29874638472216	260.23532928715053	20/04/28 05:10:36
1	69	348.04343143016933	260.2261047626092	20/04/28 05:10:37
1	69	347.86563994923847	260.21968115972254	20/04/28 05:10:37
1	69	347.61757438030145	260.2107185553482	20/04/28 05:10:37
1	69	347.4038875197626	260.20299805306644	20/04/28 05:10:37
1	69	346.91466723074603	260.18532253315794	20/04/28 05:10:37
1	69	346.6619892795642	260.17619328349923	20/04/28 05:10:37
1	69	346.4218174116958	260.1675158783971	20/04/28 05:10:37
1	69	346.184072572871	260.15892616180906	20/04/28 05:10:37
1	69	345.961170124856	260.15087270052385	20/04/28 05:10:37
1	69	345.961170124856	260.15087270052385	20/04/28 05:10:38
1	69	345.712397721096	260.14188455822057	20/04/28 05:10:38
1	69	345.46462440738105	260.13293251302196	20/04/28 05:10:38
1	69	345.30765984765276	260.1272613864095	20/04/28 05:10:38
1	69	345.1281651679323	260.12077624698236	20/04/28 05:10:38
1	69	344.9020181769196	260.11260556041924	20/04/28 05:10:38
1	69	344.6753230831704	260.10441507091446	20/04/28 05:10:38
1	69	344.4055169505896	260.0946669803816	20/04/28 05:10:38
1	69	343.96374918303457	260.0787059191876	20/04/28 05:10:38
1	69	343.96374918303457	260.0787059191876	20/04/28 05:10:38
1	69	343.8089762349876	260.07311397546425	20/04/28 05:10:39
1	69	343.5767918631946	260.0647251584462	20/04/28 05:10:39
1	69	343.3559317169709	260.0567454854866	20/04/28 05:10:39
1	69	343.18035646743175	260.05040195499873	20/04/28 05:10:39
1	69	342.9378505442905	260.0416402205232	20/04/28 05:10:39
1	69	342.70729076337443	260.03331009994326	20/04/28 05:10:39
1	69	342.54039209456556	260.0272800541552	20/04/28 05:10:39
1	69	342.3766442389876	260.02136384719034	20/04/28 05:10:39
1	69	342.14397669048174	260.0129575730067	20/04/28 05:10:39
1	69	341.9871916690619	260.00729293310997	20/04/28 05:10:40
1	69	341.78993987551706	260.00016622949187	20/04/28 05:10:40
1	69	341.3330323444424	259.9836581689246	20/04/28 05:10:40
1	69	341.1168061975296	259.97584592227355	20/04/28 05:10:40
1	69	340.8822348772022	259.96737086484956	20/04/28 05:10:40
1	69	340.70738978751154	259.96105371502335	20/04/28 05:10:40
1	69	340.4669093359633	259.95236516079865	20/04/28 05:10:40
1	69	340.22519544748485	259.9436320425207	20/04/28 05:10:40
1	69	340.0329146923479	259.93668494242746	20/04/28 05:10:40
1	69	339.7446671781801	259.92627056512214	20/04/28 05:10:40
1	69	339.44987861347676	259.9156198597831	20/04/28 05:10:41
1	69	339.21009347316635	259.9069564271404	20/04/28 05:10:41
1	69	338.9943725199789	259.8991624331292	20/04/28 05:10:41
1	69	338.7632132733932	259.8908106538658	20/04/28 05:10:41
1	69	338.5946628541863	259.88472093036665	20/04/28 05:10:41
1	69	338.35832208795534	259.8761819428952	20/04/28 05:10:41
1	69	338.167258307463	259.86927881207316	20/04/28 05:10:41
1	69	337.93706498429674	259.86096193160483	20/04/28 05:10:41
1	69	337.64451440850723	259.8503920847634	20/04/28 05:10:41
1	69	337.47132651073724	259.8441348092504	20/04/28 05:10:41
1	69	337.209757655117	259.83468433138034	20/04/28 05:10:42
1	69	336.97845560590343	259.82632739266063	20/04/28 05:10:42
1	69	336.80625829722834	259.8201059071131	20/04/28 05:10:42
1	69	336.51964368982306	259.8097505266986	20/04/28 05:10:42
1	69	336.25613891137294	259.8002301039728	20/04/28 05:10:42
1	69	336.0185810130707	259.79164714154234	20/04/28 05:10:42
1	69	335.80034223368716	259.7837621785177	20/04/28 05:10:42
1	69	335.5559050558604	259.77493066784643	20/04/28 05:10:42
1	69	335.2867283130576	259.7652053171545	20/04/28 05:10:42
1	69	335.01320581623213	259.75532295445083	20/04/28 05:10:43
1	69	334.85370726942426	259.7495602749325	20/04/28 05:10:43
1	69	334.589831862204	259.74002646139616	20/04/28 05:10:43
1	69	334.4189723395581	259.7338533100329	20/04/28 05:10:43
1	69	334.1938885851194	259.7257210381873	20/04/28 05:10:43
1	69	333.94697971130086	259.71680022518603	20/04/28 05:10:43
1	69	333.72144194975385	259.7086515500721	20/04/28 05:10:43
1	69	333.4781152877906	259.69986016231826	20/04/28 05:10:43
1	69	333.19609226178164	259.6896706756539	20/04/28 05:10:43
1	69	333.03157625626284	259.68372671544597	20/04/28 05:10:43
1	69	332.73631193964405	259.6730588211991	20/04/28 05:10:44
1	69	332.53804187578817	259.6658953274937	20/04/28 05:10:44
1	69	332.2705208988859	259.6562297995928	20/04/28 05:10:44
1	69	332.0926679674608	259.6498039765009	20/04/28 05:10:44
1	69	331.94219350152537	259.64436733685596	20/04/28 05:10:44
1	69	331.72820874442937	259.63663607157713	20/04/28 05:10:44
1	69	331.53494783195964	259.6296535584178	20/04/28 05:10:44
1	69	331.2461381601312	259.61921887036664	20/04/28 05:10:44
1	69	331.0797099622378	259.61320582268394	20/04/28 05:10:44
1	69	330.8843709710266	259.60614822857843	20/04/28 05:10:45
1	69	330.6147829855628	259.5964080196968	20/04/28 05:10:45
1	69	330.4190870951651	259.58933753083033	20/04/28 05:10:45
1	69	330.1327056668359	259.57899057517153	20/04/28 05:10:45
1	69	329.90898225330744	259.57090745241766	20/04/28 05:10:45
1	69	329.6685805771878	259.5622217443477	20/04/28 05:10:45
1	69	329.40306585007835	259.55262870221435	20/04/28 05:10:45
1	69	329.12525556453295	259.54259142178427	20/04/28 05:10:45
1	69	328.85725474841604	259.5329085573015	20/04/28 05:10:45
1	69	328.70336613997495	259.5273485647516	20/04/28 05:10:45
1	69	328.4696221991449	259.51890340053336	20/04/28 05:10:46
1	69	328.2727135362278	259.51178909421844	20/04/28 05:10:46
1	69	328.0860872456783	259.5050462898252	20/04/28 05:10:46
1	69	327.9288164251101	259.4993640980143	20/04/28 05:10:46
1	69	327.77376962540643	259.49376226003574	20/04/28 05:10:46
1	69	327.5869814708051	259.4870136074973	20/04/28 05:10:46
1	69	327.2903757278841	259.4762972475432	20/04/28 05:10:46
1	69	327.2903757278841	259.4762972475432	20/04/28 05:10:46
1	69	327.2903757278841	259.4762972475432	20/04/28 05:10:46
1	69	327.00773105781724	259.4660853008906	20/04/28 05:10:47
1	69	326.7335294366085	259.45617840143564	20/04/28 05:10:47
1	69	326.5167043577901	259.44834451538605	20/04/28 05:10:47
1	69	326.23662849316486	259.43822537962615	20/04/28 05:10:47
1	69	325.9867412290441	259.4291969574388	20/04/28 05:10:47
1	69	325.7871452341929	259.42198555787127	20/04/28 05:10:47
1	69	325.49925430926567	259.41158406412853	20/04/28 05:10:47
1	69	325.27847595699546	259.4036073463829	20/04/28 05:10:47
1	69	325.0728905393079	259.3961795490801	20/04/28 05:10:47
1	69	324.78618350304475	259.3858208292127	20/04/28 05:10:47
1	69	324.50069245397833	259.37550604294006	20/04/28 05:10:48
1	69	324.21018584112636	259.3650100444414	20/04/28 05:10:48
1	69	323.9347355521338	259.35505803064274	20/04/28 05:10:48
1	69	323.70088503869124	259.346609015958	20/04/28 05:10:48
1	69	323.48196385235707	259.33869939758296	20/04/28 05:10:48
1	69	323.2046641873826	259.3286805658646	20/04/28 05:10:48
1	69	322.9888144710775	259.32088191964436	20/04/28 05:10:48
1	69	322.7997351104733	259.31405048587584	20/04/28 05:10:48
1	69	322.63942638172045	259.3082585344989	20/04/28 05:10:48
1	69	322.48526987435434	259.3026888627659	20/04/28 05:10:48
1	69	322.1860641543913	259.29187856568973	20/04/28 05:10:49
1	69	322.0300903633133	259.2862432355301	20/04/28 05:10:49
1	69	321.81182535793704	259.27835732496084	20/04/28 05:10:49
1	69	321.54507864670285	259.2687197712641	20/04/28 05:10:49
1	69	321.31503696663424	259.2604083696581	20/04/28 05:10:49
1	69	321.05059727522166	259.2508541685444	20/04/28 05:10:49
1	69	320.79607177967443	259.24165816714225	20/04/28 05:10:49
1	69	320.5748264732	259.23366457834993	20/04/28 05:10:49
1	69	320.36537697656877	259.22609717194706	20/04/28 05:10:49
1	69	320.2080371426704	259.2204124866858	20/04/28 05:10:50
1	69	319.96981316804255	259.2118054589301	20/04/28 05:10:50
1	69	319.73129385872215	259.2031877607375	20/04/28 05:10:50
1	69	319.5547800166039	259.19681031891724	20/04/28 05:10:50
1	69	319.40246340474175	259.1913071225744	20/04/28 05:10:50
1	69	319.2376482404184	259.1853523537645	20/04/28 05:10:50
1	69	318.98235060967767	259.1761284551322	20/04/28 05:10:50
1	69	318.6911290640606	259.16560662612613	20/04/28 05:10:50
1	81	318.44108721055403	259.25161021023695	20/04/28 05:10:50
1	81	318.3146532401417	259.39326314020684	20/04/28 05:10:50
1	81	318.1303188595259	259.5997859997141	20/04/28 05:10:51
1	81	317.9610009344354	259.789484860766	20/04/28 05:10:51
1	81	317.81499010082354	259.95307113683566	20/04/28 05:10:51
1	81	317.6985149956097	260.08356644492636	20/04/28 05:10:51
1	81	317.5603704555898	260.2383395552648	20/04/28 05:10:51
1	81	317.43424084278223	260.37965149185817	20/04/28 05:10:51
1	81	317.31746781307834	260.51048058585144	20/04/28 05:10:51
1	81	317.142249330393	260.70679025940126	20/04/28 05:10:51
1	81	317.0237958027019	260.8395021342873	20/04/28 05:10:51
1	81	316.90388657649254	260.97384493130284	20/04/28 05:10:52
1	81	316.7312110322394	261.167305570859	20/04/28 05:10:52
1	81	316.6261324203413	261.2850325804909	20/04/28 05:10:52
1	81	316.4281768385852	261.5068162361666	20/04/28 05:10:52
1	81	316.31734315495555	261.6309910601818	20/04/28 05:10:52
1	81	316.1547726353334	261.81313032509695	20/04/28 05:10:52
1	81	316.05359093917826	261.9264913440775	20/04/28 05:10:52
1	81	315.85792218337986	262.1457129067004	20/04/28 05:10:52
1	81	315.6648355452725	262.36204154003156	20/04/28 05:10:52
1	81	315.52881833253747	262.4354189310505	20/04/28 05:10:52
1	81	315.668780383846	262.24772968830223	20/04/28 05:10:53
1	81	315.8352804053259	262.2157686569886	20/04/28 05:10:53
1	81	315.85861160027565	262.0850827323215	20/04/28 05:10:53
1	81	315.8132684181287	262.0067691765346	20/04/28 05:10:53
1	81	315.6554584776863	261.9662816285227	20/04/28 05:10:53
1	81	315.648364468184	261.95714225135225	20/04/28 05:10:53
1	81	315.76435972252494	262.04908615789395	20/04/28 05:10:53
1	81	315.5180688819896	262.18580838912624	20/04/28 05:10:53
1	81	315.4352176339073	262.2922457885796	20/04/28 05:10:53
1	81	315.56507232014417	262.11385923297473	20/04/28 05:10:54
1	81	315.5919204073761	262.01254406145523	20/04/28 05:10:54
1	81	315.4579883128083	261.76136889945997	20/04/28 05:10:54
1	81	315.39172128891425	261.84514008087183	20/04/28 05:10:54
1	81	315.1996294270015	261.7226032998489	20/04/28 05:10:54
1	81	315.0519810424402	261.96608156231036	20/04/28 05:10:54
1	81	315.0519810424402	261.96608156231036	20/04/28 05:10:54
1	81	314.96713263763763	262.07773521376777	20/04/28 05:10:54
1	81	315.02160198283775	261.9151627438672	20/04/28 05:10:54
1	81	314.9712686653461	261.820545646486	20/04/28 05:10:54
1	81	314.9563843282933	262.0040941636508	20/04/28 05:10:55
1	81	315.0566196382099	261.911355343499	20/04/28 05:10:55
1	81	315.1874042708282	261.81372771027293	20/04/28 05:10:55
1	81	315.1753709018557	261.82616655061094	20/04/28 05:10:55
1	81	315.1721947636694	261.5331778457781	20/04/28 05:10:55
1	81	315.3858613372181	261.46559755497736	20/04/28 05:10:55
1	81	315.41601416777866	261.42297095916797	20/04/28 05:10:55
1	81	315.52350963786074	261.6128653794278	20/04/28 05:10:55
1	81	315.5222959058273	261.61465333482903	20/04/28 05:10:55
1	81	315.56700662952073	261.45295283236135	20/04/28 05:10:55
1	81	315.72902337470055	261.3549726433797	20/04/28 05:10:56
1	81	315.6405855764754	261.2992204912619	20/04/28 05:10:56
1	81	315.6538139793847	261.21741228312624	20/04/28 05:10:56
1	81	315.6745217814736	261.48625307382366	20/04/28 05:10:56
1	81	315.7076512475687	261.4965559089371	20/04/28 05:10:56
1	81	315.47250538489277	261.64258874670804	20/04/28 05:10:56
1	81	315.31897477486956	261.44750111353784	20/04/28 05:10:56
1	81	315.52279940086527	261.3294867130835	20/04/28 05:10:56
1	81	315.6542546252227	261.26862904041525	20/04/28 05:10:56
1	81	315.87881983008145	261.30656520351687	20/04/28 05:10:57
1	81	316.0287921322047	261.32542190797506	20/04/28 05:10:57
1	81	316.06880651934745	261.12351792855077	20/04/28 05:10:57
1	81	316.2037243153688	261.1859407160604	20/04/28 05:10:57
1	81	316.04417117393103	261.2540033767188	20/04/28 05:10:57
1	81	316.2625317347911	261.2719531874595	20/04/28 05:10:57
1	81	316.25960034772345	261.24396154617176	20/04/28 05:10:57
1	81	316.19451191465066	261.3329981043155	20/04/28 05:10:57
1	81	316.201225520407	261.42087974782856	20/04/28 05:10:57
1	81	316.2140277305179	261.3827141627707	20/04/28 05:10:57
1	81	316.13350999615136	261.38576857349676	20/04/28 05:10:58
1	81	316.14077781577953	261.35407547137197	20/04/28 05:10:58
1	81	316.3002720592615	261.53269869379733	20/04/28 05:10:58
1	81	316.4369198405438	261.72682602162695	20/04/28 05:10:58
1	81	316.452631477049	261.6861119481406	20/04/28 05:10:58
1	81	316.3940423244212	261.8083783880796	20/04/28 05:10:58
1	81	316.28610073485316	261.74373185755366	20/04/28 05:10:58
1	81	316.324533853777	261.71277662629177	20/04/28 05:10:58
1	81	316.324533853777	261.71277662629177	20/04/28 05:10:58
1	81	316.324533853777	261.71277662629177	20/04/28 05:10:59
1	81	316.39603105967944	261.5340240826064	20/04/28 05:10:59
1	81	316.4985751054661	261.27765030138244	20/04/28 05:10:59
1	81	316.6054192057526	261.01052581081075	20/04/28 05:10:59
1	81	316.6917660639554	260.7946471572581	20/04/28 05:10:59
1	81	316.7752044108456	260.5860401696245	20/04/28 05:10:59
1	81	316.87891609989055	260.3267471246349	20/04/28 05:10:59
1	81	316.9796656698259	260.0748597722014	20/04/28 05:10:59
1	81	317.0553681889642	259.88559338495514	20/04/28 05:10:59
1	81	317.1313190632907	259.69570607663843	20/04/28 05:10:59
1	81	317.2066065081514	259.5074774304058	20/04/28 05:11:00
1	81	317.2688327946854	259.35190342074145	20/04/28 05:11:00
1	69	317.36450942350507	259.1611191146057	20/04/28 05:11:00
1	69	317.5412923857441	259.1760030539977	20/04/28 05:11:00
1	69	317.78724077222887	259.1967102580836	20/04/28 05:11:00
1	69	318.0772737693307	259.22112909062196	20/04/28 05:11:00
1	69	318.25156197500087	259.23580298824805	20/04/28 05:11:00
1	69	318.43370472686325	259.25113818596776	20/04/28 05:11:00
1	69	318.6181287394057	259.2666654505319	20/04/28 05:11:00
1	69	318.846523775535	259.2858947802825	20/04/28 05:11:00
1	69	319.04814566001266	259.30286999028385	20/04/28 05:11:01
1	69	319.3247177826804	259.3261555075032	20/04/28 05:11:01
1	69	319.5997346214761	259.34931008025484	20/04/28 05:11:01
1	69	319.8340060492048	259.3690341627537	20/04/28 05:11:01
1	69	319.9896669569412	259.3821397668634	20/04/28 05:11:01
1	69	320.1801484537639	259.3981770309645	20/04/28 05:11:01
1	69	320.4431990959421	259.4203241302416	20/04/28 05:11:01
1	69	320.60051851432746	259.43356936982116	20/04/28 05:11:01
1	69	320.76924673740547	259.44777515421464	20/04/28 05:11:01
1	69	320.99572056885506	259.46684273142046	20/04/28 05:11:02
1	69	321.1655369317074	259.4811401298827	20/04/28 05:11:02
1	69	321.37355887365317	259.4986541817852	20/04/28 05:11:02
1	69	321.6333555468433	259.5205273187042	20/04/28 05:11:02
1	69	321.9068596510843	259.54355452935516	20/04/28 05:11:02
1	69	322.13159757864815	259.5624759550999	20/04/28 05:11:02
1	69	322.3240986323479	259.57868325234097	20/04/28 05:11:02
1	69	322.53108951894666	259.5961104963005	20/04/28 05:11:02
1	69	322.6862237976751	259.60917176178094	20/04/28 05:11:02
1	69	322.89251876550185	259.62654041404875	20/04/28 05:11:02
1	69	323.0871249025709	259.6429249451866	20/04/28 05:11:03
1	69	323.346581441848	259.6647694451121	20/04/28 05:11:03
1	69	323.59303354801654	259.685519059016	20/04/28 05:11:03
1	69	323.8334551371577	259.7057609438446	20/04/28 05:11:03
1	69	324.1283954198511	259.730592936907	20/04/28 05:11:03
1	69	324.4270090980302	259.75573420522466	20/04/28 05:11:03
1	69	324.6400022901779	259.77366680304226	20/04/28 05:11:03
1	69	324.89514518616875	259.79514812314306	20/04/28 05:11:03
1	69	325.13370092262215	259.8152329156933	20/04/28 05:11:03
1	69	325.4211126655171	259.83943105621324	20/04/28 05:11:04
1	69	325.60782815061685	259.8551512473933	20/04/28 05:11:04
1	69	325.85277955450306	259.87577451223314	20/04/28 05:11:04
1	69	326.1112000333309	259.89753178281967	20/04/28 05:11:04
1	69	326.3869856230011	259.92075107923745	20/04/28 05:11:04
1	69	326.58624171326807	259.93752710523825	20/04/28 05:11:04
1	69	326.76466106177236	259.9525488173753	20/04/28 05:11:04
1	69	327.0258306462396	259.9745375442131	20/04/28 05:11:04
1	69	327.30633223836827	259.99815389639843	20/04/28 05:11:04
1	69	327.4641538392308	260.01144141637343	20/04/28 05:11:04
1	69	327.68048621635705	260.02965515116375	20/04/28 05:11:05
1	69	327.9319661932795	260.05082807805337	20/04/28 05:11:05
1	69	328.17455890329336	260.0712527566935	20/04/28 05:11:05
1	69	328.3270700993149	260.0840931762081	20/04/28 05:11:05
1	69	328.58984033060494	260.1062166667697	20/04/28 05:11:05
1	69	328.8700933599338	260.12981209163485	20/04/28 05:11:05
1	69	329.0419828045129	260.14428402967025	20/04/28 05:11:05
1	69	329.26629490630336	260.1631696037417	20/04/28 05:11:05
1	69	329.5501935556461	260.18707196535377	20/04/28 05:11:05
1	69	329.8427436683283	260.21170272213675	20/04/28 05:11:05
1	69	330.04560861927337	260.228782589995	20/04/28 05:11:06
1	69	330.2810707336299	260.2486069203196	20/04/28 05:11:06
1	69	330.5644506793382	260.27246561056563	20/04/28 05:11:06
1	69	330.78268575771756	260.29083954003636	20/04/28 05:11:06
1	69	331.0076667740233	260.3097814322223	20/04/28 05:11:06
1	69	331.1639333701777	260.32293803123326	20/04/28 05:11:06
1	69	331.3523485822688	260.3388013280226	20/04/28 05:11:06
1	69	331.50800334978794	260.35190641516726	20/04/28 05:11:06
1	69	331.68493247830264	260.36680266077906	20/04/28 05:11:06
1	69	331.8904291974229	260.38410410586124	20/04/28 05:11:07
1	69	332.1865393106902	260.4090345908096	20/04/28 05:11:07
1	69	332.44501826024975	260.4307967842395	20/04/28 05:11:07
1	69	332.6864899059257	260.45112707678356	20/04/28 05:11:07
1	69	332.9543593078212	260.4736798833	20/04/28 05:11:07
1	69	332.9543593078212	260.4736798833	20/04/28 05:11:07
1	69	333.2395478335407	260.4976908438493	20/04/28 05:11:07
1	69	333.41194567997	260.5122055859096	20/04/28 05:11:07
1	69	333.5747182491897	260.52590994420444	20/04/28 05:11:07
1	69	333.7419419593551	260.5399890587044	20/04/28 05:11:07
1	69	333.92371503325666	260.55529313202	20/04/28 05:11:08
1	69	334.08571211673944	260.5689321996185	20/04/28 05:11:08
1	69	334.25969829341597	260.5835806684296	20/04/28 05:11:08
1	69	334.5283344738651	260.606198032556	20/04/28 05:11:08
1	69	334.7171457670861	260.62209467671914	20/04/28 05:11:08
1	69	334.9870450666657	260.6448183870021	20/04/28 05:11:08
1	69	335.26909138275624	260.6685647945815	20/04/28 05:11:08
1	69	335.50941566457476	260.6887984867864	20/04/28 05:11:08
1	69	335.72629236889804	260.7070580502749	20/04/28 05:11:08
1	69	335.91225529639945	260.72271488115405	20/04/28 05:11:08
1	69	336.1782611679178	260.7451107909151	20/04/28 05:11:09
1	69	336.3863176429152	260.7626277502688	20/04/28 05:11:09
1	69	336.5911438697395	260.77987274439795	20/04/28 05:11:09
1	69	336.88182320634866	260.8043459943865	20/04/28 05:11:09
1	69	337.1606418573292	260.82782065421793	20/04/28 05:11:09
1	69	337.4582532261083	260.85287753480856	20/04/28 05:11:09
1	69	337.6660341236501	260.8703712923894	20/04/28 05:11:09
1	69	337.851155947828	260.8859573080116	20/04/28 05:11:09
1	69	338.0076627736906	260.89913413275235	20/04/28 05:11:09
1	69	338.29481026512417	260.9233100250721	20/04/28 05:11:10
1	69	338.5454352046515	260.94441096354944	20/04/28 05:11:10
1	69	338.7757363189748	260.96380077229617	20/04/28 05:11:10
1	69	338.94508167888785	260.9780585154708	20/04/28 05:11:10
1	69	339.1205420673153	260.992831103021	20/04/28 05:11:10
1	69	339.33858029800473	261.01118845923685	20/04/28 05:11:10
1	69	339.48995045976415	261.02393281132174	20/04/28 05:11:10
1	69	339.73176998927755	261.044292393351	20/04/28 05:11:10
1	69	340.01407324451657	261.0680604334829	20/04/28 05:11:10
1	69	340.257486459244	261.0885541931152	20/04/28 05:11:10
1	69	340.43623780841784	261.1036038574813	20/04/28 05:11:11
1	69	340.6941721109526	261.12532019528567	20/04/28 05:11:11
1	69	340.91819268707604	261.1441812248518	20/04/28 05:11:11
1	69	341.1394155784615	261.16280670813256	20/04/28 05:11:11
1	69	341.42268054845516	261.18665571819474	20/04/28 05:11:11
1	69	341.689429488102	261.209114189307	20/04/28 05:11:11
1	69	341.8620539948694	261.22364801464715	20/04/28 05:11:11
1	69	342.0369384654161	261.23837211377554	20/04/28 05:11:11
1	69	342.2562706448526	261.2568384117949	20/04/28 05:11:11
1	69	342.5151927351118	261.27863791469866	20/04/28 05:11:12
1	69	342.77806313308105	261.3007698386226	20/04/28 05:11:12
1	69	342.93483881728423	261.3139692994319	20/04/28 05:11:12
1	69	343.1846855987585	261.3350047222218	20/04/28 05:11:12
1	69	343.46320461122195	261.35845415450035	20/04/28 05:11:12
1	69	343.73507205989506	261.3813435697328	20/04/28 05:11:12
1	69	343.96316556651345	261.4005475127215	20/04/28 05:11:12
1	69	344.14320741472335	261.41570582844855	20/04/28 05:11:12
1	69	344.4383871468572	261.4405579815474	20/04/28 05:11:12
1	69	344.4383871468572	261.4405579815474	20/04/28 05:11:12
1	69	344.4383871468572	261.4405579815474	20/04/28 05:11:13
1	69	344.67500571223025	261.460479677289	20/04/28 05:11:13
1	69	344.9456775878092	261.48326843328795	20/04/28 05:11:13
1	69	345.16896886563404	261.5020680608302	20/04/28 05:11:13
1	69	345.3713385384743	261.5191062295948	20/04/28 05:11:13
1	69	345.6274867704278	261.5406721922389	20/04/28 05:11:13
1	69	345.90934819043713	261.56440303280874	20/04/28 05:11:13
1	69	346.1407126770994	261.5838823703723	20/04/28 05:11:13
1	69	346.4252109123977	261.60783521309924	20/04/28 05:11:13
1	69	346.4252109123977	261.60783521309924	20/04/28 05:11:13
1	69	346.6082000188963	261.62324166820116	20/04/28 05:11:14
1	69	346.8230532362202	261.64133086765975	20/04/28 05:11:14
1	69	347.10776649595755	261.66530181400185	20/04/28 05:11:14
1	69	347.25949760005665	261.6780765550102	20/04/28 05:11:14
1	69	347.5222300310972	261.70019686304437	20/04/28 05:11:14
1	69	347.8019687837254	261.7237489892616	20/04/28 05:11:14
1	69	347.96501234880805	261.73747616359	20/04/28 05:11:14
1	69	348.1615783989599	261.75402570626045	20/04/28 05:11:14
1	69	348.440377456276	261.77749871643675	20/04/28 05:11:14
1	69	348.7165192414181	261.80074800212356	20/04/28 05:11:15
1	69	348.89942934039124	261.8161478053219	20/04/28 05:11:15
1	69	349.10322725771516	261.83330622269	20/04/28 05:11:15
1	69	349.33657326008483	261.85295239058223	20/04/28 05:11:15
1	69	349.4883103049635	261.86572763176434	20/04/28 05:11:15
1	69	349.6394178491299	261.8784498732098	20/04/28 05:11:15
1	69	349.8801537011073	261.8987182168608	20/04/28 05:11:15
1	69	350.13650066709477	261.92030091157727	20/04/28 05:11:15
1	69	350.36388819511063	261.93944541590406	20/04/28 05:11:15
1	69	350.6583003045453	261.96423294032155	20/04/28 05:11:15
1	69	350.8222173827584	261.97803365859517	20/04/28 05:11:16
1	69	351.00536584714416	261.9934535305621	20/04/28 05:11:16
1	69	351.27298551611807	262.015985311242	20/04/28 05:11:16
1	69	351.5489535502729	262.03921996826136	20/04/28 05:11:16
1	69	351.77721755102937	262.05843826571265	20/04/28 05:11:16
1	69	352.0223932024427	262.0790804106898	20/04/28 05:11:16
1	69	352.25408550024474	262.0985873477521	20/04/28 05:11:16
1	69	352.4429936976764	262.1144921505997	20/04/28 05:11:16
1	69	352.6354371612486	262.1306945991384	20/04/28 05:11:16
1	69	352.7887494122375	262.143602462107	20/04/28 05:11:16
1	69	352.94703830020643	262.15692932452134	20/04/28 05:11:17
1	69	353.1953567200205	262.17783606951315	20/04/28 05:11:17
1	69	353.3762275765951	262.1930641821827	20/04/28 05:11:17
1	69	353.6359423389166	262.21493042275614	20/04/28 05:11:17
1	69	353.830318394719	262.23129558259495	20/04/28 05:11:17
1	69	354.00755636625337	262.246217830717	20/04/28 05:11:17
1	69	354.22364559899927	262.2644110943818	20/04/28 05:11:17
1	69	354.4855889940484	262.2864649708791	20/04/28 05:11:17
1	69	354.67318463880275	262.3022592655971	20/04/28 05:11:17
1	69	354.942048653412	262.32489581183125	20/04/28 05:11:18
1	69	355.12810256899	262.340560303296	20/04/28 05:11:18
1	69	355.38901273506593	262.3625271888456	20/04/28 05:11:18
1	69	355.6702366396253	262.3862043548916	20/04/28 05:11:18
1	69	355.8596063872126	262.4021480171658	20/04/28 05:11:18
1	69	356.1373337112946	262.42553079459407	20/04/28 05:11:18
1	69	356.3595532927109	262.4442401924887	20/04/28 05:11:18
1	69	356.5849246221572	262.46321494642245	20/04/28 05:11:18
1	69	356.8278320798217	262.4836661247032	20/04/28 05:11:18
1	69	357.1202336553528	262.50828437565457	20/04/28 05:11:18
1	69	357.37422073855134	262.5296683840726	20/04/28 05:11:19
1	69	357.61199796084264	262.5496876309534	20/04/28 05:11:19
1	69	357.80199265036117	262.56568390914543	20/04/28 05:11:19
1	69	357.99287974163514	262.5817553215782	20/04/28 05:11:19
1	69	358.25931870898665	262.6041876951028	20/04/28 05:11:19
1	69	358.41240381434176	262.61707643393294	20/04/28 05:11:19
1	69	358.5864804328393	262.6317325173386	20/04/28 05:11:19
1	69	358.8034843238169	262.6500027890901	20/04/28 05:11:19
1	69	359.0036485757253	262.66685527620825	20/04/28 05:11:19
1	69	359.28747326126336	262.6907514105642	20/04/28 05:11:20
1	69	359.4795792784956	262.70692544838494	20/04/28 05:11:20
1	69	359.68330416326336	262.7240777169018	20/04/28 05:11:20
1	69	359.87568799371127	262.74027514473147	20/04/28 05:11:20
1	69	360.03161229333244	262.7534029246708	20/04/28 05:11:20
1	69	360.2686357863807	262.77335871260607	20/04/28 05:11:20
1	69	360.54695006143993	262.79679090736875	20/04/28 05:11:20
1	69	360.7813386562176	262.816524854547	20/04/28 05:11:20
1	69	361.0582737524845	262.83984093170824	20/04/28 05:11:20
1	69	361.3375952942405	262.86335793156906	20/04/28 05:11:20
1	69	361.5720986780463	262.8831015432134	20/04/28 05:11:21
1	69	361.82881935306045	262.90471570172275	20/04/28 05:11:21
1	69	362.07154459308026	262.92515153850024	20/04/28 05:11:21
1	69	362.07154459308026	262.92515153850024	20/04/28 05:11:21
1	69	362.28313265657636	262.9429658339123	20/04/28 05:11:21
1	69	362.5530904587734	262.9656944697232	20/04/28 05:11:21
1	69	362.8181147955644	262.98800774084526	20/04/28 05:11:21
1	69	362.99380056991794	263.0027993043783	20/04/28 05:11:21
1	69	363.2138057446302	263.02132226408474	20/04/28 05:11:21
1	69	363.48356516748737	263.04403419768613	20/04/28 05:11:21
1	69	363.6558714402521	263.0585412298583	20/04/28 05:11:22
1	69	363.83556283193883	263.07367003949724	20/04/28 05:11:22
1	69	364.0979687181904	263.09576285465096	20/04/28 05:11:22
1	69	364.3450221853611	263.1165630991167	20/04/28 05:11:22
1	69	364.56455601505036	263.1350463747345	20/04/28 05:11:22
1	69	364.86299558868376	263.1601729846174	20/04/28 05:11:22
1	69	365.07639065035016	263.17813941715235	20/04/28 05:11:22
1	69	365.2600870412732	263.1936054208577	20/04/28 05:11:22
1	69	365.55485458467734	263.2184228704308	20/04/28 05:11:22
1	69	365.8256372780155	263.2412209565416	20/04/28 05:11:23
1	69	366.1139681197645	263.2654964790189	20/04/28 05:11:23
1	69	366.39585511594174	263.2892294729305	20/04/28 05:11:23
1	69	366.60037080255523	263.3064483216573	20/04/28 05:11:23
1	69	366.8228814559063	263.325182225856	20/04/28 05:11:23
1	69	367.0526033903498	263.3445232715425	20/04/28 05:11:23
1	69	367.27602603689553	263.36333395944973	20/04/28 05:11:23
1	69	367.4797873910953	263.3804892984481	20/04/28 05:11:23
1	69	367.71358473632506	263.4001734663811	20/04/28 05:11:23
1	69	367.90863168757426	263.4165951111155	20/04/28 05:11:23
1	69	368.20630948912606	263.4416575848999	20/04/28 05:11:24
1	69	368.3610034611576	263.4546817795104	20/04/28 05:11:24
1	69	368.55515309309743	263.471027875979	20/04/28 05:11:24
1	69	368.726038966617	263.48541532006413	20/04/28 05:11:24
1	69	368.9431885745447	263.5036978602052	20/04/28 05:11:24
1	69	369.23113028521095	263.527940620456	20/04/28 05:11:24
1	69	369.52798345620505	263.5529336658798	20/04/28 05:11:24
1	69	369.818912675873	263.57742795434547	20/04/28 05:11:24
1	69	370.0845592782867	263.5997936160582	20/04/28 05:11:24
1	69	370.2920098046607	263.6172595586031	20/04/28 05:11:24
1	69	370.55199463382894	263.63914853699316	20/04/28 05:11:25
1	69	370.7668389513255	263.657236987146	20/04/28 05:11:25
1	69	370.7668389513255	263.657236987146	20/04/28 05:11:25
1	69	370.9843421162811	263.67554929441684	20/04/28 05:11:25
1	69	371.1726093510042	263.69140013250455	20/04/28 05:11:25
1	69	371.35386515281675	263.70666065498057	20/04/28 05:11:25
1	69	371.526499778713	263.7211953322835	20/04/28 05:11:25
1	69	371.7403964741694	263.7392039990181	20/04/28 05:11:25
1	69	372.02479774243454	263.76314867777137	20/04/28 05:11:25
1	69	372.1975698488657	263.77769493001296	20/04/28 05:11:26
1	69	372.39695123955215	263.7944815054684	20/04/28 05:11:26
1	69	372.6596585725059	263.81659970041204	20/04/28 05:11:26
1	69	372.9322433258022	263.8395495078814	20/04/28 05:11:26
1	69	373.12310099587904	263.8556184432468	20/04/28 05:11:26
1	69	373.12310099587904	263.8556184432468	20/04/28 05:11:26
1	69	373.39939138806767	263.8788802406499	20/04/28 05:11:26
1	69	373.6714036602882	263.9017818490534	20/04/28 05:11:26
1	69	373.8512283860285	263.91692188452515	20/04/28 05:11:26
1	69	374.0090667483624	263.93021081570356	20/04/28 05:11:26
1	74	374.14413531701814	264.1634281422469	20/04/28 05:11:27
1	74	374.2350186700064	264.3546074208789	20/04/28 05:11:27
1	74	374.3389986676353	264.5733363771203	20/04/28 05:11:27
1	74	374.45694950881	264.82145394748244	20/04/28 05:11:27
1	74	374.54755316105707	265.0120448566917	20/04/28 05:11:27
1	74	374.6283445942468	265.181995099602	20/04/28 05:11:27
1	74	374.70417976333374	265.3415195058246	20/04/28 05:11:27
1	74	374.76937649707213	265.4786652439102	20/04/28 05:11:27
1	74	374.8494430739477	265.64709070254816	20/04/28 05:11:27
1	74	374.9456001939355	265.8493637066809	20/04/28 05:11:27
1	74	375.0734364863098	266.11827599210517	20/04/28 05:11:28
1	74	374.91821796483606	266.32797130904237	20/04/28 05:11:28
1	74	374.9204894517982	266.3922537405057	20/04/28 05:11:28
1	74	374.8483369392822	266.31143863535476	20/04/28 05:11:28
1	74	374.9424333358066	266.0879244214569	20/04/28 05:11:28
1	74	374.98137218627414	266.1093642623043	20/04/28 05:11:28
1	74	375.0185405105102	266.2556491461253	20/04/28 05:11:28
1	74	375.1148234695529	266.1851484685825	20/04/28 05:11:28
1	74	375.1641663568792	266.4537006330733	20/04/28 05:11:28
1	74	375.05293372611004	266.3129638422682	20/04/28 05:11:29
1	74	374.9329777312658	266.24384323449965	20/04/28 05:11:29
1	74	374.99115464515097	266.2038039950262	20/04/28 05:11:29
1	74	374.9685964744131	266.3090878506312	20/04/28 05:11:29
1	74	374.9054831348512	266.18176219498315	20/04/28 05:11:29
1	74	374.8529267694166	266.0631284458869	20/04/28 05:11:29
1	74	374.8529267694166	266.0631284458869	20/04/28 05:11:29
1	74	374.7625690898567	265.9666384123013	20/04/28 05:11:29
1	74	374.7625690898567	265.9666384123013	20/04/28 05:11:29
1	74	374.7625690898567	265.9666384123013	20/04/28 05:11:29
