floorId	partitionId	location_x	location_y	timeStamp
3	14	327.31058125591494	271.7908763576542	20/04/28 05:13:21
3	14	327.92457286980954	269.6983674606061	20/04/28 05:13:22
3	14	325.71449788200874	266.8660387296905	20/04/28 05:13:23
3	54	329.0533935951116	265.20577071730946	20/04/28 05:13:24
3	54	329.0533935951116	265.2057707173094	20/04/28 05:13:25
3	54	332.9065526505472	263.50534437986465	20/04/28 05:13:26
3	54	334.4407240787428	261.4032786809491	20/04/28 05:13:27
3	54	334.4407240787428	261.4032786809491	20/04/28 05:13:28
3	54	334.4407240787428	261.4032786809491	20/04/28 05:13:29
3	54	339.3775199660886	260.697329100326	20/04/28 05:13:30
3	42	341.52181416260896	259.72695997542405	20/04/28 05:13:31
3	54	345.98250818917177	261.859258749847	20/04/28 05:13:32
3	54	349.17477120857285	262.4807721885283	20/04/28 05:13:33
3	54	350.37914153837863	260.97432627346046	20/04/28 05:13:34
3	54	350.37914153837863	260.97432627346046	20/04/28 05:13:35
3	54	350.37914153837863	260.97432627346046	20/04/28 05:13:36
3	54	354.93110780732565	263.85962413987545	20/04/28 05:13:37
3	8	357.87501606482897	266.0533751351783	20/04/28 05:13:38
3	54	358.23287936641947	263.0061707425011	20/04/28 05:13:39
3	54	359.56855835216805	263.2279362811352	20/04/28 05:13:40
3	34	362.2167196060361	259.70189758364177	20/04/28 05:13:41
3	34	361.2642468288334	255.55936173685845	20/04/28 05:13:42
3	34	361.2642468288334	255.55936173685845	20/04/28 05:13:43
3	34	361.2642468288334	255.55936173685845	20/04/28 05:13:44
3	34	361.2642468288334	255.55936173685845	20/04/28 05:13:45
3	34	361.2642468288334	255.55936173685845	20/04/28 05:13:46
3	34	361.2642468288334	255.55936173685845	20/04/28 05:13:47
3	34	361.2642468288334	255.55936173685845	20/04/28 05:13:48
3	34	361.2642468288334	255.55936173685845	20/04/28 05:13:49
3	34	361.2642468288334	255.55936173685845	20/04/28 05:13:50
3	34	361.2642468288334	255.55936173685845	20/04/28 05:13:51
3	34	361.2642468288334	255.55936173685845	20/04/28 05:13:52
3	34	361.2642468288334	255.55936173685845	20/04/28 05:13:53
3	34	361.2642468288334	255.55936173685845	20/04/28 05:13:54
3	34	361.2642468288334	255.55936173685848	20/04/28 05:13:55
3	34	361.2642468288334	255.55936173685845	20/04/28 05:13:56
3	34	362.2167196060361	259.70189758364177	20/04/28 05:13:57
3	54	359.56855835216805	263.2279362811352	20/04/28 05:13:58
3	54	359.56855835216805	263.2279362811352	20/04/28 05:13:59
3	54	353.6323218099388	263.1854862931738	20/04/28 05:14:00
3	54	352.9059324522066	261.07811147821695	20/04/28 05:14:01
3	42	352.0898782617341	257.6816897320676	20/04/28 05:14:02
3	42	352.0898782617341	257.6816897320676	20/04/28 05:14:03
3	68	355.5701928050021	256.31045579772257	20/04/28 05:14:04
3	68	357.80003138449274	255.68897868820252	20/04/28 05:14:05
3	84	357.1311797592782	253.49332104078317	20/04/28 05:14:06
3	84	357.1311797592782	253.49332104078317	20/04/28 05:14:07
3	17	359.96968039487183	251.3655491305634	20/04/28 05:14:08
3	30	360.46690033995947	246.70758975930266	20/04/28 05:14:09
3	23	361.39171706234237	243.1777661478346	20/04/28 05:14:10
3	23	361.39171706234237	243.1777661478346	20/04/28 05:14:11
3	23	361.39171706234237	243.1777661478346	20/04/28 05:14:12
3	23	361.39171706234237	243.1777661478346	20/04/28 05:14:13
3	23	361.39171706234237	243.1777661478346	20/04/28 05:14:14
3	23	362.7432195844349	240.9347338855629	20/04/28 05:14:15
3	23	362.7432195844349	240.9347338855629	20/04/28 05:14:16
3	23	361.39171706234237	243.1777661478346	20/04/28 05:14:17
3	23	361.39171706234237	243.1777661478346	20/04/28 05:14:18
3	23	360.23406947147583	243.86796499322614	20/04/28 05:14:19
3	23	361.39171706234237	243.1777661478346	20/04/28 05:14:20
3	23	361.39171706234237	243.1777661478346	20/04/28 05:14:21
3	23	362.7432195844349	240.9347338855629	20/04/28 05:14:22
3	23	361.39171706234237	243.1777661478346	20/04/28 05:14:23
3	23	361.39171706234237	243.1777661478346	20/04/28 05:14:24
3	23	361.39171706234237	243.1777661478346	20/04/28 05:14:25
3	23	361.39171706234237	243.1777661478346	20/04/28 05:14:26
3	23	361.39171706234237	243.1777661478346	20/04/28 05:14:27
3	23	361.39171706234237	243.1777661478346	20/04/28 05:14:28
3	23	361.39171706234237	243.1777661478346	20/04/28 05:14:29
3	23	361.39171706234237	243.1777661478346	20/04/28 05:14:30
3	23	361.39171706234237	243.1777661478346	20/04/28 05:14:31
3	23	361.39171706234237	243.1777661478346	20/04/28 05:14:32
3	23	360.23406947147583	243.86796499322614	20/04/28 05:14:33
3	23	361.39171706234237	243.1777661478346	20/04/28 05:14:34
3	23	360.23406947147583	243.86796499322614	20/04/28 05:14:35
3	23	361.39171706234237	243.1777661478346	20/04/28 05:14:36
3	23	361.39171706234237	243.1777661478346	20/04/28 05:14:37
3	23	361.39171706234237	243.1777661478346	20/04/28 05:14:38
3	23	361.39171706234237	243.1777661478346	20/04/28 05:14:39
3	23	361.39171706234237	243.1777661478346	20/04/28 05:14:40
3	23	361.39171706234237	243.1777661478346	20/04/28 05:14:41
3	23	361.39171706234237	243.1777661478346	20/04/28 05:14:42
3	23	361.39171706234237	243.1777661478346	20/04/28 05:14:43
3	23	361.39171706234237	243.1777661478346	20/04/28 05:14:44
3	23	361.39171706234237	243.1777661478346	20/04/28 05:14:45
3	23	361.39171706234237	243.1777661478346	20/04/28 05:14:46
3	23	362.7432195844349	240.9347338855629	20/04/28 05:14:47
3	23	361.39171706234237	243.1777661478346	20/04/28 05:14:48
3	23	362.7432195844349	240.9347338855629	20/04/28 05:14:49
3	23	361.39171706234237	243.1777661478346	20/04/28 05:14:50
3	23	361.39171706234237	243.1777661478346	20/04/28 05:14:51
3	23	361.39171706234237	243.1777661478346	20/04/28 05:14:52
3	23	362.7432195844349	240.9347338855629	20/04/28 05:14:53
3	23	362.7432195844349	240.9347338855629	20/04/28 05:14:54
3	23	361.39171706234237	243.1777661478346	20/04/28 05:14:55
3	23	360.23406947147583	243.86796499322614	20/04/28 05:14:56
3	30	360.46690033995947	246.70758975930266	20/04/28 05:14:57
3	17	359.96968039487183	251.3655491305634	20/04/28 05:14:58
3	84	357.1311797592782	253.49332104078317	20/04/28 05:14:59
3	68	354.08131374203464	255.73290488058714	20/04/28 05:15:00
3	68	354.08131374203464	255.73290488058714	20/04/28 05:15:01
3	42	352.0898782617341	257.6816897320676	20/04/28 05:15:02
3	42	352.0898782617341	257.6816897320676	20/04/28 05:15:03
3	42	352.20974435218506	259.0612514241787	20/04/28 05:15:04
3	54	350.37914153837863	260.97432627346046	20/04/28 05:15:05
3	54	350.37914153837863	260.97432627346046	20/04/28 05:15:06
3	42	347.1868785189775	260.3528128347792	20/04/28 05:15:07
3	42	341.52181416260896	259.72695997542405	20/04/28 05:15:08
3	99	339.59375125487367	258.8166372045796	20/04/28 05:15:09
3	NULL	337.70753542622793	260.4595329480968	20/04/28 05:15:10
3	54	334.4407240787428	261.4032786809491	20/04/28 05:15:11
3	54	334.4407240787428	261.4032786809491	20/04/28 05:15:12
3	54	334.4407240787428	261.4032786809491	20/04/28 05:15:13
3	54	329.63052872625184	261.159270734312	20/04/28 05:15:14
3	54	327.3540763805351	261.10723770774325	20/04/28 05:15:15
3	54	327.3540763805351	261.1072377077433	20/04/28 05:15:16
3	54	324.0151806674323	262.76750572012435	20/04/28 05:15:17
3	54	324.01518066743233	262.76750572012435	20/04/28 05:15:18
3	18	322.99113575264545	265.5352298501222	20/04/28 05:15:19
1	81	317.52635698315385	260.75405889490565	20/04/28 05:15:20
1	81	317.5263569831538	260.75405889490565	20/04/28 05:15:21
1	81	315.74240883925677	260.5181275582284	20/04/28 05:15:22
1	81	312.6019130172586	265.6450929868838	20/04/28 05:15:23
3	51	312.6019130172586	265.6450929868838	20/04/28 05:15:24
1	98	305.42047124180004	265.2616066172563	20/04/28 05:15:25
3	47	302.8570592601016	265.6207358146814	20/04/28 05:15:26
3	47	302.8570592601016	265.6207358146814	20/04/28 05:15:27
1	98	303.28594423312194	264.61216223098285	20/04/28 05:15:28
1	98	303.28594423312194	264.61216223098285	20/04/28 05:15:29
1	98	303.28594423312194	264.61216223098285	20/04/28 05:15:30
1	56	307.159840217744	263.3357311024059	20/04/28 05:15:31
1	81	311.65911721261057	263.4112042347413	20/04/28 05:15:32
1	81	313.2523840549326	264.4074609667819	20/04/28 05:15:33
1	81	314.50318194109644	265.02915212402996	20/04/28 05:15:34
1	81	314.50318194109644	265.02915212402996	20/04/28 05:15:35
1	81	316.8584991431141	264.5437756453438	20/04/28 05:15:36
1	56	319.89662212153377	266.1573209564685	20/04/28 05:15:37
1	56	319.89662212153377	266.1573209564685	20/04/28 05:15:38
1	72	322.34915620924	265.0152899264337	20/04/28 05:15:39
1	37	323.6597216964546	264.1572674834102	20/04/28 05:15:40
1	56	328.05325631908096	266.7867136169031	20/04/28 05:15:41
1	NULL	331.9249996219656	268.73042370731713	20/04/28 05:15:42
1	NULL	331.9249996219656	268.73042370731713	20/04/28 05:15:43
1	NULL	331.9249996219656	268.73042370731713	20/04/28 05:15:44
1	29	332.11202638116566	272.3894277766605	20/04/28 05:15:45
1	29	333.41684249911117	274.9598401222384	20/04/28 05:15:46
1	29	333.41684249911117	274.9598401222384	20/04/28 05:15:47
1	29	333.41684249911117	274.9598401222384	20/04/28 05:15:48
1	29	333.41684249911117	274.9598401222384	20/04/28 05:15:49
1	29	333.41684249911117	274.9598401222384	20/04/28 05:15:50
1	29	333.41684249911117	274.9598401222384	20/04/28 05:15:51
1	29	333.41684249911117	274.9598401222384	20/04/28 05:15:52
1	29	333.41684249911117	274.9598401222384	20/04/28 05:15:53
1	29	333.41684249911117	274.9598401222384	20/04/28 05:15:54
1	29	333.41684249911117	274.9598401222384	20/04/28 05:15:55
1	29	333.41684249911117	274.9598401222384	20/04/28 05:15:56
1	29	333.41684249911117	274.9598401222384	20/04/28 05:15:57
1	29	333.41684249911117	274.9598401222384	20/04/28 05:15:58
1	29	333.41684249911117	274.9598401222384	20/04/28 05:15:59
1	29	333.41684249911117	274.9598401222384	20/04/28 05:16:00
1	29	333.41684249911117	274.9598401222384	20/04/28 05:16:01
1	29	333.41684249911117	274.9598401222384	20/04/28 05:16:02
1	29	333.41684249911117	274.9598401222384	20/04/28 05:16:03
1	29	333.41684249911117	274.9598401222384	20/04/28 05:16:04
1	29	333.41684249911117	274.9598401222384	20/04/28 05:16:05
1	29	333.41684249911117	274.9598401222384	20/04/28 05:16:06
1	29	333.41684249911117	274.9598401222384	20/04/28 05:16:07
1	29	333.41684249911117	274.9598401222384	20/04/28 05:16:08
1	29	332.7456299918409	278.40940910115313	20/04/28 05:16:09
1	29	332.7456299918409	278.40940910115313	20/04/28 05:16:10
1	29	332.7456299918409	278.40940910115313	20/04/28 05:16:11
1	29	333.41684249911117	274.9598401222384	20/04/28 05:16:12
1	29	332.7456299918409	278.40940910115313	20/04/28 05:16:13
1	29	332.7456299918409	278.40940910115313	20/04/28 05:16:14
1	29	333.41684249911117	274.9598401222384	20/04/28 05:16:15
1	29	333.41684249911117	274.9598401222384	20/04/28 05:16:16
1	29	333.41684249911117	274.9598401222384	20/04/28 05:16:17
1	29	333.41684249911117	274.9598401222384	20/04/28 05:16:18
1	29	333.41684249911117	274.9598401222384	20/04/28 05:16:19
1	29	333.41684249911117	274.9598401222384	20/04/28 05:16:20
1	29	333.41684249911117	274.9598401222384	20/04/28 05:16:21
1	29	333.41684249911117	274.9598401222384	20/04/28 05:16:22
