floorId	partitionId	location_x	location_y	timeStamp
1	93	329.50640292751115	296.7676251224773	20/04/28 05:16:02
1	93	329.50640292751115	296.7676251224773	20/04/28 05:16:02
1	93	329.5603101608619	296.6993018715962	20/04/28 05:16:02
1	93	329.51326652437666	296.6852063268701	20/04/28 05:16:02
1	93	329.5087161100155	296.6747557201366	20/04/28 05:16:02
1	93	329.5087161100155	296.6747557201366	20/04/28 05:16:02
1	93	329.5100078177034	296.6781685802964	20/04/28 05:16:03
1	93	329.5818051622857	296.6657341044778	20/04/28 05:16:03
1	93	329.51256195748624	296.65208857883204	20/04/28 05:16:03
1	93	329.7103402765895	296.519937074177	20/04/28 05:16:03
1	93	329.8864805546617	296.5749849928495	20/04/28 05:16:03
1	93	329.7808922485269	296.35241211342907	20/04/28 05:16:03
1	93	329.85325142244983	296.38625289119807	20/04/28 05:16:03
1	93	329.74917220710626	296.39121782250066	20/04/28 05:16:03
1	93	329.88438819039817	296.55213874900465	20/04/28 05:16:03
1	93	329.94214906621454	296.5704253645497	20/04/28 05:16:03
1	93	329.93537352908635	296.5485302332582	20/04/28 05:16:04
1	93	329.9421152648156	296.517505017197	20/04/28 05:16:04
1	93	330.0283725672729	296.4709891787997	20/04/28 05:16:04
1	93	330.1546455963459	296.6186324827644	20/04/28 05:16:04
1	93	330.2739329071045	296.60160463958215	20/04/28 05:16:04
1	93	330.49305648306466	296.6701066537318	20/04/28 05:16:04
1	93	330.5309197431436	296.5115442309423	20/04/28 05:16:04
1	93	330.5057440889356	296.5302996945354	20/04/28 05:16:04
1	93	330.5310583999482	296.5205195957596	20/04/28 05:16:04
1	93	330.4867985273808	296.7229120395731	20/04/28 05:16:04
1	93	330.6290188947955	296.5727714071598	20/04/28 05:16:05
1	93	330.43598643070027	296.62902552999566	20/04/28 05:16:05
1	93	330.48036297754334	296.41267374018946	20/04/28 05:16:05
1	93	330.5133183410565	296.4599450969327	20/04/28 05:16:05
1	93	330.7736055655886	296.5350345720203	20/04/28 05:16:05
1	93	330.7060598173221	296.5614083642056	20/04/28 05:16:05
1	93	330.8828959506634	296.54337616532365	20/04/28 05:16:05
1	93	330.8230456026636	296.39205118485995	20/04/28 05:16:05
1	93	330.76831772086047	296.4255103627112	20/04/28 05:16:05
1	93	330.7296998737439	296.53333623511145	20/04/28 05:16:06
1	93	330.71810316004047	296.8313879819482	20/04/28 05:16:06
1	93	330.88156260046037	296.66349404499283	20/04/28 05:16:06
1	93	330.9148776568158	296.6643509223795	20/04/28 05:16:06
1	93	330.8711099566288	296.58278689830223	20/04/28 05:16:06
1	93	330.79301066615926	296.4452799574329	20/04/28 05:16:06
1	93	330.6405194544957	296.4500937050891	20/04/28 05:16:06
1	93	330.77077696642925	296.3974915712123	20/04/28 05:16:06
1	93	330.8627011789865	296.39373187643713	20/04/28 05:16:06
1	93	330.8575977834951	296.3949864359683	20/04/28 05:16:06
1	93	330.7865218753891	296.4730666829362	20/04/28 05:16:07
1	93	330.8624249446693	296.4379742764936	20/04/28 05:16:07
1	93	330.9241388937995	296.3036423344426	20/04/28 05:16:07
1	93	330.9241388937995	296.3036423344426	20/04/28 05:16:07
1	93	331.0305650953718	296.1375252738008	20/04/28 05:16:07
1	93	330.9674712756304	296.19268741166064	20/04/28 05:16:07
1	93	330.8844502764403	296.16983356013225	20/04/28 05:16:07
1	93	331.0197544942116	296.031001509717	20/04/28 05:16:07
1	93	331.0217726314998	295.9984625056061	20/04/28 05:16:07
1	93	331.2397773269503	295.87238371479293	20/04/28 05:16:07
1	93	331.18150998883067	296.00255642097017	20/04/28 05:16:08
1	93	331.2369611723029	296.07946087914434	20/04/28 05:16:08
1	93	331.4393741259603	296.0387075264342	20/04/28 05:16:08
1	93	331.4435340665312	296.28439583195365	20/04/28 05:16:08
1	93	331.41338347388034	296.2593257122126	20/04/28 05:16:08
1	93	331.4562782866173	296.2023333056291	20/04/28 05:16:08
1	93	331.5417912947399	295.98013953834004	20/04/28 05:16:08
1	93	331.560143950853	296.16695844518455	20/04/28 05:16:08
1	93	331.64177556415507	296.1948054467118	20/04/28 05:16:08
1	93	331.5445578844425	296.3563530442347	20/04/28 05:16:09
1	93	331.56869428954184	296.2450953258824	20/04/28 05:16:09
1	93	331.44459710486194	296.4582764629912	20/04/28 05:16:09
1	93	331.4464818364335	296.62588928284345	20/04/28 05:16:09
1	93	331.640230382107	296.4449735630705	20/04/28 05:16:09
1	93	331.63068927654	296.373487717758	20/04/28 05:16:09
1	93	331.5182095317444	296.38892345776594	20/04/28 05:16:09
1	93	331.76824625389804	296.44742341975774	20/04/28 05:16:09
1	93	331.6724483696248	296.25373664489234	20/04/28 05:16:09
1	93	331.646228357459	296.26395422680446	20/04/28 05:16:09
1	93	331.5385667470005	296.21686876268745	20/04/28 05:16:10
1	93	331.52315819847394	296.02130156515153	20/04/28 05:16:10
1	93	331.3042198988734	295.82684219846607	20/04/28 05:16:10
1	93	331.420071030319	295.63382338169447	20/04/28 05:16:10
1	93	331.18605232698667	295.57172879280733	20/04/28 05:16:10
1	93	331.38992705596627	295.7137135410621	20/04/28 05:16:10
1	93	331.3430239965468	295.69913330681277	20/04/28 05:16:10
1	93	331.4630743494606	295.88534989607155	20/04/28 05:16:10
1	93	331.505171862744	296.0829147802618	20/04/28 05:16:10
1	93	331.6366733507382	296.21025123021496	20/04/28 05:16:10
1	93	331.61637635183695	296.4162335233924	20/04/28 05:16:11
1	93	331.69318679618874	296.6999181553554	20/04/28 05:16:11
1	93	331.57568906746883	296.7397948236907	20/04/28 05:16:11
1	93	331.5802656888439	296.69234205191896	20/04/28 05:16:11
1	93	331.5615455285278	296.7389354554253	20/04/28 05:16:11
1	93	331.53704840707854	296.7829696336135	20/04/28 05:16:11
1	93	331.4054443979234	296.58762317693845	20/04/28 05:16:11
1	93	331.2520985741812	296.5352787375845	20/04/28 05:16:11
1	93	331.0110102687094	296.54091148599997	20/04/28 05:16:11
1	93	331.01821831315664	296.54986969409595	20/04/28 05:16:12
1	93	331.01084546220426	296.7066715809558	20/04/28 05:16:12
1	93	330.9912399588549	296.80260875556877	20/04/28 05:16:12
1	93	330.8493245242006	296.8932392835402	20/04/28 05:16:12
1	93	330.82581496396006	296.91768185230694	20/04/28 05:16:12
1	93	330.81417390407165	297.0501208456025	20/04/28 05:16:12
1	93	330.8518887195711	297.027010388802	20/04/28 05:16:12
1	93	330.83929432759794	297.0192971771507	20/04/28 05:16:12
1	93	330.99697978736737	296.80442849045517	20/04/28 05:16:12
1	93	330.81213068346295	296.9604582131365	20/04/28 05:16:12
1	93	330.7933866142174	296.95570002580246	20/04/28 05:16:13
1	93	330.59510370727594	296.7672241900887	20/04/28 05:16:13
1	93	330.57469846038134	296.73177057852587	20/04/28 05:16:13
1	93	330.5622247938552	296.7689476649362	20/04/28 05:16:13
1	93	330.52267505626264	296.9772518126292	20/04/28 05:16:13
1	93	330.46136275293867	297.00041774524675	20/04/28 05:16:13
1	93	330.3129929768276	296.7453641816767	20/04/28 05:16:13
1	93	330.2210507768883	296.68555472931985	20/04/28 05:16:13
1	93	330.23073026412885	296.5615887976543	20/04/28 05:16:13
1	93	330.3714280847505	296.5527109865373	20/04/28 05:16:13
1	93	330.4115269610007	296.58704826663296	20/04/28 05:16:14
1	93	330.4158531115321	296.7109777743289	20/04/28 05:16:14
1	93	330.33166365276156	296.85545990092083	20/04/28 05:16:14
1	93	330.2398349780725	296.9793334577498	20/04/28 05:16:14
1	93	330.26885539503996	296.97537835457894	20/04/28 05:16:14
1	93	330.43005869520573	296.96625256654846	20/04/28 05:16:14
1	93	330.29930452041094	296.8430216969114	20/04/28 05:16:14
1	93	330.2113057542438	296.88993399163513	20/04/28 05:16:14
1	93	330.0739313907964	296.63939940918505	20/04/28 05:16:14
1	93	329.8845833823878	296.4216157224866	20/04/28 05:16:15
1	93	329.9870342467946	296.3763505460215	20/04/28 05:16:15
1	93	330.02837771652565	296.498682562601	20/04/28 05:16:15
1	93	329.90367529558347	296.68599526659455	20/04/28 05:16:15
1	93	330.03246607244637	296.88501683373124	20/04/28 05:16:15
1	93	330.008730370699	297.056941818504	20/04/28 05:16:15
1	93	329.8616541275624	297.2095949127711	20/04/28 05:16:15
1	93	329.8616846701548	297.20921500372685	20/04/28 05:16:15
1	93	329.85917540926454	297.230281921149	20/04/28 05:16:15
1	93	329.7121343599216	297.296904794433	20/04/28 05:16:15
1	93	329.6865407755772	297.36582347581003	20/04/28 05:16:16
1	93	329.781704070638	297.4342716574037	20/04/28 05:16:16
1	93	329.68247825730487	297.41076198454215	20/04/28 05:16:16
1	93	329.6918272341884	297.2974226552765	20/04/28 05:16:16
1	93	329.6022567879807	297.47468317687543	20/04/28 05:16:16
1	93	329.7806490530464	297.2588132656575	20/04/28 05:16:16
1	93	329.6993316272014	297.5348951389649	20/04/28 05:16:16
1	93	329.92461576940633	297.3373149537156	20/04/28 05:16:16
1	93	330.1250354976781	297.12995980883414	20/04/28 05:16:16
1	93	330.21652184163304	296.9935032556178	20/04/28 05:16:16
1	93	330.14057792534464	296.96076849040554	20/04/28 05:16:17
1	93	330.3313987414443	296.8791366749548	20/04/28 05:16:17
1	93	330.39012021234277	296.6920180518407	20/04/28 05:16:17
1	93	330.4371601183709	296.5283819654121	20/04/28 05:16:17
1	93	330.29387534121685	296.7172637919247	20/04/28 05:16:17
1	93	330.5195054450482	296.78445955066815	20/04/28 05:16:17
1	93	330.565397775101	296.60155855171485	20/04/28 05:16:17
1	93	330.350346663207	296.4329528969847	20/04/28 05:16:17
1	93	330.46190901731	296.2156147880279	20/04/28 05:16:17
1	93	330.4553761223647	296.19792520390286	20/04/28 05:16:18
1	93	330.37958908558767	296.09176796995257	20/04/28 05:16:18
1	93	330.3683571351934	296.1229659934932	20/04/28 05:16:18
1	93	330.35441832751275	296.150591145644	20/04/28 05:16:18
1	93	330.3594797151708	296.1408834861669	20/04/28 05:16:18
1	93	330.30429279094466	296.4131387118778	20/04/28 05:16:18
1	93	330.2673244979182	296.6378409830272	20/04/28 05:16:18
1	93	330.1378521768473	296.8656547607173	20/04/28 05:16:18
1	93	330.0878023942001	296.90152513938597	20/04/28 05:16:18
1	93	330.1246015220605	297.1144539814803	20/04/28 05:16:18
1	93	330.0647856120769	297.3994102165013	20/04/28 05:16:19
1	93	329.9826319073894	297.33217311389296	20/04/28 05:16:19
1	93	329.98347588910474	297.37523700911396	20/04/28 05:16:19
1	93	329.9447058260928	297.2895275273797	20/04/28 05:16:19
1	93	329.88576891349925	297.29075232783947	20/04/28 05:16:19
1	93	330.12692713843313	297.2481150234443	20/04/28 05:16:19
1	93	330.1956321853953	297.37690716220266	20/04/28 05:16:19
1	93	330.1537961437558	297.3702751134827	20/04/28 05:16:19
1	93	330.3394350922175	297.55832056527726	20/04/28 05:16:19
1	93	330.2252835683709	297.7229169349193	20/04/28 05:16:19
1	93	330.0759502121552	297.6636557799518	20/04/28 05:16:20
1	93	330.0759502121552	297.6636557799518	20/04/28 05:16:20
1	93	330.0759502121552	297.6636557799518	20/04/28 05:16:20
1	93	330.17593628790826	297.5974330374909	20/04/28 05:16:20
1	93	330.19373947678065	297.7993471175259	20/04/28 05:16:20
1	93	330.23431683061267	297.78714544187335	20/04/28 05:16:20
1	93	330.2072928738537	297.75464019494405	20/04/28 05:16:20
1	93	330.2698946781652	297.84088539190094	20/04/28 05:16:20
1	93	330.0859478257048	297.85572214299486	20/04/28 05:16:20
1	93	330.0641577455699	297.83833030605734	20/04/28 05:16:21
1	93	330.2848490090872	297.9041001520517	20/04/28 05:16:21
1	93	330.27016990229436	297.93462449723097	20/04/28 05:16:21
1	93	330.17775400621474	297.76373520829287	20/04/28 05:16:21
1	93	330.1108891914684	297.9200847603897	20/04/28 05:16:21
1	93	330.07053014652325	297.7294897304825	20/04/28 05:16:21
1	93	329.9661510296944	297.59330989302356	20/04/28 05:16:21
1	93	330.01858252240044	297.6799064138071	20/04/28 05:16:21
1	93	329.96442184263356	297.7359397257076	20/04/28 05:16:21
1	93	330.0874898821317	297.62216506148536	20/04/28 05:16:21
1	93	330.0901562379983	297.6143510421773	20/04/28 05:16:22
1	93	330.01416003052896	297.7295677275042	20/04/28 05:16:22
1	93	329.97313558260714	297.6116665774293	20/04/28 05:16:22
1	93	329.98160142098556	297.61244583555975	20/04/28 05:16:22
1	93	330.0951856148477	297.8181708004624	20/04/28 05:16:22
1	93	329.9822189082392	298.0240694921765	20/04/28 05:16:22
1	93	329.7374048538914	298.002995368574	20/04/28 05:16:22
1	93	329.5718932479437	298.0137392761245	20/04/28 05:16:22
1	93	329.5743906614586	298.09110552024697	20/04/28 05:16:22
1	93	329.4774536082877	297.96108820784457	20/04/28 05:16:22
1	93	329.4956692889118	298.0095464228735	20/04/28 05:16:23
1	93	329.4854457408149	298.10237655224927	20/04/28 05:16:23
1	93	329.4544823168052	298.1018925641219	20/04/28 05:16:23
1	93	329.4544823168052	298.1018925641219	20/04/28 05:16:23
1	93	329.4544823168052	298.1018925641219	20/04/28 05:16:23
1	93	329.3291676896324	298.1353861373307	20/04/28 05:16:23
1	93	329.34000106720185	298.24574767013166	20/04/28 05:16:23
1	93	329.4499441398602	298.0767243515885	20/04/28 05:16:23
1	93	329.2805743308825	297.95071833434815	20/04/28 05:16:23
1	93	329.1322941811663	298.2097854359696	20/04/28 05:16:24
1	93	329.20494452755986	298.0585710573872	20/04/28 05:16:24
1	93	329.04156879501596	297.8191622310547	20/04/28 05:16:24
1	93	329.0006235030997	297.62697945183015	20/04/28 05:16:24
1	93	329.0414149368874	297.6226793805093	20/04/28 05:16:24
1	93	329.16278795497925	297.87290720424903	20/04/28 05:16:24
1	93	328.893273914673	297.88249219396255	20/04/28 05:16:24
1	93	328.8810081840364	297.6914566216528	20/04/28 05:16:24
1	93	328.72360674852365	297.48279349247235	20/04/28 05:16:24
1	93	328.7504090794187	297.47297972577724	20/04/28 05:16:24
1	93	328.76297000133684	297.34296860942203	20/04/28 05:16:25
1	93	328.59648082023705	297.213620264329	20/04/28 05:16:25
1	93	328.6351892693982	297.3952018887957	20/04/28 05:16:25
1	93	328.35210948499554	297.30072987083514	20/04/28 05:16:25
1	93	328.36344421317716	297.2236734476347	20/04/28 05:16:25
1	93	328.5877901232315	297.2537028417523	20/04/28 05:16:25
1	93	328.4073135877321	297.3637032052942	20/04/28 05:16:25
1	93	328.6795015694468	297.4070407392089	20/04/28 05:16:25
1	93	328.65680465698614	297.6439460326969	20/04/28 05:16:25
1	93	328.5654277845519	297.45087436853277	20/04/28 05:16:25
1	93	328.5811207741387	297.4600765882568	20/04/28 05:16:26
1	93	328.5708386976823	297.4252164779991	20/04/28 05:16:26
1	93	328.5468640793621	297.5061734464317	20/04/28 05:16:26
1	93	328.5387348956535	297.50129461705086	20/04/28 05:16:26
1	93	328.5892744487744	297.5227899698884	20/04/28 05:16:26
1	93	328.5379193068007	297.80510488679454	20/04/28 05:16:26
1	93	328.54417105904537	297.8094131307659	20/04/28 05:16:26
1	93	328.3577745361504	297.6716877884077	20/04/28 05:16:26
1	93	328.1168608921851	297.690554200765	20/04/28 05:16:26
1	93	328.12766657730003	297.7062397828017	20/04/28 05:16:27
1	93	328.1359796960427	297.70716196314856	20/04/28 05:16:27
1	93	328.14830509827453	297.99375270220975	20/04/28 05:16:27
1	93	327.9781428210919	297.94551385210036	20/04/28 05:16:27
1	93	328.10934741445436	298.0045361190945	20/04/28 05:16:27
1	93	328.2841294397737	298.1047471707941	20/04/28 05:16:27
1	93	328.13739587761563	298.2344263269031	20/04/28 05:16:27
1	93	328.0555950132368	298.1778454131706	20/04/28 05:16:27
1	93	327.92644926719805	298.35387247015746	20/04/28 05:16:27
1	93	327.8834574026548	298.2644674692105	20/04/28 05:16:27
1	93	327.87672844007415	298.2601852315315	20/04/28 05:16:28
1	93	327.8041957361135	298.24566130588323	20/04/28 05:16:28
1	93	327.83948261531657	298.2735704294352	20/04/28 05:16:28
1	93	327.91607830310994	298.14993066952894	20/04/28 05:16:28
1	93	327.7202267732798	298.33969177034277	20/04/28 05:16:28
1	93	327.47736690985874	298.2681005202363	20/04/28 05:16:28
1	93	327.4871342152387	298.3493922664918	20/04/28 05:16:28
1	93	327.4844895985811	298.3488144940551	20/04/28 05:16:28
1	93	327.40392566687785	298.3440968691193	20/04/28 05:16:28
1	93	327.2875533975901	298.3645553410031	20/04/28 05:16:28
1	93	327.3536916502014	298.17922529412533	20/04/28 05:16:29
1	93	327.49296646534424	298.249616604107	20/04/28 05:16:29
1	93	327.2956499107518	298.25268050638584	20/04/28 05:16:29
1	93	327.1550021608109	298.37411485938674	20/04/28 05:16:29
1	93	327.17429106712376	298.38908590727664	20/04/28 05:16:29
1	93	327.1764564129952	298.5841334593693	20/04/28 05:16:29
1	93	327.00653459218114	298.43107169619884	20/04/28 05:16:29
1	93	326.94487830171005	298.4397052514435	20/04/28 05:16:29
1	93	326.918818889836	298.21835606331143	20/04/28 05:16:29
1	93	326.9045341927003	298.2554650850603	20/04/28 05:16:30
1	93	327.114810890771	298.26137809564364	20/04/28 05:16:30
1	93	327.1946373332199	298.0665508004325	20/04/28 05:16:30
1	93	327.18672717722086	297.93864345380143	20/04/28 05:16:30
1	93	327.08953307537723	298.05266120486726	20/04/28 05:16:30
1	93	326.93013553344764	298.04397144506873	20/04/28 05:16:30
1	93	326.92146745988026	298.26640933118597	20/04/28 05:16:30
1	93	327.001918308876	298.03065448039587	20/04/28 05:16:30
1	93	326.9447379560223	298.01137595284735	20/04/28 05:16:30
1	93	327.05320836125867	297.95434630711725	20/04/28 05:16:30
1	93	327.05564004433114	297.95762398378315	20/04/28 05:16:31
1	93	327.0525690367063	297.9617612776088	20/04/28 05:16:31
1	93	327.0756921081618	297.9955930907988	20/04/28 05:16:31
1	93	327.0795187542652	297.98915987274086	20/04/28 05:16:31
1	93	327.059221577537	298.17915477679213	20/04/28 05:16:31
1	93	327.08460155947625	297.9757197447532	20/04/28 05:16:31
1	93	327.0284182118843	298.0168986338341	20/04/28 05:16:31
1	93	327.0273872392246	298.01130265238174	20/04/28 05:16:31
1	93	326.9578507635197	298.0669139815652	20/04/28 05:16:31
1	93	326.97847513596025	298.297086241849	20/04/28 05:16:31
1	93	326.73137210652374	298.310399446175	20/04/28 05:16:32
1	93	326.4731433675862	298.3565896087122	20/04/28 05:16:32
1	93	326.51106939101726	298.2202088250853	20/04/28 05:16:32
1	93	326.6980901037529	298.2918615190949	20/04/28 05:16:32
1	93	326.8396614114857	298.073332165293	20/04/28 05:16:32
1	93	326.69013432736557	298.00392399152025	20/04/28 05:16:32
1	93	326.49579020756005	297.86798444755885	20/04/28 05:16:32
1	93	326.1987308894914	297.89669051423874	20/04/28 05:16:32
1	93	325.99768305927006	297.73585300191417	20/04/28 05:16:32
1	93	325.9267718316172	297.7244497489811	20/04/28 05:16:33
1	93	325.8878447168317	297.88413983093056	20/04/28 05:16:33
1	93	325.9216325415802	298.0764303034502	20/04/28 05:16:33
1	93	326.003596146481	297.91095430478083	20/04/28 05:16:33
1	93	325.9284439342751	297.9820101331679	20/04/28 05:16:33
1	93	325.8348894059021	298.1364654556236	20/04/28 05:16:33
1	93	325.9730148722926	298.27959957513343	20/04/28 05:16:33
1	93	325.929317778845	298.1687553530554	20/04/28 05:16:33
1	93	326.14217058663525	298.21702892526287	20/04/28 05:16:33
1	93	326.1393448356483	298.151925507849	20/04/28 05:16:33
1	93	326.223509014841	298.02463158108185	20/04/28 05:16:34
1	93	326.2726492441972	297.7859484137368	20/04/28 05:16:34
1	93	326.44241871477084	297.63151752562703	20/04/28 05:16:34
1	93	326.2461979209468	297.80170051883033	20/04/28 05:16:34
1	93	326.3596446715416	297.86882770332716	20/04/28 05:16:34
1	93	326.5040501939317	297.78971952508476	20/04/28 05:16:34
1	93	326.6594271511222	297.7794205903207	20/04/28 05:16:34
1	93	326.8254204041711	297.7036535945405	20/04/28 05:16:34
1	93	326.812706154222	297.80107229050515	20/04/28 05:16:34
1	93	326.94666546232384	297.6512855873655	20/04/28 05:16:34
1	93	326.9264409909174	297.4847894458368	20/04/28 05:16:35
1	93	326.8987539882929	297.69088262818946	20/04/28 05:16:35
1	93	326.8585070645478	297.9112834648123	20/04/28 05:16:35
1	93	326.7657426529775	297.82711623202607	20/04/28 05:16:35
1	93	326.77965571303054	297.8192374733829	20/04/28 05:16:35
1	93	326.78511208247437	297.8466414625833	20/04/28 05:16:35
1	93	326.5599871828517	297.81649839617825	20/04/28 05:16:35
1	93	326.44038268328626	297.62052704848895	20/04/28 05:16:35
1	93	326.40967837665323	297.50856666222944	20/04/28 05:16:35
1	93	326.21548587048545	297.3272468922105	20/04/28 05:16:36
1	93	326.2412616011908	297.2886445409053	20/04/28 05:16:36
1	93	326.2591599707947	297.47842763524284	20/04/28 05:16:36
1	93	326.237834175637	297.5551022093594	20/04/28 05:16:36
1	93	326.11842410802416	297.3183297529051	20/04/28 05:16:36
1	93	325.9309462363603	297.5019740404322	20/04/28 05:16:36
1	93	325.95778331477425	297.7533034442343	20/04/28 05:16:36
1	93	325.96055750435943	297.8385522782982	20/04/28 05:16:36
1	93	326.19510452798784	297.8998832176137	20/04/28 05:16:36
1	93	326.32759178729486	297.7825596156378	20/04/28 05:16:36
1	93	326.18457600634565	297.74107855816874	20/04/28 05:16:37
1	93	326.2162386978434	297.806372051235	20/04/28 05:16:37
1	93	326.22170691337953	297.8358690924381	20/04/28 05:16:37
1	93	326.2010426409082	297.94470385490854	20/04/28 05:16:37
1	93	326.2581292741436	297.94540102400435	20/04/28 05:16:37
1	93	326.346209734637	297.7168168588344	20/04/28 05:16:37
1	93	326.33424506086277	297.79803886352	20/04/28 05:16:37
1	93	326.4500273718382	297.8720616764438	20/04/28 05:16:37
1	93	326.4447817063416	297.8402272961839	20/04/28 05:16:37
1	93	326.4341126024208	297.80261431776273	20/04/28 05:16:37
1	93	326.4181550003936	297.7785890903354	20/04/28 05:16:38
1	93	326.3196251304881	297.8892575805839	20/04/28 05:16:38
1	93	326.3068400309297	297.81245581370723	20/04/28 05:16:38
1	93	326.475831195856	297.7434076550985	20/04/28 05:16:38
1	93	326.475831195856	297.7434076550985	20/04/28 05:16:38
1	93	326.475831195856	297.7434076550985	20/04/28 05:16:38
1	93	326.46992342340195	297.84182126657225	20/04/28 05:16:38
1	93	326.44957633497074	297.90302640535054	20/04/28 05:16:38
1	93	326.3725473321858	297.9621685312751	20/04/28 05:16:38
1	93	326.6235236037676	297.9779519645733	20/04/28 05:16:39
1	93	326.7212948355394	298.001294143543	20/04/28 05:16:39
1	93	326.9122178651928	297.82982213205474	20/04/28 05:16:39
1	93	326.96691252319835	297.8935637099304	20/04/28 05:16:39
1	93	326.96746600113244	297.89294123638314	20/04/28 05:16:39
1	93	326.7131269085755	297.8226345342468	20/04/28 05:16:39
1	93	326.54650013749836	297.9345969844652	20/04/28 05:16:39
1	93	326.6333947258351	297.7801498599854	20/04/28 05:16:39
1	93	326.4561359153481	297.74846271679905	20/04/28 05:16:39
1	93	326.1977924037867	297.816640347623	20/04/28 05:16:39
1	93	326.19761636463835	297.8137382145481	20/04/28 05:16:40
1	93	326.2293249140105	297.91475641276264	20/04/28 05:16:40
1	93	325.9355716159012	297.94003950260054	20/04/28 05:16:40
1	93	326.1665517167223	297.9798309444752	20/04/28 05:16:40
1	93	325.9301383864167	297.9803989873162	20/04/28 05:16:40
1	93	325.67677375434283	297.88260815032703	20/04/28 05:16:40
1	93	325.6241384157068	297.80444399071314	20/04/28 05:16:40
1	93	325.3624895378032	297.7389666976101	20/04/28 05:16:40
1	93	325.30897024767563	297.78300018089834	20/04/28 05:16:40
1	93	325.4205061321318	297.78097397170836	20/04/28 05:16:40
1	93	325.4189535590331	297.78212867976265	20/04/28 05:16:41
1	93	325.4028157146331	297.76776900370965	20/04/28 05:16:41
1	93	325.4832538188898	297.68525813190087	20/04/28 05:16:41
1	93	325.4221957398571	297.83333217776624	20/04/28 05:16:41
1	93	325.3519409443656	297.6724897670452	20/04/28 05:16:41
1	93	325.5024100182855	297.90492887437836	20/04/28 05:16:41
1	93	325.51128956151354	297.8996205683583	20/04/28 05:16:41
1	93	325.5589100969903	297.9257090519648	20/04/28 05:16:41
1	93	325.60081549723094	297.8486979192959	20/04/28 05:16:41
1	93	325.6405353280283	297.8616023096924	20/04/28 05:16:41
1	93	325.8347450447277	298.0009403766604	20/04/28 05:16:42
1	93	325.74230371761456	298.1474931980604	20/04/28 05:16:42
1	93	325.86368863602405	297.902040190682	20/04/28 05:16:42
1	93	325.9093264080724	297.94029813708426	20/04/28 05:16:42
1	93	325.78942197248176	298.0307433010998	20/04/28 05:16:42
1	93	326.0160374840256	297.87586790146855	20/04/28 05:16:42
1	93	326.00481335198043	297.8184222339299	20/04/28 05:16:42
1	93	326.00865479441563	297.8437801016986	20/04/28 05:16:42
1	93	325.87488896571176	297.7591887662942	20/04/28 05:16:42
1	93	325.88275118517674	297.7664871437267	20/04/28 05:16:43
1	93	326.09615446963306	297.70895837728494	20/04/28 05:16:43
1	93	326.15544661227045	297.72043658018174	20/04/28 05:16:43
1	93	326.1220869832853	297.71228978243334	20/04/28 05:16:43
1	93	326.0943667380532	297.69845006819753	20/04/28 05:16:43
1	93	326.08577292390555	297.7551713195492	20/04/28 05:16:43
1	93	325.80405913961204	297.67893727852066	20/04/28 05:16:43
1	93	325.7271208430968	297.85873829003054	20/04/28 05:16:43
1	93	325.7274879747651	297.85858742785285	20/04/28 05:16:43
1	93	325.6329367186944	298.045590854623	20/04/28 05:16:43
1	93	325.5246581879621	297.790118277784	20/04/28 05:16:44
1	93	325.67732341692863	297.6090459535071	20/04/28 05:16:44
1	93	325.88327100917036	297.81049688488605	20/04/28 05:16:44
1	93	325.8856978027056	297.8121482144727	20/04/28 05:16:44
1	93	325.88699849529416	297.8126100096322	20/04/28 05:16:44
1	93	325.9427364311308	298.014210006331	20/04/28 05:16:44
1	93	325.98497549391095	298.01262129567635	20/04/28 05:16:44
1	93	325.9438619911442	297.9663093074837	20/04/28 05:16:44
1	93	325.99847676911764	298.02831862400393	20/04/28 05:16:44
1	93	325.9978296717905	298.00859852890557	20/04/28 05:16:44
1	93	325.8180292010539	297.9128407450821	20/04/28 05:16:45
1	93	325.9960002055864	297.7049121671855	20/04/28 05:16:45
1	93	325.9284713924352	297.59922769691656	20/04/28 05:16:45
1	93	325.89026638412537	297.5442637408932	20/04/28 05:16:45
1	93	325.843606026773	297.77830521022906	20/04/28 05:16:45
1	93	326.08360663733885	297.91134864958644	20/04/28 05:16:45
1	93	325.99990785309336	297.7193917499932	20/04/28 05:16:45
1	93	325.915713005021	297.5088619191346	20/04/28 05:16:45
1	93	325.89661542585554	297.5839685711324	20/04/28 05:16:45
1	93	325.8295906114461	297.78292103627774	20/04/28 05:16:46
1	93	325.62885946481777	297.86309563392604	20/04/28 05:16:46
1	93	325.52852730070197	297.7934213455005	20/04/28 05:16:46
1	93	325.52298801153864	297.7774611484681	20/04/28 05:16:46
1	93	325.68065499945885	297.9717457516299	20/04/28 05:16:46
1	93	325.78848837053135	297.86643623585036	20/04/28 05:16:46
1	93	325.72656392072054	297.8586334558973	20/04/28 05:16:46
1	93	325.6132347298245	297.9111496373852	20/04/28 05:16:46
1	93	325.50171040678265	297.75769104180966	20/04/28 05:16:46
1	93	325.535686528752	297.9847306449272	20/04/28 05:16:46
1	93	325.5778274689401	297.78334056580127	20/04/28 05:16:47
1	93	325.71702451913364	297.9328841490019	20/04/28 05:16:47
1	93	325.5114027802404	298.10393704463587	20/04/28 05:16:47
1	93	325.5106624934402	298.07467329601315	20/04/28 05:16:47
1	93	325.5333981126544	298.1397209462551	20/04/28 05:16:47
1	93	325.5332480586759	298.05388801832737	20/04/28 05:16:47
1	93	325.47712789375674	298.0966010067701	20/04/28 05:16:47
1	93	325.5328937610382	298.25181163579146	20/04/28 05:16:47
1	93	325.6538192986116	298.1251520935362	20/04/28 05:16:47
1	93	325.7786169756619	298.27415462277645	20/04/28 05:16:47
1	93	325.70429131986884	298.0184659221228	20/04/28 05:16:48
1	93	325.9378746424448	297.8738578605882	20/04/28 05:16:48
1	93	326.14674882423043	297.7207291683563	20/04/28 05:16:48
1	93	326.0302704464467	297.5999599094801	20/04/28 05:16:48
1	93	326.01888731470854	297.7308952634449	20/04/28 05:16:48
1	93	326.0033403651285	297.7081501259433	20/04/28 05:16:48
1	93	326.0647441390604	297.7345753363293	20/04/28 05:16:48
1	93	326.20583898091974	297.7066256717192	20/04/28 05:16:48
1	93	326.1160710475582	297.5591577275391	20/04/28 05:16:48
1	93	325.87175615962536	297.6798791797101	20/04/28 05:16:49
1	93	325.8796110376349	297.47793593957016	20/04/28 05:16:49
1	93	325.88196773654	297.62095481673924	20/04/28 05:16:49
1	93	325.90597446400795	297.5074975152761	20/04/28 05:16:49
1	93	325.95929033676964	297.2312700525868	20/04/28 05:16:49
1	93	326.0907697202546	297.3493885123508	20/04/28 05:16:49
1	93	326.14360146214324	297.0702799174268	20/04/28 05:16:49
1	93	326.3867170839196	297.20783058025097	20/04/28 05:16:49
1	93	326.5177058337928	297.1425789566856	20/04/28 05:16:49
1	93	326.59006863183805	297.1842391299954	20/04/28 05:16:49
1	93	326.439102816845	297.28220890927594	20/04/28 05:16:50
1	93	326.5281807437747	297.1446765398166	20/04/28 05:16:50
1	93	326.4630151759227	296.99492002656615	20/04/28 05:16:50
1	93	326.5030222490495	296.98969829910914	20/04/28 05:16:50
1	93	326.4984081045915	297.0389029676266	20/04/28 05:16:50
1	93	326.3060082235262	296.96061346187145	20/04/28 05:16:50
1	93	326.3342904151568	296.7013311067511	20/04/28 05:16:50
1	93	326.2963672608261	296.8403559990264	20/04/28 05:16:50
1	93	326.4928303014341	296.8081182690132	20/04/28 05:16:50
1	93	326.5981144302891	296.9860488486964	20/04/28 05:16:50
1	93	326.63031018713883	297.11693794372366	20/04/28 05:16:51
1	93	326.8543000441206	297.19439942660284	20/04/28 05:16:51
1	93	326.9344988338372	297.3617752062044	20/04/28 05:16:51
1	93	326.9250008612705	297.32418058511985	20/04/28 05:16:51
1	93	327.12998371655476	297.4802374662032	20/04/28 05:16:51
1	93	327.0436236181303	297.4809473041132	20/04/28 05:16:51
1	93	326.87226144232955	297.3496193212165	20/04/28 05:16:51
1	93	326.96826602186286	297.3044083758047	20/04/28 05:16:51
1	93	326.94871686196797	297.3643486340377	20/04/28 05:16:51
1	93	327.0253547626304	297.3775602303888	20/04/28 05:16:52
1	93	326.7906337767506	297.50949907458175	20/04/28 05:16:52
1	93	326.8546735229649	297.6419766149042	20/04/28 05:16:52
1	93	326.90841941930563	297.8615455532998	20/04/28 05:16:52
1	93	326.78620710540014	297.8849266678511	20/04/28 05:16:52
1	93	326.8506938094825	297.9212627231405	20/04/28 05:16:52
1	93	326.9007984930055	297.72101939233505	20/04/28 05:16:52
1	93	326.9472433562271	297.67415306178793	20/04/28 05:16:52
1	93	326.8141573795837	297.68520573852226	20/04/28 05:16:52
1	93	326.8286214779732	297.72723358164956	20/04/28 05:16:52
1	93	326.7471453084914	297.84053725829517	20/04/28 05:16:53
1	93	326.5711105888692	297.99480149230243	20/04/28 05:16:53
1	93	326.4086444964934	297.80853384742284	20/04/28 05:16:53
1	93	326.6034137281734	297.80749087923164	20/04/28 05:16:53
1	93	326.5997787696848	297.80855345130635	20/04/28 05:16:53
1	93	326.67241137690075	297.9239138987971	20/04/28 05:16:53
1	93	326.7392252418278	297.88424520338157	20/04/28 05:16:53
1	93	326.7914660156852	298.1408752020094	20/04/28 05:16:53
1	93	326.8118309064208	298.2018186448009	20/04/28 05:16:53
1	93	326.8027922604744	298.2472463284393	20/04/28 05:16:53
1	93	326.80436066786143	298.0268646714206	20/04/28 05:16:54
1	93	327.0987858642637	297.9721591953195	20/04/28 05:16:54
1	93	327.04389086370537	297.7690774914727	20/04/28 05:16:54
1	93	326.99472353582973	297.7957154016594	20/04/28 05:16:54
1	93	326.9600038090343	297.69485538267094	20/04/28 05:16:54
1	93	326.8648286340068	297.92140702881915	20/04/28 05:16:54
1	93	326.9602458536192	297.93027301431255	20/04/28 05:16:54
1	93	327.04385704409333	297.96341110668726	20/04/28 05:16:54
1	93	326.7630457712225	297.9409565335674	20/04/28 05:16:54
1	93	326.8771735082076	297.68127041075456	20/04/28 05:16:55
1	93	326.89157318272316	297.68185037487854	20/04/28 05:16:55
1	93	326.8837721028529	297.6541838587246	20/04/28 05:16:55
1	93	326.9766554797928	297.57993446952327	20/04/28 05:16:55
1	93	326.72373607929865	297.53724987971236	20/04/28 05:16:55
1	93	326.72373607929865	297.53724987971236	20/04/28 05:16:55
1	93	326.72373607929865	297.53724987971236	20/04/28 05:16:55
1	93	326.74897152460375	297.4143684985416	20/04/28 05:16:55
1	93	326.8933878655551	297.3407792121612	20/04/28 05:16:55
1	93	326.94913579351214	297.45016630695693	20/04/28 05:16:55
1	93	327.14912329615385	297.4633429616771	20/04/28 05:16:56
1	93	327.00889543726805	297.6439119242682	20/04/28 05:16:56
1	93	327.05783789993717	297.709128278471	20/04/28 05:16:56
1	93	327.0033597046564	297.6353208319277	20/04/28 05:16:56
1	93	326.90271858341083	297.6645443056595	20/04/28 05:16:56
1	93	327.17071709889785	297.73386216522897	20/04/28 05:16:56
1	93	327.0208930956163	297.9733618152282	20/04/28 05:16:56
1	93	327.26566378738715	297.95309741529667	20/04/28 05:16:56
1	93	327.11369792528535	297.7757976126148	20/04/28 05:16:56
1	93	327.18406656526395	298.0025999888418	20/04/28 05:16:56
1	93	327.11224156864563	298.11364920742085	20/04/28 05:16:57
1	93	327.2964318013008	298.0481114567377	20/04/28 05:16:57
1	93	327.32150394683026	297.7561452397397	20/04/28 05:16:57
1	93	327.45031830390235	297.7342334723372	20/04/28 05:16:57
1	93	327.40112925543167	297.7114778732021	20/04/28 05:16:57
1	93	327.2761992707928	297.4901789408975	20/04/28 05:16:57
1	93	327.18557436489556	297.2438698171555	20/04/28 05:16:57
1	93	327.3082337133255	297.40922653313544	20/04/28 05:16:57
1	93	327.32230197088256	297.33905457014635	20/04/28 05:16:57
1	93	327.3235475879615	297.5605450117606	20/04/28 05:16:57
1	93	327.3233823233676	297.56087495386487	20/04/28 05:16:58
1	93	327.34638854900334	297.53278334754975	20/04/28 05:16:58
1	93	327.42387480899083	297.3070899717824	20/04/28 05:16:58
1	93	327.2990083445807	297.4425773414269	20/04/28 05:16:58
1	93	327.44853503196373	297.32476516644266	20/04/28 05:16:58
1	93	327.3534682130101	297.2738834066154	20/04/28 05:16:58
1	93	327.36992240743774	297.27994831114955	20/04/28 05:16:58
1	93	327.46296389429125	297.54313878810467	20/04/28 05:16:58
1	93	327.256423660387	297.68613077624394	20/04/28 05:16:58
1	93	327.0419787804445	297.8183838605026	20/04/28 05:16:59
1	93	326.97181307255596	297.8526759174865	20/04/28 05:16:59
1	93	326.7980146305838	297.7378453035039	20/04/28 05:16:59
1	93	326.7801204965996	297.7612969500906	20/04/28 05:16:59
1	93	326.9991014003768	297.59933060113644	20/04/28 05:16:59
1	93	327.1642156266844	297.5565545078331	20/04/28 05:16:59
1	93	327.16319794137945	297.55644216161363	20/04/28 05:16:59
1	93	327.3000206777207	297.55686501557904	20/04/28 05:16:59
1	93	327.3833166327601	297.54900782272216	20/04/28 05:16:59
1	93	327.3833166327601	297.54900782272216	20/04/28 05:16:59
1	93	327.3833166327601	297.54900782272216	20/04/28 05:17:00
1	93	327.6602376020601	297.6576155768277	20/04/28 05:17:00
1	93	327.7366167136986	297.68212409051034	20/04/28 05:17:00
1	93	327.80804831970306	297.63287816457904	20/04/28 05:17:00
1	93	327.8750878334173	297.8812337361699	20/04/28 05:17:00
1	93	327.66662877455894	297.7600606398221	20/04/28 05:17:00
1	93	327.67680486534886	297.9696289778465	20/04/28 05:17:00
1	93	327.80667263708557	298.08369382625506	20/04/28 05:17:00
1	93	327.8097243295847	298.09358875460833	20/04/28 05:17:00
1	93	327.81891406208695	298.0277032685074	20/04/28 05:17:00
1	93	328.05098963931795	297.9614741960235	20/04/28 05:17:01
1	93	328.0863265460419	297.8471536627848	20/04/28 05:17:01
1	93	328.08691138895483	297.84182066306516	20/04/28 05:17:01
1	93	328.08950925680136	297.840308024761	20/04/28 05:17:01
1	93	327.9048072649117	297.79479391149164	20/04/28 05:17:01
1	93	328.064015879096	297.69811376189386	20/04/28 05:17:01
1	93	328.0987556683522	297.6334687198839	20/04/28 05:17:01
1	93	327.9804048327599	297.74609640067933	20/04/28 05:17:01
1	93	327.759636698267	297.88107429843285	20/04/28 05:17:01
1	93	327.5675209727572	297.9854312060661	20/04/28 05:17:02
1	93	327.42566272305095	297.80163151225116	20/04/28 05:17:02
1	93	327.68176534490095	297.69220098853083	20/04/28 05:17:02
1	93	327.8418748082916	297.723147559377	20/04/28 05:17:02
1	93	327.75519612186974	297.9692784059164	20/04/28 05:17:02
1	93	327.9531665046685	297.86359442173364	20/04/28 05:17:02
1	93	327.9878582680271	297.9075037849654	20/04/28 05:17:02
1	93	327.8393142774067	298.1411186774323	20/04/28 05:17:02
1	93	327.9033823646341	297.99420312828096	20/04/28 05:17:02
1	93	327.89338175764226	297.97888209120606	20/04/28 05:17:02
1	93	327.93496288442856	297.9604479784376	20/04/28 05:17:03
1	93	327.8911080696187	297.8171375795545	20/04/28 05:17:03
1	93	327.8600451947079	297.7749107717776	20/04/28 05:17:03
1	93	328.05405657491383	297.8266368565492	20/04/28 05:17:03
1	93	327.9804446546835	297.5653588128433	20/04/28 05:17:03
1	93	327.9206832335531	297.84568883915705	20/04/28 05:17:03
1	93	327.89476163626193	297.82646448961646	20/04/28 05:17:03
1	93	327.8470486304642	297.62510123636577	20/04/28 05:17:03
1	93	327.74392380156763	297.6325340466714	20/04/28 05:17:03
1	93	327.5157385917432	297.59662723119254	20/04/28 05:17:03
1	93	327.36381292673667	297.64262791301877	20/04/28 05:17:04
1	93	327.43547661915255	297.5924474406986	20/04/28 05:17:04
1	93	327.6833058632957	297.5849864827473	20/04/28 05:17:04
1	93	327.7925195409233	297.72164323691266	20/04/28 05:17:04
1	93	327.71809631022614	297.67791758407355	20/04/28 05:17:04
1	93	327.58630803673526	297.7247266465128	20/04/28 05:17:04
1	93	327.6438002617298	297.6562209151786	20/04/28 05:17:04
1	93	327.819411881981	297.85177989938796	20/04/28 05:17:04
1	93	327.7434867956531	298.0236677278546	20/04/28 05:17:04
1	93	327.8078746777696	297.9262658263731	20/04/28 05:17:05
1	93	327.80839994643566	297.9277331302096	20/04/28 05:17:05
1	93	327.8101833553156	297.92178638267467	20/04/28 05:17:05
1	93	327.9612720872227	298.0156359434979	20/04/28 05:17:05
1	93	327.93492534754927	298.0011948234758	20/04/28 05:17:05
1	93	327.9058178319318	297.94073815691837	20/04/28 05:17:05
1	93	327.80322251903755	297.99875948919674	20/04/28 05:17:05
1	93	327.8291126708061	297.9817026610548	20/04/28 05:17:05
1	93	327.74821525236973	297.7250656996776	20/04/28 05:17:05
1	93	327.5862371300216	297.551369570967	20/04/28 05:17:05
1	93	327.6241152837089	297.5010719477065	20/04/28 05:17:06
1	93	327.6042275631994	297.5024145376974	20/04/28 05:17:06
1	93	327.46124680056516	297.4141696278428	20/04/28 05:17:06
1	93	327.4907048372663	297.64847517885534	20/04/28 05:17:06
1	93	327.5590280906067	297.6627735212217	20/04/28 05:17:06
1	93	327.49343757540316	297.6885639415031	20/04/28 05:17:06
1	93	327.48541228728766	297.63555292753875	20/04/28 05:17:06
1	93	327.38209334153845	297.52324046160857	20/04/28 05:17:06
1	93	327.38547621643687	297.6084363451534	20/04/28 05:17:06
1	93	327.27462913712054	297.6317383925277	20/04/28 05:17:06
1	93	327.38665803258067	297.36651518882513	20/04/28 05:17:07
1	93	327.143402704278	297.2611890255861	20/04/28 05:17:07
1	93	327.39844581557446	297.2533952961928	20/04/28 05:17:07
1	93	327.4544748341356	297.26509074096816	20/04/28 05:17:07
1	93	327.4229047773384	297.1709196048831	20/04/28 05:17:07
1	93	327.48331091444874	297.12771393681373	20/04/28 05:17:07
1	93	327.4915389941515	297.2037195433372	20/04/28 05:17:07
1	93	327.6773574515136	297.24413759347317	20/04/28 05:17:07
1	93	327.50481978128875	297.28493559468075	20/04/28 05:17:07
1	93	327.5027742355072	297.4804810680966	20/04/28 05:17:08
1	93	327.52735982675296	297.5096379089377	20/04/28 05:17:08
1	93	327.5328562924089	297.5162791294804	20/04/28 05:17:08
1	93	327.54891379226564	297.4709289283344	20/04/28 05:17:08
1	93	327.58437540756853	297.5262385234012	20/04/28 05:17:08
1	93	327.78962489579203	297.388295264749	20/04/28 05:17:08
1	93	327.55770763804793	297.4696175801497	20/04/28 05:17:08
1	93	327.4899494066791	297.46888469265826	20/04/28 05:17:08
1	93	327.5680951878908	297.45821224379654	20/04/28 05:17:08
1	93	327.8187614518549	297.3181866460994	20/04/28 05:17:08
1	93	327.80066123736515	297.1574305488913	20/04/28 05:17:09
1	93	327.75539191583744	297.10488882120853	20/04/28 05:17:09
1	93	327.5437507926271	297.3003311282817	20/04/28 05:17:09
1	93	327.3736605003072	297.1121812903598	20/04/28 05:17:09
1	93	327.6075874800513	297.25480647009147	20/04/28 05:17:09
1	93	327.8470485312504	297.1706285136764	20/04/28 05:17:09
1	93	327.8470448747672	297.217433615941	20/04/28 05:17:09
1	93	328.0883708457695	297.2157870903603	20/04/28 05:17:09
1	93	328.15093148397466	297.30484119179374	20/04/28 05:17:09
1	93	328.21643412822374	297.1448916100523	20/04/28 05:17:09
1	93	328.2557108055423	297.4281425932316	20/04/28 05:17:10
1	93	328.2700183581117	297.36733065522117	20/04/28 05:17:10
1	93	328.11702786166586	297.48878956424323	20/04/28 05:17:10
1	93	328.3222495786149	297.68496545038704	20/04/28 05:17:10
1	93	328.4401760541744	297.6099372663663	20/04/28 05:17:10
1	93	328.28460927756527	297.56898382338625	20/04/28 05:17:10
1	93	328.0570985547278	297.48647282227415	20/04/28 05:17:10
1	93	328.1746492363173	297.34346332288527	20/04/28 05:17:10
1	93	328.2022457865813	297.39149495219044	20/04/28 05:17:10
1	93	328.16438584055743	297.33518076624716	20/04/28 05:17:10
1	93	328.28770986648294	297.41285823177276	20/04/28 05:17:11
1	93	328.3519146834179	297.20966130193176	20/04/28 05:17:11
1	93	328.111468732176	297.23320739063695	20/04/28 05:17:11
1	93	328.27613372353665	297.12252957952427	20/04/28 05:17:11
1	93	328.074200043498	297.24004845286635	20/04/28 05:17:11
1	93	328.2256448610924	297.3146471195427	20/04/28 05:17:11
1	93	328.19060448897096	297.2700492964817	20/04/28 05:17:11
1	93	328.06847584474724	297.24723143227914	20/04/28 05:17:11
1	93	328.0109873567405	297.2773017378953	20/04/28 05:17:11
1	93	328.27318590340326	297.26267373836123	20/04/28 05:17:12
1	93	328.2866004361936	297.20927775442414	20/04/28 05:17:12
1	93	328.3348247385524	297.31963985267026	20/04/28 05:17:12
1	93	328.2200141282147	297.4005791403056	20/04/28 05:17:12
1	93	328.078949569584	297.27220496000706	20/04/28 05:17:12
1	93	327.96748590507144	297.26417280785233	20/04/28 05:17:12
1	93	327.9390557296556	297.2126184128172	20/04/28 05:17:12
1	93	327.9315138690879	297.4342177405999	20/04/28 05:17:12
1	93	327.887475540494	297.3660288713669	20/04/28 05:17:12
1	93	328.0076816699134	297.42491538390937	20/04/28 05:17:12
1	93	327.9836172281353	297.42265133321195	20/04/28 05:17:13
1	93	327.79289377160524	297.26127787176796	20/04/28 05:17:13
1	93	327.79271535290945	297.2583617161123	20/04/28 05:17:13
1	93	327.5799810790584	297.3633673414959	20/04/28 05:17:13
1	93	327.554332943013	297.63009307506513	20/04/28 05:17:13
1	93	327.5254901683296	297.51093518751736	20/04/28 05:17:13
1	93	327.46571943680715	297.7030942877832	20/04/28 05:17:13
1	93	327.3257474619056	297.4586897552942	20/04/28 05:17:13
1	93	327.30087769628034	297.4116596187376	20/04/28 05:17:13
1	93	327.07412090953557	297.55571950678944	20/04/28 05:17:13
1	93	327.36360281442984	297.5194172675761	20/04/28 05:17:14
1	93	327.4346569035698	297.366576173814	20/04/28 05:17:14
1	93	327.4382969284224	297.3566753593593	20/04/28 05:17:14
1	93	327.4775403371395	297.323362967089	20/04/28 05:17:14
1	93	327.4482392398323	297.39845548917515	20/04/28 05:17:14
1	93	327.34362231340793	297.27668175401016	20/04/28 05:17:14
1	93	327.3632512067779	297.2882644586707	20/04/28 05:17:14
1	93	327.3525902686552	297.25486144454203	20/04/28 05:17:14
1	93	327.26027489112306	297.2521664118063	20/04/28 05:17:14
1	93	327.42826728757007	297.16411802304043	20/04/28 05:17:15
1	93	327.4347204371838	297.19222835857136	20/04/28 05:17:15
1	93	327.4857564267039	297.22430237474225	20/04/28 05:17:15
1	93	327.77538885174494	297.1491170738806	20/04/28 05:17:15
1	93	327.6951797791798	297.26260968666935	20/04/28 05:17:15
1	93	327.62388398696527	297.2211103420092	20/04/28 05:17:15
1	93	327.63927723331756	297.02029060858695	20/04/28 05:17:15
1	93	327.7882220807759	297.03961734254545	20/04/28 05:17:15
1	93	327.7837251274386	296.90265811741114	20/04/28 05:17:15
1	93	327.81586365433276	296.9377467241977	20/04/28 05:17:15
1	93	327.6721455866395	296.6941507355641	20/04/28 05:17:16
1	93	327.4912526901874	296.73452373000487	20/04/28 05:17:16
1	93	327.65708908107774	296.4932513465566	20/04/28 05:17:16
1	93	327.7698797748778	296.49350677931506	20/04/28 05:17:16
1	93	327.8703051372728	296.4943482034207	20/04/28 05:17:16
1	93	327.8172178082331	296.38974121336304	20/04/28 05:17:16
1	93	327.70574022792385	296.2970803530545	20/04/28 05:17:16
1	93	327.9865500134988	296.2167443484198	20/04/28 05:17:16
1	93	327.9697131659636	296.35031736697596	20/04/28 05:17:16
1	93	327.9009702025283	296.3871814047162	20/04/28 05:17:16
1	93	327.6690031423263	296.43498818121503	20/04/28 05:17:17
1	93	327.7753791486135	296.3432601482401	20/04/28 05:17:17
1	93	327.7667151137739	296.3490076735284	20/04/28 05:17:17
1	93	327.8687675197861	296.07548990069887	20/04/28 05:17:17
1	93	327.89923560327617	296.09194787791176	20/04/28 05:17:17
1	93	328.060365327005	296.020677026508	20/04/28 05:17:17
1	93	328.19399014221614	296.28277646681823	20/04/28 05:17:17
1	93	328.08129334792517	296.27288144335023	20/04/28 05:17:17
1	93	328.05037294352934	296.0915788373188	20/04/28 05:17:17
1	93	327.9238791327682	296.2554477500284	20/04/28 05:17:18
1	93	327.6784557421995	296.1692616559739	20/04/28 05:17:18
1	93	327.3892410859982	296.1447847448746	20/04/28 05:17:18
1	93	327.3883355056792	296.1453979106509	20/04/28 05:17:18
1	93	327.3216734870601	296.26277017579	20/04/28 05:17:18
1	93	327.1686379312837	296.3710891639655	20/04/28 05:17:18
1	93	327.1538403001141	296.4909600177612	20/04/28 05:17:18
1	93	326.9008660377248	296.43767160433066	20/04/28 05:17:18
1	93	327.0100141250435	296.53162322440573	20/04/28 05:17:18
1	93	326.88477675984797	296.4776832185154	20/04/28 05:17:18
1	93	326.8506637879973	296.6309256160231	20/04/28 05:17:19
1	93	326.79504921609043	296.63540199857874	20/04/28 05:17:19
1	93	326.88833778096307	296.36480309226556	20/04/28 05:17:19
1	93	326.8586750116198	296.42795373506726	20/04/28 05:17:19
1	93	326.85449166614865	296.4120721906813	20/04/28 05:17:19
1	93	326.80783858674107	296.45780537250965	20/04/28 05:17:19
1	93	326.80783858674107	296.45780537250965	20/04/28 05:17:19
1	93	326.80783858674107	296.45780537250965	20/04/28 05:17:19
1	93	326.80783858674107	296.45780537250965	20/04/28 05:17:19
1	93	326.9586060120676	296.7254650989519	20/04/28 05:17:19
1	93	326.9498269224505	296.64074568516867	20/04/28 05:17:20
1	93	326.98054967811527	296.66504009427416	20/04/28 05:17:20
1	93	326.9888435593916	296.61395466846557	20/04/28 05:17:20
1	93	327.0664960357958	296.3490961172971	20/04/28 05:17:20
1	93	327.1266708143637	296.3613574772215	20/04/28 05:17:20
1	93	327.3249244108418	296.1563231892186	20/04/28 05:17:20
1	93	327.35826183774566	296.1544420355564	20/04/28 05:17:20
1	93	327.35328726888395	296.1475923331467	20/04/28 05:17:20
1	93	327.4354242391523	296.32722002164087	20/04/28 05:17:20
1	93	327.44628496718536	296.32542983393256	20/04/28 05:17:20
1	93	327.44628496718536	296.32542983393256	20/04/28 05:17:21
1	93	327.4159242371591	296.3420684338876	20/04/28 05:17:21
1	93	327.60692892070927	296.2020381007907	20/04/28 05:17:21
1	93	327.67974969727885	296.4304187004043	20/04/28 05:17:21
1	93	327.6588115632526	296.4189280100834	20/04/28 05:17:21
1	93	327.6588115632526	296.4189280100834	20/04/28 05:17:21
1	93	327.63533773966486	296.4216363595588	20/04/28 05:17:21
1	93	327.61693425092795	296.4129168420337	20/04/28 05:17:21
1	93	327.7088548847199	296.3953749774669	20/04/28 05:17:21
1	93	327.45412844536156	296.36940579051077	20/04/28 05:17:22
1	93	327.64160828120254	296.38588903225104	20/04/28 05:17:22
1	93	327.7313205922377	296.3647766939346	20/04/28 05:17:22
1	93	327.5536252214664	296.3374693880308	20/04/28 05:17:22
1	93	327.43328935098015	296.2893107341899	20/04/28 05:17:22
1	93	327.4686180511519	296.22890660095624	20/04/28 05:17:22
1	93	327.60122728150947	296.2618889672406	20/04/28 05:17:22
1	93	327.4575873584258	296.38780443418005	20/04/28 05:17:22
1	93	327.4621373383768	296.37337428538353	20/04/28 05:17:22
1	93	327.38928888352626	296.5335588160414	20/04/28 05:17:22
1	93	327.45009285078254	296.39343875570296	20/04/28 05:17:23
1	93	327.44000770220634	296.3746408701162	20/04/28 05:17:23
1	93	327.4893632824742	296.12623489815746	20/04/28 05:17:23
1	93	327.38038955691366	295.8577747274239	20/04/28 05:17:23
1	93	327.3697972786461	295.8743616080697	20/04/28 05:17:23
1	93	327.49984599497515	295.9227956732966	20/04/28 05:17:23
1	93	327.595684661244	295.8846814663232	20/04/28 05:17:23
1	93	327.53150890723776	295.90829460840797	20/04/28 05:17:23
1	93	327.4089917684213	296.14363004112334	20/04/28 05:17:23
1	93	327.2038458271744	295.9437623550168	20/04/28 05:17:23
1	93	326.968676430885	295.8957442618281	20/04/28 05:17:24
1	93	327.19261192219284	295.9032613947914	20/04/28 05:17:24
1	93	327.1857381430171	295.9201599428057	20/04/28 05:17:24
1	93	326.93107201868725	295.8659769350785	20/04/28 05:17:24
1	93	327.0769200812835	295.9733095058014	20/04/28 05:17:24
1	93	327.1377372681928	296.1636154034598	20/04/28 05:17:24
1	93	326.9378503288781	296.26291496703084	20/04/28 05:17:24
1	93	326.8725060542192	296.0160432358057	20/04/28 05:17:24
1	93	326.82534002470294	295.95234895474425	20/04/28 05:17:24
1	93	326.8270508939366	295.9468097296923	20/04/28 05:17:25
1	93	326.99539883902156	295.99213817685893	20/04/28 05:17:25
1	93	327.1860443715996	296.0693074149261	20/04/28 05:17:25
1	93	327.1782385851364	296.09846958054874	20/04/28 05:17:25
1	93	327.2139161904393	296.37056837154887	20/04/28 05:17:25
1	93	327.2105712345117	296.43984935588986	20/04/28 05:17:25
1	93	327.141234759233	296.4277864500182	20/04/28 05:17:25
1	93	327.1415596578589	296.4448575624236	20/04/28 05:17:25
1	93	327.1182235715092	296.4592202129103	20/04/28 05:17:25
1	93	327.1207539883736	296.455835890292	20/04/28 05:17:25
1	93	327.18173517103247	296.25137521254703	20/04/28 05:17:26
1	93	327.2109548886413	296.01890617666834	20/04/28 05:17:26
1	93	327.0989754882104	296.0257544864013	20/04/28 05:17:26
1	93	327.26910152226037	296.12307882919885	20/04/28 05:17:26
1	93	327.18093962810826	296.1269582034974	20/04/28 05:17:26
1	93	327.19358214832744	296.1354576967213	20/04/28 05:17:26
1	93	327.12782870457744	296.08495285539254	20/04/28 05:17:26
1	93	327.21172983708345	296.1670448495329	20/04/28 05:17:26
1	93	327.10263235217883	296.4451461889747	20/04/28 05:17:26
1	93	327.1209246205795	296.19713411523793	20/04/28 05:17:26
1	93	327.297091232608	296.0729632303687	20/04/28 05:17:27
1	93	327.4913141433858	295.9799701456839	20/04/28 05:17:27
1	93	327.3107326526721	296.0391148432567	20/04/28 05:17:27
1	93	327.1753132248618	296.03828210990616	20/04/28 05:17:27
1	93	327.2733883753354	295.83349223439643	20/04/28 05:17:27
1	93	327.3322118553013	295.78910588706634	20/04/28 05:17:27
1	93	327.06931969642307	295.7252449700515	20/04/28 05:17:27
1	93	326.86172052737095	295.9051273743722	20/04/28 05:17:27
1	93	327.08604500478214	295.9884496649749	20/04/28 05:17:27
1	93	326.89564779365895	295.92742479836164	20/04/28 05:17:28
1	93	326.8408255280383	295.6702594225221	20/04/28 05:17:28
1	93	326.92062890193864	295.5990781357781	20/04/28 05:17:28
1	93	326.807997886342	295.67318520002465	20/04/28 05:17:28
1	93	326.5378560303957	295.59774212708766	20/04/28 05:17:28
1	93	326.5986038270779	295.7492508073108	20/04/28 05:17:28
1	93	326.5986038270779	295.7492508073108	20/04/28 05:17:28
1	93	326.5807585037199	295.7871129331265	20/04/28 05:17:28
1	93	326.6061918517562	296.04724067455305	20/04/28 05:17:28
1	93	326.84102996695077	296.1944360789946	20/04/28 05:17:28
1	93	327.0281989629905	296.1451821077451	20/04/28 05:17:29
1	93	326.94665397592223	296.1397263316647	20/04/28 05:17:29
1	93	326.94665397592223	296.1397263316647	20/04/28 05:17:29
1	93	326.9315649297502	295.9849337176071	20/04/28 05:17:29
1	93	326.9283426835331	296.13223310688295	20/04/28 05:17:29
1	93	326.9416688266448	296.1648506287315	20/04/28 05:17:29
1	93	326.9486588423909	296.1738729099694	20/04/28 05:17:29
1	93	326.83355526166775	296.36056427413087	20/04/28 05:17:29
1	93	326.95490928210296	296.33670866369954	20/04/28 05:17:29
1	93	326.9303878794254	296.3623173030401	20/04/28 05:17:29
1	93	326.93761905300954	296.27603135258835	20/04/28 05:17:30
1	93	326.8139994536781	296.0486883661776	20/04/28 05:17:30
1	93	326.89179514352816	295.80777835631466	20/04/28 05:17:30
1	93	326.8788610822312	295.7993460944425	20/04/28 05:17:30
1	93	326.7956259994032	295.7036854160986	20/04/28 05:17:30
1	93	326.6653061707744	295.9214106095976	20/04/28 05:17:30
1	93	326.7278742759004	295.8591863752083	20/04/28 05:17:30
1	93	326.7117499982654	295.88819327647377	20/04/28 05:17:30
1	93	326.6977485052326	295.89225665728253	20/04/28 05:17:30
1	93	326.5177578786947	296.0628819538229	20/04/28 05:17:30
1	93	326.4661842778748	295.988552857381	20/04/28 05:17:31
1	93	326.182918407275	295.8916844712704	20/04/28 05:17:31
1	93	326.2576958525107	295.7645586640713	20/04/28 05:17:31
1	93	326.2693194933478	295.78170254883224	20/04/28 05:17:31
1	93	326.32117357911915	295.8092061214584	20/04/28 05:17:31
1	93	326.32331254475463	295.79310261508425	20/04/28 05:17:31
1	93	326.54562510163174	295.8103235581746	20/04/28 05:17:31
1	93	326.54813276887364	295.80701104054117	20/04/28 05:17:31
1	93	326.5396909450838	295.8647262672382	20/04/28 05:17:31
1	93	326.5396909450838	295.8647262672382	20/04/28 05:17:32
1	93	326.398111446748	295.58747319137535	20/04/28 05:17:32
1	93	326.5801302062067	295.6896211103026	20/04/28 05:17:32
1	93	326.52296688662676	295.8427323699485	20/04/28 05:17:32
1	93	326.66246808594803	296.0295498710703	20/04/28 05:17:32
1	93	326.689516869047	295.92279975254837	20/04/28 05:17:32
1	93	326.6604435551788	295.8400212021839	20/04/28 05:17:32
1	93	326.6604435551788	295.8400212021839	20/04/28 05:17:32
1	93	326.43822861524563	296.001926876694	20/04/28 05:17:32
1	93	326.3200463449176	296.19012045280016	20/04/28 05:17:32
1	93	326.65008468495967	296.29412862457207	20/04/28 05:17:33
1	93	326.65008468495967	296.29412862457207	20/04/28 05:17:33
1	93	326.6293042740193	296.2917130668359	20/04/28 05:17:33
1	93	326.6519712369027	296.2592680880358	20/04/28 05:17:33
1	93	326.6394927533053	296.189321988752	20/04/28 05:17:33
1	93	326.6394927533053	296.189321988752	20/04/28 05:17:33
1	93	326.5351434017194	296.1278636418748	20/04/28 05:17:33
1	93	326.65453069313935	295.9027000420722	20/04/28 05:17:33
1	93	326.5081125402547	295.80552145148727	20/04/28 05:17:33
1	93	326.5090459356102	295.8883267309247	20/04/28 05:17:34
1	93	326.60864373215674	295.8239974328678	20/04/28 05:17:34
1	93	326.51546365433705	295.8198115076392	20/04/28 05:17:34
1	93	326.6520211938427	295.78750706593456	20/04/28 05:17:34
1	93	326.48642395722754	295.9983322435131	20/04/28 05:17:34
1	93	326.4478146800864	295.98558236531215	20/04/28 05:17:34
1	93	326.44938466132464	295.86107999544095	20/04/28 05:17:34
1	93	326.3321072624423	295.8971972614651	20/04/28 05:17:34
1	93	326.3321072624423	295.8971972614651	20/04/28 05:17:34
1	93	326.00215574008524	295.8511846629672	20/04/28 05:17:34
1	93	325.98741908177567	295.94835887145337	20/04/28 05:17:35
1	93	325.98741908177567	295.94835887145337	20/04/28 05:17:35
1	93	326.0868467178609	295.742568333763	20/04/28 05:17:35
1	93	326.2512427946987	295.67537560564693	20/04/28 05:17:35
1	93	326.2512427946987	295.67537560564693	20/04/28 05:17:35
1	93	326.2460260918734	295.67179892277727	20/04/28 05:17:35
1	93	326.2828484814008	295.69701351163354	20/04/28 05:17:35
1	93	326.5639271911795	295.61459989836015	20/04/28 05:17:35
1	93	326.5199823513916	295.6343712190001	20/04/28 05:17:35
1	93	326.6200185866763	295.87360113427246	20/04/28 05:17:36
1	93	326.7526466398713	295.9548561814885	20/04/28 05:17:36
1	93	326.6952162549254	296.03519969593833	20/04/28 05:17:36
1	93	326.7142698274554	296.17253258948864	20/04/28 05:17:36
1	93	326.5987378137839	296.18078606054155	20/04/28 05:17:36
1	93	326.5987378137839	296.18078606054155	20/04/28 05:17:36
1	93	326.35447212757174	296.00726150557693	20/04/28 05:17:36
1	93	326.27726766504406	296.1911926930356	20/04/28 05:17:36
1	93	326.2650710479104	296.46806034616145	20/04/28 05:17:36
1	93	326.2650710479104	296.46806034616145	20/04/28 05:17:36
1	93	326.55495759170316	296.5086594967016	20/04/28 05:17:37
1	93	326.47722925699185	296.52730736992936	20/04/28 05:17:37
1	93	326.4903163343366	296.4125441402591	20/04/28 05:17:37
1	93	326.24130528677443	296.520504965313	20/04/28 05:17:37
1	93	326.05395763444807	296.55155889358366	20/04/28 05:17:37
1	93	326.24055623647337	296.66057587979066	20/04/28 05:17:37
1	93	326.2745163586516	296.84376268279703	20/04/28 05:17:37
1	93	326.38467602681345	296.8744787163987	20/04/28 05:17:37
1	93	326.50668664695297	296.9584287259799	20/04/28 05:17:37
1	93	326.5132921949465	296.7495096663498	20/04/28 05:17:37
1	93	326.59972999084863	296.78808695698075	20/04/28 05:17:38
1	93	326.66857525028917	296.6380601880375	20/04/28 05:17:38
1	93	326.689315897725	296.71065291569266	20/04/28 05:17:38
1	93	326.56879912250037	296.5480036818475	20/04/28 05:17:38
1	93	326.3800139814399	296.5038019542787	20/04/28 05:17:38
1	93	326.63699218629415	296.4245831058303	20/04/28 05:17:38
1	93	326.5169933461659	296.430509890692	20/04/28 05:17:38
1	93	326.4889079202247	296.3077456736055	20/04/28 05:17:38
1	93	326.39899430191724	296.2611148878078	20/04/28 05:17:38
1	93	326.4163425542044	296.22635839637866	20/04/28 05:17:39
1	93	326.42520880044094	296.1963017166255	20/04/28 05:17:39
1	93	326.66043353519757	296.1148993310238	20/04/28 05:17:39
1	93	326.8272883639374	295.902515299214	20/04/28 05:17:39
1	93	327.0516567548422	295.87036322221684	20/04/28 05:17:39
1	93	326.96122716605254	295.75152020099875	20/04/28 05:17:39
1	93	327.07867150574754	295.9761670325796	20/04/28 05:17:39
1	93	327.07867150574754	295.9761670325796	20/04/28 05:17:39
1	93	327.21814951986715	296.16081938463213	20/04/28 05:17:39
1	93	326.9968922418135	296.01237574758443	20/04/28 05:17:39
1	93	326.98492280780715	295.9945744908282	20/04/28 05:17:40
1	93	326.8392013714899	295.95847012233753	20/04/28 05:17:40
1	93	326.54211457781065	295.9255991053547	20/04/28 05:17:40
1	93	326.53431105933026	295.9285881515959	20/04/28 05:17:40
1	93	326.66136224392307	295.8414452757514	20/04/28 05:17:40
1	93	326.4304772328787	295.8267287845459	20/04/28 05:17:40
1	93	326.55318516719973	295.8595802125945	20/04/28 05:17:40
1	93	326.41209703073145	295.6578975660965	20/04/28 05:17:40
1	93	326.4162097885788	295.70176352018706	20/04/28 05:17:40
1	93	326.4162097885788	295.70176352018706	20/04/28 05:17:40
1	93	326.31978172371925	295.81307064986163	20/04/28 05:17:41
1	93	326.31510672604145	295.84767406345725	20/04/28 05:17:41
1	93	326.2890235944777	296.0101992711251	20/04/28 05:17:41
1	93	326.11903563552414	296.1565272136351	20/04/28 05:17:41
1	93	326.11903563552414	296.1565272136351	20/04/28 05:17:41
1	93	325.98649689301186	296.4133815912636	20/04/28 05:17:41
1	93	326.1321421031403	296.4294998998188	20/04/28 05:17:41
1	93	326.2535017232979	296.5199026996438	20/04/28 05:17:41
1	93	325.8689265420249	296.6249396062355	20/04/28 05:17:41
1	93	325.8538724061162	296.6850192004231	20/04/28 05:17:42
1	93	325.90445056129244	296.65863964079267	20/04/28 05:17:42
1	93	325.90562919859246	296.6733213194721	20/04/28 05:17:42
1	93	325.85234011849633	296.783344010009	20/04/28 05:17:42
1	93	325.72438758479615	296.8156966763457	20/04/28 05:17:42
1	93	325.7023087028051	296.69391551424314	20/04/28 05:17:42
1	93	325.53894143375607	296.8699467995715	20/04/28 05:17:42
1	93	325.3742786726984	297.0288269560807	20/04/28 05:17:42
1	93	325.634827155538	297.0696423716337	20/04/28 05:17:42
1	93	325.58405198794446	296.98280428379826	20/04/28 05:17:42
1	93	325.58275263498314	296.9629654834896	20/04/28 05:17:43
1	93	325.79456125384655	296.84226552122226	20/04/28 05:17:43
1	93	325.6707181177077	296.88966136922187	20/04/28 05:17:43
1	93	325.8341055434319	297.04711540960386	20/04/28 05:17:43
1	93	325.8750153702061	297.0459218881242	20/04/28 05:17:43
1	93	326.0453402596443	296.80537248673164	20/04/28 05:17:43
1	93	325.8480605928256	296.94470883059734	20/04/28 05:17:43
1	93	325.74029530818393	296.8225519065892	20/04/28 05:17:43
1	93	325.64687369471693	296.66788902195367	20/04/28 05:17:43
1	93	325.6466048498318	296.6676490781885	20/04/28 05:17:44
1	93	325.4848520017559	296.73135840696233	20/04/28 05:17:44
1	93	325.4848520017559	296.73135840696233	20/04/28 05:17:44
1	93	325.4848520017559	296.73135840696233	20/04/28 05:17:44
1	93	325.4360802827722	296.7703953320988	20/04/28 05:17:44
1	93	325.14882619456375	296.8097817207347	20/04/28 05:17:44
1	93	325.2074521428114	296.9037132783075	20/04/28 05:17:44
1	93	325.04133577053	296.6798522227289	20/04/28 05:17:44
1	93	324.85001996791	296.54615872910927	20/04/28 05:17:44
1	93	324.9705513006395	296.4300164187919	20/04/28 05:17:44
1	93	324.9021936700003	296.20000613940084	20/04/28 05:17:45
1	93	325.0267403766565	296.01525683711805	20/04/28 05:17:45
1	93	324.8382566251164	295.8381220174599	20/04/28 05:17:45
1	93	324.7331100820688	295.9659642120317	20/04/28 05:17:45
1	93	324.4456312946253	295.92805572850386	20/04/28 05:17:45
1	93	324.4868736095154	295.9040672124759	20/04/28 05:17:45
1	93	324.38984802993326	295.88378408028694	20/04/28 05:17:45
1	93	324.3089443549288	295.73193898151624	20/04/28 05:17:45
1	93	324.35497063127804	295.8044775379051	20/04/28 05:17:45
1	93	324.1785231646868	296.03369621021926	20/04/28 05:17:45
1	93	324.13955981556126	295.9669799347512	20/04/28 05:17:46
1	93	324.0524235414864	296.1618008640856	20/04/28 05:17:46
1	93	324.2674103261985	296.17164085604816	20/04/28 05:17:46
1	93	324.4698499639833	296.35514295642145	20/04/28 05:17:46
1	93	324.4418587092389	296.47617848104505	20/04/28 05:17:46
1	93	324.5172078637239	296.5068014970053	20/04/28 05:17:46
1	93	324.5420207060453	296.58826246066815	20/04/28 05:17:46
1	93	324.4046612300591	296.4192585487412	20/04/28 05:17:46
1	93	324.29558129932775	296.5076827970106	20/04/28 05:17:46
1	93	324.312401931653	296.4948037331717	20/04/28 05:17:47
1	93	324.3765485164722	296.57059419988485	20/04/28 05:17:47
1	93	324.4765950928881	296.77533857901443	20/04/28 05:17:47
1	93	324.44156469946495	296.57301304352154	20/04/28 05:17:47
1	93	324.6884191048936	296.5242481253093	20/04/28 05:17:47
1	93	324.66440247984264	296.27071934154407	20/04/28 05:17:47
1	93	324.60196350811674	296.18732642305366	20/04/28 05:17:47
1	93	324.60509092810474	295.96429232307753	20/04/28 05:17:47
1	93	324.8932175664437	296.00258648034713	20/04/28 05:17:47
1	93	324.8468285284871	296.0735968022	20/04/28 05:17:47
1	93	324.85924485441956	296.0313913510408	20/04/28 05:17:48
1	93	324.87516469792394	296.12157728665505	20/04/28 05:17:48
1	93	324.9072980966042	296.2558231165145	20/04/28 05:17:48
1	93	324.9672042756881	296.2791155080256	20/04/28 05:17:48
1	93	324.82522455724177	296.4456040767628	20/04/28 05:17:48
1	93	324.87282759969185	296.451114412901	20/04/28 05:17:48
1	93	324.81143550387424	296.3769864809856	20/04/28 05:17:48
1	93	324.9880929419233	296.6182869126676	20/04/28 05:17:48
1	93	324.99074161924227	296.558688981857	20/04/28 05:17:48
1	93	324.94030991446067	296.472465407229	20/04/28 05:17:48
1	93	325.0739445681585	296.7092754269233	20/04/28 05:17:49
1	93	325.07131835675443	296.64423354050456	20/04/28 05:17:49
1	93	325.10478142517564	296.692405633741	20/04/28 05:17:49
1	93	325.2306979718758	296.7815481119919	20/04/28 05:17:49
1	93	325.21069881615307	296.7918568251058	20/04/28 05:17:49
1	93	325.24315681071755	296.7878808044568	20/04/28 05:17:49
1	93	325.2819666548535	296.72173193070097	20/04/28 05:17:49
1	93	325.2804986402107	296.696975834759	20/04/28 05:17:49
1	93	325.40480944864044	296.65825523454043	20/04/28 05:17:49
1	93	325.4949940761924	296.69614235076233	20/04/28 05:17:50
1	93	325.75789757657657	296.7405831860309	20/04/28 05:17:50
1	93	325.5868285239657	296.79363717426645	20/04/28 05:17:50
1	93	325.59442513750673	296.78425560057013	20/04/28 05:17:50
1	93	325.485347032931	296.8367762581469	20/04/28 05:17:50
1	93	325.379591345834	296.7337059775347	20/04/28 05:17:50
1	93	325.3818987507203	296.73615326678515	20/04/28 05:17:50
1	93	325.3036803981763	296.71457404363	20/04/28 05:17:50
1	93	325.1761163438583	296.5573581599346	20/04/28 05:17:50
1	93	325.181705202885	296.62515580943113	20/04/28 05:17:50
1	93	325.21348811277204	296.72677946741743	20/04/28 05:17:51
1	93	325.0598697548398	296.85485777560143	20/04/28 05:17:51
1	93	325.053774623044	296.7419271948965	20/04/28 05:17:51
1	93	324.9685476245904	296.8997376197826	20/04/28 05:17:51
1	93	324.8841267065261	297.04838760522875	20/04/28 05:17:51
1	93	324.99923614857875	296.99453257898404	20/04/28 05:17:51
1	93	324.99624079427815	297.01409867765483	20/04/28 05:17:51
1	93	324.8752203433514	296.89412301002017	20/04/28 05:17:51
1	93	324.91539185117085	296.7831781638582	20/04/28 05:17:51
1	93	324.9452828792241	296.81194312796566	20/04/28 05:17:51
1	93	324.9895655538862	297.05373964987035	20/04/28 05:17:52
1	93	325.08848601052034	297.06043716067376	20/04/28 05:17:52
1	93	325.0880429944782	297.332440177108	20/04/28 05:17:52
1	93	325.09788904362154	297.317350646977	20/04/28 05:17:52
1	93	324.9802485631395	297.4166571799673	20/04/28 05:17:52
1	93	325.1316581791051	297.3054949033877	20/04/28 05:17:52
1	93	325.19070205391944	297.1855799151832	20/04/28 05:17:52
1	93	325.2844768419395	297.2822559412845	20/04/28 05:17:52
1	93	325.30493676065345	297.4523493746216	20/04/28 05:17:52
1	93	325.24859899484625	297.70668684806276	20/04/28 05:17:53
1	93	325.0861797272012	297.76005650127877	20/04/28 05:17:53
1	93	325.1133006795233	297.65986374022725	20/04/28 05:17:53
1	93	325.0192364902667	297.4712182930156	20/04/28 05:17:53
1	93	324.9764955872429	297.52179911323867	20/04/28 05:17:53
1	93	324.8472041865123	297.6844142044306	20/04/28 05:17:53
1	93	324.85262997281717	297.74874967360523	20/04/28 05:17:53
1	93	324.70218516736037	297.68733261883466	20/04/28 05:17:53
1	93	324.82766337223086	297.77967130166394	20/04/28 05:17:53
1	93	324.7381698533001	297.586109050109	20/04/28 05:17:53
1	93	324.8806137084654	297.62208720339186	20/04/28 05:17:54
1	93	324.9463409128311	297.7177278606049	20/04/28 05:17:54
1	93	325.0962483524091	297.6855990027978	20/04/28 05:17:54
1	93	325.17337199072955	297.6724171981666	20/04/28 05:17:54
1	93	325.10210425045096	297.8231855164562	20/04/28 05:17:54
1	93	325.159887579098	297.57070951119704	20/04/28 05:17:54
1	93	325.07466595960096	297.5610047427409	20/04/28 05:17:54
1	93	324.8531352605779	297.59154977813716	20/04/28 05:17:54
1	93	324.79681570317706	297.3165468063753	20/04/28 05:17:54
1	93	324.7863368069016	297.27454241716697	20/04/28 05:17:54
1	93	324.85656807990534	297.51796880185606	20/04/28 05:17:55
1	93	324.75432173867887	297.7577955367037	20/04/28 05:17:55
1	93	324.62627619168745	297.6592206701306	20/04/28 05:17:55
1	93	324.62610263940394	297.6588729080592	20/04/28 05:17:55
1	93	324.3776945015178	297.5934269184029	20/04/28 05:17:55
1	93	324.4309287855129	297.5629017986493	20/04/28 05:17:55
1	93	324.67704931958923	297.5676126594834	20/04/28 05:17:55
1	93	324.6682548850134	297.4230482641573	20/04/28 05:17:55
1	93	324.39338269752733	297.3795190089966	20/04/28 05:17:55
1	93	324.4789359542011	297.3364080759332	20/04/28 05:17:56
1	93	324.2418185997077	297.2058342656207	20/04/28 05:17:56
1	93	324.27268193006137	297.08388577308205	20/04/28 05:17:56
1	93	324.44991667451626	297.179878346132	20/04/28 05:17:56
1	93	324.44604313863044	297.2409872184662	20/04/28 05:17:56
1	93	324.4121516101579	297.3278974594408	20/04/28 05:17:56
1	93	324.4633488582705	297.2965823816638	20/04/28 05:17:56
1	93	324.48728165508084	297.06403485109115	20/04/28 05:17:56
1	93	324.46760845706	297.09404163396187	20/04/28 05:17:56
1	93	324.29243075767823	296.8572907573135	20/04/28 05:17:56
1	93	324.1514871531959	296.990639571935	20/04/28 05:17:57
1	93	324.1766971612279	296.9561381899275	20/04/28 05:17:57
1	93	324.4652180542834	296.8842124420925	20/04/28 05:17:57
1	93	324.55098079288064	297.07546386179524	20/04/28 05:17:57
1	93	324.40184196922957	297.1402153797797	20/04/28 05:17:57
1	93	324.1936122314834	297.0677331399264	20/04/28 05:17:57
1	93	324.15070204101727	297.08357811250966	20/04/28 05:17:57
1	93	324.18814728137914	297.37304870300034	20/04/28 05:17:57
1	93	324.30620319370416	297.136609752663	20/04/28 05:17:57
1	93	324.4749768174525	297.073681657398	20/04/28 05:17:58
1	93	324.42894076489574	297.04847629050374	20/04/28 05:17:58
1	93	324.3495315330061	297.06998591435257	20/04/28 05:17:58
1	93	324.3604981836331	297.09252419628865	20/04/28 05:17:58
1	93	324.4608323701121	297.13445400416464	20/04/28 05:17:58
1	93	324.48736704052595	297.0968429604313	20/04/28 05:17:58
1	93	324.46290886301813	297.2292428905814	20/04/28 05:17:58
1	93	324.39100670048146	297.30183602898023	20/04/28 05:17:58
1	93	324.4948288212446	297.1965096895903	20/04/28 05:17:58
1	93	324.5190565660109	297.3391846932866	20/04/28 05:17:58
1	93	324.32457887660263	297.24831368962015	20/04/28 05:17:59
1	93	324.2204163933629	297.1418844232508	20/04/28 05:17:59
1	93	324.0641435643645	296.9359008072408	20/04/28 05:17:59
1	93	323.80032505110535	296.86815313395124	20/04/28 05:17:59
1	93	323.817918094021	296.85268786047976	20/04/28 05:17:59
1	93	323.7440613960652	296.76234385689924	20/04/28 05:17:59
1	93	323.71992722195523	296.519125160845	20/04/28 05:17:59
1	93	323.50445533073906	296.34802268235836	20/04/28 05:17:59
1	93	323.545841143526	296.3420140439407	20/04/28 05:17:59
1	93	323.5081336456381	296.4176356107141	20/04/28 05:17:59
1	93	323.30334480948176	296.4374325532616	20/04/28 05:18:00
1	93	323.3629361957758	296.2793925953342	20/04/28 05:18:00
1	93	323.4096913815315	296.0452545283595	20/04/28 05:18:00
1	93	323.63232103541065	296.0634174669009	20/04/28 05:18:00
1	93	323.59192829571657	295.97100489406205	20/04/28 05:18:00
1	93	323.85159405143776	296.10759695310725	20/04/28 05:18:00
1	93	323.87945001129015	296.31318784136613	20/04/28 05:18:00
1	93	323.8693325279943	296.3076165734278	20/04/28 05:18:00
1	93	323.8997099630687	296.31626886565397	20/04/28 05:18:00
1	93	323.62999618524424	296.252320042181	20/04/28 05:18:01
1	93	323.60358945469517	296.23688995889756	20/04/28 05:18:01
1	93	323.6608226219261	296.2527321105364	20/04/28 05:18:01
1	93	323.6704842002027	296.21451556101056	20/04/28 05:18:01
1	93	323.6603195357231	296.1904985826717	20/04/28 05:18:01
1	93	323.68780825117705	295.95003440033986	20/04/28 05:18:01
1	93	323.83132546013	295.92579361552055	20/04/28 05:18:01
1	93	324.1012932327445	295.98155548256005	20/04/28 05:18:01
1	93	324.15414999466367	295.6944574550399	20/04/28 05:18:01
1	93	323.95071580438696	295.909123346121	20/04/28 05:18:01
1	93	323.82121134159604	295.79026570728774	20/04/28 05:18:02
1	93	323.90552353572525	295.7228113015324	20/04/28 05:18:02
1	93	323.8803343716636	295.74868106751654	20/04/28 05:18:02
1	93	323.8803343716636	295.74868106751654	20/04/28 05:18:02
1	93	323.8803343716636	295.74868106751654	20/04/28 05:18:02
1	93	323.77407134910516	295.8150842425159	20/04/28 05:18:02
1	93	323.8456487573903	295.81699306268786	20/04/28 05:18:02
1	93	323.90530670417905	295.96098159732236	20/04/28 05:18:02
1	93	323.9811329078464	295.98623029745437	20/04/28 05:18:02
1	93	323.9644982675708	295.7588300446846	20/04/28 05:18:02
1	93	324.16634536685797	295.6385822832807	20/04/28 05:18:03
1	93	324.45882507571747	295.6913446431607	20/04/28 05:18:03
1	93	324.4453646040984	295.85759683546394	20/04/28 05:18:03
1	93	324.1855771846121	295.74342301440817	20/04/28 05:18:03
1	93	324.30188538789866	295.8896948758406	20/04/28 05:18:03
1	93	324.3989907840626	296.1010855783181	20/04/28 05:18:03
1	93	324.2025042132422	295.9660672663162	20/04/28 05:18:03
1	93	324.2603046464087	295.8353042660932	20/04/28 05:18:03
1	93	324.3069050937742	296.06837900016524	20/04/28 05:18:03
1	93	324.433297240294	296.33665079101377	20/04/28 05:18:04
1	93	324.6776169924632	296.31547281789966	20/04/28 05:18:04
1	93	324.7511199058688	296.03530039066044	20/04/28 05:18:04
1	93	324.6654811595391	296.12693987571384	20/04/28 05:18:04
1	93	324.5319489695136	296.20311239354317	20/04/28 05:18:04
1	93	324.66969377419395	296.0879278164845	20/04/28 05:18:04
1	93	324.6903669832661	296.1123438721606	20/04/28 05:18:04
1	93	324.8956089009789	296.07778619467297	20/04/28 05:18:04
1	93	324.9187365332974	296.0652723431353	20/04/28 05:18:04
1	93	325.0525305418785	296.24680618089315	20/04/28 05:18:04
1	93	324.94152442682787	296.123592854626	20/04/28 05:18:05
1	93	324.9172935787593	296.3243047566726	20/04/28 05:18:05
1	93	324.89917708339675	296.2433577643667	20/04/28 05:18:05
1	93	325.0261012867171	296.45140708973565	20/04/28 05:18:05
1	93	325.0050359711477	296.4541917537434	20/04/28 05:18:05
1	93	325.0050359711477	296.4541917537434	20/04/28 05:18:05
