floorId	partitionId	location_x	location_y	timeStamp
19	955	331.14052623366666	274.53372397223194	21/02/24 15:38:00
19	955	331.14052623366666	274.53372397223194	21/02/24 15:38:01
19	955	328.92321811554416	278.4499778858854	21/02/24 15:38:02
19	955	328.92321811554416	278.4499778858854	21/02/24 15:38:03
19	NULL	326.2665356724085	280.50725420525265	21/02/24 15:38:04
19	NULL	322.7688919024709	282.9508947625264	21/02/24 15:38:05
19	911	321.43497119517593	280.68483158670483	21/02/24 15:38:06
19	897	319.01521359261704	283.59757186890573	21/02/24 15:38:07
19	897	319.01521359261704	283.59757186890573	21/02/24 15:38:08
19	897	319.01521359261704	283.59757186890573	21/02/24 15:38:09
19	897	319.01521359261704	283.59757186890573	21/02/24 15:38:10
19	975	315.07586920053365	286.03778962296946	21/02/24 15:38:11
19	975	315.07586920053365	286.03778962296946	21/02/24 15:38:12
19	897	319.01521359261704	283.59757186890573	21/02/24 15:38:13
19	897	319.01521359261704	283.59757186890573	21/02/24 15:38:14
19	897	319.01521359261704	283.59757186890573	21/02/24 15:38:15
19	897	319.01521359261704	283.59757186890573	21/02/24 15:38:16
19	897	319.01521359261704	283.59757186890573	21/02/24 15:38:17
19	897	319.01521359261704	283.59757186890573	21/02/24 15:38:18
19	897	319.01521359261704	283.59757186890573	21/02/24 15:38:19
19	NULL	322.7688919024709	282.9508947625264	21/02/24 15:38:20
19	NULL	322.7688919024709	282.9508947625264	21/02/24 15:38:21
19	NULL	326.2665356724085	280.50725420525265	21/02/24 15:38:22
19	955	328.92321811554416	278.4499778858854	21/02/24 15:38:23
19	955	328.92321811554416	278.4499778858854	21/02/24 15:38:24
19	955	328.92321811554416	278.4499778858854	21/02/24 15:38:25
19	955	328.92321811554416	278.4499778858854	21/02/24 15:38:26
19	909	333.7969183453893	273.32229963118385	21/02/24 15:38:27
19	909	333.7969183453893	273.32229963118385	21/02/24 15:38:28
19	909	341.47028904589564	272.96345906466144	21/02/24 15:38:29
19	964	344.3155484927012	283.53998029232963	21/02/24 15:38:30
19	964	349.72234002988336	284.71465847817086	21/02/24 15:38:31
19	964	349.72234002988336	284.71465847817086	21/02/24 15:38:32
19	968	355.71807547868275	279.11092240486005	21/02/24 15:38:33
19	968	355.71807547868275	279.11092240486005	21/02/24 15:38:34
19	964	355.482293890607	282.3613173869535	21/02/24 15:38:35
19	968	355.71807547868275	279.11092240486005	21/02/24 15:38:36
19	945	357.7218077022862	278.62087605071156	21/02/24 15:38:37
19	968	355.71807547868275	279.11092240486005	21/02/24 15:38:38
19	945	357.7218077022862	278.62087605071156	21/02/24 15:38:39
19	945	357.7218077022862	278.62087605071156	21/02/24 15:38:40
19	945	357.7218077022862	278.62087605071156	21/02/24 15:38:41
19	945	357.7218077022862	278.62087605071156	21/02/24 15:38:42
19	968	355.71807547868275	279.11092240486005	21/02/24 15:38:43
19	904	356.7863299312423	273.21510555058285	21/02/24 15:38:44
19	904	356.7863299312423	273.21510555058285	21/02/24 15:38:45
19	945	357.7218077022862	278.62087605071156	21/02/24 15:38:46
19	945	357.7218077022862	278.62087605071156	21/02/24 15:38:47
19	945	357.72180770228624	278.62087605071156	21/02/24 15:38:48
19	964	355.482293890607	282.36131738695343	21/02/24 15:38:49
19	964	355.482293890607	282.3613173869535	21/02/24 15:38:50
19	964	355.482293890607	282.3613173869535	21/02/24 15:38:51
19	968	355.71807547868275	279.11092240486005	21/02/24 15:38:52
19	964	355.482293890607	282.36131738695343	21/02/24 15:38:53
19	968	355.71807547868275	279.11092240486005	21/02/24 15:38:54
19	964	355.482293890607	282.36131738695343	21/02/24 15:38:55
19	964	355.482293890607	282.36131738695343	21/02/24 15:38:56
19	964	355.482293890607	282.3613173869535	21/02/24 15:38:57
19	945	357.72180770228624	278.62087605071156	21/02/24 15:38:58
19	964	355.482293890607	282.3613173869535	21/02/24 15:38:59
19	964	355.482293890607	282.3613173869535	21/02/24 15:39:00
19	964	355.482293890607	282.3613173869535	21/02/24 15:39:01
19	964	349.72234002988336	284.71465847817086	21/02/24 15:39:02
19	940	347.9711572177418	278.13370891448585	21/02/24 15:39:03
19	964	344.3155484927012	283.53998029232963	21/02/24 15:39:04
19	915	336.5415648801153	280.3558442180772	21/02/24 15:39:05
19	955	332.13398995625107	274.9863189954403	21/02/24 15:39:06
19	955	331.5796102272668	277.2385535448373	21/02/24 15:39:07
19	955	328.92321811554416	278.4499778858854	21/02/24 15:39:08
19	955	328.92321811554416	278.4499778858854	21/02/24 15:39:09
19	955	328.92321811554416	278.4499778858854	21/02/24 15:39:10
19	955	328.92321811554416	278.4499778858854	21/02/24 15:39:11
19	NULL	322.7688919024709	282.9508947625264	21/02/24 15:39:12
19	NULL	322.7688919024709	282.9508947625264	21/02/24 15:39:13
19	897	319.01521359261704	283.59757186890573	21/02/24 15:39:14
19	897	319.01521359261704	283.59757186890573	21/02/24 15:39:15
19	897	319.01521359261704	283.59757186890573	21/02/24 15:39:16
19	897	319.01521359261704	283.59757186890573	21/02/24 15:39:17
19	897	319.01521359261704	283.59757186890573	21/02/24 15:39:18
19	897	319.01521359261704	283.59757186890573	21/02/24 15:39:19
19	897	319.01521359261704	283.59757186890573	21/02/24 15:39:20
19	897	319.01521359261704	283.59757186890573	21/02/24 15:39:21
19	897	319.01521359261704	283.59757186890573	21/02/24 15:39:22
19	897	319.01521359261704	283.59757186890573	21/02/24 15:39:23
19	897	319.01521359261704	283.59757186890573	21/02/24 15:39:24
19	897	319.01521359261704	283.59757186890573	21/02/24 15:39:25
19	897	319.01521359261704	283.59757186890573	21/02/24 15:39:26
19	911	321.43497119517593	280.68483158670483	21/02/24 15:39:27
19	911	321.43497119517593	280.6848315867048	21/02/24 15:39:28
19	938	320.06540842682995	274.628200335538	21/02/24 15:39:29
19	938	320.06540842682995	274.628200335538	21/02/24 15:39:30
19	938	320.06540842682995	274.628200335538	21/02/24 15:39:31
19	955	324.54280201671514	277.9190966181156	21/02/24 15:39:32
19	938	319.6142600484264	275.33665898475994	21/02/24 15:39:33
19	909	322.2597600934958	270.0626572957563	21/02/24 15:39:34
19	938	320.06540842682995	274.628200335538	21/02/24 15:39:35
19	938	315.6384393527919	272.97827146710677	21/02/24 15:39:36
19	938	320.06540842682995	274.628200335538	21/02/24 15:39:37
19	938	315.6384393527919	272.97827146710677	21/02/24 15:39:38
19	938	315.6384393527919	272.97827146710677	21/02/24 15:39:39
19	938	315.6384393527919	272.97827146710677	21/02/24 15:39:40
19	938	315.6384393527919	272.9782714671068	21/02/24 15:39:41
19	938	320.06540842682995	274.628200335538	21/02/24 15:39:42
19	938	316.2262659388113	269.2456724805139	21/02/24 15:39:43
19	909	322.72209086996554	272.5709240161707	21/02/24 15:39:44
19	900	321.3196420966728	268.8413887464654	21/02/24 15:39:45
19	909	322.2597600934958	270.06265729575637	21/02/24 15:39:46
19	900	325.33470491008825	269.6240183086286	21/02/24 15:39:47
19	909	326.737153683381	273.3535535783339	21/02/24 15:39:48
19	909	326.737153683381	273.3535535783339	21/02/24 15:39:49
19	900	327.22300534636753	269.6378469350531	21/02/24 15:39:50
19	909	326.737153683381	273.3535535783339	21/02/24 15:39:51
19	909	329.0152670680587	273.689476616074	21/02/24 15:39:52
19	909	326.737153683381	273.3535535783339	21/02/24 15:39:53
19	909	326.737153683381	273.3535535783339	21/02/24 15:39:54
19	909	326.737153683381	273.3535535783339	21/02/24 15:39:55
19	909	326.737153683381	273.3535535783339	21/02/24 15:39:56
19	909	326.737153683381	273.3535535783339	21/02/24 15:39:57
19	909	329.0152670680587	273.689476616074	21/02/24 15:39:58
19	909	329.0152670680587	273.689476616074	21/02/24 15:39:59
19	909	326.737153683381	273.3535535783339	21/02/24 15:40:00
19	909	326.737153683381	273.3535535783339	21/02/24 15:40:01
19	909	326.737153683381	273.3535535783339	21/02/24 15:40:02
19	900	327.2230053463675	269.6378469350531	21/02/24 15:40:03
19	909	326.737153683381	273.3535535783339	21/02/24 15:40:04
19	909	329.0152670680587	273.689476616074	21/02/24 15:40:05
19	909	329.0152670680587	273.689476616074	21/02/24 15:40:06
19	909	330.2883825087984	271.703362840502	21/02/24 15:40:07
19	909	333.79691834538926	273.32229963118385	21/02/24 15:40:08
19	909	333.4071053969908	273.0002052198683	21/02/24 15:40:09
19	909	333.79691834538926	273.32229963118385	21/02/24 15:40:10
19	NULL	337.73701806888556	270.34580290420837	21/02/24 15:40:11
19	NULL	337.73701806888556	270.34580290420837	21/02/24 15:40:12
19	919	340.2475697813879	268.6028650417705	21/02/24 15:40:13
19	919	341.8507959684553	269.41861351939014	21/02/24 15:40:14
19	904	347.25758750563756	270.59329170523137	21/02/24 15:40:15
19	954	349.64467777791396	276.6907309398741	21/02/24 15:40:16
19	954	351.0914713947271	276.75392450645927	21/02/24 15:40:17
19	968	355.71807547868275	279.11092240486005	21/02/24 15:40:18
19	964	355.482293890607	282.3613173869535	21/02/24 15:40:19
19	964	355.482293890607	282.3613173869535	21/02/24 15:40:20
19	964	355.482293890607	282.3613173869535	21/02/24 15:40:21
19	990	357.82242061436574	282.16385269148645	21/02/24 15:40:22
19	NULL	361.8602798513784	283.01660848074425	21/02/24 15:40:23
19	990	363.02552872525683	282.5550180117545	21/02/24 15:40:24
19	958	366.610069358505	283.9792033041277	21/02/24 15:40:25
19	910	370.3346661920939	284.10402409280755	21/02/24 15:40:26
19	990	373.5702263177357	281.590961967497	21/02/24 15:40:27
19	990	373.5702263177357	281.590961967497	21/02/24 15:40:28
19	990	373.5702263177357	281.5909619674969	21/02/24 15:40:29
19	NULL	375.7018838907682	280.5525699379839	21/02/24 15:40:30
19	NULL	375.70188389076833	280.5525699379839	21/02/24 15:40:31
19	NULL	375.70188389076833	280.5525699379839	21/02/24 15:40:32
19	937	374.63236040462476	279.0631299285737	21/02/24 15:40:33
19	937	374.63236040462476	279.0631299285737	21/02/24 15:40:34
19	937	374.63236040462476	279.0631299285737	21/02/24 15:40:35
19	937	374.63236040462476	279.0631299285737	21/02/24 15:40:36
19	937	374.63236040462476	279.0631299285737	21/02/24 15:40:37
19	937	374.63236040462476	279.0631299285737	21/02/24 15:40:38
19	937	374.63236040462476	279.0631299285737	21/02/24 15:40:39
19	937	374.63236040462476	279.0631299285737	21/02/24 15:40:40
19	937	374.63236040462476	279.0631299285737	21/02/24 15:40:41
19	937	374.63236040462476	279.0631299285737	21/02/24 15:40:42
19	937	374.6323604046247	279.06312992857363	21/02/24 15:40:43
19	937	374.63236040462476	279.0631299285737	21/02/24 15:40:44
19	937	374.6323604046247	279.06312992857363	21/02/24 15:40:45
19	937	374.63236040462476	279.0631299285737	21/02/24 15:40:46
19	937	374.63236040462476	279.0631299285737	21/02/24 15:40:47
19	NULL	375.7018838907682	280.5525699379839	21/02/24 15:40:48
19	990	373.5702263177357	281.5909619674969	21/02/24 15:40:49
19	990	373.5702263177357	281.590961967497	21/02/24 15:40:50
19	990	373.5702263177357	281.590961967497	21/02/24 15:40:51
19	910	370.3346661920939	284.1040240928075	21/02/24 15:40:52
19	990	366.8458509465807	280.72880832203424	21/02/24 15:40:53
19	NULL	360.5547106147949	283.12207921272073	21/02/24 15:40:54
19	987	360.4804147429043	276.7888416553232	21/02/24 15:40:55
19	987	360.4804147429043	276.7888416553232	21/02/24 15:40:56
19	NULL	358.3760696072213	273.7359113686968	21/02/24 15:40:57
19	NULL	358.3760696072213	273.7359113686968	21/02/24 15:40:58
19	NULL	358.3760696072213	273.7359113686968	21/02/24 15:40:59
19	NULL	358.3760696072213	273.7359113686968	21/02/24 15:41:00
19	945	357.72180770228624	278.62087605071156	21/02/24 15:41:01
19	945	357.72180770228624	278.62087605071156	21/02/24 15:41:02
19	987	360.4804147429043	276.7888416553232	21/02/24 15:41:03
19	945	357.72180770228624	278.62087605071156	21/02/24 15:41:04
19	945	357.72180770228624	278.62087605071156	21/02/24 15:41:05
19	945	357.7218077022862	278.62087605071156	21/02/24 15:41:06
19	NULL	358.3760696072213	273.7359113686968	21/02/24 15:41:07
19	NULL	358.3760696072213	273.7359113686968	21/02/24 15:41:08
19	NULL	358.3760696072213	273.7359113686968	21/02/24 15:41:09
