floorId	partitionId	location_x	location_y	timeStamp
1	50	326.34794436810495	289.829004440674	20/04/28 05:11:40
1	50	326.4957215923686	289.7966122258197	20/04/28 05:11:40
1	50	326.52529563569715	289.80333964384647	20/04/28 05:11:40
1	50	326.52529563569715	289.80333964384647	20/04/28 05:11:40
1	50	326.6039950218251	289.89632804916806	20/04/28 05:11:40
1	50	326.84580496813084	289.8309247578393	20/04/28 05:11:40
1	50	326.77819500376387	289.8037172552168	20/04/28 05:11:40
1	50	326.69645129542795	289.7253649480674	20/04/28 05:11:40
1	50	326.6646879771839	289.729678243255	20/04/28 05:11:41
1	50	326.7897846738738	289.8078167993692	20/04/28 05:11:41
1	50	326.755041978807	289.7118860627444	20/04/28 05:11:41
1	50	326.9428316759483	289.8602895954957	20/04/28 05:11:41
1	50	327.05952057904466	289.9519526078307	20/04/28 05:11:41
1	50	326.84082686674344	289.9425686795154	20/04/28 05:11:41
1	50	326.74327911333097	289.8500995307508	20/04/28 05:11:41
1	50	326.6511549054951	289.75620503180215	20/04/28 05:11:41
1	50	326.8145916763032	289.72110263015526	20/04/28 05:11:41
1	50	326.8145916763032	289.72110263015526	20/04/28 05:11:42
1	50	326.7862040245845	289.73906316951206	20/04/28 05:11:42
1	50	326.7711455046028	289.81548102123116	20/04/28 05:11:42
1	50	326.75812349907625	290.03915067473594	20/04/28 05:11:42
1	50	326.84564335800866	290.2581423055466	20/04/28 05:11:42
1	50	326.7886628933532	290.09599908677694	20/04/28 05:11:42
1	50	326.74720803444364	290.01147155245565	20/04/28 05:11:42
1	50	326.7625124955466	289.99501011803295	20/04/28 05:11:42
1	50	326.6614545196224	290.17690127789933	20/04/28 05:11:42
1	50	326.71846362693844	290.42101323402306	20/04/28 05:11:42
1	50	326.71846362693844	290.42101323402306	20/04/28 05:11:43
1	50	326.87717393589696	290.5596217664095	20/04/28 05:11:43
1	50	326.87717393589696	290.5596217664095	20/04/28 05:11:43
1	50	326.99983973018675	290.7923406409058	20/04/28 05:11:43
1	50	326.67052309997706	290.8879197259446	20/04/28 05:11:43
1	50	326.67052309997706	290.8879197259446	20/04/28 05:11:43
1	50	326.3960383922671	290.92973352603553	20/04/28 05:11:43
1	50	326.3756854842436	290.97978248311085	20/04/28 05:11:43
1	50	326.6262049613212	290.8554171665276	20/04/28 05:11:43
1	50	326.527091284685	290.9180036163469	20/04/28 05:11:43
1	50	326.6092217122437	290.9018304960501	20/04/28 05:11:44
1	50	326.5127632222502	290.93163218939293	20/04/28 05:11:44
1	50	326.5127632222502	290.93163218939293	20/04/28 05:11:44
1	50	326.55700075700884	290.99520190869066	20/04/28 05:11:44
1	50	326.53250315031556	291.27073880450916	20/04/28 05:11:44
1	50	326.47295607828283	291.4231079222604	20/04/28 05:11:44
1	50	326.6195985507557	291.31732820579685	20/04/28 05:11:44
1	50	326.50884197748434	291.0397683653871	20/04/28 05:11:44
1	50	326.50415568126243	291.03406707785103	20/04/28 05:11:44
1	50	326.50964397429976	291.0740969690569	20/04/28 05:11:45
1	50	326.4649944484771	291.039411505708	20/04/28 05:11:45
1	50	326.4189002629791	290.76490342440763	20/04/28 05:11:45
1	50	326.41495546687696	290.75612080008875	20/04/28 05:11:45
1	50	326.6154980807354	290.760343525309	20/04/28 05:11:45
1	50	326.6551311642603	290.9837891366408	20/04/28 05:11:45
1	50	326.43430734797363	290.9282660521448	20/04/28 05:11:45
1	50	326.2167455778094	290.98322394138813	20/04/28 05:11:45
1	50	326.35114825249195	290.97313603390677	20/04/28 05:11:45
1	50	326.17625074255983	290.9448765785612	20/04/28 05:11:45
1	50	326.25211522778466	291.12358821762183	20/04/28 05:11:46
1	50	326.0395808812611	291.23786426942894	20/04/28 05:11:46
1	50	325.9634001404506	291.10644467258726	20/04/28 05:11:46
1	50	326.0391921183515	291.1273140373677	20/04/28 05:11:46
1	50	326.0391921183515	291.1273140373677	20/04/28 05:11:46
1	50	326.0099201625184	291.14283777754986	20/04/28 05:11:46
1	50	325.9252962753727	290.9395892645855	20/04/28 05:11:46
1	50	325.9252962753727	290.9395892645855	20/04/28 05:11:46
1	50	325.74869474103275	290.7995941872449	20/04/28 05:11:46
1	50	325.53754459134115	290.9222739165141	20/04/28 05:11:47
1	50	325.5481426521954	290.88835349640675	20/04/28 05:11:47
1	50	325.7269653311725	290.67470538945935	20/04/28 05:11:47
1	50	325.7832375467905	290.79682423143	20/04/28 05:11:47
1	50	325.8736212618159	290.5871215285032	20/04/28 05:11:47
1	50	325.69329559420856	290.5149961973362	20/04/28 05:11:47
1	50	325.702453490007	290.54847615900064	20/04/28 05:11:47
1	50	325.66689968224176	290.26543868846704	20/04/28 05:11:47
1	50	325.6696494702744	290.2688403599055	20/04/28 05:11:47
1	50	325.65509593076473	290.3941301313875	20/04/28 05:11:47
1	50	325.65509593076473	290.3941301313875	20/04/28 05:11:48
1	50	325.80222548437905	290.1704285635895	20/04/28 05:11:48
1	50	325.85351264380637	290.356228184734	20/04/28 05:11:48
1	50	325.9461851846725	290.09891966785756	20/04/28 05:11:48
1	50	326.2171213546249	290.0537807807881	20/04/28 05:11:48
1	50	326.2080093378586	290.0263551684796	20/04/28 05:11:48
1	50	326.2080093378586	290.0263551684796	20/04/28 05:11:48
1	50	325.88689095908904	289.9029589199186	20/04/28 05:11:48
1	50	325.88456102898675	289.91297380555	20/04/28 05:11:48
1	50	325.89298906640033	290.0179119861801	20/04/28 05:11:48
1	50	325.89298906640033	290.0179119861801	20/04/28 05:11:49
1	50	326.12665022856345	290.20569329297575	20/04/28 05:11:49
1	50	326.1189347671945	290.22306609037383	20/04/28 05:11:49
1	50	326.1752846055437	290.4378228176394	20/04/28 05:11:49
1	50	326.18747010416007	290.4828376948079	20/04/28 05:11:49
1	50	326.11753268627757	290.4497068496679	20/04/28 05:11:49
1	50	326.0139136077728	290.5133688627176	20/04/28 05:11:49
1	50	326.2139398274914	290.6154213951722	20/04/28 05:11:49
1	50	326.1263358663106	290.741979171923	20/04/28 05:11:49
1	50	326.11032472743005	290.4788483218416	20/04/28 05:11:50
1	50	326.15804164199267	290.76178498753455	20/04/28 05:11:50
1	50	326.25192118329977	290.8202711672995	20/04/28 05:11:50
1	50	326.38620934178033	290.7210149195259	20/04/28 05:11:50
1	50	326.28539802764897	290.7279307669522	20/04/28 05:11:50
1	50	326.2276548169004	290.71496570552375	20/04/28 05:11:50
1	50	326.29877275451105	290.81867207102977	20/04/28 05:11:50
1	50	326.1443238331762	290.60120906760255	20/04/28 05:11:50
1	50	326.27250370138734	290.71863412600186	20/04/28 05:11:50
1	50	326.25594676661996	290.8697465814713	20/04/28 05:11:50
1	50	326.28891897760553	290.78538556497926	20/04/28 05:11:51
1	50	326.42912779442116	290.80569234627956	20/04/28 05:11:51
1	50	326.4693209696232	290.7065405220444	20/04/28 05:11:51
1	50	326.4693209696232	290.7065405220444	20/04/28 05:11:51
1	50	326.2747377639696	290.7473956066073	20/04/28 05:11:51
1	50	326.4823052548009	290.8711690761788	20/04/28 05:11:51
1	50	326.4384966334124	290.91625070332776	20/04/28 05:11:51
1	50	326.437660426306	290.91685206328884	20/04/28 05:11:51
1	50	326.437660426306	290.91685206328884	20/04/28 05:11:51
1	50	326.437660426306	290.91685206328884	20/04/28 05:11:52
1	50	326.2452717516352	290.7459107116937	20/04/28 05:11:52
1	50	326.16766360160307	290.6695375830667	20/04/28 05:11:52
1	50	326.3592048720587	290.4992995442187	20/04/28 05:11:52
1	50	326.2583545183879	290.77166517494004	20/04/28 05:11:52
1	50	326.31934714891094	290.7490723963289	20/04/28 05:11:52
1	50	326.3376202270137	291.02723031945874	20/04/28 05:11:52
1	50	326.3125406724529	291.0659635654825	20/04/28 05:11:52
1	50	326.29658070440763	290.90810743611746	20/04/28 05:11:52
1	50	326.44320934641183	290.7742375604856	20/04/28 05:11:52
1	50	326.3613890339417	290.738521197094	20/04/28 05:11:53
1	50	326.21598116117616	290.52794184493087	20/04/28 05:11:53
1	50	326.2971782449776	290.5122063476578	20/04/28 05:11:53
1	50	326.32508902128274	290.5653893186497	20/04/28 05:11:53
1	50	326.21384310534324	290.63622153937854	20/04/28 05:11:53
1	50	326.4086567947676	290.4106560202872	20/04/28 05:11:53
1	50	326.5004327676822	290.6884703559307	20/04/28 05:11:53
1	50	326.34722805919085	290.5448140842955	20/04/28 05:11:53
1	50	326.3784341339658	290.53718461097304	20/04/28 05:11:53
1	50	326.38094337034573	290.5406427365076	20/04/28 05:11:53
1	50	326.3145374928087	290.4662336911023	20/04/28 05:11:54
1	50	326.289209290279	290.45525683889	20/04/28 05:11:54
1	50	326.38791277738	290.50169547260975	20/04/28 05:11:54
1	50	326.50987687178355	290.5325383866595	20/04/28 05:11:54
1	50	326.3747262265627	290.62785983977227	20/04/28 05:11:54
1	50	326.51502320664997	290.7281568720432	20/04/28 05:11:54
1	50	326.3525166030192	290.89849063849994	20/04/28 05:11:54
1	50	326.1734335088493	290.9471377057491	20/04/28 05:11:54
1	50	325.98034177163873	291.0352624572083	20/04/28 05:11:54
1	50	326.0507069696439	291.070277527795	20/04/28 05:11:55
1	50	325.8254242524416	291.0948057697436	20/04/28 05:11:55
1	50	325.8308647528921	291.2455419028442	20/04/28 05:11:55
1	50	326.00888464665445	291.21743703588146	20/04/28 05:11:55
1	50	326.20294351018975	291.23485579811694	20/04/28 05:11:55
1	50	326.26186637374633	291.3034310512885	20/04/28 05:11:55
1	50	326.1776985943543	291.44886135812374	20/04/28 05:11:55
1	50	326.0210354683076	291.55690082283826	20/04/28 05:11:55
1	50	326.1523064286813	291.5232475597939	20/04/28 05:11:55
1	50	325.9346537102237	291.4031528341953	20/04/28 05:11:55
1	50	325.98694658247507	291.5223237725824	20/04/28 05:11:56
1	50	326.0023421289284	291.37763509610306	20/04/28 05:11:56
1	50	326.0039119242597	291.37323907703137	20/04/28 05:11:56
1	50	325.7904155774214	291.42414448069775	20/04/28 05:11:56
1	50	325.79100435692374	291.4481175384015	20/04/28 05:11:56
1	50	325.9789810772503	291.2341128701191	20/04/28 05:11:56
1	50	326.23154696502417	291.16664195086776	20/04/28 05:11:56
1	50	326.2803160609912	291.2471905060694	20/04/28 05:11:56
1	50	326.29156241399664	291.4179151214151	20/04/28 05:11:56
1	50	326.5834021323431	291.4017503299793	20/04/28 05:11:56
1	50	326.6463112283227	291.4410043850486	20/04/28 05:11:57
1	50	326.6463112283227	291.4410043850486	20/04/28 05:11:57
1	50	327.0258561185811	291.59062327796045	20/04/28 05:11:57
1	50	327.0258561185811	291.59062327796045	20/04/28 05:11:57
1	50	326.9334810759704	291.7470757260252	20/04/28 05:11:57
1	50	326.8248361792759	291.72378294561923	20/04/28 05:11:57
1	50	326.81747821453826	291.3440129635092	20/04/28 05:11:57
1	50	326.7920645298467	291.35455357690984	20/04/28 05:11:57
1	50	326.9296290762412	291.57988834139763	20/04/28 05:11:57
1	50	326.99489024328716	291.75123673895285	20/04/28 05:11:58
1	50	326.96524318013417	291.6715677084499	20/04/28 05:11:58
1	50	327.0428596205398	291.6227567050942	20/04/28 05:11:58
1	50	326.99429654840515	291.63615732628386	20/04/28 05:11:58
1	50	326.99429654840515	291.63615732628386	20/04/28 05:11:58
1	50	327.1220785056136	291.78931178476336	20/04/28 05:11:58
1	50	327.12053684976087	291.7911931367689	20/04/28 05:11:58
1	50	327.12176722219635	291.7826804864679	20/04/28 05:11:58
1	50	327.1747746107405	291.49673454569205	20/04/28 05:11:58
1	50	327.4248845347745	291.4765501676268	20/04/28 05:11:58
1	50	327.36092064334696	291.4178115036978	20/04/28 05:11:59
1	50	327.0924609856809	291.41076848420016	20/04/28 05:11:59
1	50	326.95515821012253	291.6402951758491	20/04/28 05:11:59
1	50	327.13172783611424	291.86760505249663	20/04/28 05:11:59
1	50	327.1188543663001	292.04078610544997	20/04/28 05:11:59
1	50	327.08564552026206	292.0836860922465	20/04/28 05:11:59
1	50	327.06442447062517	292.268308254623	20/04/28 05:11:59
1	50	327.097237396199	292.06529689150994	20/04/28 05:11:59
1	50	327.026903509951	292.18349589942886	20/04/28 05:11:59
1	50	326.79449438267096	292.17645765185597	20/04/28 05:11:59
1	50	326.6283257341472	291.9303690179642	20/04/28 05:12:00
1	50	326.36837430926374	291.9599175391266	20/04/28 05:12:00
1	50	326.3818227377302	291.94312357600495	20/04/28 05:12:00
1	50	326.3818227377302	291.94312357600495	20/04/28 05:12:00
1	50	326.51307650459364	291.78538331420714	20/04/28 05:12:00
1	50	326.5576940788212	291.84357276111024	20/04/28 05:12:00
1	50	326.4319729889581	291.7893922884256	20/04/28 05:12:00
1	50	326.47908951524437	291.8595609586437	20/04/28 05:12:00
1	50	326.6749698457854	291.8733653797409	20/04/28 05:12:00
1	50	326.6749698457854	291.8733653797409	20/04/28 05:12:01
1	50	326.79141871504885	292.11895654298627	20/04/28 05:12:01
1	50	326.7667395535283	292.1274723398832	20/04/28 05:12:01
1	50	326.7370272031502	292.0659688461745	20/04/28 05:12:01
1	50	326.7743353834242	292.2260327990269	20/04/28 05:12:01
1	50	326.977574329881	292.3904495500082	20/04/28 05:12:01
1	50	326.85573544602534	292.38304376585626	20/04/28 05:12:01
1	50	326.80342214345325	292.4039687050017	20/04/28 05:12:01
1	50	326.81135300597776	292.37477424312044	20/04/28 05:12:01
1	50	326.72141616395834	292.19129727196093	20/04/28 05:12:01
1	50	326.58834252067686	292.2131087989458	20/04/28 05:12:02
1	50	326.4289150871105	292.4221306490807	20/04/28 05:12:02
1	50	326.20089333339087	292.1159693110156	20/04/28 05:12:02
1	50	326.17369698388376	292.21160691698327	20/04/28 05:12:02
1	50	326.1882634087405	292.2462666417371	20/04/28 05:12:02
1	50	326.1882634087405	292.2462666417371	20/04/28 05:12:02
1	50	326.3761668214951	292.39113623787637	20/04/28 05:12:02
1	50	326.3768669552384	292.4371401850702	20/04/28 05:12:02
1	50	326.3636294921084	292.4727654345208	20/04/28 05:12:02
1	50	326.4456887921477	292.60021970521547	20/04/28 05:12:03
1	50	326.444942970319	292.4435005508777	20/04/28 05:12:03
1	50	326.4848900541873	292.39168211998594	20/04/28 05:12:03
1	50	326.3807122303366	292.4159341377709	20/04/28 05:12:03
1	50	326.2307866062763	292.4650820720661	20/04/28 05:12:03
1	50	326.15973263571533	292.31900839413703	20/04/28 05:12:03
1	50	326.23308186279303	292.22976411547626	20/04/28 05:12:03
1	50	326.2507157407281	292.2813064862573	20/04/28 05:12:03
1	50	326.2358511245718	292.27439698089086	20/04/28 05:12:03
1	50	326.0386851942715	292.37815181312436	20/04/28 05:12:03
1	50	325.8967532039843	292.3697285232409	20/04/28 05:12:04
1	50	326.0244925264433	292.3598081322977	20/04/28 05:12:04
1	50	326.1286616673942	292.2654421601512	20/04/28 05:12:04
1	50	325.9382315386095	292.13053392347973	20/04/28 05:12:04
1	50	325.91675854492746	292.1175238779236	20/04/28 05:12:04
1	50	325.92945263313413	292.41723371444044	20/04/28 05:12:04
1	50	326.01469652845896	292.25857245962806	20/04/28 05:12:04
1	50	326.2632498153338	292.2189523223908	20/04/28 05:12:04
1	50	326.05676317300333	292.43621240605114	20/04/28 05:12:04
1	50	326.04913819005026	292.4300111970197	20/04/28 05:12:04
1	50	326.1735803986404	292.16241405033753	20/04/28 05:12:05
1	50	326.10500118929235	292.22050361430973	20/04/28 05:12:05
1	50	326.24105101104936	292.1991672432528	20/04/28 05:12:05
1	50	326.2887551866555	292.08996268498606	20/04/28 05:12:05
1	50	326.3301510314584	292.3394117887717	20/04/28 05:12:05
1	50	326.2135222846738	292.4022631086248	20/04/28 05:12:05
1	50	326.0261007595532	292.50756644373274	20/04/28 05:12:05
1	50	326.25877452555	292.69239121016716	20/04/28 05:12:05
1	50	326.10956285130294	292.59648592671175	20/04/28 05:12:05
1	50	326.1083638875102	292.4452624284363	20/04/28 05:12:06
1	50	326.10880265795714	292.44190401164707	20/04/28 05:12:06
1	50	326.1089055349164	292.4418881298452	20/04/28 05:12:06
1	50	326.1848071350189	292.4743833912057	20/04/28 05:12:06
1	50	326.1707961108642	292.50241424824975	20/04/28 05:12:06
1	50	326.0252187185947	292.37853243996693	20/04/28 05:12:06
1	50	325.93562090844966	292.5208376024936	20/04/28 05:12:06
1	50	325.94570241168515	292.5454901660606	20/04/28 05:12:06
1	50	326.0427407063957	292.66970948448443	20/04/28 05:12:06
1	50	326.28091676445564	292.5997571092793	20/04/28 05:12:06
1	50	326.29973584669847	292.5707014790188	20/04/28 05:12:07
1	50	326.33253643976764	292.49262885482085	20/04/28 05:12:07
1	50	326.3496216414954	292.5152300470708	20/04/28 05:12:07
1	50	326.57865848527075	292.45488499603454	20/04/28 05:12:07
1	50	326.6109100051583	292.47442446364494	20/04/28 05:12:07
1	50	326.61745177940554	292.47372690804315	20/04/28 05:12:07
1	50	326.82321462358425	292.2795941810685	20/04/28 05:12:07
1	50	326.70530896810544	292.20174715868524	20/04/28 05:12:07
1	50	326.81675053504927	292.10856541584286	20/04/28 05:12:07
1	50	326.8569438342153	291.95246910843986	20/04/28 05:12:07
1	50	326.8686711407579	291.9647670600582	20/04/28 05:12:08
1	50	326.76998938218736	292.00875312746524	20/04/28 05:12:08
1	50	326.962373883918	291.79666361408107	20/04/28 05:12:08
1	50	326.9894784735224	291.6614484601988	20/04/28 05:12:08
1	50	326.81915706314834	291.674018205506	20/04/28 05:12:08
1	50	326.8882527469479	291.5169669769736	20/04/28 05:12:08
1	50	326.9522344656471	291.6415218075858	20/04/28 05:12:08
1	50	326.867998456926	291.7185936236801	20/04/28 05:12:08
1	50	326.7969217163333	291.5854391150251	20/04/28 05:12:08
1	50	326.80417545238157	291.66701101047425	20/04/28 05:12:09
1	50	326.6742947525831	291.5911117596711	20/04/28 05:12:09
1	50	326.6750430772509	291.56875216959065	20/04/28 05:12:09
1	50	326.63840997897205	291.63106405779934	20/04/28 05:12:09
1	50	326.64702600008405	291.924515730296	20/04/28 05:12:09
1	50	326.63906904761217	291.96164483571096	20/04/28 05:12:09
1	50	326.74577398106265	291.9653710418599	20/04/28 05:12:09
1	50	326.77830986308	291.92198267495104	20/04/28 05:12:09
1	50	326.8068046465923	291.7937101573841	20/04/28 05:12:09
1	50	326.8068046465923	291.7937101573841	20/04/28 05:12:09
1	50	326.7194053363452	292.0783032298246	20/04/28 05:12:10
1	50	326.3912353783689	292.0413797542646	20/04/28 05:12:10
1	50	326.19631394172944	292.1912198225672	20/04/28 05:12:10
1	50	326.25181077056817	292.3219943767592	20/04/28 05:12:10
1	50	326.1977605985845	292.4736509880318	20/04/28 05:12:10
1	50	326.2237859120941	292.37845364474265	20/04/28 05:12:10
1	50	326.3633494417978	292.2923636552382	20/04/28 05:12:10
1	50	326.3787893037283	292.3370429665243	20/04/28 05:12:10
1	50	326.2973835403502	292.4186045550864	20/04/28 05:12:10
1	50	326.2990809416202	292.4165434665843	20/04/28 05:12:11
1	50	326.3296406775958	292.59580620589776	20/04/28 05:12:11
1	50	326.33227726818467	292.5954064970053	20/04/28 05:12:11
1	50	326.18071785498654	292.5929253470089	20/04/28 05:12:11
1	50	326.1847660827524	292.6170565219924	20/04/28 05:12:11
1	50	326.30770368445826	292.70099033772726	20/04/28 05:12:11
1	50	326.30770368445826	292.70099033772726	20/04/28 05:12:11
1	50	326.24001748519936	292.88886211288144	20/04/28 05:12:11
1	50	326.2166486677798	292.8202500406375	20/04/28 05:12:11
1	50	326.0732719403679	292.87419191991285	20/04/28 05:12:11
1	50	326.0732719403679	292.87419191991285	20/04/28 05:12:12
1	50	326.2370892623634	292.641878401843	20/04/28 05:12:12
1	50	326.2370892623634	292.641878401843	20/04/28 05:12:12
1	50	326.2682898064063	292.62361134681606	20/04/28 05:12:12
1	50	326.6202516760177	292.4245167892657	20/04/28 05:12:12
1	50	326.6202516760177	292.4245167892657	20/04/28 05:12:12
1	50	326.3398315203455	292.2681463917556	20/04/28 05:12:12
1	50	326.22922505750034	292.3244982599895	20/04/28 05:12:12
1	50	326.22922505750034	292.3244982599895	20/04/28 05:12:12
1	50	326.33922178172133	292.2482641682237	20/04/28 05:12:12
1	50	326.23996568805535	292.1569516650228	20/04/28 05:12:13
1	50	326.17452681931553	292.16546456033717	20/04/28 05:12:13
1	50	326.1627225932272	292.07825190126573	20/04/28 05:12:13
1	50	326.62130039556155	291.95209270805873	20/04/28 05:12:13
1	50	326.62130039556155	291.95209270805873	20/04/28 05:12:13
1	50	326.62130039556155	291.95209270805873	20/04/28 05:12:13
1	50	326.7906363247784	291.9783625504895	20/04/28 05:12:13
1	50	326.81452176152436	291.8252916201414	20/04/28 05:12:13
1	50	326.6576926383131	291.6166367978167	20/04/28 05:12:13
1	50	326.6576926383131	291.6166367978167	20/04/28 05:12:14
1	50	326.78467936013806	291.5035304267945	20/04/28 05:12:14
1	50	326.76987749527666	291.4700814204158	20/04/28 05:12:14
1	50	327.0342790830902	291.33638330665565	20/04/28 05:12:14
1	50	326.80055543576856	291.4760801003791	20/04/28 05:12:14
1	50	326.781317730386	291.6037572029359	20/04/28 05:12:14
1	50	326.50811485083995	291.6997001414991	20/04/28 05:12:14
1	50	326.6028646936626	291.7439554566578	20/04/28 05:12:14
1	50	326.5464350950108	291.66370690137313	20/04/28 05:12:14
1	50	326.6356805307826	291.8324018862067	20/04/28 05:12:14
1	50	326.81807211595105	291.7466329322659	20/04/28 05:12:15
1	50	326.7750656022684	291.8017703804157	20/04/28 05:12:15
1	50	326.70059082270376	291.7833884169187	20/04/28 05:12:15
1	50	326.6983107693011	291.75305972049006	20/04/28 05:12:15
1	50	326.52216637545774	291.9052284137123	20/04/28 05:12:15
1	50	326.541363969837	291.91411710040967	20/04/28 05:12:15
1	50	326.5698477784367	291.92566260948666	20/04/28 05:12:15
1	50	326.59738670296656	292.016545331804	20/04/28 05:12:15
1	50	326.6280123116046	292.16309351332916	20/04/28 05:12:15
1	50	326.37984995702107	292.30083557758826	20/04/28 05:12:15
1	50	326.3584048581367	292.2987897062118	20/04/28 05:12:16
1	50	326.3687011226071	292.33848426317877	20/04/28 05:12:16
1	50	326.3522599214754	292.34116654714853	20/04/28 05:12:16
1	50	326.39427453469347	292.6208832401164	20/04/28 05:12:16
1	50	326.48438442476714	292.85774057994246	20/04/28 05:12:16
1	50	326.3797984355693	292.6180133250785	20/04/28 05:12:16
1	50	326.42197083503896	292.60872576440136	20/04/28 05:12:16
1	50	326.1378122774774	292.5160447080908	20/04/28 05:12:16
1	50	325.8622703511219	292.5948635065471	20/04/28 05:12:16
1	50	325.9439199855645	292.4979924176287	20/04/28 05:12:17
1	50	325.7465311379288	292.58895728630085	20/04/28 05:12:17
1	50	325.75931321874083	292.6711554130062	20/04/28 05:12:17
1	50	325.5499883529443	292.73300582738267	20/04/28 05:12:17
1	50	325.70905776693587	292.57293747638425	20/04/28 05:12:17
1	50	325.6238467014943	292.7887692979029	20/04/28 05:12:17
1	50	325.6135017595322	292.6981055740908	20/04/28 05:12:17
1	50	325.5126383847877	292.5842913523629	20/04/28 05:12:17
1	50	325.57474881422144	292.6042431552337	20/04/28 05:12:17
1	50	325.2815469185079	292.6646495036512	20/04/28 05:12:17
1	50	325.30311323090575	292.6547829765659	20/04/28 05:12:18
1	50	325.17252215369535	292.55349940026446	20/04/28 05:12:18
1	50	325.2144947992879	292.5983406659628	20/04/28 05:12:18
1	50	325.08895909307364	292.54346307377745	20/04/28 05:12:18
1	50	325.2688344523798	292.56863079439046	20/04/28 05:12:18
1	50	325.0847214435845	292.7351202629623	20/04/28 05:12:18
1	50	325.2877669793487	292.88251137243503	20/04/28 05:12:18
1	50	325.4088025759885	293.04138155680295	20/04/28 05:12:18
1	50	325.3136814457372	293.0526132414452	20/04/28 05:12:18
1	50	325.05859818957794	293.06651274630593	20/04/28 05:12:19
1	50	325.0627505240499	293.047556424482	20/04/28 05:12:19
1	50	325.1536702543978	292.8433959492248	20/04/28 05:12:19
1	50	325.077439001698	292.7883752036796	20/04/28 05:12:19
1	50	325.22765472703077	292.9465142068484	20/04/28 05:12:19
1	50	325.294509872475	293.0301009926122	20/04/28 05:12:19
1	50	325.1418466950748	293.0502617042725	20/04/28 05:12:19
1	50	324.96875610502155	292.9034689990172	20/04/28 05:12:19
1	50	325.1077825219739	292.79538739210767	20/04/28 05:12:19
1	50	325.1007143679775	292.79359828874294	20/04/28 05:12:19
1	50	325.1441756260742	292.78423837320355	20/04/28 05:12:20
1	50	325.1435313948975	292.79267179974426	20/04/28 05:12:20
1	50	325.24330226731894	292.7888086783388	20/04/28 05:12:20
1	50	325.2416465271956	292.69674638840945	20/04/28 05:12:20
1	50	325.23561629503854	292.6883404737455	20/04/28 05:12:20
1	50	325.18381672338853	292.8984973957895	20/04/28 05:12:20
1	50	325.1255447179354	292.8514181249579	20/04/28 05:12:20
1	50	325.1026223072564	292.84733714555716	20/04/28 05:12:20
1	50	325.2023720604223	293.06042963852946	20/04/28 05:12:20
1	50	325.19744730241047	292.88777273669166	20/04/28 05:12:20
1	50	325.25965957239544	293.06269343511417	20/04/28 05:12:21
1	50	325.42312603578506	293.02656812024907	20/04/28 05:12:21
1	50	325.4024697556736	293.00915394073866	20/04/28 05:12:21
1	50	325.590674109768	292.90929419951357	20/04/28 05:12:21
1	50	325.80248439317717	292.73060051515193	20/04/28 05:12:21
1	50	325.8579294040825	292.8877260645715	20/04/28 05:12:21
1	50	325.80109036852116	292.95765286436585	20/04/28 05:12:21
1	50	325.8239388648379	293.1372949048139	20/04/28 05:12:21
1	50	325.92950879832654	293.28810091994205	20/04/28 05:12:21
1	50	325.936459566992	293.0732926148936	20/04/28 05:12:22
1	50	325.8087368169106	293.184570210339	20/04/28 05:12:22
1	50	325.66143111011684	293.0982511211451	20/04/28 05:12:22
1	50	325.72131568724456	293.1153841116823	20/04/28 05:12:22
1	50	325.889029452657	292.881024848063	20/04/28 05:12:22
1	50	325.92925417944684	292.952014954361	20/04/28 05:12:22
1	50	325.92889563165033	292.9513239248061	20/04/28 05:12:22
1	50	325.9284415850051	292.9543315870902	20/04/28 05:12:22
1	50	325.91483489268603	292.945977583098	20/04/28 05:12:22
1	50	326.1029468852577	293.00293063247585	20/04/28 05:12:22
1	50	326.10550332914505	293.21792539344995	20/04/28 05:12:23
1	50	326.1723785942874	293.10262680679034	20/04/28 05:12:23
1	50	326.25743560242256	293.0312826015862	20/04/28 05:12:23
1	50	326.24421416082674	293.04478897128485	20/04/28 05:12:23
1	50	326.26988041880486	292.99585937969994	20/04/28 05:12:23
1	50	326.0508644514948	292.8576295509063	20/04/28 05:12:23
1	50	326.2710174166431	293.03792009755426	20/04/28 05:12:23
1	50	326.28493380964636	293.0131443867641	20/04/28 05:12:23
1	50	326.1596856974658	293.0584792636915	20/04/28 05:12:23
1	50	326.3733154614189	292.9493254160156	20/04/28 05:12:24
1	50	326.3331479465108	292.9172013493133	20/04/28 05:12:24
1	50	326.3120926149323	292.9175511134254	20/04/28 05:12:24
1	50	326.3600911159738	292.7884637617276	20/04/28 05:12:24
1	50	326.25697745823004	292.8593005526426	20/04/28 05:12:24
1	50	326.40378648494203	292.88972698369105	20/04/28 05:12:24
1	50	326.34433810576576	292.98434578818444	20/04/28 05:12:24
1	50	326.46480253460805	292.78871675896374	20/04/28 05:12:24
1	50	326.4666092786676	292.787349696654	20/04/28 05:12:24
1	50	326.5948056505519	292.74193473913846	20/04/28 05:12:24
1	50	326.57131289150414	292.4876634356011	20/04/28 05:12:25
1	50	326.77555013364434	292.3042795697303	20/04/28 05:12:25
1	50	326.92290845159914	292.1992161441859	20/04/28 05:12:25
1	50	327.14696201579943	292.1507156203422	20/04/28 05:12:25
1	50	327.1599648412808	292.27928430583086	20/04/28 05:12:25
1	50	327.26100114999895	292.2204024552121	20/04/28 05:12:25
1	50	327.24637652225243	292.2592050395243	20/04/28 05:12:25
1	50	327.26370040839385	292.2108977402714	20/04/28 05:12:25
1	50	327.12977134859926	292.28160095977546	20/04/28 05:12:25
1	50	327.1019848994713	292.4215884853845	20/04/28 05:12:25
1	50	326.935220071012	292.2140929019606	20/04/28 05:12:26
1	50	327.00670063773316	292.24637939715234	20/04/28 05:12:26
1	50	327.26485565994926	292.120649113895	20/04/28 05:12:26
1	50	327.4945608852238	291.9374740536994	20/04/28 05:12:26
1	50	327.5224569285175	291.8802121262983	20/04/28 05:12:26
1	50	327.52096160264233	291.70197356986665	20/04/28 05:12:26
1	50	327.5134950789617	291.911133253279	20/04/28 05:12:26
1	50	327.53869383584	291.98597687919164	20/04/28 05:12:26
1	50	327.5832869580655	291.95576666215726	20/04/28 05:12:26
1	50	327.4764574548055	291.90374755502785	20/04/28 05:12:27
1	50	327.4146250791713	291.63536926098385	20/04/28 05:12:27
1	50	327.3991677416937	291.61559550879514	20/04/28 05:12:27
1	50	327.39991660083086	291.61426094871	20/04/28 05:12:27
1	50	327.33337788115324	291.4295695851903	20/04/28 05:12:27
1	50	327.45448220143857	291.4479193753394	20/04/28 05:12:27
1	50	327.4531829465846	291.4453761717717	20/04/28 05:12:27
1	50	327.347147554376	291.5289672492203	20/04/28 05:12:27
1	50	327.357845737172	291.5373232139857	20/04/28 05:12:27
1	50	327.2736136079284	291.78939501329216	20/04/28 05:12:27
1	50	327.0670348108835	291.7480116505482	20/04/28 05:12:28
1	50	326.9085489950344	291.7622749001624	20/04/28 05:12:28
1	50	326.95650462622734	291.7260850023839	20/04/28 05:12:28
1	50	327.1052875496926	291.8650119487298	20/04/28 05:12:28
1	50	327.27710568751786	291.83672520579063	20/04/28 05:12:28
1	50	327.29511764863065	291.89409116836134	20/04/28 05:12:28
1	50	327.31687779736785	291.89363256541054	20/04/28 05:12:28
1	50	327.3368496945601	291.894955508466	20/04/28 05:12:28
1	50	327.2903573814111	291.9082846864154	20/04/28 05:12:28
1	50	327.2903573814111	291.9082846864154	20/04/28 05:12:28
1	50	327.2903573814111	291.9082846864154	20/04/28 05:12:29
1	50	327.3559062817233	291.97088591024345	20/04/28 05:12:29
1	50	327.43555023303907	291.690668993348	20/04/28 05:12:29
1	50	327.3467081674935	291.71650683893	20/04/28 05:12:29
1	50	327.3314945781736	291.9064689116902	20/04/28 05:12:29
1	50	327.3406320635416	291.96255708114876	20/04/28 05:12:29
1	50	327.295625536912	291.84734159377297	20/04/28 05:12:29
1	50	327.43141350692315	291.90362445414695	20/04/28 05:12:29
1	50	327.3842168539018	292.13822956299117	20/04/28 05:12:29
1	50	327.38259263518455	292.1408846346379	20/04/28 05:12:30
1	50	327.35304179608374	292.004618637416	20/04/28 05:12:30
1	50	327.4542516845664	291.92620232275664	20/04/28 05:12:30
1	50	327.4299575939469	291.932493623655	20/04/28 05:12:30
1	50	327.3662576221139	291.97262000507726	20/04/28 05:12:30
1	50	327.2251020173526	291.83876176801147	20/04/28 05:12:30
1	50	327.27037121376003	291.7663285704267	20/04/28 05:12:30
1	50	327.28292877124045	291.62156589909426	20/04/28 05:12:30
1	50	327.10781287203855	291.3934723326683	20/04/28 05:12:30
1	50	327.10461013951584	291.12002089317446	20/04/28 05:12:30
1	50	327.28028213244966	291.2982254043374	20/04/28 05:12:31
1	50	327.32843251624575	291.25324142899296	20/04/28 05:12:31
1	50	327.2993341828192	291.0669305680471	20/04/28 05:12:31
1	50	327.33854638908434	291.2733173329444	20/04/28 05:12:31
1	50	327.20391145092475	291.2382041398504	20/04/28 05:12:31
1	50	327.2772177277732	291.28147062862797	20/04/28 05:12:31
1	50	327.2965909122159	291.2863924262494	20/04/28 05:12:31
1	50	327.2239372134452	291.22344708959497	20/04/28 05:12:31
1	50	327.2629369014485	291.04020987461416	20/04/28 05:12:31
1	50	327.2263500630363	290.9651404713313	20/04/28 05:12:32
1	50	327.42147617081326	291.1833416839013	20/04/28 05:12:32
1	50	327.49822687838343	291.21373344943856	20/04/28 05:12:32
1	50	327.5136122104128	291.00831430540177	20/04/28 05:12:32
1	50	327.47688751606773	291.0261356497579	20/04/28 05:12:32
1	50	327.4148093874772	290.89979664942575	20/04/28 05:12:32
1	50	327.3461611363411	291.08434405664036	20/04/28 05:12:32
1	50	327.2941941888856	291.1087052230164	20/04/28 05:12:32
1	50	327.5170190101514	290.9971419608844	20/04/28 05:12:32
1	50	327.57451226658435	290.8732442381524	20/04/28 05:12:32
1	50	327.6127983106943	290.905075416715	20/04/28 05:12:33
1	50	327.613196974877	291.12418603967893	20/04/28 05:12:33
1	50	327.60847458012086	291.2477764989583	20/04/28 05:12:33
1	50	327.68240750251533	291.17896986530616	20/04/28 05:12:33
1	50	327.38511112597143	291.21804171222004	20/04/28 05:12:33
1	50	327.3454433498045	291.3762001370568	20/04/28 05:12:33
1	50	327.28573096695965	291.3777881133566	20/04/28 05:12:33
1	50	327.10457616235027	291.51122844459206	20/04/28 05:12:33
1	50	326.913783089925	291.49035590227453	20/04/28 05:12:33
1	50	326.94681572040986	291.5589178091658	20/04/28 05:12:33
1	50	326.92565074794766	291.39176214482717	20/04/28 05:12:34
1	50	326.99245332834823	291.55121227716916	20/04/28 05:12:34
1	50	326.9569634538918	291.4691001189287	20/04/28 05:12:34
1	50	326.99660568544147	291.39919893356466	20/04/28 05:12:34
1	50	326.99756759978374	291.39958480272793	20/04/28 05:12:34
1	50	327.0826377159527	291.39738191918474	20/04/28 05:12:34
1	50	327.12042601928914	291.41258697541247	20/04/28 05:12:34
1	50	327.04046824037556	291.1440722640173	20/04/28 05:12:34
1	50	327.15465750309005	291.1488499102082	20/04/28 05:12:34
1	50	327.1896303120608	291.110363413967	20/04/28 05:12:35
1	50	327.3328107860262	290.88570197498217	20/04/28 05:12:35
1	50	327.3328107860262	290.88570197498217	20/04/28 05:12:35
1	50	327.3328107860262	290.88570197498217	20/04/28 05:12:35
1	50	327.14760413478797	291.0943072333209	20/04/28 05:12:35
1	50	327.0271515694308	291.2299775148464	20/04/28 05:12:35
1	50	326.9099482419029	291.3619880568742	20/04/28 05:12:35
1	50	326.7357589270156	291.5581840724545	20/04/28 05:12:35
1	50	326.6000554581407	291.71103202360985	20/04/28 05:12:35
1	50	326.40388648573503	291.93198455902433	20/04/28 05:12:35
1	50	326.25270257169797	292.10226872124804	20/04/28 05:12:36
1	50	326.0916039079223	292.28372024121376	20/04/28 05:12:36
1	50	325.9468293043693	292.4467853545514	20/04/28 05:12:36
1	50	325.77522532998125	292.6400694033145	20/04/28 05:12:36
1	50	325.59591128783933	292.8420375930889	20/04/28 05:12:36
1	50	325.54194568973315	292.90282108795304	20/04/28 05:12:36
1	50	325.70906265038155	292.8514772306389	20/04/28 05:12:36
1	50	325.6196878032543	292.77164757496314	20/04/28 05:12:36
1	50	325.63003601535127	292.7605860582237	20/04/28 05:12:36
1	50	325.68919598035126	292.5030036841749	20/04/28 05:12:36
1	50	325.75884495827324	292.47488716270396	20/04/28 05:12:37
1	50	325.76017984496946	292.47515137571736	20/04/28 05:12:37
1	50	325.5867385678899	292.43132108412436	20/04/28 05:12:37
1	50	325.6658456567593	292.40040097537985	20/04/28 05:12:37
1	50	325.75992778483095	292.5408876274564	20/04/28 05:12:37
1	50	325.81824228555155	292.3611690997427	20/04/28 05:12:37
1	50	325.8747849433191	292.3688425140843	20/04/28 05:12:37
1	50	325.92537307735995	292.3732549516809	20/04/28 05:12:37
1	50	325.7903366774907	292.52125349908806	20/04/28 05:12:37
1	50	325.75638375900814	292.55184699598374	20/04/28 05:12:38
1	50	325.974831057462	292.581785735849	20/04/28 05:12:38
1	50	326.2736387075959	292.59619560197865	20/04/28 05:12:38
1	50	326.0384054406992	292.5499070170698	20/04/28 05:12:38
1	50	325.9834629623224	292.50773441390373	20/04/28 05:12:38
1	50	325.9872546181773	292.54591525980334	20/04/28 05:12:38
1	50	326.03914847268845	292.8070915585028	20/04/28 05:12:38
1	50	326.13834313276453	292.9239700813295	20/04/28 05:12:38
1	50	326.16251584838994	292.9039888056886	20/04/28 05:12:38
1	50	325.98143842023893	293.04981222678	20/04/28 05:12:38
1	50	326.0363143177253	292.9331930095598	20/04/28 05:12:39
1	50	326.0381174469686	293.0921198377019	20/04/28 05:12:39
1	50	326.0484370069939	292.9707675574593	20/04/28 05:12:39
1	50	326.2585926575419	292.7701812635546	20/04/28 05:12:39
1	50	326.2873693949995	292.7361904274943	20/04/28 05:12:39
1	50	326.5248024617696	292.6300696963691	20/04/28 05:12:39
1	50	326.6971868403513	292.7612726684992	20/04/28 05:12:39
1	50	326.5975656671141	292.4991062767318	20/04/28 05:12:39
1	50	326.79320441505183	292.3122477811983	20/04/28 05:12:39
1	50	326.6277372469722	292.32624004085875	20/04/28 05:12:39
1	50	326.69417777829676	292.4203254675101	20/04/28 05:12:40
1	50	326.7076754915095	292.4764824771242	20/04/28 05:12:40
1	50	326.61381312685836	292.2256998970386	20/04/28 05:12:40
1	50	326.623273248852	292.2239859175646	20/04/28 05:12:40
1	50	326.7549359629647	292.26154183376275	20/04/28 05:12:40
1	50	326.8172245625534	292.1273474120998	20/04/28 05:12:40
1	50	326.71292329998676	292.08279426593873	20/04/28 05:12:40
1	50	326.69889900426443	292.1184268311578	20/04/28 05:12:40
1	50	326.9262066946813	292.0190509862106	20/04/28 05:12:40
1	50	326.87804430343874	292.06797894074714	20/04/28 05:12:41
1	50	326.7679500746814	292.2764437795933	20/04/28 05:12:41
1	50	326.8710566204103	292.28563028142406	20/04/28 05:12:41
1	50	326.8710566204103	292.28563028142406	20/04/28 05:12:41
1	50	326.85750080457854	292.4661525481433	20/04/28 05:12:41
1	50	326.96162988113986	292.457513406801	20/04/28 05:12:41
1	50	327.0225558324128	292.72126923258963	20/04/28 05:12:41
1	50	327.03979208530853	292.57348856621735	20/04/28 05:12:41
1	50	327.03883968902176	292.5745581491889	20/04/28 05:12:41
1	50	327.03883968902176	292.5745581491889	20/04/28 05:12:41
1	50	326.7800809837994	292.6616086220535	20/04/28 05:12:42
1	50	326.8405420660643	292.50556197212603	20/04/28 05:12:42
1	50	326.8405420660643	292.50556197212603	20/04/28 05:12:42
1	50	326.89810803353197	292.5071787270028	20/04/28 05:12:42
1	50	326.9686616321162	292.32473805090467	20/04/28 05:12:42
1	50	326.97586812986805	292.244338959025	20/04/28 05:12:42
1	50	327.08944406039035	292.44039687976	20/04/28 05:12:42
1	50	327.27465811106754	292.55097896740244	20/04/28 05:12:42
1	50	327.2344140553289	292.54031871063995	20/04/28 05:12:42
1	50	327.2546013495106	292.50227533216855	20/04/28 05:12:42
1	50	327.2309910066438	292.4943640073823	20/04/28 05:12:43
1	50	327.3043845958821	292.36885053254906	20/04/28 05:12:43
1	50	327.1698791763256	292.1700810961305	20/04/28 05:12:43
1	50	327.15778824503803	292.02447727915836	20/04/28 05:12:43
1	50	326.9909570155068	291.8783209307183	20/04/28 05:12:43
1	50	326.97723660093425	292.1021056239156	20/04/28 05:12:43
1	50	327.0103798553644	292.09808312783554	20/04/28 05:12:43
1	50	327.0113688172154	292.14895752061716	20/04/28 05:12:43
1	50	326.9752271550159	292.12253145821234	20/04/28 05:12:43
1	50	326.9752271550159	292.12253145821234	20/04/28 05:12:44
1	50	326.9752271550159	292.12253145821234	20/04/28 05:12:44
1	50	327.0845646233421	292.00046790106916	20/04/28 05:12:44
1	50	327.03079451552554	292.0397619867356	20/04/28 05:12:44
1	50	327.20816128562	291.94484465700555	20/04/28 05:12:44
1	50	327.0833233835802	291.89233798395253	20/04/28 05:12:44
1	50	327.15372215773465	291.7773476061092	20/04/28 05:12:44
1	50	327.20307530802035	291.78415120244426	20/04/28 05:12:44
1	50	327.0369820602249	291.94944195578887	20/04/28 05:12:44
1	50	327.0215633279599	291.9377361767487	20/04/28 05:12:44
1	50	326.9268334550022	292.17725161486703	20/04/28 05:12:45
1	50	326.6528958095546	292.25364525562895	20/04/28 05:12:45
1	50	326.52141607575425	292.3092030016264	20/04/28 05:12:45
1	50	326.3949363769493	292.4786646865958	20/04/28 05:12:45
1	50	326.40713753612874	292.4172733093879	20/04/28 05:12:45
1	50	326.40713753612874	292.4172733093879	20/04/28 05:12:45
1	50	326.21299239943886	292.5478112426225	20/04/28 05:12:45
1	50	326.2673705892379	292.60219942114315	20/04/28 05:12:45
1	50	326.23928553015287	292.613679818495	20/04/28 05:12:45
1	50	326.23928553015287	292.613679818495	20/04/28 05:12:45
1	50	326.410512371401	292.8545435401765	20/04/28 05:12:46
1	50	326.16973738257843	292.76979145506016	20/04/28 05:12:46
1	50	326.16305363995366	292.8010988896884	20/04/28 05:12:46
1	50	326.17485062525043	292.7729993153418	20/04/28 05:12:46
1	50	326.4214750365097	292.6268359219521	20/04/28 05:12:46
1	50	326.57834347560845	292.681061578708	20/04/28 05:12:46
1	50	326.5567462141354	292.64292402698	20/04/28 05:12:46
1	50	326.56765671131114	292.71706011423333	20/04/28 05:12:46
1	50	326.54716050316534	292.6504537690332	20/04/28 05:12:46
1	50	326.4847186362862	292.857146789865	20/04/28 05:12:47
1	50	326.3567502623569	292.8854456169805	20/04/28 05:12:47
1	50	326.233991865601	292.8506968099493	20/04/28 05:12:47
1	50	326.3869325353028	292.8832556620401	20/04/28 05:12:47
1	50	326.34715915415967	292.9977272466978	20/04/28 05:12:47
1	50	326.10981954771967	293.1493715790709	20/04/28 05:12:47
1	50	326.14302013733396	293.36933162275574	20/04/28 05:12:47
1	50	326.137910076789	293.361681645855	20/04/28 05:12:47
1	50	326.2304388234796	293.23050429343135	20/04/28 05:12:47
1	50	326.24074086427595	293.23451840565247	20/04/28 05:12:47
1	50	326.0063680505811	293.08258679739555	20/04/28 05:12:48
1	50	326.27587109643224	293.13165642312526	20/04/28 05:12:48
1	50	326.25881616138906	293.2355364247065	20/04/28 05:12:48
1	50	326.4640267559481	293.04108871576966	20/04/28 05:12:48
1	50	326.5903342892835	293.27078209298094	20/04/28 05:12:48
1	50	326.70238842077623	293.4174289587129	20/04/28 05:12:48
1	50	326.55482971396975	293.46756091280815	20/04/28 05:12:48
1	50	326.6418786667047	293.4150597817556	20/04/28 05:12:48
1	50	326.3996894044415	293.30306421321603	20/04/28 05:12:48
1	50	326.53968734483294	293.4204457963853	20/04/28 05:12:48
1	50	326.2591071852679	293.4606853929458	20/04/28 05:12:49
1	50	326.07740871615283	293.37871567204047	20/04/28 05:12:49
1	50	326.10665968108333	293.4316296601746	20/04/28 05:12:49
1	50	326.0425237142324	293.38955992569106	20/04/28 05:12:49
1	50	326.0164560220272	293.37222420152335	20/04/28 05:12:49
1	50	325.9117964722915	293.3121027953508	20/04/28 05:12:49
1	50	325.9564319879627	293.2997814683286	20/04/28 05:12:49
1	50	325.79073131330625	293.36206485007915	20/04/28 05:12:49
1	50	326.03756369272793	293.31714101321353	20/04/28 05:12:49
1	50	326.0506697416358	293.2842556516809	20/04/28 05:12:50
1	50	326.0621436113699	293.0895571436719	20/04/28 05:12:50
1	50	325.9932489769402	293.1294758096458	20/04/28 05:12:50
1	50	325.9479239207177	293.18116328276113	20/04/28 05:12:50
1	50	325.9776099032434	293.21064036273197	20/04/28 05:12:50
1	50	325.93320103532466	293.03938908048696	20/04/28 05:12:50
1	50	325.92574517932826	293.0702585323109	20/04/28 05:12:50
1	50	326.16745498527916	293.01721428384036	20/04/28 05:12:50
1	50	326.19353156610947	293.020591149483	20/04/28 05:12:50
1	50	326.20309185145203	292.85918457245356	20/04/28 05:12:50
1	50	326.1407294789622	292.82259591059545	20/04/28 05:12:51
1	50	325.97238660176606	292.8903126948753	20/04/28 05:12:51
1	50	326.0009614298585	292.8482450646758	20/04/28 05:12:51
1	50	326.13101332213	292.7319752208132	20/04/28 05:12:51
1	50	326.14309084135147	292.7966128577637	20/04/28 05:12:51
1	50	326.09074564498883	292.70411642438563	20/04/28 05:12:51
1	50	326.19878542513334	292.7907484634958	20/04/28 05:12:51
1	50	326.11176994741214	292.7946569569791	20/04/28 05:12:51
1	50	326.0867258630316	292.9824087983635	20/04/28 05:12:51
1	50	326.0232028255698	292.84668794131073	20/04/28 05:12:52
1	50	326.04381465623123	292.78517640191524	20/04/28 05:12:52
1	50	326.01037621454935	292.75331444473295	20/04/28 05:12:52
1	50	325.93706468784904	292.85068626370287	20/04/28 05:12:52
1	50	325.9736496069014	292.76199156748555	20/04/28 05:12:52
1	50	325.8353402874812	292.70374859204543	20/04/28 05:12:52
1	50	325.8917662287742	292.9040786438424	20/04/28 05:12:52
1	50	326.06966698730844	292.70896043637384	20/04/28 05:12:52
1	50	326.02123054997867	292.415017350473	20/04/28 05:12:52
1	50	325.99041632723527	292.46433598303264	20/04/28 05:12:52
1	50	326.10047293117736	292.32064764764766	20/04/28 05:12:53
1	50	326.10217709753533	292.32005646263536	20/04/28 05:12:53
1	50	326.0489421939932	292.53019254594534	20/04/28 05:12:53
1	50	326.11512115987654	292.4957159408969	20/04/28 05:12:53
1	50	326.14645815580224	292.4955920096976	20/04/28 05:12:53
1	50	326.24545351558845	292.61438286377313	20/04/28 05:12:53
1	50	326.29593934063234	292.5752169496062	20/04/28 05:12:53
1	50	326.24747302903984	292.39852061949415	20/04/28 05:12:53
1	50	326.4441186178565	292.39494247586964	20/04/28 05:12:53
1	50	326.4971128428583	292.294045772209	20/04/28 05:12:53
1	50	326.63020923179573	292.34612951582466	20/04/28 05:12:54
1	50	326.79268235998904	292.55469831443617	20/04/28 05:12:54
1	50	326.58302603433276	292.5269914554884	20/04/28 05:12:54
1	50	326.60587882199343	292.68372759817	20/04/28 05:12:54
1	50	326.61262376285737	292.49151136703597	20/04/28 05:12:54
1	50	326.62937735068084	292.44989671828665	20/04/28 05:12:54
1	50	326.6585390493451	292.39940342182786	20/04/28 05:12:54
1	50	326.57886548854583	292.1466323861562	20/04/28 05:12:54
1	50	326.4694418149267	292.0743399659321	20/04/28 05:12:54
1	50	326.47821120110143	291.9843146054284	20/04/28 05:12:55
1	50	326.22829696634045	292.1424061604488	20/04/28 05:12:55
1	50	326.3100760311224	292.2611411176336	20/04/28 05:12:55
1	50	326.21825360560337	292.2169046259512	20/04/28 05:12:55
1	50	326.1359864174619	292.15745761945004	20/04/28 05:12:55
1	50	325.89148545637653	292.01543158841287	20/04/28 05:12:55
1	50	325.9637232665745	291.9089582849807	20/04/28 05:12:55
1	50	326.0815263679611	291.8991639886253	20/04/28 05:12:55
1	50	326.16080011687586	291.74383049966934	20/04/28 05:12:55
1	50	326.07065153418444	291.89202488773935	20/04/28 05:12:55
1	50	325.99884589987107	291.99898410971804	20/04/28 05:12:56
1	50	326.0772238764055	291.90440117690224	20/04/28 05:12:56
1	50	326.26285119879617	292.05346889205134	20/04/28 05:12:56
1	50	326.02062838228017	292.1326478167858	20/04/28 05:12:56
1	50	326.31026431360596	292.1657226945917	20/04/28 05:12:56
1	50	326.3102540516951	292.16629923367657	20/04/28 05:12:56
1	50	326.1409355221414	292.21279698935393	20/04/28 05:12:56
1	50	326.0427204309742	291.95368393978725	20/04/28 05:12:56
1	50	325.96516925063065	291.94921888806834	20/04/28 05:12:56
1	50	326.1941385805687	291.9994911171891	20/04/28 05:12:56
1	50	326.4492258637501	292.1426198430321	20/04/28 05:12:57
1	50	326.29438203145077	292.09200965373714	20/04/28 05:12:57
1	50	326.27928262115023	292.0864098718529	20/04/28 05:12:57
1	50	326.2968756266829	291.92324432551845	20/04/28 05:12:57
1	50	326.15047709909965	291.78810337711457	20/04/28 05:12:57
1	50	326.3530576140231	291.6620433236338	20/04/28 05:12:57
1	50	326.49486123727405	291.76935322650115	20/04/28 05:12:57
1	50	326.46566578326593	291.77673748338606	20/04/28 05:12:57
1	50	326.6007637080442	291.9392737658531	20/04/28 05:12:57
1	50	326.5497166147823	292.0391850217837	20/04/28 05:12:58
1	50	326.49212135812587	291.99038979019747	20/04/28 05:12:58
1	50	326.4631190261785	292.00092393690585	20/04/28 05:12:58
1	50	326.56085960498285	291.98735451337126	20/04/28 05:12:58
1	50	326.6235272689922	291.9707043572927	20/04/28 05:12:58
1	50	326.8126287068642	291.84932440834154	20/04/28 05:12:58
1	50	326.63586453645803	291.66443077865534	20/04/28 05:12:58
1	50	326.77410964357813	291.920329726957	20/04/28 05:12:58
1	50	326.67251139992374	291.9294359227224	20/04/28 05:12:58
1	50	326.78571838461306	291.8425687211954	20/04/28 05:12:58
1	50	326.78616600428654	291.842133117817	20/04/28 05:12:59
1	50	326.8517354073658	291.82106668782995	20/04/28 05:12:59
1	50	326.63496360071247	291.7528037392152	20/04/28 05:12:59
1	50	326.63496360071247	291.7528037392152	20/04/28 05:12:59
1	50	326.63496360071247	291.7528037392152	20/04/28 05:12:59
1	50	326.56543435718316	291.98256928288265	20/04/28 05:12:59
1	50	326.72975101224483	292.0576461106207	20/04/28 05:12:59
1	50	326.5483338479303	291.93236298886126	20/04/28 05:12:59
1	50	326.5121575786482	291.98488598048095	20/04/28 05:12:59
1	50	326.63410875736184	291.7915561225932	20/04/28 05:13:00
1	50	326.5439656377545	291.9708026859495	20/04/28 05:13:00
1	50	326.57612828158466	292.2020121534685	20/04/28 05:13:00
1	50	326.2971602829394	292.1899692679339	20/04/28 05:13:00
1	50	326.20743304287026	292.2066529969593	20/04/28 05:13:00
1	50	326.2253977697819	292.2199383390217	20/04/28 05:13:00
1	50	326.1643828412876	292.2811147195443	20/04/28 05:13:00
1	50	326.07296854886545	292.31046719637044	20/04/28 05:13:00
1	50	326.14292166664376	292.12428455626934	20/04/28 05:13:00
1	50	325.93171697196084	292.2720615218597	20/04/28 05:13:00
1	50	325.8874764296869	292.2745710514386	20/04/28 05:13:01
1	50	325.7691066307899	292.21614256532075	20/04/28 05:13:01
1	50	325.56017020519886	292.1486564390692	20/04/28 05:13:01
1	50	325.7815687872383	291.9773654288924	20/04/28 05:13:01
1	50	325.53614175427435	291.8636405554718	20/04/28 05:13:01
1	50	325.53614175427435	291.8636405554718	20/04/28 05:13:01
1	50	325.53614175427435	291.8636405554718	20/04/28 05:13:01
1	50	325.4394422681185	291.75112930817596	20/04/28 05:13:01
1	50	325.2858014432447	291.9681946787148	20/04/28 05:13:01
1	50	325.1671319198446	291.8526960376945	20/04/28 05:13:01
1	50	325.03435803274385	291.81900752624347	20/04/28 05:13:02
1	50	324.81172004690717	292.0037877935954	20/04/28 05:13:02
1	50	324.7134832535005	291.97855239020487	20/04/28 05:13:02
1	50	324.8505435743453	291.8834761497485	20/04/28 05:13:02
1	50	324.9061082679258	291.7603924277557	20/04/28 05:13:02
1	50	324.88813019029527	291.69433558131703	20/04/28 05:13:02
1	50	325.0971742184655	291.5518668192839	20/04/28 05:13:02
1	50	325.2438345385934	291.420741535716	20/04/28 05:13:02
1	50	325.2436938013153	291.5023574028995	20/04/28 05:13:02
1	50	325.052722428407	291.663221528242	20/04/28 05:13:03
1	50	325.1425167557093	291.73937462940984	20/04/28 05:13:03
1	50	324.9492641725574	291.71858963329817	20/04/28 05:13:03
1	50	325.06591845492824	291.91673901032414	20/04/28 05:13:03
1	50	325.09534554330395	291.9172878805721	20/04/28 05:13:03
1	50	325.1829412294542	291.86463651003004	20/04/28 05:13:03
1	50	325.17106414962007	292.1034350343776	20/04/28 05:13:03
1	50	325.00154983536896	292.15036297130274	20/04/28 05:13:03
1	50	325.10813539564083	292.2809385811994	20/04/28 05:13:03
1	50	325.3619874544595	292.41339659411085	20/04/28 05:13:03
1	50	325.3263356506234	292.1767425766048	20/04/28 05:13:04
1	50	325.41670723780146	292.13112616830597	20/04/28 05:13:04
1	50	325.32678554119343	292.1538973817386	20/04/28 05:13:04
1	50	325.53134279864224	292.15383578690904	20/04/28 05:13:04
1	50	325.79217303369035	292.27255329143816	20/04/28 05:13:04
1	50	325.8071264084151	292.35220740526194	20/04/28 05:13:04
1	50	325.8024175231236	292.50076624996	20/04/28 05:13:04
1	50	325.91986960688035	292.2512321976763	20/04/28 05:13:04
1	50	326.044275954996	292.1060261012352	20/04/28 05:13:04
1	50	325.9657687953029	291.8600547324447	20/04/28 05:13:05
1	50	325.9463484669804	291.5882114235638	20/04/28 05:13:05
1	50	326.07834278006703	291.81710563321354	20/04/28 05:13:05
1	50	326.0100559400888	291.9891499916472	20/04/28 05:13:05
1	50	325.9177926983803	292.0034268613092	20/04/28 05:13:05
1	50	326.0930429656	291.9362096570102	20/04/28 05:13:05
1	50	326.14198556985826	291.77380974366685	20/04/28 05:13:05
1	50	326.33052852993615	291.76101376807605	20/04/28 05:13:05
1	50	326.11934467373015	291.9063385714405	20/04/28 05:13:05
1	50	326.0793509074505	291.82364159304194	20/04/28 05:13:05
1	50	326.1287486942415	291.7122765297002	20/04/28 05:13:06
1	50	325.95815194661503	291.9009465966845	20/04/28 05:13:06
1	50	326.0717601764175	291.7699866613404	20/04/28 05:13:06
1	50	325.95073925493955	291.5664069872898	20/04/28 05:13:06
1	50	325.9293489984763	291.65969052970945	20/04/28 05:13:06
1	50	325.7454453388489	291.55183400321556	20/04/28 05:13:06
1	50	325.77041307139035	291.81247664830954	20/04/28 05:13:06
1	50	325.77041307139035	291.81247664830954	20/04/28 05:13:06
1	50	325.73246426059893	291.9102672377873	20/04/28 05:13:06
1	50	325.65390417450016	291.9972377404201	20/04/28 05:13:06
1	50	325.81164148284427	292.08301812741803	20/04/28 05:13:07
1	50	325.8569008825667	292.19445219540387	20/04/28 05:13:07
1	50	325.8569008825667	292.19445219540387	20/04/28 05:13:07
1	50	325.8633049675312	291.9755634418762	20/04/28 05:13:07
1	50	325.85547066442126	291.83748237108153	20/04/28 05:13:07
1	50	325.85547066442126	291.83748237108153	20/04/28 05:13:07
1	50	325.89745384322106	291.8100588681579	20/04/28 05:13:07
1	50	325.92767984891486	292.0098451546542	20/04/28 05:13:07
1	50	325.9251635893376	292.0164745776397	20/04/28 05:13:07
1	50	325.90804987594004	291.7412285841272	20/04/28 05:13:08
1	50	325.82154441660157	291.6282998732629	20/04/28 05:13:08
1	50	325.88588580296414	291.7371148922898	20/04/28 05:13:08
1	50	325.92481891248144	291.6925148751345	20/04/28 05:13:08
1	50	326.02732885156786	291.64673373068894	20/04/28 05:13:08
1	50	326.0996109852213	291.61823091374083	20/04/28 05:13:08
1	50	325.9816686064555	291.6322235513216	20/04/28 05:13:08
1	50	326.0429004031372	291.5371099820284	20/04/28 05:13:08
1	50	326.1845100922565	291.53045075175	20/04/28 05:13:08
1	50	326.0496784915069	291.5645847546856	20/04/28 05:13:08
1	50	325.9065777654782	291.6713044722355	20/04/28 05:13:09
1	50	325.87745925585455	291.8158245939627	20/04/28 05:13:09
1	50	326.0821278427335	291.6805986671223	20/04/28 05:13:09
1	50	325.79752672080156	291.72389695690777	20/04/28 05:13:09
1	50	326.0534774926493	291.70168628449824	20/04/28 05:13:09
1	50	326.1125432698244	291.7237965777542	20/04/28 05:13:09
1	50	325.88035656472215	291.787391762479	20/04/28 05:13:09
1	50	325.5880844019585	291.79498201193644	20/04/28 05:13:09
1	50	325.4884755437287	291.67136890421585	20/04/28 05:13:09
1	50	325.41263749938213	291.7080896202469	20/04/28 05:13:09
1	50	325.3082936146886	291.6402305226369	20/04/28 05:13:10
1	50	325.0962879925582	291.58425315116244	20/04/28 05:13:10
1	50	325.25323142537457	291.4891233841946	20/04/28 05:13:10
1	50	325.4336275257398	291.5708233559343	20/04/28 05:13:10
1	50	325.1660690864711	291.6467882817299	20/04/28 05:13:10
1	50	325.1088261395414	291.62194436626345	20/04/28 05:13:10
1	50	325.1548042441924	291.55534699547377	20/04/28 05:13:10
1	50	325.10859381550256	291.850298871299	20/04/28 05:13:10
1	50	325.1934900871351	291.948530605897	20/04/28 05:13:10
1	50	325.1514695223609	292.1044519915463	20/04/28 05:13:11
1	50	325.1170696143092	291.97498324730236	20/04/28 05:13:11
1	50	325.3054247023471	291.9471607319644	20/04/28 05:13:11
1	50	325.08730970759814	292.1457042141113	20/04/28 05:13:11
1	50	325.1535881034115	292.21180257553334	20/04/28 05:13:11
1	50	325.046504204711	292.2657239775587	20/04/28 05:13:11
1	50	325.031494966803	292.2753744743344	20/04/28 05:13:11
1	50	324.97058807251375	292.24623044879706	20/04/28 05:13:11
1	50	325.110413263295	292.39223633151767	20/04/28 05:13:11
1	50	324.88181075124334	292.3801611877813	20/04/28 05:13:11
1	50	324.81695933526805	292.2522597354287	20/04/28 05:13:12
1	50	324.74508260800513	292.25930965301876	20/04/28 05:13:12
1	50	324.58177813856446	292.4255842293495	20/04/28 05:13:12
1	50	324.63166885433833	292.21639251433555	20/04/28 05:13:12
1	50	324.86593202734605	292.22777989435605	20/04/28 05:13:12
1	50	325.05379591277216	292.0957579066992	20/04/28 05:13:12
1	50	325.10446007222583	292.2765754695824	20/04/28 05:13:12
1	50	325.168370149494	292.1862533816352	20/04/28 05:13:12
1	50	325.10207083385103	292.40967436926604	20/04/28 05:13:12
1	50	325.31711619795055	292.4676004058798	20/04/28 05:13:12
1	50	325.33027153277305	292.4692943999602	20/04/28 05:13:13
1	50	325.3859745086026	292.75990019093337	20/04/28 05:13:13
1	50	325.4611788583694	292.67355100132164	20/04/28 05:13:13
1	50	325.5281826752992	292.7023370827624	20/04/28 05:13:13
1	50	325.53719396120937	292.67842085197054	20/04/28 05:13:13
1	50	325.7661840650239	292.7993767253721	20/04/28 05:13:13
1	50	325.5793182650747	292.72877873929986	20/04/28 05:13:13
1	50	325.66317346925297	292.71380680538925	20/04/28 05:13:13
1	50	325.8540082403462	292.6626122997726	20/04/28 05:13:13
1	50	325.8198006564598	292.663999402627	20/04/28 05:13:14
1	50	325.83291576374813	292.63631528831047	20/04/28 05:13:14
1	50	326.01715042839004	292.6251343069566	20/04/28 05:13:14
1	50	326.17177639270426	292.44629344078663	20/04/28 05:13:14
1	50	326.2109734625245	292.3960774694836	20/04/28 05:13:14
1	50	326.260828323161	292.3747187749273	20/04/28 05:13:14
1	50	325.98584900329274	292.4615617965385	20/04/28 05:13:14
1	50	325.7835985853083	292.4513397455506	20/04/28 05:13:14
1	50	325.66967115343783	292.4268064325019	20/04/28 05:13:14
1	50	325.83508476035786	292.57461981023965	20/04/28 05:13:14
1	50	325.5944932291299	292.65932327416505	20/04/28 05:13:15
1	50	325.83278750279817	292.7310130565713	20/04/28 05:13:15
1	50	325.6150351859648	292.67742699406114	20/04/28 05:13:15
1	50	325.8710047778314	292.82407359306757	20/04/28 05:13:15
1	50	326.04631539171737	292.89506508477575	20/04/28 05:13:15
1	50	326.05786564003995	292.9282548959011	20/04/28 05:13:15
1	50	326.1884404333325	292.8588827370439	20/04/28 05:13:15
1	50	326.1903159710771	292.8571964088693	20/04/28 05:13:15
1	50	326.18928974884426	292.8299192993395	20/04/28 05:13:15
1	50	325.9241650661706	292.93445421943136	20/04/28 05:13:15
1	50	326.1782853433708	292.8312564056807	20/04/28 05:13:16
1	50	326.26027596912104	292.6882245552094	20/04/28 05:13:16
1	50	326.23085325636526	292.62690159882084	20/04/28 05:13:16
1	50	326.36584733659936	292.62303892019827	20/04/28 05:13:16
1	50	326.3829256721763	292.3985171694498	20/04/28 05:13:16
1	50	326.52482104055576	292.1812110932195	20/04/28 05:13:16
1	50	326.5659913498115	292.05358981534727	20/04/28 05:13:16
1	50	326.4677291243449	292.286420479152	20/04/28 05:13:16
1	50	326.6709513526394	292.3117003892537	20/04/28 05:13:16
1	50	326.52217952195764	292.3380306862435	20/04/28 05:13:17
1	50	326.47479497762737	292.5016433774109	20/04/28 05:13:17
1	50	326.620100184092	292.6179093729505	20/04/28 05:13:17
1	50	326.620100184092	292.6179093729505	20/04/28 05:13:17
