floorId	partitionId	location_x	location_y	timeStamp
1	39	324.80800196126967	279.1715114276729	20/04/28 05:17:35
1	39	324.68877437971724	279.2833886133998	20/04/28 05:17:35
1	39	324.518319096065	279.44333530676545	20/04/28 05:17:35
1	39	324.32688387128144	279.6229685251778	20/04/28 05:17:35
1	39	324.12975850190804	279.80794109002994	20/04/28 05:17:35
1	39	323.9946740452576	279.93469757245384	20/04/28 05:17:36
1	39	323.8187372169477	280.09978787254	20/04/28 05:17:36
1	39	323.6922042758625	280.2185200414395	20/04/28 05:17:36
1	39	323.57595190511165	280.3276054384956	20/04/28 05:17:36
1	39	323.4045740278172	280.48841784748606	20/04/28 05:17:36
1	39	323.2738074559238	280.61112264330677	20/04/28 05:17:36
1	39	323.10056143648296	280.7736880232387	20/04/28 05:17:36
1	39	322.98790050021597	280.8794033982115	20/04/28 05:17:36
1	39	322.84886634599445	281.00986607884033	20/04/28 05:17:36
1	39	322.6389898699756	281.2068036429638	20/04/28 05:17:36
1	39	322.4235670218861	281.40894564460234	20/04/28 05:17:37
1	39	322.2715910463719	281.55155228156707	20/04/28 05:17:37
1	4	322.26156630291786	281.7151854682505	20/04/28 05:17:37
1	4	322.3063626166778	281.93531399620935	20/04/28 05:17:37
1	4	322.3454455229599	282.1273669109721	20/04/28 05:17:37
1	4	322.39189336682006	282.3556110372763	20/04/28 05:17:37
1	4	322.4224545956922	282.5057885353689	20/04/28 05:17:37
1	59	322.5619341974695	282.59139246651546	20/04/28 05:17:37
1	59	322.80189410243753	282.57170012493793	20/04/28 05:17:37
1	59	323.06953864930875	282.5497358395334	20/04/28 05:17:37
1	59	323.35527693001757	282.5262866894504	20/04/28 05:17:38
1	59	323.58542478733176	282.5073995748711	20/04/28 05:17:38
1	59	323.7715906816048	282.49212184594967	20/04/28 05:17:38
1	59	324.04692876139416	282.46952618974103	20/04/28 05:17:38
1	59	324.33804001169716	282.4456361061923	20/04/28 05:17:38
1	59	324.5831009659511	282.42552514632536	20/04/28 05:17:38
1	59	324.8117742549938	282.40675904238776	20/04/28 05:17:38
1	59	325.0224849591389	282.3894670403734	20/04/28 05:17:38
1	59	325.2792251408276	282.3683976231507	20/04/28 05:17:38
1	59	325.4862478772334	282.3514082747003	20/04/28 05:17:39
1	59	325.7418481185857	282.3304324068332	20/04/28 05:17:39
1	59	325.94678765391285	282.3136140165569	20/04/28 05:17:39
1	59	326.19615062304496	282.2931500112657	20/04/28 05:17:39
1	59	326.36897880080863	282.278966843827	20/04/28 05:17:39
1	59	326.3893234344579	282.29816378589425	20/04/28 05:17:39
1	59	326.40235385925905	282.3484176330159	20/04/28 05:17:39
1	59	326.3951023948307	282.36828562970635	20/04/28 05:17:39
1	59	326.226435145977	282.2836183448606	20/04/28 05:17:39
1	59	326.297107635502	282.20218283030994	20/04/28 05:17:39
1	59	326.09213443768755	282.2816320848028	20/04/28 05:17:40
1	59	326.3470859898606	282.2278551832738	20/04/28 05:17:40
1	59	326.1015762370923	282.3204072789898	20/04/28 05:17:40
1	59	325.99975628635684	282.24648439069017	20/04/28 05:17:40
1	59	325.99204743763863	282.3179686749145	20/04/28 05:17:40
1	59	325.98958007904224	282.325768385587	20/04/28 05:17:40
1	59	325.89272771212654	282.3560723154243	20/04/28 05:17:40
1	59	325.90827658179705	282.301864833687	20/04/28 05:17:40
1	59	326.0111434369013	282.21639396213715	20/04/28 05:17:40
1	59	325.8748003990308	282.43130682952966	20/04/28 05:17:40
1	59	325.79188522732926	282.2472497610836	20/04/28 05:17:41
1	59	325.60725104120377	282.19629186624115	20/04/28 05:17:41
1	59	325.7116496379421	282.38492628572675	20/04/28 05:17:41
1	59	325.7105375834146	282.33965615679233	20/04/28 05:17:41
1	59	325.8108983230022	282.34187413054553	20/04/28 05:17:41
1	59	325.7764173459737	282.51243608705954	20/04/28 05:17:41
1	59	325.98178465912014	282.3139098634343	20/04/28 05:17:41
1	59	325.8723501889139	282.4172014386882	20/04/28 05:17:41
1	59	325.7320967573364	282.5086406989518	20/04/28 05:17:41
1	59	325.6579115076943	282.4892177830292	20/04/28 05:17:42
1	59	325.92729205215903	282.4849758239812	20/04/28 05:17:42
1	59	325.8799453636265	282.5075767765182	20/04/28 05:17:42
1	59	325.85359300201594	282.54046962576973	20/04/28 05:17:42
1	59	325.75886289310097	282.2932516039241	20/04/28 05:17:42
1	59	325.7251994869665	282.27578716955986	20/04/28 05:17:42
1	59	325.59699059299027	282.3266737243939	20/04/28 05:17:42
1	59	325.81364919161746	282.214353247656	20/04/28 05:17:42
1	59	325.7093811922796	282.27549846417895	20/04/28 05:17:42
1	59	325.8078868580288	282.39830320026414	20/04/28 05:17:42
1	59	325.8534799149863	282.3979287034208	20/04/28 05:17:43
1	59	325.8021724153846	282.3062543017617	20/04/28 05:17:43
1	59	325.9302851936059	282.31608008251766	20/04/28 05:17:43
1	59	326.0234281668708	282.2833012016512	20/04/28 05:17:43
1	59	326.0479174476952	282.29140933895616	20/04/28 05:17:43
1	59	325.9280008926473	282.30787233719	20/04/28 05:17:43
1	59	326.1285677513441	282.31980772649695	20/04/28 05:17:43
1	59	326.0401035459035	282.2472643709531	20/04/28 05:17:43
1	59	326.1127044801681	282.34885383205756	20/04/28 05:17:43
1	59	326.0204201266328	282.29459620441	20/04/28 05:17:44
1	59	326.0664353891436	282.18498236172985	20/04/28 05:17:44
1	59	325.8198017628005	282.19974220557236	20/04/28 05:17:44
1	59	325.74004986723367	282.2271678819244	20/04/28 05:17:44
1	59	325.86163869367834	282.4145471697417	20/04/28 05:17:44
1	59	325.86254850688545	282.41125220836244	20/04/28 05:17:44
1	59	325.9138177646959	282.31304333352654	20/04/28 05:17:44
1	59	325.8213523095777	282.5062285501101	20/04/28 05:17:44
1	59	325.7284992939121	282.41377628678794	20/04/28 05:17:44
1	59	325.88807142653445	282.39780888041236	20/04/28 05:17:44
1	59	325.78162071388454	282.3051099821821	20/04/28 05:17:45
1	59	325.7840736174565	282.31001025855903	20/04/28 05:17:45
1	59	325.77994984557085	282.27203312329914	20/04/28 05:17:45
1	59	325.5658104375635	282.2088286777585	20/04/28 05:17:45
1	59	325.3879195157559	282.432900043712	20/04/28 05:17:45
1	59	325.33203882244555	282.659245819566	20/04/28 05:17:45
1	59	325.1713054579116	282.5259261441021	20/04/28 05:17:45
1	59	325.1641351844616	282.55874700535065	20/04/28 05:17:45
1	59	325.04652711875315	282.3416155934875	20/04/28 05:17:45
1	59	325.16282128096435	282.3619511888245	20/04/28 05:17:45
1	59	325.2743440806881	282.24407527183195	20/04/28 05:17:46
1	59	325.4484095863351	282.274842344841	20/04/28 05:17:46
1	59	325.4936996921798	282.3345349415811	20/04/28 05:17:46
1	59	325.4653923909178	282.3993789436921	20/04/28 05:17:46
1	59	325.45054535609466	282.4077764738018	20/04/28 05:17:46
1	59	325.2105377501213	282.4987421388525	20/04/28 05:17:46
1	59	325.0888170605301	282.4175573302251	20/04/28 05:17:46
1	59	324.8963871755712	282.52254276445717	20/04/28 05:17:46
1	59	324.95617419705314	282.4927115891753	20/04/28 05:17:46
1	59	324.9256425703028	282.55817168797194	20/04/28 05:17:47
1	59	324.7537473539369	282.69719244968707	20/04/28 05:17:47
1	59	324.7353399073264	282.6617757437487	20/04/28 05:17:47
1	59	324.90411152386855	282.5375810823349	20/04/28 05:17:47
1	59	324.9914678772849	282.74682330880194	20/04/28 05:17:47
1	59	325.08659419900965	282.4864186010776	20/04/28 05:17:47
1	59	325.0121830080473	282.24654917818816	20/04/28 05:17:47
1	59	324.9693142080456	282.22361532705895	20/04/28 05:17:47
1	59	325.00941817312196	282.2151693253165	20/04/28 05:17:47
1	59	324.87698703465804	282.2464458535805	20/04/28 05:17:47
1	59	325.13552540450695	282.3844451170554	20/04/28 05:17:48
1	59	325.091728023398	282.3940844208766	20/04/28 05:17:48
1	59	325.30259328602506	282.30354156336614	20/04/28 05:17:48
1	59	325.1338734613352	282.3231016620245	20/04/28 05:17:48
1	59	325.32965432697955	282.2372802156948	20/04/28 05:17:48
1	59	325.39122483184076	282.3405101140919	20/04/28 05:17:48
1	59	325.49076030498657	282.47270275349774	20/04/28 05:17:48
1	59	325.32634266421246	282.4289829709288	20/04/28 05:17:48
1	59	325.58923045988166	282.4822958473924	20/04/28 05:17:48
1	59	325.30133081430387	282.44272191012664	20/04/28 05:17:48
1	59	325.1543228974801	282.6760666322176	20/04/28 05:17:49
1	59	325.16410515801863	282.6822710457841	20/04/28 05:17:49
1	59	324.869556136741	282.6699959957632	20/04/28 05:17:49
1	59	324.8228384642306	282.78856232250655	20/04/28 05:17:49
1	59	324.70666213961135	282.702633599713	20/04/28 05:17:49
1	59	324.8647376797385	282.8738003905527	20/04/28 05:17:49
1	59	324.9112103910758	282.92282583546313	20/04/28 05:17:49
1	59	324.8427601523034	282.9383051158115	20/04/28 05:17:49
1	59	324.8770947970066	282.7272993008165	20/04/28 05:17:49
1	59	324.7493119324141	282.76469067646417	20/04/28 05:17:50
1	59	324.7024935512272	282.5441270987633	20/04/28 05:17:50
1	59	324.5720726774835	282.6299322317168	20/04/28 05:17:50
1	59	324.4981034277969	282.53203208736596	20/04/28 05:17:50
1	59	324.2893305446812	282.6210231041225	20/04/28 05:17:50
1	59	324.41876285513763	282.7974393778667	20/04/28 05:17:50
1	59	324.47964606549243	282.57761283965357	20/04/28 05:17:50
1	59	324.46786705781227	282.5254852402928	20/04/28 05:17:50
1	59	324.31090040668363	282.36498751626976	20/04/28 05:17:50
1	59	324.4387985890408	282.5524292588786	20/04/28 05:17:50
1	59	324.2664683271149	282.4703703313223	20/04/28 05:17:51
1	59	324.05692957299493	282.39803024873936	20/04/28 05:17:51
1	59	324.23090775322225	282.5549695850761	20/04/28 05:17:51
1	59	324.1167103205338	282.61195760243845	20/04/28 05:17:51
1	59	324.0967536426961	282.37011192894755	20/04/28 05:17:51
1	59	324.014467073386	282.48751768435625	20/04/28 05:17:51
1	59	324.1059068164138	282.67743449251174	20/04/28 05:17:51
1	59	324.1985922964704	282.48886574998846	20/04/28 05:17:51
1	59	324.049016627216	282.3042880798619	20/04/28 05:17:51
1	59	324.06354423766896	282.29775866795944	20/04/28 05:17:51
1	59	324.03852954168184	282.3381546789266	20/04/28 05:17:52
1	59	323.8990913821573	282.58042965255737	20/04/28 05:17:52
1	59	323.79628981993295	282.5819812073357	20/04/28 05:17:52
1	59	323.69077936282736	282.60144187421594	20/04/28 05:17:52
1	59	323.49061679161264	282.42871777417145	20/04/28 05:17:52
1	59	323.55370474803544	282.54675934373813	20/04/28 05:17:52
1	59	323.32469429518545	282.507478733931	20/04/28 05:17:52
1	59	323.2070295319881	282.28967719338175	20/04/28 05:17:52
1	59	323.2861761738444	282.2442626734855	20/04/28 05:17:52
1	59	323.2476921673828	282.2449821017011	20/04/28 05:17:53
1	59	323.4929350652487	282.1856952133763	20/04/28 05:17:53
1	59	323.323877068263	282.3059879991679	20/04/28 05:17:53
1	59	323.21062150904703	282.3548545815338	20/04/28 05:17:53
1	59	323.0561812072085	282.3916708729998	20/04/28 05:17:53
1	59	322.9169352502896	282.3430222349037	20/04/28 05:17:53
1	59	322.89010560952954	282.2493241986087	20/04/28 05:17:53
1	59	322.7666129033068	282.2930218704283	20/04/28 05:17:53
1	59	322.70601923357924	282.4641379783135	20/04/28 05:17:53
1	59	322.794718610744	282.53074748032833	20/04/28 05:17:53
1	59	323.0397441207549	282.54257489841797	20/04/28 05:17:54
1	59	322.87762870250066	282.6855242241055	20/04/28 05:17:54
1	59	322.7076285549345	282.5996128223833	20/04/28 05:17:54
1	59	322.92982093055434	282.7021750331012	20/04/28 05:17:54
1	59	322.9688326895898	282.7428265807472	20/04/28 05:17:54
1	59	322.73959914720194	282.91824282778043	20/04/28 05:17:54
1	59	322.8092783275603	282.7353969155691	20/04/28 05:17:54
1	59	322.8084736680556	282.8293559712441	20/04/28 05:17:54
1	59	322.7045712253565	282.99775998379016	20/04/28 05:17:54
1	59	322.7761733594874	283.0417537935449	20/04/28 05:17:54
1	59	322.68588625229825	283.0061549006648	20/04/28 05:17:55
1	59	322.7236383233353	283.2184125865228	20/04/28 05:17:55
1	59	322.99839384906824	283.1664174985342	20/04/28 05:17:55
1	59	323.0316507492732	283.21435305325946	20/04/28 05:17:55
1	59	323.0316507492732	283.21435305325946	20/04/28 05:17:55
1	59	323.2040386760606	283.19401473972937	20/04/28 05:17:55
1	59	323.19598052709307	283.0449135267984	20/04/28 05:17:55
1	59	323.23599854330246	283.1004108471782	20/04/28 05:17:55
1	59	323.23599854330246	283.1004108471782	20/04/28 05:17:55
1	59	323.32241759211126	283.18632669559935	20/04/28 05:17:56
1	59	323.45192468995896	283.44198611267706	20/04/28 05:17:56
1	59	323.4371460103947	283.47182085366353	20/04/28 05:17:56
1	59	323.6149270228938	283.6567032454033	20/04/28 05:17:56
1	59	323.6498666361723	283.6724950949466	20/04/28 05:17:56
1	59	323.64778151615127	283.66427962058384	20/04/28 05:17:56
1	59	323.78768283283443	283.83326721357435	20/04/28 05:17:56
1	59	323.8398058496035	284.11297636711936	20/04/28 05:17:56
1	59	323.8472607320347	284.12357479903847	20/04/28 05:17:56
1	59	323.86569074706495	284.130848816708	20/04/28 05:17:56
1	59	323.85161167909916	284.00844488510046	20/04/28 05:17:57
1	59	323.9637991483827	284.24261348660417	20/04/28 05:17:57
1	59	324.0843914647574	284.342756812926	20/04/28 05:17:57
1	59	324.03839177419854	284.3803266145608	20/04/28 05:17:57
1	59	324.0132010955271	284.1712876839947	20/04/28 05:17:57
1	59	324.1442014751584	283.9368913284959	20/04/28 05:17:57
1	59	324.1788972761545	283.65489325603465	20/04/28 05:17:57
1	59	324.1488980264888	283.7411137436491	20/04/28 05:17:57
1	59	323.8644240511092	283.7845953174729	20/04/28 05:17:57
1	59	323.8717784816715	283.72214850346745	20/04/28 05:17:58
1	59	324.0758796923119	283.77500566191077	20/04/28 05:17:58
1	59	324.0758796923119	283.77500566191077	20/04/28 05:17:58
1	59	323.979706486695	283.7220352433679	20/04/28 05:17:58
1	59	323.95563824992206	283.95530196157665	20/04/28 05:17:58
1	59	323.905584976563	283.98249888361727	20/04/28 05:17:58
1	59	323.73800650957884	283.9169961957517	20/04/28 05:17:58
1	59	323.9823234819737	283.9278436397974	20/04/28 05:17:58
1	59	323.9952506936662	283.9960957995107	20/04/28 05:17:58
1	59	323.99249763495607	284.0183564557191	20/04/28 05:17:58
1	59	324.0090081276374	283.8981927557367	20/04/28 05:17:59
1	59	323.86201847493686	283.76216308215373	20/04/28 05:17:59
1	59	323.7261511710116	283.7816573828061	20/04/28 05:17:59
1	59	323.63061021254504	283.6930809325845	20/04/28 05:17:59
1	59	323.63061021254504	283.6930809325845	20/04/28 05:17:59
1	59	323.632516643191	283.69409541693585	20/04/28 05:17:59
1	59	323.4809136894579	283.7269349417728	20/04/28 05:17:59
1	59	323.4361200500902	283.53860138672576	20/04/28 05:17:59
1	59	323.40998378170707	283.5694800806789	20/04/28 05:17:59
1	59	323.41851453159194	283.4843170531635	20/04/28 05:17:59
1	59	323.41571801230435	283.38739739968014	20/04/28 05:18:00
1	59	323.4802720528168	283.4409586887638	20/04/28 05:18:00
1	59	323.67048410864186	283.5433163506199	20/04/28 05:18:00
1	59	323.6598702185206	283.5367819339444	20/04/28 05:18:00
1	59	323.78218589357175	283.36560229224204	20/04/28 05:18:00
1	59	323.90738314137036	283.27968330464824	20/04/28 05:18:00
1	59	323.88230270730264	283.3609926924315	20/04/28 05:18:00
1	59	324.0702265478442	283.37437242883294	20/04/28 05:18:00
1	59	324.0102444844721	283.21909096392477	20/04/28 05:18:00
1	59	323.8234916923326	283.0070760201266	20/04/28 05:18:01
1	59	323.71138325018165	282.9244240811265	20/04/28 05:18:01
1	59	323.64673674461034	282.81521984369334	20/04/28 05:18:01
1	59	323.5386319117287	283.07953614759725	20/04/28 05:18:01
1	59	323.6029130519287	283.30999536323554	20/04/28 05:18:01
1	59	323.71563962687515	283.03498296359527	20/04/28 05:18:01
1	59	323.6340520026943	283.1988193613886	20/04/28 05:18:01
1	59	323.66032969486696	283.166577178414	20/04/28 05:18:01
1	59	323.725359810653	283.43837967879375	20/04/28 05:18:01
1	59	323.725359810653	283.43837967879375	20/04/28 05:18:01
1	59	323.6220480195362	283.34826664512656	20/04/28 05:18:02
1	59	323.6220480195362	283.34826664512656	20/04/28 05:18:02
1	59	323.43126577333106	283.26195504408645	20/04/28 05:18:02
1	59	323.545749614864	283.45939819399064	20/04/28 05:18:02
1	59	323.53473297031223	283.4464269196138	20/04/28 05:18:02
1	59	323.53473297031223	283.4464269196138	20/04/28 05:18:02
1	59	323.4954348086891	283.40778233438556	20/04/28 05:18:02
1	59	323.73362239740266	283.46206913511446	20/04/28 05:18:02
1	59	323.59355668578644	282.95700512868905	20/04/28 05:18:02
1	59	323.853989486016	282.86278590679495	20/04/28 05:18:02
1	59	323.7079274867697	282.70667346460556	20/04/28 05:18:03
1	59	323.91597672720906	282.6265397918698	20/04/28 05:18:03
1	59	323.91597672720906	282.6265397918698	20/04/28 05:18:03
1	59	323.67920262517555	282.53105262193054	20/04/28 05:18:03
1	59	323.93436017791765	282.68519490129336	20/04/28 05:18:03
1	59	323.71939799225805	282.58389462493506	20/04/28 05:18:03
1	59	323.67125378821817	282.29708012378677	20/04/28 05:18:03
1	59	323.47538708360634	282.3618706441146	20/04/28 05:18:03
1	59	323.5428252780885	282.2804027479842	20/04/28 05:18:03
1	59	323.46652043968186	282.3263877494657	20/04/28 05:18:04
1	59	323.57993723258784	282.54416080466143	20/04/28 05:18:04
1	59	323.4321022647651	282.53283390723624	20/04/28 05:18:04
1	59	323.40028019391457	282.5772860689847	20/04/28 05:18:04
1	59	323.4038173491135	282.5841327868421	20/04/28 05:18:04
1	59	323.41718467967905	282.6262045909509	20/04/28 05:18:04
1	59	323.4683914475886	282.8079872502581	20/04/28 05:18:04
1	59	323.27356726650885	283.03179505480824	20/04/28 05:18:04
1	59	322.9824417900188	283.06205191707517	20/04/28 05:18:04
1	59	323.07291701345594	283.224596209548	20/04/28 05:18:04
1	59	323.0979238496819	283.3800745076059	20/04/28 05:18:05
1	59	323.01250660844636	283.39516594178235	20/04/28 05:18:05
1	59	323.0238554100563	283.3844349714242	20/04/28 05:18:05
1	59	323.0735505414023	283.50873312604193	20/04/28 05:18:05
1	59	323.14511455183293	283.5615663367066	20/04/28 05:18:05
1	59	323.19651728991977	283.7334026606018	20/04/28 05:18:05
1	59	323.21888685233455	283.5615214305716	20/04/28 05:18:05
1	59	323.1620434429544	283.5003311281408	20/04/28 05:18:05
1	59	323.45702218389164	283.53937731698085	20/04/28 05:18:05
1	59	323.32496594642737	283.6834212699299	20/04/28 05:18:05
1	59	323.2956285432815	283.66488199863846	20/04/28 05:18:06
1	59	323.3034188207181	283.66174071891544	20/04/28 05:18:06
1	59	323.15433086119344	283.61785037181863	20/04/28 05:18:06
1	59	323.3566770268016	283.4736898007219	20/04/28 05:18:06
1	59	323.39471883521924	283.4926657424264	20/04/28 05:18:06
1	59	323.16958580508583	283.31258013748493	20/04/28 05:18:06
1	59	323.0817942876091	283.3804619216343	20/04/28 05:18:06
1	59	322.9371339086978	283.26923771075803	20/04/28 05:18:06
1	59	323.14696586239336	283.2408946009513	20/04/28 05:18:06
1	59	323.10218251629277	283.4238584448174	20/04/28 05:18:07
1	59	323.14103025884685	283.4689258905913	20/04/28 05:18:07
1	59	323.0943315314612	283.4635202307516	20/04/28 05:18:07
1	59	323.09901329310605	283.4089027363871	20/04/28 05:18:07
1	59	323.25656455700863	283.3601560131539	20/04/28 05:18:07
1	59	323.065657959151	283.5585527305029	20/04/28 05:18:07
1	59	323.0662360381624	283.5894399161949	20/04/28 05:18:07
1	59	323.008251420446	283.60074057720857	20/04/28 05:18:07
1	59	322.8761169011512	283.4488907484798	20/04/28 05:18:07
1	59	322.67272860220163	283.54534982883155	20/04/28 05:18:07
1	59	322.48006096819773	283.6091814235817	20/04/28 05:18:08
1	59	322.62142463390256	283.46109807315776	20/04/28 05:18:08
1	59	322.8596944615018	283.60076087556166	20/04/28 05:18:08
1	59	322.88964120142094	283.76851754322666	20/04/28 05:18:08
1	59	322.99731121735323	284.0115221439704	20/04/28 05:18:08
1	59	323.01812119696206	284.1276375977392	20/04/28 05:18:08
1	59	323.0024120811028	284.06797977180764	20/04/28 05:18:08
1	59	323.1542440531121	283.82320212229826	20/04/28 05:18:08
1	59	323.24200183792425	284.0542266818081	20/04/28 05:18:08
1	59	323.03789193836343	284.0793688018408	20/04/28 05:18:09
1	59	322.99073338652704	283.9541134408048	20/04/28 05:18:09
1	59	323.00805360255646	284.0635134659967	20/04/28 05:18:09
1	59	323.0991230409687	284.1613407790447	20/04/28 05:18:09
1	59	323.03279960943706	284.1272876049301	20/04/28 05:18:09
1	59	322.9994442854173	284.1773539610788	20/04/28 05:18:09
1	59	322.9925372245803	283.9916739742974	20/04/28 05:18:09
1	59	322.92529962951755	284.08062804719475	20/04/28 05:18:09
1	59	322.8915687047496	284.03209982814815	20/04/28 05:18:09
1	59	322.8293069517444	283.9490363978818	20/04/28 05:18:09
1	59	322.9156500889248	284.1959606710935	20/04/28 05:18:10
1	59	322.949892938118	284.1895111489975	20/04/28 05:18:10
1	59	322.949892938118	284.1895111489975	20/04/28 05:18:10
1	59	322.949892938118	284.1895111489975	20/04/28 05:18:10
1	59	322.96687167611475	284.02751793474954	20/04/28 05:18:10
1	59	323.24970179946416	284.0790077049976	20/04/28 05:18:10
1	59	323.4054104513961	284.18061269806446	20/04/28 05:18:10
1	59	323.2030205794452	284.2088252263532	20/04/28 05:18:10
1	59	323.20052537027743	284.2117191441398	20/04/28 05:18:10
1	59	323.06543086014625	284.0673416196918	20/04/28 05:18:10
1	59	323.0765131542201	283.99601472846564	20/04/28 05:18:11
1	59	323.2026387801107	284.0241674896979	20/04/28 05:18:11
1	59	322.9343527167167	284.0251906712627	20/04/28 05:18:11
1	59	323.00080296481843	284.0957394399391	20/04/28 05:18:11
1	59	322.9930459671692	284.261322371165	20/04/28 05:18:11
1	59	323.03976291129663	284.1352114473096	20/04/28 05:18:11
1	59	323.00938476209893	284.1439220975797	20/04/28 05:18:11
1	59	322.77799610753414	284.0310818466657	20/04/28 05:18:11
1	59	322.8148112108822	284.0427330059572	20/04/28 05:18:11
1	59	322.8888212961568	283.99711066185426	20/04/28 05:18:12
1	59	322.77363321886753	283.89044037224176	20/04/28 05:18:12
1	59	322.69529814855014	283.6810327103186	20/04/28 05:18:12
1	59	322.59427990080917	283.5531738304827	20/04/28 05:18:12
1	59	322.7949951954454	283.38538405334367	20/04/28 05:18:12
1	59	322.662139621714	283.2429884640049	20/04/28 05:18:12
1	59	322.67344195256504	283.2750273843521	20/04/28 05:18:12
1	59	322.72300701578104	283.33118322340164	20/04/28 05:18:12
1	59	322.85973339044426	283.32069706550635	20/04/28 05:18:12
1	59	322.83776475700074	283.3293135782723	20/04/28 05:18:12
1	59	322.9257975954998	283.52149594956614	20/04/28 05:18:13
1	59	322.9405337399523	283.73470869018877	20/04/28 05:18:13
1	59	322.92243779729	283.51619623056087	20/04/28 05:18:13
1	59	322.96280000979954	283.5816402279773	20/04/28 05:18:13
1	59	323.0000179161669	283.6404877485042	20/04/28 05:18:13
1	59	323.07751029941704	283.81416026572975	20/04/28 05:18:13
1	59	323.2045747481534	283.9318083348446	20/04/28 05:18:13
1	59	323.1375663914031	284.08183337808765	20/04/28 05:18:13
1	59	323.038775848279	284.09337724714266	20/04/28 05:18:13
1	59	322.9120334308649	283.86862748241805	20/04/28 05:18:13
1	59	322.99774040484465	283.805358092107	20/04/28 05:18:14
1	59	322.96729250141374	283.9931590065206	20/04/28 05:18:14
1	59	322.9859327038208	284.2892899742935	20/04/28 05:18:14
1	59	322.80802954552894	284.4666486273457	20/04/28 05:18:14
1	59	322.51777355112523	284.47216856556435	20/04/28 05:18:14
1	59	322.44261143187776	284.74840798901636	20/04/28 05:18:14
1	59	322.65354502921724	284.85693223996833	20/04/28 05:18:14
1	59	322.61933651473646	285.1270366746139	20/04/28 05:18:14
1	59	322.79308175583304	285.23332921900715	20/04/28 05:18:14
1	59	322.84025148991884	285.18559982062243	20/04/28 05:18:15
1	59	323.1140270533171	285.19611717881645	20/04/28 05:18:15
1	59	323.24970694069276	285.19181768964523	20/04/28 05:18:15
1	59	323.1138164991603	284.96953246646814	20/04/28 05:18:15
1	59	323.21461396962906	284.823316304528	20/04/28 05:18:15
1	59	323.3040025461211	284.78538394431416	20/04/28 05:18:15
1	59	323.03403632541165	284.65567724087686	20/04/28 05:18:15
1	59	323.0540610205104	284.60751177358014	20/04/28 05:18:15
1	59	323.0540610205104	284.60751177358014	20/04/28 05:18:15
1	59	322.85705721623447	284.67516439414584	20/04/28 05:18:15
1	59	322.88830644354965	284.7317078830892	20/04/28 05:18:16
1	59	322.9434780393821	284.73586525352096	20/04/28 05:18:16
1	59	322.9031969041224	284.8925190258628	20/04/28 05:18:16
1	59	322.8823990603167	284.85440062644756	20/04/28 05:18:16
1	59	322.711342527017	284.64968555560375	20/04/28 05:18:16
1	59	322.8246957825367	284.5024431548882	20/04/28 05:18:16
1	59	322.63834564189864	284.28414080284796	20/04/28 05:18:16
1	59	322.771749360096	284.10230386243364	20/04/28 05:18:16
1	59	322.769002234475	284.075775574919	20/04/28 05:18:16
1	59	322.8016866983205	284.3039040713245	20/04/28 05:18:16
1	59	322.9147644180765	284.3866353982716	20/04/28 05:18:17
1	59	322.9193203266734	284.28036808900816	20/04/28 05:18:17
1	59	322.86344129411555	284.3156351069079	20/04/28 05:18:17
1	59	322.88004140074054	284.1836036256537	20/04/28 05:18:17
1	59	322.89327155837657	284.3250424531765	20/04/28 05:18:17
1	59	322.942246082128	284.3847721860753	20/04/28 05:18:17
1	59	322.80914239250853	284.3725105396561	20/04/28 05:18:17
1	59	322.662360686235	284.1264311151252	20/04/28 05:18:17
1	59	322.69615781691556	283.9865510927283	20/04/28 05:18:17
1	59	322.4981874963158	284.1747016184602	20/04/28 05:18:18
1	59	322.68069103216175	284.14807520208836	20/04/28 05:18:18
1	59	322.45617120336385	284.20797328169965	20/04/28 05:18:18
1	59	322.4509123994133	284.2106060408188	20/04/28 05:18:18
1	59	322.5075761913343	284.1804033932527	20/04/28 05:18:18
1	59	322.4703622810435	284.1416083663415	20/04/28 05:18:18
1	59	322.4639462733812	284.0891338891509	20/04/28 05:18:18
1	59	322.6869167171588	283.99247522537	20/04/28 05:18:18
1	59	322.4513233678873	284.1610147188077	20/04/28 05:18:18
1	59	322.52573639247134	284.237730726833	20/04/28 05:18:18
1	59	322.4580552321296	284.1730139300868	20/04/28 05:18:19
1	59	322.6486679135377	284.08309763709167	20/04/28 05:18:19
1	59	322.6486679135377	284.08309763709167	20/04/28 05:18:19
1	59	322.564946361657	284.2362564008923	20/04/28 05:18:19
1	59	322.6824103123957	284.45773906147235	20/04/28 05:18:19
1	59	322.6824103123957	284.45773906147235	20/04/28 05:18:19
1	59	322.5679757246394	284.45838518672997	20/04/28 05:18:19
1	59	322.56329719848964	284.4727423834574	20/04/28 05:18:19
1	59	322.71507930749993	284.5070387083537	20/04/28 05:18:19
1	59	322.7516788011471	284.72331425461306	20/04/28 05:18:19
1	59	322.7735109800538	284.7508573075053	20/04/28 05:18:20
1	59	322.71754490056986	284.7591928488039	20/04/28 05:18:20
1	59	322.8677640154361	284.65957755351855	20/04/28 05:18:20
1	59	322.7070400659617	284.6525789745745	20/04/28 05:18:20
1	59	322.7013628590144	284.65549239806154	20/04/28 05:18:20
1	59	322.59731077538487	284.85723755559076	20/04/28 05:18:20
1	59	322.59053871944377	284.8550781130262	20/04/28 05:18:20
1	59	322.64575069601096	284.74992564027843	20/04/28 05:18:20
1	59	322.8305364103387	284.73477096420913	20/04/28 05:18:20
1	59	322.94361084609346	284.83143251172515	20/04/28 05:18:20
1	59	322.8305621438496	284.8657497425153	20/04/28 05:18:21
1	59	322.85471951519594	284.87840202412036	20/04/28 05:18:21
1	59	323.12102686379427	284.77274553082833	20/04/28 05:18:21
1	59	323.13965448260086	284.8373969758818	20/04/28 05:18:21
1	59	322.94964212133004	284.94043521072695	20/04/28 05:18:21
1	59	323.007000547666	284.70618340301513	20/04/28 05:18:21
1	59	322.948237626594	284.6856552115703	20/04/28 05:18:21
1	59	323.10400927180694	284.8728450265728	20/04/28 05:18:21
1	59	323.0073354553036	284.7995333231499	20/04/28 05:18:21
1	59	323.1499623512666	284.8396737133218	20/04/28 05:18:22
1	59	323.21122603492915	284.88416129477343	20/04/28 05:18:22
1	59	322.9841778095343	284.7068127064924	20/04/28 05:18:22
1	59	322.9459331494989	284.4173814975558	20/04/28 05:18:22
1	59	323.13731297420526	284.2668287442823	20/04/28 05:18:22
1	59	323.14443352156735	284.25250436304236	20/04/28 05:18:22
1	59	323.09527261335876	284.21871008905947	20/04/28 05:18:22
1	59	323.14007323548833	284.2894783386681	20/04/28 05:18:22
1	59	323.3057194270094	284.4490089930312	20/04/28 05:18:22
1	59	323.30860316129525	284.43445849662334	20/04/28 05:18:22
1	59	323.15518915928203	284.5380535869974	20/04/28 05:18:23
1	59	323.1263819676545	284.67408961884337	20/04/28 05:18:23
1	59	323.08847284607486	284.6338781116827	20/04/28 05:18:23
1	59	323.0428373840756	284.5739025815076	20/04/28 05:18:23
1	59	323.0776587648307	284.60547500358945	20/04/28 05:18:23
1	59	323.1086862677561	284.59822063505163	20/04/28 05:18:23
1	59	323.29516685248467	284.39633593549445	20/04/28 05:18:23
1	59	323.325459362951	284.4885316034371	20/04/28 05:18:23
1	59	323.31402370303766	284.3282514539361	20/04/28 05:18:23
1	59	323.36093568264516	284.1992596790334	20/04/28 05:18:23
1	59	323.62096989664576	284.1235776049323	20/04/28 05:18:24
1	59	323.6415882626643	284.08277561687294	20/04/28 05:18:24
1	59	323.491065252247	284.013183987814	20/04/28 05:18:24
1	59	323.4639402251135	283.8625018281595	20/04/28 05:18:24
1	59	323.2341249688599	284.0028865196712	20/04/28 05:18:24
1	59	323.28647708710105	283.8749963149729	20/04/28 05:18:24
1	59	322.9505527390417	283.9776235393686	20/04/28 05:18:24
1	59	323.1469007115364	284.12776413913826	20/04/28 05:18:24
1	59	323.0274724145639	284.0957377820257	20/04/28 05:18:24
1	59	323.2194197001217	283.9687486720541	20/04/28 05:18:25
1	59	323.1231310989221	284.04081036702644	20/04/28 05:18:25
1	59	322.96431878418156	284.17590616327203	20/04/28 05:18:25
1	59	322.8603911265133	284.0240310102741	20/04/28 05:18:25
1	59	322.8603911265133	284.0240310102741	20/04/28 05:18:25
1	59	322.75642954571714	283.7445640934586	20/04/28 05:18:25
1	59	322.7875194244147	283.63908802188786	20/04/28 05:18:25
1	59	322.95504372498226	283.5784160181718	20/04/28 05:18:25
1	59	323.0474594272293	283.60463133920865	20/04/28 05:18:25
1	59	322.905754599216	283.5775810236379	20/04/28 05:18:25
1	59	323.0073711162735	283.64980581530966	20/04/28 05:18:26
1	59	323.21757209110575	283.60955639018437	20/04/28 05:18:26
1	59	323.4073901738809	283.67500687411314	20/04/28 05:18:26
1	59	323.23657057628355	283.48206880110064	20/04/28 05:18:26
1	59	323.0160933406444	283.42072313138505	20/04/28 05:18:26
1	59	323.09415134026614	283.3009433697482	20/04/28 05:18:26
1	59	323.11794415892007	283.2689338829778	20/04/28 05:18:26
1	59	323.11794415892007	283.2689338829778	20/04/28 05:18:26
1	59	323.05808113194496	283.478295162316	20/04/28 05:18:26
1	59	323.24730865385146	283.52608066280516	20/04/28 05:18:27
1	59	323.25107470102347	283.2316509897235	20/04/28 05:18:27
1	59	323.2880177310534	283.12948245656673	20/04/28 05:18:27
1	59	323.09367061426303	283.2993031128749	20/04/28 05:18:27
1	59	323.1319876186518	283.37688263650676	20/04/28 05:18:27
1	59	323.0003502027558	283.4234485821945	20/04/28 05:18:27
1	59	323.05382899969834	283.6755294808559	20/04/28 05:18:27
1	59	323.0068133826046	283.5347396578239	20/04/28 05:18:27
1	59	323.03621383869586	283.60220347356494	20/04/28 05:18:27
1	59	323.1733327727229	283.83907349559166	20/04/28 05:18:27
1	59	323.222776823486	283.67703547630975	20/04/28 05:18:28
1	59	323.36108633012134	283.47045747269175	20/04/28 05:18:28
1	59	323.19366186730724	283.6617823379591	20/04/28 05:18:28
1	59	323.17177337413324	283.6556803102848	20/04/28 05:18:28
1	59	323.18506421601097	283.6308712298836	20/04/28 05:18:28
1	59	323.3876380155905	283.68579935057727	20/04/28 05:18:28
1	59	323.5568167455349	283.4594401308642	20/04/28 05:18:28
1	59	323.4728373441628	283.62472001851626	20/04/28 05:18:28
1	59	323.3610719302631	283.5427255576122	20/04/28 05:18:28
1	59	323.29506944101405	283.68775285102157	20/04/28 05:18:28
1	59	323.22480192336195	283.6069310616803	20/04/28 05:18:29
1	59	323.2335255920156	283.60652350892144	20/04/28 05:18:29
1	59	323.37746247353573	283.59103997517326	20/04/28 05:18:29
1	59	323.3935425043444	283.51472654927136	20/04/28 05:18:29
1	59	323.42264925124704	283.54573805164307	20/04/28 05:18:29
1	59	323.35726792757237	283.30453278323404	20/04/28 05:18:29
1	59	323.3323856955788	283.4684479775763	20/04/28 05:18:29
1	59	323.21065747842465	283.2904296423429	20/04/28 05:18:29
1	59	323.0315872055058	283.0901810708003	20/04/28 05:18:29
1	59	323.1786542400322	282.8748426937904	20/04/28 05:18:30
1	59	323.0910537136396	283.01503873112307	20/04/28 05:18:30
1	59	323.05951705512024	282.9870244236822	20/04/28 05:18:30
1	59	322.91019263471367	282.9360624871537	20/04/28 05:18:30
1	59	323.0489149466309	282.95988233721266	20/04/28 05:18:30
1	59	322.9560400139097	282.87103108298436	20/04/28 05:18:30
1	59	322.90548591162377	282.844948761698	20/04/28 05:18:30
1	59	322.9147261990236	282.8610021319388	20/04/28 05:18:30
1	59	322.9223033410412	282.9312436773953	20/04/28 05:18:30
1	59	322.93550449983553	282.765505197495	20/04/28 05:18:30
1	59	323.15032215224863	282.6981519257715	20/04/28 05:18:31
1	59	323.33181646100564	282.76145581726996	20/04/28 05:18:31
1	59	323.22768656448125	282.6663687860862	20/04/28 05:18:31
1	59	323.2606178587023	282.7820391178006	20/04/28 05:18:31
1	59	323.47264008935434	282.9885717614764	20/04/28 05:18:31
1	59	323.5405188850395	283.02283683706855	20/04/28 05:18:31
1	59	323.49597562213904	283.24860906079016	20/04/28 05:18:31
1	59	323.2666484754223	283.0708712196518	20/04/28 05:18:31
1	59	323.1678665644815	283.116822422487	20/04/28 05:18:31
1	59	323.2038577745694	283.0307039117848	20/04/28 05:18:31
1	59	323.0681258627371	282.78565593166655	20/04/28 05:18:32
1	59	322.9056542698089	282.9309404795086	20/04/28 05:18:32
1	59	322.96586800193086	282.7929464805134	20/04/28 05:18:32
1	59	323.043857418331	282.77254276075587	20/04/28 05:18:32
1	59	323.04080424484687	282.4727159424506	20/04/28 05:18:32
1	59	323.2633655355044	282.45467143401993	20/04/28 05:18:32
1	59	323.23738364630407	282.41353088183683	20/04/28 05:18:32
1	59	323.1963245776176	282.42485728063485	20/04/28 05:18:32
1	59	323.18799551453924	282.41431706313085	20/04/28 05:18:32
1	59	323.4475631496782	282.5050236332663	20/04/28 05:18:32
1	59	323.57419828101143	282.41650072090204	20/04/28 05:18:33
1	59	323.4820484480709	282.4321550132561	20/04/28 05:18:33
1	59	323.4343423745573	282.48142632027617	20/04/28 05:18:33
1	59	323.4449813580116	282.47999269060733	20/04/28 05:18:33
1	59	323.2662953353179	282.6267092906889	20/04/28 05:18:33
1	59	323.38038084594604	282.4678825879639	20/04/28 05:18:33
1	59	323.57721436989823	282.59672425613775	20/04/28 05:18:33
1	59	323.74531677658564	282.3773437640747	20/04/28 05:18:33
1	59	323.564635290051	282.4208805774286	20/04/28 05:18:33
1	59	323.57835545545066	282.43948534127315	20/04/28 05:18:34
1	59	323.5630312955848	282.2603590019478	20/04/28 05:18:34
1	59	323.53000038029177	282.3701375857967	20/04/28 05:18:34
1	59	323.42796999294086	282.3840036334426	20/04/28 05:18:34
1	59	323.4414480203066	282.32405382906103	20/04/28 05:18:34
1	59	323.4438038326549	282.3596198348077	20/04/28 05:18:34
1	59	323.2159539727846	282.2880021492946	20/04/28 05:18:34
1	59	323.148143593172	282.24048573555126	20/04/28 05:18:34
1	59	323.148143593172	282.24048573555126	20/04/28 05:18:34
1	59	322.8952951441509	282.5451802582078	20/04/28 05:18:34
1	59	322.96582146772715	282.58712518146297	20/04/28 05:18:35
1	59	323.25521060210434	282.6139830875412	20/04/28 05:18:35
1	59	323.45831064541477	282.6372991622841	20/04/28 05:18:35
1	59	323.2775938487667	282.6565433117307	20/04/28 05:18:35
1	59	323.14331565152287	282.68822799140565	20/04/28 05:18:35
1	59	323.35884744494365	282.8479348467668	20/04/28 05:18:35
1	59	323.3694074073036	282.7221743204027	20/04/28 05:18:35
1	59	323.4793218611974	282.77250420028736	20/04/28 05:18:35
1	59	323.4793218611974	282.77250420028736	20/04/28 05:18:35
1	59	323.4807804576136	283.04846320830615	20/04/28 05:18:35
1	59	323.6482504188057	282.888392825404	20/04/28 05:18:36
1	59	323.6482504188057	282.888392825404	20/04/28 05:18:36
1	59	323.4813934014865	282.8823044519213	20/04/28 05:18:36
1	59	323.4058309887022	282.93567827485015	20/04/28 05:18:36
1	59	323.41767119275033	282.91148292594823	20/04/28 05:18:36
1	59	323.66888090312773	282.8359577600975	20/04/28 05:18:36
1	59	323.77694017756914	282.8317773938177	20/04/28 05:18:36
1	59	323.81172799645776	282.8914435230556	20/04/28 05:18:36
1	59	323.94012360538125	282.9414242453801	20/04/28 05:18:36
1	59	323.76764875876927	282.91185786741505	20/04/28 05:18:37
1	59	323.9261540055339	282.99318252239806	20/04/28 05:18:37
1	59	324.2743782465598	282.816274828404	20/04/28 05:18:37
1	59	324.0326842967347	282.6543889257152	20/04/28 05:18:37
1	59	324.15997891653916	282.61840874749595	20/04/28 05:18:37
1	59	324.1291892912039	282.6100408889962	20/04/28 05:18:37
1	59	324.19327754740016	282.4915633292043	20/04/28 05:18:37
1	59	324.2108773016077	282.7157658734215	20/04/28 05:18:37
1	59	324.30670106155105	282.7667696788995	20/04/28 05:18:37
1	59	324.30312924906593	282.74089832367997	20/04/28 05:18:37
1	59	324.4463491826877	282.61736515531567	20/04/28 05:18:38
1	59	324.65807890007125	282.70415943972637	20/04/28 05:18:38
1	59	324.93680098072304	282.7122929779082	20/04/28 05:18:38
1	59	324.8559891559592	282.6636599952869	20/04/28 05:18:38
1	59	324.8559891559592	282.6636599952869	20/04/28 05:18:38
1	59	324.6868183672282	282.8843722810736	20/04/28 05:18:38
1	59	324.93973447888686	282.89908563013057	20/04/28 05:18:38
1	59	324.93973447888686	282.89908563013057	20/04/28 05:18:38
1	59	324.93973447888686	282.89908563013057	20/04/28 05:18:38
1	59	325.0979100499479	282.83698276588575	20/04/28 05:18:38
1	59	325.1351431534809	282.7934983399029	20/04/28 05:18:39
1	59	324.9170064204124	282.6353798395287	20/04/28 05:18:39
1	59	325.00035270433693	282.5736064167058	20/04/28 05:18:39
1	59	325.000854040877	282.58191323962654	20/04/28 05:18:39
1	59	325.000854040877	282.58191323962654	20/04/28 05:18:39
1	59	325.00990378872	282.58505679523495	20/04/28 05:18:39
1	59	325.05159509120386	282.6764640817219	20/04/28 05:18:39
1	59	325.05159509120386	282.6764640817219	20/04/28 05:18:39
1	59	325.32531003169913	282.63057825013027	20/04/28 05:18:39
1	59	325.4834166537121	282.3586986610733	20/04/28 05:18:40
1	59	325.5239958064836	282.3867983477792	20/04/28 05:18:40
1	59	325.5239958064836	282.3867983477792	20/04/28 05:18:40
1	59	325.53580042747853	282.5441992049878	20/04/28 05:18:40
1	59	325.5424615954022	282.5460973324216	20/04/28 05:18:40
1	59	325.54522977381924	282.55589225571595	20/04/28 05:18:40
1	59	325.3692596757909	282.60113470128545	20/04/28 05:18:40
1	59	325.277005435189	282.8157953895225	20/04/28 05:18:40
1	59	325.5203417018048	282.90453370780165	20/04/28 05:18:40
1	59	325.5868945073537	282.82511243384175	20/04/28 05:18:40
1	59	325.65069422148696	282.7286846985833	20/04/28 05:18:41
1	59	325.62789122622934	282.7536040245386	20/04/28 05:18:41
1	59	325.63084128888806	282.7534539432244	20/04/28 05:18:41
1	59	325.5417893590834	282.7631692657068	20/04/28 05:18:41
1	59	325.3983846808407	282.710116663925	20/04/28 05:18:41
1	59	325.33204375656845	282.68802127341945	20/04/28 05:18:41
1	59	325.40575615617246	282.7372744050176	20/04/28 05:18:41
1	59	325.43258903438937	282.76101686936346	20/04/28 05:18:41
1	59	325.27363823984297	283.00738342087203	20/04/28 05:18:41
1	59	325.3285140329023	282.98348101519247	20/04/28 05:18:41
1	59	325.5975087277412	283.0225468691778	20/04/28 05:18:42
1	59	325.6358255133692	282.89049181529373	20/04/28 05:18:42
1	59	325.40584966248235	282.8599994811779	20/04/28 05:18:42
1	59	325.3592923958668	282.6796789840327	20/04/28 05:18:42
1	59	325.4085813512739	282.52325729597095	20/04/28 05:18:42
1	59	325.46302498981856	282.25292924640496	20/04/28 05:18:42
1	59	325.4019823276224	282.4496822162218	20/04/28 05:18:42
1	59	325.53578470721146	282.7072649334787	20/04/28 05:18:42
1	59	325.6480275609896	282.64785174319996	20/04/28 05:18:42
1	59	325.3753215600288	282.6966725151279	20/04/28 05:18:43
1	59	325.2718472149266	282.72192253497565	20/04/28 05:18:43
1	59	325.2696040751586	282.65436798740524	20/04/28 05:18:43
1	59	325.244953263405	282.6690409134005	20/04/28 05:18:43
1	59	325.37473345301527	282.54919055821017	20/04/28 05:18:43
1	59	325.23719315301264	282.6349443637382	20/04/28 05:18:43
1	59	325.40146652429655	282.69697242882614	20/04/28 05:18:43
1	59	325.4090052421997	282.6883214367601	20/04/28 05:18:43
1	59	325.627827637361	282.68957256102135	20/04/28 05:18:43
1	59	325.722866811207	282.758884966158	20/04/28 05:18:43
1	59	325.6682981005424	282.8632203706439	20/04/28 05:18:44
1	59	325.61063881712454	282.86609010358677	20/04/28 05:18:44
1	59	325.52119694716924	283.08578959760234	20/04/28 05:18:44
1	59	325.60000314902663	282.87379476810025	20/04/28 05:18:44
1	59	325.6549851196438	282.9753867686256	20/04/28 05:18:44
1	59	325.69786277657664	283.19559684360075	20/04/28 05:18:44
1	59	325.63841983986174	283.0843851265893	20/04/28 05:18:44
1	59	325.6341131176055	283.26807911179435	20/04/28 05:18:44
1	59	325.4517183269229	283.127484904805	20/04/28 05:18:44
1	59	325.4903239691588	283.13791516872175	20/04/28 05:18:44
1	59	325.71563151566113	283.04140163102306	20/04/28 05:18:45
1	59	325.6460313431468	282.8160251344998	20/04/28 05:18:45
1	59	325.8426465355832	282.64805494310946	20/04/28 05:18:45
1	59	326.0869628340343	282.6114404562015	20/04/28 05:18:45
1	59	325.8704743279437	282.52660683106166	20/04/28 05:18:45
1	59	325.8343452851493	282.6940919855431	20/04/28 05:18:45
1	59	325.875182016704	282.4673736171719	20/04/28 05:18:45
1	59	325.99956091607186	282.4861533463879	20/04/28 05:18:45
1	59	325.98208543749865	282.48283740357044	20/04/28 05:18:45
1	59	325.7434841500791	282.481685239283	20/04/28 05:18:46
1	59	325.7941341021223	282.43834886705133	20/04/28 05:18:46
1	59	325.7058804997312	282.64053303152195	20/04/28 05:18:46
1	59	325.62723335751474	282.58678300457865	20/04/28 05:18:46
1	59	325.6582144366784	282.61478872887017	20/04/28 05:18:46
1	59	325.6582144366784	282.61478872887017	20/04/28 05:18:46
1	59	325.5335340619768	282.7965588190757	20/04/28 05:18:46
1	59	325.5335340619768	282.7965588190757	20/04/28 05:18:46
1	59	325.5302092287595	282.82722317834316	20/04/28 05:18:46
1	59	325.84839617630615	282.99689809455907	20/04/28 05:18:46
1	59	325.8419354835584	283.0606979791436	20/04/28 05:18:47
1	59	325.8419354835584	283.0606979791436	20/04/28 05:18:47
1	59	325.69321034656105	283.0226082764072	20/04/28 05:18:47
1	59	325.69321034656105	283.0226082764072	20/04/28 05:18:47
1	59	325.7140084320504	282.77173833231666	20/04/28 05:18:47
1	59	325.74242199427675	282.6802213993556	20/04/28 05:18:47
1	59	325.93511659782325	282.685503835439	20/04/28 05:18:47
1	59	326.09208777556313	282.8305905293364	20/04/28 05:18:47
1	59	326.2599205209635	282.87040010622695	20/04/28 05:18:47
1	59	326.23516962342165	282.3739090872498	20/04/28 05:18:47
1	59	326.07084979451855	282.4193019279222	20/04/28 05:18:48
1	59	326.29359157562254	282.48669898983167	20/04/28 05:18:48
1	59	326.2442849986223	282.47963001553813	20/04/28 05:18:48
1	59	326.2442849986223	282.47963001553813	20/04/28 05:18:48
1	59	326.2807868586101	282.4325547481951	20/04/28 05:18:48
1	59	326.27436920815734	282.78167259900033	20/04/28 05:18:48
1	59	326.1427402045917	282.95142961483185	20/04/28 05:18:48
1	59	326.1298630456815	282.9287416836693	20/04/28 05:18:48
1	59	326.1298630456815	282.9287416836693	20/04/28 05:18:48
1	59	326.0238129812962	282.8692034704789	20/04/28 05:18:49
