floorId	partitionId	location_x	location_y	timeStamp
18	982	360.3327834419265	278.3422844929435	21/02/24 15:46:05
18	982	360.3327834419265	278.3422844929435	21/02/24 15:46:06
18	982	360.3327834419265	278.3422844929435	21/02/24 15:46:07
18	979	348.2367582443579	277.1518332869306	21/02/24 15:46:08
18	979	348.2367582443579	277.1518332869306	21/02/24 15:46:09
18	979	348.2367582443579	277.1518332869306	21/02/24 15:46:10
18	979	348.2367582443579	277.1518332869306	21/02/24 15:46:11
18	979	348.2367582443579	277.15183328693064	21/02/24 15:46:12
18	979	341.3179542174323	279.8134374747344	21/02/24 15:46:13
18	979	341.3179542174323	279.8134374747344	21/02/24 15:46:14
18	979	341.3179542174323	279.8134374747344	21/02/24 15:46:15
18	979	341.3179542174323	279.8134374747344	21/02/24 15:46:16
18	979	341.3179542174323	279.8134374747344	21/02/24 15:46:17
18	979	341.3179542174323	279.8134374747344	21/02/24 15:46:18
18	979	341.3179542174323	279.8134374747344	21/02/24 15:46:19
18	982	335.5707947754775	282.66660998132573	21/02/24 15:46:20
18	979	341.3179542174323	279.8134374747344	21/02/24 15:46:21
18	979	341.3179542174323	279.8134374747344	21/02/24 15:46:22
18	979	341.3179542174323	279.8134374747344	21/02/24 15:46:23
18	979	341.3179542174323	279.8134374747344	21/02/24 15:46:24
18	979	341.3179542174323	279.8134374747344	21/02/24 15:46:25
18	979	341.3179542174323	279.8134374747344	21/02/24 15:46:26
18	979	341.3179542174323	279.8134374747344	21/02/24 15:46:27
18	979	341.3179542174323	279.8134374747344	21/02/24 15:46:28
18	979	341.3179542174323	279.8134374747344	21/02/24 15:46:29
18	979	341.3179542174323	279.8134374747344	21/02/24 15:46:30
18	979	341.3179542174323	279.8134374747344	21/02/24 15:46:31
18	979	341.3179542174323	279.8134374747344	21/02/24 15:46:32
18	979	341.3179542174323	279.8134374747344	21/02/24 15:46:33
18	979	341.3179542174323	279.8134374747344	21/02/24 15:46:34
18	979	341.3179542174323	279.8134374747344	21/02/24 15:46:35
18	979	341.3179542174323	279.8134374747344	21/02/24 15:46:36
18	979	341.3179542174323	279.8134374747344	21/02/24 15:46:37
18	979	341.3179542174323	279.8134374747344	21/02/24 15:46:38
18	979	341.3179542174323	279.8134374747344	21/02/24 15:46:39
18	979	341.3179542174323	279.8134374747344	21/02/24 15:46:40
18	979	341.3179542174323	279.8134374747344	21/02/24 15:46:41
18	979	348.2367582443579	277.15183328693064	21/02/24 15:46:42
18	979	348.2367582443579	277.15183328693064	21/02/24 15:46:43
18	979	348.2367582443579	277.1518332869306	21/02/24 15:46:44
18	979	348.2367582443579	277.1518332869306	21/02/24 15:46:45
18	979	348.2367582443579	277.1518332869306	21/02/24 15:46:46
18	982	360.3327834419265	278.3422844929435	21/02/24 15:46:47
18	982	360.3327834419265	278.3422844929435	21/02/24 15:46:48
18	982	360.3327834419265	278.3422844929435	21/02/24 15:46:49
18	982	360.3327834419265	278.3422844929435	21/02/24 15:46:50
18	982	360.3327834419265	278.3422844929435	21/02/24 15:46:51
18	982	360.3327834419265	278.3422844929435	21/02/24 15:46:52
18	982	360.3327834419265	278.3422844929435	21/02/24 15:46:53
18	982	360.3327834419265	278.3422844929435	21/02/24 15:46:54
18	982	360.3327834419265	278.3422844929435	21/02/24 15:46:55
18	982	360.3327834419265	278.3422844929435	21/02/24 15:46:56
18	982	360.3327834419265	278.3422844929435	21/02/24 15:46:57
18	982	360.3327834419265	278.3422844929435	21/02/24 15:46:58
18	982	360.3327834419265	278.3422844929435	21/02/24 15:46:59
18	982	360.3327834419265	278.3422844929435	21/02/24 15:47:00
18	982	360.3327834419265	278.3422844929435	21/02/24 15:47:02
18	982	360.3327834419265	278.3422844929435	21/02/24 15:47:03
18	982	360.3327834419265	278.3422844929435	21/02/24 15:47:04
18	982	360.3327834419265	278.3422844929435	21/02/24 15:47:05
18	982	360.3327834419265	278.3422844929435	21/02/24 15:47:06
18	982	360.3327834419265	278.3422844929435	21/02/24 15:47:07
18	982	360.3327834419265	278.3422844929435	21/02/24 15:47:08
18	982	360.3327834419265	278.3422844929435	21/02/24 15:47:09
18	982	360.3327834419265	278.3422844929435	21/02/24 15:47:10
18	982	360.3327834419265	278.3422844929435	21/02/24 15:47:11
18	982	360.3327834419265	278.3422844929435	21/02/24 15:47:12
18	982	360.3327834419265	278.3422844929435	21/02/24 15:47:13
18	982	360.3327834419265	278.3422844929435	21/02/24 15:47:14
18	982	360.3327834419265	278.3422844929435	21/02/24 15:47:15
18	982	360.3327834419265	278.3422844929435	21/02/24 15:47:16
18	982	360.3327834419265	278.3422844929435	21/02/24 15:47:17
18	982	360.3327834419265	278.3422844929435	21/02/24 15:47:18
18	982	360.3327834419265	278.3422844929435	21/02/24 15:47:19
18	982	360.3327834419265	278.3422844929435	21/02/24 15:47:20
18	982	360.3327834419265	278.3422844929435	21/02/24 15:47:21
18	982	360.3327834419265	278.3422844929435	21/02/24 15:47:22
18	982	360.3327834419265	278.3422844929435	21/02/24 15:47:23
18	982	360.3327834419265	278.3422844929435	21/02/24 15:47:24
18	982	360.3327834419265	278.3422844929435	21/02/24 15:47:25
18	982	360.3327834419265	278.3422844929435	21/02/24 15:47:26
18	979	348.2367582443579	277.1518332869306	21/02/24 15:47:27
18	979	348.2367582443579	277.1518332869306	21/02/24 15:47:28
18	979	348.2367582443579	277.1518332869306	21/02/24 15:47:29
18	979	341.3179542174323	279.8134374747344	21/02/24 15:47:30
18	979	348.2367582443579	277.15183328693064	21/02/24 15:47:31
18	979	341.3179542174323	279.8134374747344	21/02/24 15:47:32
18	979	341.3179542174323	279.8134374747344	21/02/24 15:47:33
18	979	341.3179542174323	279.8134374747344	21/02/24 15:47:34
18	979	341.3179542174323	279.8134374747344	21/02/24 15:47:35
18	979	341.3179542174323	279.8134374747344	21/02/24 15:47:36
18	979	341.3179542174323	279.8134374747344	21/02/24 15:47:37
18	979	341.3179542174323	279.8134374747344	21/02/24 15:47:38
18	979	341.3179542174323	279.8134374747344	21/02/24 15:47:39
18	979	341.3179542174323	279.8134374747344	21/02/24 15:47:40
18	979	341.3179542174323	279.8134374747344	21/02/24 15:47:41
18	979	341.3179542174323	279.8134374747344	21/02/24 15:47:42
18	979	341.3179542174323	279.8134374747344	21/02/24 15:47:43
18	979	341.3179542174323	279.8134374747344	21/02/24 15:47:44
18	979	341.3179542174323	279.8134374747344	21/02/24 15:47:45
18	979	341.3179542174323	279.8134374747344	21/02/24 15:47:46
