floorId	partitionId	location_x	location_y	timeStamp
1	93	325.2351698940949	295.7424387172771	20/04/28 05:08:49
1	93	325.2351698940949	295.7424387172771	20/04/28 05:08:50
3	80	325.54973502904267	296.5446451310957	20/04/28 05:08:51
1	93	325.54973502904267	296.5446451310957	20/04/28 05:08:52
1	93	324.9710986825425	296.4754307966967	20/04/28 05:08:53
1	93	325.2351698940949	295.7424387172771	20/04/28 05:08:54
1	93	325.54973502904267	296.5446451310957	20/04/28 05:08:55
1	93	325.54973502904267	296.5446451310957	20/04/28 05:08:56
1	93	325.54973502904267	296.5446451310957	20/04/28 05:08:57
1	93	325.2351698940949	295.7424387172771	20/04/28 05:08:58
1	4	317.62678749159863	295.24617992491676	20/04/28 05:08:59
1	93	325.63960729750016	294.92545288314295	20/04/28 05:09:00
1	50	325.33662414622455	292.4082746224365	20/04/28 05:09:01
1	93	324.9710986825425	296.4754307966967	20/04/28 05:09:02
1	4	317.62678749159863	295.24617992491676	20/04/28 05:09:03
1	4	317.890858703151	294.51318784549716	20/04/28 05:09:04
3	51	317.3122223566509	294.4439735110981	20/04/28 05:09:05
1	4	317.62678749159863	295.24617992491676	20/04/28 05:09:06
1	4	317.890858703151	294.51318784549716	20/04/28 05:09:07
1	4	317.3122223566509	294.4439735110981	20/04/28 05:09:08
3	51	317.62678749159863	295.24617992491676	20/04/28 05:09:09
1	93	324.9710986825425	296.4754307966967	20/04/28 05:09:10
3	51	317.62678749159863	295.24617992491676	20/04/28 05:09:11
1	4	317.890858703151	294.51318784549716	20/04/28 05:09:12
3	80	324.9710986825425	296.4754307966967	20/04/28 05:09:13
3	51	317.62678749159863	295.24617992491676	20/04/28 05:09:14
1	4	317.62678749159863	295.24617992491676	20/04/28 05:09:15
1	4	317.890858703151	294.51318784549716	20/04/28 05:09:16
1	4	317.890858703151	294.51318784549716	20/04/28 05:09:17
1	93	324.9710986825425	296.4754307966967	20/04/28 05:09:18
1	93	325.54973502904267	296.5446451310957	20/04/28 05:09:19
1	93	325.2351698940949	295.7424387172771	20/04/28 05:09:20
1	93	325.54973502904267	296.5446451310957	20/04/28 05:09:21
1	93	324.9710986825425	296.4754307966967	20/04/28 05:09:22
3	80	324.9710986825425	296.4754307966967	20/04/28 05:09:23
1	93	325.2351698940949	295.7424387172771	20/04/28 05:09:24
1	93	324.9710986825425	296.4754307966967	20/04/28 05:09:25
1	93	325.54973502904267	296.5446451310957	20/04/28 05:09:26
1	93	325.2351698940949	295.7424387172771	20/04/28 05:09:27
1	93	324.9710986825425	296.4754307966967	20/04/28 05:09:28
3	80	325.54973502904267	296.5446451310957	20/04/28 05:09:29
3	80	325.54973502904267	296.5446451310957	20/04/28 05:09:30
1	93	325.54973502904267	296.5446451310957	20/04/28 05:09:31
1	93	324.9710986825425	296.4754307966967	20/04/28 05:09:32
1	93	325.54973502904267	296.5446451310957	20/04/28 05:09:33
1	93	325.54973502904267	296.5446451310957	20/04/28 05:09:34
3	51	317.6267874915986	295.24617992491676	20/04/28 05:09:35
3	51	317.8908587031511	294.51318784549716	20/04/28 05:09:36
1	93	325.54973502904267	296.5446451310957	20/04/28 05:09:37
1	93	325.54973502904267	296.5446451310957	20/04/28 05:09:38
1	93	325.2351698940949	295.7424387172771	20/04/28 05:09:39
1	93	325.2351698940949	295.7424387172771	20/04/28 05:09:40
3	NULL	324.65241278750864	310.57808879675025	20/04/28 05:09:41
1	93	324.9710986825425	296.4754307966967	20/04/28 05:09:42
1	93	324.9710986825425	296.4754307966967	20/04/28 05:09:43
1	93	325.54973502904267	296.5446451310957	20/04/28 05:09:44
1	93	324.9710986825425	296.4754307966967	20/04/28 05:09:45
1	93	325.2351698940949	295.7424387172771	20/04/28 05:09:46
1	93	325.2351698940949	295.7424387172771	20/04/28 05:09:47
1	93	325.54973502904267	296.5446451310957	20/04/28 05:09:48
1	93	324.9710986825425	296.4754307966967	20/04/28 05:09:49
1	93	325.54973502904267	296.5446451310957	20/04/28 05:09:50
1	93	325.2351698940949	295.7424387172771	20/04/28 05:09:51
1	93	325.54973502904267	296.5446451310957	20/04/28 05:09:52
1	93	324.9710986825425	296.4754307966967	20/04/28 05:09:53
1	93	325.54973502904267	296.5446451310957	20/04/28 05:09:54
1	93	325.2351698940949	295.7424387172771	20/04/28 05:09:55
1	93	325.54973502904267	296.5446451310957	20/04/28 05:09:56
1	93	324.9710986825425	296.4754307966967	20/04/28 05:09:57
1	93	325.54973502904267	296.5446451310957	20/04/28 05:09:58
1	93	324.9710986825425	296.4754307966967	20/04/28 05:09:59
1	93	324.9710986825425	296.4754307966967	20/04/28 05:10:00
1	93	325.2351698940949	295.7424387172771	20/04/28 05:10:01
1	93	325.90367850905267	294.19246080372335	20/04/28 05:10:02
1	93	324.9710986825425	296.4754307966967	20/04/28 05:10:03
1	93	325.54973502904267	296.5446451310957	20/04/28 05:10:04
3	80	325.54973502904267	296.5446451310957	20/04/28 05:10:05
1	50	325.33662414622455	292.4082746224365	20/04/28 05:10:06
1	93	325.2351698940949	295.7424387172771	20/04/28 05:10:07
1	93	325.2351698940949	295.7424387172771	20/04/28 05:10:08
1	93	325.54973502904267	296.5446451310957	20/04/28 05:10:09
1	93	325.54973502904267	296.5446451310957	20/04/28 05:10:10
1	93	325.54973502904267	296.5446451310957	20/04/28 05:10:11
