stationId	t_start	t_end	t_max	timeStamp
81	20/04/28 05:08:49	20/04/28 05:08:49	20/04/28 05:08:49
147	20/04/28 05:08:51	20/04/28 05:08:51	20/04/28 05:08:51
39	20/04/28 05:08:53	20/04/28 05:08:53	20/04/28 05:08:53
6	20/04/28 05:08:55	20/04/28 05:08:55	20/04/28 05:08:55
19	20/04/28 05:08:57	20/04/28 05:08:58	20/04/28 05:08:58
5	20/04/28 05:09:00	20/04/28 05:09:00	20/04/28 05:09:00
142	20/04/28 05:09:02	20/04/28 05:09:02	20/04/28 05:09:02
118	20/04/28 05:09:04	20/04/28 05:09:04	20/04/28 05:09:04
117	20/04/28 05:09:06	20/04/28 05:09:06	20/04/28 05:09:06
117	20/04/28 05:09:08	20/04/28 05:09:08	20/04/28 05:09:08
142	20/04/28 05:09:10	20/04/28 05:09:10	20/04/28 05:09:10
147	20/04/28 05:09:12	20/04/28 05:09:12	20/04/28 05:09:12
101	20/04/28 05:09:14	20/04/28 05:09:14	20/04/28 05:09:14
147	20/04/28 05:09:16	20/04/28 05:09:17	20/04/28 05:09:17
142	20/04/28 05:09:19	20/04/28 05:09:19	20/04/28 05:09:19
87	20/04/28 05:09:21	20/04/28 05:09:21	20/04/28 05:09:21
74	20/04/28 05:09:23	20/04/28 05:09:23	20/04/28 05:09:23
87	20/04/28 05:09:25	20/04/28 05:09:25	20/04/28 05:09:25
113	20/04/28 05:09:27	20/04/28 05:09:27	20/04/28 05:09:27
6	20/04/28 05:09:29	20/04/28 05:09:30	20/04/28 05:09:30
21	20/04/28 05:09:32	20/04/28 05:09:32	20/04/28 05:09:32
101	20/04/28 05:09:34	20/04/28 05:09:35	20/04/28 05:09:35
32	20/04/28 05:09:37	20/04/28 05:09:37	20/04/28 05:09:37
19	20/04/28 05:09:39	20/04/28 05:09:39	20/04/28 05:09:39
142	20/04/28 05:09:41	20/04/28 05:09:41	20/04/28 05:09:41
87	20/04/28 05:09:43	20/04/28 05:09:44	20/04/28 05:09:44
87	20/04/28 05:09:46	20/04/28 05:09:46	20/04/28 05:09:46
101	20/04/28 05:09:48	20/04/28 05:09:48	20/04/28 05:09:48
5	20/04/28 05:09:50	20/04/28 05:09:50	20/04/28 05:09:50
100	20/04/28 05:09:52	20/04/28 05:09:52	20/04/28 05:09:52
101	20/04/28 05:09:54	20/04/28 05:09:54	20/04/28 05:09:54
21	20/04/28 05:09:56	20/04/28 05:09:56	20/04/28 05:09:56
101	20/04/28 05:09:58	20/04/28 05:09:58	20/04/28 05:09:58
117	20/04/28 05:10:00	20/04/28 05:10:00	20/04/28 05:10:00
105	20/04/28 05:10:02	20/04/28 05:10:02	20/04/28 05:10:02
87	20/04/28 05:10:04	20/04/28 05:10:04	20/04/28 05:10:04
41	20/04/28 05:10:06	20/04/28 05:10:06	20/04/28 05:10:06
23	20/04/28 05:10:08	20/04/28 05:10:08	20/04/28 05:10:08
17	20/04/28 05:10:10	20/04/28 05:10:11	20/04/28 05:10:10
24	20/04/28 05:10:13	20/04/28 05:10:13	20/04/28 05:10:13
76	20/04/28 05:10:15	20/04/28 05:10:15	20/04/28 05:10:15
157	20/04/28 05:10:17	20/04/28 05:10:17	20/04/28 05:10:17
133	20/04/28 05:10:19	20/04/28 05:10:19	20/04/28 05:10:19
25	20/04/28 05:10:21	20/04/28 05:10:21	20/04/28 05:10:21
90	20/04/28 05:10:23	20/04/28 05:10:23	20/04/28 05:10:23
23	20/04/28 05:10:25	20/04/28 05:10:25	20/04/28 05:10:25
44	20/04/28 05:10:27	20/04/28 05:10:27	20/04/28 05:10:27
151	20/04/28 05:10:29	20/04/28 05:10:29	20/04/28 05:10:29
152	20/04/28 05:10:31	20/04/28 05:10:31	20/04/28 05:10:31
156	20/04/28 05:10:33	20/04/28 05:10:33	20/04/28 05:10:33
114	20/04/28 05:10:35	20/04/28 05:10:35	20/04/28 05:10:35
63	20/04/28 05:10:37	20/04/28 05:10:37	20/04/28 05:10:37
61	20/04/28 05:10:39	20/04/28 05:10:39	20/04/28 05:10:39
155	20/04/28 05:10:41	20/04/28 05:10:42	20/04/28 05:10:42
64	20/04/28 05:10:44	20/04/28 05:10:44	20/04/28 05:10:44
155	20/04/28 05:10:46	20/04/28 05:10:46	20/04/28 05:10:46
111	20/04/28 05:10:48	20/04/28 05:10:48	20/04/28 05:10:48
132	20/04/28 05:10:50	20/04/28 05:10:50	20/04/28 05:10:50
134	20/04/28 05:10:52	20/04/28 05:10:52	20/04/28 05:10:52
134	20/04/28 05:10:54	20/04/28 05:10:54	20/04/28 05:10:54
134	20/04/28 05:10:56	20/04/28 05:10:56	20/04/28 05:10:56
39	20/04/28 05:10:58	20/04/28 05:10:58	20/04/28 05:10:58
78	20/04/28 05:11:00	20/04/28 05:11:00	20/04/28 05:11:00
54	20/04/28 05:11:02	20/04/28 05:11:04	20/04/28 05:11:04
56	20/04/28 05:11:06	20/04/28 05:11:06	20/04/28 05:11:06
69	20/04/28 05:11:08	20/04/28 05:11:08	20/04/28 05:11:08
53	20/04/28 05:11:10	20/04/28 05:11:10	20/04/28 05:11:10
157	20/04/28 05:11:12	20/04/28 05:11:12	20/04/28 05:11:12
69	20/04/28 05:11:14	20/04/28 05:11:15	20/04/28 05:11:15
69	20/04/28 05:11:17	20/04/28 05:11:17	20/04/28 05:11:17
111	20/04/28 05:11:19	20/04/28 05:11:19	20/04/28 05:11:19
134	20/04/28 05:11:21	20/04/28 05:11:21	20/04/28 05:11:21
155	20/04/28 05:11:23	20/04/28 05:11:24	20/04/28 05:11:24
61	20/04/28 05:11:26	20/04/28 05:11:26	20/04/28 05:11:26
135	20/04/28 05:11:28	20/04/28 05:11:28	20/04/28 05:11:28
18	20/04/28 05:11:30	20/04/28 05:11:31	20/04/28 05:11:31
45	20/04/28 05:11:33	20/04/28 05:11:33	20/04/28 05:11:33
133	20/04/28 05:17:47	20/04/28 05:11:36	20/04/28 05:11:36
89	20/04/28 05:11:38	20/04/28 05:11:38	20/04/28 05:11:38
89	20/04/28 05:11:40	20/04/28 05:11:40	20/04/28 05:11:40
24	20/04/28 05:11:42	20/04/28 05:11:42	20/04/28 05:11:42
96	20/04/28 05:11:44	20/04/28 05:11:44	20/04/28 05:11:44
26	20/04/28 05:11:46	20/04/28 05:11:46	20/04/28 05:11:46
94	20/04/28 05:11:48	20/04/28 05:11:48	20/04/28 05:11:48
10	20/04/28 05:11:50	20/04/28 05:11:50	20/04/28 05:11:50
6	20/04/28 05:11:53	20/04/28 05:11:53	20/04/28 05:11:53
24	20/04/28 05:11:55	20/04/28 05:11:55	20/04/28 05:11:55
19	20/04/28 05:11:57	20/04/28 05:11:57	20/04/28 05:11:57
6	20/04/28 05:11:59	20/04/28 05:11:59	20/04/28 05:11:59
23	20/04/28 05:12:01	20/04/28 05:12:01	20/04/28 05:12:01
74	20/04/28 05:15:13	20/04/28 05:12:03	20/04/28 05:15:13
66	20/04/28 05:12:05	20/04/28 05:12:05	20/04/28 05:12:05
117	20/04/28 05:12:07	20/04/28 05:12:07	20/04/28 05:12:07
118	20/04/28 05:12:09	20/04/28 05:12:09	20/04/28 05:12:09
142	20/04/28 05:12:11	20/04/28 05:12:11	20/04/28 05:12:11
25	20/04/28 05:12:13	20/04/28 05:12:14	20/04/28 05:12:14
67	20/04/28 05:12:16	20/04/28 05:12:16	20/04/28 05:12:16
26	20/04/28 05:12:18	20/04/28 05:12:18	20/04/28 05:12:18
103	20/04/28 05:12:20	20/04/28 05:12:20	20/04/28 05:12:20
95	20/04/28 05:12:22	20/04/28 05:12:22	20/04/28 05:12:22
87	20/04/28 05:12:24	20/04/28 05:12:24	20/04/28 05:12:24
91	20/04/28 05:12:26	20/04/28 05:12:26	20/04/28 05:12:26
