deviceId	device_location_x	device_location_y	rssi_measurement	timeStamp
8	335.18908653775424	273.64277610272416	-66	21/02/21 12:33:05
23	330.6764275924185	279.5887246759348	-64	21/02/21 12:33:05
25	323.1833154830733	277.6040507255065	-59	21/02/21 12:33:05
10	323.0502130932265	281.62588160894785	-65	21/02/21 12:33:05
6	337.04454004665996	273.25643905156295	-67	21/02/21 12:33:05
7	327.7449897754536	270.4181144613178	-57	21/02/21 12:33:05
14	339.94288768566685	270.20726744103035	-69	21/02/21 12:33:05
20	331.61914505200315	268.4880246133412	-62	21/02/21 12:33:05
30	328.07937707734857	267.3032546469616	-57	21/02/21 12:33:05
21	333.7333032313522	265.34260958227395	-65	21/02/21 12:33:05
29	322.1123294790049	269.2232534149863	-27	21/02/21 12:33:05
24	321.10158544309553	278.01477212573917	-62	21/02/21 12:33:05
28	319.26031784491215	284.64721387467006	-68	21/02/21 12:33:05
11	316.7021736546535	282.6227620614726	-67	21/02/21 12:33:05
38	314.8977849114711	286.85646554275206	-68	21/02/21 12:33:05
39	310.81308531710044	284.506294925849	-70	21/02/21 12:33:05
41	309.82870033354214	266.4102080744689	-64	21/02/21 12:33:05
43	309.3127830305578	276.2289980291384	-66	21/02/21 12:33:05
42	308.5311189694193	268.2749847222526	-63	21/02/21 12:33:05

45	341.6241027740285	277.6995631173448	-71	21/02/21 12:33:06
8	335.18908653775424	273.64277610272416	-65	21/02/21 12:33:06
23	330.6764275924185	279.5887246759348	-65	21/02/21 12:33:06
25	323.1833154830733	277.6040507255065	-61	21/02/21 12:33:06
10	323.0502130932265	281.62588160894785	-64	21/02/21 12:33:06
17	322.8754502998156	289.2268238104236	-69	21/02/21 12:33:06
6	337.04454004665996	273.25643905156295	-66	21/02/21 12:33:06
7	327.7449897754536	270.4181144613178	-49	21/02/21 12:33:06
14	339.94288768566685	270.20726744103035	-66	21/02/21 12:33:06
20	331.61914505200315	268.4880246133412	-60	21/02/21 12:33:06
13	343.2999250966318	267.57435812307386	-70	21/02/21 12:33:06
30	328.07937707734857	267.3032546469616	-54	21/02/21 12:33:06
21	333.7333032313522	265.34260958227395	-61	21/02/21 12:33:06
29	322.1123294790049	269.2232534149863	-37	21/02/21 12:33:06
24	321.10158544309553	278.01477212573917	-61	21/02/21 12:33:06
28	319.26031784491215	284.64721387467006	-68	21/02/21 12:33:06
11	316.7021736546535	282.6227620614726	-65	21/02/21 12:33:06
38	314.8977849114711	286.85646554275206	-72	21/02/21 12:33:06
39	310.81308531710044	284.506294925849	-69	21/02/21 12:33:06
41	309.82870033354214	266.4102080744689	-64	21/02/21 12:33:06
43	309.3127830305578	276.2289980291384	-66	21/02/21 12:33:06
42	308.5311189694193	268.2749847222526	-66	21/02/21 12:33:06

45	341.6241027740285	277.6995631173448	-69	21/02/21 12:33:07
8	335.18908653775424	273.64277610272416	-64	21/02/21 12:33:07
23	330.6764275924185	279.5887246759348	-63	21/02/21 12:33:07
25	323.1833154830733	277.6040507255065	-60	21/02/21 12:33:07
10	323.0502130932265	281.62588160894785	-65	21/02/21 12:33:07
17	322.8754502998156	289.2268238104236	-72	21/02/21 12:33:07
6	337.04454004665996	273.25643905156295	-65	21/02/21 12:33:07
7	327.7449897754536	270.4181144613178	-40	21/02/21 12:33:07
14	339.94288768566685	270.20726744103035	-66	21/02/21 12:33:07
20	331.61914505200315	268.4880246133412	-56	21/02/21 12:33:07
13	343.2999250966318	267.57435812307386	-70	21/02/21 12:33:07
30	328.07937707734857	267.3032546469616	-47	21/02/21 12:33:07
21	333.7333032313522	265.34260958227395	-60	21/02/21 12:33:07
29	322.1123294790049	269.2232534149863	-47	21/02/21 12:33:07
24	321.10158544309553	278.01477212573917	-61	21/02/21 12:33:07
28	319.26031784491215	284.64721387467006	-69	21/02/21 12:33:07
11	316.7021736546535	282.6227620614726	-67	21/02/21 12:33:07
41	309.82870033354214	266.4102080744689	-67	21/02/21 12:33:07
43	309.3127830305578	276.2289980291384	-69	21/02/21 12:33:07
42	308.5311189694193	268.2749847222526	-68	21/02/21 12:33:07

45	341.6241027740285	277.6995631173448	-68	21/02/21 12:33:08
8	335.18908653775424	273.64277610272416	-60	21/02/21 12:33:08
23	330.6764275924185	279.5887246759348	-63	21/02/21 12:33:08
25	323.1833154830733	277.6040507255065	-57	21/02/21 12:33:08
10	323.0502130932265	281.62588160894785	-64	21/02/21 12:33:08
17	322.8754502998156	289.2268238104236	-71	21/02/21 12:33:08
6	337.04454004665996	273.25643905156295	-63	21/02/21 12:33:08
7	327.7449897754536	270.4181144613178	-6	21/02/21 12:33:08
14	339.94288768566685	270.20726744103035	-64	21/02/21 12:33:08
20	331.61914505200315	268.4880246133412	-53	21/02/21 12:33:08
13	343.2999250966318	267.57435812307386	-68	21/02/21 12:33:08
30	328.07937707734857	267.3032546469616	-48	21/02/21 12:33:08
21	333.7333032313522	265.34260958227395	-58	21/02/21 12:33:08
31	345.2775751581305	263.5870918256099	-71	21/02/21 12:33:08
29	322.1123294790049	269.2232534149863	-55	21/02/21 12:33:08
24	321.10158544309553	278.01477212573917	-62	21/02/21 12:33:08
28	319.26031784491215	284.64721387467006	-67	21/02/21 12:33:08
11	316.7021736546535	282.6227620614726	-67	21/02/21 12:33:08
41	309.82870033354214	266.4102080744689	-71	21/02/21 12:33:08
43	309.3127830305578	276.2289980291384	-70	21/02/21 12:33:08
42	308.5311189694193	268.2749847222526	-69	21/02/21 12:33:08

22	348.76402647654106	277.5698827491972	-72	21/02/21 12:33:09
45	341.6241027740285	277.6995631173448	-65	21/02/21 12:33:09
8	335.18908653775424	273.64277610272416	-53	21/02/21 12:33:09
23	330.6764275924185	279.5887246759348	-60	21/02/21 12:33:09
25	323.1833154830733	277.6040507255065	-59	21/02/21 12:33:09
10	323.0502130932265	281.62588160894785	-66	21/02/21 12:33:09
17	322.8754502998156	289.2268238104236	-72	21/02/21 12:33:09
6	337.04454004665996	273.25643905156295	-59	21/02/21 12:33:09
7	327.7449897754536	270.4181144613178	-42	21/02/21 12:33:09
14	339.94288768566685	270.20726744103035	-62	21/02/21 12:33:09
20	331.61914505200315	268.4880246133412	-46	21/02/21 12:33:09
13	343.2999250966318	267.57435812307386	-66	21/02/21 12:33:09
30	328.07937707734857	267.3032546469616	-50	21/02/21 12:33:09
21	333.7333032313522	265.34260958227395	-54	21/02/21 12:33:09
31	345.2775751581305	263.5870918256099	-68	21/02/21 12:33:09
29	322.1123294790049	269.2232534149863	-59	21/02/21 12:33:09
24	321.10158544309553	278.01477212573917	-64	21/02/21 12:33:09
28	319.26031784491215	284.64721387467006	-68	21/02/21 12:33:09
11	316.7021736546535	282.6227620614726	-67	21/02/21 12:33:09

22	348.76402647654106	277.5698827491972	-67	21/02/21 12:33:10
45	341.6241027740285	277.6995631173448	-65	21/02/21 12:33:10
8	335.18908653775424	273.64277610272416	-49	21/02/21 12:33:10
23	330.6764275924185	279.5887246759348	-59	21/02/21 12:33:10
25	323.1833154830733	277.6040507255065	-63	21/02/21 12:33:10
10	323.0502130932265	281.62588160894785	-66	21/02/21 12:33:10
6	337.04454004665996	273.25643905156295	-55	21/02/21 12:33:10
7	327.7449897754536	270.4181144613178	-48	21/02/21 12:33:10
14	339.94288768566685	270.20726744103035	-58	21/02/21 12:33:10
20	331.61914505200315	268.4880246133412	-47	21/02/21 12:33:10
13	343.2999250966318	267.57435812307386	-65	21/02/21 12:33:10
30	328.07937707734857	267.3032546469616	-53	21/02/21 12:33:10
21	333.7333032313522	265.34260958227395	-55	21/02/21 12:33:10
31	345.2775751581305	263.5870918256099	-67	21/02/21 12:33:10
29	322.1123294790049	269.2232534149863	-61	21/02/21 12:33:10
24	321.10158544309553	278.01477212573917	-65	21/02/21 12:33:10
28	319.26031784491215	284.64721387467006	-67	21/02/21 12:33:10
11	316.7021736546535	282.6227620614726	-69	21/02/21 12:33:10

22	348.76402647654106	277.5698827491972	-67	21/02/21 12:33:11
45	341.6241027740285	277.6995631173448	-60	21/02/21 12:33:11
8	335.18908653775424	273.64277610272416	-44	21/02/21 12:33:11
23	330.6764275924185	279.5887246759348	-60	21/02/21 12:33:11
25	323.1833154830733	277.6040507255065	-65	21/02/21 12:33:11
10	323.0502130932265	281.62588160894785	-67	21/02/21 12:33:11
6	337.04454004665996	273.25643905156295	-49	21/02/21 12:33:11
7	327.7449897754536	270.4181144613178	-56	21/02/21 12:33:11
14	339.94288768566685	270.20726744103035	-57	21/02/21 12:33:11
20	331.61914505200315	268.4880246133412	-47	21/02/21 12:33:11
13	343.2999250966318	267.57435812307386	-61	21/02/21 12:33:11
30	328.07937707734857	267.3032546469616	-57	21/02/21 12:33:11
21	333.7333032313522	265.34260958227395	-55	21/02/21 12:33:11
31	345.2775751581305	263.5870918256099	-65	21/02/21 12:33:11
29	322.1123294790049	269.2232534149863	-62	21/02/21 12:33:11
24	321.10158544309553	278.01477212573917	-64	21/02/21 12:33:11
28	319.26031784491215	284.64721387467006	-69	21/02/21 12:33:11

22	348.76402647654106	277.5698827491972	-66	21/02/21 12:33:12
45	341.6241027740285	277.6995631173448	-60	21/02/21 12:33:12
8	335.18908653775424	273.64277610272416	-37	21/02/21 12:33:12
23	330.6764275924185	279.5887246759348	-60	21/02/21 12:33:12
25	323.1833154830733	277.6040507255065	-65	21/02/21 12:33:12
10	323.0502130932265	281.62588160894785	-66	21/02/21 12:33:12
32	354.79200455915435	273.497535538315	-69	21/02/21 12:33:12
6	337.04454004665996	273.25643905156295	-38	21/02/21 12:33:12
7	327.7449897754536	270.4181144613178	-57	21/02/21 12:33:12
14	339.94288768566685	270.20726744103035	-53	21/02/21 12:33:12
20	331.61914505200315	268.4880246133412	-55	21/02/21 12:33:12
13	343.2999250966318	267.57435812307386	-59	21/02/21 12:33:12
30	328.07937707734857	267.3032546469616	-59	21/02/21 12:33:12
21	333.7333032313522	265.34260958227395	-59	21/02/21 12:33:12
31	345.2775751581305	263.5870918256099	-64	21/02/21 12:33:12
29	322.1123294790049	269.2232534149863	-64	21/02/21 12:33:12
24	321.10158544309553	278.01477212573917	-65	21/02/21 12:33:12

22	348.76402647654106	277.5698827491972	-65	21/02/21 12:33:13
45	341.6241027740285	277.6995631173448	-56	21/02/21 12:33:13
8	335.18908653775424	273.64277610272416	-46	21/02/21 12:33:13
23	330.6764275924185	279.5887246759348	-62	21/02/21 12:33:13
25	323.1833154830733	277.6040507255065	-68	21/02/21 12:33:13
10	323.0502130932265	281.62588160894785	-70	21/02/21 12:33:13
32	354.79200455915435	273.497535538315	-67	21/02/21 12:33:13
6	337.04454004665996	273.25643905156295	-32	21/02/21 12:33:13
7	327.7449897754536	270.4181144613178	-61	21/02/21 12:33:13
14	339.94288768566685	270.20726744103035	-48	21/02/21 12:33:13
20	331.61914505200315	268.4880246133412	-57	21/02/21 12:33:13
13	343.2999250966318	267.57435812307386	-57	21/02/21 12:33:13
30	328.07937707734857	267.3032546469616	-62	21/02/21 12:33:13
21	333.7333032313522	265.34260958227395	-58	21/02/21 12:33:13
31	345.2775751581305	263.5870918256099	-63	21/02/21 12:33:13
29	322.1123294790049	269.2232534149863	-66	21/02/21 12:33:13
24	321.10158544309553	278.01477212573917	-69	21/02/21 12:33:13

22	348.76402647654106	277.5698827491972	-60	21/02/21 12:33:14
45	341.6241027740285	277.6995631173448	-50	21/02/21 12:33:14
44	338.5438306190012	292.7158779942662	-69	21/02/21 12:33:14
8	335.18908653775424	273.64277610272416	-52	21/02/21 12:33:14
23	330.6764275924185	279.5887246759348	-64	21/02/21 12:33:14
25	323.1833154830733	277.6040507255065	-69	21/02/21 12:33:14
10	323.0502130932265	281.62588160894785	-69	21/02/21 12:33:14
32	354.79200455915435	273.497535538315	-68	21/02/21 12:33:14
6	337.04454004665996	273.25643905156295	-44	21/02/21 12:33:14
7	327.7449897754536	270.4181144613178	-66	21/02/21 12:33:14
14	339.94288768566685	270.20726744103035	-46	21/02/21 12:33:14
20	331.61914505200315	268.4880246133412	-60	21/02/21 12:33:14
13	343.2999250966318	267.57435812307386	-55	21/02/21 12:33:14
30	328.07937707734857	267.3032546469616	-64	21/02/21 12:33:14
21	333.7333032313522	265.34260958227395	-63	21/02/21 12:33:14
33	357.2942125772355	265.089238430286	-70	21/02/21 12:33:14
31	345.2775751581305	263.5870918256099	-63	21/02/21 12:33:14
29	322.1123294790049	269.2232534149863	-68	21/02/21 12:33:14
24	321.10158544309553	278.01477212573917	-71	21/02/21 12:33:14

37	356.97295615755235	285.13562634015204	-71	21/02/21 12:33:15
22	348.76402647654106	277.5698827491972	-57	21/02/21 12:33:15
45	341.6241027740285	277.6995631173448	-50	21/02/21 12:33:15
44	338.5438306190012	292.7158779942662	-69	21/02/21 12:33:15
8	335.18908653775424	273.64277610272416	-56	21/02/21 12:33:15
23	330.6764275924185	279.5887246759348	-65	21/02/21 12:33:15
25	323.1833154830733	277.6040507255065	-70	21/02/21 12:33:15
32	354.79200455915435	273.497535538315	-64	21/02/21 12:33:15
6	337.04454004665996	273.25643905156295	-51	21/02/21 12:33:15
7	327.7449897754536	270.4181144613178	-66	21/02/21 12:33:15
14	339.94288768566685	270.20726744103035	-50	21/02/21 12:33:15
20	331.61914505200315	268.4880246133412	-62	21/02/21 12:33:15
13	343.2999250966318	267.57435812307386	-54	21/02/21 12:33:15
30	328.07937707734857	267.3032546469616	-67	21/02/21 12:33:15
21	333.7333032313522	265.34260958227395	-64	21/02/21 12:33:15
33	357.2942125772355	265.089238430286	-69	21/02/21 12:33:15
31	345.2775751581305	263.5870918256099	-60	21/02/21 12:33:15

37	356.97295615755235	285.13562634015204	-69	21/02/21 12:33:16
22	348.76402647654106	277.5698827491972	-53	21/02/21 12:33:16
40	362.36880033132195	276.13356616109996	-70	21/02/21 12:33:16
45	341.6241027740285	277.6995631173448	-48	21/02/21 12:33:16
46	339.72568759684384	293.6330487844042	-71	21/02/21 12:33:16
44	338.5438306190012	292.7158779942662	-71	21/02/21 12:33:16
8	335.18908653775424	273.64277610272416	-61	21/02/21 12:33:16
23	330.6764275924185	279.5887246759348	-68	21/02/21 12:33:16
32	354.79200455915435	273.497535538315	-64	21/02/21 12:33:16
6	337.04454004665996	273.25643905156295	-55	21/02/21 12:33:16
7	327.7449897754536	270.4181144613178	-70	21/02/21 12:33:16
14	339.94288768566685	270.20726744103035	-54	21/02/21 12:33:16
20	331.61914505200315	268.4880246133412	-65	21/02/21 12:33:16
13	343.2999250966318	267.57435812307386	-58	21/02/21 12:33:16
30	328.07937707734857	267.3032546469616	-70	21/02/21 12:33:16
21	333.7333032313522	265.34260958227395	-66	21/02/21 12:33:16
33	357.2942125772355	265.089238430286	-69	21/02/21 12:33:16
31	345.2775751581305	263.5870918256099	-61	21/02/21 12:33:16

37	356.97295615755235	285.13562634015204	-68	21/02/21 12:33:17
27	362.9671468703788	283.86221808734723	-71	21/02/21 12:33:17
22	348.76402647654106	277.5698827491972	-49	21/02/21 12:33:17
40	362.36880033132195	276.13356616109996	-67	21/02/21 12:33:17
45	341.6241027740285	277.6995631173448	-53	21/02/21 12:33:17
46	339.72568759684384	293.6330487844042	-72	21/02/21 12:33:17
44	338.5438306190012	292.7158779942662	-72	21/02/21 12:33:17
8	335.18908653775424	273.64277610272416	-61	21/02/21 12:33:17
23	330.6764275924185	279.5887246759348	-66	21/02/21 12:33:17
32	354.79200455915435	273.497535538315	-61	21/02/21 12:33:17
6	337.04454004665996	273.25643905156295	-62	21/02/21 12:33:17
7	327.7449897754536	270.4181144613178	-68	21/02/21 12:33:17
14	339.94288768566685	270.20726744103035	-57	21/02/21 12:33:17
20	331.61914505200315	268.4880246133412	-67	21/02/21 12:33:17
13	343.2999250966318	267.57435812307386	-60	21/02/21 12:33:17
30	328.07937707734857	267.3032546469616	-69	21/02/21 12:33:17
21	333.7333032313522	265.34260958227395	-67	21/02/21 12:33:17
33	357.2942125772355	265.089238430286	-69	21/02/21 12:33:17
31	345.2775751581305	263.5870918256099	-66	21/02/21 12:33:17

37	356.97295615755235	285.13562634015204	-65	21/02/21 12:33:18
27	362.9671468703788	283.86221808734723	-69	21/02/21 12:33:18
22	348.76402647654106	277.5698827491972	-38	21/02/21 12:33:18
40	362.36880033132195	276.13356616109996	-67	21/02/21 12:33:18
45	341.6241027740285	277.6995631173448	-56	21/02/21 12:33:18
46	339.72568759684384	293.6330487844042	-68	21/02/21 12:33:18
44	338.5438306190012	292.7158779942662	-69	21/02/21 12:33:18
8	335.18908653775424	273.64277610272416	-66	21/02/21 12:33:18
23	330.6764275924185	279.5887246759348	-70	21/02/21 12:33:18
32	354.79200455915435	273.497535538315	-58	21/02/21 12:33:18
6	337.04454004665996	273.25643905156295	-64	21/02/21 12:33:18
14	339.94288768566685	270.20726744103035	-60	21/02/21 12:33:18
20	331.61914505200315	268.4880246133412	-69	21/02/21 12:33:18
13	343.2999250966318	267.57435812307386	-61	21/02/21 12:33:18
21	333.7333032313522	265.34260958227395	-69	21/02/21 12:33:18
33	357.2942125772355	265.089238430286	-65	21/02/21 12:33:18
31	345.2775751581305	263.5870918256099	-66	21/02/21 12:33:18

37	356.97295615755235	285.13562634015204	-61	21/02/21 12:33:19
27	362.9671468703788	283.86221808734723	-68	21/02/21 12:33:19
22	348.76402647654106	277.5698827491972	-29	21/02/21 12:33:19
40	362.36880033132195	276.13356616109996	-67	21/02/21 12:33:19
12	369.23036108484195	275.6064335555381	-72	21/02/21 12:33:19
45	341.6241027740285	277.6995631173448	-57	21/02/21 12:33:19
46	339.72568759684384	293.6330487844042	-68	21/02/21 12:33:19
44	338.5438306190012	292.7158779942662	-71	21/02/21 12:33:19
8	335.18908653775424	273.64277610272416	-66	21/02/21 12:33:19
23	330.6764275924185	279.5887246759348	-68	21/02/21 12:33:19
32	354.79200455915435	273.497535538315	-56	21/02/21 12:33:19
6	337.04454004665996	273.25643905156295	-64	21/02/21 12:33:19
14	339.94288768566685	270.20726744103035	-65	21/02/21 12:33:19
13	343.2999250966318	267.57435812307386	-62	21/02/21 12:33:19
33	357.2942125772355	265.089238430286	-68	21/02/21 12:33:19
31	345.2775751581305	263.5870918256099	-66	21/02/21 12:33:19

26	365.88911476698456	290.06273815971616	-69	21/02/21 12:33:20
37	356.97295615755235	285.13562634015204	-61	21/02/21 12:33:20
27	362.9671468703788	283.86221808734723	-63	21/02/21 12:33:20
22	348.76402647654106	277.5698827491972	-46	21/02/21 12:33:20
40	362.36880033132195	276.13356616109996	-62	21/02/21 12:33:20
12	369.23036108484195	275.6064335555381	-71	21/02/21 12:33:20
45	341.6241027740285	277.6995631173448	-60	21/02/21 12:33:20
46	339.72568759684384	293.6330487844042	-69	21/02/21 12:33:20
44	338.5438306190012	292.7158779942662	-71	21/02/21 12:33:20
8	335.18908653775424	273.64277610272416	-67	21/02/21 12:33:20
32	354.79200455915435	273.497535538315	-54	21/02/21 12:33:20
6	337.04454004665996	273.25643905156295	-65	21/02/21 12:33:20
14	339.94288768566685	270.20726744103035	-68	21/02/21 12:33:20
13	343.2999250966318	267.57435812307386	-64	21/02/21 12:33:20
33	357.2942125772355	265.089238430286	-66	21/02/21 12:33:20
31	345.2775751581305	263.5870918256099	-67	21/02/21 12:33:20

26	365.88911476698456	290.06273815971616	-70	21/02/21 12:33:21
9	370.34591673039785	290.055159067517	-72	21/02/21 12:33:21
37	356.97295615755235	285.13562634015204	-57	21/02/21 12:33:21
27	362.9671468703788	283.86221808734723	-61	21/02/21 12:33:21
22	348.76402647654106	277.5698827491972	-54	21/02/21 12:33:21
40	362.36880033132195	276.13356616109996	-63	21/02/21 12:33:21
12	369.23036108484195	275.6064335555381	-68	21/02/21 12:33:21
45	341.6241027740285	277.6995631173448	-63	21/02/21 12:33:21
46	339.72568759684384	293.6330487844042	-72	21/02/21 12:33:21
44	338.5438306190012	292.7158779942662	-69	21/02/21 12:33:21
8	335.18908653775424	273.64277610272416	-71	21/02/21 12:33:21
32	354.79200455915435	273.497535538315	-55	21/02/21 12:33:21
6	337.04454004665996	273.25643905156295	-69	21/02/21 12:33:21
14	339.94288768566685	270.20726744103035	-66	21/02/21 12:33:21
13	343.2999250966318	267.57435812307386	-69	21/02/21 12:33:21
33	357.2942125772355	265.089238430286	-67	21/02/21 12:33:21
31	345.2775751581305	263.5870918256099	-69	21/02/21 12:33:21

26	365.88911476698456	290.06273815971616	-66	21/02/21 12:33:22
9	370.34591673039785	290.055159067517	-67	21/02/21 12:33:22
37	356.97295615755235	285.13562634015204	-51	21/02/21 12:33:22
27	362.9671468703788	283.86221808734723	-58	21/02/21 12:33:22
22	348.76402647654106	277.5698827491972	-57	21/02/21 12:33:22
40	362.36880033132195	276.13356616109996	-61	21/02/21 12:33:22
12	369.23036108484195	275.6064335555381	-66	21/02/21 12:33:22
45	341.6241027740285	277.6995631173448	-67	21/02/21 12:33:22
32	354.79200455915435	273.497535538315	-57	21/02/21 12:33:22
6	337.04454004665996	273.25643905156295	-70	21/02/21 12:33:22
14	339.94288768566685	270.20726744103035	-70	21/02/21 12:33:22
13	343.2999250966318	267.57435812307386	-69	21/02/21 12:33:22
33	357.2942125772355	265.089238430286	-68	21/02/21 12:33:22
31	345.2775751581305	263.5870918256099	-69	21/02/21 12:33:22

26	365.88911476698456	290.06273815971616	-63	21/02/21 12:33:23
9	370.34591673039785	290.055159067517	-69	21/02/21 12:33:23
35	375.9117979149197	286.2314635184194	-70	21/02/21 12:33:23
37	356.97295615755235	285.13562634015204	-50	21/02/21 12:33:23
27	362.9671468703788	283.86221808734723	-57	21/02/21 12:33:23
22	348.76402647654106	277.5698827491972	-61	21/02/21 12:33:23
40	362.36880033132195	276.13356616109996	-59	21/02/21 12:33:23
12	369.23036108484195	275.6064335555381	-66	21/02/21 12:33:23
45	341.6241027740285	277.6995631173448	-65	21/02/21 12:33:23
32	354.79200455915435	273.497535538315	-59	21/02/21 12:33:23
13	343.2999250966318	267.57435812307386	-70	21/02/21 12:33:23
33	357.2942125772355	265.089238430286	-66	21/02/21 12:33:23

26	365.88911476698456	290.06273815971616	-62	21/02/21 12:33:24
9	370.34591673039785	290.055159067517	-67	21/02/21 12:33:24
35	375.9117979149197	286.2314635184194	-67	21/02/21 12:33:24
37	356.97295615755235	285.13562634015204	-48	21/02/21 12:33:24
27	362.9671468703788	283.86221808734723	-49	21/02/21 12:33:24
22	348.76402647654106	277.5698827491972	-62	21/02/21 12:33:24
40	362.36880033132195	276.13356616109996	-55	21/02/21 12:33:24
19	376.5655697556478	276.0418870017079	-69	21/02/21 12:33:24
12	369.23036108484195	275.6064335555381	-62	21/02/21 12:33:24
45	341.6241027740285	277.6995631173448	-70	21/02/21 12:33:24
32	354.79200455915435	273.497535538315	-62	21/02/21 12:33:24
33	357.2942125772355	265.089238430286	-70	21/02/21 12:33:24

26	365.88911476698456	290.06273815971616	-60	21/02/21 12:33:25
9	370.34591673039785	290.055159067517	-64	21/02/21 12:33:25
34	378.8515913430413	287.52236983309126	-69	21/02/21 12:33:25
35	375.9117979149197	286.2314635184194	-68	21/02/21 12:33:25
37	356.97295615755235	285.13562634015204	-51	21/02/21 12:33:25
36	380.12482687495054	283.93141746664196	-68	21/02/21 12:33:25
27	362.9671468703788	283.86221808734723	-46	21/02/21 12:33:25
22	348.76402647654106	277.5698827491972	-63	21/02/21 12:33:25
40	362.36880033132195	276.13356616109996	-54	21/02/21 12:33:25
19	376.5655697556478	276.0418870017079	-67	21/02/21 12:33:25
12	369.23036108484195	275.6064335555381	-61	21/02/21 12:33:25
45	341.6241027740285	277.6995631173448	-70	21/02/21 12:33:25
32	354.79200455915435	273.497535538315	-62	21/02/21 12:33:25
33	357.2942125772355	265.089238430286	-69	21/02/21 12:33:25

26	365.88911476698456	290.06273815971616	-60	21/02/21 12:33:26
9	370.34591673039785	290.055159067517	-62	21/02/21 12:33:26
34	378.8515913430413	287.52236983309126	-68	21/02/21 12:33:26
35	375.9117979149197	286.2314635184194	-65	21/02/21 12:33:26
37	356.97295615755235	285.13562634015204	-54	21/02/21 12:33:26
36	380.12482687495054	283.93141746664196	-67	21/02/21 12:33:26
27	362.9671468703788	283.86221808734723	-33	21/02/21 12:33:26
22	348.76402647654106	277.5698827491972	-66	21/02/21 12:33:26
40	362.36880033132195	276.13356616109996	-55	21/02/21 12:33:26
19	376.5655697556478	276.0418870017079	-66	21/02/21 12:33:26
12	369.23036108484195	275.6064335555381	-61	21/02/21 12:33:26
32	354.79200455915435	273.497535538315	-64	21/02/21 12:33:26
33	357.2942125772355	265.089238430286	-72	21/02/21 12:33:26

26	365.88911476698456	290.06273815971616	-56	21/02/21 12:33:27
9	370.34591673039785	290.055159067517	-60	21/02/21 12:33:27
34	378.8515913430413	287.52236983309126	-64	21/02/21 12:33:27
35	375.9117979149197	286.2314635184194	-64	21/02/21 12:33:27
37	356.97295615755235	285.13562634015204	-60	21/02/21 12:33:27
36	380.12482687495054	283.93141746664196	-68	21/02/21 12:33:27
27	362.9671468703788	283.86221808734723	-42	21/02/21 12:33:27
22	348.76402647654106	277.5698827491972	-67	21/02/21 12:33:27
40	362.36880033132195	276.13356616109996	-59	21/02/21 12:33:27
19	376.5655697556478	276.0418870017079	-64	21/02/21 12:33:27
12	369.23036108484195	275.6064335555381	-60	21/02/21 12:33:27
32	354.79200455915435	273.497535538315	-67	21/02/21 12:33:27
33	357.2942125772355	265.089238430286	-69	21/02/21 12:33:27

26	365.88911476698456	290.06273815971616	-52	21/02/21 12:33:28
9	370.34591673039785	290.055159067517	-58	21/02/21 12:33:28
34	378.8515913430413	287.52236983309126	-66	21/02/21 12:33:28
35	375.9117979149197	286.2314635184194	-61	21/02/21 12:33:28
37	356.97295615755235	285.13562634015204	-60	21/02/21 12:33:28
36	380.12482687495054	283.93141746664196	-65	21/02/21 12:33:28
27	362.9671468703788	283.86221808734723	-47	21/02/21 12:33:28
22	348.76402647654106	277.5698827491972	-71	21/02/21 12:33:28
40	362.36880033132195	276.13356616109996	-61	21/02/21 12:33:28
19	376.5655697556478	276.0418870017079	-65	21/02/21 12:33:28
12	369.23036108484195	275.6064335555381	-63	21/02/21 12:33:28
32	354.79200455915435	273.497535538315	-68	21/02/21 12:33:28

26	365.88911476698456	290.06273815971616	-47	21/02/21 12:33:29
9	370.34591673039785	290.055159067517	-51	21/02/21 12:33:29
34	378.8515913430413	287.52236983309126	-63	21/02/21 12:33:29
35	375.9117979149197	286.2314635184194	-60	21/02/21 12:33:29
37	356.97295615755235	285.13562634015204	-59	21/02/21 12:33:29
36	380.12482687495054	283.93141746664196	-65	21/02/21 12:33:29
27	362.9671468703788	283.86221808734723	-54	21/02/21 12:33:29
40	362.36880033132195	276.13356616109996	-65	21/02/21 12:33:29
19	376.5655697556478	276.0418870017079	-66	21/02/21 12:33:29
12	369.23036108484195	275.6064335555381	-63	21/02/21 12:33:29
32	354.79200455915435	273.497535538315	-70	21/02/21 12:33:29

