stationId	t_start	t_end	t_max	timeStamp
71	20/04/28 05:13:39	20/04/28 05:11:17	20/04/28 05:11:17
151	20/04/28 05:11:19	20/04/28 05:11:19	20/04/28 05:11:19
6	20/04/28 05:11:21	20/04/28 05:11:21	20/04/28 05:11:21
150	20/04/28 05:11:23	20/04/28 05:11:23	20/04/28 05:11:23
12	20/04/28 05:11:25	20/04/28 05:11:25	20/04/28 05:11:25
29	20/04/28 05:11:27	20/04/28 05:11:27	20/04/28 05:11:27
89	20/04/28 05:11:29	20/04/28 05:11:29	20/04/28 05:11:29
108	20/04/28 05:11:31	20/04/28 05:11:31	20/04/28 05:11:31
35	20/04/28 05:11:33	20/04/28 05:11:34	20/04/28 05:11:34
71	20/04/28 05:11:36	20/04/28 05:11:36	20/04/28 05:11:36
28	20/04/28 05:11:38	20/04/28 05:11:38	20/04/28 05:11:38
28	20/04/28 05:11:40	20/04/28 05:11:41	20/04/28 05:11:41
18	20/04/28 05:11:43	20/04/28 05:11:44	20/04/28 05:11:44
98	20/04/28 05:11:46	20/04/28 05:11:46	20/04/28 05:11:46
18	20/04/28 05:11:48	20/04/28 05:11:48	20/04/28 05:11:48
18	20/04/28 05:11:50	20/04/28 05:11:51	20/04/28 05:11:51
18	20/04/28 05:11:53	20/04/28 05:11:53	20/04/28 05:11:53
75	20/04/28 05:11:55	20/04/28 05:11:55	20/04/28 05:11:55
35	20/04/28 05:11:57	20/04/28 05:11:57	20/04/28 05:11:57
35	20/04/28 05:11:59	20/04/28 05:11:59	20/04/28 05:11:59
35	20/04/28 05:12:01	20/04/28 05:12:02	20/04/28 05:12:02
39	20/04/28 05:12:04	20/04/28 05:12:04	20/04/28 05:12:04
64	20/04/28 05:12:06	20/04/28 05:12:06	20/04/28 05:12:06
64	20/04/28 05:12:08	20/04/28 05:12:08	20/04/28 05:12:08
64	20/04/28 05:12:10	20/04/28 05:12:10	20/04/28 05:12:10
35	20/04/28 05:12:12	20/04/28 05:12:14	20/04/28 05:12:14
109	20/04/28 05:12:16	20/04/28 05:12:16	20/04/28 05:12:16
39	20/04/28 05:12:18	20/04/28 05:12:18	20/04/28 05:12:18
35	20/04/28 05:12:20	20/04/28 05:12:22	20/04/28 05:12:20
35	20/04/28 05:12:24	20/04/28 05:12:24	20/04/28 05:12:24
88	20/04/28 05:12:26	20/04/28 05:12:26	20/04/28 05:12:26
45	20/04/28 05:12:28	20/04/28 05:12:28	20/04/28 05:12:28
64	20/04/28 05:12:30	20/04/28 05:12:30	20/04/28 05:12:30
14	20/04/28 05:12:32	20/04/28 05:12:32	20/04/28 05:12:32
150	20/04/28 05:12:34	20/04/28 05:12:34	20/04/28 05:12:34
1	20/04/28 05:12:36	20/04/28 05:12:36	20/04/28 05:12:36
41	20/04/28 05:12:38	20/04/28 05:12:38	20/04/28 05:12:38
39	20/04/28 05:12:40	20/04/28 05:12:40	20/04/28 05:12:40
17	20/04/28 05:12:42	20/04/28 05:12:42	20/04/28 05:12:42
6	20/04/28 05:12:44	20/04/28 05:12:44	20/04/28 05:12:44
65	20/04/28 05:12:46	20/04/28 05:12:46	20/04/28 05:12:46
74	20/04/28 05:12:48	20/04/28 05:12:48	20/04/28 05:12:48
117	20/04/28 05:12:50	20/04/28 05:12:50	20/04/28 05:12:50
41	20/04/28 05:12:52	20/04/28 05:12:53	20/04/28 05:12:53
74	20/04/28 05:12:55	20/04/28 05:12:55	20/04/28 05:12:55
19	20/04/28 05:12:57	20/04/28 05:12:57	20/04/28 05:12:57
65	20/04/28 05:12:59	20/04/28 05:12:59	20/04/28 05:12:59
42	20/04/28 05:13:01	20/04/28 05:13:01	20/04/28 05:13:01
143	20/04/28 05:13:03	20/04/28 05:13:03	20/04/28 05:13:03
94	20/04/28 05:13:05	20/04/28 05:13:05	20/04/28 05:12:41
78	20/04/28 05:13:07	20/04/28 05:13:07	20/04/28 05:13:07
91	20/04/28 05:13:09	20/04/28 05:13:09	20/04/28 05:13:09
26	20/04/28 05:13:11	20/04/28 05:13:11	20/04/28 05:13:11
135	20/04/28 05:13:13	20/04/28 05:13:13	20/04/28 05:13:13
125	20/04/28 05:13:15	20/04/28 05:13:15	20/04/28 05:13:15
79	20/04/28 05:13:17	20/04/28 05:13:17	20/04/28 05:13:17
89	20/04/28 05:13:19	20/04/28 05:13:19	20/04/28 05:13:19
30	20/04/28 05:13:21	20/04/28 05:13:21	20/04/28 05:13:21
79	20/04/28 05:13:23	20/04/28 05:13:23	20/04/28 05:13:23
88	20/04/28 05:13:25	20/04/28 05:13:25	20/04/28 05:13:25
57	20/04/28 05:13:27	20/04/28 05:13:28	20/04/28 05:13:28
107	20/04/28 05:13:30	20/04/28 05:13:32	20/04/28 05:13:31
62	20/04/28 05:13:34	20/04/28 05:13:34	20/04/28 05:13:34
107	20/04/28 05:13:36	20/04/28 05:13:36	20/04/28 05:13:36
57	20/04/28 05:13:38	20/04/28 05:13:38	20/04/28 05:13:38
12	20/04/28 05:13:40	20/04/28 05:13:40	20/04/28 05:13:40
57	20/04/28 05:13:42	20/04/28 05:13:42	20/04/28 05:13:42
156	20/04/28 05:13:44	20/04/28 05:13:44	20/04/28 05:13:44
109	20/04/28 05:13:46	20/04/28 05:13:46	20/04/28 05:13:46
61	20/04/28 05:13:48	20/04/28 05:13:48	20/04/28 05:13:48
155	20/04/28 05:13:50	20/04/28 05:13:51	20/04/28 05:13:51
29	20/04/28 05:13:53	20/04/28 05:13:53	20/04/28 05:13:53
155	20/04/28 05:13:55	20/04/28 05:13:56	20/04/28 05:13:56
56	20/04/28 05:13:58	20/04/28 05:13:58	20/04/28 05:13:58
56	20/04/28 05:14:00	20/04/28 05:14:00	20/04/28 05:14:00
29	20/04/28 05:14:02	20/04/28 05:14:02	20/04/28 05:14:02
135	20/04/28 05:14:04	20/04/28 05:14:04	20/04/28 05:14:04
135	20/04/28 05:14:06	20/04/28 05:14:07	20/04/28 05:14:06
135	20/04/28 05:14:09	20/04/28 05:14:09	20/04/28 05:14:09
135	20/04/28 05:14:11	20/04/28 05:14:12	20/04/28 05:14:12
135	20/04/28 05:14:14	20/04/28 05:14:16	20/04/28 05:14:14
135	20/04/28 05:14:18	20/04/28 05:14:18	20/04/28 05:14:18
155	20/04/28 05:14:20	20/04/28 05:14:20	20/04/28 05:14:20
18	20/04/28 05:14:22	20/04/28 05:14:22	20/04/28 05:14:22
45	20/04/28 05:14:24	20/04/28 05:14:24	20/04/28 05:14:24
133	20/04/28 05:14:26	20/04/28 05:14:26	20/04/28 05:14:26
106	20/04/28 05:14:28	20/04/28 05:14:28	20/04/28 05:14:28
12	20/04/28 05:14:30	20/04/28 05:14:30	20/04/28 05:14:30
39	20/04/28 05:14:32	20/04/28 05:14:32	20/04/28 05:14:32
35	20/04/28 05:14:34	20/04/28 05:14:34	20/04/28 05:14:34
40	20/04/28 05:14:36	20/04/28 05:14:36	20/04/28 05:14:36
142	20/04/28 05:15:26	20/04/28 05:14:38	20/04/28 05:14:38
150	20/04/28 05:14:40	20/04/28 05:14:40	20/04/28 05:14:40
13	20/04/28 05:14:42	20/04/28 05:14:42	20/04/28 05:14:42
103	20/04/28 05:14:44	20/04/28 05:14:44	20/04/28 05:14:44
76	20/04/28 05:14:46	20/04/28 05:14:46	20/04/28 05:14:46
6	20/04/28 05:14:48	20/04/28 05:14:48	20/04/28 05:14:48
94	20/04/28 05:14:50	20/04/28 05:14:50	20/04/28 05:14:50
65	20/04/28 05:14:52	20/04/28 05:14:52	20/04/28 05:14:52
74	20/04/28 05:14:54	20/04/28 05:14:54	20/04/28 05:14:54
105	20/04/28 05:14:56	20/04/28 05:14:56	20/04/28 05:14:56
117	20/04/28 05:14:58	20/04/28 05:14:58	20/04/28 05:14:58
113	20/04/28 05:15:00	20/04/28 05:15:00	20/04/28 05:15:00
117	20/04/28 05:15:02	20/04/28 05:15:02	20/04/28 05:15:02
118	20/04/28 05:15:04	20/04/28 05:15:04	20/04/28 05:15:04
103	20/04/28 05:15:06	20/04/28 05:15:06	20/04/28 05:15:06
68	20/04/28 05:15:08	20/04/28 05:15:09	20/04/28 05:15:09
118	20/04/28 05:15:11	20/04/28 05:15:13	20/04/28 05:15:13
103	20/04/28 05:15:15	20/04/28 05:15:15	20/04/28 05:15:15
117	20/04/28 05:15:17	20/04/28 05:15:17	20/04/28 05:15:17
103	20/04/28 05:15:19	20/04/28 05:15:19	20/04/28 05:15:19
118	20/04/28 05:15:21	20/04/28 05:15:21	20/04/28 05:15:21
117	20/04/28 05:15:23	20/04/28 05:15:23	20/04/28 05:15:23
105	20/04/28 05:15:25	20/04/28 05:15:25	20/04/28 05:15:25
120	20/04/28 05:15:27	20/04/28 05:15:27	20/04/28 05:15:27
105	20/04/28 05:15:29	20/04/28 05:15:29	20/04/28 05:15:29
120	20/04/28 05:15:31	20/04/28 05:15:31	20/04/28 05:15:31
