stationId	t_start	t_end	t_max	timeStamp
49	20/04/28 05:08:49	20/04/28 05:08:49	20/04/28 05:08:49
77	20/04/28 05:08:51	20/04/28 05:08:51	20/04/28 05:08:51
84	20/04/28 05:08:53	20/04/28 05:13:55	20/04/28 05:13:55
156	20/04/28 05:08:55	20/04/28 05:08:55	20/04/28 05:08:55
84	20/04/28 05:08:57	20/04/28 05:08:58	20/04/28 05:08:57
49	20/04/28 05:09:00	20/04/28 05:09:00	20/04/28 05:09:00
77	20/04/28 05:09:02	20/04/28 05:09:02	20/04/28 05:09:02
77	20/04/28 05:09:04	20/04/28 05:09:04	20/04/28 05:09:04
84	20/04/28 05:09:06	20/04/28 05:09:06	20/04/28 05:09:06
84	20/04/28 05:09:08	20/04/28 05:09:08	20/04/28 05:09:08
24	20/04/28 05:09:10	20/04/28 05:09:10	20/04/28 05:09:10
77	20/04/28 05:09:12	20/04/28 05:09:13	20/04/28 05:09:12
95	20/04/28 05:09:15	20/04/28 05:09:15	20/04/28 05:09:15
56	20/04/28 05:09:17	20/04/28 05:09:17	20/04/28 05:09:17
49	20/04/28 05:09:19	20/04/28 05:09:21	20/04/28 05:09:21
84	20/04/28 05:09:23	20/04/28 05:09:23	20/04/28 05:09:23
56	20/04/28 05:09:25	20/04/28 05:09:25	20/04/28 05:09:25
84	20/04/28 05:09:27	20/04/28 05:09:28	20/04/28 05:09:28
46	20/04/28 05:09:30	20/04/28 05:09:30	20/04/28 05:09:30
56	20/04/28 05:09:32	20/04/28 05:09:32	20/04/28 05:09:32
84	20/04/28 05:09:34	20/04/28 05:09:35	20/04/28 05:09:34
77	20/04/28 05:09:37	20/04/28 05:09:37	20/04/28 05:09:37
24	20/04/28 05:09:39	20/04/28 05:09:39	20/04/28 05:09:39
78	20/04/28 05:09:41	20/04/28 05:09:41	20/04/28 05:09:41
129	20/04/28 05:09:43	20/04/28 05:09:43	20/04/28 05:09:43
18	20/04/28 05:09:45	20/04/28 05:09:45	20/04/28 05:09:45
18	20/04/28 05:09:47	20/04/28 05:09:47	20/04/28 05:09:47
71	20/04/28 05:09:49	20/04/28 05:09:50	20/04/28 05:09:49
75	20/04/28 05:09:52	20/04/28 05:09:52	20/04/28 05:09:52
109	20/04/28 05:09:54	20/04/28 05:09:54	20/04/28 05:09:54
109	20/04/28 05:09:56	20/04/28 05:09:56	20/04/28 05:09:56
69	20/04/28 05:09:58	20/04/28 05:09:58	20/04/28 05:09:58
69	20/04/28 05:10:00	20/04/28 05:10:00	20/04/28 05:10:00
71	20/04/28 05:10:02	20/04/28 05:10:03	20/04/28 05:10:03
71	20/04/28 05:10:05	20/04/28 05:10:07	20/04/28 05:10:05
71	20/04/28 05:10:09	20/04/28 05:10:09	20/04/28 05:10:09
71	20/04/28 05:10:11	20/04/28 05:10:11	20/04/28 05:10:11
109	20/04/28 05:10:13	20/04/28 05:10:13	20/04/28 05:10:13
31	20/04/28 05:10:15	20/04/28 05:10:15	20/04/28 05:10:15
112	20/04/28 05:10:17	20/04/28 05:10:17	20/04/28 05:10:17
31	20/04/28 05:10:19	20/04/28 05:10:19	20/04/28 05:10:19
112	20/04/28 05:10:21	20/04/28 05:10:21	20/04/28 05:10:21
75	20/04/28 05:10:23	20/04/28 05:10:23	20/04/28 05:10:23
110	20/04/28 05:10:25	20/04/28 05:10:25	20/04/28 05:10:25
112	20/04/28 05:10:27	20/04/28 05:10:27	20/04/28 05:10:27
110	20/04/28 05:10:29	20/04/28 05:10:29	20/04/28 05:10:29
18	20/04/28 05:10:31	20/04/28 05:10:31	20/04/28 05:10:31
110	20/04/28 05:10:33	20/04/28 05:10:33	20/04/28 05:10:33
110	20/04/28 05:10:35	20/04/28 05:10:35	20/04/28 05:10:35
70	20/04/28 05:10:37	20/04/28 05:10:37	20/04/28 05:10:37
110	20/04/28 05:10:39	20/04/28 05:10:39	20/04/28 05:10:39
71	20/04/28 05:10:41	20/04/28 05:10:41	20/04/28 05:10:41
110	20/04/28 05:10:43	20/04/28 05:10:43	20/04/28 05:10:43
18	20/04/28 05:10:45	20/04/28 05:10:45	20/04/28 05:10:45
