floorId	partitionId	location_x	location_y	timeStamp
3	42	352.0898782617341	257.6816897320676	20/04/28 05:16:38
3	42	352.0898782617341	257.6816897320676	20/04/28 05:16:39
3	42	352.0898782617341	257.6816897320676	20/04/28 05:16:40
3	42	352.0898782617341	257.6816897320676	20/04/28 05:16:41
3	42	352.0898782617341	257.6816897320676	20/04/28 05:16:42
3	42	352.0898782617341	257.6816897320676	20/04/28 05:16:43
3	42	352.0898782617341	257.6816897320676	20/04/28 05:16:44
3	42	352.0898782617341	257.6816897320676	20/04/28 05:16:45
3	42	352.0898782617341	257.6816897320676	20/04/28 05:16:46
3	42	352.0898782617341	257.6816897320676	20/04/28 05:16:47
3	42	352.0898782617341	257.6816897320676	20/04/28 05:16:48
3	42	352.0898782617341	257.6816897320676	20/04/28 05:16:49
3	42	352.0898782617341	257.6816897320676	20/04/28 05:16:50
3	42	352.0898782617341	257.6816897320676	20/04/28 05:16:51
3	42	352.0898782617341	257.6816897320676	20/04/28 05:16:52
3	42	352.0898782617341	257.6816897320676	20/04/28 05:16:53
3	42	352.0898782617341	257.6816897320676	20/04/28 05:16:54
3	42	352.0898782617341	257.6816897320676	20/04/28 05:16:55
3	42	351.2362894892158	259.98472696547645	20/04/28 05:16:56
3	54	350.37914153837863	260.97432627346046	20/04/28 05:16:57
3	42	352.20974435218506	259.0612514241787	20/04/28 05:16:58
3	68	354.27494542472317	260.2761007032412	20/04/28 05:16:59
3	54	358.9196105941784	261.36039806972667	20/04/28 05:17:00
3	34	358.6160855749653	259.08540043435187	20/04/28 05:17:01
3	54	359.56855835216805	263.2279362811352	20/04/28 05:17:02
3	34	363.08940602427793	260.2393220879455	20/04/28 05:17:03
3	57	365.8336784609425	258.95489486040736	20/04/28 05:17:04
3	54	368.9169651830857	261.65782172430613	20/04/28 05:17:05
3	57	370.51908075392413	258.7689659184304	20/04/28 05:17:06
3	54	372.48785670166836	262.3595943162643	20/04/28 05:17:07
3	57	374.26377240687094	258.097817872792	20/04/28 05:17:08
3	54	376.35656519674916	261.5624468270555	20/04/28 05:17:09
3	15	379.8755906118027	262.6421307240284	20/04/28 05:17:10
3	15	379.8755906118027	262.6421307240284	20/04/28 05:17:11
3	15	380.97239583354167	266.94453563659977	20/04/28 05:17:12
1	33	381.6109766893215	266.73786054806715	20/04/28 05:17:13
1	33	381.6109766893215	266.7378605480671	20/04/28 05:17:14
1	69	376.18075636557654	261.96517202151136	20/04/28 05:17:15
1	74	374.7544496259108	264.4513026329313	20/04/28 05:17:16
1	69	372.48785670166836	262.35959431626424	20/04/28 05:17:17
1	69	372.48785670166836	262.3595943162643	20/04/28 05:17:18
1	69	368.9169651830857	261.65782172430613	20/04/28 05:17:19
1	69	368.9169651830857	261.6578217243062	20/04/28 05:17:20
3	57	365.6578696297699	259.3576200548633	20/04/28 05:17:21
3	54	359.7450566703883	261.7485007314006	20/04/28 05:17:22
3	54	357.6965830742679	260.8022089979779	20/04/28 05:17:23
1	64	356.02694011127693	259.70882448523747	20/04/28 05:17:24
1	64	354.49328963180795	262.3471616487957	20/04/28 05:17:25
1	41	352.7251685521831	260.56227788261185	20/04/28 05:17:26
1	41	352.7251685521831	260.56227788261185	20/04/28 05:17:27
1	41	351.1038521390131	261.25919659269	20/04/28 05:17:28
1	41	349.6149730760457	260.6816456755546	20/04/28 05:17:29
1	41	349.6149730760457	260.6816456755546	20/04/28 05:17:31
1	22	343.1917987024697	259.9647561276533	20/04/28 05:17:32
1	NULL	341.7564158159603	259.49985762417106	20/04/28 05:17:33
1	22	343.1917987024697	259.9647561276533	20/04/28 05:17:34
1	22	346.48253983850464	261.2777688197779	20/04/28 05:17:35
1	41	349.2732493252067	263.17227144197165	20/04/28 05:17:36
1	41	349.2732493252067	263.17227144197165	20/04/28 05:17:37
1	41	349.2732493252067	263.17227144197165	20/04/28 05:17:38
1	41	349.2732493252067	263.17227144197165	20/04/28 05:17:39
1	22	346.48253983850464	261.2777688197779	20/04/28 05:17:40
1	41	349.2732493252067	263.17227144197165	20/04/28 05:17:41
1	41	349.2732493252067	263.17227144197165	20/04/28 05:17:42
1	22	347.0487578307616	265.14175249273313	20/04/28 05:17:43
1	NULL	346.19160987992444	266.1313518007171	20/04/28 05:17:44
1	41	349.2732493252067	263.17227144197165	20/04/28 05:17:45
1	NULL	346.19160987992444	266.1313518007171	20/04/28 05:17:46
1	41	349.2732493252067	263.17227144197165	20/04/28 05:17:47
1	41	349.2732493252067	263.17227144197165	20/04/28 05:17:48
1	NULL	346.19160987992444	266.1313518007171	20/04/28 05:17:49
1	NULL	346.19160987992444	266.1313518007171	20/04/28 05:17:50
1	41	349.2732493252067	263.17227144197165	20/04/28 05:17:51
1	22	347.0487578307616	265.14175249273313	20/04/28 05:17:52
1	22	343.40090039322234	264.23684917852336	20/04/28 05:17:53
1	22	343.40090039322234	264.23684917852336	20/04/28 05:17:54
1	22	343.1917987024697	259.9647561276533	20/04/28 05:17:55
1	22	343.40090039322234	264.23684917852336	20/04/28 05:17:56
1	22	343.40090039322234	264.23684917852336	20/04/28 05:17:57
1	22	343.40090039322234	264.23684917852336	20/04/28 05:17:58
1	22	343.40090039322234	264.23684917852336	20/04/28 05:17:59
1	22	343.40090039322234	264.23684917852336	20/04/28 05:18:00
1	22	343.1917987024697	259.9647561276533	20/04/28 05:18:01
1	22	343.1917987024697	259.9647561276533	20/04/28 05:18:02
1	NULL	341.7564158159603	259.49985762417106	20/04/28 05:18:03
1	22	343.1917987024697	259.9647561276533	20/04/28 05:18:04
1	22	346.8396561400089	260.869659441863	20/04/28 05:18:05
1	NULL	359.57368741858875	268.7891190240523	20/04/28 05:18:06
3	42	352.0898782617341	257.6816897320676	20/04/28 05:18:07
3	42	352.0898782617341	257.6816897320676	20/04/28 05:18:08
3	68	355.570192805002	256.3104557977225	20/04/28 05:18:09
3	84	357.1311797592782	253.49332104078317	20/04/28 05:18:10
3	84	357.1311797592782	253.49332104078317	20/04/28 05:18:11
3	17	359.96968039487183	251.3655491305634	20/04/28 05:18:12
3	17	359.96968039487183	251.3655491305634	20/04/28 05:18:13
3	30	361.5359815708335	246.73539932578205	20/04/28 05:18:14
3	17	359.96968039487183	251.3655491305634	20/04/28 05:18:15
3	30	360.46690033995947	246.70758975930266	20/04/28 05:18:16
3	17	359.96968039487183	251.3655491305634	20/04/28 05:18:17
3	17	359.96968039487183	251.3655491305634	20/04/28 05:18:18
3	30	361.5359815708335	246.73539932578205	20/04/28 05:18:19
3	30	361.5359815708335	246.73539932578205	20/04/28 05:18:20
3	30	361.5359815708335	246.73539932578205	20/04/28 05:18:21
3	30	361.5359815708335	246.73539932578205	20/04/28 05:18:22
3	30	363.12031496140963	247.33199182958694	20/04/28 05:18:23
3	30	363.12031496140963	247.33199182958694	20/04/28 05:18:24
3	17	359.96968039487183	251.3655491305634	20/04/28 05:18:25
3	30	361.5359815708335	246.73539932578205	20/04/28 05:18:26
3	30	361.5359815708335	246.73539932578205	20/04/28 05:18:27
3	23	364.04513168379253	243.80216821811885	20/04/28 05:18:28
3	30	361.5359815708335	246.73539932578205	20/04/28 05:18:29
3	23	364.04513168379253	243.80216821811885	20/04/28 05:18:30
3	30	361.5359815708335	246.73539932578205	20/04/28 05:18:31
3	30	360.46690033995947	246.70758975930266	20/04/28 05:18:32
3	30	360.46690033995947	246.70758975930266	20/04/28 05:18:33
3	30	360.46690033995947	246.70758975930266	20/04/28 05:18:34
3	84	350.8159664197056	245.9604556911897	20/04/28 05:18:35
3	84	354.12807799186004	246.4320269932376	20/04/28 05:18:36
3	84	352.59148945562407	251.4272332360133	20/04/28 05:18:37
3	84	349.54162343838044	253.66681707581725	20/04/28 05:18:38
3	84	345.0291864199896	249.61802848724906	20/04/28 05:18:39
3	95	338.25283756549294	246.86353675454257	20/04/28 05:18:40
3	95	338.25283756549294	246.86353675454257	20/04/28 05:18:41
3	95	338.69093139148134	248.43413806245653	20/04/28 05:18:42
3	95	335.4149042494905	248.08298100603488	20/04/28 05:18:43
3	95	334.48669637099164	246.39521680190742	20/04/28 05:18:44
3	95	332.65419250800556	247.24933982518607	20/04/28 05:18:45
3	95	332.65419250800556	247.24933982518607	20/04/28 05:18:46
3	31	329.26112895585516	244.63947690333885	20/04/28 05:18:47
3	31	328.81363800896884	245.118476741945	20/04/28 05:18:48
