floorId	partitionId	location_x	location_y	timeStamp
3	84	357.1311797592782	253.49332104078317	20/04/28 05:08:49
3	17	359.96968039487183	251.3655491305634	20/04/28 05:08:50
3	17	362.3945272480641	251.57317905073432	20/04/28 05:08:51
3	17	362.3945272480641	251.57317905073432	20/04/28 05:08:52
3	17	363.0633788732786	253.76883669815368	20/04/28 05:08:53
3	17	361.9057312824121	254.45903554354518	20/04/28 05:08:54
3	34	361.2642468288334	255.55936173685845	20/04/28 05:08:55
3	34	361.2642468288334	255.55936173685845	20/04/28 05:08:56
3	54	359.5685583521681	263.2279362811352	20/04/28 05:08:57
3	54	358.23287936641947	263.0061707425011	20/04/28 05:08:58
3	54	358.23287936641947	263.00617074250107	20/04/28 05:08:59
3	54	354.93110780732565	263.85962413987545	20/04/28 05:09:00
3	54	353.26146484433474	262.766239627135	20/04/28 05:09:01
3	54	350.37914153837863	260.97432627346046	20/04/28 05:09:02
3	54	350.37914153837863	260.97432627346046	20/04/28 05:09:03
3	54	349.17477120857285	262.4807721885283	20/04/28 05:09:04
1	22	345.98250818917177	261.859258749847	20/04/28 05:09:05
3	54	345.98250818917177	261.859258749847	20/04/28 05:09:06
3	99	339.59375125487367	258.8166372045796	20/04/28 05:09:07
3	54	339.3775199660886	260.697329100326	20/04/28 05:09:08
3	54	334.4407240787428	261.4032786809491	20/04/28 05:09:09
3	54	334.4407240787428	261.4032786809491	20/04/28 05:09:10
3	54	332.9065526505472	263.50534437986465	20/04/28 05:09:11
3	54	332.9065526505472	263.50534437986465	20/04/28 05:09:12
3	54	329.31216016542004	263.67468515646516	20/04/28 05:09:13
3	54	329.0533935951116	265.2057707173094	20/04/28 05:09:14
3	54	329.31216016542004	263.67468515646516	20/04/28 05:09:15
3	54	329.31216016542004	263.67468515646516	20/04/28 05:09:16
3	54	329.31216016542004	263.67468515646516	20/04/28 05:09:17
3	54	329.31216016542004	263.67468515646516	20/04/28 05:09:18
3	54	329.0533935951116	265.2057707173094	20/04/28 05:09:19
3	54	329.31216016542004	263.67468515646516	20/04/28 05:09:20
3	54	330.6301003048306	263.453311353296	20/04/28 05:09:21
3	54	329.0533935951116	265.2057707173094	20/04/28 05:09:22
3	54	329.31216016542004	263.67468515646516	20/04/28 05:09:23
3	54	329.0533935951116	265.2057707173094	20/04/28 05:09:24
3	54	329.0533935951116	265.2057707173094	20/04/28 05:09:25
3	54	329.0533935951116	265.2057707173094	20/04/28 05:09:26
3	54	329.31216016542004	263.67468515646516	20/04/28 05:09:27
3	54	329.0533935951116	265.2057707173094	20/04/28 05:09:28
3	54	329.0533935951116	265.2057707173094	20/04/28 05:09:29
3	54	329.0533935951116	265.2057707173094	20/04/28 05:09:30
3	54	329.31216016542004	263.67468515646516	20/04/28 05:09:31
3	54	329.31216016542004	263.67468515646516	20/04/28 05:09:32
3	54	329.0533935951116	265.2057707173094	20/04/28 05:09:33
3	54	330.6301003048306	263.453311353296	20/04/28 05:09:34
3	54	329.31216016542004	263.67468515646516	20/04/28 05:09:35
3	54	329.0533935951116	265.20577071730946	20/04/28 05:09:36
3	54	329.0533935951116	265.20577071730946	20/04/28 05:09:37
3	54	329.0533935951116	265.20577071730946	20/04/28 05:09:38
3	14	325.7144978820088	266.8660387296905	20/04/28 05:09:39
3	28	332.6477860802388	265.03642994070896	20/04/28 05:09:40
3	28	332.6477860802388	265.03642994070896	20/04/28 05:09:41
3	54	334.4407240787428	261.4032786809491	20/04/28 05:09:42
3	54	334.4407240787428	261.4032786809491	20/04/28 05:09:43
3	54	334.4407240787428	261.4032786809491	20/04/28 05:09:44
3	54	339.3775199660886	260.697329100326	20/04/28 05:09:45
3	54	341.305582873824	261.6076518711705	20/04/28 05:09:46
3	54	345.98250818917177	261.859258749847	20/04/28 05:09:47
3	42	347.1868785189775	260.3528128347792	20/04/28 05:09:48
3	54	350.37914153837863	260.97432627346046	20/04/28 05:09:49
3	54	350.37914153837863	260.97432627346046	20/04/28 05:09:50
3	54	350.37914153837863	260.97432627346046	20/04/28 05:09:51
3	54	354.93110780732565	263.85962413987545	20/04/28 05:09:52
3	54	354.93110780732565	263.85962413987545	20/04/28 05:09:53
3	54	358.23287936641947	263.0061707425011	20/04/28 05:09:54
3	54	359.5685583521681	263.2279362811352	20/04/28 05:09:55
3	34	362.2167196060361	259.70189758364177	20/04/28 05:09:56
3	34	362.2167196060361	259.70189758364177	20/04/28 05:09:57
3	17	361.9057312824121	254.45903554354518	20/04/28 05:09:58
3	17	363.0633788732786	253.76883669815365	20/04/28 05:09:59
3	17	363.0633788732786	253.76883669815368	20/04/28 05:10:00
3	17	362.3945272480641	251.57317905073432	20/04/28 05:10:01
3	30	365.5344509753579	248.80973562593917	20/04/28 05:10:02
3	6	369.2791426283047	248.13858758030082	20/04/28 05:10:03
3	6	370.63064515039724	245.89555531802912	20/04/28 05:10:04
3	6	370.63064515039724	245.89555531802912	20/04/28 05:10:05
3	6	374.6648195618352	245.76470510583655	20/04/28 05:10:06
3	6	374.0340459475005	245.59491742296848	20/04/28 05:10:07
3	6	374.6648195618352	245.7647051058365	20/04/28 05:10:08
3	6	374.6648195618352	245.7647051058365	20/04/28 05:10:09
3	6	374.6648195618352	245.7647051058365	20/04/28 05:10:10
3	57	376.87914975273753	250.53787723607397	20/04/28 05:10:11
3	57	376.87914975273753	250.53787723607397	20/04/28 05:10:12
3	6	374.6648195618352	245.7647051058365	20/04/28 05:10:13
3	6	374.6648195618352	245.7647051058365	20/04/28 05:10:14
3	57	376.87914975273753	250.53787723607397	20/04/28 05:10:15
3	6	374.6648195618352	245.7647051058365	20/04/28 05:10:16
3	6	374.6648195618352	245.7647051058365	20/04/28 05:10:17
3	6	374.6648195618352	245.7647051058365	20/04/28 05:10:18
3	6	374.6648195618352	245.7647051058365	20/04/28 05:10:19
3	6	374.6648195618352	245.7647051058365	20/04/28 05:10:20
3	6	374.6648195618352	245.7647051058365	20/04/28 05:10:21
3	6	374.6648195618352	245.7647051058365	20/04/28 05:10:22
3	6	374.6648195618352	245.7647051058365	20/04/28 05:10:23
3	6	374.6648195618352	245.76470510583655	20/04/28 05:10:24
3	6	374.6648195618352	245.7647051058365	20/04/28 05:10:25
3	6	374.6648195618352	245.7647051058365	20/04/28 05:10:26
3	6	374.6648195618352	245.76470510583655	20/04/28 05:10:27
3	6	374.6648195618352	245.76470510583655	20/04/28 05:10:28
3	6	374.6648195618352	245.76470510583655	20/04/28 05:10:29
3	6	374.6648195618352	245.7647051058365	20/04/28 05:10:30
3	6	374.6648195618352	245.76470510583655	20/04/28 05:10:31
3	6	374.6648195618352	245.7647051058365	20/04/28 05:10:32
3	6	374.6648195618352	245.7647051058365	20/04/28 05:10:33
3	6	374.6648195618352	245.7647051058365	20/04/28 05:10:34
3	6	371.6459156222339	242.1946659303275	20/04/28 05:10:35
3	6	374.6648195618352	245.76470510583655	20/04/28 05:10:36
3	6	374.6648195618352	245.76470510583655	20/04/28 05:10:37
3	6	374.6648195618352	245.76470510583655	20/04/28 05:10:38
3	6	374.6648195618352	245.76470510583655	20/04/28 05:10:39
3	6	374.6648195618352	245.76470510583655	20/04/28 05:10:40
3	6	374.6648195618352	245.7647051058365	20/04/28 05:10:41
3	6	374.6648195618352	245.7647051058365	20/04/28 05:10:42
3	6	374.6648195618352	245.76470510583655	20/04/28 05:10:43
3	6	374.6648195618352	245.7647051058365	20/04/28 05:10:44
3	6	374.6648195618352	245.7647051058365	20/04/28 05:10:45
3	6	374.6648195618352	245.76470510583655	20/04/28 05:10:46
3	6	374.6648195618352	245.76470510583655	20/04/28 05:10:47
3	6	371.6459156222339	242.1946659303275	20/04/28 05:10:48
3	6	374.6648195618352	245.76470510583655	20/04/28 05:10:49
3	6	371.6459156222339	242.1946659303275	20/04/28 05:10:50
3	6	374.6648195618352	245.76470510583655	20/04/28 05:10:51
3	6	374.6648195618352	245.76470510583655	20/04/28 05:10:52
3	6	371.6459156222339	242.1946659303275	20/04/28 05:10:53
3	6	370.63064515039724	245.89555531802912	20/04/28 05:10:54
3	57	365.0939862748352	252.93573801154582	20/04/28 05:10:55
3	57	369.9048574370517	250.13674253917654	20/04/28 05:10:56
3	57	367.74878116626024	253.5829077561766	20/04/28 05:10:57
3	17	363.0633788732786	253.76883669815368	20/04/28 05:10:58
3	17	363.0633788732786	253.76883669815365	20/04/28 05:10:59
3	34	361.2642468288334	255.55936173685845	20/04/28 05:11:00
3	34	361.2642468288334	255.55936173685845	20/04/28 05:11:01
3	34	361.2642468288334	255.55936173685845	20/04/28 05:11:02
3	57	365.8336784609425	258.95489486040736	20/04/28 05:11:03
3	57	365.8336784609425	258.95489486040736	20/04/28 05:11:04
3	54	372.48785670166836	262.3595943162643	20/04/28 05:11:05
3	54	372.48785670166836	262.3595943162643	20/04/28 05:11:06
3	54	372.48785670166836	262.3595943162643	20/04/28 05:11:07
3	54	376.35656519674916	261.5624468270555	20/04/28 05:11:08
3	54	376.18269094789457	263.03655301878126	20/04/28 05:11:09
3	15	380.97239583354167	266.94453563659977	20/04/28 05:11:10
3	15	380.97239583354167	266.94453563659977	20/04/28 05:11:11
1	33	381.6109766893215	266.73786054806715	20/04/28 05:11:12
1	33	381.6109766893215	266.7378605480671	20/04/28 05:11:13
1	69	376.18075636557654	261.96517202151136	20/04/28 05:11:14
1	69	376.18075636557654	261.96517202151136	20/04/28 05:11:15
1	69	372.48785670166836	262.3595943162643	20/04/28 05:11:16
1	69	372.48785670166836	262.3595943162643	20/04/28 05:11:17
1	69	367.80245440868674	262.5455232582413	20/04/28 05:11:18
3	54	367.80245440868674	262.5455232582413	20/04/28 05:11:19
3	54	364.18549555378036	263.2925259814757	20/04/28 05:11:20
3	54	358.87237025214637	261.21107622709695	20/04/28 05:11:21
3	68	357.91989747494364	257.0685403803136	20/04/28 05:11:22
1	64	356.02694011127693	259.70882448523747	20/04/28 05:11:23
1	64	354.3333978239378	262.53426333928064	20/04/28 05:11:24
1	41	352.7251685521831	260.56227788261185	20/04/28 05:11:25
1	41	352.7251685521831	260.56227788261185	20/04/28 05:11:26
1	41	351.1038521390131	261.25919659268993	20/04/28 05:11:27
1	22	346.48253983850464	261.2777688197779	20/04/28 05:11:28
1	22	343.1917987024697	259.9647561276533	20/04/28 05:11:29
1	22	343.1917987024697	259.9647561276533	20/04/28 05:11:30
1	69	340.1854692097293	258.18142547541174	20/04/28 05:11:31
1	69	340.1854692097293	258.18142547541174	20/04/28 05:11:32
1	69	338.1583683683643	258.3517387010974	20/04/28 05:11:33
1	5	334.95421240030805	260.2160082477838	20/04/28 05:11:34
1	5	333.1227839393323	261.62465248411826	20/04/28 05:11:35
3	54	329.2127636639186	262.68039063695386	20/04/28 05:11:36
1	37	327.25467987903363	260.112943188232	20/04/28 05:11:37
1	37	327.25467987903363	260.112943188232	20/04/28 05:11:38
1	37	324.68376661124154	261.38954335341236	20/04/28 05:11:39
1	37	324.68376661124154	261.38954335341236	20/04/28 05:11:40
1	37	327.25467987903363	260.112943188232	20/04/28 05:11:41
1	37	323.9780902572864	261.641853061257	20/04/28 05:11:42
1	37	326.9602189569582	261.44157637998103	20/04/28 05:11:43
1	37	323.9780902572864	261.641853061257	20/04/28 05:11:44
1	37	323.9780902572864	261.641853061257	20/04/28 05:11:45
1	37	323.9780902572864	261.641853061257	20/04/28 05:11:46
1	37	323.9780902572864	261.641853061257	20/04/28 05:11:47
1	37	324.68376661124154	261.38954335341236	20/04/28 05:11:48
1	37	323.9780902572864	261.641853061257	20/04/28 05:11:49
1	37	323.9780902572864	261.641853061257	20/04/28 05:11:50
1	37	323.9780902572864	261.641853061257	20/04/28 05:11:51
1	37	323.9780902572864	261.641853061257	20/04/28 05:11:52
1	37	323.9780902572864	261.641853061257	20/04/28 05:11:53
1	37	323.9780902572864	261.641853061257	20/04/28 05:11:54
1	37	323.9780902572864	261.641853061257	20/04/28 05:11:55
1	37	323.9780902572864	261.641853061257	20/04/28 05:11:56
1	37	323.9780902572864	261.641853061257	20/04/28 05:11:57
1	37	323.9780902572864	261.641853061257	20/04/28 05:11:58
1	37	323.6597216964546	264.1572674834102	20/04/28 05:11:59
1	37	323.9780902572864	261.641853061257	20/04/28 05:12:00
1	37	323.9780902572864	261.641853061257	20/04/28 05:12:01
1	37	323.9780902572864	261.641853061257	20/04/28 05:12:02
1	37	323.9780902572864	261.641853061257	20/04/28 05:12:03
1	37	323.9780902572864	261.641853061257	20/04/28 05:12:04
1	37	323.9780902572864	261.641853061257	20/04/28 05:12:05
1	37	323.9780902572864	261.641853061257	20/04/28 05:12:06
1	37	323.9780902572864	261.641853061257	20/04/28 05:12:07
1	37	323.9780902572864	261.641853061257	20/04/28 05:12:08
1	37	323.9780902572864	261.641853061257	20/04/28 05:12:09
1	37	323.9780902572864	261.641853061257	20/04/28 05:12:10
1	37	323.9780902572864	261.641853061257	20/04/28 05:12:11
1	37	323.9780902572864	261.641853061257	20/04/28 05:12:12
1	37	323.9780902572864	261.641853061257	20/04/28 05:12:13
1	37	323.9780902572864	261.641853061257	20/04/28 05:12:14
1	37	323.9780902572864	261.641853061257	20/04/28 05:12:15
1	37	323.6597216964546	264.1572674834102	20/04/28 05:12:16
1	37	323.6597216964546	264.1572674834102	20/04/28 05:12:17
1	37	323.6597216964546	264.1572674834102	20/04/28 05:12:18
1	37	323.9780902572864	261.641853061257	20/04/28 05:12:19
1	37	323.6597216964546	264.1572674834102	20/04/28 05:12:21
1	37	323.9780902572864	261.641853061257	20/04/28 05:12:22
1	37	323.9780902572864	261.641853061257	20/04/28 05:12:23
1	37	323.9780902572864	261.641853061257	20/04/28 05:12:24
1	37	329.2127636639186	262.68039063695386	20/04/28 05:12:25
3	54	329.2127636639186	262.68039063695386	20/04/28 05:12:26
3	54	329.2127636639186	262.6803906369539	20/04/28 05:12:27
1	69	335.24867332238347	258.8873750560348	20/04/28 05:12:28
1	69	338.1583683683643	258.3517387010974	20/04/28 05:12:29
1	69	338.1583683683643	258.3517387010974	20/04/28 05:12:30
1	69	340.1854692097293	258.18142547541174	20/04/28 05:12:31
1	69	340.1854692097293	258.18142547541174	20/04/28 05:12:32
1	22	343.1917987024697	259.9647561276533	20/04/28 05:12:33
1	22	346.48253983850464	261.2777688197779	20/04/28 05:12:34
1	41	351.1038521390131	261.25919659268993	20/04/28 05:12:35
1	41	351.1038521390131	261.25919659268993	20/04/28 05:12:36
1	41	352.7251685521831	260.56227788261185	20/04/28 05:12:37
1	41	352.7251685521831	260.56227788261185	20/04/28 05:12:38
1	64	354.3333978239378	262.53426333928064	20/04/28 05:12:39
1	64	354.49328963180795	262.3471616487957	20/04/28 05:12:40
1	64	359.0687213949978	261.8954025150879	20/04/28 05:12:41
3	54	357.6965830742679	260.80220899797797	20/04/28 05:12:42
1	13	368.31727752533806	266.1301521552222	20/04/28 05:12:43
1	13	368.31727752533806	266.1301521552222	20/04/28 05:12:44
1	69	368.9169651830857	261.65782172430613	20/04/28 05:12:45
1	69	372.48785670166836	262.3595943162643	20/04/28 05:12:46
1	69	372.48785670166836	262.3595943162643	20/04/28 05:12:47
1	74	374.7544496259108	264.4513026329313	20/04/28 05:12:48
1	74	374.7544496259108	264.4513026329313	20/04/28 05:12:49
1	33	380.6150632356726	267.4744509522458	20/04/28 05:12:50
1	33	380.10363975758173	269.99320560191785	20/04/28 05:12:51
1	33	380.10363975758173	269.99320560191785	20/04/28 05:12:52
1	33	379.10772630393285	270.7297960060965	20/04/28 05:12:53
1	33	379.10772630393285	270.7297960060965	20/04/28 05:12:54
1	33	379.10772630393285	270.7297960060965	20/04/28 05:12:55
1	33	379.10772630393285	270.7297960060965	20/04/28 05:12:56
1	33	379.10772630393285	270.7297960060965	20/04/28 05:12:57
1	33	379.10772630393285	270.7297960060965	20/04/28 05:12:58
1	86	379.841850882261	275.57240741593785	20/04/28 05:12:59
1	33	379.10772630393285	270.7297960060965	20/04/28 05:13:00
1	86	379.841850882261	275.57240741593785	20/04/28 05:13:01
1	86	379.841850882261	275.57240741593785	20/04/28 05:13:02
1	86	379.841850882261	275.57240741593785	20/04/28 05:13:03
1	86	379.20327002648105	275.7790825044705	20/04/28 05:13:04
1	86	379.841850882261	275.57240741593785	20/04/28 05:13:05
1	86	379.841850882261	275.57240741593785	20/04/28 05:13:06
1	86	379.841850882261	275.57240741593785	20/04/28 05:13:07
1	86	379.20327002648105	275.7790825044705	20/04/28 05:13:08
1	86	379.841850882261	275.57240741593785	20/04/28 05:13:09
1	86	379.841850882261	275.57240741593785	20/04/28 05:13:10
1	86	379.20327002648105	275.7790825044705	20/04/28 05:13:11
3	46	379.841850882261	275.57240741593785	20/04/28 05:13:12
1	86	379.841850882261	275.57240741593785	20/04/28 05:13:13
1	86	379.841850882261	275.57240741593785	20/04/28 05:13:14
1	86	379.841850882261	275.57240741593785	20/04/28 05:13:15
3	46	379.20327002648105	275.7790825044705	20/04/28 05:13:16
1	86	379.20327002648105	275.7790825044705	20/04/28 05:13:17
1	86	379.841850882261	275.57240741593785	20/04/28 05:13:18
1	86	379.841850882261	275.57240741593785	20/04/28 05:13:19
1	86	379.20327002648105	275.7790825044705	20/04/28 05:13:20
