floorId	partitionId	location_x	location_y	timeStamp
3	14	327.6654113040225	273.08156794644333	20/04/28 05:09:20
3	14	325.03373391471956	273.59095825607847	20/04/28 05:09:21
3	14	327.6654113040225	273.08156794644333	20/04/28 05:09:22
3	14	327.31058125591494	271.7908763576542	20/04/28 05:09:23
3	14	327.6654113040225	273.08156794644333	20/04/28 05:09:24
3	14	327.6654113040225	273.08156794644333	20/04/28 05:09:25
3	14	327.31058125591494	271.7908763576542	20/04/28 05:09:26
3	14	327.6654113040225	273.08156794644333	20/04/28 05:09:27
3	14	327.6654113040225	273.08156794644333	20/04/28 05:09:28
3	14	327.6654113040225	273.08156794644333	20/04/28 05:09:29
3	14	327.6654113040224	273.08156794644333	20/04/28 05:09:30
3	14	325.03373391471956	273.59095825607847	20/04/28 05:09:31
3	14	325.0337339147196	273.59095825607847	20/04/28 05:09:32
3	14	325.03373391471956	273.59095825607847	20/04/28 05:09:33
3	14	325.0337339147196	273.59095825607847	20/04/28 05:09:34
3	14	327.6654113040225	273.08156794644333	20/04/28 05:09:35
3	14	327.6654113040224	273.08156794644333	20/04/28 05:09:36
3	14	327.6654113040224	273.08156794644333	20/04/28 05:09:37
3	14	325.03373391471956	273.59095825607847	20/04/28 05:09:38
3	14	327.6654113040224	273.08156794644333	20/04/28 05:09:39
3	14	325.03373391471956	273.59095825607847	20/04/28 05:09:40
3	14	325.03373391471956	273.59095825607847	20/04/28 05:09:41
3	14	327.6654113040224	273.08156794644333	20/04/28 05:09:42
3	14	327.6654113040224	273.08156794644333	20/04/28 05:09:43
3	14	327.6654113040224	273.08156794644333	20/04/28 05:09:44
3	14	325.03373391471956	273.59095825607847	20/04/28 05:09:45
3	14	327.6654113040224	273.08156794644333	20/04/28 05:09:46
3	14	325.03373391471956	273.59095825607847	20/04/28 05:09:47
3	14	327.6654113040224	273.08156794644333	20/04/28 05:09:48
3	14	327.6654113040224	273.08156794644333	20/04/28 05:09:49
3	14	327.6654113040224	273.08156794644333	20/04/28 05:09:50
3	14	327.6654113040225	273.08156794644333	20/04/28 05:09:51
3	14	327.31058125591494	271.7908763576542	20/04/28 05:09:52
3	14	325.71449788200874	266.8660387296905	20/04/28 05:09:53
3	14	325.7144978820088	266.8660387296905	20/04/28 05:09:54
3	54	329.0533935951116	265.20577071730946	20/04/28 05:09:55
3	28	332.6477860802388	265.03642994070896	20/04/28 05:09:56
3	54	332.9065526505472	263.50534437986465	20/04/28 05:09:57
3	54	334.4407240787428	261.4032786809491	20/04/28 05:09:58
3	54	334.4407240787428	261.4032786809491	20/04/28 05:09:59
3	NULL	337.7075354262279	260.45953294809675	20/04/28 05:10:00
3	NULL	337.7075354262279	260.45953294809675	20/04/28 05:10:01
3	42	343.19179870246967	259.9647561276533	20/04/28 05:10:02
3	54	345.98250818917177	261.859258749847	20/04/28 05:10:03
3	54	349.17477120857285	262.4807721885283	20/04/28 05:10:04
3	54	350.37914153837863	260.97432627346046	20/04/28 05:10:05
3	54	350.89456573837674	262.47535273189357	20/04/28 05:10:06
3	54	354.93110780732565	263.85962413987545	20/04/28 05:10:07
3	54	354.93110780732565	263.85962413987545	20/04/28 05:10:08
3	54	360.0352469025501	262.00891114944136	20/04/28 05:10:09
3	54	359.5685583521681	263.2279362811352	20/04/28 05:10:10
3	34	362.2167196060361	259.70189758364177	20/04/28 05:10:11
3	34	362.2167196060361	259.70189758364177	20/04/28 05:10:12
3	34	361.2642468288334	255.55936173685845	20/04/28 05:10:13
3	34	361.2642468288334	255.55936173685845	20/04/28 05:10:14
3	17	361.9057312824121	254.45903554354518	20/04/28 05:10:15
3	17	363.0633788732786	253.76883669815368	20/04/28 05:10:16
3	17	362.3945272480641	251.57317905073432	20/04/28 05:10:17
3	17	362.3945272480641	251.57317905073432	20/04/28 05:10:18
3	30	365.53445097535786	248.80973562593917	20/04/28 05:10:19
3	30	364.9036773610231	248.6399479430711	20/04/28 05:10:20
3	17	362.3945272480641	251.57317905073432	20/04/28 05:10:21
3	17	362.3945272480641	251.57317905073432	20/04/28 05:10:22
3	17	362.3945272480641	251.57317905073432	20/04/28 05:10:23
3	30	365.53445097535786	248.80973562593917	20/04/28 05:10:24
3	30	365.53445097535786	248.80973562593917	20/04/28 05:10:25
3	30	364.9036773610232	248.6399479430711	20/04/28 05:10:26
3	17	362.3945272480641	251.57317905073432	20/04/28 05:10:27
3	17	362.3945272480641	251.57317905073432	20/04/28 05:10:28
3	30	365.53445097535786	248.80973562593917	20/04/28 05:10:29
3	17	362.3945272480641	251.57317905073432	20/04/28 05:10:30
3	17	362.3945272480641	251.57317905073432	20/04/28 05:10:31
3	30	364.9036773610231	248.6399479430711	20/04/28 05:10:32
3	30	365.53445097535786	248.80973562593917	20/04/28 05:10:33
3	30	365.53445097535786	248.80973562593917	20/04/28 05:10:34
3	30	364.9036773610231	248.6399479430711	20/04/28 05:10:35
3	30	364.9036773610232	248.6399479430711	20/04/28 05:10:36
3	17	362.3945272480641	251.57317905073432	20/04/28 05:10:37
3	30	363.12031496140963	247.33199182958694	20/04/28 05:10:38
3	30	363.7510885757444	247.501779512455	20/04/28 05:10:39
3	30	363.12031496140963	247.33199182958694	20/04/28 05:10:40
3	30	363.12031496140963	247.33199182958694	20/04/28 05:10:41
3	23	366.2602386887035	244.5685484047918	20/04/28 05:10:42
3	23	366.2602386887034	244.5685484047918	20/04/28 05:10:43
3	23	366.2602386887035	244.5685484047918	20/04/28 05:10:44
3	23	366.2602386887035	244.5685484047918	20/04/28 05:10:45
3	30	363.12031496140963	247.33199182958694	20/04/28 05:10:46
3	23	364.04513168379253	243.80216821811885	20/04/28 05:10:47
3	23	366.2602386887035	244.5685484047918	20/04/28 05:10:48
3	23	364.04513168379253	243.80216821811885	20/04/28 05:10:49
3	23	366.2602386887035	244.5685484047918	20/04/28 05:10:50
3	23	366.2602386887034	244.5685484047918	20/04/28 05:10:51
3	23	366.2602386887034	244.5685484047918	20/04/28 05:10:52
3	23	366.2602386887035	244.5685484047918	20/04/28 05:10:53
3	30	363.12031496140963	247.33199182958694	20/04/28 05:10:54
3	30	363.12031496140963	247.33199182958694	20/04/28 05:10:55
3	23	364.04513168379253	243.80216821811885	20/04/28 05:10:56
3	30	363.12031496140963	247.33199182958694	20/04/28 05:10:57
3	17	362.3945272480641	251.57317905073432	20/04/28 05:10:58
3	17	362.3945272480641	251.57317905073432	20/04/28 05:10:59
3	30	363.7510885757444	247.501779512455	20/04/28 05:11:00
3	17	359.96968039487183	251.3655491305634	20/04/28 05:11:01
3	17	362.3945272480641	251.57317905073432	20/04/28 05:11:02
3	17	362.3945272480641	251.57317905073432	20/04/28 05:11:03
3	17	362.3945272480641	251.57317905073432	20/04/28 05:11:04
3	17	362.3945272480641	251.57317905073432	20/04/28 05:11:05
3	17	362.3945272480641	251.57317905073432	20/04/28 05:11:06
3	17	362.3945272480641	251.57317905073432	20/04/28 05:11:07
3	17	362.3945272480641	251.57317905073432	20/04/28 05:11:08
3	17	362.3945272480641	251.57317905073432	20/04/28 05:11:09
3	17	362.3945272480641	251.57317905073432	20/04/28 05:11:10
3	17	362.3945272480641	251.57317905073432	20/04/28 05:11:11
3	17	362.3945272480641	251.57317905073432	20/04/28 05:11:12
3	30	363.7510885757444	247.501779512455	20/04/28 05:11:13
3	23	366.2602386887035	244.5685484047918	20/04/28 05:11:14
3	17	362.3945272480641	251.57317905073432	20/04/28 05:11:15
3	30	364.9036773610232	248.6399479430711	20/04/28 05:11:16
3	23	366.2602386887034	244.5685484047918	20/04/28 05:11:17
3	23	366.2602386887035	244.5685484047918	20/04/28 05:11:18
3	30	363.12031496140963	247.33199182958694	20/04/28 05:11:19
3	30	364.9036773610232	248.6399479430711	20/04/28 05:11:20
3	23	366.2602386887034	244.5685484047918	20/04/28 05:11:21
3	23	366.2602386887034	244.5685484047918	20/04/28 05:11:22
3	23	366.2602386887034	244.5685484047918	20/04/28 05:11:23
3	23	366.2602386887034	244.5685484047918	20/04/28 05:11:24
3	23	366.2602386887035	244.5685484047918	20/04/28 05:11:25
3	23	366.2602386887034	244.5685484047918	20/04/28 05:11:26
3	30	363.12031496140963	247.33199182958694	20/04/28 05:11:27
3	23	366.2602386887034	244.5685484047918	20/04/28 05:11:28
3	23	366.2602386887034	244.5685484047918	20/04/28 05:11:29
3	23	366.2602386887034	244.5685484047918	20/04/28 05:11:30
3	23	366.2602386887034	244.5685484047918	20/04/28 05:11:31
3	23	366.2602386887034	244.5685484047918	20/04/28 05:11:32
3	23	366.2602386887034	244.5685484047918	20/04/28 05:11:33
3	23	366.2602386887034	244.5685484047918	20/04/28 05:11:34
3	23	366.2602386887034	244.5685484047918	20/04/28 05:11:35
3	23	366.2602386887034	244.5685484047918	20/04/28 05:11:36
3	23	366.2602386887035	244.5685484047918	20/04/28 05:11:37
3	23	366.2602386887034	244.5685484047918	20/04/28 05:11:38
3	23	366.2602386887034	244.5685484047918	20/04/28 05:11:39
3	23	366.2602386887034	244.5685484047918	20/04/28 05:11:40
3	30	363.12031496140963	247.33199182958694	20/04/28 05:11:41
3	23	366.2602386887034	244.5685484047918	20/04/28 05:11:42
3	23	366.2602386887034	244.5685484047918	20/04/28 05:11:43
3	23	366.2602386887035	244.5685484047918	20/04/28 05:11:44
3	23	366.2602386887034	244.5685484047918	20/04/28 05:11:45
3	23	366.2602386887034	244.5685484047918	20/04/28 05:11:46
3	23	366.2602386887034	244.5685484047918	20/04/28 05:11:48
3	23	366.2602386887034	244.5685484047918	20/04/28 05:11:49
3	23	366.2602386887035	244.5685484047918	20/04/28 05:11:50
3	23	366.2602386887035	244.5685484047918	20/04/28 05:11:51
3	23	366.2602386887034	244.5685484047918	20/04/28 05:11:52
3	23	366.2602386887034	244.5685484047918	20/04/28 05:11:53
3	23	366.2602386887035	244.5685484047918	20/04/28 05:11:54
3	23	366.2602386887034	244.5685484047918	20/04/28 05:11:55
3	23	366.2602386887035	244.5685484047918	20/04/28 05:11:56
3	23	366.2602386887035	244.5685484047918	20/04/28 05:11:57
3	23	366.0274078202198	241.72892363871526	20/04/28 05:11:58
3	23	366.2602386887035	244.5685484047918	20/04/28 05:11:59
3	23	366.2602386887035	244.5685484047918	20/04/28 05:12:00
3	23	366.2602386887035	244.5685484047918	20/04/28 05:12:01
3	23	366.2602386887034	244.5685484047918	20/04/28 05:12:02
3	23	366.2602386887035	244.5685484047918	20/04/28 05:12:03
3	23	366.2602386887035	244.5685484047918	20/04/28 05:12:04
3	23	366.2602386887035	244.5685484047918	20/04/28 05:12:05
3	23	366.2602386887035	244.5685484047918	20/04/28 05:12:06
3	23	366.2602386887034	244.5685484047918	20/04/28 05:12:07
3	23	366.2602386887035	244.5685484047918	20/04/28 05:12:08
3	23	366.2602386887035	244.5685484047918	20/04/28 05:12:09
3	NULL	366.79190435951654	246.6278485991508	20/04/28 05:12:10
3	23	366.2602386887035	244.5685484047918	20/04/28 05:12:11
3	23	366.2602386887035	244.5685484047918	20/04/28 05:12:12
3	23	366.2602386887034	244.5685484047918	20/04/28 05:12:13
3	23	366.2602386887035	244.5685484047918	20/04/28 05:12:14
3	23	366.2602386887034	244.5685484047918	20/04/28 05:12:15
3	23	366.2602386887034	244.5685484047918	20/04/28 05:12:16
3	23	366.2602386887034	244.5685484047918	20/04/28 05:12:17
3	23	366.2602386887034	244.5685484047918	20/04/28 05:12:18
3	23	366.2602386887034	244.5685484047918	20/04/28 05:12:19
3	23	366.2602386887034	244.5685484047918	20/04/28 05:12:20
3	23	366.2602386887035	244.5685484047918	20/04/28 05:12:21
3	23	366.2602386887035	244.5685484047918	20/04/28 05:12:22
3	23	366.2602386887035	244.5685484047918	20/04/28 05:12:23
3	23	366.2602386887035	244.5685484047918	20/04/28 05:12:24
3	23	366.2602386887035	244.5685484047918	20/04/28 05:12:25
3	23	366.2602386887035	244.5685484047918	20/04/28 05:12:26
3	23	366.2602386887035	244.5685484047918	20/04/28 05:12:27
3	23	366.2602386887035	244.5685484047918	20/04/28 05:12:28
3	23	366.2602386887034	244.5685484047918	20/04/28 05:12:29
3	23	366.2602386887035	244.5685484047918	20/04/28 05:12:30
3	23	366.2602386887035	244.5685484047918	20/04/28 05:12:31
