floorId	partitionId	location_x	location_y	timeStamp
3	51	317.8588782033235	287.46158796668846	20/04/28 05:12:18
3	51	317.6556732130947	287.30997767063906	20/04/28 05:12:19
3	51	317.6556732130947	287.30997767063906	20/04/28 05:12:19
3	51	317.7834716124877	287.27212164056436	20/04/28 05:12:19
3	51	317.9434373682636	287.15758335520917	20/04/28 05:12:19
3	51	317.9399598194848	286.93061113733853	20/04/28 05:12:19
3	51	317.88604904172263	286.8977256180138	20/04/28 05:12:19
3	51	317.88604904172263	286.8977256180138	20/04/28 05:12:19
3	51	317.7647626340395	286.9890912347483	20/04/28 05:12:19
3	51	317.70819127982236	286.97629098897033	20/04/28 05:12:19
3	51	317.7861430192498	287.1990825754206	20/04/28 05:12:20
3	51	317.8082432506329	287.2297879929177	20/04/28 05:12:20
3	51	317.8890945189381	287.24695908179734	20/04/28 05:12:20
3	51	317.9459142042379	287.28039725442426	20/04/28 05:12:20
3	51	317.9459142042379	287.28039725442426	20/04/28 05:12:20
3	51	318.18205336705824	287.2421970028735	20/04/28 05:12:20
3	51	318.2359711290182	287.1994259575205	20/04/28 05:12:20
3	51	318.1335113503107	287.1323801177347	20/04/28 05:12:20
3	51	317.93784569332735	287.14475713543425	20/04/28 05:12:20
3	51	317.9347765925014	287.0970213080623	20/04/28 05:12:20
3	51	317.9347765925014	287.0970213080623	20/04/28 05:12:21
3	51	318.0940098961085	287.072544442526	20/04/28 05:12:21
3	51	318.0940098961085	287.072544442526	20/04/28 05:12:21
3	51	318.0018317683223	287.1907100538448	20/04/28 05:12:21
3	51	318.0018317683223	287.1907100538448	20/04/28 05:12:21
3	51	317.9956895741126	287.2370743799519	20/04/28 05:12:21
3	51	317.89667121386407	287.3910982522927	20/04/28 05:12:21
3	51	317.9012661798218	287.2101308520982	20/04/28 05:12:21
3	51	317.8117424718761	287.2818406805023	20/04/28 05:12:21
3	51	317.81709521794124	287.39846853716045	20/04/28 05:12:21
3	51	317.5588292144345	287.52850469566044	20/04/28 05:12:22
3	51	317.83179015654014	287.6444305367638	20/04/28 05:12:22
3	51	317.9298325112138	287.56968145470665	20/04/28 05:12:22
3	51	317.74571809122136	287.58561403909937	20/04/28 05:12:22
3	51	317.74571809122136	287.58561403909937	20/04/28 05:12:22
3	51	317.63341025814043	287.5315010922896	20/04/28 05:12:22
3	51	317.61921154850586	287.806986216931	20/04/28 05:12:22
3	51	317.7355127316225	287.85049338627095	20/04/28 05:12:22
3	51	317.9715131016357	287.7827160165767	20/04/28 05:12:22
3	51	317.8260144887502	287.7764250836084	20/04/28 05:12:23
3	51	318.0403069055203	287.91720720490724	20/04/28 05:12:23
3	51	318.0422735688719	287.7423763177138	20/04/28 05:12:23
3	51	318.2193433954123	287.7423825538474	20/04/28 05:12:23
3	51	318.1976791531336	287.52326177178264	20/04/28 05:12:23
3	51	318.2587322440803	287.6212976669831	20/04/28 05:12:23
3	51	318.1075327031755	287.58884508768824	20/04/28 05:12:23
3	51	317.98138181164546	287.3910357140888	20/04/28 05:12:23
3	51	318.0815224399543	287.46361459170674	20/04/28 05:12:23
3	51	317.9799224603565	287.58028081512697	20/04/28 05:12:23
3	51	317.99860743725446	287.5894032400502	20/04/28 05:12:24
3	51	317.8227140189043	287.83115403449034	20/04/28 05:12:24
3	51	317.93135555141305	288.098423478761	20/04/28 05:12:24
3	51	317.82311720040053	288.17856430638386	20/04/28 05:12:24
3	51	317.72979956371404	288.1722075886514	20/04/28 05:12:24
3	51	317.72979956371404	288.1722075886514	20/04/28 05:12:24
3	51	317.57958686686254	288.1226899869915	20/04/28 05:12:24
3	51	317.39002371199894	288.2553969384068	20/04/28 05:12:24
3	51	317.36171351337816	288.0503184829116	20/04/28 05:12:24
3	51	317.42939060178526	288.12557406046926	20/04/28 05:12:25
3	51	317.4232343624564	288.1301757528991	20/04/28 05:12:25
3	51	317.42645494825	288.17251150488545	20/04/28 05:12:25
3	51	317.5149160686785	288.25411297305834	20/04/28 05:12:25
3	51	317.5390013748675	288.26342175885344	20/04/28 05:12:25
3	51	317.5033502072332	288.3094612195659	20/04/28 05:12:25
3	51	317.6039378249776	288.4149027439084	20/04/28 05:12:25
3	51	317.57004326993393	288.57455820149045	20/04/28 05:12:25
3	51	317.970615362028	288.7548273224659	20/04/28 05:12:25
3	51	317.970615362028	288.7548273224659	20/04/28 05:12:25
3	51	317.89275051389757	288.77516183998614	20/04/28 05:12:26
3	51	317.8453596930542	288.7237614750437	20/04/28 05:12:26
3	51	317.64626104410144	288.8888229349055	20/04/28 05:12:26
3	51	317.54170115627596	288.9639335849457	20/04/28 05:12:26
3	51	317.71220214971066	288.7450878609987	20/04/28 05:12:26
3	51	317.8879112119078	288.6939676603165	20/04/28 05:12:26
3	51	317.6647558122588	288.71823646470705	20/04/28 05:12:26
3	51	317.6262815233065	288.6779716710382	20/04/28 05:12:26
3	51	317.7415273311348	288.89071036158896	20/04/28 05:12:26
3	51	317.9060477163736	288.9799211606362	20/04/28 05:12:26
3	51	317.83875542019746	289.1271149947686	20/04/28 05:12:27
3	51	317.7797180993696	289.38712921971705	20/04/28 05:12:27
3	51	317.5431258211072	289.22182592772293	20/04/28 05:12:27
3	51	317.3847129852489	289.4354665337813	20/04/28 05:12:27
3	51	317.25043815291156	289.2569557525928	20/04/28 05:12:27
3	51	317.3060226749951	289.27129288376136	20/04/28 05:12:27
3	51	317.2342112293868	289.32908481329514	20/04/28 05:12:27
3	51	317.44445706363996	289.14788584174454	20/04/28 05:12:27
3	51	317.5719982549809	289.1773545530218	20/04/28 05:12:27
3	51	317.7675259374974	289.26588136567005	20/04/28 05:12:28
3	51	317.76096450402036	289.2430491700688	20/04/28 05:12:28
3	51	317.7422075365465	289.06374329494116	20/04/28 05:12:28
3	51	317.9438502182306	288.9564828283488	20/04/28 05:12:28
3	51	317.8620001539007	288.7927188568134	20/04/28 05:12:28
3	51	317.92836037973996	288.77022971334065	20/04/28 05:12:28
3	51	318.100269724003	288.7439118767101	20/04/28 05:12:28
3	51	318.176508209441	288.67835857675226	20/04/28 05:12:28
3	51	318.28224353463503	288.8800391116253	20/04/28 05:12:28
3	51	318.13938054518917	288.6688256266719	20/04/28 05:12:28
3	51	318.13938054518917	288.6688256266719	20/04/28 05:12:29
3	51	318.13938054518917	288.6688256266719	20/04/28 05:12:29
3	51	318.2462264051243	288.6252004455546	20/04/28 05:12:29
3	51	318.398899766478	288.7190613135258	20/04/28 05:12:29
3	51	318.59450480148706	288.6529825775194	20/04/28 05:12:29
3	51	318.55487086116085	288.75986058469283	20/04/28 05:12:29
3	51	318.63432693370754	288.65079014082977	20/04/28 05:12:29
3	51	318.6794179916689	288.66478423079093	20/04/28 05:12:29
3	51	318.60363058310605	288.6413727806936	20/04/28 05:12:29
3	51	318.6167418438673	288.77067743364813	20/04/28 05:12:30
3	51	318.5591394453327	288.50249606168774	20/04/28 05:12:30
3	51	318.5591394453327	288.50249606168774	20/04/28 05:12:30
3	51	318.319523737201	288.3777771393606	20/04/28 05:12:30
3	51	318.31959771540653	288.3725653008065	20/04/28 05:12:30
3	51	318.1883557993469	288.13533380142735	20/04/28 05:12:30
3	51	318.2501751978938	288.09762645272673	20/04/28 05:12:30
3	51	318.2900476597931	287.91137108916115	20/04/28 05:12:30
3	51	318.37015793814476	288.1905040188719	20/04/28 05:12:30
3	51	318.34110135976715	288.0776921846592	20/04/28 05:12:30
3	51	318.50643013909774	288.2409986379253	20/04/28 05:12:31
3	51	318.49393341652495	288.23399816216767	20/04/28 05:12:31
3	51	318.58213513698564	288.45181724990897	20/04/28 05:12:31
3	51	318.67882919257374	288.7275793904746	20/04/28 05:12:31
3	51	318.4022823763095	288.82613755982175	20/04/28 05:12:31
3	51	318.4019997764537	288.82736472028165	20/04/28 05:12:31
3	51	318.179328232188	288.875014349945	20/04/28 05:12:31
3	51	318.02746761631647	288.9310080824669	20/04/28 05:12:31
3	51	318.2054078426156	288.8717929671214	20/04/28 05:12:31
3	51	318.3216708009983	288.60991223323674	20/04/28 05:12:32
3	51	318.1621157168274	288.379237796177	20/04/28 05:12:32
3	51	318.02431496284817	288.27948811082314	20/04/28 05:12:32
3	51	318.0383205847522	288.3244173882121	20/04/28 05:12:32
3	51	317.9456672359408	288.42320302733197	20/04/28 05:12:32
3	51	317.8983584031495	288.2612287118744	20/04/28 05:12:32
3	51	317.7827373719358	288.3110646552446	20/04/28 05:12:32
3	51	317.93555530950084	288.51870476873944	20/04/28 05:12:32
3	51	317.9452081572497	288.42717626264385	20/04/28 05:12:32
3	51	318.08228049095123	288.4921304446808	20/04/28 05:12:32
3	51	318.16087149311426	288.3962380958225	20/04/28 05:12:33
3	51	318.136464167186	288.6083289595619	20/04/28 05:12:33
3	51	318.3953522619292	288.57880079858074	20/04/28 05:12:33
3	51	318.63396351807023	288.44591760233294	20/04/28 05:12:33
3	51	318.65751768955835	288.3216027211035	20/04/28 05:12:33
3	51	318.66593318958377	288.34530718998195	20/04/28 05:12:33
3	51	318.40738148989794	288.2509158085141	20/04/28 05:12:33
3	51	318.45747962542924	288.48272466513214	20/04/28 05:12:33
3	51	318.5940657693099	288.36374116945325	20/04/28 05:12:33
3	51	318.8525165866228	288.31427782207925	20/04/28 05:12:33
3	51	318.7854960950286	288.31841470127506	20/04/28 05:12:34
3	51	318.5374370260653	288.3640269699013	20/04/28 05:12:34
3	51	318.68748280896085	288.2753790226205	20/04/28 05:12:34
3	51	318.7108458811227	288.2693515168941	20/04/28 05:12:34
3	51	318.7507221414401	288.32325342732196	20/04/28 05:12:34
3	51	318.56581116280364	288.353385119183	20/04/28 05:12:34
3	51	318.451438287126	288.14842848541457	20/04/28 05:12:34
3	51	318.38886440541114	287.9912215949192	20/04/28 05:12:34
3	51	318.515248416185	287.8480467174714	20/04/28 05:12:34
3	51	318.4151392627629	287.9350884382327	20/04/28 05:12:34
3	51	318.44240733429785	287.96549423931316	20/04/28 05:12:35
3	51	318.45730705794864	287.94276981252386	20/04/28 05:12:35
3	51	318.3728165965914	288.21807305564494	20/04/28 05:12:35
3	51	318.4692181942456	288.15404236827834	20/04/28 05:12:35
3	51	318.6522366951884	288.04370682644213	20/04/28 05:12:35
3	51	318.51592847446005	288.182677141837	20/04/28 05:12:35
3	51	318.66692101887423	288.0873522623169	20/04/28 05:12:35
3	51	318.59656490093585	287.9985021709337	20/04/28 05:12:35
3	51	318.54714356446914	287.82853555578794	20/04/28 05:12:35
3	51	318.8274100333434	287.83875059572955	20/04/28 05:12:36
3	51	318.6174860929808	287.70188778352383	20/04/28 05:12:36
3	51	318.73685345252915	287.728211711318	20/04/28 05:12:36
3	51	318.7947281489047	287.51400382582	20/04/28 05:12:36
3	51	318.8020169177729	287.269469064775	20/04/28 05:12:36
3	51	318.63334015845146	287.1965215494219	20/04/28 05:12:36
3	51	318.72414606207997	287.0797983444693	20/04/28 05:12:36
3	51	318.8156882187978	287.17342328267347	20/04/28 05:12:36
3	51	318.61781644512064	287.1366217921771	20/04/28 05:12:36
3	51	318.71661198166174	287.358823850619	20/04/28 05:12:36
3	51	318.64333135524504	287.22995399098164	20/04/28 05:12:37
3	51	318.64330452087324	287.23097607725174	20/04/28 05:12:37
3	51	318.5781930570849	287.2049607159242	20/04/28 05:12:37
3	51	318.5432767057457	287.311559453211	20/04/28 05:12:37
3	51	318.5441065368866	287.3405609671152	20/04/28 05:12:37
3	51	318.5950022738569	287.5340605352711	20/04/28 05:12:37
3	51	318.59695166307614	287.5354603292544	20/04/28 05:12:37
3	51	318.46803397398855	287.55111270507854	20/04/28 05:12:37
3	51	318.69177430222925	287.46719104328406	20/04/28 05:12:37
3	51	318.58040639249583	287.72647471868584	20/04/28 05:12:37
3	51	318.63703167317607	287.9676063390584	20/04/28 05:12:38
3	51	318.65163640884424	288.00623187754746	20/04/28 05:12:38
3	51	318.7691571256772	288.2696311675228	20/04/28 05:12:38
3	51	318.5374987627665	288.3457245590787	20/04/28 05:12:38
3	51	318.55433306506944	288.3360361416405	20/04/28 05:12:38
3	51	318.67655471038745	288.3303774916297	20/04/28 05:12:38
3	51	318.63536771415215	288.26540294023005	20/04/28 05:12:38
3	51	318.6130127051277	288.0916271734022	20/04/28 05:12:38
3	51	318.5013917618344	288.3292026410587	20/04/28 05:12:38
3	51	318.50533074074053	288.4002824064738	20/04/28 05:12:39
3	51	318.3354114226098	288.4907444794604	20/04/28 05:12:39
3	51	318.3303997881621	288.49071913701977	20/04/28 05:12:39
3	51	318.3341650808892	288.47510373621503	20/04/28 05:12:39
3	51	318.4708830199578	288.459549965633	20/04/28 05:12:39
3	51	318.2715997838522	288.5094589205881	20/04/28 05:12:39
3	51	318.19794048929884	288.58131242079435	20/04/28 05:12:39
3	51	318.19802557719873	288.5811770338347	20/04/28 05:12:39
3	51	318.2468617219829	288.5031269011336	20/04/28 05:12:39
3	51	318.2126533971083	288.3548224992199	20/04/28 05:12:39
3	51	317.99785244677986	288.236037796369	20/04/28 05:12:40
3	51	317.78798878977256	288.2032968329081	20/04/28 05:12:40
3	51	317.8151128220706	288.21550281150803	20/04/28 05:12:40
3	51	317.87223490102997	288.4237160349025	20/04/28 05:12:40
3	51	318.05001239893363	288.6092425034905	20/04/28 05:12:40
3	51	318.16618989551927	288.56346968187984	20/04/28 05:12:40
3	51	318.31706867611916	288.6310306231728	20/04/28 05:12:40
3	51	318.3990449596816	288.6993809943039	20/04/28 05:12:40
3	51	318.2540521057708	288.6043477988023	20/04/28 05:12:40
3	51	318.1353170459975	288.6758911792323	20/04/28 05:12:41
3	51	318.1353170459975	288.6758911792323	20/04/28 05:12:41
3	51	318.1353170459975	288.6758911792323	20/04/28 05:12:41
3	51	318.1844143329484	288.4820020091485	20/04/28 05:12:41
3	51	318.1885916039207	288.22688325860497	20/04/28 05:12:41
3	51	317.97493232208427	288.27770617718403	20/04/28 05:12:41
3	51	317.99508613939577	288.2748071872776	20/04/28 05:12:41
3	51	317.8615326759185	288.42165179687436	20/04/28 05:12:41
3	51	317.9032814023326	288.7137508337351	20/04/28 05:12:41
3	51	317.8979742386577	288.8362478527737	20/04/28 05:12:41
3	51	318.0984886350147	288.9911372822539	20/04/28 05:12:42
3	51	318.1124788323894	289.0093320233428	20/04/28 05:12:42
3	51	318.116655135616	289.2540670051356	20/04/28 05:12:42
3	51	318.322853727674	289.33597566346583	20/04/28 05:12:42
3	51	318.39976972115915	289.20565785674654	20/04/28 05:12:42
3	51	318.37613098878955	289.2504261433929	20/04/28 05:12:42
3	51	318.37595344499044	289.18830796876887	20/04/28 05:12:42
3	51	318.26844473429446	288.9162665120707	20/04/28 05:12:42
3	51	318.2696749371282	288.7026897819376	20/04/28 05:12:42
3	51	318.4661732497755	288.70926330918206	20/04/28 05:12:42
3	51	318.6841273386875	288.5908017744178	20/04/28 05:12:43
3	51	318.5674882884084	288.71875547248015	20/04/28 05:12:43
3	51	318.6852941755555	288.52120555631325	20/04/28 05:12:43
3	51	318.62275016176756	288.2929877616558	20/04/28 05:12:43
3	51	318.72447243954304	288.2761788612786	20/04/28 05:12:43
3	51	318.71134435986716	288.5706646930896	20/04/28 05:12:43
3	51	318.76569871598133	288.57793854379497	20/04/28 05:12:43
3	51	318.92356784722415	288.4147322523118	20/04/28 05:12:43
3	51	318.9909886253727	288.2446897749004	20/04/28 05:12:43
3	51	318.78204058565365	288.28399635190294	20/04/28 05:12:44
3	51	318.5950443838582	288.35462949926637	20/04/28 05:12:44
3	51	318.76334484170206	288.5521680443481	20/04/28 05:12:44
3	51	318.57540878430615	288.5264759558033	20/04/28 05:12:44
3	51	318.49557420652064	288.4384475192771	20/04/28 05:12:44
3	51	318.45055064050433	288.1647922845394	20/04/28 05:12:44
3	51	318.4563999268443	288.1506669342611	20/04/28 05:12:44
3	51	318.5073266208315	288.29803724763724	20/04/28 05:12:44
3	51	318.5056154107424	288.2962683189015	20/04/28 05:12:44
3	51	318.4814785430988	288.35748099239896	20/04/28 05:12:44
3	51	318.4812328031698	288.36171971928263	20/04/28 05:12:45
3	51	318.56178639849014	288.1178932448985	20/04/28 05:12:45
3	51	318.56464475178535	288.1193523562939	20/04/28 05:12:45
3	51	318.5242087196328	287.86406210241466	20/04/28 05:12:45
3	51	318.61172183514134	287.8469064316794	20/04/28 05:12:45
3	51	318.6165704050691	287.59435967214023	20/04/28 05:12:45
3	51	318.81332742853607	287.41080555170015	20/04/28 05:12:45
3	51	318.946288994529	287.1983844923273	20/04/28 05:12:45
3	51	319.057725402413	287.18703880287734	20/04/28 05:12:45
3	51	319.0865984283159	287.4069554623115	20/04/28 05:12:45
3	51	319.1406582344206	287.39860584025405	20/04/28 05:12:46
3	51	319.06573656172884	287.26499594075057	20/04/28 05:12:46
3	51	319.1982826789428	287.0628241257463	20/04/28 05:12:46
3	51	319.2416386172192	287.34794737680846	20/04/28 05:12:46
3	51	319.24534961420704	287.3485307409824	20/04/28 05:12:46
3	51	319.281157083226	287.3970524993706	20/04/28 05:12:46
3	51	319.25894997287827	287.31813095092565	20/04/28 05:12:46
3	51	319.37450697764814	287.0941358590527	20/04/28 05:12:46
3	51	319.437803799027	287.23601953736835	20/04/28 05:12:46
3	51	319.4521967033587	287.1514152509313	20/04/28 05:12:47
3	51	319.4647687274891	287.2885469797673	20/04/28 05:12:47
3	51	319.5739556901375	287.3696721987376	20/04/28 05:12:47
3	51	319.4938339115901	287.34997688775104	20/04/28 05:12:47
3	51	319.5958246299889	287.58986301294607	20/04/28 05:12:47
3	51	319.78414989341957	287.50866514831347	20/04/28 05:12:47
3	51	319.5505322490295	287.4822119799749	20/04/28 05:12:47
3	51	319.6066175152122	287.5616744561161	20/04/28 05:12:47
3	51	319.8585629641316	287.593215706119	20/04/28 05:12:47
3	51	319.7775175692853	287.5431854851584	20/04/28 05:12:47
3	51	319.67945150227496	287.47116479679045	20/04/28 05:12:48
3	51	319.6926440685744	287.47569870818586	20/04/28 05:12:48
3	51	319.5928597796607	287.65344027912454	20/04/28 05:12:48
3	51	319.43152734733906	287.6816515673591	20/04/28 05:12:48
3	51	319.4805402355688	287.61365867591564	20/04/28 05:12:48
3	51	319.56800517091386	287.78672086073044	20/04/28 05:12:48
3	51	319.5482815262364	287.7743356047654	20/04/28 05:12:48
3	51	319.54817196103676	287.6163864992695	20/04/28 05:12:48
3	51	319.67809804347195	287.7263871631979	20/04/28 05:12:48
3	51	319.6765438989571	287.72220032296894	20/04/28 05:12:49
3	51	319.39996554742254	287.70520699302904	20/04/28 05:12:49
3	51	319.31330754110195	287.7789838823473	20/04/28 05:12:49
3	51	319.45878042570143	287.74034555542835	20/04/28 05:12:49
3	51	319.44792646569783	287.76367685460735	20/04/28 05:12:49
3	51	319.4765182158806	287.92650523412493	20/04/28 05:12:49
3	51	319.65353229166436	288.0440812442271	20/04/28 05:12:49
3	51	319.6586436574513	288.0481942030366	20/04/28 05:12:49
3	51	319.5386625722705	288.30549219968043	20/04/28 05:12:49
3	51	319.39570220926817	288.1265331603562	20/04/28 05:12:49
3	51	319.42829040488766	288.09042866905696	20/04/28 05:12:50
3	51	319.36857845804815	288.1099648524222	20/04/28 05:12:50
3	51	319.186924951038	288.04078363863806	20/04/28 05:12:50
3	51	319.3180992650863	288.0375772561534	20/04/28 05:12:50
3	51	319.1823522210752	288.09398189580526	20/04/28 05:12:50
3	51	319.30613025087234	288.3254408050313	20/04/28 05:12:50
3	51	319.3422972373956	288.24426082181617	20/04/28 05:12:50
3	51	319.34158935485857	288.2261711821758	20/04/28 05:12:50
3	51	319.38279200182734	288.1494837804601	20/04/28 05:12:50
3	51	319.18083283290485	287.9769287186741	20/04/28 05:12:50
3	51	319.17963146808444	287.9793829334253	20/04/28 05:12:51
3	51	319.1495935769931	287.9280263188762	20/04/28 05:12:51
3	51	319.1386154343049	288.13754030593066	20/04/28 05:12:51
3	51	318.9374896296058	288.14613822964566	20/04/28 05:12:51
3	51	318.9374896296058	288.14613822964566	20/04/28 05:12:51
3	51	318.963870560528	288.5491988266462	20/04/28 05:12:51
3	51	318.85249720290597	288.6741984044682	20/04/28 05:12:51
3	51	318.8182619994797	288.65103411396103	20/04/28 05:12:51
3	51	318.71214166376103	288.68408956117617	20/04/28 05:12:51
3	51	318.7046876173003	288.62393099588877	20/04/28 05:12:52
3	51	318.7046876173003	288.62393099588877	20/04/28 05:12:52
3	51	318.85071792578555	288.81794544907797	20/04/28 05:12:52
3	51	318.85071792578555	288.81794544907797	20/04/28 05:12:52
3	51	318.7484527460503	288.85045540110053	20/04/28 05:12:52
3	51	318.76305261025334	288.90824847980525	20/04/28 05:12:52
3	51	318.8471049332835	288.8362034943418	20/04/28 05:12:52
3	51	318.6103483142985	288.779900427662	20/04/28 05:12:52
3	51	318.5064127066562	288.79340151466465	20/04/28 05:12:52
3	51	318.70852280638974	288.68492740330214	20/04/28 05:12:52
3	51	318.77998503571234	288.6502785684974	20/04/28 05:12:53
3	51	318.7385458094573	288.4815735378937	20/04/28 05:12:53
3	51	318.69622236072166	288.4716500767763	20/04/28 05:12:53
3	51	318.8942668995763	288.53397311864904	20/04/28 05:12:53
3	51	318.924059514857	288.3162828951987	20/04/28 05:12:53
3	51	319.0745823272359	288.5438950417873	20/04/28 05:12:53
3	51	319.09404614688344	288.58329792261986	20/04/28 05:12:53
3	51	319.15544854260577	288.7077294640093	20/04/28 05:12:53
3	51	319.35852148485054	288.88343969183325	20/04/28 05:12:53
3	51	319.25751463615927	288.6838266183021	20/04/28 05:12:54
3	51	319.3118725110461	288.7872299908932	20/04/28 05:12:54
3	51	319.4114848551696	288.8359000055495	20/04/28 05:12:54
3	51	319.3444091977721	288.71268734696423	20/04/28 05:12:54
3	51	319.36029071700534	288.7657516103574	20/04/28 05:12:54
3	51	319.2851698597957	288.817791095377	20/04/28 05:12:54
3	51	319.08489165067374	288.69952991379165	20/04/28 05:12:54
3	51	319.12878777488856	288.68263641878406	20/04/28 05:12:54
3	51	319.1253777310685	288.68576156389844	20/04/28 05:12:54
3	51	319.2772392803887	288.5106639785421	20/04/28 05:12:54
3	51	319.5120491302326	288.4281991102592	20/04/28 05:12:55
3	51	319.4223114899201	288.6489753359625	20/04/28 05:12:55
3	51	319.47714055715835	288.42347599500965	20/04/28 05:12:55
3	51	319.6886304390503	288.52635295454706	20/04/28 05:12:55
3	51	319.64474135515826	288.30058588108903	20/04/28 05:12:55
3	51	319.8205078506776	288.51974290692016	20/04/28 05:12:55
3	51	319.83638828175714	288.4819063617524	20/04/28 05:12:55
3	51	319.9259722796296	288.4996737734091	20/04/28 05:12:55
3	51	319.62952241551085	288.45676696661405	20/04/28 05:12:55
3	51	319.4854428324772	288.531200137929	20/04/28 05:12:55
3	51	319.3528726046458	288.5569329242525	20/04/28 05:12:56
3	51	319.416454683048	288.75048821117764	20/04/28 05:12:56
3	51	319.4071716846712	288.5678266910558	20/04/28 05:12:56
3	51	319.1934019179146	288.4891851385852	20/04/28 05:12:56
3	51	319.2631083612742	288.23287283906416	20/04/28 05:12:56
3	51	319.1839225510841	288.0615139096827	20/04/28 05:12:56
3	51	319.32268260181434	287.94246749097357	20/04/28 05:12:56
3	51	319.21116039453386	287.99523591332223	20/04/28 05:12:56
3	51	319.45731243373405	287.89735320009385	20/04/28 05:12:56
3	51	319.31766688701344	287.9861066466678	20/04/28 05:12:57
3	51	319.33354779173646	287.90000526781864	20/04/28 05:12:57
3	51	319.2689226396297	288.02544653625125	20/04/28 05:12:57
3	51	319.39568212711185	287.89520770226864	20/04/28 05:12:57
3	51	319.3312578254414	287.779987288125	20/04/28 05:12:57
3	51	319.3312578254414	287.779987288125	20/04/28 05:12:57
3	51	319.09359350603705	287.8040341821436	20/04/28 05:12:57
3	51	319.09359350603705	287.8040341821436	20/04/28 05:12:57
3	51	319.2187683163337	287.83277404875554	20/04/28 05:12:57
3	51	319.11105306492544	287.70309629058625	20/04/28 05:12:57
3	51	319.12934393668115	287.795332569301	20/04/28 05:12:58
3	51	319.3913362260907	287.81296631624423	20/04/28 05:12:58
3	51	319.378953755877	288.0570780529121	20/04/28 05:12:58
3	51	319.378953755877	288.0570780529121	20/04/28 05:12:58
3	51	319.3022664784558	288.0834311947864	20/04/28 05:12:58
3	51	319.3022664784558	288.0834311947864	20/04/28 05:12:58
3	51	319.1314887674718	287.9550186144963	20/04/28 05:12:58
3	51	319.1121919255713	287.88306337179637	20/04/28 05:12:58
3	51	319.08439987487253	288.087307162515	20/04/28 05:12:58
3	51	319.09007272373117	288.30495661187274	20/04/28 05:12:59
3	51	319.09007272373117	288.30495661187274	20/04/28 05:12:59
3	51	318.8814294391033	288.27786824865325	20/04/28 05:12:59
3	51	319.0803862182196	288.4335099779973	20/04/28 05:12:59
3	51	319.0959349957925	288.16353494867394	20/04/28 05:12:59
3	51	319.0959349957925	288.16353494867394	20/04/28 05:12:59
3	51	319.0373633843207	288.31351018911465	20/04/28 05:12:59
3	51	319.07252517116586	288.1994311260633	20/04/28 05:12:59
3	51	318.97863945499023	288.0268282348207	20/04/28 05:12:59
3	51	318.7609738662265	288.1222523446766	20/04/28 05:12:59
3	51	319.00241803428094	288.1215937895133	20/04/28 05:13:00
3	51	318.87746521735505	288.16764221911	20/04/28 05:13:00
3	51	319.144469045399	288.27499400734513	20/04/28 05:13:00
3	51	319.1300187182276	288.45402777908043	20/04/28 05:13:00
3	51	319.0516533426542	288.4883509321747	20/04/28 05:13:00
3	51	318.993081985441	288.49748797754324	20/04/28 05:13:00
3	51	319.15613647376057	288.6334602036169	20/04/28 05:13:00
3	51	319.0040043411071	288.79944105390246	20/04/28 05:13:00
3	51	319.0036816637156	288.8047935363983	20/04/28 05:13:00
3	51	319.1356037162946	289.03649757131456	20/04/28 05:13:00
3	51	318.93877625512295	288.94282222615675	20/04/28 05:13:01
3	51	318.8047481512429	288.80560698201504	20/04/28 05:13:01
3	51	318.8150556043507	289.05332512170355	20/04/28 05:13:01
3	51	318.6467919916142	289.1645835753187	20/04/28 05:13:01
3	51	318.58857752081997	289.0156545561181	20/04/28 05:13:01
3	51	318.7404130015067	289.1125444308186	20/04/28 05:13:01
3	51	318.76500396276384	289.03806681477835	20/04/28 05:13:01
3	51	318.51418349725674	288.9410140991644	20/04/28 05:13:01
3	51	318.47517371155305	288.94626137844057	20/04/28 05:13:01
3	51	318.26131873775546	288.73948784036133	20/04/28 05:13:02
3	51	318.346154734209	288.7390464861732	20/04/28 05:13:02
3	51	318.5466750533034	288.78889471474935	20/04/28 05:13:02
3	51	318.47095794110123	288.8567112459369	20/04/28 05:13:02
3	51	318.4666708498226	289.08600002497843	20/04/28 05:13:02
3	51	318.62782787424794	289.13426171146057	20/04/28 05:13:02
3	51	318.51742534269755	289.2008501527712	20/04/28 05:13:02
3	51	318.57279260759725	289.17260420460747	20/04/28 05:13:02
3	51	318.56175786676005	289.4387517381834	20/04/28 05:13:02
3	51	318.37065798211745	289.4336170175626	20/04/28 05:13:02
3	51	318.34520417481565	289.4201164139566	20/04/28 05:13:03
3	51	318.413009465766	289.43064314937	20/04/28 05:13:03
3	51	318.3767275234442	289.41371497875593	20/04/28 05:13:03
3	51	318.44217591332114	289.49083257268217	20/04/28 05:13:03
3	51	318.4573923640725	289.22149553056465	20/04/28 05:13:03
3	51	318.44814161212804	289.3154830774395	20/04/28 05:13:03
3	51	318.2575530158141	289.2247299107483	20/04/28 05:13:03
3	51	318.0694384401663	289.26184495924696	20/04/28 05:13:03
3	51	317.81647868050356	289.3430103587869	20/04/28 05:13:03
3	51	317.790187689486	289.31171691989556	20/04/28 05:13:03
3	51	317.84574861290946	289.177538302374	20/04/28 05:13:04
3	51	317.9328629246155	289.18859283817034	20/04/28 05:13:04
3	51	318.03410223392314	288.98829503030186	20/04/28 05:13:04
3	51	317.89467275667806	289.245688272958	20/04/28 05:13:04
3	51	318.005750099994	289.4125812394644	20/04/28 05:13:04
3	51	317.96851334638484	289.44988674110124	20/04/28 05:13:04
3	51	317.96252666216094	289.44336535326096	20/04/28 05:13:04
3	51	318.1052116450448	289.5799247835591	20/04/28 05:13:04
3	51	318.0024387293148	289.66010187425985	20/04/28 05:13:04
3	51	317.9833183430677	289.57910304443385	20/04/28 05:13:05
3	51	318.03629631175903	289.7202489755064	20/04/28 05:13:05
3	51	318.2098167481949	289.57073802694885	20/04/28 05:13:05
3	51	318.225897598254	289.57657137411064	20/04/28 05:13:05
3	51	318.15021010574986	289.2937681498586	20/04/28 05:13:05
3	51	318.19620524442956	289.29582806058085	20/04/28 05:13:05
3	51	318.2025190816398	289.1318439275552	20/04/28 05:13:05
3	51	318.20064888452083	289.1320172651673	20/04/28 05:13:05
3	51	318.238342072439	289.0084373644009	20/04/28 05:13:05
3	51	318.1632691108834	289.10706711995726	20/04/28 05:13:05
3	51	318.2659549541587	289.2054765979506	20/04/28 05:13:06
3	51	318.19369053923816	289.1946495537529	20/04/28 05:13:06
3	51	318.38460571120174	289.1540830598302	20/04/28 05:13:06
3	51	318.3778142021224	288.986644034629	20/04/28 05:13:06
3	51	318.4316228356129	288.7039103706536	20/04/28 05:13:06
3	51	318.4081357466897	288.7458580150913	20/04/28 05:13:06
3	51	318.1979982610167	288.63850971238406	20/04/28 05:13:06
3	51	318.1979982610167	288.63850971238406	20/04/28 05:13:06
3	51	318.1979982610167	288.63850971238406	20/04/28 05:13:06
3	51	318.07567597594607	288.583699935998	20/04/28 05:13:06
3	51	318.2790893180853	288.4399751561552	20/04/28 05:13:07
3	51	318.3451566240423	288.45823623101364	20/04/28 05:13:07
3	51	318.3518390343764	288.4406812310646	20/04/28 05:13:07
3	51	318.32221664067725	288.42184272131874	20/04/28 05:13:07
3	51	318.5390354940625	288.5361322472647	20/04/28 05:13:07
3	51	318.48809340795344	288.3907837125306	20/04/28 05:13:07
3	51	318.50989376003577	288.33176477070435	20/04/28 05:13:07
3	51	318.4613285323889	288.3195897031402	20/04/28 05:13:07
3	51	318.4613285323889	288.3195897031402	20/04/28 05:13:07
3	51	318.4613285323889	288.3195897031402	20/04/28 05:13:08
3	51	318.532095568684	288.23667251008396	20/04/28 05:13:08
3	51	318.53319068148744	288.23404953415536	20/04/28 05:13:08
3	51	318.55945476659946	288.1539611036225	20/04/28 05:13:08
3	51	318.6106901197669	288.287563862373	20/04/28 05:13:08
3	51	318.63268687197547	288.36528558150377	20/04/28 05:13:08
3	51	318.45004278469037	288.5793918400229	20/04/28 05:13:08
3	51	318.4684327047181	288.48472698718035	20/04/28 05:13:08
3	51	318.54598894621796	288.4928007897778	20/04/28 05:13:08
3	51	318.5354465964203	288.4460423395863	20/04/28 05:13:08
3	51	318.3961971079149	288.33650886786467	20/04/28 05:13:09
3	51	318.233321721768	288.25373755252247	20/04/28 05:13:09
3	51	318.06900864944265	288.356948001011	20/04/28 05:13:09
3	51	317.9495061195519	288.265225554764	20/04/28 05:13:09
3	51	317.68594957620496	288.1844024843056	20/04/28 05:13:09
3	51	317.9507897002392	288.21311736461445	20/04/28 05:13:09
3	51	318.0685773193611	288.35951884716826	20/04/28 05:13:09
3	51	318.0714148151886	288.3473026678513	20/04/28 05:13:09
3	51	317.96175901536196	288.28903186271134	20/04/28 05:13:09
3	51	318.0618881732387	288.13207724069105	20/04/28 05:13:09
3	51	318.16825056999403	288.1831369860491	20/04/28 05:13:10
3	51	318.2040940529322	288.18927196943775	20/04/28 05:13:10
3	51	318.393312528309	288.34432495707574	20/04/28 05:13:10
3	51	318.56341990103573	288.3598120650952	20/04/28 05:13:10
3	51	318.54080982321807	288.2050191548201	20/04/28 05:13:10
3	51	318.54265122726423	288.21844086686883	20/04/28 05:13:10
3	51	318.46859306867543	288.2043747435937	20/04/28 05:13:10
3	51	318.3078400249244	288.3972537606814	20/04/28 05:13:10
3	51	318.07866899080875	288.38000327630164	20/04/28 05:13:10
3	51	318.0800676164246	288.38241785269594	20/04/28 05:13:11
3	51	318.33809072517926	288.2749193993265	20/04/28 05:13:11
3	51	318.43563312554363	288.18274372239864	20/04/28 05:13:11
3	51	318.42937541969235	288.1889254459363	20/04/28 05:13:11
3	51	318.3372196919112	288.1564370712133	20/04/28 05:13:11
3	51	318.6339087766943	288.1218360206594	20/04/28 05:13:11
3	51	318.807329449141	287.89892366441956	20/04/28 05:13:11
3	51	318.72556650487775	288.05862518721165	20/04/28 05:13:11
3	51	318.78945883578973	287.9320699788144	20/04/28 05:13:11
3	51	318.78575306348574	287.89595111866817	20/04/28 05:13:11
3	51	318.58690558448717	288.1191839602515	20/04/28 05:13:12
3	51	318.74193696249966	288.007886322782	20/04/28 05:13:12
3	51	318.69525141403113	287.73360247207734	20/04/28 05:13:12
3	51	318.71469325176514	287.7316358965518	20/04/28 05:13:12
3	51	318.74513349629876	287.8229379921682	20/04/28 05:13:12
3	51	318.7641712869205	288.07603796528946	20/04/28 05:13:12
3	51	318.7487174100421	288.0741287838011	20/04/28 05:13:12
3	51	318.74750213102186	287.9839504231355	20/04/28 05:13:12
3	51	318.75111363786544	287.819626179031	20/04/28 05:13:12
3	51	318.72649442824917	287.8930865012036	20/04/28 05:13:13
3	51	318.973275633215	288.0252848270137	20/04/28 05:13:13
3	51	318.97724415350814	287.8307019964786	20/04/28 05:13:13
3	51	318.8978785251718	287.9652396443226	20/04/28 05:13:13
3	51	319.11208068513923	288.04580309269886	20/04/28 05:13:13
3	51	319.0824512790953	288.1906945211669	20/04/28 05:13:13
3	51	319.07129159220545	288.31291296715904	20/04/28 05:13:13
3	51	319.1189646129696	288.3217688660124	20/04/28 05:13:13
3	51	319.0618188898225	288.27928039079376	20/04/28 05:13:13
3	51	319.057667095601	287.98843062002624	20/04/28 05:13:13
3	51	319.0015342852617	288.06542185420733	20/04/28 05:13:14
3	51	319.0864667360009	288.07006370510874	20/04/28 05:13:14
3	51	318.84876503968724	288.08921424015017	20/04/28 05:13:14
3	51	318.97055557132506	288.2280165729325	20/04/28 05:13:14
3	51	318.7299486550978	288.1679686843546	20/04/28 05:13:14
3	51	318.9011945680874	288.1109649276121	20/04/28 05:13:14
3	51	318.98975828906	288.36398254680057	20/04/28 05:13:14
3	51	319.01750350409316	288.38695946300714	20/04/28 05:13:14
3	51	319.10187748692846	288.5207356095759	20/04/28 05:13:14
3	51	319.24146016717214	288.56783657719	20/04/28 05:13:14
3	51	319.23381622709235	288.52036600513594	20/04/28 05:13:15
3	51	319.42745528145826	288.6225110582699	20/04/28 05:13:15
3	51	319.3494385736185	288.57080323118424	20/04/28 05:13:15
3	51	319.34241709628384	288.56179637082886	20/04/28 05:13:15
3	51	319.34221515801426	288.5654269513042	20/04/28 05:13:15
3	51	319.34153286810766	288.5635696786526	20/04/28 05:13:15
3	51	319.2046518017926	288.4376086205406	20/04/28 05:13:15
3	51	319.1698571065644	288.4564447545172	20/04/28 05:13:15
3	51	319.15483237379095	288.43559411013547	20/04/28 05:13:15
3	51	319.4020341428617	288.4276047222259	20/04/28 05:13:16
3	51	319.39147765746634	288.38236768005765	20/04/28 05:13:16
3	51	319.4508800324239	288.2906596369967	20/04/28 05:13:16
3	51	319.64990790994665	288.31975327890945	20/04/28 05:13:16
3	51	319.829652699212	288.2454726919917	20/04/28 05:13:16
3	51	319.8368176527227	288.2655104979237	20/04/28 05:13:16
3	51	320.0392945923979	288.19671371829827	20/04/28 05:13:16
3	51	320.19287984532446	288.2855597819297	20/04/28 05:13:16
3	51	320.1137792283625	288.1181942207432	20/04/28 05:13:16
3	51	320.30419633831735	288.05756087853746	20/04/28 05:13:16
3	51	320.29567999556	288.0115923615538	20/04/28 05:13:17
3	51	320.2342807097939	288.01603988359017	20/04/28 05:13:17
3	51	320.12557749587876	287.97029218950735	20/04/28 05:13:17
3	51	320.02071689420205	287.93070793737036	20/04/28 05:13:17
3	51	319.92997199144406	287.801279855397	20/04/28 05:13:17
3	51	319.87577840543884	287.5967965269865	20/04/28 05:13:17
3	51	319.9217818749615	287.51512365711716	20/04/28 05:13:17
3	51	319.92174373051296	287.5140693767012	20/04/28 05:13:17
3	51	319.89777743623847	287.2178261521557	20/04/28 05:13:17
3	51	320.0689540322649	287.42427602193476	20/04/28 05:13:17
3	51	320.06474597161366	287.4277332493801	20/04/28 05:13:18
3	51	319.8954023861707	287.34859059309827	20/04/28 05:13:18
3	51	320.0200335198962	287.09622688834094	20/04/28 05:13:18
3	51	319.96547394482053	287.2884326890311	20/04/28 05:13:18
3	51	320.1337572449523	287.25537138779316	20/04/28 05:13:18
3	51	320.0762728269822	287.40232039395806	20/04/28 05:13:18
3	51	320.0001205140619	287.2977824972804	20/04/28 05:13:18
3	51	320.00491553760327	287.3498995393707	20/04/28 05:13:18
3	51	320.28654984610904	287.3103597164273	20/04/28 05:13:18
3	51	320.3445692034128	287.4014411100051	20/04/28 05:13:19
3	51	320.4222201916008	287.29449016314373	20/04/28 05:13:19
3	51	320.4222201916008	287.29449016314373	20/04/28 05:13:19
3	51	320.4222201916008	287.29449016314373	20/04/28 05:13:19
3	51	320.49597973919475	287.37512825752503	20/04/28 05:13:19
3	51	320.49606221720626	287.43876636472964	20/04/28 05:13:19
3	51	320.6930886489598	287.3569000690864	20/04/28 05:13:19
3	51	320.8282316310762	287.29113190252366	20/04/28 05:13:19
3	51	320.8121690399091	287.25476932766935	20/04/28 05:13:19
3	51	320.71526377769237	287.269924529917	20/04/28 05:13:19
3	51	320.7410131105403	287.3970314285162	20/04/28 05:13:20
3	51	320.77202931855516	287.5229606039603	20/04/28 05:13:20
3	51	320.5880214446678	287.7428215226183	20/04/28 05:13:20
3	51	320.73380787703775	287.70697262193323	20/04/28 05:13:20
3	51	320.6622493048563	287.44031613061236	20/04/28 05:13:20
3	51	320.65219508340476	287.59398871898077	20/04/28 05:13:20
3	51	320.65675067350344	287.51218682525314	20/04/28 05:13:20
3	51	320.59600970356945	287.5746939397279	20/04/28 05:13:20
3	51	320.41549491114984	287.5090008668579	20/04/28 05:13:20
3	51	320.51535945555514	287.4828387211835	20/04/28 05:13:20
3	51	320.41575801417275	287.4450564187393	20/04/28 05:13:21
3	51	320.4883643276661	287.5861613030481	20/04/28 05:13:21
3	51	320.35402226177064	287.5705320028546	20/04/28 05:13:21
3	51	320.3828149483049	287.77467271460887	20/04/28 05:13:21
3	51	320.4886876437992	287.68211359380064	20/04/28 05:13:21
3	51	320.25588617687936	287.5124612178253	20/04/28 05:13:21
3	51	320.22173047322445	287.5965160386648	20/04/28 05:13:21
3	51	320.302917472846	287.4190678909741	20/04/28 05:13:21
3	51	320.04250604810255	287.36068065872485	20/04/28 05:13:21
3	51	319.98187304503915	287.38773425118643	20/04/28 05:13:22
3	51	319.86925329657015	287.27716000937716	20/04/28 05:13:22
3	51	319.90941990754794	287.3048680090952	20/04/28 05:13:22
3	51	319.9630981502124	287.3390839269745	20/04/28 05:13:22
3	51	319.8187317502571	287.33110802540364	20/04/28 05:13:22
3	51	319.72720257002993	287.51803345992084	20/04/28 05:13:22
3	51	319.64138099367057	287.2631109980788	20/04/28 05:13:22
3	51	319.59442616710004	287.1707360219816	20/04/28 05:13:22
3	51	319.5488574234981	287.1746837668273	20/04/28 05:13:22
3	51	319.36112843028974	287.0206904938773	20/04/28 05:13:22
3	51	319.2761973964322	287.0001878674449	20/04/28 05:13:23
3	51	319.39615807826135	287.1903294007677	20/04/28 05:13:23
3	51	319.4925343538574	287.26321428537983	20/04/28 05:13:23
3	51	319.5680545428097	287.27266946188456	20/04/28 05:13:23
3	51	319.56380630801766	287.1074967549203	20/04/28 05:13:23
3	51	319.5643868187702	287.2247277200511	20/04/28 05:13:23
3	51	319.47195819029935	287.2379131277322	20/04/28 05:13:23
3	51	319.54397504531266	287.36501946951313	20/04/28 05:13:23
3	51	319.54397504531266	287.36501946951313	20/04/28 05:13:23
3	51	319.54397504531266	287.36501946951313	20/04/28 05:13:23
3	51	319.5432479252224	287.3656821177877	20/04/28 05:13:24
3	51	319.7212041294304	287.3466427451331	20/04/28 05:13:24
3	51	319.7069845243662	287.32598007760475	20/04/28 05:13:24
3	51	319.9116670843021	287.22795753195356	20/04/28 05:13:24
3	51	319.95656577791374	287.19842740184407	20/04/28 05:13:24
3	51	319.87870736736556	287.2763375748394	20/04/28 05:13:24
3	51	319.9353852127241	287.30630287576884	20/04/28 05:13:24
3	51	319.9884002119397	287.31335327274513	20/04/28 05:13:24
3	51	319.87530824509344	287.5437214016917	20/04/28 05:13:24
3	51	319.8146816422465	287.38117889467424	20/04/28 05:13:25
3	51	319.81956906234404	287.34867644018794	20/04/28 05:13:25
3	51	319.81956906234404	287.34867644018794	20/04/28 05:13:25
