<robot name="human">
  <include filename="$(find multiple_robot_gazebo)/object/human.gazebo"/>
  <link name="base_link">

    <inertial>
      <origin xyz="0 0 0" rpy="0 0 0" />
      <mass value="0.5" />
      <inertia ixx="3" ixy="0.0" ixz="0.0" iyy="3" iyz="0.0" izz="3" />
    </inertial>

    <visual>
      <origin rpy="0 0 0" xyz="-0.156 -0.08 0"/>
      <geometry>
        <mesh filename="package://multiple_robot_gazebo/object/meshes/human.stl" scale="0.1 0.1 0.1"/>
      </geometry>
    </visual>

    <collision>
      <origin rpy="0 0 0" xyz="-0.156 -0.08 0"/>
      <geometry>
        <mesh filename="package://multiple_robot_gazebo/object/meshes/human.stl" scale="0.1 0.1 0.1"/>
      </geometry>
    </collision>
  </link>
</robot>


