{"path": "/home/eaibot/dashgo_ws/src/dashgo/dashgo_nav/maps/map1183181.pgm", "isUsed": false, "id": "2018-04-17_14:02:31", "name": "map1183181"}
{"path": "/home/eaibot/dashgo_ws/src/dashgo/dashgo_nav/maps/map1184181.pgm", "id": "2018-04-17_11:33:37", "name": "map1184181", "isUsed": false}
{"path": "/home/eaibot/dashgo_ws/src/dashgo/dashgo_nav/maps/map0420.pgm", "isUsed": false, "id": "2018-04-17_12:31:17", "name": "map0420"}
{"path": "/home/eaibot/dashgo_ws/src/dashgo/dashgo_nav/maps/map042001.pgm", "isUsed": false, "id": "2018-04-17_17:30:11", "name": "map042001"}
{"path": "/home/eaibot/dashgo_ws/src/dashgo/dashgo_nav/maps/map0423.pgm", "isUsed": false, "id": "2018-04-17_11:14:06", "name": "map0423"}
{"path": "/home/eaibot/dashgo_ws/src/dashgo/dashgo_nav/maps/map042301.pgm", "id": "2018-04-17_11:21:23", "name": "map042301", "isUsed": false}
{"path": "/home/eaibot/dashgo_ws/src/dashgo/dashgo_nav/maps/map042302.pgm", "isUsed": false, "id": "2018-04-17_11:42:43", "name": "map042302"}
{"path": "/home/eaibot/dashgo_ws/src/dashgo/dashgo_nav/maps/dt.pgm", "id": "2018-04-17_12:07:28", "name": "dt", "isUsed": false}
{"path": "/home/eaibot/dashgo_ws/src/dashgo/dashgo_nav/maps/vg.pgm", "isUsed": false, "id": "2018-04-17_12:30:29", "name": "vg"}
{"path": "/home/eaibot/dashgo_ws/src/dashgo/dashgo_nav/maps/noimu1.pgm", "id": "2018-04-17_12:01:34", "name": "noimu1", "isUsed": false}
{"path": "/home/eaibot/dashgo_ws/src/dashgo/dashgo_nav/maps/map042401.pgm", "isUsed": false, "id": "2018-04-17_12:18:37", "name": "map042401"}
{"path": "/home/eaibot/dashgo_ws/src/dashgo/dashgo_nav/maps/Bbb.pgm", "isUsed": false, "id": "2018-04-17_11:22:41", "name": "Bbb"}
{"path": "/home/eaibot/dashgo_ws/src/dashgo/dashgo_nav/maps/696..pgm", "isUsed": false, "id": "2018-04-17_11:09:13", "name": "696."}
{"path": "/home/eaibot/dashgo_ws/src/dashgo/dashgo_nav/maps/6972.pgm", "id": "2018-04-17_11:09:23", "name": "6972", "isUsed": false}
{"path": "/home/eaibot/dashgo_ws/src/dashgo/dashgo_nav/maps/5826.pgm", "isUsed": true, "id": "2018-04-17_11:14:40", "name": "5826"}
