G04*
G04 #@! TF.GenerationSoftware,Altium Limited,Altium Designer,20.0.10 (225)*
G04*
G04 Layer_Physical_Order=2*
G04 Layer_Color=16711680*
%FSLAX25Y25*%
%MOIN*%
G70*
G01*
G75*
%ADD18C,0.01181*%
%ADD43R,0.06000X0.06000*%
%ADD74C,0.03543*%
%ADD80R,0.07874X0.07874*%
%ADD81R,0.07874X0.07874*%
%ADD82C,0.10050*%
%ADD83C,0.10500*%
%ADD84R,0.06000X0.06000*%
%ADD85R,0.19685X0.19685*%
D18*
X238189Y227854D02*
X241732Y224311D01*
Y217323D02*
Y224311D01*
X238189Y227854D02*
Y271654D01*
X343110Y290158D02*
X374114Y259154D01*
X309547Y290158D02*
X343110D01*
X374114Y259154D02*
X390945D01*
X295079Y275689D02*
X309547Y290158D01*
X306988Y280512D02*
X311122Y276378D01*
X300295Y273327D02*
X305413Y268209D01*
Y247342D02*
Y268209D01*
X311122Y252854D02*
Y276378D01*
X267520Y275689D02*
X295079D01*
X311122Y252854D02*
X320571Y243406D01*
X308366Y252362D02*
X324705Y236024D01*
X303543Y275984D02*
X308366Y271161D01*
Y252362D02*
Y271161D01*
X320571Y243406D02*
X335827D01*
X341929Y237303D01*
X303543Y275984D02*
Y276772D01*
X332382Y236024D02*
X342224Y226181D01*
X324705Y236024D02*
X332382D01*
X305413Y247342D02*
X312992Y239764D01*
X313090D01*
X392992Y251279D02*
Y257106D01*
X390945Y259154D02*
X392992Y257106D01*
X381594Y244193D02*
X382992Y245590D01*
Y251279D01*
X358268Y244193D02*
X381594D01*
X355512Y246949D02*
X358268Y244193D01*
X351181Y255807D02*
X355512Y251476D01*
Y246949D02*
Y251476D01*
X351181Y255807D02*
X355512Y260138D01*
X328346Y255807D02*
X351181D01*
X351476Y261811D02*
Y266437D01*
X324606Y259055D02*
X348721D01*
X351476Y261811D01*
X355512Y260138D02*
Y269488D01*
X348031Y273327D02*
X348130Y273425D01*
X351575D01*
X355512Y269488D01*
X342126Y219390D02*
X342224Y219488D01*
X342126Y199114D02*
Y219390D01*
X266437Y246457D02*
X266929Y245965D01*
X270276D01*
X278642Y237598D01*
X298031Y198917D02*
Y207095D01*
X300492Y209556D02*
Y209646D01*
X298031Y207095D02*
X300492Y209556D01*
D43*
X237008Y310630D02*
D03*
Y318504D02*
D03*
Y334252D02*
D03*
Y326378D02*
D03*
D74*
X235039Y277953D02*
D03*
Y260630D02*
D03*
X241732Y217323D02*
D03*
X306988Y280512D02*
D03*
X300295Y273327D02*
D03*
X238189Y271654D02*
D03*
X341929Y237303D02*
D03*
X303543Y276772D02*
D03*
X342224Y226181D02*
D03*
X313090Y239764D02*
D03*
X267520Y275689D02*
D03*
X328346Y255807D02*
D03*
X324606Y259055D02*
D03*
X348031Y273327D02*
D03*
X351476Y266437D02*
D03*
X342126Y199114D02*
D03*
X342224Y219488D02*
D03*
X266437Y246457D02*
D03*
X278642Y237598D02*
D03*
X298031Y198917D02*
D03*
X300492Y209646D02*
D03*
D80*
X400394Y180551D02*
D03*
Y190551D02*
D03*
X250787Y169291D02*
D03*
Y159291D02*
D03*
X224016Y235787D02*
D03*
Y225787D02*
D03*
Y205787D02*
D03*
Y215787D02*
D03*
X268110Y159468D02*
D03*
Y169468D02*
D03*
Y189469D02*
D03*
Y179469D02*
D03*
Y199528D02*
D03*
Y209528D02*
D03*
Y229528D02*
D03*
Y219528D02*
D03*
D81*
X372992Y251279D02*
D03*
X362992D02*
D03*
X382992D02*
D03*
X392992D02*
D03*
D82*
X364488Y357165D02*
D03*
Y377165D02*
D03*
X344488D02*
D03*
Y357165D02*
D03*
X240079D02*
D03*
Y377165D02*
D03*
X220079D02*
D03*
Y357165D02*
D03*
D83*
X354488Y367165D02*
D03*
X230079D02*
D03*
D84*
X357087Y124628D02*
D03*
X349213D02*
D03*
D85*
X317460Y117717D02*
D03*
X289113D02*
D03*
M02*
