def exp_to_lvlup(level):
    # How much exp to rank up?
    nmult=150.0
    nmult+=level/35.0
    nmult+=level/10.0
    nmult+=level/6.0
    nmult+=level/2.0
    nmult=nmult**1.01
    next_exp=int(level*nmult)
    return next_exp

i=0;tb=[]
while i <= 100:
    x=exp_to_lvlup(i);tb.append(x); print "Level %d = %d" % (i, x);i+=1

Level 0 = 0
Level 1 = 158
Level 2 = 318
Level 3 = 480
Level 4 = 644
Level 5 = 809
Level 6 = 976
Level 7 = 1145
Level 8 = 1315
Level 9 = 1487
Level 10 = 1661
Level 11 = 1836
Level 12 = 2014
Level 13 = 2192
Level 14 = 2373
Level 15 = 2555
Level 16 = 2739
Level 17 = 2925
Level 18 = 3112
Level 19 = 3301
Level 20 = 3492
Level 21 = 3684
Level 22 = 3878
Level 23 = 4074
Level 24 = 4271
Level 25 = 4470
Level 26 = 4671
Level 27 = 4874
Level 28 = 5078
Level 29 = 5284
Level 30 = 5491
Level 31 = 5701
Level 32 = 5912
Level 33 = 6124
Level 34 = 6339
Level 35 = 6555
Level 36 = 6772
Level 37 = 6992
Level 38 = 7213
Level 39 = 7436
Level 40 = 7660
Level 41 = 7886
Level 42 = 8114
Level 43 = 8344
Level 44 = 8575
Level 45 = 8808
Level 46 = 9043
Level 47 = 9279
Level 48 = 9517
Level 49 = 9757
Level 50 = 9999
Level 51 = 10242
Level 52 = 10487
Level 53 = 10733
Level 54 = 10981
Level 55 = 11231
Level 56 = 11483
Level 57 = 11736
Level 58 = 11991
Level 59 = 12248
Level 60 = 12506
Level 61 = 12767
Level 62 = 13028
Level 63 = 13292
Level 64 = 13557
Level 65 = 13824
Level 66 = 14092
Level 67 = 14363
Level 68 = 14635
Level 69 = 14908
Level 70 = 15184
Level 71 = 15461
Level 72 = 15740
Level 73 = 16020
Level 74 = 16302
Level 75 = 16586
Level 76 = 16872
Level 77 = 17159
Level 78 = 17448
Level 79 = 17738
Level 80 = 18031
Level 81 = 18325
Level 82 = 18621
Level 83 = 18918
Level 84 = 19217
Level 85 = 19518
Level 86 = 19820
Level 87 = 20125
Level 88 = 20431
Level 89 = 20738
Level 90 = 21048
Level 91 = 21359
Level 92 = 21671
Level 93 = 21986
Level 94 = 22302
Level 95 = 22620
Level 96 = 22939
Level 97 = 23260
Level 98 = 23583
Level 99 = 23908
Level 100 = 24234

