{
    "Main": [
        [
            "The Academy",
            0,
            "bgm02",
            {
                "name": "Tutorial", 
                "quest_id": 1
            }, 
            {
                "name": "Quest 2", 
                "quest_id": 2
            }, 
            {
                "name": "Quest 3", 
                "quest_id": 3
            }, 
            {
                "name": "Quest 4", 
                "quest_id": 4
            }, 
            {
                "name": "Quest 5", 
                "quest_id": 5
            }
        ], 
        [
            "The Stronghold", 
            5, 
            "bgm02",
            {
                "name": "Quest 6", 
                "quest_id": 6
            }, 
            {
                "name": "Quest 7", 
                "quest_id": 7
            }, 
            {
                "name": "Quest 8", 
                "quest_id": 8
            }, 
            {
                "name": "Quest 9", 
                "quest_id": 9
            }, 
            {
                "name": "Quest 10", 
                "quest_id": 10
            }
        ], 
        [
            "Forest Path", 
            10, 
            "bgm02",
            {
                "name": "Quest 11", 
                "quest_id": 11
            }, 
            {
                "name": "Quest 12", 
                "quest_id": 12
            }, 
            {
                "name": "Quest 13", 
                "quest_id": 13
            }, 
            {
                "name": "Quest 14", 
                "quest_id": 14
            }, 
            {
                "name": "Final Quest", 
                "quest_id": 15
            }
        ], 
        [
            "Forest of Fae", 
            99999, 
            "bgm02",
            {
                "name": "WIP", 
                "quest_id": 90000
            }
        ], 
        [
            "{b}Special{/b}",
            5,
            "bgm02",
            {
                "name": "Fairy World I", 
                "quest_id": 90000
            }, 
            {
                "name": "Rise of Spheres I", 
                "quest_id": 90001
            },
            {
                "name": "Fairy World II", 
                "quest_id": 90002
            } 
        ], 
        [
            "Daily Quests", 
            99999, 
            "bgm02",
            {
                "name": "Daily Quest", 
                "quest_id": 90001
            }
        ]
    ]
}
