{
  "$id": "dateCreated.json",
  "$schema": "http://json-schema.org/draft-07/schema#",
  "title": "Creation Date",
  "description": "The creation date in ISO 8601 format: YYYY-MM-DD",
  "$ref": "iso8601date.json"
}