{

    "creator": [
          {
                "name": "Niccolò Zagli",
                "type": "Person"
          }
    ],
    "keywords": [
          "20304 Thermodynamics and Statistical Physics"
    ],
    "about": [ ],
    "description": "Here are the data about the linear response experiments for the Desai Zwanzig model with additive perturbation",
    "inLanguage": [ ],
    "isAccessibleForFree": true,
    "type": [
          "Dataset"
    ],
    "mainEntityOfPage": [
          {
                "dateCreated": "2021-04-08",
                "provider": {
                      "name": "DataCite",
                      "id": "https://search.datacite.org",
                      "type": "Service"
                },
                "dateModified": "2021-04-08",
                "id": "https://search.datacite.org/works/10.6084/M9.FIGSHARE.14387675"
          }
    ],
    "@context": [
          "https://example.org/other-context-url",
          {
                "@language": "de"
          }
    ],
    "datePublished": "2021-01-01",
    "license": {
          "id": "https://creativecommons.org/licenses/by/4.0/"
    },
    "name": "Data for Desai-Zwanzig Response Additive perturbation",
    "publisher": [
          {
                "name": "figshare",
                "type": "Organization"
          }
    ],
    "id": "https://doi.org/10.6084/M9.FIGSHARE.14387675"

}