{
  "kind": "collectionType",
  "collectionName": "news_cards",
  "info": {
    "singularName": "news-card",
    "pluralName": "news-cards",
    "displayName": "News-card",
    "name": "news-card"
  },
  "options": {
    "increments": true,
    "timestamps": true,
    "draftAndPublish": true
  },
  "pluginOptions": {},
  "attributes": {
    "title": {
      "type": "string",
      "required": true
    },
    "message": {
      "type": "richtext"
    }
  }
}
