{
	"astro-ph": "Astrophysics and Astronomy",
"hep-ph": "Physics",
"quant-ph": "Quantum Physics",
"hep-th": "Quantum Physics",
"cs.CV": "Computer Vision and Pattern Recognition",
"cond-mat.mtrl-sci": "Materials Science and Engineering",
"cond-mat.mes-hall": "Physics",
"math.AP": "Dynamics/Dynamical Systems",
"gr-qc": "Cosmology, Relativity, and Gravity",
"astro-ph.GA": "External Galaxies",
"math.CO": "Discrete Mathematics and Combinatorics",
"astro-ph.SR": "The Sun and the Solar System",
"cond-mat.str-el": "Atomic, Molecular and Optical Physics",
"math.PR": "Statistics and Probability",
"astro-ph.CO": "Cosmology",
"astro-ph.HE": "Physical Processes",
"math.NT": "Number Theory",
"nucl-th": "Nonlinear Sciences",
"cond-mat.stat-mech": "Applied Mathematics",
"math.AG": "Algebraic Geometry",
"hep-ex": "Physics",
"cs.CL": "Computational Linguistics",
"cond-mat.supr-con": "Mechanics of Materials",
"math.DG": "Geometry and Topology",
"physics.optics": "Optics",
"math.OC": "Mathematics",
"astro-ph.EP": "The Sun and the Solar System",
"cond-mat.soft": "Condensed Matter Physics",
"math.DS": "Dynamics/Dynamical Systems",
"math.FA": "Analysis",
"cs.LG": "Machine Learning",
"hep-lat": "Physics",
"cond-mat": "Condensed Matter Physics",
"math.NA": "Numerical Analysis and Computation",
"physics.flu-dyn": "Fluid Dynamics",
"cs.NI": "Digital Communications and Networking",
"cs.CR": "Cryptography and Security",
"math.CA": "Analysis",
"stat.ME": "Statistical Methodology",
"cs.AI": "Artificial Intelligence", 
"cs.RO": "Robotics", 
"math.GT": "Geometry and Topology", 
"astro-ph.IM": "Instrumentation", 
"math.GR": "Set Theory", 
"nucl-ex": "Nonlinear Sciences", 
"cs.DS": "Theory/Algorithms", 
"physics.gen-ph": "Physics", 
"cs.SE": "Software Engineering", 
"math.RT": "Mathematics", 
"eess.SP": "Signal Processing",
"physics.plasm-ph": "Plasma and Beam Physics",
"physics.atom-ph": "Atomic, Molecular and Optical Physics",
"math.LO": "Logic and Foundations",
"cs.DC": "Digital Communications and Networking",
"math.RA": "Algebra", 
"math.CV": "Complex Variables",
"cond-mat.quant-gas": "Quantum Physics",
"cs.LO": "Theory/Algorithms",
"stat.AP": "Applied Statistics",
"physics.ins-det": "Instrumentation",
"physics.chem-ph": "Biological and Chemical Physics",
"math.AC": "Algebra",
"cond-mat.other": "Condensed Matter Physics",
"physics.acc-ph": "Physics",
"cs.CY": "Computers and Society",
"cond-mat.dis-nn": "Condensed Matter Physics",
"math.AT": "Geometry and Topology",
"cs.HC": "Human Computer Interfaces",
"nlin.CD": "Nonlinear Sciences",
"math.OA": "Algebra",
"physics.soc-ph": "Physics and Society",
"math.GM": "Mathematics",
"cs.DB": "Databases/Information Systems",
"cs.SY": "Controls and Control Theory",
"physics.app-ph": "Physics",
"cs.GT": "Computer Science and Game Theory", 
"q-bio.PE": "Population Biology", 
"math.QA": "Algebra",
"cs.IR": "Computer Sciences",
"math.MG": "Geometry and Topology",
"q-bio.NC": "Motor Control",
"cs.PL": "Programming Languages/Compilers",
"physics.class-ph": "Physics", 
"nlin.SI": "Nonlinear Sciences", 
"cs.NE": "Artificial Intelligence", 
"cs.SI": "Digital Communications and Networking",
"cs.CC": "Theory/Algorithms",
"cs.CG": "Computational Geometry",
"physics.comp-ph": "Computational Physics",
"nlin.PS": "Nonlinear Sciences",
"physics.med-ph": "Medical Physics",
"physics.geo-ph": "Geophysics and Seismology",
"math.GN": "Geometry and Topology",
"physics.ed-ph": "Physics Education",
"cs.OH": "Computer Sciences",
"math.SG": "Geometry and Topology",
"stat.ML": "Machine Learning",
"cs.DL": "Digital Libraries",
"math.SP": "Applied Mathematics",
"math.HO": "Mathematics History and Overview",
"stat.CO": "Statistics and Probability",
"math.CT": "Category Theory",
"physics.ao-ph": "Atmospheric Sciences", 
"cs.DM": "Discrete Mathematics and Combinatorics", 
"cs.FL": "Programming Languages/Compilers",
"physics.bio-ph": "Biological and Chemical Physics",
"cs.CE": "Computational Engineering",
"cs.AR": "Hardware Systems",
"q-bio.QM": "Quantitative Methods", 
"eess.IV": "Image and Video Processing", 
"physics.hist-ph": "History and Philosophy of Physics",
"q-bio.BM": "Molecular Biology",
"cs.GR": "Human Computer Interfaces",
"nlin.AO": "Nonlinear Sciences",
"econ.EM": "Econometrics",
"physics.data-an": "Data Analysis, Statistics and Probability",
"q-bio.MN": "Molecular Biology",
"cs.MM": "Communication Technology and New Media",
"q-bio.GN": "Genomics",
"physics.space-ph": "Space Physics",
"cs.ET": "Computer Sciences",
"cs.MA": "Multiagent Systems",
"math.KT": "Algebraic Geometry",
"econ.TH": "Economic Theory",
"q-fin.MF": "Quantitative Finance",
"q-fin.GN": "Economics",
"q-fin.ST": "Quantitative Finance",
"physics.atm-clus": "Atomic, Molecular and Optical Physics",
"cs.SC": "Programming Languages/Compilers",
"q-bio.TO": "Tissues and Organs",
"q-bio.OT": "Other Quantitative Biology",
"physics.pop-ph": "Popular Physics",
"q-fin.RM": "Economics",
"eess.AS": "Audio and Speech Processing",
"cs.PF": "OS/Networks",
"q-fin.PR": "Economics",
"cs.SD": "Electrical and Computer Engineering",
"cs.NA": "Numerical Analysis and Computation",
"q-fin.CP": "Quantitative Finance",
"q-fin.TR": "Quantitative Finance",
"q-fin.PM": "Quantitative Finance",
"cs.MS": "Mathematical Software",
"q-bio.CB": "Cell Behavior",
"cs.OS": "OS/Networks",
"nlin.CG": "Nonlinear Sciences",
"q-bio.SC": "Molecular, cellular, and tissue engineering",
"q-fin.EC": "Economics",
"cs.GL": "Computer Sciences",
"stat.OT": "Statistics and Probability",
	"math-ph": "Mathematics",
	"cs.IT": "Information Theory",
	"math.ST": "Statistics and Probability"
}
