-DOCSTART- (S016816561300552X)

The	0,3	O	B-Process
transfer	4,12	O	I-Process
of	13,15	O	O
a	16,17	O	B-Process
laboratory	18,28	O	I-Process
process	29,36	O	I-Process
into	37,41	O	O
a	42,43	O	B-Material
manufacturing	44,57	O	I-Material
facility	58,66	O	I-Material
is	67,69	O	O
one	70,73	O	O
of	74,76	O	O
the	77,80	O	O
most	81,85	O	O
critical	86,94	O	O
steps	95,100	O	O
required	101,109	O	O
for	110,113	O	O
the	114,117	O	B-Process
large	118,123	O	I-Process
scale	124,129	O	I-Process
production	130,140	O	I-Process
of	141,143	O	O
cell	144,148	O	B-Material
-	148,149	O	I-Material
based	149,154	O	I-Material
therapy	155,162	O	I-Material
products	163,171	O	I-Material
.	171,172	O	O

This	173,177	O	O
study	178,183	O	O
describes	184,193	O	O
the	194,197	O	B-Method
first	198,203	O	I-Method
published	204,213	O	I-Method
protocol	214,222	O	I-Method
for	223,226	O	O
scalable	227,235	O	B-Process
automated	236,245	O	I-Process
expansion	246,255	O	I-Process
of	256,258	O	O
human	259,264	O	B-Material
induced	265,272	O	I-Material
pluripotent	273,284	O	I-Material
stem	285,289	O	I-Material
cell	290,294	O	I-Material
lines	295,300	O	I-Material
growing	301,308	O	B-Process
in	309,311	O	O
aggregates	312,322	O	B-Material
in	323,325	O	O
feeder	326,332	O	B-Material
-	332,333	O	I-Material
free	333,337	O	I-Material
and	338,341	O	I-Material
chemically	342,352	O	I-Material
defined	353,360	O	I-Material
medium	361,367	O	I-Material
.	367,368	O	O

Cells	369,374	O	B-Material
were	375,379	O	O
successfully	380,392	O	O
transferred	393,404	O	B-Process
between	405,412	O	O
different	413,422	O	B-Material
sites	423,428	O	I-Material
representative	429,443	O	O
of	444,446	O	O
research	447,455	O	B-Data
and	456,459	O	I-Data
manufacturing	460,473	O	I-Data
settings	474,482	O	I-Data
;	482,483	O	O
and	484,487	O	O
passaged	488,496	O	B-Process
manually	497,505	O	I-Process
and	506,509	O	O
using	510,515	O	O
the	516,519	O	B-Material
CompacT	520,527	O	I-Material
SelecT	528,534	O	I-Material
automation	535,545	O	I-Material
platform	546,554	O	I-Material
.	554,555	O	O

Modified	556,564	O	B-Process
protocols	565,574	O	I-Process
were	575,579	O	O
developed	580,589	O	O
for	590,593	O	O
the	594,597	O	B-Material
automated	598,607	O	I-Material
system	608,614	O	I-Material
and	615,618	O	O
the	619,622	O	B-Process
management	623,633	O	I-Process
of	634,636	O	O
cells	637,642	O	B-Material
aggregates	643,653	O	I-Material
(	654,655	O	I-Material
clumps	655,661	O	I-Material
)	661,662	O	I-Material
was	663,666	O	O
identified	667,677	O	O
as	678,680	O	O
the	681,684	O	O
critical	685,693	O	O
step	694,698	O	O
.	698,699	O	O

Cellular	700,708	O	B-Data
morphology	709,719	O	I-Data
,	719,720	O	O
pluripotency	721,733	O	B-Process
gene	734,738	O	I-Process
expression	739,749	O	I-Process
and	750,753	O	O
differentiation	754,769	O	B-Process
into	770,774	O	O
the	775,778	O	B-Material
three	779,784	O	I-Material
germ	785,789	O	I-Material
layers	790,796	O	I-Material
have	797,801	O	O
been	802,806	O	O
used	807,811	O	O
compare	812,819	O	B-Process
the	820,823	O	B-Data
outcomes	824,832	O	I-Data
of	833,835	O	O
manual	836,842	O	B-Process
and	843,846	O	I-Process
automated	847,856	O	I-Process
processes	857,866	O	I-Process
.	866,867	O	O

-DOCSTART- (S1873506114000075)

Familial	0,8	O	B-Process
amyloidotic	9,20	O	I-Process
polyneuropathy	21,35	O	I-Process
(	36,37	O	I-Process
FAP	37,40	O	I-Process
)	40,41	O	I-Process
is	42,44	O	O
a	45,46	O	B-Process
hereditary	47,57	O	I-Process
amyloidosis	58,69	O	I-Process
induced	70,77	O	B-Process
by	78,80	O	O
amyloidogenic	81,94	O	B-Material
transthyretin	95,108	O	I-Material
(	109,110	O	I-Material
ATTR	110,114	O	I-Material
)	114,115	O	I-Material
.	115,116	O	O

Because	117,124	O	O
most	125,129	O	B-Material
transthyretin	130,143	O	I-Material
(	144,145	O	I-Material
TTR	145,148	O	I-Material
)	148,149	O	I-Material
in	150,152	O	I-Material
serum	153,158	O	I-Material
is	159,161	O	O
synthesized	162,173	O	B-Process
by	174,176	O	O
the	177,180	O	B-Material
liver	181,186	O	I-Material
,	186,187	O	O
liver	188,193	O	B-Process
transplantation	194,209	O	I-Process
(	210,211	O	I-Process
LT	211,213	O	I-Process
)	213,214	O	I-Process
is	215,217	O	O
today	218,223	O	O
the	224,227	O	O
only	228,232	O	O
treatment	233,242	O	O
available	243,252	O	O
to	253,255	O	O
halt	256,260	O	B-Process
the	261,264	O	B-Process
progression	265,276	O	I-Process
of	277,279	O	I-Process
FAP	280,283	O	I-Process
,	283,284	O	O
even	285,289	O	O
though	290,296	O	O
LT	297,299	O	B-Process
is	300,302	O	O
associated	303,313	O	O
with	314,318	O	O
several	319,326	O	B-Process
problems	327,335	O	I-Process
.	335,336	O	O

Despite	337,344	O	O
the	345,348	O	O
urgent	349,355	O	O
need	356,360	O	O
to	361,363	O	O
develop	364,371	O	O
alternatives	372,384	O	O
to	385,387	O	O
LT	388,390	O	B-Process
,	390,391	O	O
the	392,395	O	B-Data
detailed	396,404	O	I-Data
pathogenesis	405,417	O	I-Data
of	418,420	O	O
FAP	421,424	O	B-Process
is	425,427	O	O
still	428,433	O	O
unknown	434,441	O	O
;	441,442	O	O
also	443,447	O	O
,	447,448	O	O
no	449,451	O	O
model	452,457	O	O
fully	458,463	O	O
represents	464,474	O	O
the	475,478	O	B-Process
relevant	479,487	O	I-Process
processes	488,497	O	I-Process
in	498,500	O	O
patients	501,509	O	B-Material
with	510,514	O	O
FAP	515,518	O	B-Process
.	518,519	O	O

The	520,523	O	B-Process
induction	524,533	O	I-Process
of	534,536	O	O
induced	537,544	O	B-Material
pluripotent	545,556	O	I-Material
stem	557,561	O	I-Material
(	562,563	O	I-Material
iPS	563,566	O	I-Material
)	566,567	O	I-Material
cells	568,573	O	I-Material
has	574,577	O	O
allowed	578,585	O	O
development	586,597	O	B-Process
of	598,600	O	O
pluripotent	601,612	O	B-Material
cells	613,618	O	I-Material
specific	619,627	O	O
for	628,631	O	O
patients	632,640	O	B-Material
and	641,644	O	O
has	645,648	O	O
led	649,652	O	O
to	653,655	O	O
useful	656,662	O	B-Material
models	663,669	O	I-Material
of	670,672	O	O
human	673,678	O	B-Process
diseases	679,687	O	I-Process
.	687,688	O	O

Because	689,696	O	O
of	697,699	O	O
the	700,703	O	O
need	704,708	O	O
for	709,712	O	O
a	713,714	O	O
tool	715,719	O	O
to	720,722	O	O
elucidate	723,732	O	B-Process
the	733,736	O	B-Data
molecular	737,746	O	I-Data
pathogenesis	747,759	O	I-Data
of	760,762	O	O
FAP	763,766	O	B-Process
,	766,767	O	O
in	768,770	O	O
this	771,775	O	O
study	776,781	O	O
we	782,784	O	O
sought	785,791	O	O
to	792,794	O	O
establish	795,804	O	O
heterozygous	805,817	O	B-Material
ATTR	818,822	O	I-Material
mutant	823,829	O	I-Material
iPS	830,833	O	I-Material
cells	834,839	O	I-Material
,	839,840	O	O
and	841,844	O	O
were	845,849	O	O
successful	850,860	O	O
,	860,861	O	O
by	862,864	O	O
using	865,870	O	O
a	871,872	O	B-Material
Sendai	873,879	O	I-Material
virus	880,885	O	I-Material
vector	886,892	O	I-Material
mixture	893,900	O	I-Material
containing	901,911	O	O
four	912,916	O	B-Material
transcription	917,930	O	I-Material
factors	931,938	O	I-Material
(	939,940	O	I-Material
Oct3/4	940,946	O	I-Material
,	946,947	O	I-Material
Sox2	948,952	O	I-Material
,	952,953	O	I-Material
Klf4	954,958	O	I-Material
,	958,959	O	I-Material
and	960,963	O	I-Material
c	964,965	O	I-Material
-	965,966	O	I-Material
Myc	966,969	O	I-Material
)	969,970	O	I-Material
to	971,973	O	O
reprogram	974,983	O	B-Process
dermal	984,990	O	B-Material
fibroblasts	991,1002	O	I-Material
derived	1003,1010	O	B-Process
from	1011,1015	O	O
FAP	1016,1019	O	B-Material
patients	1020,1028	O	I-Material
.	1028,1029	O	O

Moreover	1030,1038	O	O
,	1038,1039	O	O
FAP	1040,1043	O	B-Material
-	1043,1044	O	I-Material
specific	1044,1052	O	I-Material
iPS	1053,1056	O	I-Material
cells	1057,1062	O	I-Material
had	1063,1066	O	O
the	1067,1070	O	O
potential	1071,1080	O	O
to	1081,1083	O	O
differentiate	1084,1097	O	B-Process
into	1098,1102	O	O
hepatocyte	1103,1113	O	B-Material
-	1113,1114	O	I-Material
like	1114,1118	O	I-Material
cells	1119,1124	O	I-Material
and	1125,1128	O	O
indeed	1129,1135	O	O
expressed	1136,1145	O	B-Material
ATTR	1146,1150	O	I-Material
.	1150,1151	O	O

FAP	1152,1155	O	B-Material
-	1155,1156	O	I-Material
specific	1156,1164	O	I-Material
iPS	1165,1168	O	I-Material
cells	1169,1174	O	I-Material
demonstrated	1175,1187	O	O
the	1188,1191	O	O
possibility	1192,1203	O	O
of	1204,1206	O	O
serving	1207,1214	O	O
as	1215,1217	O	O
a	1218,1219	O	B-Method
pathological	1220,1232	O	I-Method
tool	1233,1237	O	I-Method
that	1238,1242	O	O
will	1243,1247	O	O
contribute	1248,1258	O	O
to	1259,1261	O	O
understanding	1262,1275	O	O
the	1276,1279	O	B-Data
pathogenesis	1280,1292	O	I-Data
of	1293,1295	O	O
FAP	1296,1299	O	B-Process
and	1300,1303	O	O
development	1304,1315	O	O
of	1316,1318	O	O
FAP	1319,1322	O	B-Process
treatments	1323,1333	O	I-Process
.	1333,1334	O	O

Highlights	1335,1345	O	O
•	1346,1347	O	O

We	1348,1350	O	O
established	1351,1362	O	O
,	1362,1363	O	O
for	1364,1367	O	O
the	1368,1371	O	O
first	1372,1377	O	O
time	1378,1382	O	O
,	1382,1383	O	O
FAP	1384,1387	O	B-Material
-	1387,1388	O	I-Material
specific	1388,1396	O	I-Material
iPS	1397,1400	O	I-Material
cells	1401,1406	O	I-Material
by	1407,1409	O	O
using	1410,1415	O	O
a	1416,1417	O	B-Material
Sendai	1418,1424	O	I-Material
virus	1425,1430	O	I-Material
.	1430,1431	O	O

•	1432,1433	O	O
FAP	1434,1437	O	B-Material
-	1437,1438	O	I-Material
specific	1438,1446	O	I-Material
iPS	1447,1450	O	I-Material
cells	1451,1456	O	I-Material
have	1457,1461	O	O
potential	1462,1471	O	O
to	1472,1474	O	O
differentiate	1475,1488	O	B-Process
into	1489,1493	O	O
hepatocyte	1494,1504	O	B-Material
-	1504,1505	O	I-Material
like	1505,1509	O	I-Material
cells	1510,1515	O	I-Material
.	1515,1516	O	O

•	1517,1518	O	O

Hepatocyte	1519,1529	O	B-Material
-	1529,1530	O	I-Material
like	1530,1534	O	I-Material
cells	1535,1540	O	I-Material
from	1541,1545	O	O
FAP	1546,1549	O	B-Material
-	1549,1550	O	I-Material
specific	1550,1558	O	I-Material
iPS	1559,1562	O	I-Material
cells	1563,1568	O	I-Material
indeed	1569,1575	O	O
expressed	1576,1585	O	B-Material
ATTR	1586,1590	O	I-Material
Val30Met	1591,1599	O	I-Material
.	1599,1600	O	O

•	1601,1602	O	O

FAP	1603,1606	O	B-Material
-	1606,1607	O	I-Material
specific	1607,1615	O	I-Material
iPS	1616,1619	O	I-Material
cells	1620,1625	O	I-Material
demonstrate	1626,1637	O	O
the	1638,1641	O	O
possibility	1642,1653	O	O
to	1654,1656	O	O
serve	1657,1662	O	O
as	1663,1665	O	O
a	1666,1667	O	B-Material
pathological	1668,1680	O	I-Material
tool	1681,1685	O	I-Material
.	1685,1686	O	O

-DOCSTART- (S2211124712002884)

The	0,3	O	B-Process
pathogenic	4,14	O	I-Process
mechanisms	15,25	O	I-Process
of	26,28	O	I-Process
frontotemporal	29,43	O	I-Process
dementia	44,52	O	I-Process
(	53,54	O	I-Process
FTD	54,57	O	I-Process
)	57,58	O	I-Process
remain	59,65	O	O
poorly	66,72	O	O
understood	73,83	O	O
.	83,84	O	O

Here	85,89	O	O
we	90,92	O	O
generated	93,102	O	B-Process
multiple	103,111	O	B-Material
induced	112,119	O	I-Material
pluripotent	120,131	O	I-Material
stem	132,136	O	I-Material
cell	137,141	O	I-Material
lines	142,147	O	I-Material
from	148,152	O	O
a	153,154	O	B-Material
control	155,162	O	I-Material
subject	163,170	O	I-Material
,	170,171	O	O
a	172,173	O	B-Material
patient	174,181	O	I-Material
with	182,186	O	O
sporadic	187,195	O	B-Process
FTD	196,199	O	I-Process
,	199,200	O	O
and	201,204	O	O
an	205,207	O	B-Material
FTD	208,211	O	I-Material
patient	212,219	O	I-Material
with	220,224	O	O
a	225,226	O	B-Process
novel	227,232	O	I-Process
heterozygous	233,245	O	I-Process
GRN	246,249	O	I-Process
mutation	250,258	O	I-Process
(	259,260	O	I-Process
progranulin	260,271	O	I-Process
[	272,273	O	I-Process
PGRN	273,277	O	I-Process
]	277,278	O	I-Process

S116X	279,284	O	I-Process
)	284,285	O	I-Process
.	285,286	O	O

In	287,289	O	O
neurons	290,297	O	B-Material
and	298,301	O	O
microglia	302,311	O	B-Material
differentiated	312,326	O	O
from	327,331	O	O
PGRN	332,336	O	B-Material
S116X	337,342	O	I-Material
induced	343,350	O	I-Material
pluripotent	351,362	O	I-Material
stem	363,367	O	I-Material
cells	368,373	O	I-Material
,	373,374	O	O
the	375,378	O	B-Data
levels	379,385	O	I-Data
of	386,388	O	O
intracellular	389,402	O	B-Material
and	403,406	O	I-Material
secreted	407,415	O	I-Material
PGRN	416,420	O	I-Material
were	421,425	O	O
reduced	426,433	O	O
,	433,434	O	O
establishing	435,447	O	O
patient	448,455	O	B-Material
-	455,456	O	I-Material
specific	456,464	O	I-Material
cellular	465,473	O	I-Material
models	474,480	O	I-Material
of	481,483	O	O
PGRN	484,488	O	B-Process
haploinsufficiency	489,507	O	I-Process
.	507,508	O	O

Through	509,516	O	O
a	517,518	O	B-Process
systematic	519,529	O	I-Process
screen	530,536	O	I-Process
of	537,539	O	O
inducers	540,548	O	B-Material
of	549,551	O	O
cellular	552,560	O	B-Process
stress	561,567	O	I-Process
,	567,568	O	O
we	569,571	O	O
found	572,577	O	O
that	578,582	O	O
PGRN	583,587	O	B-Material
S116X	588,593	O	I-Material
neurons	594,601	O	I-Material
,	601,602	O	O
but	603,606	O	O
not	607,610	O	O
sporadic	611,619	O	B-Material
FTD	620,623	O	I-Material
neurons	624,631	O	I-Material
,	631,632	O	O
exhibited	633,642	O	O
increased	643,652	O	B-Data
sensitivity	653,664	O	I-Data
to	665,667	O	O
staurosporine	668,681	O	B-Material
and	682,685	O	O
other	686,691	O	B-Material
kinase	692,698	O	I-Material
inhibitors	699,709	O	I-Material
.	709,710	O	O

Moreover	711,719	O	O
,	719,720	O	O
the	721,724	O	B-Material
serine	725,731	O	I-Material
/	731,732	O	I-Material
threonine	732,741	O	I-Material
kinase	742,748	O	I-Material
S6K2	749,753	O	I-Material
,	753,754	O	O
a	755,756	O	O
component	757,766	O	O
of	767,769	O	O
the	770,773	O	B-Material
phosphatidylinositol	774,794	O	I-Material
3-kinase	795,803	O	I-Material
and	804,807	O	I-Material
mitogen	808,815	O	I-Material
-	815,816	O	I-Material
activated	816,825	O	I-Material
protein	826,833	O	I-Material
kinase	834,840	O	I-Material
pathways	841,849	O	I-Material
,	849,850	O	O
was	851,854	O	O
specifically	855,867	O	O
downregulated	868,881	O	B-Process
in	882,884	O	O
PGRN	885,889	O	B-Material
S116X	890,895	O	I-Material
neurons	896,903	O	I-Material
.	903,904	O	O

Both	905,909	O	O
increased	910,919	O	B-Data
sensitivity	920,931	O	I-Data
to	932,934	O	O
kinase	935,941	O	B-Material
inhibitors	942,952	O	I-Material
and	953,956	O	O
reduced	957,964	O	B-Material
S6K2	965,969	O	I-Material
were	970,974	O	O
rescued	975,982	O	B-Process
by	983,985	O	O
PGRN	986,990	O	B-Process
expression	991,1001	O	I-Process
.	1001,1002	O	O

Our	1003,1006	O	O
findings	1007,1015	O	O
identify	1016,1024	O	O
cell	1025,1029	O	B-Data
-	1029,1030	O	I-Data
autonomous	1030,1040	O	I-Data
,	1040,1041	O	I-Data
reversible	1042,1052	O	I-Data
defects	1053,1060	O	I-Data
in	1061,1063	O	O
patient	1064,1071	O	B-Material
neurons	1072,1079	O	I-Material
with	1080,1084	O	O
PGRN	1085,1089	O	B-Data
deficiency	1090,1100	O	I-Data
,	1100,1101	O	O
and	1102,1105	O	O
provide	1106,1113	O	O
a	1114,1115	O	O
compelling	1116,1126	O	O
model	1127,1132	O	O
for	1133,1136	O	O
studying	1137,1145	O	B-Process
PGRN	1146,1150	O	B-Process
-	1150,1151	O	I-Process
dependent	1151,1160	O	I-Process
pathogenic	1161,1171	O	I-Process
mechanisms	1172,1182	O	I-Process
and	1183,1186	O	O
testing	1187,1194	O	B-Process
potential	1195,1204	O	B-Process
therapies	1205,1214	O	I-Process
.	1214,1215	O	O

Graphical	1216,1225	O	O
Abstract	1226,1234	O	O
Highlights	1235,1245	O	O

►	1246,1247	O	O

A	1248,1249	O	B-Method
human	1250,1255	O	I-Method
neuron	1256,1262	O	I-Method
model	1263,1268	O	I-Method
of	1269,1271	O	O
progranulin	1272,1283	O	B-Process
(	1284,1285	O	I-Process
PGRN	1285,1289	O	I-Process
)	1289,1290	O	I-Process
haploinsufficiency	1291,1309	O	I-Process
is	1310,1312	O	O
established	1313,1324	O	O
►	1325,1326	O	O

Sporadic	1327,1335	O	B-Material
and	1336,1339	O	I-Material
PGRN	1340,1344	O	I-Material
-	1344,1345	O	I-Material
deficient	1345,1354	O	I-Material
frontotemporal	1355,1369	O	I-Material
dementia	1370,1378	O	I-Material
patient	1379,1386	O	I-Material
iPSCs	1387,1392	O	B-Material
are	1393,1396	O	O
made	1397,1401	O	O
►	1402,1403	O	O

PGRN	1404,1408	O	B-Material
S116X	1409,1414	O	I-Material
mutant	1415,1421	O	I-Material
neurons	1422,1429	O	I-Material
are	1430,1433	O	O
sensitive	1434,1443	O	O
to	1444,1446	O	O
stress	1447,1453	O	B-Process
by	1454,1456	O	O
kinase	1457,1463	O	B-Material
inhibitors	1464,1474	O	I-Material

►	1475,1476	O	O

S6K2	1477,1481	O	B-Material
is	1482,1484	O	O
downregulated	1485,1498	O	B-Process
in	1499,1501	O	O
patient	1502,1509	O	B-Material
neurons	1510,1517	O	I-Material
in	1518,1520	O	O
a	1521,1522	O	B-Process
PGRN	1523,1527	O	I-Process
-	1527,1528	O	I-Process
dependent	1528,1537	O	I-Process
manner	1538,1544	O	I-Process
Progranulin	1545,1556	O	B-Process
(	1557,1558	O	I-Process
PGRN	1558,1562	O	I-Process
)	1562,1563	O	I-Process
mutations	1564,1573	O	I-Process
are	1574,1577	O	O
a	1578,1579	O	O
common	1580,1586	O	O
cause	1587,1592	O	O
of	1593,1595	O	O
frontotemporal	1596,1610	O	B-Process
dementia	1611,1619	O	I-Process
,	1619,1620	O	O
but	1621,1624	O	O
the	1625,1628	O	B-Process
underlying	1629,1639	O	I-Process
molecular	1640,1649	O	I-Process
mechanism	1650,1659	O	I-Process
is	1660,1662	O	O
unknown	1663,1670	O	O
.	1670,1671	O	O

Gao	1672,1675	O	O
and	1676,1679	O	O
colleagues	1680,1690	O	O
now	1691,1694	O	O
generate	1695,1703	O	O
multiple	1704,1712	O	B-Material
frontotemporal	1713,1727	O	I-Material
dementia	1728,1736	O	I-Material
patient	1737,1744	O	I-Material
-	1744,1745	O	I-Material
specific	1745,1753	O	I-Material
induced	1754,1761	O	I-Material
pluripotent	1762,1773	O	I-Material
stem	1774,1778	O	I-Material
cell	1779,1783	O	I-Material
lines	1784,1789	O	I-Material
and	1790,1793	O	O
establish	1794,1803	O	O
a	1804,1805	O	B-Method
human	1806,1811	O	I-Method
neuronal	1812,1820	O	I-Method
model	1821,1826	O	I-Method
of	1827,1829	O	O
PGRN	1830,1834	O	B-Process
haploinsufficiency	1835,1853	O	I-Process
.	1853,1854	O	O

Studies	1855,1862	O	O
on	1863,1865	O	O
human	1866,1871	O	B-Material
postmitotic	1872,1883	O	I-Material
neurons	1884,1891	O	I-Material
derived	1892,1899	O	O
from	1900,1904	O	O
these	1905,1910	O	B-Material
lines	1911,1916	O	I-Material
reveal	1917,1923	O	O
cell	1924,1928	O	B-Process
-	1928,1929	O	I-Process
autonomous	1929,1939	O	I-Process
and	1940,1943	O	I-Process
reversible	1944,1954	O	I-Process
defects	1955,1962	O	I-Process
in	1963,1965	O	O
specific	1966,1974	O	B-Material
signaling	1975,1984	O	I-Material
pathways	1985,1993	O	I-Material
that	1994,1998	O	O
are	1999,2002	O	O
compromised	2003,2014	O	O
in	2015,2017	O	O
PGRN	2018,2022	O	B-Material
-	2022,2023	O	I-Material
deficient	2023,2032	O	I-Material
neurons	2033,2040	O	I-Material
and	2041,2044	O	O
establish	2045,2054	O	O
a	2055,2056	O	B-Material
model	2057,2062	O	I-Material
system	2063,2069	O	I-Material
for	2070,2073	O	O
studying	2074,2082	O	B-Process
PGRN	2083,2087	O	B-Process
-	2087,2088	O	I-Process
dependent	2088,2097	O	I-Process
pathogenic	2098,2108	O	I-Process
mechanisms	2109,2119	O	I-Process
and	2120,2123	O	O
testing	2124,2131	O	B-Process
potential	2132,2141	O	B-Process
therapies	2142,2151	O	I-Process
.	2151,2152	O	O

-DOCSTART- (S2211124713006475)

Cranial	0,7	O	B-Material
placodes	8,16	O	I-Material
are	17,20	O	O
embryonic	21,30	O	B-Material
structures	31,41	O	I-Material
essential	42,51	O	O
for	52,55	O	O
sensory	56,63	O	B-Process
and	64,67	O	I-Process
endocrine	68,77	O	I-Process
organ	78,83	O	I-Process
development	84,95	O	I-Process
.	95,96	O	O

Human	97,102	O	B-Process
placode	103,110	O	I-Process
development	111,122	O	I-Process
has	123,126	O	O
remained	127,135	O	O
largely	136,143	O	O
inaccessible	144,156	O	O
despite	157,164	O	O
the	165,168	O	B-Data
serious	169,176	O	I-Data
medical	177,184	O	I-Data
conditions	185,195	O	I-Data
caused	196,202	O	O
by	203,205	O	O
the	206,209	O	B-Process
dysfunction	210,221	O	I-Process
of	222,224	O	O
placode	225,232	O	B-Material
-	232,233	O	I-Material
derived	233,240	O	I-Material
tissues	241,248	O	I-Material
.	248,249	O	O

Here	250,254	O	O
,	254,255	O	O
we	256,258	O	O
demonstrate	259,270	O	O
the	271,274	O	B-Process
efficient	275,284	O	I-Process
derivation	285,295	O	I-Process
of	296,298	O	O
cranial	299,306	O	B-Material
placodes	307,315	O	I-Material
from	316,320	O	O
human	321,326	O	B-Material
pluripotent	327,338	O	I-Material
stem	339,343	O	I-Material
cells	344,349	O	I-Material
.	349,350	O	O

Timed	351,356	O	B-Process
removal	357,364	O	I-Process
of	365,367	O	O
the	368,371	O	B-Material
BMP	372,375	O	I-Material
inhibitor	376,385	O	I-Material
Noggin	386,392	O	I-Material
,	392,393	O	O
a	394,395	O	O
component	396,405	O	O
of	406,408	O	O
the	409,412	O	B-Method
dual	413,417	O	I-Method
-	417,418	O	I-Method
SMAD	418,422	O	I-Method
inhibition	423,433	O	I-Method
strategy	434,442	O	I-Method
of	443,445	O	O
neural	446,452	O	B-Process
induction	453,462	O	I-Process
,	462,463	O	O
triggers	464,472	O	B-Process
placode	473,480	O	B-Process
induction	481,490	O	I-Process
at	491,493	O	O
the	494,497	O	O
expense	498,505	O	O
of	506,508	O	O
CNS	509,512	O	B-Data
fates	513,518	O	I-Data
.	518,519	O	O

Concomitant	520,531	O	B-Process
inhibition	532,542	O	I-Process
of	543,545	O	O
fibroblast	546,556	O	B-Process
growth	557,563	O	I-Process
factor	564,570	O	I-Process
signaling	571,580	O	I-Process
disrupts	581,589	O	B-Process
placode	590,597	O	B-Process
derivation	598,608	O	I-Process
and	609,612	O	O
induces	613,620	O	B-Process
surface	621,628	O	B-Material
ectoderm	629,637	O	I-Material
.	637,638	O	O

Further	639,646	O	O
fate	647,651	O	B-Data
specification	652,665	O	I-Data
at	666,668	O	O
the	669,672	O	B-Data
preplacode	673,683	O	I-Data
stage	684,689	O	I-Data
enables	690,697	O	O
the	698,701	O	B-Process
selective	702,711	O	I-Process
generation	712,722	O	I-Process
of	723,725	O	O
placode	726,733	O	B-Material
-	733,734	O	I-Material
derived	734,741	O	I-Material
trigeminal	742,752	O	I-Material
ganglia	753,760	O	I-Material
capable	761,768	O	O
of	769,771	O	O
in	772,774	O	B-Method
vivo	775,779	O	I-Method
engraftment	780,791	O	B-Process
,	791,792	O	O
mature	793,799	O	B-Material
lens	800,804	O	I-Material
fibers	805,811	O	I-Material
,	811,812	O	O
and	813,816	O	O
anterior	817,825	O	B-Material
pituitary	826,835	O	I-Material
hormone	836,843	O	I-Material
-	843,844	O	I-Material
producing	844,853	O	I-Material
cells	854,859	O	I-Material
that	860,864	O	O
upon	865,869	O	O
transplantation	870,885	O	B-Process
produce	886,893	O	O
human	894,899	O	B-Material
growth	900,906	O	I-Material
hormone	907,914	O	I-Material
and	915,918	O	O
adrenocorticotropic	919,938	O	B-Material
hormone	939,946	O	I-Material
in	947,949	O	B-Method
vivo	950,954	O	I-Method
.	954,955	O	O

Our	956,959	O	O
results	960,967	O	O
establish	968,977	O	O
a	978,979	O	B-Material
powerful	980,988	O	I-Material
experimental	989,1001	O	I-Material
platform	1002,1010	O	I-Material
to	1011,1013	O	O
study	1014,1019	O	O
human	1020,1025	O	B-Process
cranial	1026,1033	O	I-Process
placode	1034,1041	O	I-Process
development	1042,1053	O	I-Process
and	1054,1057	O	O
set	1058,1061	O	O
the	1062,1065	O	O
stage	1066,1071	O	O
for	1072,1075	O	O
the	1076,1079	O	B-Process
development	1080,1091	O	I-Process
of	1092,1094	O	O
human	1095,1100	O	B-Process
cell	1101,1105	O	I-Process
-	1105,1106	O	I-Process
based	1106,1111	O	I-Process
therapies	1112,1121	O	I-Process
in	1122,1124	O	O
sensory	1125,1132	O	B-Process
and	1133,1136	O	I-Process
endocrine	1137,1146	O	I-Process
disease	1147,1154	O	I-Process
.	1154,1155	O	O

Graphical	1156,1165	O	O
Abstract	1166,1174	O	O
Highlights	1175,1185	O	O
•	1186,1187	O	O
Timed	1188,1193	O	B-Process
withdrawal	1194,1204	O	I-Process
of	1205,1207	O	O
BMP	1208,1211	O	B-Material
inhibitor	1212,1221	O	I-Material
is	1222,1224	O	O
sufficient	1225,1235	O	O
to	1236,1238	O	O
induce	1239,1245	O	B-Process
placode	1246,1253	O	B-Data
fates	1254,1259	O	I-Data
from	1260,1264	O	O
hESCs	1265,1270	O	B-Material
•	1271,1272	O	O
Timed	1273,1278	O	B-Process
FGF	1279,1282	O	I-Process
inhibition	1283,1293	O	I-Process
suppresses	1294,1304	O	B-Process
placode	1305,1312	O	B-Data
fate	1313,1317	O	I-Data
and	1318,1321	O	O
induces	1322,1329	O	B-Process
epidermal	1330,1339	O	B-Material
lineage	1340,1347	O	I-Material
•	1348,1349	O	O
Placode	1350,1357	O	B-Material
-	1357,1358	O	I-Material
derived	1358,1365	O	I-Material
trigeminal	1366,1376	O	I-Material
neurons	1377,1384	O	I-Material
are	1385,1388	O	O
functional	1389,1399	O	B-Process
in	1400,1402	O	B-Method
vitro	1403,1408	O	I-Method
and	1409,1412	O	O
engraft	1413,1420	O	B-Process
in	1421,1423	O	B-Method
vivo	1424,1428	O	I-Method
•	1429,1430	O	O
Pituitary	1431,1440	O	B-Material
placode	1441,1448	O	I-Material
-	1448,1449	O	I-Material
derived	1449,1456	O	I-Material
cells	1457,1462	O	I-Material
are	1463,1466	O	O
capable	1467,1474	O	O
of	1475,1477	O	O
hormone	1478,1485	O	B-Process
release	1486,1493	O	I-Process
in	1494,1496	O	B-Method
vitro	1497,1502	O	I-Method
and	1503,1506	O	I-Method
in	1507,1509	O	I-Method
vivo	1510,1514	O	I-Method

Cranial	1515,1522	O	B-Material
placodes	1523,1531	O	I-Material
are	1532,1535	O	O
essential	1536,1545	O	O
for	1546,1549	O	O
the	1550,1553	O	B-Process
development	1554,1565	O	I-Process
of	1566,1568	O	O
sensory	1569,1576	O	B-Material
and	1577,1580	O	I-Material
endocrine	1581,1590	O	I-Material
organs	1591,1597	O	I-Material
.	1597,1598	O	O

Here	1599,1603	O	O
,	1603,1604	O	O
Studer	1605,1611	O	O
and	1612,1615	O	O
colleagues	1616,1626	O	O
report	1627,1633	O	O
the	1634,1637	O	B-Process
efficient	1638,1647	O	I-Process
derivation	1648,1658	O	I-Process
of	1659,1661	O	O
cranial	1662,1669	O	B-Material
placodes	1670,1678	O	I-Material
from	1679,1683	O	O
human	1684,1689	O	B-Material
pluripotent	1690,1701	O	I-Material
stem	1702,1706	O	I-Material
cells	1707,1712	O	I-Material
.	1712,1713	O	O

They	1714,1718	O	O
demonstrate	1719,1730	O	O
how	1731,1734	O	O
to	1735,1737	O	O
obtain	1738,1744	O	O
specific	1745,1753	O	B-Material
placode	1754,1761	O	I-Material
derivatives	1762,1773	O	I-Material
such	1774,1778	O	O
as	1779,1781	O	O
trigeminal	1782,1792	O	B-Material
ganglia	1793,1800	O	I-Material
capable	1801,1808	O	O
of	1809,1811	O	O
in	1812,1814	O	B-Method
vivo	1815,1819	O	I-Method
engraftment	1820,1831	O	B-Process
,	1831,1832	O	O
mature	1833,1839	O	B-Material
lens	1840,1844	O	I-Material
fibers	1845,1851	O	I-Material
,	1851,1852	O	O
and	1853,1856	O	O
anterior	1857,1865	O	B-Material
pituitary	1866,1875	O	I-Material
cells	1876,1881	O	I-Material
capable	1882,1889	O	O
of	1890,1892	O	O
producing	1893,1902	O	B-Process
human	1903,1908	O	B-Material
GH	1909,1911	O	I-Material
and	1912,1915	O	I-Material
ACTH	1916,1920	O	I-Material
in	1921,1923	O	B-Method
vivo	1924,1928	O	I-Method
.	1928,1929	O	O

Their	1930,1935	O	O
results	1936,1943	O	O
establish	1944,1953	O	O
a	1954,1955	O	B-Material
platform	1956,1964	O	I-Material
for	1965,1968	O	O
studying	1969,1977	O	B-Process
human	1978,1983	O	B-Process
cranial	1984,1991	O	I-Process
placode	1992,1999	O	I-Process
development	2000,2011	O	I-Process
and	2012,2015	O	O
for	2016,2019	O	O
applications	2020,2032	O	B-Process
of	2033,2035	O	O
placode	2036,2043	O	B-Material
derivatives	2044,2055	O	I-Material
in	2056,2058	O	O
regenerative	2059,2071	O	B-Process
medicine	2072,2080	O	I-Process
.	2080,2081	O	O

-DOCSTART- (S2213671113000672)

Tauopathies	0,11	O	B-Process
represent	12,21	O	O
a	22,23	O	B-Process
group	24,29	O	I-Process
of	30,32	O	I-Process
neurodegenerative	33,50	O	I-Process
disorders	51,60	O	I-Process
characterized	61,74	O	O
by	75,77	O	O
the	78,81	O	B-Process
accumulation	82,94	O	I-Process
of	95,97	O	O
pathological	98,110	O	B-Material
TAU	111,114	O	I-Material
protein	115,122	O	I-Material
in	123,125	O	O
brains	126,132	O	B-Material
.	132,133	O	O

We	134,136	O	O
report	137,143	O	O
a	144,145	O	B-Material
human	146,151	O	I-Material
neuronal	152,160	O	I-Material
model	161,166	O	I-Material
of	167,169	O	O
tauopathy	170,179	O	B-Process
derived	180,187	O	B-Process
from	188,192	O	O
induced	193,200	O	B-Material
pluripotent	201,212	O	I-Material
stem	213,217	O	I-Material
cells	218,223	O	I-Material
(	224,225	O	I-Material
iPSCs	225,230	O	I-Material
)	230,231	O	I-Material
carrying	232,240	O	O
a	241,242	O	B-Process
TAU	243,246	O	I-Process
-	246,247	O	I-Process
A152	247,251	O	I-Process
T	251,252	O	I-Process
mutation	253,261	O	I-Process
.	261,262	O	O

Using	263,268	O	O
zinc	269,273	O	B-Process
-	273,274	O	I-Process
finger	274,280	O	I-Process
nuclease	281,289	O	I-Process
-	289,290	O	I-Process
mediated	290,298	O	I-Process
gene	299,303	O	I-Process
editing	304,311	O	I-Process
,	311,312	O	O
we	313,315	O	O
generated	316,325	O	B-Process
two	326,329	O	B-Material
isogenic	330,338	O	I-Material
iPSC	339,343	O	I-Material
lines	344,349	O	I-Material
:	349,350	O	O
one	351,354	O	O
with	355,359	O	O
the	360,363	O	B-Process
mutation	364,372	O	I-Process
corrected	373,382	O	B-Process
,	382,383	O	O
and	384,387	O	O
another	388,395	O	O
with	396,400	O	O
the	401,404	O	B-Process
homozygous	405,415	O	I-Process
mutation	416,424	O	I-Process
engineered	425,435	O	B-Process
.	435,436	O	O

The	437,440	O	B-Process
A152	441,445	O	I-Process
T	445,446	O	I-Process
mutation	447,455	O	I-Process
increased	456,465	O	B-Process
TAU	466,469	O	B-Process
fragmentation	470,483	O	I-Process
and	484,487	O	I-Process
phosphorylation	488,503	O	I-Process
,	503,504	O	O
leading	505,512	O	O
to	513,515	O	O
neurodegeneration	516,533	O	B-Process
and	534,537	O	O
especially	538,548	O	O
axonal	549,555	O	B-Process
degeneration	556,568	O	I-Process
.	568,569	O	O

These	570,575	O	B-Data
cellular	576,584	O	I-Data
phenotypes	585,595	O	I-Data
were	596,600	O	O
consistent	601,611	O	O
with	612,616	O	O
those	617,622	O	O
observed	623,631	O	O
in	632,634	O	O
a	635,636	O	B-Material
patient	637,644	O	I-Material
with	645,649	O	O

TAU	650,653	O	B-Material
-	653,654	O	I-Material
A152T.	654,660	O	I-Material
Upon	661,665	O	O
mutation	666,674	O	B-Process
correction	675,685	O	I-Process
,	685,686	O	O
normal	687,693	O	B-Data
neuronal	694,702	O	I-Data
and	703,706	O	I-Data
axonal	707,713	O	I-Data
morphologies	714,726	O	I-Data
were	727,731	O	O
restored	732,740	O	B-Process
,	740,741	O	O
accompanied	742,753	O	O
by	754,756	O	O
decreases	757,766	O	B-Process
in	767,769	O	O
TAU	770,773	O	B-Process
fragmentation	774,787	O	I-Process
and	788,791	O	I-Process
phosphorylation	792,807	O	I-Process
,	807,808	O	O
whereas	809,816	O	O
the	817,820	O	B-Data
severity	821,829	O	I-Data
of	830,832	O	O
tauopathy	833,842	O	B-Process
was	843,846	O	O
intensified	847,858	O	B-Process
in	859,861	O	O
neurons	862,869	O	B-Material
with	870,874	O	O
the	875,878	O	B-Process
homozygous	879,889	O	I-Process
mutation	890,898	O	I-Process
.	898,899	O	O

These	900,905	O	B-Material
isogenic	906,914	O	I-Material
TAU	915,918	O	I-Material
-	918,919	O	I-Material
iPSC	919,923	O	I-Material
lines	924,929	O	I-Material
represent	930,939	O	O
a	940,941	O	O
critical	942,950	O	O
advancement	951,962	O	O
toward	963,969	O	O
the	970,973	O	B-Process
accurate	974,982	O	I-Process
modeling	983,991	O	I-Process
and	992,995	O	O
mechanistic	996,1007	O	B-Process
study	1008,1013	O	I-Process
of	1014,1016	O	O
tauopathies	1017,1028	O	B-Process
with	1029,1033	O	O
human	1034,1039	O	B-Material
neurons	1040,1047	O	I-Material
and	1048,1051	O	O
will	1052,1056	O	O
be	1057,1059	O	O
invaluable	1060,1070	O	O
for	1071,1074	O	O
drug	1075,1079	O	B-Process
-	1079,1080	O	I-Process
screening	1080,1089	O	I-Process
efforts	1090,1097	O	I-Process
and	1098,1101	O	O
future	1102,1108	O	O
cell	1109,1113	O	B-Process
-	1113,1114	O	I-Process
based	1114,1119	O	I-Process
therapies	1120,1129	O	I-Process
.	1129,1130	O	O

Highlights	1131,1141	O	O
•	1142,1143	O	O

A	1144,1145	O	B-Material
human	1146,1151	O	I-Material
neuron	1152,1158	O	I-Material
model	1159,1164	O	I-Material
of	1165,1167	O	O
tauopathy	1168,1177	O	B-Process
using	1178,1183	O	O
TAU	1184,1187	O	B-Material
-	1187,1188	O	I-Material
A152T	1188,1193	O	I-Material
-	1193,1194	O	I-Material
iPSCs	1194,1199	O	I-Material
•	1200,1201	O	O
Correction	1202,1212	O	B-Process
of	1213,1215	O	O
TAU	1216,1219	O	B-Process
-	1219,1220	O	I-Process
A152	1220,1224	O	I-Process
T	1224,1225	O	I-Process
mutation	1226,1234	O	I-Process
eliminates	1235,1245	O	B-Process
tauopathy	1246,1255	O	B-Process
•	1256,1257	O	O
Engineered	1258,1268	O	B-Process
homozygous	1269,1279	O	B-Process
TAU	1280,1283	O	I-Process
-	1283,1284	O	I-Process
A152	1284,1288	O	I-Process
T	1288,1289	O	I-Process
mutation	1290,1298	O	I-Process
intensifies	1299,1310	O	B-Process
tauopathy	1311,1320	O	B-Process
•	1321,1322	O	O
A152	1323,1327	O	B-Process
T	1327,1328	O	I-Process
mutation	1329,1337	O	I-Process
increases	1338,1347	O	B-Process
TAU	1348,1351	O	B-Process
proteolysis	1352,1363	O	I-Process
,	1363,1364	O	O
leading	1365,1372	O	O
to	1373,1375	O	O
tauopathy	1376,1385	O	B-Process

-DOCSTART- (S2213671113000921)

SOX2	0,4	O	B-Material
is	5,7	O	O
involved	8,16	O	O
in	17,19	O	O
several	20,27	O	B-Process
cell	28,32	O	I-Process
and	33,36	O	I-Process
developmental	37,50	O	I-Process
processes	51,60	O	I-Process
,	60,61	O	O
including	62,71	O	O
maintenance	72,83	O	B-Process
of	84,86	O	O
embryonic	87,96	O	B-Material
stem	97,101	O	I-Material
cells	102,107	O	I-Material
,	107,108	O	O
differentiation	109,124	O	B-Process
of	125,127	O	O
neural	128,134	O	B-Material
progenitor	135,145	O	I-Material
cells	146,151	O	I-Material
,	151,152	O	O
and	153,156	O	O
patterning	157,167	O	B-Process
of	168,170	O	O
gut	171,174	O	B-Material
endoderm	175,183	O	I-Material
.	183,184	O	O

To	185,187	O	O
study	188,193	O	O
its	194,197	O	O
role	198,202	O	O
in	203,205	O	O
a	206,207	O	B-Material
human	208,213	O	I-Material
system	214,220	O	I-Material
,	220,221	O	O
we	222,224	O	O
generated	225,234	O	B-Process
a	235,236	O	B-Material
human	237,242	O	I-Material
embryonic	243,252	O	I-Material
stem	253,257	O	I-Material
cell	258,262	O	I-Material
(	263,264	O	I-Material
hESC	264,268	O	I-Material
)	268,269	O	I-Material
line	270,274	O	I-Material
harboring	275,284	O	B-Process
a	285,286	O	B-Material
reporter	287,295	O	I-Material
gene	296,300	O	I-Material
encoding	301,309	O	I-Material
GFP	310,313	O	I-Material
in	314,316	O	O
the	317,320	O	B-Material
SOX2	321,325	O	I-Material
locus	326,331	O	I-Material
.	331,332	O	O

This	333,337	O	B-Material
SOX2	338,342	O	I-Material
reporter	343,351	O	I-Material
line	352,356	O	I-Material
faithfully	357,367	O	O
recapitulates	368,381	O	O
expression	382,392	O	B-Process
of	393,395	O	O
the	396,399	O	B-Material
SOX2	400,404	O	I-Material
gene	405,409	O	I-Material
in	410,412	O	O
undifferentiated	413,429	O	B-Material
human	430,435	O	I-Material
pluripotent	436,447	O	I-Material
stem	448,452	O	I-Material
cells	453,458	O	I-Material
(	459,460	O	I-Material
hPSCs	460,465	O	I-Material
)	465,466	O	I-Material
,	466,467	O	I-Material
neural	468,474	O	I-Material
progenitor	475,485	O	I-Material
cells	486,491	O	I-Material
(	492,493	O	I-Material
NPCs	493,497	O	I-Material
)	497,498	O	I-Material
,	498,499	O	I-Material
and	500,503	O	I-Material
anterior	504,512	O	I-Material
foregut	513,520	O	I-Material
endoderm	521,529	O	I-Material
(	530,531	O	I-Material
AFE	531,534	O	I-Material
)	534,535	O	I-Material
.	535,536	O	O

In	537,539	O	O
undifferentiated	540,556	O	B-Material
hESCs	557,562	O	I-Material
,	562,563	O	O
GFP	564,567	O	B-Process
expression	568,578	O	I-Process
corresponds	579,590	O	O
to	591,593	O	O
those	594,599	O	B-Material
cells	600,605	O	I-Material
with	606,610	O	O
highest	611,618	O	B-Data
levels	619,625	O	I-Data
of	626,628	O	O
expression	629,639	O	B-Process
of	640,642	O	I-Process
genes	643,648	O	I-Process
associated	649,659	O	O
with	660,664	O	O
the	665,668	O	B-Data
pluripotent	669,680	O	I-Data
state	681,686	O	I-Data
.	686,687	O	O

In	688,690	O	O
NPCs	691,695	O	B-Material
,	695,696	O	O
expression	697,707	O	B-Process
of	708,710	O	O
GFP	711,714	O	B-Material
can	715,718	O	O
be	719,721	O	O
employed	722,730	O	O
to	731,733	O	O
isolate	734,741	O	B-Process
cells	742,747	O	B-Data
expressing	748,758	O	I-Data
markers	759,766	O	I-Data
associated	767,777	O	O
with	778,782	O	O
NPC	783,786	O	B-Process
multipotency	787,799	O	I-Process
.	799,800	O	O

In	801,803	O	O
AFE	804,807	O	B-Material
,	807,808	O	O
we	809,811	O	O
used	812,816	O	O
transcriptome	817,830	O	B-Process
-	830,831	O	I-Process
wide	831,835	O	I-Process
expression	836,846	O	I-Process
analysis	847,855	O	I-Process
to	856,858	O	O
identify	859,867	O	O
cell	868,872	O	B-Data
surface	873,880	O	I-Data
markers	881,888	O	I-Data
with	889,893	O	O
elevated	894,902	O	B-Process
expression	903,913	O	I-Process
in	914,916	O	O
this	917,921	O	B-Material
population	922,932	O	I-Material
,	932,933	O	O
thereby	934,941	O	O
facilitating	942,954	O	O
isolation	955,964	O	B-Process
and	965,968	O	O
purification	969,981	O	B-Process
of	982,984	O	O
this	985,989	O	B-Material
hPSC	990,994	O	I-Material
-	994,995	O	I-Material
derived	995,1002	O	I-Material
cell	1003,1007	O	I-Material
population	1008,1018	O	I-Material
.	1018,1019	O	O

Highlights	1020,1030	O	O

A	1031,1032	O	B-Material
SOX2-GFP	1033,1041	O	I-Material
hESC	1042,1046	O	I-Material
line	1047,1051	O	I-Material
is	1052,1054	O	O
used	1055,1059	O	O
to	1060,1062	O	O
isolate	1063,1070	O	B-Process
and	1071,1074	O	O
characterize	1075,1087	O	B-Process
multiple	1088,1096	O	B-Material
cell	1097,1101	O	I-Material
types	1102,1107	O	I-Material
A	1108,1109	O	B-Data
cell	1110,1114	O	I-Data
surface	1115,1122	O	I-Data
marker	1123,1129	O	I-Data
signature	1130,1139	O	I-Data
allows	1140,1146	O	O
for	1147,1150	O	O
the	1151,1154	O	B-Process
purification	1155,1167	O	I-Process
of	1168,1170	O	O
endodermal	1171,1181	O	B-Material
progeny	1182,1189	O	I-Material
Targeted	1190,1198	O	B-Process
gene	1199,1203	O	I-Process
insertion	1204,1213	O	I-Process
with	1214,1218	O	O
adeno	1219,1224	O	B-Material
-	1224,1225	O	I-Material
associated	1225,1235	O	I-Material
virus	1236,1241	O	I-Material
(	1242,1243	O	I-Material
AAV	1243,1246	O	I-Material
)	1246,1247	O	I-Material
is	1248,1250	O	O
highly	1251,1257	O	O
efficient	1258,1267	O	O
SOX2	1268,1272	O	B-Material
is	1273,1275	O	O
expressed	1276,1285	O	O
during	1286,1292	O	O
multiple	1293,1301	O	B-Process
developmental	1302,1315	O	I-Process
stages	1316,1322	O	I-Process
.	1322,1323	O	O

Brafman	1324,1331	O	O
,	1331,1332	O	O
Willert	1333,1340	O	O
,	1340,1341	O	O
and	1342,1345	O	O
colleagues	1346,1356	O	O
used	1357,1361	O	O
human	1362,1367	O	B-Material
embryonic	1368,1377	O	I-Material
stem	1378,1382	O	I-Material
cells	1383,1388	O	I-Material
carrying	1389,1397	O	O
a	1398,1399	O	B-Material
SOX2	1400,1404	O	I-Material
reporter	1405,1413	O	I-Material
to	1414,1416	O	O
characterize	1417,1429	O	O
its	1430,1433	O	B-Process
expression	1434,1444	O	I-Process
in	1445,1447	O	O
undifferentiated	1448,1464	O	B-Material
cells	1465,1470	O	I-Material
and	1471,1474	O	O
in	1475,1477	O	O
neural	1478,1484	O	B-Material
and	1485,1488	O	I-Material
lung	1489,1493	O	I-Material
progenitor	1494,1504	O	I-Material
cells	1505,1510	O	I-Material
.	1510,1511	O	O

This	1512,1516	O	O
approach	1517,1525	O	O
led	1526,1529	O	O
to	1530,1532	O	O
the	1533,1536	O	B-Process
identification	1537,1551	O	I-Process
of	1552,1554	O	O
a	1555,1556	O	B-Data
cell	1557,1561	O	I-Data
surface	1562,1569	O	I-Data
signature	1570,1579	O	I-Data
to	1580,1582	O	O
isolate	1583,1590	O	B-Process
prospective	1591,1602	O	O
lung	1603,1607	O	B-Material
progenitors	1608,1619	O	I-Material
.	1619,1620	O	O

-DOCSTART- (S2213671113001288)

Whether	0,7	O	O
human	8,13	O	B-Material
induced	14,21	O	I-Material
pluripotent	22,33	O	I-Material
stem	34,38	O	I-Material
cells	39,44	O	I-Material
(	45,46	O	I-Material
hiPSCs	46,52	O	I-Material
)	52,53	O	I-Material
are	54,57	O	O
epigenetically	58,72	O	B-Process
identical	73,82	O	O
to	83,85	O	O
human	86,91	O	B-Material
embryonic	92,101	O	I-Material
stem	102,106	O	I-Material
cells	107,112	O	I-Material
(	113,114	O	I-Material
hESCs	114,119	O	I-Material
)	119,120	O	I-Material
has	121,124	O	O
been	125,129	O	O
debated	130,137	O	O
in	138,140	O	O
the	141,144	O	B-Process
stem	145,149	O	I-Process
cell	150,154	O	I-Process
field	155,160	O	I-Process
.	160,161	O	O

In	162,164	O	O
this	165,169	O	O
study	170,175	O	O
,	175,176	O	O
we	177,179	O	O
analyzed	180,188	O	B-Process
DNA	189,192	O	B-Data
methylation	193,204	O	I-Data
patterns	205,213	O	I-Data
in	214,216	O	O
a	217,218	O	O
large	219,224	O	O
number	225,231	O	O
of	232,234	O	O
hiPSCs	235,241	O	B-Material
(	242,243	O	O
n	243,244	O	B-Data
=	245,246	O	I-Data
114	247,250	O	I-Data
)	250,251	O	O
and	252,255	O	O
hESCs	256,261	O	B-Material
(	262,263	O	O
n	263,264	O	B-Data
=	265,266	O	I-Data
155	267,270	O	I-Data
)	270,271	O	O
,	271,272	O	O
and	273,276	O	O
identified	277,287	O	B-Process
a	288,289	O	B-Material
panel	290,295	O	I-Material
of	296,298	O	O
82	299,301	O	B-Data
CpG	302,305	O	B-Material
methylation	306,317	O	I-Material
sites	318,323	O	I-Material
that	324,328	O	O
can	329,332	O	O
distinguish	333,344	O	B-Process
hiPSCs	345,351	O	B-Material
from	352,356	O	O
hESCs	357,362	O	B-Material
with	363,367	O	O
high	368,372	O	B-Data
accuracy	373,381	O	I-Data
.	381,382	O	O

We	383,385	O	O
show	386,390	O	O
that	391,395	O	O
12	396,398	O	B-Data
out	399,402	O	I-Data
of	403,405	O	I-Data
the	406,409	O	I-Data
82	410,412	O	I-Data
CpG	413,416	O	B-Material
sites	417,422	O	I-Material
were	423,427	O	O
subject	428,435	O	O
to	436,438	O	O
hypermethylation	439,455	O	B-Process
in	456,458	O	O
part	459,463	O	O
by	464,466	O	O

DNMT3B.	467,474	O	B-Material
Notably	475,482	O	O
,	482,483	O	O
DNMT3B	484,490	O	B-Material
contributes	491,502	O	O
directly	503,511	O	O
to	512,514	O	O
aberrant	515,523	O	B-Process
hypermethylation	524,540	O	I-Process
and	541,544	O	O
silencing	545,554	O	B-Process
of	555,557	O	O
the	558,561	O	B-Material
signature	562,571	O	I-Material
gene	572,576	O	I-Material
,	576,577	O	I-Material

TCERG1L.	578,586	O	I-Material
Overall	587,594	O	O
,	594,595	O	O
we	596,598	O	O
conclude	599,607	O	O
that	608,612	O	O
DNMT3B	613,619	O	B-Material
is	620,622	O	O
involved	623,631	O	O
in	632,634	O	O
a	635,636	O	B-Process
wave	637,641	O	I-Process
of	642,644	O	I-Process
de	645,647	O	I-Process
novo	648,652	O	I-Process
methylation	653,664	O	I-Process
during	665,671	O	O
reprogramming	672,685	O	B-Process
,	685,686	O	O
a	687,688	O	O
portion	689,696	O	O
of	697,699	O	O
which	700,705	O	O
contributes	706,717	O	O
to	718,720	O	O
the	721,724	O	B-Data
unique	725,731	O	I-Data
hiPSC	732,737	O	I-Data
methylation	738,749	O	I-Data
signature	750,759	O	I-Data
.	759,760	O	O

These	761,766	O	O
82	767,769	O	B-Data
CpG	770,773	O	B-Material
methylation	774,785	O	I-Material
sites	786,791	O	I-Material
may	792,795	O	O
be	796,798	O	O
useful	799,805	O	O
as	806,808	O	O
biomarkers	809,819	O	B-Material
to	820,822	O	O
distinguish	823,834	O	B-Process
between	835,842	O	O
hiPSCs	843,849	O	B-Material
and	850,853	O	O
hESCs	854,859	O	B-Material
.	859,860	O	O

Highlights	861,871	O	O
•	872,873	O	O

Eighty	874,880	O	B-Data
-	880,881	O	I-Data
two	881,884	O	I-Data
DNA	885,888	O	B-Material
methylation	889,900	O	I-Material
sites	901,906	O	I-Material
distinguish	907,918	O	B-Process
hiPSCs	919,925	O	B-Material
and	926,929	O	O
hESCs	930,935	O	B-Material
with	936,940	O	O
high	941,945	O	B-Data
accuracy	946,954	O	I-Data
•	955,956	O	O

Twelve	957,963	O	B-Data
aberrantly	964,974	O	B-Material
hypermethylated	975,990	O	I-Material
signature	991,1000	O	I-Material
CG	1001,1003	O	I-Material
sites	1004,1009	O	I-Material
are	1010,1013	O	O
due	1014,1017	O	O
in	1018,1020	O	O
part	1021,1025	O	O
to	1026,1028	O	O
DNMT3B	1029,1035	O	B-Material
•	1036,1037	O	O
DNMT3B	1038,1044	O	B-Material
also	1045,1049	O	O
contributes	1050,1061	O	O
to	1062,1064	O	O
previously	1065,1075	O	O
reported	1076,1084	O	O
aberrant	1085,1093	O	B-Process
hypermethylation	1094,1110	O	I-Process
in	1111,1113	O	O
hiPSCs	1114,1120	O	B-Material

Huang	1121,1126	O	O
et	1127,1129	O	O
al	1130,1132	O	O
.	1132,1133	O	O
identify	1134,1142	O	O
a	1143,1144	O	B-Material
panel	1145,1150	O	I-Material
of	1151,1153	O	O
82	1154,1156	O	B-Data
CpG	1157,1160	O	B-Material
methylation	1161,1172	O	I-Material
sites	1173,1178	O	I-Material
that	1179,1183	O	O
can	1184,1187	O	O
robustly	1188,1196	O	O
distinguish	1197,1208	O	B-Process
hiPSCs	1209,1215	O	B-Material
from	1216,1220	O	O
hESCs	1221,1226	O	B-Material
with	1227,1231	O	O
high	1232,1236	O	B-Data
accuracy	1237,1245	O	I-Data
.	1245,1246	O	O

Part	1247,1251	O	O
of	1252,1254	O	O
the	1255,1258	O	B-Data
signature	1259,1268	O	I-Data
consists	1269,1277	O	O
of	1278,1280	O	O
aberrantly	1281,1291	O	B-Material
hypermethylated	1292,1307	O	I-Material
CpG	1308,1311	O	I-Material
sites	1312,1317	O	I-Material
,	1317,1318	O	O
which	1319,1324	O	O
are	1325,1328	O	O
partially	1329,1338	O	B-Process
abrogated	1339,1348	O	I-Process
in	1349,1351	O	O
the	1352,1355	O	O
absence	1356,1363	O	O
of	1364,1366	O	O
DNMT3B.	1367,1374	O	B-Material

In	1375,1377	O	O
addition	1378,1386	O	O
,	1386,1387	O	O
DNMT3B	1388,1394	O	B-Material
-	1394,1395	O	I-Material
mutant	1395,1401	O	I-Material
hiPSCs	1402,1408	O	I-Material
do	1409,1411	O	O
not	1412,1415	O	O
exhibit	1416,1423	O	O
other	1424,1429	O	B-Data
aberrant	1430,1438	O	I-Data
hypermethylation	1439,1455	O	I-Data
signatures	1456,1466	O	I-Data
as	1467,1469	O	O
previously	1470,1480	O	O
reported	1481,1489	O	O
.	1489,1490	O	O

-DOCSTART- (S2213671113001306)

Transplantation	0,15	O	B-Process
of	16,18	O	O
the	19,22	O	B-Material
retinal	23,30	O	I-Material
pigment	31,38	O	I-Material
epithelium	39,49	O	I-Material
(	50,51	O	I-Material
RPE	51,54	O	I-Material
)	54,55	O	I-Material
is	56,58	O	O
being	59,64	O	O
developed	65,74	O	O
as	75,77	O	O
a	78,79	O	B-Process
cell	80,84	O	I-Process
-	84,85	O	I-Process
replacement	85,96	O	I-Process
therapy	97,104	O	I-Process
for	105,108	O	O
age	109,112	O	B-Process
-	112,113	O	I-Process
related	113,120	O	I-Process
macular	121,128	O	I-Process
degeneration	129,141	O	I-Process
.	141,142	O	O

Human	143,148	O	B-Material
embryonic	149,158	O	I-Material
stem	159,163	O	I-Material
cell	164,168	O	I-Material
(	169,170	O	I-Material
hESC	170,174	O	I-Material
)	174,175	O	I-Material
and	176,179	O	O
induced	180,187	O	B-Process
pluripotent	188,199	O	B-Material
stem	200,204	O	I-Material
cell	205,209	O	I-Material

(	210,211	O	I-Material
iPSC)-derived	211,224	O	I-Material
RPE	225,228	O	I-Material
are	229,232	O	O
currently	233,242	O	O
translating	243,254	O	B-Process
toward	255,261	O	O
clinic	262,268	O	B-Material
.	268,269	O	O

We	270,272	O	O
introduce	273,282	O	O
the	283,286	O	B-Material
adult	287,292	O	I-Material
human	293,298	O	I-Material
RPE	299,302	O	I-Material
stem	303,307	O	I-Material
cell	308,312	O	I-Material
(	313,314	O	I-Material
hRPESC	314,320	O	I-Material
)	320,321	O	I-Material
as	322,324	O	O
an	325,327	O	B-Material
alternative	328,339	O	I-Material
RPE	340,343	O	I-Material
source	344,350	O	I-Material
.	350,351	O	O

Polarized	352,361	O	B-Material
monolayers	362,372	O	I-Material
of	373,375	O	O
adult	376,381	O	B-Material
hRPESC	382,388	O	I-Material
-	388,389	O	I-Material
derived	389,396	O	I-Material
RPE	397,400	O	I-Material
grown	401,406	O	B-Process
on	407,409	O	O
polyester	410,419	O	B-Material

(	420,421	O	I-Material
PET	421,424	O	I-Material
)	424,425	O	I-Material
membranes	426,435	O	I-Material
had	436,439	O	O
near	440,444	O	B-Data
-	444,445	O	I-Data
native	445,451	O	I-Data
characteristics	452,467	O	I-Data
.	467,468	O	O

Trephined	469,478	O	B-Material
pieces	479,485	O	I-Material
of	486,488	O	I-Material
RPE	489,492	O	I-Material
monolayers	493,503	O	I-Material
on	504,506	O	O
PET	507,510	O	B-Material
were	511,515	O	O
transplanted	516,528	O	B-Process
subretinally	529,541	O	I-Process
in	542,544	O	O
the	545,548	O	B-Material
rabbit	549,555	O	I-Material
,	555,556	O	I-Material
a	557,558	O	I-Material
large	559,564	O	I-Material
-	564,565	O	I-Material
eyed	565,569	O	I-Material
animal	570,576	O	I-Material
model	577,582	O	I-Material
.	582,583	O	O

After	584,589	O	O
4	590,591	O	O
days	592,596	O	O
,	596,597	O	O
retinal	598,605	O	B-Material
edema	606,611	O	I-Material
was	612,615	O	O
observed	616,624	O	O
above	625,630	O	O
the	631,634	O	B-Material
implant	635,642	O	I-Material
,	642,643	O	O
detected	644,652	O	B-Process
by	653,655	O	O
spectral	656,664	O	B-Method
domain	665,671	O	I-Method
optical	672,679	O	I-Method
coherence	680,689	O	I-Method
tomography	690,700	O	I-Method
(	701,702	O	I-Method
SD	702,704	O	I-Method
-	704,705	O	I-Method
OCT	705,708	O	I-Method
)	708,709	O	I-Method
and	710,713	O	I-Method
fundoscopy	714,724	O	I-Method
.	724,725	O	O

At	726,728	O	O
1	729,730	O	O
week	731,735	O	O
,	735,736	O	O
retinal	737,744	O	B-Process
atrophy	745,752	O	I-Process
overlying	753,762	O	O
the	763,766	O	B-Material
fetal	767,772	O	I-Material
or	773,775	O	I-Material
adult	776,781	O	I-Material
transplant	782,792	O	I-Material
was	793,796	O	O
observed	797,805	O	O
,	805,806	O	O
remaining	807,816	O	O
stable	817,823	O	B-Data
thereafter	824,834	O	O
.	834,835	O	O

Histology	836,845	O	B-Process
obtained	846,854	O	O
4	855,856	O	O
weeks	857,862	O	O
after	863,868	O	O
implantation	869,881	O	B-Process
confirmed	882,891	O	O
a	892,893	O	B-Material
continuous	894,904	O	I-Material
polarized	905,914	O	I-Material
human	915,920	O	I-Material
RPE	921,924	O	I-Material
monolayer	925,934	O	I-Material
on	935,937	O	O
PET	938,941	O	B-Material
.	941,942	O	O

Taken	943,948	O	O
together	949,957	O	O
,	957,958	O	O
the	959,962	O	B-Material
xeno	963,967	O	I-Material
-	967,968	O	I-Material
RPE	968,971	O	I-Material
survived	972,980	O	O
with	981,985	O	O
retained	986,994	O	B-Data
characteristics	995,1010	O	I-Data
in	1011,1013	O	O
the	1014,1017	O	B-Material
subretinal	1018,1028	O	I-Material
space	1029,1034	O	I-Material
.	1034,1035	O	O

These	1036,1041	O	O
experiments	1042,1053	O	O
support	1054,1061	O	O
that	1062,1066	O	O
adult	1067,1072	O	B-Material
hRPESC	1073,1079	O	I-Material
-	1079,1080	O	I-Material
derived	1080,1087	O	I-Material
RPE	1088,1091	O	I-Material
are	1092,1095	O	O
a	1096,1097	O	O
potential	1098,1107	O	O
source	1108,1114	O	O
for	1115,1118	O	O
transplantation	1119,1134	O	B-Process
therapies	1135,1144	O	I-Process
.	1144,1145	O	O

Graphical	1146,1155	O	O
Abstract	1156,1164	O	O
Highlights	1165,1175	O	O
•	1176,1177	O	O
Adult	1178,1183	O	B-Material
hRPESC	1184,1190	O	I-Material
-	1190,1191	O	I-Material
derived	1191,1198	O	I-Material
RPE	1199,1202	O	I-Material
had	1203,1206	O	O
comparable	1207,1217	O	O
in	1218,1220	O	B-Method
vitro	1221,1226	O	I-Method
characteristics	1227,1242	O	B-Data
to	1243,1245	O	O
fetal	1246,1251	O	B-Material
hRPE	1252,1256	O	I-Material
•	1257,1258	O	O

hRPE	1259,1263	O	B-Material
monolayers	1264,1274	O	I-Material
survived	1275,1283	O	O
4	1284,1285	O	O
weeks	1286,1291	O	O
on	1292,1294	O	O
PET	1295,1298	O	B-Material
carriers	1299,1307	O	I-Material
under	1308,1313	O	O
the	1314,1317	O	B-Material
rabbit	1318,1324	O	I-Material
retina	1325,1331	O	I-Material
•	1332,1333	O	O

Better	1334,1340	O	O
xenograft	1341,1350	O	B-Process
survival	1351,1359	O	I-Process
may	1360,1363	O	O
be	1364,1366	O	O
due	1367,1370	O	O
to	1371,1373	O	O
the	1374,1377	O	B-Data
maintained	1378,1388	O	I-Data
hRPE	1389,1393	O	I-Data
cell	1394,1398	O	I-Data
polarity	1399,1407	O	I-Data

•	1408,1409	O	O
Atrophy	1410,1417	O	B-Process
of	1418,1420	O	O
the	1421,1424	O	B-Material
retina	1425,1431	O	I-Material
overlaying	1432,1442	O	B-Process
the	1443,1446	O	B-Material
hRPE	1447,1451	O	I-Material
xenograft	1452,1461	O	I-Material
remains	1462,1469	O	O
a	1470,1471	O	O
future	1472,1478	O	O
challenge	1479,1488	O	O
Stanzel	1489,1496	O	O
et	1497,1499	O	O
al	1500,1502	O	O
.	1502,1503	O	O

have	1504,1508	O	O
transplanted	1509,1521	O	B-Process
polarized	1522,1531	O	B-Material
monolayers	1532,1542	O	I-Material
of	1543,1545	O	O
human	1546,1551	O	B-Material
retinal	1552,1559	O	I-Material
pigment	1560,1567	O	I-Material
epithelium	1568,1578	O	I-Material
(	1579,1580	O	I-Material
hRPE	1580,1584	O	I-Material
)	1584,1585	O	I-Material
grown	1586,1591	O	B-Process
on	1592,1594	O	O
polyester	1595,1604	O	B-Material
membranes	1605,1614	O	I-Material
derived	1615,1622	O	B-Process
from	1623,1627	O	O
adult	1628,1633	O	B-Material
hRPE	1634,1638	O	I-Material
stem	1639,1643	O	I-Material
cells	1644,1649	O	I-Material
or	1650,1652	O	I-Material
fetal	1653,1658	O	I-Material
tissue	1659,1665	O	I-Material
under	1666,1671	O	O
the	1672,1675	O	B-Material
rabbit	1676,1682	O	I-Material
retina	1683,1689	O	I-Material
.	1689,1690	O	O

The	1691,1694	O	B-Material
xeno	1695,1699	O	I-Material
-	1699,1700	O	I-Material
RPE	1700,1703	O	I-Material
survived	1704,1712	O	O
4	1713,1714	O	O
weeks	1715,1720	O	O
with	1721,1725	O	O
retained	1726,1734	O	O
cell	1735,1739	O	B-Data
polarity	1740,1748	O	I-Data
characteristics	1749,1764	O	I-Data
in	1765,1767	O	O
the	1768,1771	O	B-Material
subretinal	1772,1782	O	I-Material
space	1783,1788	O	I-Material
.	1788,1789	O	O

These	1790,1795	O	O
experiments	1796,1807	O	O
support	1808,1815	O	O
that	1816,1820	O	O
adult	1821,1826	O	B-Material
hRPESC	1827,1833	O	I-Material
-	1833,1834	O	I-Material
derived	1834,1841	O	I-Material
RPE	1842,1845	O	I-Material
are	1846,1849	O	O
a	1850,1851	O	O
potential	1852,1861	O	O
source	1862,1868	O	O
for	1869,1872	O	O
transplantation	1873,1888	O	B-Process
therapies	1889,1898	O	I-Process
.	1898,1899	O	O

