-DOCSTART- (S0019103511004994)

The	0,3	O	B-Material
moon	4,8	O	I-Material
Enceladus	9,18	O	I-Material
,	18,19	O	O
embedded	20,28	O	O
in	29,31	O	O
Saturn	32,38	O	B-Material
's	38,40	O	I-Material
radiation	41,50	O	I-Material
belts	51,56	O	I-Material
,	56,57	O	O
is	58,60	O	O
the	61,64	O	O
main	65,69	O	O
internal	70,78	O	O
source	79,85	O	O
of	86,88	O	O
neutral	89,96	O	B-Material
and	97,100	O	I-Material
charged	101,108	O	I-Material
particles	109,118	O	I-Material
in	119,121	O	O
the	122,125	O	B-Material
Kronian	126,133	O	I-Material
magnetosphere	134,147	O	I-Material
.	147,148	O	O

A	149,150	O	B-Material
plume	151,156	O	I-Material
of	157,159	O	I-Material
water	160,165	O	I-Material
ice	166,169	O	I-Material
molecules	170,179	O	I-Material
and	180,183	O	I-Material
dust	184,188	O	I-Material
released	189,197	O	O
through	198,205	O	O
geysers	206,213	O	B-Material
on	214,216	O	I-Material
the	217,220	O	I-Material
south	221,226	O	I-Material
polar	227,232	O	I-Material
region	233,239	O	I-Material
provides	240,248	O	O
enough	249,255	O	O
material	256,264	O	O
to	265,267	O	O
feed	268,272	O	B-Process
the	273,276	O	B-Material
E	277,278	O	I-Material
-	278,279	O	I-Material
ring	279,283	O	I-Material
and	284,287	O	O
also	288,292	O	O
the	293,296	O	B-Material
neutral	297,304	O	I-Material
torus	305,310	O	I-Material
of	311,313	O	I-Material
Saturn	314,320	O	I-Material
and	321,324	O	I-Material
the	325,328	O	I-Material
entire	329,335	O	I-Material
magnetosphere	336,349	O	I-Material
.	349,350	O	O

In	351,353	O	O
the	354,357	O	O
time	358,362	O	O
period	363,369	O	O
2005	370,374	O	O
-	374,375	O	O
2010	375,379	O	O
the	380,383	O	B-Material
Cassini	384,391	O	I-Material
spacecraft	392,402	O	I-Material
flew	403,407	O	B-Process
close	408,413	O	O
by	414,416	O	O
the	417,420	O	B-Material
moon	421,425	O	I-Material
14	426,428	O	B-Data
times	429,434	O	I-Data
,	434,435	O	O
sometimes	436,445	O	O
as	446,448	O	B-Data
low	449,452	O	I-Data
as	453,455	O	I-Data
25	456,458	O	I-Data
km	458,460	O	I-Data
above	461,466	O	O
the	467,470	O	B-Material
surface	471,478	O	I-Material
and	479,482	O	O
directly	483,491	O	O
through	492,499	O	O
the	500,503	O	B-Material
plume	504,509	O	I-Material
.	509,510	O	O

For	511,514	O	O
the	515,518	O	O
very	519,523	O	O
first	524,529	O	O
time	530,534	O	O
measurements	535,547	O	B-Data
of	548,550	O	O
plasma	551,557	O	B-Material
and	558,561	O	I-Material
energetic	562,571	O	I-Material
particles	572,581	O	I-Material
inside	582,588	O	O
the	589,592	O	B-Material
plume	593,598	O	I-Material
and	599,602	O	O
its	603,606	O	B-Material
immediate	607,616	O	I-Material
vicinity	617,625	O	I-Material
could	626,631	O	O
be	632,634	O	O
obtained	635,643	O	O
.	643,644	O	O

In	645,647	O	O
this	648,652	O	O
work	653,657	O	O
we	658,660	O	O
summarize	661,670	O	O
the	671,674	O	O
results	675,682	O	O
of	683,685	O	O
energetic	686,695	O	B-Process
electron	696,704	O	I-Process
measurements	705,717	O	I-Process
in	718,720	O	O
the	721,724	O	B-Data
energy	725,731	O	I-Data
range	732,737	O	I-Data
27keV	738,743	O	I-Data
to	744,746	O	I-Data
21MeV	747,752	O	I-Data
taken	753,758	O	O
by	759,761	O	O
the	762,765	O	B-Method
Low	766,769	O	I-Method
Energy	770,776	O	I-Method
Magnetospheric	777,791	O	I-Method
Measurement	792,803	O	I-Method
System	804,810	O	I-Method
(	811,812	O	I-Method
LEMMS	812,817	O	I-Method
)	817,818	O	I-Method
,	818,819	O	O
part	820,824	O	O
of	825,827	O	O
the	828,831	O	B-Material
Magnetospheric	832,846	O	I-Material
Imaging	847,854	O	I-Material
Instrument	855,865	O	I-Material
(	866,867	O	I-Material
MIMI	867,871	O	I-Material
)	871,872	O	I-Material
onboard	873,880	O	O
Cassini	881,888	O	B-Material
in	889,891	O	O
the	892,895	O	O
vicinity	896,904	O	O
of	905,907	O	O
the	908,911	O	B-Material
moon	912,916	O	I-Material
in	917,919	O	O
combination	920,931	O	O
with	932,936	O	O
measurements	937,949	O	B-Data
of	950,952	O	O
the	953,956	O	B-Material
magnetometer	957,969	O	I-Material
instrument	970,980	O	I-Material
MAG	981,984	O	I-Material
and	985,988	O	O
the	989,992	O	B-Material
Electron	993,1001	O	I-Material
Spectrometer	1002,1014	O	I-Material
ELS	1015,1018	O	I-Material
of	1019,1021	O	O
the	1022,1025	O	B-Material
plasma	1026,1032	O	I-Material
instrument	1033,1043	O	I-Material
CAPS	1044,1048	O	I-Material
onboard	1049,1056	O	O
the	1057,1060	O	B-Material
spacecraft	1061,1071	O	I-Material
.	1071,1072	O	O

Features	1073,1081	O	B-Data
in	1082,1084	O	I-Data
the	1085,1088	O	I-Data
data	1089,1093	O	I-Data
can	1094,1097	O	O
be	1098,1100	O	O
interpreted	1101,1112	O	O
as	1113,1115	O	O
that	1116,1120	O	O
the	1121,1124	O	B-Material
spacecraft	1125,1135	O	I-Material
was	1136,1139	O	O
connected	1140,1149	O	O
to	1150,1152	O	O
the	1153,1156	O	B-Material
plume	1157,1162	O	I-Material
material	1163,1171	O	I-Material
along	1172,1177	O	O
field	1178,1183	O	B-Data
lines	1184,1189	O	I-Data
well	1190,1194	O	O
before	1195,1201	O	O
entering	1202,1210	O	B-Process
the	1211,1214	O	B-Material
high	1215,1219	O	I-Material
density	1220,1227	O	I-Material
region	1228,1234	O	I-Material
of	1235,1237	O	O
the	1238,1241	O	B-Material
plume	1242,1247	O	I-Material
.	1247,1248	O	O

Sharp	1249,1254	O	B-Data
absorption	1255,1265	O	I-Data
signatures	1266,1276	O	I-Data
as	1277,1279	O	O
the	1280,1283	O	O
result	1284,1290	O	O
of	1291,1293	O	O
losses	1294,1300	O	B-Data
of	1301,1303	O	O
energetic	1304,1313	O	B-Material
electrons	1314,1323	O	I-Material
bouncing	1324,1332	O	B-Process
along	1333,1338	O	O
those	1339,1344	O	B-Data
field	1345,1350	O	I-Data
lines	1351,1356	O	I-Data
,	1356,1357	O	O
through	1358,1365	O	O
the	1366,1369	O	B-Material
emitted	1370,1377	O	I-Material
gas	1378,1381	O	I-Material
and	1382,1385	O	I-Material
dust	1386,1390	O	I-Material
clouds	1391,1397	O	I-Material
,	1397,1398	O	O
clearly	1399,1406	O	O
depend	1407,1413	O	O
on	1414,1416	O	O
flyby	1417,1422	O	B-Data
geometry	1423,1431	O	I-Data
as	1432,1434	O	O
well	1435,1439	O	O
as	1440,1442	O	O
on	1443,1445	O	O
measured	1446,1454	O	B-Data
pitch	1455,1460	O	I-Data
angle	1461,1466	O	I-Data
/	1466,1467	O	I-Data
look	1467,1471	O	I-Data
direction	1472,1481	O	I-Data
of	1482,1484	O	O
the	1485,1488	O	B-Material
instrument	1489,1499	O	I-Material
.	1499,1500	O	O

We	1501,1503	O	O
found	1504,1509	O	O
that	1510,1514	O	O
the	1515,1518	O	B-Data
depletion	1519,1528	O	I-Data
signatures	1529,1539	O	I-Data
during	1540,1546	O	O
some	1547,1551	O	B-Process
of	1552,1554	O	I-Process
the	1555,1558	O	I-Process
flybys	1559,1565	O	I-Process
show	1566,1570	O	O
"	1571,1572	O	B-Data
ramp	1572,1576	O	I-Data
-	1576,1577	O	I-Data
like	1577,1581	O	I-Data
"	1581,1582	O	I-Data
features	1583,1591	O	I-Data
where	1592,1597	O	O
only	1598,1602	O	O
a	1603,1604	O	B-Process
partial	1605,1612	O	I-Process
depletion	1613,1622	O	I-Process
has	1623,1626	O	O
been	1627,1631	O	O
observed	1632,1640	O	O
further	1641,1648	O	O
away	1649,1653	O	O
from	1654,1658	O	O
the	1659,1662	O	B-Material
moon	1663,1667	O	I-Material
followed	1668,1676	O	O
by	1677,1679	O	O
nearly	1680,1686	O	B-Process
full	1687,1691	O	I-Process
absorption	1692,1702	O	I-Process
of	1703,1705	O	O
electrons	1706,1715	O	B-Material
closer	1716,1722	O	O
in	1723,1725	O	O
.	1725,1726	O	O

We	1727,1729	O	O
interpret	1730,1739	O	O
this	1740,1744	O	O
as	1745,1747	O	O
partially	1748,1757	O	B-Process
/	1757,1758	O	I-Process
fully	1758,1763	O	I-Process
connected	1764,1773	O	I-Process
to	1774,1776	O	O
the	1777,1780	O	B-Material
flux	1781,1785	O	I-Material
tube	1786,1790	O	I-Material
connecting	1791,1801	O	O
the	1802,1805	O	B-Material
moon	1806,1810	O	I-Material
with	1811,1815	O	O
Cassini	1816,1823	O	B-Material
.	1823,1824	O	O

During	1825,1831	O	O
at	1832,1834	O	B-Data
least	1835,1840	O	I-Data
two	1841,1844	O	I-Data
of	1845,1847	O	O
the	1848,1851	O	B-Process
flybys	1852,1858	O	I-Process
(	1859,1860	O	O
with	1860,1864	O	O
some	1865,1869	O	O
evidence	1870,1878	O	O
of	1879,1881	O	O
one	1882,1885	O	O
additional	1886,1896	O	O
encounter	1897,1906	O	O
)	1906,1907	O	O
MIMI	1908,1912	O	B-Data
/	1912,1913	O	I-Data
LEMMS	1913,1918	O	I-Data
data	1919,1923	O	I-Data
are	1924,1927	O	O
consistent	1928,1938	O	O
with	1939,1943	O	O
the	1944,1947	O	B-Material
presence	1948,1956	O	I-Material
of	1957,1959	O	I-Material
dust	1960,1964	O	I-Material
in	1965,1967	O	O
energetic	1968,1977	O	B-Data
electron	1978,1986	O	I-Data
data	1987,1991	O	I-Data
when	1992,1996	O	O
Cassini	1997,2004	O	B-Material
flew	2005,2009	O	B-Process
directly	2010,2018	O	I-Process
through	2019,2026	O	O
the	2027,2030	O	B-Material
south	2031,2036	O	I-Material
polar	2037,2042	O	I-Material
plume	2043,2048	O	I-Material
.	2048,2049	O	O

In	2050,2052	O	O
addition	2053,2061	O	O
we	2062,2064	O	O
found	2065,2070	O	O
gradients	2071,2080	O	B-Data
in	2081,2083	O	O
the	2084,2087	O	B-Material
magnetic	2088,2096	O	I-Material
field	2097,2102	O	I-Material
components	2103,2113	O	I-Material
which	2114,2119	O	O
are	2120,2123	O	O
frequently	2124,2134	O	O
found	2135,2140	O	O
to	2141,2143	O	O
be	2144,2146	O	O
associated	2147,2157	O	O
with	2158,2162	O	O
changes	2163,2170	O	O
in	2171,2173	O	O
the	2174,2177	O	B-Data
MIMI	2178,2182	O	I-Data
/	2182,2183	O	I-Data
LEMMS	2183,2188	O	I-Data
particles	2189,2198	O	I-Data
intensities	2199,2210	O	I-Data
.	2210,2211	O	O

This	2212,2216	O	O
indicates	2217,2226	O	O
that	2227,2231	O	O
complex	2232,2239	O	B-Process
electron	2240,2248	O	I-Process
drifts	2249,2255	O	I-Process
in	2256,2258	O	O
the	2259,2262	O	O
vicinity	2263,2271	O	O
of	2272,2274	O	O
Enceladus	2275,2284	O	B-Material
could	2285,2290	O	O
form	2291,2295	O	O
forbidden	2296,2305	O	B-Material
regions	2306,2313	O	I-Material
for	2314,2317	O	O
electrons	2318,2327	O	B-Material
which	2328,2333	O	O
may	2334,2337	O	O
appear	2338,2344	O	O
as	2345,2347	O	O
intensity	2348,2357	O	B-Data
drop	2358,2362	O	I-Data
-	2362,2363	O	I-Data
outs	2363,2367	O	I-Data
.	2367,2368	O	O

-DOCSTART- (S0019103512002801)

Saturn	0,6	O	B-Material
's	6,8	O	I-Material
moon	9,13	O	I-Material
Rhea	14,18	O	I-Material
is	19,21	O	O
thought	22,29	O	O
to	30,32	O	O
be	33,35	O	O
a	36,37	O	B-Material
simple	38,44	O	I-Material
plasma	45,51	O	I-Material
absorber	52,60	O	I-Material
,	60,61	O	O
however	62,69	O	O
,	69,70	O	O
energetic	71,80	O	B-Material
particle	81,89	O	I-Material
observations	90,102	O	O
in	103,105	O	O
its	106,109	O	O
vicinity	110,118	O	O
show	119,123	O	O
a	124,125	O	O
variety	126,133	O	O
of	134,136	O	O
unexpected	137,147	O	B-Data
and	148,151	O	I-Data
complex	152,159	O	I-Data
interaction	160,171	O	I-Data
features	172,180	O	I-Data
that	181,185	O	O
do	186,188	O	O
not	189,192	O	O
conform	193,200	O	O
with	201,205	O	O
our	206,209	O	O
current	210,217	O	O
understanding	218,231	O	O
about	232,237	O	O
plasma	238,244	O	B-Process
absorbing	245,254	O	I-Process
interactions	255,267	O	I-Process
.	267,268	O	O

Energetic	269,278	O	B-Data
electron	279,287	O	I-Data
data	288,292	O	I-Data
are	293,296	O	O
especially	297,307	O	O
interesting	308,319	O	O
,	319,320	O	O
as	321,323	O	O
they	324,328	O	O
contain	329,336	O	O
a	337,338	O	B-Process
series	339,345	O	I-Process
of	346,348	O	O
broad	349,354	O	B-Process
and	355,358	O	I-Process
narrow	359,365	O	I-Process
flux	366,370	O	I-Process
depletions	371,381	O	I-Process
on	382,384	O	O
either	385,391	O	O
side	392,396	O	O
of	397,399	O	O
the	400,403	O	B-Material
moon	404,408	O	I-Material
's	408,410	O	I-Material
wake	411,415	O	I-Material
.	415,416	O	O

The	417,420	O	B-Process
association	421,432	O	I-Process
of	433,435	O	O
these	436,441	O	B-Process
dropouts	442,450	O	I-Process
with	451,455	O	O
absorption	456,466	O	B-Process
by	467,469	O	O
dust	470,474	O	B-Material
and	475,478	O	I-Material
boulders	479,487	O	I-Material
orbiting	488,496	O	B-Process
within	497,503	O	O
Rhea	504,508	O	B-Material
's	508,510	O	I-Material
Hill	511,515	O	I-Material
sphere	516,522	O	I-Material
was	523,526	O	O
suggested	527,536	O	O
but	537,540	O	O
subsequently	541,553	O	O
not	554,557	O	O
confirmed	558,567	O	O
,	567,568	O	O
so	569,571	O	O
in	572,574	O	O
this	575,579	O	O
study	580,585	O	O
we	586,588	O	O
review	589,595	O	O
data	596,600	O	O
from	601,605	O	O
all	606,609	O	B-Material
four	610,614	O	I-Material
Cassini	615,622	O	I-Material
flybys	623,629	O	I-Material
of	630,632	O	I-Material
Rhea	633,637	O	I-Material
to	638,640	O	O
date	641,645	O	O
seeking	646,653	O	O
evidence	654,662	O	O
for	663,666	O	O
alternative	667,678	O	B-Process
processes	679,688	O	I-Process
operating	689,698	O	B-Process
within	699,705	O	O
the	706,709	O	B-Material
moon	710,714	O	I-Material
's	714,716	O	I-Material
interaction	717,728	O	I-Material
region	729,735	O	I-Material
.	735,736	O	O

We	737,739	O	O
focus	740,745	O	O
on	746,748	O	O
energetic	749,758	O	B-Material
electron	759,767	O	I-Material
observations	768,780	O	O
,	780,781	O	O
which	782,787	O	O
we	788,790	O	O
put	791,794	O	O
in	795,797	O	O
context	798,805	O	O
with	806,810	O	O
magnetometer	811,823	O	B-Data
,	823,824	O	I-Data
cold	825,829	O	I-Data
plasma	830,836	O	I-Data
density	837,844	O	I-Data
and	845,848	O	I-Data
energetic	849,858	O	I-Data
ion	859,862	O	I-Data
data	863,867	O	I-Data
.	867,868	O	O

All	869,872	O	B-Material
flybys	873,879	O	I-Material
have	880,884	O	O
unique	885,891	O	B-Data
features	892,900	O	I-Data
,	900,901	O	O
but	902,905	O	O
here	906,910	O	O
we	911,913	O	O
only	914,918	O	O
focus	919,924	O	O
on	925,927	O	O
several	928,935	O	B-Material
structures	936,946	O	I-Material
that	947,951	O	O
are	952,955	O	O
consistently	956,968	O	O
observed	969,977	O	O
.	977,978	O	O

The	979,982	O	B-Data
most	983,987	O	I-Data
interesting	988,999	O	I-Data
common	1000,1006	O	I-Data
feature	1007,1014	O	I-Data
is	1015,1017	O	O
that	1018,1022	O	O
of	1023,1025	O	O
narrow	1026,1032	O	B-Process
dropouts	1033,1041	O	I-Process
in	1042,1044	O	O
energetic	1045,1054	O	B-Process
electron	1055,1063	O	I-Process
fluxes	1064,1070	O	I-Process
,	1070,1071	O	O
visible	1072,1079	O	O
near	1080,1084	O	O
the	1085,1088	O	B-Material
wake	1089,1093	O	I-Material
flanks	1094,1100	O	I-Material
.	1100,1101	O	O

These	1102,1107	O	O
are	1108,1111	O	O
typically	1112,1121	O	O
seen	1122,1126	O	O
together	1127,1135	O	O
with	1136,1140	O	O
narrow	1141,1147	O	B-Process
flux	1148,1152	O	I-Process
enhancements	1153,1165	O	I-Process
inside	1166,1172	O	O
the	1173,1176	O	B-Material
wake	1177,1181	O	I-Material
.	1181,1182	O	O

A	1183,1184	O	B-Method
phase	1185,1190	O	I-Method
-	1190,1191	O	I-Method
space	1191,1196	O	I-Method
-	1196,1197	O	I-Method
density	1197,1204	O	I-Method
analysis	1205,1213	O	I-Method
for	1214,1217	O	O
these	1218,1223	O	B-Material
structures	1224,1234	O	I-Material
from	1235,1239	O	O
the	1240,1243	O	B-Material
first	1244,1249	O	I-Material
Rhea	1250,1254	O	I-Material
flyby	1255,1260	O	I-Material
(	1261,1262	O	I-Material
R1	1262,1264	O	I-Material
)	1264,1265	O	I-Material
shows	1266,1271	O	O
that	1272,1276	O	O
Liouville	1277,1286	O	B-Method
's	1286,1288	O	I-Method
theorem	1289,1296	O	I-Method
holds	1297,1302	O	O
,	1302,1303	O	O
suggesting	1304,1314	O	O
that	1315,1319	O	O
they	1320,1324	O	O
may	1325,1328	O	O
be	1329,1331	O	O
forming	1332,1339	O	O
due	1340,1343	O	O
to	1344,1346	O	O
rapid	1347,1352	O	B-Process
transport	1353,1362	O	I-Process
of	1363,1365	O	O
energetic	1366,1375	O	B-Material
electrons	1376,1385	O	I-Material
from	1386,1390	O	O
the	1391,1394	O	B-Material
magnetosphere	1395,1408	O	I-Material
to	1409,1411	O	O
the	1412,1415	O	B-Material
wake	1416,1420	O	I-Material
,	1420,1421	O	O
through	1422,1429	O	O
narrow	1430,1436	O	B-Material
channels	1437,1445	O	I-Material
.	1445,1446	O	O

A	1447,1448	O	O
series	1449,1455	O	O
of	1456,1458	O	O
possibilities	1459,1472	O	O
are	1473,1476	O	O
considered	1477,1487	O	O
to	1488,1490	O	O
explain	1491,1498	O	O
this	1499,1503	O	B-Process
transport	1504,1513	O	I-Process
process	1514,1521	O	I-Process
.	1521,1522	O	O

We	1523,1525	O	O
examined	1526,1534	O	O
whether	1535,1542	O	O
complex	1543,1550	O	B-Process
energetic	1551,1560	O	I-Process
electron	1561,1569	O	I-Process
drifts	1570,1576	O	I-Process
in	1577,1579	O	O
the	1580,1583	O	B-Material
interaction	1584,1595	O	I-Material
region	1596,1602	O	I-Material
of	1603,1605	O	O
a	1606,1607	O	B-Material
plasma	1608,1614	O	I-Material
absorbing	1615,1624	O	I-Material
moon	1625,1629	O	I-Material
(	1630,1631	O	O
modeled	1631,1638	O	O
through	1639,1646	O	O
a	1647,1648	O	B-Method
hybrid	1649,1655	O	I-Method
simulation	1656,1666	O	I-Method
code	1667,1671	O	I-Method
)	1671,1672	O	O
may	1673,1676	O	O
allow	1677,1682	O	O
such	1683,1687	O	O
a	1688,1689	O	B-Process
transport	1690,1699	O	I-Process
.	1699,1700	O	O

With	1701,1705	O	O
the	1706,1709	O	O
exception	1710,1719	O	O
of	1720,1722	O	O
several	1723,1730	O	B-Data
features	1731,1739	O	I-Data
(	1740,1741	O	O
e.g.	1741,1745	O	O
broadening	1746,1756	O	B-Process
of	1757,1759	O	O
the	1760,1763	O	B-Material
central	1764,1771	O	I-Material
wake	1772,1776	O	I-Material
with	1777,1781	O	O
increasing	1782,1792	O	B-Process
electron	1793,1801	O	B-Data
energy	1802,1808	O	I-Data
)	1808,1809	O	O
,	1809,1810	O	O
most	1811,1815	O	O
of	1816,1818	O	O
the	1819,1822	O	O
commonly	1823,1831	O	O
observed	1832,1840	O	O
interaction	1841,1852	O	B-Data
signatures	1853,1863	O	I-Data
in	1864,1866	O	O
energetic	1867,1876	O	B-Material
electrons	1877,1886	O	I-Material
(	1887,1888	O	O
including	1888,1897	O	O
the	1898,1901	O	B-Material
narrow	1902,1908	O	I-Material
structures	1909,1919	O	I-Material
)	1919,1920	O	O
were	1921,1925	O	O
not	1926,1929	O	O
reproduced	1930,1940	O	O
.	1940,1941	O	O

Additional	1942,1952	O	B-Process
dynamical	1953,1962	O	I-Process
processes	1963,1972	O	I-Process
,	1972,1973	O	O
not	1974,1977	O	O
simulated	1978,1987	O	O
by	1988,1990	O	O
the	1991,1994	O	B-Method
hybrid	1995,2001	O	I-Method
code	2002,2006	O	I-Method
,	2006,2007	O	O
should	2008,2014	O	O
be	2015,2017	O	O
considered	2018,2028	O	O
in	2029,2031	O	O
order	2032,2037	O	O
to	2038,2040	O	O
explain	2041,2048	O	O
the	2049,2052	O	O
data	2053,2057	O	O
.	2057,2058	O	O

For	2059,2062	O	O
the	2063,2066	O	B-Data
small	2067,2072	O	I-Data
scale	2073,2078	O	I-Data
features	2079,2087	O	I-Data
,	2087,2088	O	O
the	2089,2092	O	O
possibility	2093,2104	O	O
that	2105,2109	O	O
a	2110,2111	O	B-Process
flute	2112,2117	O	I-Process
(	2118,2119	O	I-Process
interchange	2119,2130	O	I-Process
)	2130,2131	O	I-Process
instability	2132,2143	O	I-Process
acts	2144,2148	O	O
on	2149,2151	O	O
the	2152,2155	O	B-Material
electrons	2156,2165	O	I-Material
is	2166,2168	O	O
discussed	2169,2178	O	O
.	2178,2179	O	O

This	2180,2184	O	B-Data
instability	2185,2196	O	I-Data
is	2197,2199	O	O
probably	2200,2208	O	O
driven	2209,2215	O	O
by	2216,2218	O	O
strong	2219,2225	O	B-Data
gradients	2226,2235	O	I-Data
in	2236,2238	O	O
the	2239,2242	O	B-Data
plasma	2243,2249	O	I-Data
pressure	2250,2258	O	I-Data
and	2259,2262	O	O
the	2263,2266	O	B-Data
magnetic	2267,2275	O	I-Data
field	2276,2281	O	I-Data
magnitude	2282,2291	O	I-Data
:	2291,2292	O	O
magnetometer	2293,2305	O	B-Material
observations	2306,2318	O	O
show	2319,2323	O	O
clearly	2324,2331	O	O
signatures	2332,2342	O	B-Data
consistent	2343,2353	O	O
with	2354,2358	O	O
the	2359,2362	O	B-Process
(	2363,2364	O	I-Process
expected	2364,2372	O	I-Process
)	2372,2373	O	I-Process
plasma	2374,2380	O	I-Process
pressure	2381,2389	O	I-Process
loss	2390,2394	O	I-Process
due	2395,2398	O	O
to	2399,2401	O	O
ion	2402,2405	O	B-Process
absorption	2406,2416	O	I-Process
at	2417,2419	O	O
Rhea	2420,2424	O	B-Material
.	2424,2425	O	O

Another	2426,2433	O	O
potential	2434,2443	O	O
driver	2444,2450	O	O
of	2451,2453	O	O
the	2454,2457	O	B-Data
instability	2458,2469	O	I-Data
could	2470,2475	O	O
have	2476,2480	O	O
been	2481,2485	O	O
gradients	2486,2495	O	B-Data
in	2496,2498	O	O
the	2499,2502	O	B-Data
cold	2503,2507	O	I-Data
plasma	2508,2514	O	I-Data
density	2515,2522	O	I-Data
,	2522,2523	O	O
which	2524,2529	O	O
are	2530,2533	O	O
,	2533,2534	O	O
however	2535,2542	O	O
,	2542,2543	O	O
surprisingly	2544,2556	O	O
absent	2557,2563	O	O
from	2564,2568	O	O
most	2569,2573	O	B-Process
crossings	2574,2583	O	I-Process
of	2584,2586	O	O
Rhea	2587,2591	O	B-Material
's	2591,2593	O	I-Material
plasma	2594,2600	O	I-Material
wake	2601,2605	O	I-Material
.	2605,2606	O	O

The	2607,2610	O	O
lack	2611,2615	O	O
of	2616,2618	O	O
a	2619,2620	O	B-Process
density	2621,2628	O	I-Process
depletion	2629,2638	O	I-Process
in	2639,2641	O	O
Rhea	2642,2646	O	B-Material
's	2646,2648	O	I-Material
wake	2649,2653	O	I-Material
suggests	2654,2662	O	O
the	2663,2666	O	O
presence	2667,2675	O	O
of	2676,2678	O	O
a	2679,2680	O	B-Material
local	2681,2686	O	I-Material
cold	2687,2691	O	I-Material
plasma	2692,2698	O	I-Material
source	2699,2705	O	I-Material
region	2706,2712	O	I-Material
.	2712,2713	O	O

Hybrid	2714,2720	O	B-Method
plasma	2721,2727	O	I-Method
simulations	2728,2739	O	I-Method
show	2740,2744	O	O
that	2745,2749	O	O
this	2750,2754	O	B-Material
source	2755,2761	O	I-Material
can	2762,2765	O	O
not	2765,2768	O	O
be	2769,2771	O	O
the	2772,2775	O	B-Material
ionized	2776,2783	O	I-Material
component	2784,2793	O	I-Material
of	2794,2796	O	O
Rhea	2797,2801	O	B-Material
's	2801,2803	O	I-Material
weak	2804,2808	O	I-Material
exosphere	2809,2818	O	I-Material
.	2818,2819	O	O

It	2820,2822	O	O
is	2823,2825	O	O
probably	2826,2834	O	O
related	2835,2842	O	O
to	2843,2845	O	O
accelerated	2846,2857	O	B-Material
photoelectrons	2858,2872	O	I-Material
from	2873,2877	O	O
the	2878,2881	O	B-Material
moon	2882,2886	O	I-Material
's	2886,2888	O	I-Material
negatively	2889,2899	O	I-Material
charged	2900,2907	O	I-Material
surface	2908,2915	O	I-Material
,	2915,2916	O	O
indicating	2917,2927	O	O
that	2928,2932	O	O
surface	2933,2940	O	B-Process
charging	2941,2949	O	I-Process
may	2950,2953	O	O
play	2954,2958	O	O
a	2959,2960	O	O
very	2961,2965	O	O
important	2966,2975	O	O
role	2976,2980	O	O
in	2981,2983	O	O
shaping	2984,2991	O	B-Process
Rhea	2992,2996	O	B-Material
's	2996,2998	O	I-Material
magnetospheric	2999,3013	O	I-Material
interaction	3014,3025	O	I-Material
region	3026,3032	O	I-Material
.	3032,3033	O	O

-DOCSTART- (S0019103512003533)

We	0,2	O	O
present	3,10	O	O
comprehensive	11,24	O	B-Data
calculations	25,37	O	I-Data
of	38,40	O	O
the	41,44	O	B-Process
steady	45,51	O	I-Process
state	52,57	O	I-Process
response	58,66	O	I-Process
of	67,69	O	O
Saturn	70,76	O	B-Material
's	76,78	O	I-Material
coupled	79,86	O	I-Material
thermosphere	87,99	O	I-Material
-	99,100	O	I-Material
ionosphere	100,110	O	I-Material
to	111,113	O	O
forcing	114,121	O	O
by	122,124	O	O
solar	125,130	O	B-Process
radiation	131,140	O	I-Process
,	140,141	O	O
magnetospheric	142,156	O	B-Process
energetic	157,166	O	I-Process
electron	167,175	O	I-Process
precipitation	176,189	O	I-Process
and	190,193	O	O
high	194,198	O	B-Data
latitude	199,207	O	I-Data
electric	208,216	O	B-Material
fields	217,223	O	I-Material
caused	224,230	O	O
by	231,233	O	O
sub	234,237	O	B-Process
-	237,238	O	I-Process
corotation	238,248	O	I-Process
of	249,251	O	O
magnetospheric	252,266	O	B-Material
plasma	267,273	O	I-Material
.	273,274	O	O

Significant	275,286	O	O
additions	287,296	O	O
to	297,299	O	O
the	300,303	O	B-Process
physical	304,312	O	I-Process
processes	313,322	O	I-Process
calculated	323,333	O	O
in	334,336	O	O
our	337,340	O	B-Method
Saturn	341,347	O	I-Method
Thermosphere	348,360	O	I-Method
Ionosphere	361,371	O	I-Method
General	372,379	O	I-Method
Circulation	380,391	O	I-Method
Model	392,397	O	I-Method
(	398,399	O	I-Method
STIM	399,403	O	I-Method
-	403,404	O	I-Method
GCM	404,407	O	I-Method
)	407,408	O	I-Method
include	409,416	O	O
the	417,420	O	O
comprehensive	421,434	O	O
and	435,438	O	O
self	439,443	O	O
-	443,444	O	O
consistent	444,454	O	O
treatment	455,464	O	O
of	465,467	O	O
neutral	468,475	O	B-Process
-	475,476	O	I-Process
ion	476,479	O	I-Process
dynamical	480,489	O	I-Process
coupling	490,498	O	I-Process
and	499,502	O	O
the	503,506	O	O
use	507,510	O	O
of	511,513	O	O
self	514,518	O	B-Data
-	518,519	O	I-Data
consistently	519,531	O	I-Data
calculated	532,542	O	I-Data
rates	543,548	O	I-Data
of	549,551	O	O
plasma	552,558	O	B-Process
production	559,569	O	I-Process
from	570,574	O	O
incident	575,583	O	B-Material
energetic	584,593	O	I-Material
electrons	594,603	O	I-Material
.	603,604	O	O

Our	605,608	O	B-Method
simulations	609,620	O	I-Method
successfully	621,633	O	O
reproduce	634,643	O	O
the	644,647	O	O
observed	648,656	O	O
high	657,661	O	B-Data
latitude	662,670	O	I-Data
temperatures	671,683	O	I-Data
as	684,686	O	O
well	687,691	O	O
as	692,694	O	O
the	695,698	O	B-Data
latitudinal	699,710	O	I-Data
variations	711,721	O	I-Data
of	722,724	O	O
ionospheric	725,736	O	B-Data
peak	737,741	O	I-Data
electron	742,750	O	I-Data
densities	751,760	O	I-Data
that	761,765	O	O
have	766,770	O	O
been	771,775	O	O
observed	776,784	O	O
by	785,787	O	O
the	788,791	O	B-Method
Cassini	792,799	O	I-Method
Radio	800,805	O	I-Method
Science	806,813	O	I-Method
Subsystem	814,823	O	I-Method
experiment	824,834	O	I-Method
(	835,836	O	I-Method
RSS	836,839	O	I-Method
)	839,840	O	I-Method
.	840,841	O	O

We	842,844	O	O
find	845,849	O	O
magnetospheric	850,864	O	B-Process
energy	865,871	O	I-Process
deposition	872,882	O	I-Process
to	883,885	O	O
strongly	886,894	O	O
control	895,902	O	B-Process
the	903,906	O	B-Process
flow	907,911	O	I-Process
of	912,914	O	O
mass	915,919	O	B-Material
and	920,923	O	O
energy	924,930	O	B-Material
in	931,933	O	O
the	934,937	O	B-Material
high	938,942	O	I-Material
and	943,946	O	I-Material
mid	947,950	O	I-Material
-	950,951	O	I-Material
latitude	951,959	O	I-Material
thermosphere	960,972	O	I-Material
and	973,976	O	O
thermospheric	977,990	O	B-Process
dynamics	991,999	O	I-Process
to	1000,1002	O	O
play	1003,1007	O	O
a	1008,1009	O	O
crucial	1010,1017	O	O
role	1018,1022	O	O
in	1023,1025	O	O
driving	1026,1033	O	B-Process
this	1034,1038	O	B-Process
flow	1039,1043	O	I-Process
,	1043,1044	O	O
highlighting	1045,1057	O	O
the	1058,1061	O	O
importance	1062,1072	O	O
of	1073,1075	O	O
including	1076,1085	O	O
dynamics	1086,1094	O	B-Process
in	1095,1097	O	O
any	1098,1101	O	B-Method
high	1102,1106	O	I-Method
latitude	1107,1115	O	I-Method
energy	1116,1122	O	I-Method
balance	1123,1130	O	I-Method
studies	1131,1138	O	I-Method
on	1139,1141	O	O
Saturn	1142,1148	O	B-Material
and	1149,1152	O	I-Material
other	1153,1158	O	I-Material
Gas	1159,1162	O	I-Material
Giants	1163,1169	O	I-Material
.	1169,1170	O	O

By	1171,1173	O	O
relating	1174,1182	O	O
observed	1183,1191	O	O
H3	1192,1194	O	B-Data
+	1194,1195	O	I-Data
column	1196,1202	O	I-Data
emissions	1203,1212	O	I-Data
and	1213,1216	O	I-Data
temperatures	1217,1229	O	I-Data
to	1230,1232	O	O
the	1233,1236	O	O
same	1237,1241	O	O
quantities	1242,1252	O	O
inferred	1253,1261	O	O
from	1262,1266	O	O
simulated	1267,1276	O	B-Data
atmosphere	1277,1287	O	I-Data
profiles	1288,1296	O	I-Data
we	1297,1299	O	O
identify	1300,1308	O	O
a	1309,1310	O	O
potential	1311,1320	O	O
method	1321,1327	O	O
of	1328,1330	O	O
better	1331,1337	O	B-Process
constraining	1338,1350	O	I-Process
the	1351,1354	O	B-Material
still	1355,1360	O	I-Material
unknown	1361,1368	O	I-Material
abundance	1369,1378	O	I-Material
of	1379,1381	O	O
vibrationally	1382,1395	O	B-Material
excited	1396,1403	O	I-Material
H2	1404,1406	O	I-Material
which	1407,1412	O	O
strongly	1413,1421	O	O
affects	1422,1429	O	O
the	1430,1433	O	B-Data
H3	1434,1436	O	I-Data
+	1436,1437	O	I-Data
densities	1438,1447	O	I-Data
.	1447,1448	O	O

Our	1449,1452	O	B-Data
calculations	1453,1465	O	I-Data
also	1466,1470	O	O
suggest	1471,1478	O	O
that	1479,1483	O	O
local	1484,1489	O	B-Data
time	1490,1494	O	I-Data
variability	1495,1506	O	I-Data
in	1507,1509	O	O
H3	1510,1512	O	B-Process
+	1512,1513	O	I-Process
column	1514,1520	O	I-Process
emission	1521,1529	O	I-Process
flux	1530,1534	O	I-Process
may	1535,1538	O	O
be	1539,1541	O	O
largely	1542,1549	O	O
driven	1550,1556	O	O
by	1557,1559	O	O
local	1560,1565	O	B-Process
time	1566,1570	O	I-Process
changes	1571,1578	O	I-Process
of	1579,1581	O	O
H3	1582,1584	O	B-Data
+	1584,1585	O	I-Data
densities	1586,1595	O	I-Data
rather	1596,1602	O	O
than	1603,1607	O	O
temperatures	1608,1620	O	B-Data
.	1620,1621	O	O

By	1622,1624	O	O
exploring	1625,1634	O	O
the	1635,1638	O	B-Data
parameter	1639,1648	O	I-Data
space	1649,1654	O	I-Data
of	1655,1657	O	O
possible	1658,1666	O	O
high	1667,1671	O	B-Data
latitude	1672,1680	O	I-Data
electric	1681,1689	O	I-Data
field	1690,1695	O	I-Data
strengths	1696,1705	O	I-Data
and	1706,1709	O	O
incident	1710,1718	O	B-Process
energetic	1719,1728	O	I-Process
electron	1729,1737	O	I-Process
fluxes	1738,1744	O	I-Process
,	1744,1745	O	O
we	1746,1748	O	O
determine	1749,1758	O	O
the	1759,1762	O	B-Data
response	1763,1771	O	I-Data
of	1772,1774	O	O
thermospheric	1775,1788	O	B-Data
polar	1789,1794	O	I-Data
temperatures	1795,1807	O	I-Data
to	1808,1810	O	O
a	1811,1812	O	B-Data
range	1813,1818	O	I-Data
of	1819,1821	O	I-Data
these	1822,1827	O	I-Data
magnetospheric	1828,1842	O	I-Data
forcing	1843,1850	O	I-Data
parameters	1851,1861	O	I-Data
,	1861,1862	O	O
illustrating	1863,1875	O	O
that	1876,1880	O	O
10keV	1881,1886	O	B-Data
electron	1887,1895	O	B-Process
fluxes	1896,1902	O	I-Process
of	1903,1905	O	O
0.1	1906,1909	O	B-Data
-	1909,1910	O	I-Data
1.2mWm-2	1910,1918	O	I-Data
in	1919,1921	O	O
combination	1922,1933	O	O
with	1934,1938	O	O
electric	1939,1947	O	B-Data
field	1948,1953	O	I-Data
strengths	1954,1963	O	I-Data
of	1964,1966	O	O
80	1967,1969	O	B-Data
-	1969,1970	O	I-Data
100mVm-1	1970,1978	O	I-Data
produce	1979,1986	O	O
H3	1987,1989	O	B-Process
+	1989,1990	O	I-Process
emissions	1991,2000	O	I-Process
consistent	2001,2011	O	O
with	2012,2016	O	O
observations	2017,2029	O	O
.	2029,2030	O	O

Our	2031,2034	O	B-Data
calculations	2035,2047	O	I-Data
highlight	2048,2057	O	O
the	2058,2061	O	O
importance	2062,2072	O	O
of	2073,2075	O	O
considering	2076,2087	O	O
thermospheric	2088,2101	O	B-Data
temperatures	2102,2114	O	I-Data
as	2115,2117	O	O
one	2118,2121	O	O
of	2122,2124	O	O
the	2125,2128	O	O
constraints	2129,2140	O	O
when	2141,2145	O	O
examining	2146,2155	O	O
the	2156,2159	O	B-Data
state	2160,2165	O	I-Data
of	2166,2168	O	O
Saturn	2169,2175	O	B-Material
's	2175,2177	O	I-Material
magnetosphere	2178,2191	O	I-Material
and	2192,2195	O	O
its	2196,2199	O	B-Process
coupling	2200,2208	O	I-Process
to	2209,2211	O	O
the	2212,2215	O	B-Material
upper	2216,2221	O	I-Material
atmosphere	2222,2232	O	I-Material
.	2232,2233	O	O

-DOCSTART- (S0019103512003995)

Transits	0,8	O	B-Process
in	9,11	O	O
the	12,15	O	B-Material
H	16,17	O	I-Material

I	18,19	O	I-Material
1216Å	20,25	O	I-Material
(	26,27	O	I-Material
Lyman	27,32	O	I-Material
α	33,34	O	I-Material
)	34,35	O	I-Material
,	35,36	O	I-Material

O	37,38	O	I-Material
I	39,40	O	I-Material
1334Å	41,46	O	I-Material
,	46,47	O	I-Material
C	48,49	O	I-Material
II	50,52	O	I-Material
1335Å	53,58	O	I-Material
,	58,59	O	I-Material
and	60,63	O	I-Material
Si	64,66	O	I-Material
III	67,70	O	I-Material
1206.5Å	71,78	O	I-Material
lines	79,84	O	I-Material
constrain	85,94	O	O
the	95,98	O	B-Data
properties	99,109	O	I-Data
of	110,112	O	O
the	113,116	O	B-Material
upper	117,122	O	I-Material
atmosphere	123,133	O	I-Material
of	134,136	O	O
HD209458b	137,146	O	B-Material
.	146,147	O	O

In	148,150	O	O
addition	151,159	O	O
to	160,162	O	O
probing	163,170	O	O
the	171,174	O	B-Data
temperature	175,186	O	I-Data
and	187,190	O	I-Data
density	191,198	O	I-Data
profiles	199,207	O	I-Data
in	208,210	O	O
the	211,214	O	B-Material
thermosphere	215,227	O	I-Material
,	227,228	O	O
they	229,233	O	O
have	234,238	O	O
implications	239,251	O	O
for	252,255	O	O
the	256,259	O	B-Data
properties	260,270	O	I-Data
of	271,273	O	O
the	274,277	O	B-Material
lower	278,283	O	I-Material
atmosphere	284,294	O	I-Material
.	294,295	O	O

Fits	296,300	O	O
to	301,303	O	O
the	304,307	O	O
observations	308,320	O	O
with	321,325	O	O
a	326,327	O	B-Material
simple	328,334	O	I-Material
empirical	335,344	O	I-Material
model	345,350	O	I-Material
and	351,354	O	O
a	355,356	O	O
direct	357,363	O	O
comparison	364,374	O	O
with	375,379	O	O
a	380,381	O	B-Material
more	382,386	O	I-Material
complex	387,394	O	I-Material
hydrodynamic	395,407	O	I-Material
model	408,413	O	I-Material
constrain	414,423	O	O
the	424,427	O	B-Data
mean	428,432	O	I-Data
temperature	433,444	O	I-Data
and	445,448	O	O
ionization	449,459	O	B-Data
state	460,465	O	I-Data
of	466,468	O	O
the	469,472	O	B-Material
atmosphere	473,483	O	I-Material
,	483,484	O	O
and	485,488	O	O
imply	489,494	O	O
that	495,499	O	O
the	500,503	O	B-Data
optical	504,511	O	I-Data
depth	512,517	O	I-Data
of	518,520	O	O
the	521,524	O	B-Material
extended	525,533	O	I-Material
thermosphere	534,546	O	I-Material
of	547,549	O	O
the	550,553	O	B-Material
planet	554,560	O	I-Material
in	561,563	O	O
the	564,567	O	B-Material
atomic	568,574	O	I-Material
resonance	575,584	O	I-Material
lines	585,590	O	I-Material
is	591,593	O	O
significant	594,605	O	O
.	605,606	O	O

In	607,609	O	O
particular	610,620	O	O
,	620,621	O	O
it	622,624	O	O
is	625,627	O	O
sufficient	628,638	O	O
to	639,641	O	O
explain	642,649	O	O
the	650,653	O	B-Data
observed	654,662	O	I-Data
transit	663,670	O	I-Data
depths	671,677	O	I-Data
in	678,680	O	O
the	681,684	O	B-Material
H	685,686	O	I-Material
I	687,688	O	I-Material
1216Å	689,694	O	I-Material
line	695,699	O	I-Material
.	699,700	O	O

The	701,704	O	B-Process
detection	705,714	O	I-Process
of	715,717	O	O
O	718,719	O	B-Material
at	720,722	O	O
high	723,727	O	B-Data
altitudes	728,737	O	I-Data
implies	738,745	O	O
that	746,750	O	O
the	751,754	O	B-Data
minimum	755,762	O	I-Data
mass	763,767	O	I-Data
loss	768,772	O	I-Data
rate	773,777	O	I-Data
from	778,782	O	O
the	783,786	O	B-Material
planet	787,793	O	I-Material
is	794,796	O	O
approximately	797,810	O	B-Data
6×106kgs-1	811,821	O	I-Data
.	821,822	O	O

The	823,826	O	B-Data
mass	827,831	O	I-Data
loss	832,836	O	I-Data
rate	837,841	O	I-Data
based	842,847	O	O
on	848,850	O	O
our	851,854	O	B-Material
hydrodynamic	855,867	O	I-Material
model	868,873	O	I-Material
is	874,876	O	O
higher	877,883	O	O
than	884,888	O	O
this	889,893	O	O
and	894,897	O	O
implies	898,905	O	O
that	906,910	O	O
diffusive	911,920	O	B-Process
separation	921,931	O	I-Process
is	932,934	O	O
prevented	935,944	O	O
for	945,948	O	O
neutral	949,956	O	B-Material
species	957,964	O	I-Material
with	965,969	O	O
a	970,971	O	B-Data
mass	972,976	O	I-Data
lower	977,982	O	I-Data
than	983,987	O	I-Data
about	988,993	O	I-Data
130amu	994,1000	O	I-Data
by	1001,1003	O	O
the	1004,1007	O	B-Process
escape	1008,1014	O	I-Process
of	1015,1017	O	O
H.	1018,1020	O	B-Material
Heavy	1021,1026	O	B-Material
ions	1027,1031	O	I-Material
are	1032,1035	O	O
transported	1036,1047	O	B-Process
to	1048,1050	O	O
the	1051,1054	O	B-Material
upper	1055,1060	O	I-Material
atmosphere	1061,1071	O	I-Material
by	1072,1074	O	O
Coulomb	1075,1082	O	B-Process
collisions	1083,1093	O	I-Process
with	1094,1098	O	O
H+	1099,1101	O	B-Material
and	1102,1105	O	O
their	1106,1111	O	B-Material
presence	1112,1120	O	I-Material
does	1121,1125	O	O
not	1126,1129	O	O
provide	1130,1137	O	O
as	1138,1140	O	O
strong	1141,1147	O	O
constraints	1148,1159	O	O
on	1160,1162	O	O
the	1163,1166	O	B-Data
mass	1167,1171	O	I-Data
loss	1172,1176	O	I-Data
rate	1177,1181	O	I-Data
as	1182,1184	O	O
the	1185,1188	O	B-Process
detection	1189,1198	O	I-Process
of	1199,1201	O	O
heavy	1202,1207	O	B-Material
neutral	1208,1215	O	I-Material
atoms	1216,1221	O	I-Material
.	1221,1222	O	O

Models	1223,1229	O	B-Material
of	1230,1232	O	O
the	1233,1236	O	B-Material
upper	1237,1242	O	I-Material
atmosphere	1243,1253	O	I-Material
with	1254,1258	O	O
solar	1259,1264	O	B-Process
composition	1265,1276	O	I-Process
and	1277,1280	O	I-Process
heating	1281,1288	O	I-Process
based	1289,1294	O	O
on	1295,1297	O	O
the	1298,1301	O	B-Process
average	1302,1309	O	I-Process
solar	1310,1315	O	I-Process
X	1316,1317	O	I-Process
-	1317,1318	O	I-Process
ray	1318,1321	O	I-Process
and	1322,1325	O	I-Process
EUV	1326,1329	O	I-Process
flux	1330,1334	O	I-Process
agree	1335,1340	O	O
broadly	1341,1348	O	O
with	1349,1353	O	O
the	1354,1357	O	O
observations	1358,1370	O	O
but	1371,1374	O	O
tend	1375,1379	O	O
to	1380,1382	O	O
underestimate	1383,1396	O	O
the	1397,1400	O	B-Data
transit	1401,1408	O	I-Data
depths	1409,1415	O	I-Data
in	1416,1418	O	O

the	1419,1422	O	B-Material
O	1423,1424	O	I-Material
I	1425,1426	O	I-Material
,	1426,1427	O	I-Material
C	1428,1429	O	I-Material
II	1430,1432	O	I-Material
,	1432,1433	O	I-Material
and	1434,1437	O	I-Material
Si	1438,1440	O	I-Material
III	1441,1444	O	I-Material
lines	1445,1450	O	I-Material
.	1450,1451	O	O

This	1452,1456	O	O
suggests	1457,1465	O	O
that	1466,1470	O	O
the	1471,1474	O	B-Data
temperature	1475,1486	O	I-Data
and/or	1487,1493	O	O
elemental	1494,1503	O	B-Data
abundances	1504,1514	O	I-Data
in	1515,1517	O	O
the	1518,1521	O	B-Material
thermosphere	1522,1534	O	I-Material
may	1535,1538	O	O
be	1539,1541	O	O
higher	1542,1548	O	O
than	1549,1553	O	O
expected	1554,1562	O	O
from	1563,1567	O	O
such	1568,1572	O	B-Material
models	1573,1579	O	I-Material
.	1579,1580	O	O

Observations	1581,1593	O	O
of	1594,1596	O	O
the	1597,1600	O	B-Process
escaping	1601,1609	O	I-Process
atmosphere	1610,1620	O	I-Process
can	1621,1624	O	O
potentially	1625,1636	O	O
be	1637,1639	O	O
used	1640,1644	O	O
to	1645,1647	O	O
constrain	1648,1657	O	O
the	1658,1661	O	B-Data
strength	1662,1670	O	I-Data
of	1671,1673	O	O
the	1674,1677	O	B-Material
planetary	1678,1687	O	I-Material
magnetic	1688,1696	O	I-Material
field	1697,1702	O	I-Material
.	1702,1703	O	O

We	1704,1706	O	O
find	1707,1711	O	O
that	1712,1716	O	O
a	1717,1718	O	B-Data
magnetic	1719,1727	O	I-Data
moment	1728,1734	O	I-Data
of	1735,1737	O	I-Data
m≲0.04mJ	1738,1746	O	I-Data
,	1746,1747	O	O
where	1748,1753	O	O
mJ	1754,1756	O	B-Data
is	1757,1759	O	O
the	1760,1763	O	B-Process
jovian	1764,1770	O	I-Process
magnetic	1771,1779	O	I-Process
moment	1780,1786	O	I-Process
,	1786,1787	O	O
allows	1788,1794	O	O
the	1795,1798	O	B-Material
ions	1799,1803	O	I-Material
to	1804,1806	O	O
escape	1807,1813	O	B-Process
globally	1814,1822	O	I-Process
rather	1823,1829	O	O
than	1830,1834	O	O
only	1835,1839	O	O
along	1840,1845	O	O
open	1846,1850	O	B-Material
field	1851,1856	O	I-Material
lines	1857,1862	O	I-Material
.	1862,1863	O	O

The	1864,1867	O	B-Process
detection	1868,1877	O	I-Process
of	1878,1880	O	O
Si2	1881,1884	O	B-Material
+	1884,1885	O	I-Material
in	1886,1888	O	O
the	1889,1892	O	B-Material
thermosphere	1893,1905	O	I-Material
indicates	1906,1915	O	O
that	1916,1920	O	O
clouds	1921,1927	O	B-Material
of	1928,1930	O	I-Material
forsterite	1931,1941	O	I-Material
and	1942,1945	O	I-Material
enstatite	1946,1955	O	I-Material
do	1956,1958	O	O
not	1959,1962	O	O
form	1963,1967	O	O
in	1968,1970	O	O
the	1971,1974	O	B-Material
lower	1975,1980	O	I-Material
atmosphere	1981,1991	O	I-Material
.	1991,1992	O	O

This	1993,1997	O	O
has	1998,2001	O	O
implications	2002,2014	O	O
for	2015,2018	O	O
the	2019,2022	O	B-Data
temperature	2023,2034	O	I-Data
and	2035,2038	O	O
dynamics	2039,2047	O	B-Process
of	2048,2050	O	O
the	2051,2054	O	B-Material
atmosphere	2055,2065	O	I-Material
that	2066,2070	O	O
also	2071,2075	O	O
affect	2076,2082	O	O
the	2083,2086	O	O
interpretation	2087,2101	O	O
of	2102,2104	O	O
transit	2105,2112	O	B-Process
and	2113,2116	O	I-Process
secondary	2117,2126	O	I-Process
eclipse	2127,2134	O	I-Process
observations	2135,2147	O	O
in	2148,2150	O	O
the	2151,2154	O	B-Data
visible	2155,2162	O	I-Data
and	2163,2166	O	I-Data
infrared	2167,2175	O	I-Data
wavelengths	2176,2187	O	I-Data
.	2187,2188	O	O

-DOCSTART- (S0019103512004009)

The	0,3	O	B-Process
detections	4,14	O	I-Process
of	15,17	O	O
atomic	18,24	O	B-Material
hydrogen	25,33	O	I-Material
,	33,34	O	I-Material
heavy	35,40	O	I-Material
atoms	41,46	O	I-Material
and	47,50	O	I-Material
ions	51,55	O	I-Material
surrounding	56,67	O	O
the	68,71	O	B-Material
extrasolar	72,82	O	I-Material
giant	83,88	O	I-Material
planet	89,95	O	I-Material
(	96,97	O	I-Material
EGP	97,100	O	I-Material
)	100,101	O	I-Material

HD209458b	102,111	O	I-Material
constrain	112,121	O	O
the	122,125	O	B-Data
composition	126,137	O	I-Data
,	137,138	O	I-Data
temperature	139,150	O	I-Data
and	151,154	O	I-Data
density	155,162	O	I-Data
profiles	163,171	O	I-Data
in	172,174	O	O
its	175,178	O	B-Material
upper	179,184	O	I-Material
atmosphere	185,195	O	I-Material
.	195,196	O	O

Thus	197,201	O	O
the	202,205	O	O
observations	206,218	O	O
provide	219,226	O	O
guidance	227,235	O	O
for	236,239	O	O
models	240,246	O	B-Material
that	247,251	O	O
have	252,256	O	O
so	257,259	O	O
far	260,263	O	O
predicted	264,273	O	B-Process
a	274,275	O	B-Data
range	276,281	O	I-Data
of	282,284	O	I-Data
possible	285,293	O	I-Data
conditions	294,304	O	I-Data
.	304,305	O	O

We	306,308	O	O
present	309,316	O	O
the	317,320	O	B-Material
first	321,326	O	I-Material
hydrodynamic	327,339	O	I-Material
escape	340,346	O	I-Material
model	347,352	O	I-Material
for	353,356	O	O
the	357,360	O	B-Material
upper	361,366	O	I-Material
atmosphere	367,377	O	I-Material
that	378,382	O	O
includes	383,391	O	O
all	392,395	O	O
of	396,398	O	O
the	399,402	O	B-Material
detected	403,411	O	I-Material
species	412,419	O	I-Material
in	420,422	O	O
order	423,428	O	O
to	429,431	O	O
explain	432,439	O	O
their	440,445	O	B-Material
presence	446,454	O	I-Material
at	455,457	O	O
high	458,462	O	B-Data
altitudes	463,472	O	I-Data
,	472,473	O	O
and	474,477	O	O
to	478,480	O	O
further	481,488	O	O
constrain	489,498	O	O
the	499,502	O	B-Data
temperature	503,514	O	I-Data
and	515,518	O	I-Data
velocity	519,527	O	I-Data
profiles	528,536	O	I-Data
.	536,537	O	O

This	538,542	O	B-Material
model	543,548	O	I-Material
calculates	549,559	O	B-Process
the	560,563	O	B-Data
stellar	564,571	O	I-Data
heating	572,579	O	I-Data
rates	580,585	O	I-Data
based	586,591	O	O
on	592,594	O	O
recent	595,601	O	B-Data
estimates	602,611	O	I-Data
of	612,614	O	O
photoelectron	615,628	O	B-Process
heating	629,636	O	I-Process
efficiencies	637,649	O	I-Process
,	649,650	O	O
and	651,654	O	O
includes	655,663	O	O
the	664,667	O	B-Data
photochemistry	668,682	O	I-Data
of	683,685	O	O
heavy	686,691	O	B-Material
atoms	692,697	O	I-Material
and	698,701	O	I-Material
ions	702,706	O	I-Material
in	707,709	O	O
addition	710,718	O	O
to	719,721	O	O
hydrogen	722,730	O	B-Material
and	731,734	O	O
helium	735,741	O	B-Material
.	741,742	O	O

The	743,746	O	B-Data
composition	747,758	O	I-Data
at	759,761	O	O
the	762,765	O	B-Data
lower	766,771	O	I-Data
boundary	772,780	O	I-Data
of	781,783	O	O
the	784,787	O	B-Material
escape	788,794	O	I-Material
model	795,800	O	I-Material
is	801,803	O	O
constrained	804,815	O	O
by	816,818	O	O
a	819,820	O	B-Material
full	821,825	O	I-Material
photochemical	826,839	O	I-Material
model	840,845	O	I-Material
of	846,848	O	O
the	849,852	O	B-Material
lower	853,858	O	I-Material
atmosphere	859,869	O	I-Material
.	869,870	O	O

We	871,873	O	O
confirm	874,881	O	O
that	882,886	O	O
molecules	887,896	O	B-Material
dissociate	897,907	O	B-Process
near	908,912	O	O
the	913,916	O	B-Data
1μbar	917,922	O	I-Data
level	923,928	O	I-Data
,	928,929	O	O
and	930,933	O	O
find	934,938	O	O
that	939,943	O	O
complex	944,951	O	B-Data
molecular	952,961	O	I-Data
chemistry	962,971	O	I-Data
does	972,976	O	O
not	977,980	O	O
need	981,985	O	O
to	986,988	O	O
be	989,991	O	O
included	992,1000	O	O
above	1001,1006	O	O
this	1007,1011	O	B-Data
level	1012,1017	O	I-Data
.	1017,1018	O	O

We	1019,1021	O	O
also	1022,1026	O	O
confirm	1027,1034	O	O
that	1035,1039	O	O
diffusive	1040,1049	O	B-Process
separation	1050,1060	O	I-Process
of	1061,1063	O	O
the	1064,1067	O	B-Material
detected	1068,1076	O	I-Material
species	1077,1084	O	I-Material
does	1085,1089	O	O
not	1090,1093	O	O
occur	1094,1099	O	O
because	1100,1107	O	O
the	1108,1111	O	B-Material
heavy	1112,1117	O	I-Material
atoms	1118,1123	O	I-Material
and	1124,1127	O	I-Material
ions	1128,1132	O	I-Material
collide	1133,1140	O	B-Process
frequently	1141,1151	O	I-Process
with	1152,1156	O	O
the	1157,1160	O	B-Material
rapidly	1161,1168	O	I-Material
escaping	1169,1177	O	I-Material
H	1178,1179	O	I-Material
and	1180,1183	O	I-Material
H+	1184,1186	O	I-Material
.	1186,1187	O	O

This	1188,1192	O	O
means	1193,1198	O	O
that	1199,1203	O	O
the	1204,1207	O	O
abundance	1208,1217	O	O
of	1218,1220	O	O
the	1221,1224	O	B-Material
heavy	1225,1230	O	I-Material
atoms	1231,1236	O	I-Material
and	1237,1240	O	I-Material
ions	1241,1245	O	I-Material
in	1246,1248	O	O
the	1249,1252	O	B-Material
thermosphere	1253,1265	O	I-Material
simply	1266,1272	O	O
depends	1273,1280	O	O
on	1281,1283	O	O
the	1284,1287	O	B-Data
elemental	1288,1297	O	I-Data
abundances	1298,1308	O	I-Data
and	1309,1312	O	O
ionization	1313,1323	O	B-Data
rates	1324,1329	O	I-Data
.	1329,1330	O	O

We	1331,1333	O	O
show	1334,1338	O	O
that	1339,1343	O	O
,	1343,1344	O	O
as	1345,1347	O	O
expected	1348,1356	O	O
,	1356,1357	O	O
H	1358,1359	O	B-Material
and	1360,1363	O	O
O	1364,1365	O	B-Material
remain	1366,1372	O	O
mostly	1373,1379	O	O
neutral	1380,1387	O	B-Data
up	1388,1390	O	B-Data
to	1391,1393	O	I-Data
at	1394,1396	O	I-Data
least	1397,1402	O	I-Data
3Rp	1403,1406	O	I-Data
,	1406,1407	O	O
whereas	1408,1415	O	O
both	1416,1420	O	B-Material
C	1421,1422	O	I-Material
and	1423,1426	O	I-Material
Si	1427,1429	O	I-Material
are	1430,1433	O	O
mostly	1434,1440	O	O
ionized	1441,1448	O	B-Process
at	1449,1451	O	O
significantly	1452,1465	O	B-Data
lower	1466,1471	O	I-Data
altitudes	1472,1481	O	I-Data
.	1481,1482	O	O

We	1483,1485	O	O
also	1486,1490	O	O
explore	1491,1498	O	O
the	1499,1502	O	B-Data
temperature	1503,1514	O	I-Data
and	1515,1518	O	I-Data
velocity	1519,1527	O	I-Data
profiles	1528,1536	O	I-Data
,	1536,1537	O	O
and	1538,1541	O	O
find	1542,1546	O	O
that	1547,1551	O	O
the	1552,1555	O	B-Data
outflow	1556,1563	O	I-Data
speed	1564,1569	O	I-Data
and	1570,1573	O	O
the	1574,1577	O	B-Data
temperature	1578,1589	O	I-Data
gradients	1590,1599	O	I-Data
depend	1600,1606	O	O
strongly	1607,1615	O	O
on	1616,1618	O	O
the	1619,1622	O	B-Data
assumed	1623,1630	O	I-Data
heating	1631,1638	O	I-Data
efficiencies	1639,1651	O	I-Data
.	1651,1652	O	O

Our	1653,1656	O	B-Material
models	1657,1663	O	I-Material
predict	1664,1671	O	O
an	1672,1674	O	B-Data
upper	1675,1680	O	I-Data
limit	1681,1686	O	I-Data
of	1687,1689	O	I-Data
8000	1690,1694	O	I-Data
K	1694,1695	O	I-Data
for	1696,1699	O	O
the	1700,1703	O	B-Data
mean	1704,1708	O	I-Data
(	1709,1710	O	I-Data
pressure	1710,1718	O	I-Data
averaged	1719,1727	O	I-Data
)	1727,1728	O	I-Data
temperature	1729,1740	O	I-Data
below	1741,1746	O	I-Data
3Rp	1747,1750	O	I-Data
,	1750,1751	O	O
with	1752,1756	O	O
a	1757,1758	O	B-Data
typical	1759,1766	O	I-Data
value	1767,1772	O	I-Data
of	1773,1775	O	I-Data
7000	1776,1780	O	I-Data
K	1780,1781	O	I-Data
based	1782,1787	O	O
on	1788,1790	O	O
the	1791,1794	O	B-Process
average	1795,1802	O	I-Process
solar	1803,1808	O	I-Process
XUV	1809,1812	O	I-Process
flux	1813,1817	O	I-Process
at	1818,1820	O	O
0.047AU	1821,1828	O	B-Data
.	1828,1829	O	O

We	1830,1832	O	O
use	1833,1836	O	O
these	1837,1842	O	B-Data
temperature	1843,1854	O	I-Data
limits	1855,1861	O	I-Data
and	1862,1865	O	O
the	1866,1869	O	B-Data
observations	1870,1882	O	I-Data
to	1883,1885	O	O
evaluate	1886,1894	O	B-Process
the	1895,1898	O	O
role	1899,1903	O	O
of	1904,1906	O	O
stellar	1907,1914	O	B-Data
energy	1915,1921	O	I-Data
in	1922,1924	O	O
heating	1925,1932	O	B-Process
the	1933,1936	O	B-Material
upper	1937,1942	O	I-Material
atmosphere	1943,1953	O	I-Material
.	1953,1954	O	O

-DOCSTART- (S0032063312000487)

Waves	0,5	O	B-Material
on	6,8	O	I-Material
the	9,12	O	I-Material
surface	13,20	O	I-Material
of	21,23	O	I-Material
a	24,25	O	I-Material
planetary	26,35	O	I-Material
magnetopause	36,48	O	I-Material
promote	49,56	O	O
energy	57,63	O	B-Process
transport	64,73	O	I-Process
into	74,78	O	O
the	79,82	O	B-Material
magnetosphere	83,96	O	I-Material
,	96,97	O	O
representing	98,110	O	O
an	111,113	O	O
important	114,123	O	O
aspect	124,130	O	O
of	131,133	O	O
solar	134,139	O	B-Process
wind	140,144	O	I-Process
-	144,145	O	I-Process
magnetosphere	145,158	O	I-Process
coupling	159,167	O	I-Process
.	167,168	O	O

At	169,171	O	O
Saturn	172,178	O	B-Material
's	178,180	O	I-Material
magnetopause	181,193	O	I-Material
it	194,196	O	O
has	197,200	O	O
been	201,205	O	O
proposed	206,214	O	O
that	215,219	O	O
growth	220,226	O	B-Process
of	227,229	O	O
the	230,233	O	B-Process
Kelvin	234,240	O	I-Process
-	240,241	O	I-Process
Helmholtz	241,250	O	I-Process
(	251,252	O	I-Process
K	252,253	O	I-Process
-	253,254	O	I-Process
H	254,255	O	I-Process
)	255,256	O	I-Process
instability	257,268	O	I-Process
produces	269,277	O	O
greater	278,285	O	B-Process
wave	286,290	O	I-Process
activity	291,299	O	I-Process
on	300,302	O	O
the	303,306	O	B-Material
dawn	307,311	O	I-Material
side	312,316	O	I-Material
of	317,319	O	O
the	320,323	O	B-Material
surface	324,331	O	I-Material
than	332,336	O	O
on	337,339	O	O
the	340,343	O	B-Material
dusk	344,348	O	I-Material
side	349,353	O	I-Material
.	353,354	O	O

We	355,357	O	O
test	358,362	O	O
this	363,367	O	O
hypothesis	368,378	O	O
using	379,384	O	O
data	385,389	O	O
taken	390,395	O	O
by	396,398	O	O
the	399,402	O	B-Material
Cassini	403,410	O	I-Material
spacecraft	411,421	O	I-Material
during	422,428	O	O
crossings	429,438	O	B-Process
of	439,441	O	O
Saturn	442,448	O	B-Material
's	448,450	O	I-Material
magnetopause	451,463	O	I-Material
.	463,464	O	O

Surface	465,472	O	B-Process
orientation	473,484	O	I-Process
perturbations	485,498	O	I-Process
are	499,502	O	O
primarily	503,512	O	O
controlled	513,523	O	O
by	524,526	O	O
the	527,530	O	B-Data
local	531,536	O	I-Data
magnetospheric	537,551	O	I-Data
magnetic	552,560	O	I-Data
field	561,566	O	I-Data
orientation	567,578	O	I-Data
,	578,579	O	O
and	580,583	O	O
are	584,587	O	O
generally	588,597	O	O
greater	598,605	O	O
at	606,608	O	O
dusk	609,613	O	B-Data
than	614,618	O	O
at	619,621	O	O
dawn	622,626	O	B-Data
.	626,627	O	O

53	628,630	O	B-Data
%	630,631	O	I-Data
of	632,634	O	O
all	635,638	O	B-Process
crossings	639,648	O	I-Process
were	649,653	O	O
part	654,658	O	O
of	659,661	O	O
a	662,663	O	B-Process
sequence	664,672	O	I-Process
of	673,675	O	I-Process
regular	676,683	O	I-Process
oscillations	684,696	O	I-Process
arising	697,704	O	O
in	705,707	O	O
consecutive	708,719	O	B-Data
surface	720,727	O	I-Data
normals	728,735	O	I-Data
that	736,740	O	O
is	741,743	O	O
strong	744,750	O	O
evidence	751,759	O	O
for	760,763	O	O
tailward	764,772	O	B-Process
propagating	773,784	O	I-Process
surface	785,792	O	I-Process
waves	793,798	O	I-Process
,	798,799	O	O
with	800,804	O	O
no	805,807	O	O
detectable	808,818	O	O
local	819,824	O	B-Data
time	825,829	O	I-Data
asymmetry	830,839	O	I-Data
in	840,842	O	O
this	843,847	O	B-Process
phenomenon	848,858	O	I-Process
.	858,859	O	O

We	860,862	O	O
estimate	863,871	O	B-Process
the	872,875	O	B-Data
dominant	876,884	O	I-Data
wave	885,889	O	I-Data
period	890,896	O	I-Data
to	897,899	O	O
be	900,902	O	O
∼5h	903,906	O	B-Data
at	907,909	O	I-Data
dawn	910,914	O	I-Data
and	915,918	O	I-Data
∼3h	919,922	O	I-Data
at	923,925	O	I-Data
dusk	926,930	O	I-Data
.	930,931	O	O

The	932,935	O	O
role	936,940	O	O
played	941,947	O	O
by	948,950	O	O
the	951,954	O	B-Material
magnetospheric	955,969	O	I-Material
magnetic	970,978	O	I-Material
field	979,984	O	I-Material
,	984,985	O	O
tailward	986,994	O	B-Process
wave	995,999	O	I-Process
propagation	1000,1011	O	I-Process
,	1011,1012	O	O
and	1013,1016	O	O
the	1017,1020	O	B-Data
dawn	1021,1025	O	I-Data
-	1025,1026	O	I-Data
dusk	1026,1030	O	I-Data
difference	1031,1041	O	I-Data
in	1042,1044	O	O
wave	1045,1049	O	B-Data
period	1050,1056	O	I-Data
suggests	1057,1065	O	O
that	1066,1070	O	O
K	1071,1072	O	B-Process
-	1072,1073	O	I-Process
H	1073,1074	O	I-Process
instability	1075,1086	O	I-Process
is	1087,1089	O	O
a	1090,1091	O	B-Process
major	1092,1097	O	I-Process
wave	1098,1102	O	I-Process
driving	1103,1110	O	I-Process
mechanism	1111,1120	O	I-Process
.	1120,1121	O	O

Using	1122,1127	O	O
linear	1128,1134	O	B-Method
K	1135,1136	O	I-Method
-	1136,1137	O	I-Method
H	1137,1138	O	I-Method
theory	1139,1145	O	I-Method
we	1146,1148	O	O
estimate	1149,1157	O	O
the	1158,1161	O	B-Data
dominant	1162,1170	O	I-Data
wavelength	1171,1181	O	I-Data
to	1182,1184	O	O
be	1185,1187	O	O
∼10	1188,1191	O	B-Data
Saturn	1192,1198	O	I-Data
radii	1199,1204	O	I-Data
(	1205,1206	O	I-Data
RS	1206,1208	O	I-Data
)	1208,1209	O	I-Data
and	1210,1213	O	O
amplitude	1214,1223	O	B-Data
to	1224,1226	O	O
be	1227,1229	O	O
∼1	1230,1232	O	B-Data
RS	1233,1235	O	I-Data
at	1236,1238	O	I-Data
both	1239,1243	O	I-Data
dawn	1244,1248	O	I-Data
and	1249,1252	O	I-Data
dusk	1253,1257	O	I-Data
,	1257,1258	O	O
giving	1259,1265	O	O
propagation	1266,1277	O	B-Data
speeds	1278,1284	O	I-Data
of	1285,1287	O	I-Data
∼30	1288,1291	O	I-Data

and	1292,1295	O	I-Data
∼50kms-1	1296,1304	O	I-Data
at	1305,1307	O	I-Data
dawn	1308,1312	O	I-Data
and	1313,1316	O	I-Data
dusk	1317,1321	O	I-Data
,	1321,1322	O	O
respectively	1323,1335	O	O
.	1335,1336	O	O

The	1337,1340	O	O
lack	1341,1345	O	O
of	1346,1348	O	O
the	1349,1352	O	B-Data
hypothesized	1353,1365	O	I-Data
dawn	1366,1370	O	I-Data
-	1370,1371	O	I-Data
dusk	1371,1375	O	I-Data
asymmetry	1376,1385	O	I-Data
in	1386,1388	O	O
wave	1389,1393	O	B-Process
activity	1394,1402	O	I-Process
demonstrates	1403,1415	O	O
that	1416,1420	O	O
we	1421,1423	O	O
need	1424,1428	O	O
to	1429,1431	O	O
revise	1432,1438	O	O
our	1439,1442	O	O
understanding	1443,1456	O	O
of	1457,1459	O	O
the	1460,1463	O	B-Process
growth	1464,1470	O	I-Process
of	1471,1473	O	O
the	1474,1477	O	B-Process
K	1478,1479	O	I-Process
-	1479,1480	O	I-Process
H	1480,1481	O	I-Process
instability	1482,1493	O	I-Process
at	1494,1496	O	O
Saturn	1497,1503	O	B-Material
's	1503,1505	O	I-Material
magnetopause	1506,1518	O	I-Material
,	1518,1519	O	O
which	1520,1525	O	O
will	1526,1530	O	O
have	1531,1535	O	O
implications	1536,1548	O	O
for	1549,1552	O	O
the	1553,1556	O	O
study	1557,1562	O	O
of	1563,1565	O	O
other	1566,1571	O	B-Material
planetary	1572,1581	O	I-Material
magnetospheres	1582,1596	O	I-Material
.	1596,1597	O	O

Highlights	1598,1608	O	O
►	1609,1610	O	O

Surface	1611,1618	O	B-Material
waves	1619,1624	O	I-Material
on	1625,1627	O	I-Material
a	1628,1629	O	I-Material
planetary	1630,1639	O	I-Material
magnetopause	1640,1652	O	I-Material
transport	1653,1662	O	B-Process
energy	1663,1669	O	B-Material
into	1670,1674	O	O
the	1675,1678	O	B-Material
magnetosphere	1679,1692	O	I-Material
.	1692,1693	O	O

►	1694,1695	O	O

Differences	1696,1707	O	B-Data
in	1708,1710	O	O
the	1711,1714	O	B-Data
level	1715,1720	O	I-Data
of	1721,1723	O	O
wave	1724,1728	O	B-Process
activity	1729,1737	O	I-Process
across	1738,1744	O	O
Saturn	1745,1751	O	B-Material
's	1751,1753	O	I-Material
magnetopause	1754,1766	O	I-Material
has	1767,1770	O	O
been	1771,1775	O	O
predicted	1776,1785	O	B-Process
.	1785,1786	O	O

►	1787,1788	O	O

Kelvin	1789,1795	O	B-Material
-	1795,1796	O	I-Material
Helmholtz	1796,1805	O	I-Material
waves	1806,1811	O	I-Material
often	1812,1817	O	O
form	1818,1822	O	B-Process
on	1823,1825	O	O
Saturn	1826,1832	O	B-Material
's	1832,1834	O	I-Material
magnetopause	1835,1847	O	I-Material
surface	1848,1855	O	I-Material
.	1855,1856	O	O

►	1857,1858	O	O

There	1859,1864	O	O
is	1865,1867	O	O
no	1868,1870	O	O
evidence	1871,1879	O	O
for	1880,1883	O	O
the	1884,1887	O	B-Data
predicted	1888,1897	O	I-Data
difference	1898,1908	O	I-Data
across	1909,1915	O	O
the	1916,1919	O	B-Material
surface	1920,1927	O	I-Material
.	1927,1928	O	O

►	1929,1930	O	O

We	1931,1933	O	O
need	1934,1938	O	O
to	1939,1941	O	O
revise	1942,1948	O	O
our	1949,1952	O	O
understanding	1953,1966	O	O
of	1967,1969	O	O
surface	1970,1977	O	B-Material
waves	1978,1983	O	I-Material
on	1984,1986	O	I-Material
Saturn	1987,1993	O	I-Material
's	1993,1995	O	I-Material
magnetopause	1996,2008	O	I-Material
.	2008,2009	O	O

-DOCSTART- (S0032063312002437)

The	0,3	O	B-Process
transterminator	4,19	O	I-Process
ion	20,23	O	I-Process
flow	24,28	O	I-Process
in	29,31	O	O
the	32,35	O	B-Material
Venusian	36,44	O	I-Material
ionosphere	45,55	O	I-Material
is	56,58	O	O
observed	59,67	O	O
at	68,70	O	O
solar	71,76	O	B-Data
minimum	77,84	O	I-Data
for	85,88	O	O
the	89,92	O	O
first	93,98	O	O
time	99,103	O	O
.	103,104	O	O

Such	105,109	O	O
a	110,111	O	B-Process
flow	112,116	O	I-Process
,	116,117	O	O
which	118,123	O	O
transports	124,134	O	B-Process
ions	135,139	O	B-Material
from	140,144	O	O
the	145,148	O	B-Data
day	149,152	O	I-Data
to	153,155	O	I-Data
the	156,159	O	I-Data
nightside	160,169	O	I-Data
,	169,170	O	O
has	171,174	O	O
been	175,179	O	O
observed	180,188	O	O
previously	189,199	O	O
around	200,206	O	O
solar	207,212	O	B-Data
maximum	213,220	O	I-Data
.	220,221	O	O

At	222,224	O	O
solar	225,230	O	B-Data
minimum	231,238	O	I-Data
this	239,243	O	B-Process
transport	244,253	O	I-Process
process	254,261	O	I-Process
is	262,264	O	O
severely	265,273	O	B-Process
inhibited	274,283	O	I-Process
by	284,286	O	O
the	287,290	O	B-Data
lower	291,296	O	I-Data
altitude	297,305	O	I-Data
of	306,308	O	O
the	309,312	O	B-Material
ionopause	313,322	O	I-Material
.	322,323	O	O

The	324,327	O	O
observations	328,340	O	O
presented	341,350	O	O
were	351,355	O	O
those	356,361	O	O
made	362,366	O	O
of	367,369	O	O
the	370,373	O	B-Material
Venusian	374,382	O	I-Material
ionospheric	383,394	O	I-Material
plasma	395,401	O	I-Material
by	402,404	O	O
the	405,408	O	B-Method
ASPERA-4	409,417	O	I-Method
experiment	418,428	O	I-Method
onboard	429,436	O	O
the	437,440	O	B-Material
Venus	441,446	O	I-Material
Express	447,454	O	I-Material
spacecraft	455,465	O	I-Material
,	465,466	O	O
and	467,470	O	O
which	471,476	O	O
constitute	477,487	O	O
the	488,491	O	O
first	492,497	O	O
extensive	498,507	O	O
in	508,510	O	B-Method
-	510,511	O	I-Method
situ	511,515	O	I-Method
measurements	516,528	O	I-Method
of	529,531	O	O
the	532,535	O	B-Material
plasma	536,542	O	I-Material
near	543,547	O	O
solar	548,553	O	B-Data
minimum	554,561	O	I-Data
.	561,562	O	O

Observations	563,575	O	O
near	576,580	O	O
the	581,584	O	B-Material
terminator	585,595	O	I-Material
of	596,598	O	I-Material
the	599,602	O	I-Material
energies	603,611	O	I-Material
of	612,614	O	I-Material
ions	615,619	O	I-Material
of	620,622	O	O
ionospheric	623,634	O	B-Material
origin	635,641	O	I-Material
showed	642,648	O	O
asymmetry	649,658	O	B-Data
between	659,666	O	O
the	667,670	O	B-Material
noon	671,675	O	I-Material
and	676,679	O	I-Material
midnight	680,688	O	I-Material
sectors	689,696	O	I-Material
,	696,697	O	O
which	698,703	O	O
indicated	704,713	O	O
an	714,716	O	B-Process
antisunward	717,728	O	I-Process
ion	729,732	O	I-Process
flow	733,737	O	I-Process
with	738,742	O	O
a	743,744	O	B-Data
velocity	745,753	O	I-Data
of	754,756	O	I-Data
(	757,758	O	I-Data
2.5±1.5)kms-1	758,771	O	I-Data
.	771,772	O	O

It	773,775	O	O
is	776,778	O	O
suggested	779,788	O	O
that	789,793	O	O
this	794,798	O	B-Process
ion	799,802	O	I-Process
flow	803,807	O	I-Process
contributes	808,819	O	O
to	820,822	O	O
maintaining	823,834	O	B-Process
the	835,838	O	B-Material
nightside	839,848	O	I-Material
ionosphere	849,859	O	I-Material
near	860,864	O	O
the	865,868	O	B-Material
terminator	869,879	O	I-Material
region	880,886	O	I-Material
at	887,889	O	O
solar	890,895	O	B-Data
minimum	896,903	O	I-Data
.	903,904	O	O

The	905,908	O	O
interpretation	909,923	O	O
of	924,926	O	O
the	927,930	O	B-Data
result	931,937	O	I-Data
was	938,941	O	O
reinforced	942,952	O	O
by	953,955	O	O
observed	956,964	O	O
asymmetries	965,976	O	B-Data
in	977,979	O	O
the	980,983	O	B-Data
ion	984,987	O	I-Data
number	988,994	O	I-Data
counts	995,1001	O	I-Data
.	1001,1002	O	O

The	1003,1006	O	O
observed	1007,1015	O	O
dawn	1016,1020	O	B-Data
-	1020,1021	O	I-Data
dusk	1021,1025	O	I-Data
asymmetry	1026,1035	O	I-Data
was	1036,1039	O	O
consistent	1040,1050	O	O
with	1051,1055	O	O
a	1056,1057	O	B-Process
nightward	1058,1067	O	I-Process
transport	1068,1077	O	I-Process
of	1078,1080	O	O
ions	1081,1085	O	B-Material
while	1086,1091	O	O
the	1092,1095	O	B-Material
noon	1096,1100	O	I-Material
-	1100,1101	O	I-Material
midnight	1101,1109	O	I-Material
observations	1110,1122	O	O
indicated	1123,1132	O	O
that	1133,1137	O	O
the	1138,1141	O	B-Process
flow	1142,1146	O	I-Process
was	1147,1150	O	O
highly	1151,1157	O	B-Data
variable	1158,1166	O	I-Data
but	1167,1170	O	O
could	1171,1176	O	O
contribute	1177,1187	O	O
to	1188,1190	O	O
the	1191,1194	O	B-Process
maintenance	1195,1206	O	I-Process
of	1207,1209	O	O
the	1210,1213	O	B-Material
nightside	1214,1223	O	I-Material
ionosphere	1224,1234	O	I-Material
.	1234,1235	O	O

Highlights	1236,1246	O	O

►	1247,1248	O	O

The	1249,1252	O	B-Process
transterminator	1253,1268	O	I-Process
ion	1269,1272	O	I-Process
flow	1273,1277	O	I-Process
in	1278,1280	O	O
the	1281,1284	O	B-Material
Venusian	1285,1293	O	I-Material
ionosphere	1294,1304	O	I-Material
is	1305,1307	O	O
observed	1308,1316	O	O
at	1317,1319	O	O
solar	1320,1325	O	B-Data
minimum	1326,1333	O	I-Data
.	1333,1334	O	O

►	1335,1336	O	O

This	1337,1341	O	B-Process
flow	1342,1346	O	I-Process
has	1347,1350	O	O
a	1351,1352	O	B-Data
velocity	1353,1361	O	I-Data
of	1362,1364	O	I-Data
(	1365,1366	O	I-Data
2.5±1.5)kms-1	1366,1379	O	I-Data
.	1379,1380	O	O

►	1381,1382	O	O

The	1383,1386	O	O
occurrence	1387,1397	O	O
of	1398,1400	O	O
this	1401,1405	O	B-Process
flow	1406,1410	O	I-Process
is	1411,1413	O	O
highly	1414,1420	O	B-Data
variable	1421,1429	O	I-Data
,	1429,1430	O	O
but	1431,1434	O	O
can	1435,1438	O	O
be	1439,1441	O	O
a	1442,1443	O	O
significant	1444,1455	O	O
source	1456,1462	O	O
of	1463,1465	O	O
the	1466,1469	O	B-Material
nightside	1470,1479	O	I-Material
ionosphere	1480,1490	O	I-Material
.	1490,1491	O	O

-DOCSTART- (S0032063312003054)

The	0,3	O	O
different	4,13	O	O
types	14,19	O	O
of	20,22	O	O
asymmetry	23,32	O	B-Data
observed	33,41	O	O
in	42,44	O	O
the	45,48	O	B-Data
energy	49,55	O	I-Data
distributions	56,69	O	I-Data
of	70,72	O	O
electrons	73,82	O	B-Material
and	83,86	O	O
heavy	87,92	O	B-Material
-	92,93	O	I-Material
ions	93,97	O	I-Material
(	98,99	O	O
M	99,100	O	B-Data
/	100,101	O	I-Data
Q=16	101,105	O	I-Data
-	105,106	O	I-Data
44	106,108	O	I-Data
)	108,109	O	O
during	110,116	O	O
signatures	117,127	O	B-Data
of	128,130	O	O
electron	131,139	O	B-Process
precipitation	140,153	O	I-Process
in	154,156	O	O
the	157,160	O	B-Material
Martian	161,168	O	I-Material
ionosphere	169,179	O	I-Material
have	180,184	O	O
been	185,189	O	O
classified	190,200	O	B-Process
.	200,201	O	O

This	202,206	O	O
has	207,210	O	O
been	211,215	O	O
achieved	216,224	O	O
using	225,230	O	O
the	231,234	O	B-Method
space	235,240	O	I-Method
plasma	241,247	O	I-Method
instrumentation	248,263	O	I-Method
of	264,266	O	O
MEX	267,270	O	B-Material
ASPERA-3	271,279	O	I-Material
from	280,284	O	O
peri	285,289	O	B-Data
-	289,290	O	I-Data
centre	290,296	O	I-Data
altitude	297,305	O	I-Data
to	306,308	O	I-Data
2200	309,313	O	I-Data
km	313,315	O	I-Data
.	315,316	O	O

ASPERA-3	317,325	O	B-Method
ELS	326,329	O	I-Method
observes	330,338	O	O
signatures	339,349	O	B-Data
of	350,352	O	O
electron	353,361	O	B-Process
precipitation	362,375	O	I-Process
on	376,378	O	O
43.0	379,383	O	B-Data
%	383,384	O	I-Data
of	385,387	O	O
MEX	388,391	O	B-Material
orbits	392,398	O	I-Material
.	398,399	O	O

Unaccelerated	400,413	O	B-Material
electrons	414,423	O	I-Material
in	424,426	O	O
the	427,430	O	O
form	431,435	O	O
of	436,438	O	O
sudden	439,445	O	B-Process
electron	446,454	O	I-Process
flux	455,459	O	I-Process
enhancements	460,472	O	I-Process
are	473,476	O	O
the	477,480	O	O
most	481,485	O	O
common	486,492	O	O
type	493,497	O	O
of	498,500	O	O
electron	501,509	O	B-Data
precipitation	510,523	O	I-Data
signature	524,533	O	I-Data
at	534,536	O	O
Mars	537,541	O	B-Material
and	542,545	O	O
account	546,553	O	O
for	554,557	O	O
∼70	558,561	O	B-Data
%	561,562	O	I-Data
of	563,565	O	O
the	566,569	O	B-Process
events	570,576	O	I-Process
observed	577,585	O	O
in	586,588	O	O
this	589,593	O	O
study	594,599	O	O
.	599,600	O	O

Electrons	601,610	O	B-Material
that	611,615	O	O
form	616,620	O	O
unaccelerated	621,634	O	B-Data
electron	635,643	O	I-Data
precipitation	644,657	O	I-Data
signatures	658,668	O	I-Data
are	669,672	O	O
either	673,679	O	O
local	680,685	O	B-Material
ionospheric	686,697	O	I-Material
electrons	698,707	O	I-Material
with	708,712	O	O
enhanced	713,721	O	B-Data
density	722,729	O	I-Data
,	729,730	O	O
or	731,733	O	O
electrons	734,743	O	B-Material
transported	744,755	O	B-Process
from	756,760	O	O
another	761,768	O	B-Material
region	769,775	O	I-Material
of	776,778	O	I-Material
ionosphere	779,789	O	I-Material
,	789,790	O	I-Material
solar	791,796	O	I-Material
wind	797,801	O	I-Material
or	802,804	O	I-Material
tail	805,809	O	I-Material
,	809,810	O	O
or	811,813	O	O
a	814,815	O	B-Material
combination	816,827	O	I-Material
of	828,830	O	I-Material
local	831,836	O	I-Material
and	837,840	O	I-Material
transported	841,852	O	I-Material
electrons	853,862	O	I-Material
.	862,863	O	O

The	864,867	O	B-Process
heating	868,875	O	I-Process
of	876,878	O	O
electrons	879,888	O	B-Material
has	889,892	O	O
a	893,894	O	O
strong	895,901	O	O
influence	902,911	O	O
on	912,914	O	O
the	915,918	O	B-Data
shape	919,924	O	I-Data
of	925,927	O	O
most	928,932	O	B-Material
electron	933,941	O	I-Material
energy	942,948	O	I-Material
spectra	949,956	O	I-Material
from	957,961	O	O
accelerated	962,973	O	B-Data
precipitation	974,987	O	I-Data
signatures	988,998	O	I-Data
.	998,999	O	O

On	1000,1002	O	O
most	1003,1007	O	O
occasions	1008,1017	O	O
the	1018,1021	O	B-Process
general	1022,1029	O	I-Process
flow	1030,1034	O	I-Process
of	1035,1037	O	O
heavy	1038,1043	O	B-Material
-	1043,1044	O	I-Material
ions	1044,1048	O	I-Material
away	1049,1053	O	O
from	1054,1058	O	O
Mars	1059,1063	O	B-Material
is	1064,1066	O	O
unchanged	1067,1076	O	O
during	1077,1083	O	O
the	1084,1087	O	B-Process
precipitation	1088,1101	O	I-Process
of	1102,1104	O	O
electrons	1105,1114	O	B-Material
,	1114,1115	O	O
which	1116,1121	O	O
is	1122,1124	O	O
thought	1125,1132	O	O
to	1133,1135	O	O
be	1136,1138	O	O
the	1139,1142	O	O
result	1143,1149	O	O
of	1150,1152	O	O
the	1153,1156	O	B-Process
finite	1157,1163	O	I-Process
gyroradius	1164,1174	O	I-Process
effect	1175,1181	O	I-Process
of	1182,1184	O	O
the	1185,1188	O	B-Material
heavy	1189,1194	O	I-Material
-	1194,1195	O	I-Material
ions	1195,1199	O	I-Material
on	1200,1202	O	I-Material
crustal	1203,1210	O	I-Material
magnetic	1211,1219	O	I-Material
field	1220,1225	O	I-Material
lines	1226,1231	O	I-Material
.	1231,1232	O	O

Only	1233,1237	O	O
∼17	1238,1241	O	B-Data
%	1241,1242	O	I-Data
of	1243,1245	O	O
events	1246,1252	O	B-Process
show	1253,1257	O	O
some	1258,1262	O	O
form	1263,1267	O	O
of	1268,1270	O	O
heavy	1271,1276	O	B-Process
-	1276,1277	O	I-Process
ion	1277,1280	O	I-Process
acceleration	1281,1293	O	I-Process
that	1294,1298	O	O
is	1299,1301	O	O
either	1302,1308	O	O
concurrent	1309,1319	O	B-Process
or	1320,1322	O	O
at	1323,1325	O	O
the	1326,1329	O	B-Material
periphery	1330,1339	O	I-Material
of	1340,1342	O	O
an	1343,1345	O	B-Data
electron	1346,1354	O	I-Data
precipitation	1355,1368	O	I-Data
signature	1369,1378	O	I-Data
.	1378,1379	O	O

The	1380,1383	O	O
most	1384,1388	O	O
common	1389,1395	O	O
combination	1396,1407	O	O
of	1408,1410	O	O
electron	1411,1419	O	B-Data
and	1420,1423	O	I-Data
heavy	1424,1429	O	I-Data
-	1429,1430	O	I-Data
ion	1430,1433	O	I-Data
energy	1434,1440	O	I-Data
distributions	1441,1454	O	I-Data
for	1455,1458	O	O
signatures	1459,1469	O	B-Data
of	1470,1472	O	O
electron	1473,1481	O	B-Process
precipitation	1482,1495	O	I-Process
involves	1496,1504	O	O
electrons	1505,1514	O	B-Material
that	1515,1519	O	O
visually	1520,1528	O	O
have	1529,1533	O	O
very	1534,1538	O	B-Data
little	1539,1545	O	I-Data
asymmetry	1546,1555	O	I-Data
or	1556,1558	O	O
are	1559,1562	O	O
isotropic	1563,1572	O	B-Process
and	1573,1576	O	O
heavy	1577,1582	O	B-Material
-	1582,1583	O	I-Material
ions	1583,1587	O	I-Material
that	1588,1592	O	O
have	1593,1597	O	O
a	1598,1599	O	B-Process
upward	1600,1606	O	I-Process
net	1607,1610	O	I-Process
flux	1611,1615	O	I-Process
,	1615,1616	O	O
and	1617,1620	O	O
suggest	1621,1628	O	O
the	1629,1632	O	B-Process
upward	1633,1639	O	I-Process
current	1640,1647	O	I-Process
associated	1648,1658	O	O
with	1659,1663	O	O
aurora	1664,1670	O	B-Material
.	1670,1671	O	O

Due	1672,1675	O	O
to	1676,1678	O	O
a	1679,1680	O	O
lack	1681,1685	O	O
of	1686,1688	O	O
reliable	1689,1697	O	B-Data
measurements	1698,1710	O	I-Data
of	1711,1713	O	O
electrons	1714,1723	O	B-Material
travelling	1724,1734	O	B-Process
towards	1735,1742	O	O
Mars	1743,1747	O	B-Material
,	1747,1748	O	O
it	1749,1751	O	O
is	1752,1754	O	O
likely	1755,1761	O	O
we	1762,1764	O	O
miss	1765,1769	O	O
further	1770,1777	O	B-Data
evidence	1778,1786	O	I-Data
of	1787,1789	O	O
upward	1790,1796	O	B-Process
currents	1797,1805	O	I-Process
.	1805,1806	O	O

The	1807,1810	O	O
second	1811,1817	O	O
most	1818,1822	O	O
common	1823,1829	O	O
combination	1830,1841	O	O
of	1842,1844	O	O
electron	1845,1853	O	B-Data
and	1854,1857	O	I-Data
heavy	1858,1863	O	I-Data
-	1863,1864	O	I-Data
ion	1864,1867	O	I-Data
energy	1868,1874	O	I-Data
distributions	1875,1888	O	I-Data
for	1889,1892	O	O
signatures	1893,1903	O	B-Data
of	1904,1906	O	O
electron	1907,1915	O	B-Process
precipitation	1916,1929	O	I-Process
,	1929,1930	O	O
are	1931,1934	O	O
those	1935,1940	O	O
distributions	1941,1954	O	B-Process
of	1955,1957	O	O
electrons	1958,1967	O	B-Material
that	1968,1972	O	O
are	1973,1976	O	O
asymmetric	1977,1987	O	B-Data
and	1988,1991	O	O
have	1992,1996	O	O
an	1997,1999	O	B-Process
net	2000,2003	O	I-Process
upward	2004,2010	O	I-Process
flux	2011,2015	O	I-Process
,	2015,2016	O	O
with	2017,2021	O	O
distributions	2022,2035	O	B-Data
of	2036,2038	O	O
heavy	2039,2044	O	B-Material
-	2044,2045	O	I-Material
ions	2045,2049	O	I-Material
that	2050,2054	O	O
also	2055,2059	O	O
have	2060,2064	O	O
a	2065,2066	O	B-Process
net	2067,2070	O	I-Process
upward	2071,2077	O	I-Process
flux	2078,2082	O	I-Process
.	2082,2083	O	O

Energy	2084,2090	O	B-Data
distributions	2091,2104	O	I-Data
of	2105,2107	O	O
heavy	2108,2113	O	B-Material
-	2113,2114	O	I-Material
ions	2114,2118	O	I-Material
with	2119,2123	O	O
a	2124,2125	O	B-Process
net	2126,2129	O	I-Process
flux	2130,2134	O	I-Process
towards	2135,2142	O	O
Mars	2143,2147	O	B-Material
occur	2148,2153	O	O
half	2154,2158	O	O
as	2159,2161	O	O
often	2162,2167	O	O
as	2168,2170	O	O
heavy	2171,2176	O	B-Material
-	2176,2177	O	I-Material
ions	2177,2181	O	I-Material
with	2182,2186	O	O
an	2187,2189	O	B-Process
upward	2190,2196	O	I-Process
net	2197,2200	O	I-Process
flux	2201,2205	O	I-Process
.	2205,2206	O	O

There	2207,2212	O	O
is	2213,2215	O	O
also	2216,2220	O	O
evidence	2221,2229	O	O
to	2230,2232	O	O
suggest	2233,2240	O	O
we	2241,2243	O	O
observe	2244,2251	O	O
downward	2252,2260	O	B-Process
currents	2261,2269	O	I-Process
during	2270,2276	O	O
electron	2277,2285	O	B-Data
precipitation	2286,2299	O	I-Data
signatures	2300,2310	O	I-Data
when	2311,2315	O	O
we	2316,2318	O	O
find	2319,2323	O	O
energy	2324,2330	O	B-Data
distributions	2331,2344	O	I-Data
of	2345,2347	O	O
electrons	2348,2357	O	B-Material
that	2358,2362	O	O
are	2363,2366	O	O
asymmetric	2367,2377	O	B-Data
and	2378,2381	O	O
have	2382,2386	O	O
an	2387,2389	O	B-Process
upward	2390,2396	O	I-Process
net	2397,2400	O	I-Process
flux	2401,2405	O	I-Process
,	2405,2406	O	O
combined	2407,2415	O	O
with	2416,2420	O	O
energy	2421,2427	O	B-Data
distributions	2428,2441	O	I-Data
of	2442,2444	O	O
heavy	2445,2450	O	B-Material
-	2450,2451	O	I-Material
ions	2451,2455	O	I-Material
that	2456,2460	O	O
have	2461,2465	O	O
a	2466,2467	O	B-Process
downward	2468,2476	O	I-Process
net	2477,2480	O	I-Process
flux	2481,2485	O	I-Process
.	2485,2486	O	O

Wave	2487,2491	O	B-Process
particle	2492,2500	O	I-Process
interactions	2501,2513	O	I-Process
and	2514,2517	O	O
downward	2518,2526	O	B-Material
parallel	2527,2535	O	I-Material
electric	2536,2544	O	I-Material
fields	2545,2551	O	I-Material
may	2552,2555	O	O
be	2556,2558	O	O
responsible	2559,2570	O	O
for	2571,2574	O	O
electrons	2575,2584	O	B-Material
that	2585,2589	O	O
display	2590,2597	O	O
a	2598,2599	O	B-Data
large	2600,2605	O	I-Data
amount	2606,2612	O	I-Data
of	2613,2615	O	I-Data
asymmetry	2616,2625	O	I-Data
in	2626,2628	O	O
the	2629,2632	O	B-Data
upward	2633,2639	O	I-Data
direction	2640,2649	O	I-Data
of	2650,2652	O	O
the	2653,2656	O	B-Process
energy	2657,2663	O	I-Process
distribution	2664,2676	O	I-Process
and	2677,2680	O	O
have	2681,2685	O	O
a	2686,2687	O	B-Process
upward	2688,2694	O	I-Process
net	2695,2698	O	I-Process
flux	2699,2703	O	I-Process
.	2703,2704	O	O

Highlights	2705,2715	O	O

►	2716,2717	O	O

We	2718,2720	O	O
use	2721,2724	O	O
ASPERA-3	2725,2733	O	B-Material
to	2734,2736	O	O
classify	2737,2745	O	B-Process
particle	2746,2754	O	B-Data
asymmetries	2755,2766	O	I-Data
during	2767,2773	O	O
electron	2774,2782	O	B-Process
precipitation	2783,2796	O	I-Process
at	2797,2799	O	O
Mars	2800,2804	O	B-Material
.	2804,2805	O	O

►	2806,2807	O	O

Most	2808,2812	O	O
common	2813,2819	O	O
type	2820,2824	O	O
of	2825,2827	O	O
energy	2828,2834	O	B-Data
distribution	2835,2847	O	I-Data
is	2848,2850	O	O
of	2851,2853	O	O
isotropic	2854,2863	O	B-Material
electrons	2864,2873	O	I-Material
and	2874,2877	O	O
upward	2878,2884	O	B-Material
heavy	2885,2890	O	I-Material
-	2890,2891	O	I-Material
ions	2891,2895	O	I-Material
.	2895,2896	O	O

►	2897,2898	O	O

Distributions	2899,2912	O	B-Data
suggesting	2913,2923	O	O
upward	2924,2930	O	B-Process
currents	2931,2939	O	I-Process
observed	2940,2948	O	O
four	2949,2953	O	B-Data
times	2954,2959	O	I-Data
more	2960,2964	O	O
than	2965,2969	O	O
downward	2970,2978	O	B-Process
currents	2979,2987	O	I-Process
.	2987,2988	O	O

►	2989,2990	O	O

Heavy	2991,2996	O	B-Process
-	2996,2997	O	I-Process
ion	2997,3000	O	I-Process
flow	3001,3005	O	I-Process
at	3006,3008	O	O
Mars	3009,3013	O	B-Material
mostly	3014,3020	O	O
unaffected	3021,3031	O	O
by	3032,3034	O	O
electron	3035,3043	O	B-Process
precipitation	3044,3057	O	I-Process
due	3058,3061	O	O
to	3062,3064	O	O
finite	3065,3071	O	B-Data
gyro	3072,3076	O	I-Data
-	3076,3077	O	I-Data
radius	3077,3083	O	I-Data
.	3083,3084	O	O

►	3085,3086	O	O

Acceleration	3087,3099	O	B-Process
of	3100,3102	O	O
heavy	3103,3108	O	B-Material
-	3108,3109	O	I-Material
ions	3109,3113	O	I-Material
is	3114,3116	O	O
rarely	3117,3123	O	O
observed	3124,3132	O	O
during	3133,3139	O	O
electron	3140,3148	O	B-Process
precipitation	3149,3162	O	I-Process
.	3162,3163	O	O

