-DOCSTART- (S0012821X12004384)

Environmental	0,13	O	B-Process
changes	14,21	O	I-Process
associated	22,32	O	O
with	33,37	O	O
the	38,41	O	B-Data
Paleocene	42,51	O	I-Data
-	51,52	O	I-Data
Eocene	52,58	O	I-Data
thermal	59,66	O	I-Data
maximum	67,74	O	I-Data
(	75,76	O	I-Data
PETM	76,80	O	I-Data
,	80,81	O	I-Data
∼56Ma	82,87	O	I-Data
)	87,88	O	I-Data
have	89,93	O	O
not	94,97	O	O
yet	98,101	O	O
been	102,106	O	O
documented	107,117	O	B-Process
in	118,120	O	O
detail	121,127	O	O
from	128,132	O	O
the	133,136	O	B-Material
North	137,142	O	I-Material
Sea	143,146	O	I-Material
Basin	147,152	O	I-Material
.	152,153	O	O

Located	154,161	O	O
within	162,168	O	O
proximity	169,178	O	B-Data
to	179,181	O	O
the	182,185	O	B-Material
North	186,191	O	I-Material
Atlantic	192,200	O	I-Material
igneous	201,208	O	I-Material
province	209,217	O	I-Material
(	218,219	O	I-Material
NAIP	219,223	O	I-Material
)	223,224	O	I-Material
,	224,225	O	O
the	226,229	O	B-Material
Kilda	230,235	O	I-Material
Basin	236,241	O	I-Material
,	241,242	O	O
and	243,246	O	O
the	247,250	O	B-Material
northern	251,259	O	I-Material
rain	260,264	O	I-Material
belt	265,269	O	I-Material
(	270,271	O	O
paleolatitude	271,284	O	B-Data
54	285,287	O	I-Data
°	287,288	O	I-Data
N	288,289	O	I-Data
)	289,290	O	O
during	291,297	O	O
the	298,301	O	B-Data
PETM	302,306	O	I-Data
,	306,307	O	O
this	308,312	O	O
is	313,315	O	O
a	316,317	O	O
critical	318,326	O	O
region	327,333	O	O
for	334,337	O	O
testing	338,345	O	O
proposed	346,354	O	O
triggers	355,363	O	B-Material
of	364,366	O	O
atmospheric	367,378	O	B-Process
carbon	379,385	O	I-Process
release	386,393	O	I-Process
that	394,398	O	O
may	399,402	O	O
have	403,407	O	O
caused	408,414	O	O
the	415,418	O	B-Process
global	419,425	O	I-Process
negative	426,434	O	I-Process
carbon	435,441	O	I-Process
isotope	442,449	O	I-Process
excursion	450,459	O	I-Process
(	460,461	O	I-Process
CIE	461,464	O	I-Process
)	464,465	O	I-Process
in	466,468	O	O
marine	469,475	O	B-Material
and	476,479	O	I-Material
terrestrial	480,491	O	I-Material
environments	492,504	O	I-Material
.	504,505	O	O

The	506,509	O	B-Process
CIE	510,513	O	I-Process
onset	514,519	O	I-Process
is	520,522	O	O
identified	523,533	O	O
from	534,538	O	O
organic	539,546	O	B-Material
matter	547,553	O	I-Material
δ13C	554,558	O	I-Material
in	559,561	O	O
exceptional	562,573	O	O
detail	574,580	O	O
within	581,587	O	O
a	588,589	O	B-Material
highly	590,596	O	I-Material
expanded	597,605	O	I-Material
sedimentary	606,617	O	I-Material
sequence	618,626	O	I-Material
.	626,627	O	O

Pollen	628,634	O	B-Material
and	635,638	O	I-Material
spore	639,644	O	I-Material
assemblages	645,656	O	I-Material
analysed	657,665	O	O
in	666,668	O	O
the	669,672	O	B-Material
same	673,677	O	I-Material
samples	678,685	O	I-Material
for	686,689	O	O
the	690,693	O	O
first	694,699	O	O
time	700,704	O	O
allow	705,710	O	O
a	711,712	O	B-Process
reconstruction	713,727	O	I-Process
of	728,730	O	I-Process
possible	731,739	O	I-Process
changes	740,747	O	I-Process
to	748,750	O	O
vegetation	751,761	O	B-Material
on	762,764	O	O
the	765,768	O	B-Material
surrounding	769,780	O	I-Material
landmass	781,789	O	I-Material
.	789,790	O	O

Multiproxy	791,801	O	B-Data
palynological	802,815	O	I-Data
,	815,816	O	I-Data
geochemical	817,828	O	I-Data
,	828,829	O	I-Data
and	830,833	O	I-Data
sedimentologic	834,848	O	I-Data
records	849,856	O	I-Data
demonstrate	857,868	O	O
enhanced	869,877	O	B-Process
halocline	878,887	O	I-Process
stratification	888,902	O	I-Process
and	903,906	O	I-Process
terrigenous	907,918	O	I-Process
deposition	919,929	O	I-Process
well	930,934	O	O
before	935,941	O	O

(	942,943	O	O
103yrs	943,949	O	B-Data
)	949,950	O	O
the	951,954	O	B-Process
CIE	955,958	O	I-Process
,	958,959	O	O
interpreted	960,971	O	O
as	972,974	O	O
due	975,978	O	O
to	979,981	O	O
either	982,988	O	O
tectonic	989,997	O	B-Process
uplift	998,1004	O	I-Process
possibly	1005,1013	O	O
from	1014,1018	O	O
a	1019,1020	O	B-Process
nearby	1021,1027	O	I-Process
magmatic	1028,1036	O	I-Process
intrusion	1037,1046	O	I-Process
,	1046,1047	O	O
or	1048,1050	O	O
increased	1051,1060	O	B-Process
precipitation	1061,1074	O	I-Process
and	1075,1078	O	O
fluvial	1079,1086	O	B-Process
runoff	1087,1093	O	I-Process
possibly	1094,1102	O	O
from	1103,1107	O	O
an	1108,1110	O	B-Process
enhanced	1111,1119	O	I-Process
hydrologic	1120,1130	O	I-Process
cycle	1131,1136	O	I-Process
.	1136,1137	O	O

Stratification	1138,1152	O	B-Process
and	1153,1156	O	I-Process
terrigenous	1157,1168	O	I-Process
deposition	1169,1179	O	I-Process
increased	1180,1189	O	B-Process
further	1190,1197	O	I-Process
at	1198,1200	O	O
the	1201,1204	O	B-Process
onset	1205,1210	O	I-Process
and	1211,1214	O	I-Process
within	1215,1221	O	I-Process
the	1222,1225	O	I-Process
earliest	1226,1234	O	I-Process
CIE	1235,1238	O	I-Process
which	1239,1244	O	O
,	1244,1245	O	O
coupled	1246,1253	O	B-Process
with	1254,1258	O	O
evidence	1259,1267	O	B-Data
for	1268,1271	O	O
sea	1272,1275	O	B-Process
level	1276,1281	O	I-Process
rise	1282,1286	O	I-Process
,	1286,1287	O	O
may	1288,1291	O	O
be	1292,1294	O	O
interpreted	1295,1306	O	O
as	1307,1309	O	O
resulting	1310,1319	O	O
from	1320,1324	O	O
an	1325,1327	O	B-Process
increase	1328,1336	O	I-Process
in	1337,1339	O	I-Process
precipitation	1340,1353	O	I-Process
over	1354,1358	O	O
NW	1359,1361	O	B-Material
Europe	1362,1368	O	I-Material
consistent	1369,1379	O	O
with	1380,1384	O	O
an	1385,1387	O	B-Process
enhanced	1388,1396	O	I-Process
hydrologic	1397,1407	O	I-Process
cycle	1408,1413	O	I-Process
in	1414,1416	O	O
response	1417,1425	O	O
to	1426,1428	O	O
global	1429,1435	O	B-Process
warming	1436,1443	O	I-Process
during	1444,1450	O	O
the	1451,1454	O	B-Data
PETM	1455,1459	O	I-Data
.	1459,1460	O	O

Palynological	1461,1474	O	B-Data
evidence	1475,1483	O	I-Data
indicates	1484,1493	O	O
a	1494,1495	O	B-Material
flora	1496,1501	O	I-Material
dominated	1502,1511	O	B-Process
by	1512,1514	O	O
pollen	1515,1521	O	B-Material
from	1522,1526	O	O
coastal	1527,1534	O	B-Material
swamp	1535,1540	O	I-Material
conifers	1541,1549	O	I-Material
before	1550,1556	O	O
the	1557,1560	O	B-Process
CIE	1561,1564	O	I-Process
was	1565,1568	O	O
abruptly	1569,1577	O	O
replaced	1578,1586	O	O
with	1587,1591	O	O
a	1592,1593	O	B-Material
more	1594,1598	O	I-Material
diverse	1599,1606	O	I-Material
assemblage	1607,1617	O	I-Material
of	1618,1620	O	I-Material
generalist	1621,1631	O	I-Material
species	1632,1639	O	I-Material
including	1640,1649	O	O
pollen	1650,1656	O	B-Material
similar	1657,1664	O	O
to	1665,1667	O	O
modern	1668,1674	O	B-Material
alder	1675,1680	O	I-Material
,	1680,1681	O	I-Material
fern	1682,1686	O	I-Material
,	1686,1687	O	I-Material
and	1688,1691	O	I-Material
fungal	1692,1698	O	I-Material
spores	1699,1705	O	I-Material
.	1705,1706	O	O

This	1707,1711	O	O
may	1712,1715	O	O
have	1716,1720	O	O
resulted	1721,1729	O	O
from	1730,1734	O	O
flooding	1735,1743	O	B-Process
of	1744,1746	O	O
coastal	1747,1754	O	B-Material
areas	1755,1760	O	I-Material
due	1761,1764	O	O
to	1765,1767	O	O
relative	1768,1776	O	B-Data
sea	1777,1780	O	I-Data
level	1781,1786	O	I-Data
rise	1787,1791	O	I-Data
,	1791,1792	O	O
and/or	1793,1799	O	O
ecologic	1800,1808	O	B-Process
changes	1809,1816	O	I-Process
forced	1817,1823	O	I-Process
by	1824,1826	O	I-Process
climate	1827,1834	O	I-Process
.	1834,1835	O	O

A	1836,1837	O	B-Process
shift	1838,1843	O	I-Process
towards	1844,1851	O	O
more	1852,1856	O	O
diverse	1857,1864	O	B-Material
angiosperm	1865,1875	O	I-Material
and	1876,1879	O	I-Material
pteridophyte	1880,1892	O	I-Material
vegetation	1893,1903	O	I-Material
within	1904,1910	O	O
the	1911,1914	O	B-Process
early	1915,1920	O	I-Process
CIE	1921,1924	O	I-Process
,	1924,1925	O	O
including	1926,1935	O	O
pollen	1936,1942	O	B-Material
similar	1943,1950	O	O
to	1951,1953	O	O
modern	1954,1960	O	B-Material
hickory	1961,1968	O	I-Material
,	1968,1969	O	O
documents	1970,1979	O	O
a	1980,1981	O	B-Process
long	1982,1986	O	I-Process
term	1987,1991	O	I-Process
change	1992,1998	O	I-Process
to	1999,2001	O	O
regional	2002,2010	O	B-Material
vegetation	2011,2021	O	I-Material
.	2021,2022	O	O

Highlights	2023,2033	O	O

►	2034,2035	O	O

We	2036,2038	O	O
identify	2039,2047	O	O
the	2048,2051	O	B-Process
carbon	2052,2058	O	I-Process
isotope	2059,2066	O	I-Process
excursion	2067,2076	O	I-Process
from	2077,2081	O	O
the	2082,2085	O	B-Material
North	2086,2091	O	I-Material
Sea	2092,2095	O	I-Material
in	2096,2098	O	O
exceptional	2099,2110	O	O
detail	2111,2117	O	O
.	2117,2118	O	O

►	2119,2120	O	O

We	2121,2123	O	O
document	2124,2132	O	B-Process
changes	2133,2140	O	B-Process
to	2141,2143	O	O
ocean	2144,2149	O	B-Process
stratification	2150,2164	O	I-Process
well	2165,2169	O	O
before	2170,2176	O	O
atmospheric	2177,2188	O	B-Process
carbon	2189,2195	O	I-Process
release	2196,2203	O	I-Process
.	2203,2204	O	O

►	2205,2206	O	O

Precursor	2207,2216	O	B-Process
stratification	2217,2231	O	I-Process
may	2232,2235	O	O
be	2236,2238	O	O
associated	2239,2249	O	O
with	2250,2254	O	O
the	2255,2258	O	B-Material
trigger	2259,2266	O	I-Material
for	2267,2270	O	O
carbon	2271,2277	O	B-Process
release	2278,2285	O	I-Process
.	2285,2286	O	O

►	2287,2288	O	O

Increased	2289,2298	O	B-Process
precipitation	2299,2312	O	I-Process
and	2313,2316	O	I-Process
runoff	2317,2323	O	I-Process
likely	2324,2330	O	O
occurred	2331,2339	O	O
along	2340,2345	O	O
with	2346,2350	O	O
carbon	2351,2357	O	B-Process
release	2358,2365	O	I-Process
.	2365,2366	O	O

►	2367,2368	O	O

We	2369,2371	O	O
document	2372,2380	O	B-Process
a	2381,2382	O	B-Process
rapid	2383,2388	O	I-Process
change	2389,2395	O	I-Process
to	2396,2398	O	O
regional	2399,2407	O	B-Material
vegetation	2408,2418	O	I-Material
during	2419,2425	O	O
carbon	2426,2432	O	B-Process
release	2433,2440	O	I-Process
.	2440,2441	O	O

-DOCSTART- (S0012821X13007309)

High	0,4	O	B-Method
-	4,5	O	I-Method
resolution	5,15	O	I-Method
osmium	16,22	O	I-Method
(	23,24	O	I-Method
Os	24,26	O	I-Method
)	26,27	O	I-Method
isotope	28,35	O	I-Method
stratigraphy	36,48	O	I-Method
across	49,55	O	O
the	56,59	O	B-Data
Cenomanian	60,70	O	I-Data
-	70,71	O	I-Data
Turonian	71,79	O	I-Data
Boundary	80,88	O	I-Data
Interval	89,97	O	I-Data
from	98,102	O	O
6	103,104	O	B-Data
sections	105,113	O	I-Data
for	114,117	O	O
four	118,122	O	B-Data
transcontinental	123,139	O	I-Data
settings	140,148	O	I-Data
has	149,152	O	O
produced	153,161	O	O
a	162,163	O	B-Data
record	164,170	O	I-Data
of	171,173	O	I-Data
seawater	174,182	O	I-Data
chemistry	183,192	O	I-Data
that	193,197	O	O
demonstrates	198,210	O	O
regional	211,219	O	B-Process
variability	220,231	O	I-Process
as	232,234	O	O
a	235,236	O	O
function	237,245	O	O
of	246,248	O	O
terrestrial	249,260	O	B-Material
and	261,264	O	I-Material
hydrothermal	265,277	O	I-Material
inputs	278,284	O	I-Material
,	284,285	O	O
revealing	286,295	O	O
the	296,299	O	B-Process
impact	300,306	O	I-Process
of	307,309	O	I-Process
palaeoenvironmental	310,329	O	I-Process
processes	330,339	O	I-Process
.	339,340	O	O

In	341,343	O	O
every	344,349	O	O
section	350,357	O	O
the	358,361	O	B-Data
187Os/188Os	362,373	O	I-Data
profiles	374,382	O	I-Data
show	383,387	O	O
a	388,389	O	O
comparable	390,400	O	O
trend	401,406	O	O
;	406,407	O	O
radiogenic	408,418	O	B-Data
values	419,425	O	I-Data
in	426,428	O	O
the	429,432	O	O
lead	433,437	O	O
up	438,440	O	O
to	441,443	O	O
Oceanic	444,451	O	B-Process
Anoxic	452,458	O	I-Process
Event	459,464	O	I-Process
2	465,466	O	I-Process
(	467,468	O	I-Process
OAE	468,471	O	I-Process
2	472,473	O	I-Process
)	473,474	O	I-Process
;	474,475	O	O
an	476,478	O	B-Process
abrupt	479,485	O	I-Process
unradiogenic	486,498	O	I-Process
trend	499,504	O	I-Process
at	505,507	O	O
the	508,511	O	B-Process
onset	512,517	O	I-Process
of	518,520	O	I-Process
OAE	521,524	O	I-Process
2	525,526	O	I-Process
;	526,527	O	O
an	528,530	O	B-Process
unradiogenic	531,543	O	I-Process
interval	544,552	O	I-Process
during	553,559	O	O
the	560,563	O	B-Process
first	564,569	O	I-Process
part	570,574	O	I-Process
of	575,577	O	I-Process
OAE	578,581	O	I-Process
2	582,583	O	I-Process
;	583,584	O	O
and	585,588	O	O
a	589,590	O	B-Process
return	591,597	O	I-Process
to	598,600	O	O
radiogenic	601,611	O	B-Data
values	612,618	O	I-Data
towards	619,626	O	O
the	627,630	O	O
end	631,634	O	O
of	635,637	O	O
the	638,641	O	O
event	642,647	O	O
,	647,648	O	O
above	649,654	O	O
the	655,658	O	B-Data
Cenomanian	659,669	O	I-Data
-	669,670	O	I-Data
Turonian	670,678	O	I-Data
boundary	679,687	O	I-Data
.	687,688	O	O

The	689,692	O	B-Process
unradiogenic	693,705	O	I-Process
trend	706,711	O	I-Process
in	712,714	O	O
187Os/188Os	715,726	O	B-Data
is	727,729	O	O
synchronous	730,741	O	B-Process
in	742,744	O	O
all	745,748	O	B-Material
sections	749,757	O	I-Material
.	757,758	O	O

Previous	759,767	O	O
work	768,772	O	O
suggests	773,781	O	O
that	782,786	O	O
activity	787,795	O	B-Process
of	796,798	O	O
the	799,802	O	B-Material
Caribbean	803,812	O	I-Material
LIP	813,816	O	I-Material
(	817,818	O	I-Material
Large	818,823	O	I-Material
Igneous	824,831	O	I-Material
Province	832,840	O	I-Material
)	840,841	O	I-Material
was	842,845	O	O
the	846,849	O	O
source	850,856	O	O
of	857,859	O	O
unradiogenic	860,872	O	B-Material
Os	873,875	O	I-Material
across	876,882	O	O
the	883,886	O	B-Process
OAE	887,890	O	I-Process
2	891,892	O	I-Process
and	893,896	O	O
possibly	897,905	O	O
an	906,908	O	B-Process
instigator	909,919	O	I-Process
of	920,922	O	O
anoxia	923,929	O	B-Process
in	930,932	O	O
the	933,936	O	B-Material
oceans	937,943	O	I-Material
.	943,944	O	O

Here	945,949	O	O
we	950,952	O	O
assess	953,959	O	B-Process
this	960,964	O	O
hypothesis	965,975	O	O
and	976,979	O	O
consider	980,988	O	O
the	989,992	O	O
influence	993,1002	O	O
of	1003,1005	O	O
activity	1006,1014	O	O
from	1015,1019	O	O
other	1020,1025	O	B-Material
LIPs	1026,1030	O	I-Material
;	1030,1031	O	O
such	1032,1036	O	O
as	1037,1039	O	O
the	1040,1043	O	B-Material
High	1044,1048	O	I-Material
Arctic	1049,1055	O	I-Material
LIP	1056,1059	O	I-Material
.	1059,1060	O	O

A	1061,1062	O	O
brief	1063,1068	O	O
shift	1069,1074	O	O
to	1075,1077	O	O
high	1078,1082	O	B-Data
radiogenic	1083,1093	O	I-Data
187Os/188Os	1094,1105	O	I-Data
values	1106,1112	O	I-Data
occurred	1113,1121	O	O
in	1122,1124	O	O
the	1125,1128	O	B-Material
Western	1129,1136	O	I-Material
Interior	1137,1145	O	I-Material
Seaway	1146,1152	O	I-Material
before	1153,1159	O	O
the	1160,1163	O	B-Process
onset	1164,1169	O	I-Process
of	1170,1172	O	I-Process
OAE	1173,1176	O	I-Process
2	1177,1178	O	I-Process
.	1178,1179	O	O

We	1180,1182	O	O
evaluate	1183,1191	O	B-Process
this	1192,1196	O	B-Data
trend	1197,1202	O	I-Data
and	1203,1206	O	O
suggest	1207,1214	O	O
that	1215,1219	O	O
a	1220,1221	O	B-Data
combination	1222,1233	O	I-Data
of	1234,1236	O	I-Data
factors	1237,1244	O	I-Data
collectively	1245,1257	O	O
played	1258,1264	O	O
critical	1265,1273	O	O
roles	1274,1279	O	O
in	1280,1282	O	O
the	1283,1286	O	B-Process
initiation	1287,1297	O	I-Process
of	1298,1300	O	I-Process
OAE	1301,1304	O	I-Process
2	1305,1306	O	I-Process
;	1306,1307	O	O
differential	1308,1320	O	O
input	1321,1326	O	O
of	1327,1329	O	O
nutrients	1330,1339	O	B-Material
from	1340,1344	O	O
continental	1345,1356	O	B-Material
and	1357,1360	O	I-Material
volcanogenic	1361,1373	O	I-Material
sources	1374,1381	O	I-Material
,	1381,1382	O	O
coupled	1383,1390	O	B-Process
with	1391,1395	O	O
efficient	1396,1405	O	O
palaeocirculation	1406,1423	O	B-Process
of	1424,1426	O	O
the	1427,1430	O	B-Material
global	1431,1437	O	I-Material
ocean	1438,1443	O	I-Material
and	1444,1447	O	I-Material
epeiric	1448,1455	O	I-Material
seas	1456,1460	O	I-Material
,	1460,1461	O	O
enhanced	1462,1470	O	B-Process
productivity	1471,1483	O	I-Process
due	1484,1487	O	O
to	1488,1490	O	O
higher	1491,1497	O	B-Data
nutrient	1498,1506	O	I-Data
availability	1507,1519	O	I-Data
,	1519,1520	O	O
which	1521,1526	O	O
permitted	1527,1536	O	O
penecontemporaneous	1537,1556	O	B-Process
transport	1557,1566	O	I-Process
of	1567,1569	O	O
continental	1570,1581	O	B-Material
and	1582,1585	O	I-Material
LIP	1586,1589	O	I-Material
-	1589,1590	O	I-Material
derived	1590,1597	O	I-Material
nutrients	1598,1607	O	I-Material
to	1608,1610	O	O
trans	1611,1616	O	B-Material
-	1616,1617	O	I-Material
equatorial	1617,1627	O	I-Material
basins	1628,1634	O	I-Material
.	1634,1635	O	O

Highlights	1636,1646	O	O

•	1647,1648	O	O
Use	1649,1652	O	O
Osi	1653,1656	O	B-Method
isotope	1657,1664	O	I-Method
stratigraphy	1665,1677	O	I-Method
to	1678,1680	O	O
infer	1681,1686	O	O
driving	1687,1694	O	B-Process
mechanism(s	1695,1706	O	I-Process
)	1706,1707	O	I-Process
of	1708,1710	O	O
Oceanic	1711,1718	O	B-Process
Anoxic	1719,1725	O	I-Process
Event	1726,1731	O	I-Process
2	1732,1733	O	I-Process
.	1733,1734	O	O
•	1735,1736	O	O

Osi	1737,1740	O	B-Data
profiles	1741,1749	O	I-Data
from	1750,1754	O	O
6	1755,1756	O	B-Material
sites	1757,1762	O	I-Material
illustrate	1763,1773	O	O
the	1774,1777	O	B-Process
regional	1778,1786	O	I-Process
variability	1787,1798	O	I-Process
of	1799,1801	O	O
seawater	1802,1810	O	B-Data
chemistry	1811,1820	O	I-Data
.	1820,1821	O	O
•	1822,1823	O	O

δ13Corg	1824,1831	O	B-Data
and	1832,1835	O	I-Data
Osi	1836,1839	O	I-Data
records	1840,1847	O	I-Data
combined	1848,1856	O	O
generate	1857,1865	O	O
an	1866,1868	O	B-Material
integrated	1869,1879	O	I-Material
timescale	1880,1889	O	I-Material
model	1890,1895	O	I-Material
based	1896,1901	O	O
on	1902,1904	O	O
the	1905,1908	O	B-Material
GSSP	1909,1913	O	I-Material
.	1913,1914	O	O
•	1915,1916	O	O

Anoxia	1917,1923	O	B-Process
is	1924,1926	O	O
a	1927,1928	O	O
function	1929,1937	O	O
of	1938,1940	O	O
feedback	1941,1949	O	B-Data
based	1950,1955	O	O
on	1956,1958	O	O
climate	1959,1966	O	B-Process
change	1967,1973	O	I-Process
and	1974,1977	O	O
volcanism	1978,1987	O	B-Process
.	1987,1988	O	O

•	1989,1990	O	O

Quantitatively	1991,2005	O	O
constrain	2006,2015	O	O
the	2016,2019	O	B-Data
duration	2020,2028	O	I-Data
of	2029,2031	O	O
volcanism	2032,2041	O	B-Process
from	2042,2046	O	O
Caribbean	2047,2056	O	B-Material
LIP	2057,2060	O	I-Material
.	2060,2061	O	O

-DOCSTART- (S0025322712001600)

We	0,2	O	O
present	3,10	O	O
a	11,12	O	B-Data
multi	13,18	O	I-Data
-	18,19	O	I-Data
proxy	19,24	O	I-Data
mineral	25,32	O	I-Data
record	33,39	O	I-Data
based	40,45	O	O
on	46,48	O	O
X	49,50	O	B-Method
-	50,51	O	I-Method
ray	51,54	O	I-Method
diffraction	55,66	O	I-Method
and	67,70	O	I-Method
diffuse	71,78	O	I-Method
reflectance	79,90	O	I-Method
spectrophotometry	91,108	O	I-Method
analysis	109,117	O	I-Method
for	118,121	O	O
two	122,125	O	B-Material
cores	126,131	O	I-Material
from	132,136	O	O
the	137,140	O	B-Material
western	141,148	O	I-Material
Indus	149,154	O	I-Material
Shelf	155,160	O	I-Material
in	161,163	O	O
order	164,169	O	O
to	170,172	O	O
reconstruct	173,184	O	B-Process
changing	185,193	O	B-Data
weathering	194,204	O	I-Data
intensities	205,216	O	I-Data
,	216,217	O	O
sediment	218,226	O	B-Process
transport	227,236	O	I-Process
,	236,237	O	O
and	238,241	O	O
provenance	242,252	O	B-Process
variations	253,263	O	I-Process
since	264,269	O	O
13ka	270,274	O	B-Data
.	274,275	O	O

Core	276,280	O	B-Material
Indus-10	281,289	O	I-Material
is	290,292	O	O
located	293,300	O	O
northwest	301,310	O	O
of	311,313	O	O
the	314,317	O	O
Indus	318,323	O	O
Canyon	324,330	O	O
and	331,334	O	O
exhibits	335,343	O	O
fluctuations	344,356	O	B-Process
in	357,359	O	O
smectite/(illite+chlorite	360,385	O	B-Data
)	385,386	O	I-Data
ratios	387,393	O	I-Data
that	394,398	O	O
correlate	399,408	O	B-Process
with	409,413	O	O
monsoon	414,421	O	B-Data
intensity	422,431	O	I-Data
.	431,432	O	O

Higher	433,439	O	B-Data
smectite/(illite+chlorite	440,465	O	B-Material
)	465,466	O	I-Material
and	467,470	O	O
lower	471,476	O	B-Data
illite	477,483	O	B-Material
crystallinity	484,497	O	I-Material
,	497,498	O	O
normally	499,507	O	O
associated	508,518	O	O
with	519,523	O	O
stronger	524,532	O	B-Process
weathering	533,543	O	I-Process
,	543,544	O	O
peaked	545,551	O	B-Process
during	552,558	O	O
the	559,562	O	B-Data
Early	563,568	O	I-Data
-	568,569	O	I-Data
Mid	569,572	O	I-Data
Holocene	573,581	O	I-Data
,	581,582	O	O
the	583,586	O	B-Data
period	587,593	O	I-Data
of	594,596	O	O
maximum	597,604	O	B-Data
summer	605,611	O	B-Material
monsoon	612,619	O	I-Material
.	619,620	O	O

Hematite	621,629	O	B-Process
/	629,630	O	I-Process
goethite	630,638	O	I-Process
and	639,642	O	I-Process
magnetic	643,651	O	I-Process
susceptibility	652,666	O	I-Process
do	667,669	O	O
not	670,673	O	O
show	674,678	O	O
clear	679,684	O	B-Data
co	685,687	O	B-Process
-	687,688	O	I-Process
variation	688,697	O	I-Process
,	697,698	O	O
although	699,707	O	O
they	708,712	O	O
both	713,717	O	O
increase	718,726	O	O
at	727,729	O	O
Indus-10	730,738	O	B-Material
after	739,744	O	O
10ka	745,749	O	B-Data
,	749,750	O	O
as	751,753	O	O
the	754,757	O	B-Material
monsoon	758,765	O	I-Material
weakened	766,774	O	B-Process
.	774,775	O	O

At	776,778	O	O
Indus-23	779,787	O	B-Material
,	787,788	O	O
located	789,796	O	O
on	797,799	O	O
a	800,801	O	B-Material
clinoform	802,811	O	I-Material
just	812,816	O	O
west	817,821	O	O
of	822,824	O	O
the	825,828	O	B-Material
canyon	829,835	O	I-Material
,	835,836	O	O
hematite	837,845	O	B-Material
/	845,846	O	I-Material
goethite	846,854	O	I-Material
increased	855,864	O	B-Process
during	865,871	O	O
a	872,873	O	B-Data
period	874,880	O	I-Data
of	881,883	O	O
monsoon	884,891	O	B-Material
strengthening	892,905	O	B-Process
from	906,910	O	B-Data
10	911,913	O	I-Data
to	914,916	O	I-Data
8ka	917,920	O	I-Data
,	920,921	O	O
consistent	922,932	O	O
with	933,937	O	O
increased	938,947	O	B-Process
seasonality	948,959	O	I-Process
and/or	960,966	O	O
reworking	967,976	O	B-Process
of	977,979	O	O
sediment	980,988	O	B-Material
deposited	989,998	O	I-Material
prior	999,1004	O	O
to	1005,1007	O	O
or	1008,1010	O	O
during	1011,1017	O	O
the	1018,1021	O	B-Process
glacial	1022,1029	O	I-Process
maximum	1030,1037	O	I-Process
.	1037,1038	O	O

After	1039,1044	O	O
2ka	1045,1048	O	B-Data
terrigenous	1049,1060	O	I-Data
sediment	1061,1069	O	I-Data
accumulation	1070,1082	O	I-Data
rates	1083,1088	O	I-Data
in	1089,1091	O	O
both	1092,1096	O	B-Material
cores	1097,1102	O	I-Material
increased	1103,1112	O	B-Process
together	1113,1121	O	O
with	1122,1126	O	O
redness	1127,1134	O	B-Data
and	1135,1138	O	O
hematite	1139,1147	O	B-Material
/	1147,1148	O	I-Material
goethite	1148,1156	O	I-Material
,	1156,1157	O	O
which	1158,1163	O	O
we	1164,1166	O	O
attribute	1167,1176	O	O
to	1177,1179	O	O
widespread	1180,1190	O	B-Process
cultivation	1191,1202	O	I-Process
of	1203,1205	O	O
the	1206,1209	O	B-Material
floodplain	1210,1220	O	I-Material
triggering	1221,1231	O	B-Process
reworking	1232,1241	O	B-Process
,	1241,1242	O	O
especially	1243,1253	O	O
after	1254,1259	O	O
200years	1260,1268	O	B-Data
ago	1269,1272	O	I-Data
.	1272,1273	O	O

Over	1274,1278	O	O
Holocene	1279,1287	O	B-Material
timescales	1288,1298	O	I-Material
sediment	1299,1307	O	B-Data
composition	1308,1319	O	I-Data
and	1320,1323	O	O
mineralogy	1324,1334	O	B-Process
in	1335,1337	O	O
two	1338,1341	O	B-Material
localities	1342,1352	O	I-Material
on	1353,1355	O	O
the	1356,1359	O	B-Material
high	1360,1364	O	I-Material
-	1364,1365	O	I-Material
energy	1365,1371	O	I-Material
shelf	1372,1377	O	I-Material
were	1378,1382	O	O
controlled	1383,1393	O	O
by	1394,1396	O	O
varying	1397,1404	O	B-Data
degrees	1405,1412	O	I-Data
of	1413,1415	O	O
reworking	1416,1425	O	B-Process
,	1425,1426	O	O
as	1427,1429	O	O
well	1430,1434	O	O
as	1435,1437	O	O
climatically	1438,1450	O	B-Process
modulated	1451,1460	O	I-Process
chemical	1461,1469	O	I-Process
weathering	1470,1480	O	I-Process
.	1480,1481	O	O

Highlights	1482,1492	O	O

►	1493,1494	O	O

We	1495,1497	O	O
examine	1498,1505	O	O
a	1506,1507	O	B-Data
high	1508,1512	O	I-Data
resolution	1513,1523	O	I-Data
multi	1524,1529	O	I-Data
-	1529,1530	O	I-Data
proxy	1530,1535	O	I-Data
physical	1536,1544	O	I-Data
properties	1545,1555	O	I-Data
from	1556,1560	O	O
two	1561,1564	O	B-Material
marine	1565,1571	O	I-Material
cores	1572,1577	O	I-Material
.	1577,1578	O	O

►	1579,1580	O	O

Little	1581,1587	O	B-Data
correlation	1588,1599	O	I-Data
between	1600,1607	O	O
physical	1608,1616	O	B-Material
proxies	1617,1624	O	I-Material
and	1625,1628	O	O
climate	1629,1636	O	B-Material
in	1637,1639	O	O
early	1640,1645	O	B-Data
Holocene	1646,1654	O	I-Data
►	1655,1656	O	O
Reworking	1657,1666	O	B-Process
probable	1667,1675	O	O
cause	1676,1681	O	O
of	1682,1684	O	O
poor	1685,1689	O	B-Data
correlation	1690,1701	O	I-Data
in	1702,1704	O	O
Early	1705,1710	O	B-Data
Holocene	1711,1719	O	I-Data
►	1720,1721	O	O
Possible	1722,1730	O	O
anthropogenic	1731,1744	O	B-Process
influence	1745,1754	O	I-Process
on	1755,1757	O	O
sedimentation	1758,1771	O	B-Process
in	1772,1774	O	O
the	1775,1778	O	B-Data
last	1779,1783	O	I-Data
200	1784,1787	O	I-Data
years	1788,1793	O	I-Data

-DOCSTART- (S027737911400050X)

The	0,3	O	B-Material
Southern	4,12	O	I-Material
and	13,16	O	I-Material
Austral	17,24	O	I-Material
Volcanic	25,33	O	I-Material
Zones	34,39	O	I-Material
of	40,42	O	O
the	43,46	O	B-Material
Andes	47,52	O	I-Material
comprise	53,61	O	O
74	62,64	O	B-Data
volcanic	65,73	O	B-Material
centres	74,81	O	I-Material
with	82,86	O	O
known	87,92	O	O
post	93,97	O	B-Process
-	97,98	O	I-Process
glacial	98,105	O	I-Process
activity	106,114	O	I-Process
.	114,115	O	O

At	116,118	O	O
least	119,124	O	O
21	125,127	O	B-Data
of	128,130	O	I-Data
these	131,136	O	I-Data
have	137,141	O	O
had	142,145	O	O
one	146,149	O	B-Data
or	150,152	O	I-Data
more	153,157	O	I-Data
large	158,163	O	B-Process
explosive	164,173	O	I-Process
eruptions	174,183	O	I-Process
in	184,186	O	O
the	187,190	O	B-Data
late	191,195	O	I-Data
Quaternary	196,206	O	I-Data
,	206,207	O	O
dispersing	208,218	O	B-Process
tephra	219,225	O	B-Material
over	226,230	O	O
vast	231,235	O	B-Material
areas	236,241	O	I-Material
.	241,242	O	O

These	243,248	O	B-Material
tephra	249,255	O	I-Material
layers	256,262	O	I-Material
therefore	263,272	O	O
have	273,277	O	O
great	278,283	O	O
potential	284,293	O	O
as	294,296	O	O
tephrochronological	297,316	O	B-Data
marker	317,323	O	I-Data
horizons	324,332	O	I-Data
in	333,335	O	O
palaeoenvironmental	336,355	O	B-Process
studies	356,363	O	I-Process
in	364,366	O	O
southern	367,375	O	O
Chile	376,381	O	O
and	382,385	O	O
Argentina	386,395	O	O
,	395,396	O	O
a	397,398	O	B-Material
region	399,405	O	I-Material
that	406,410	O	O
is	411,413	O	O
particularly	414,426	O	O
useful	427,433	O	O
to	434,436	O	O
study	437,442	O	O
climate	443,450	O	B-Process
dynamics	451,459	O	I-Process
of	460,462	O	O
the	463,466	O	B-Material
southern	467,475	O	I-Material
hemisphere	476,486	O	I-Material
.	486,487	O	O

However	488,495	O	O
,	495,496	O	O
to	497,499	O	O
date	500,504	O	O
tephrochronology	505,521	O	B-Process
has	522,525	O	O
rarely	526,532	O	O
been	533,537	O	O
fully	538,543	O	O
utilised	544,552	O	O
in	553,555	O	O
this	556,560	O	B-Material
region	561,567	O	I-Material
as	568,570	O	O
a	571,572	O	B-Material
correlation	573,584	O	I-Material
and	585,588	O	I-Material
dating	589,595	O	I-Material
tool	596,600	O	I-Material
.	600,601	O	O

Here	602,606	O	O
we	607,609	O	O
review	610,616	O	O
the	617,620	O	B-Data
existing	621,629	O	I-Data
post	630,634	O	I-Data
-	634,635	O	I-Data
glacial	635,642	O	I-Data
tephrostratigraphic	643,662	O	I-Data
record	663,669	O	I-Data
of	670,672	O	O
the	673,676	O	B-Material
Southern	677,685	O	I-Material
and	686,689	O	I-Material
Austral	690,697	O	I-Material
Volcanic	698,706	O	I-Material
Zones	707,712	O	I-Material
,	712,713	O	O
and	714,717	O	O
compile	718,725	O	B-Process
a	726,727	O	B-Material
database	728,736	O	I-Material
of	737,739	O	O
known	740,745	O	B-Data
occurrences	746,757	O	I-Data
of	758,760	O	O
tephra	761,767	O	B-Material
from	768,772	O	O
these	773,778	O	B-Material
volcanoes	779,788	O	I-Material
in	789,791	O	O
ice	792,795	O	B-Material
and	796,799	O	O
lacustrine	800,810	O	B-Data
,	810,811	O	I-Data
marine	812,818	O	I-Data
,	818,819	O	I-Data
peat	820,824	O	I-Data
,	824,825	O	I-Data
and	826,829	O	I-Data
cave	830,834	O	I-Data
sediment	835,843	O	I-Data
records	844,851	O	I-Data
.	851,852	O	O

We	853,855	O	O
address	856,863	O	O
the	864,867	O	B-Data
inconsistencies	868,883	O	I-Data
in	884,886	O	O
and	887,890	O	O
revisions	891,900	O	O
of	901,903	O	O
the	904,907	O	B-Process
tephrostratigraphies	908,928	O	I-Process
presented	929,938	O	O
in	939,941	O	O
prior	942,947	O	O
literature	948,958	O	O
,	958,959	O	O
and	960,963	O	O
discuss	964,971	O	O
the	972,975	O	O
challenges	976,986	O	O
in	987,989	O	O
correlating	990,1001	O	B-Process
tephras	1002,1009	O	B-Material
and	1010,1013	O	O
the	1014,1017	O	B-Data
limitations	1018,1029	O	I-Data
of	1030,1032	O	I-Data
the	1033,1036	O	I-Data
tephrostratigraphic	1037,1056	O	I-Data
record	1057,1063	O	I-Data
in	1064,1066	O	O
this	1067,1071	O	O
area	1072,1076	O	O
.	1076,1077	O	O

This	1078,1082	O	O
study	1083,1088	O	O
highlights	1089,1099	O	O
the	1100,1103	O	O
many	1104,1108	O	O
gaps	1109,1113	O	O
that	1114,1118	O	O
still	1119,1124	O	O
exist	1125,1130	O	O
in	1131,1133	O	O
our	1134,1137	O	B-Data
knowledge	1138,1147	O	I-Data
of	1148,1150	O	O
the	1151,1154	O	B-Data
eruptive	1155,1163	O	I-Data
histories	1164,1173	O	I-Data
of	1174,1176	O	O
these	1177,1182	O	B-Material
volcanoes	1183,1192	O	I-Material
,	1192,1193	O	O
but	1194,1197	O	O
also	1198,1202	O	O
reveals	1203,1210	O	O
the	1211,1214	O	B-Data
largely	1215,1222	O	I-Data
under	1223,1228	O	I-Data
-	1228,1229	O	I-Data
utilised	1229,1237	O	I-Data
potential	1238,1247	O	I-Data
of	1248,1250	O	O
tephra	1251,1257	O	B-Material
as	1258,1260	O	O
a	1261,1262	O	B-Material
correlation	1263,1274	O	I-Material
tool	1275,1279	O	I-Material
in	1280,1282	O	O
this	1283,1287	O	B-Material
region	1288,1294	O	I-Material
.	1294,1295	O	O

This	1296,1300	O	O
is	1301,1303	O	O
exemplified	1304,1315	O	O
by	1316,1318	O	O
the	1319,1322	O	O
severe	1323,1329	O	O
lack	1330,1334	O	O
of	1335,1337	O	O
adequate	1338,1346	O	B-Process
geochemical	1347,1358	O	I-Process
analysis	1359,1367	O	I-Process
of	1368,1370	O	O
tephra	1371,1377	O	B-Material
layers	1378,1384	O	I-Material
preserved	1385,1394	O	O
in	1395,1397	O	O
many	1398,1402	O	B-Material
lacustrine	1403,1413	O	I-Material
and	1414,1417	O	I-Material
peat	1418,1422	O	I-Material
sediment	1423,1431	O	I-Material
sections	1432,1440	O	I-Material
,	1440,1441	O	O
which	1442,1447	O	O
are	1448,1451	O	O
particularly	1452,1464	O	O
important	1465,1474	O	O
tephrostratigraphic	1475,1494	O	B-Data
records	1495,1502	O	I-Data
in	1503,1505	O	O
southern	1506,1514	O	O
Chile	1515,1520	O	O
and	1521,1524	O	O
Argentina	1525,1534	O	O
due	1535,1538	O	O
to	1539,1541	O	O
the	1542,1545	O	B-Data
paucity	1546,1553	O	I-Data
of	1554,1556	O	O
surface	1557,1564	O	B-Process
preservation	1565,1577	O	I-Process
.	1577,1578	O	O

Highlights	1579,1589	O	O
•	1590,1591	O	O
Review	1592,1598	O	O
of	1599,1601	O	O
the	1602,1605	O	B-Process
post	1606,1610	O	I-Process
-	1610,1611	O	I-Process
glacial	1611,1618	O	I-Process
tephrostratigraphy	1619,1637	O	I-Process
in	1638,1640	O	O
southern	1641,1649	O	O
Chile	1650,1655	O	O
/	1655,1656	O	O
Argentina	1656,1665	O	O
.	1665,1666	O	O

•	1667,1668	O	O
Identify	1669,1677	O	O
29	1678,1680	O	B-Data
potential	1681,1690	O	B-Material
regional	1691,1699	O	I-Material
marker	1700,1706	O	I-Material
tephra	1707,1713	O	I-Material
units	1714,1719	O	I-Material
from	1720,1724	O	O
21	1725,1727	O	B-Data
volcanoes	1728,1737	O	B-Material
.	1737,1738	O	O

•	1739,1740	O	O

Present	1741,1748	O	B-Material
database	1749,1757	O	I-Material
of	1758,1760	O	O
tephra	1761,1767	O	B-Material
occurrences	1768,1779	O	I-Material
in	1780,1782	O	O
palaeoenvironment	1783,1800	O	B-Data
records	1801,1808	O	I-Data
from	1809,1813	O	O
the	1814,1817	O	B-Material
region	1818,1824	O	I-Material
.	1824,1825	O	O

•	1826,1827	O	O

Describe	1828,1836	O	O
challenges	1837,1847	O	O
in	1848,1850	O	O
correlation	1851,1862	O	B-Process
of	1863,1865	O	O
tephra	1866,1872	O	B-Material
units	1873,1878	O	I-Material
in	1879,1881	O	O
the	1882,1885	O	B-Material
region	1886,1892	O	I-Material
.	1892,1893	O	O

•	1894,1895	O	O

The	1896,1899	O	B-Data
tephrochronological	1900,1919	O	I-Data
potential	1920,1929	O	I-Data
of	1930,1932	O	O
sediment	1933,1941	O	B-Material
sections	1942,1950	O	I-Material
is	1951,1953	O	O
significantly	1954,1967	O	O
underused	1968,1977	O	O
.	1977,1978	O	O

-DOCSTART- (S092181811300218X)

Shallow	0,7	O	B-Data
-	7,8	O	I-Data
marine	8,14	O	I-Data
sediment	15,23	O	I-Data
records	24,31	O	I-Data
have	32,36	O	O
the	37,40	O	O
strong	41,47	O	O
potential	48,57	O	O
to	58,60	O	O
display	61,68	O	O
sensitive	69,78	O	B-Data
environmental	79,92	O	I-Data
changes	93,100	O	I-Data
in	101,103	O	O
sedimentary	104,115	O	B-Data
geometries	116,126	O	I-Data
and	127,130	O	O
skeletal	131,139	O	B-Data
content	140,147	O	I-Data
.	147,148	O	O

However	149,156	O	O
,	156,157	O	O
the	158,161	O	B-Data
time	162,166	O	I-Data
resolution	167,177	O	I-Data
of	178,180	O	O
most	181,185	O	B-Data
neritic	186,193	O	I-Data
carbonate	194,203	O	I-Data
records	204,211	O	I-Data
is	212,214	O	O
not	215,218	O	O
high	219,223	O	O
enough	224,230	O	O
to	231,233	O	O
be	234,236	O	O
compared	237,245	O	B-Process
with	246,250	O	O
climatic	251,259	O	B-Process
events	260,266	O	I-Process
as	267,269	O	O
recorded	270,278	O	B-Process
in	279,281	O	O
the	282,285	O	B-Material
deep	286,290	O	I-Material
-	290,291	O	I-Material
sea	291,294	O	I-Material
sediment	295,303	O	I-Material
archives	304,312	O	I-Material
.	312,313	O	O

In	314,316	O	O
order	317,322	O	O
to	323,325	O	O
resolve	326,333	O	O
the	334,337	O	B-Data
paleoceanographic	338,355	O	I-Data
and	356,359	O	I-Data
paleoclimatic	360,373	O	I-Data
changes	374,381	O	I-Data
during	382,388	O	O
the	389,392	O	B-Process
Oligocene	393,402	O	I-Process
-	402,403	O	I-Process
Miocene	403,410	O	I-Process
transition	411,421	O	I-Process
in	422,424	O	O
the	425,428	O	B-Material
Mediterranean	429,442	O	I-Material
shallow	443,450	O	I-Material
water	451,456	O	I-Material
carbonate	457,466	O	I-Material
systems	467,474	O	I-Material
with	475,479	O	O
the	480,483	O	B-Data
best	484,488	O	I-Data
possible	489,497	O	I-Data
time	498,502	O	I-Data
resolution	503,513	O	I-Data
,	513,514	O	O
we	515,517	O	O
re	518,520	O	B-Process
-	520,521	O	I-Process
evaluated	521,530	O	I-Process
the	531,534	O	B-Material
Decontra	535,543	O	I-Material
section	544,551	O	I-Material
on	552,554	O	I-Material
the	555,558	O	I-Material
Maiella	559,566	O	I-Material
Platform	567,575	O	I-Material
(	576,577	O	I-Material
central	577,584	O	I-Material
Apennines	585,594	O	I-Material
,	594,595	O	I-Material
Italy	596,601	O	I-Material
)	601,602	O	I-Material
,	602,603	O	O
which	604,609	O	O
acts	610,614	O	O
as	615,617	O	O
a	618,619	O	O
reference	620,629	O	O
for	630,633	O	O
the	634,637	O	B-Process
correlation	638,649	O	I-Process
of	650,652	O	O
Oligocene	653,662	O	B-Material
-	662,663	O	I-Material
Miocene	663,670	O	I-Material
shallow	671,678	O	I-Material
water	679,684	O	I-Material
deposits	685,693	O	I-Material
in	694,696	O	O
the	697,700	O	B-Material
Mediterranean	701,714	O	I-Material
region	715,721	O	I-Material
.	721,722	O	O

The	723,726	O	B-Data
120-m	727,732	O	I-Data
-	732,733	O	I-Data
thick	733,738	O	I-Data
late	739,743	O	B-Process
Oligocene	744,753	O	I-Process
-	753,754	O	I-Process
late	754,758	O	I-Process
Miocene	759,766	O	I-Process
carbonate	767,776	O	I-Process
succession	777,787	O	I-Process
is	788,790	O	O
composed	791,799	O	O
of	800,802	O	O
larger	803,809	O	B-Data
foraminiferal	810,823	O	B-Material
,	823,824	O	I-Material
bryozoan	825,833	O	I-Material
and	834,837	O	I-Material
corallinacean	838,851	O	I-Material
limestones	852,862	O	I-Material
interlayered	863,875	O	B-Process
with	876,880	O	O
distinct	881,889	O	O
planktonic	890,900	O	B-Material
foraminiferal	901,914	O	I-Material
carbonates	915,925	O	I-Material
representing	926,938	O	O
a	939,940	O	B-Material
mostly	941,947	O	I-Material
outer	948,953	O	I-Material
neritic	954,961	O	I-Material
setting	962,969	O	I-Material
.	969,970	O	O

Integrated	971,981	O	B-Process
multi	982,987	O	I-Process
-	987,988	O	I-Process
proxy	988,993	O	I-Process
and	994,997	O	I-Process
facies	998,1004	O	I-Process
analyses	1005,1013	O	I-Process
indicate	1014,1022	O	O
that	1023,1027	O	O
CaCO3	1028,1033	O	B-Material
and	1034,1037	O	O
total	1038,1043	O	B-Material
organic	1044,1051	O	I-Material
carbon	1052,1058	O	I-Material
contents	1059,1067	O	I-Material
as	1068,1070	O	O
well	1071,1075	O	O
as	1076,1078	O	O
gamma	1079,1084	O	B-Material
-	1084,1085	O	I-Material
ray	1085,1088	O	I-Material
display	1089,1096	O	B-Process
only	1097,1101	O	O
local	1102,1107	O	O
to	1108,1110	O	O
regional	1111,1119	O	B-Process
processes	1120,1129	O	I-Process
on	1130,1132	O	O
the	1133,1136	O	B-Material
carbonate	1137,1146	O	I-Material
platform	1147,1155	O	I-Material
and	1156,1159	O	O
are	1160,1163	O	O
not	1164,1167	O	O
suited	1168,1174	O	O
for	1175,1178	O	O
stratigraphic	1179,1192	O	B-Process
correlation	1193,1204	O	I-Process
on	1205,1207	O	O
a	1208,1209	O	B-Data
wider	1210,1215	O	I-Data
scale	1216,1221	O	I-Data
.	1221,1222	O	O

In	1223,1225	O	O
contrast	1226,1234	O	O
,	1234,1235	O	O
new	1236,1239	O	B-Data
biostratigraphic	1240,1256	O	I-Data
data	1257,1261	O	I-Data
correlate	1262,1271	O	B-Process
the	1272,1275	O	B-Data
Decontra	1276,1284	O	I-Data
stable	1285,1291	O	I-Data
carbon	1292,1298	O	I-Data
isotope	1299,1306	O	I-Data
record	1307,1313	O	I-Data
to	1314,1316	O	O
the	1317,1320	O	B-Data
global	1321,1327	O	I-Data
deep	1328,1332	O	I-Data
-	1332,1333	O	I-Data
sea	1333,1336	O	I-Data
carbon	1337,1343	O	I-Data
isotope	1344,1351	O	I-Data
record	1352,1358	O	I-Data
.	1358,1359	O	O

This	1360,1364	O	O
links	1365,1370	O	O
relative	1371,1379	O	O
sea	1380,1383	O	B-Process
level	1384,1389	O	I-Process
fluctuations	1390,1402	O	I-Process
,	1402,1403	O	O
which	1404,1409	O	O
are	1410,1413	O	O
reflected	1414,1423	O	B-Process
by	1424,1426	O	O
facies	1427,1433	O	B-Data
and	1434,1437	O	I-Data
magnetic	1438,1446	O	I-Data
susceptibility	1447,1461	O	I-Data
changes	1462,1469	O	I-Data
,	1469,1470	O	O
to	1471,1473	O	O
third	1474,1479	O	B-Data
-	1479,1480	O	I-Data
order	1480,1485	O	I-Data
eustatic	1486,1494	O	B-Process
cycles	1495,1501	O	I-Process
.	1501,1502	O	O

The	1503,1506	O	B-Material
new	1507,1510	O	I-Material
integrated	1511,1521	O	I-Material
bio-	1522,1526	O	I-Material
,	1526,1527	O	I-Material
chemo-	1528,1534	O	I-Material
,	1534,1535	O	I-Material
and	1536,1539	O	I-Material
sequence	1540,1548	O	I-Material
stratigraphic	1549,1562	O	I-Material
framework	1563,1572	O	I-Material
enables	1573,1580	O	O
a	1581,1582	O	B-Data
more	1583,1587	O	I-Data
precise	1588,1595	O	I-Data
timing	1596,1602	O	I-Data
of	1603,1605	O	O
environmental	1606,1619	O	B-Process
changes	1620,1627	O	I-Process
within	1628,1634	O	O
the	1635,1638	O	B-Data
studied	1639,1646	O	I-Data
time	1647,1651	O	I-Data
interval	1652,1660	O	I-Data
and	1661,1664	O	O
identifies	1665,1675	O	O
Decontra	1676,1684	O	B-Material
as	1685,1687	O	O
an	1688,1690	O	B-Material
important	1691,1700	O	I-Material
locality	1701,1709	O	I-Material
for	1710,1713	O	O
correlating	1714,1725	O	B-Process
not	1726,1729	O	O
only	1730,1734	O	O
shallow	1735,1742	O	B-Material
and	1743,1746	O	I-Material
deep	1747,1751	O	I-Material
water	1752,1757	O	I-Material
sediments	1758,1767	O	I-Material
of	1768,1770	O	O
the	1771,1774	O	B-Material
Mediterranean	1775,1788	O	I-Material
region	1789,1795	O	I-Material
but	1796,1799	O	O
also	1800,1804	O	O
on	1805,1807	O	O
a	1808,1809	O	B-Data
global	1810,1816	O	I-Data
scale	1817,1822	O	I-Data
.	1822,1823	O	O

Highlights	1824,1834	O	O
•	1835,1836	O	O

We	1837,1839	O	O
establish	1840,1849	O	O
a	1850,1851	O	B-Method
new	1852,1855	O	I-Method
age	1856,1859	O	I-Method
model	1860,1865	O	I-Method
for	1866,1869	O	O
the	1870,1873	O	B-Material
Oligo	1874,1879	O	I-Material
-	1879,1880	O	I-Material
Miocene	1880,1887	O	I-Material
Decontra	1888,1896	O	I-Material
section	1897,1904	O	I-Material
.	1904,1905	O	O

•	1906,1907	O	O

The	1908,1911	O	B-Data
local	1912,1917	O	I-Data
carbon	1918,1924	O	I-Data
isotope	1925,1932	O	I-Data
record	1933,1939	O	I-Data
is	1940,1942	O	O
correlated	1943,1953	O	B-Process
with	1954,1958	O	O
the	1959,1962	O	B-Data
global	1963,1969	O	I-Data
δ13C	1970,1974	O	I-Data
curve	1975,1980	O	I-Data
.	1980,1981	O	O

•	1982,1983	O	O

This	1984,1988	O	O
correlates	1989,1999	O	B-Process
Mediterranean	2000,2013	O	B-Data
shallow	2014,2021	O	I-Data
water	2022,2027	O	I-Data
records	2028,2035	O	I-Data
with	2036,2040	O	O
oceanic	2041,2048	O	B-Process
/	2048,2049	O	I-Process
climatic	2049,2057	O	I-Process
events	2058,2064	O	I-Process
.	2064,2065	O	O

-DOCSTART- (S0921818113002245)

We	0,2	O	O
studied	3,10	O	O
the	11,14	O	B-Data
paleomagnetic	15,28	O	I-Data
properties	29,39	O	I-Data
of	40,42	O	O
relatively	43,53	O	B-Material
organic	54,61	O	I-Material
rich	62,66	O	I-Material
,	66,67	O	I-Material
annually	68,76	O	I-Material
laminated	77,86	O	I-Material
(	87,88	O	I-Material
varved	88,94	O	I-Material
)	94,95	O	I-Material
sediments	96,105	O	I-Material
of	106,108	O	O
Holocene	109,117	O	B-Data
age	118,121	O	I-Data
in	122,124	O	O
Gyltigesjön	125,136	O	O
,	136,137	O	O
which	138,143	O	O
is	144,146	O	O
a	147,148	O	O
lake	149,153	O	O
in	154,156	O	O
southern	157,165	O	O
Sweden	166,172	O	O
.	172,173	O	O

An	174,176	O	B-Material
age	177,180	O	I-Material
-	180,181	O	I-Material
depth	181,186	O	I-Material
model	187,192	O	I-Material
was	193,196	O	O
based	197,202	O	O
on	203,205	O	O
a	206,207	O	B-Material
regional	208,216	O	I-Material
lead	217,221	O	I-Material
pollution	222,231	O	I-Material
isochron	232,240	O	I-Material
and	241,244	O	O
Bayesian	245,253	O	B-Method
modelling	254,263	O	I-Method
of	264,266	O	O
radiocarbon	267,278	O	B-Data
ages	279,283	O	I-Data
of	284,286	O	O
bulk	287,291	O	B-Material
sediments	292,301	O	I-Material
and	302,305	O	O
terrestrial	306,317	O	B-Material
macrofossils	318,330	O	I-Material
,	330,331	O	O
which	332,337	O	O
included	338,346	O	O
a	347,348	O	B-Material
radiocarbon	349,360	O	I-Material
wiggle	361,367	O	I-Material
-	367,368	O	I-Material
matched	368,375	O	I-Material
series	376,382	O	I-Material
of	383,385	O	O
873	386,389	O	B-Data
varves	390,396	O	B-Material
that	397,401	O	O
accumulated	402,413	O	O
between	414,421	O	B-Data
3000	422,426	O	I-Data
and	427,430	O	I-Data
2000	431,435	O	I-Data
Cal	436,439	O	I-Data
a	440,441	O	I-Data
BP	442,444	O	I-Data
(	445,446	O	O
Mellström	446,455	O	O
et	456,458	O	O
al	459,461	O	O
.	461,462	O	O
,	462,463	O	O
2013	464,468	O	O
)	468,469	O	O
.	469,470	O	O

Mineral	471,478	O	B-Data
magnetic	479,487	O	I-Data
data	488,492	O	I-Data
and	493,496	O	O
first	497,502	O	B-Data
order	503,508	O	I-Data
reversal	509,517	O	I-Data
curves	518,524	O	I-Data
suggest	525,532	O	O
that	533,537	O	O
the	538,541	O	B-Process
natural	542,549	O	I-Process
remanent	550,558	O	I-Process
magnetization	559,572	O	I-Process
is	573,575	O	O
carried	576,583	O	O
by	584,586	O	O
stable	587,593	O	B-Material
single	594,600	O	I-Material
-	600,601	O	I-Material
domain	601,607	O	I-Material
grains	608,614	O	I-Material
of	615,617	O	I-Material
magnetite	618,627	O	I-Material
,	627,628	O	O
probably	629,637	O	O
of	638,640	O	O
magnetosomal	641,653	O	B-Process
origin	654,660	O	I-Process
.	660,661	O	O

Discrete	662,670	O	B-Material
samples	671,678	O	I-Material
taken	679,684	O	O
from	685,689	O	O
overlapping	690,701	O	B-Material
piston	702,708	O	I-Material
cores	709,714	O	I-Material
were	715,719	O	O
used	720,724	O	O
to	725,727	O	O
produce	728,735	O	O
smoothed	736,744	O	B-Process
paleomagnetic	745,758	O	I-Process
secular	759,766	O	I-Process
variation	767,776	O	I-Process
(	777,778	O	I-Process
inclination	778,789	O	I-Process
and	790,793	O	I-Process
declination	794,805	O	I-Process
)	805,806	O	I-Process
and	807,810	O	O
relative	811,819	O	B-Material
paleointensity	820,834	O	I-Material
data	835,839	O	I-Material
sets	840,844	O	I-Material
.	844,845	O	O

Alternative	846,857	O	O
temporal	858,866	O	B-Process
trends	867,873	O	I-Process
in	874,876	O	O
the	877,880	O	B-Material
paleomagnetic	881,894	O	I-Material
data	895,899	O	I-Material
were	900,904	O	O
obtained	905,913	O	O
by	914,916	O	O
correcting	917,927	O	B-Process
for	928,931	O	O
paleomagnetic	932,945	O	B-Data
lock	946,950	O	I-Data
-	950,951	O	I-Data
in	951,953	O	I-Data
depths	954,960	O	I-Data
between	961,968	O	B-Data
0	969,970	O	I-Data
and	971,974	O	I-Data
70	975,977	O	I-Data
cm	977,979	O	I-Data
and	980,983	O	O
taking	984,990	O	O
into	991,995	O	O
account	996,1003	O	O
changes	1004,1011	O	B-Data
in	1012,1014	O	I-Data
sediment	1015,1023	O	I-Data
accumulation	1024,1036	O	I-Data
rate	1037,1041	O	I-Data
.	1041,1042	O	O

These	1043,1048	O	B-Data
temporal	1049,1057	O	I-Data
trends	1058,1064	O	I-Data
were	1065,1069	O	O
regressed	1070,1079	O	B-Process
against	1080,1087	O	O
reference	1088,1097	O	B-Data
curves	1098,1104	O	I-Data
for	1105,1108	O	O
the	1109,1112	O	B-Material
same	1113,1117	O	I-Material
region	1118,1124	O	I-Material
(	1125,1126	O	I-Material
FENNOSTACK	1126,1136	O	I-Material
and	1137,1140	O	I-Material
FENNORPIS	1141,1150	O	I-Material
;	1150,1151	O	I-Material
Snowball	1152,1160	O	I-Material
et	1161,1163	O	I-Material
al	1164,1166	O	I-Material
.	1166,1167	O	I-Material
,	1167,1168	O	I-Material
2007	1169,1173	O	I-Material
)	1173,1174	O	I-Material
.	1174,1175	O	O

The	1176,1179	O	O
best	1180,1184	O	O
statistical	1185,1196	O	O
matches	1197,1204	O	O
to	1205,1207	O	O
the	1208,1211	O	B-Data
reference	1212,1221	O	I-Data
curves	1222,1228	O	I-Data
are	1229,1232	O	O
obtained	1233,1241	O	O
when	1242,1246	O	O
we	1247,1249	O	O
apply	1250,1255	O	O
lock	1256,1260	O	B-Data
-	1260,1261	O	I-Data
in	1261,1263	O	I-Data
depths	1264,1270	O	I-Data
of	1271,1273	O	I-Data
21	1274,1276	O	I-Data
-	1276,1277	O	I-Data
34	1277,1279	O	I-Data
cm	1279,1281	O	I-Data
to	1282,1284	O	O
the	1285,1288	O	B-Material
Gyltigesjön	1289,1300	O	I-Material
paleomagnetic	1301,1314	O	I-Material
data	1315,1319	O	I-Material
,	1319,1320	O	O
although	1321,1329	O	O
these	1330,1335	O	O
are	1336,1339	O	O
most	1340,1344	O	O
likely	1345,1351	O	O
minimum	1352,1359	O	B-Data
estimates	1360,1369	O	I-Data
.	1369,1370	O	O

Our	1371,1374	O	O
study	1375,1380	O	O
suggests	1381,1389	O	O
that	1390,1394	O	O
a	1395,1396	O	B-Data
significant	1397,1408	O	I-Data
paleomagnetic	1409,1422	O	I-Data
lock	1423,1427	O	I-Data
-	1427,1428	O	I-Data
in	1428,1430	O	I-Data
depth	1431,1436	O	I-Data
can	1437,1440	O	O
affect	1441,1447	O	O
the	1448,1451	O	O
acquisition	1452,1463	O	O
of	1464,1466	O	O
post	1467,1471	O	B-Process
-	1471,1472	O	I-Process
depositional	1472,1484	O	I-Process
remanent	1485,1493	O	I-Process
magnetization	1494,1507	O	I-Process
even	1508,1512	O	O
where	1513,1518	O	O
bioturbation	1519,1531	O	B-Material
is	1532,1534	O	O
absent	1535,1541	O	O
and	1542,1545	O	O
no	1546,1548	O	O
mixed	1549,1554	O	B-Material
sediment	1555,1563	O	I-Material
surface	1564,1571	O	I-Material
layer	1572,1577	O	I-Material
exists	1578,1584	O	O
.	1584,1585	O	O

Highlights	1586,1596	O	O
•	1597,1598	O	O

Paleomagnetic	1599,1612	O	B-Material
data	1613,1617	O	I-Material
obtained	1618,1626	O	O
from	1627,1631	O	O
organic	1632,1639	O	B-Material
rich	1640,1644	O	I-Material
varved	1645,1651	O	I-Material
lake	1652,1656	O	I-Material
sediments	1657,1666	O	I-Material
.	1666,1667	O	O

•	1668,1669	O	O

Chronology	1670,1680	O	B-Process
based	1681,1686	O	O
on	1687,1689	O	O
14C	1690,1693	O	B-Data
wiggle	1694,1700	O	I-Data
-	1700,1701	O	I-Data
matching	1701,1709	O	I-Data
and	1710,1713	O	O
14C	1714,1717	O	B-Data
ages	1718,1722	O	I-Data
of	1723,1725	O	O
terrestrial	1726,1737	O	B-Material
macrofossils	1738,1750	O	I-Material
.	1750,1751	O	O

•	1752,1753	O	O

Paleomagnetic	1754,1767	O	B-Data
lock	1768,1772	O	I-Data
-	1772,1773	O	I-Data
in	1773,1775	O	I-Data
delay	1776,1781	O	I-Data
quantified	1782,1792	O	B-Process
to	1793,1795	O	O
at	1796,1798	O	B-Data
least	1799,1804	O	I-Data
21	1805,1807	O	I-Data
cm	1807,1809	O	I-Data
.	1809,1810	O	O

-DOCSTART- (S0967064513002774)

Cold	0,4	O	B-Material
-	4,5	O	I-Material
water	5,10	O	I-Material
corals	11,17	O	I-Material
are	18,21	O	O
associated	22,32	O	O
with	33,37	O	O
high	38,42	O	B-Data
local	43,48	O	B-Material
biodiversity	49,61	O	I-Material
,	61,62	O	O
but	63,66	O	O
despite	67,74	O	O
their	75,80	O	O
importance	81,91	O	O
as	92,94	O	O
ecosystem	95,104	O	B-Process
engineers	105,114	O	I-Process
,	114,115	O	O
little	116,122	O	O
is	123,125	O	O
known	126,131	O	O
about	132,137	O	O
how	138,141	O	O
these	142,147	O	B-Material
organisms	148,157	O	I-Material
will	158,162	O	O
respond	163,170	O	O
to	171,173	O	O
projected	174,183	O	B-Process
ocean	184,189	O	I-Process
acidification	190,203	O	I-Process
.	203,204	O	O

Since	205,210	O	O
preindustrial	211,224	O	B-Data
times	225,230	O	I-Data
,	230,231	O	O
average	232,239	O	B-Data
ocean	240,245	O	I-Data
pH	246,248	O	I-Data
has	249,252	O	O
decreased	253,262	O	B-Process
from	263,267	O	B-Data
8.2	268,271	O	I-Data
to	272,274	O	I-Data
~8.1	275,279	O	I-Data
,	279,280	O	O
and	281,284	O	O
predicted	285,294	O	B-Material
CO2	295,298	O	I-Material
emissions	299,308	O	I-Material
will	309,313	O	O
decrease	314,322	O	B-Process
by	323,325	O	O
up	326,328	O	B-Data
to	329,331	O	I-Data
another	332,339	O	I-Data
0.3	340,343	O	I-Data
pH	344,346	O	I-Data
units	347,352	O	I-Data
by	353,355	O	O
the	356,359	O	O
end	360,363	O	O
of	364,366	O	O
the	367,370	O	O
century	371,378	O	O
.	378,379	O	O

This	380,384	O	B-Process
decrease	385,393	O	I-Process
in	394,396	O	O
pH	397,399	O	B-Material
may	400,403	O	O
have	404,408	O	O
a	409,410	O	O
wide	411,415	O	O
range	416,421	O	O
of	422,424	O	O
impacts	425,432	O	O
upon	433,437	O	O
marine	438,444	O	B-Material
life	445,449	O	I-Material
,	449,450	O	O
and	451,454	O	O
in	455,457	O	O
particular	458,468	O	O
upon	469,473	O	O
calcifiers	474,484	O	B-Material
such	485,489	O	O
as	490,492	O	O
cold	493,497	O	B-Material
-	497,498	O	I-Material
water	498,503	O	I-Material
corals	504,510	O	I-Material
.	510,511	O	O

Lophelia	512,520	O	B-Material
pertusa	521,528	O	I-Material
is	529,531	O	O
the	532,535	O	B-Material
most	536,540	O	I-Material
widespread	541,551	O	I-Material
cold	552,556	O	I-Material
-	556,557	O	I-Material
water	557,562	O	I-Material
coral	563,568	O	I-Material
(	569,570	O	I-Material
CWC	570,573	O	I-Material
)	573,574	O	I-Material
species	575,582	O	I-Material
,	582,583	O	O
frequently	584,594	O	O
found	595,600	O	O
in	601,603	O	O
the	604,607	O	O
North	608,613	O	O
Atlantic	614,622	O	O
.	622,623	O	O

Here	624,628	O	O
,	628,629	O	O
we	630,632	O	O
present	633,640	O	O
the	641,644	O	B-Data
first	645,650	O	I-Data
short	651,656	O	I-Data
-	656,657	O	I-Data
term	657,661	O	I-Data
(	662,663	O	I-Data
21	663,665	O	I-Data
days	666,670	O	I-Data
)	670,671	O	I-Data
data	672,676	O	I-Data
on	677,679	O	O
the	680,683	O	B-Process
effects	684,691	O	I-Process
of	692,694	O	O
increased	695,704	O	B-Process
CO2	705,708	O	B-Material
(	709,710	O	O
750ppm	710,716	O	B-Data
)	716,717	O	O
upon	718,722	O	O
the	723,726	O	B-Process
metabolism	727,737	O	I-Process
of	738,740	O	O
freshly	741,748	O	B-Material
collected	749,758	O	I-Material
L.	759,761	O	I-Material
pertusa	762,769	O	I-Material
from	770,774	O	O
Mingulay	775,783	O	B-Material
Reef	784,788	O	I-Material
Complex	789,796	O	I-Material
,	796,797	O	O
Scotland	798,806	O	O
,	806,807	O	O
for	808,811	O	O
comparison	812,822	O	O
with	823,827	O	O
net	828,831	O	B-Process
calcification	832,845	O	I-Process
.	845,846	O	O

Over	847,851	O	B-Data
21	852,854	O	I-Data
days	855,859	O	I-Data
,	859,860	O	O
corals	861,867	O	B-Material
exposed	868,875	O	B-Process
to	876,878	O	O
increased	879,888	O	B-Process
CO2	889,892	O	B-Data
conditions	893,903	O	I-Data
had	904,907	O	O
significantly	908,921	O	O
lower	922,927	O	B-Data
respiration	928,939	O	B-Data
rates	940,945	O	I-Data
(	946,947	O	O
11.4±1.39	947,956	O	B-Data
SE	957,959	O	I-Data
,	959,960	O	I-Data
µmolO2g-1tissuedryweighth-1	961,988	O	I-Data
)	988,989	O	O
than	990,994	O	O
corals	995,1001	O	B-Material
in	1002,1004	O	O
control	1005,1012	O	B-Data
conditions	1013,1023	O	I-Data
(	1024,1025	O	O
28.6±7.30	1025,1034	O	B-Data
SE	1035,1037	O	I-Data
µmolO2g-1tissuedryweighth-1	1038,1065	O	I-Data
)	1065,1066	O	O
.	1066,1067	O	O

There	1068,1073	O	O
was	1074,1077	O	O
no	1078,1080	O	O
corresponding	1081,1094	O	O
change	1095,1101	O	B-Data
in	1102,1104	O	I-Data
calcification	1105,1118	O	I-Data
rates	1119,1124	O	I-Data
between	1125,1132	O	O
treatments	1133,1143	O	B-Process
,	1143,1144	O	O
measured	1145,1153	O	O
using	1154,1159	O	O
the	1160,1163	O	B-Method
alkalinity	1164,1174	O	I-Method
anomaly	1175,1182	O	I-Method
technique	1183,1192	O	I-Method
and	1193,1196	O	O
14C	1197,1200	O	B-Data
uptake	1201,1207	O	B-Process
.	1207,1208	O	O

The	1209,1212	O	B-Process
decrease	1213,1221	O	I-Process
in	1222,1224	O	O
respiration	1225,1236	O	B-Data
rate	1237,1241	O	I-Data
and	1242,1245	O	O
maintenance	1246,1257	O	B-Process
of	1258,1260	O	O
calcification	1261,1274	O	B-Data
rate	1275,1279	O	I-Data
indicates	1280,1289	O	O
an	1290,1292	O	B-Data
energetic	1293,1302	O	I-Data
imbalance	1303,1312	O	I-Data
,	1312,1313	O	O
likely	1314,1320	O	O
facilitated	1321,1332	O	O
by	1333,1335	O	O
utilisation	1336,1347	O	B-Process
of	1348,1350	O	O
lipid	1351,1356	O	B-Material
reserves	1357,1365	O	I-Material
.	1365,1366	O	O

These	1367,1372	O	O
data	1373,1377	O	O
from	1378,1382	O	O
freshly	1383,1390	O	B-Material
collected	1391,1400	O	I-Material
L.	1401,1403	O	I-Material
pertusa	1404,1411	O	I-Material
from	1412,1416	O	O
the	1417,1420	O	B-Material
Mingulay	1421,1429	O	I-Material
Reef	1430,1434	O	I-Material
Complex	1435,1442	O	I-Material
will	1443,1447	O	O
help	1448,1452	O	O
define	1453,1459	O	O
the	1460,1463	O	O
impact	1464,1470	O	O
of	1471,1473	O	O
ocean	1474,1479	O	B-Process
acidification	1480,1493	O	I-Process
upon	1494,1498	O	O
the	1499,1502	O	B-Process
growth	1503,1509	O	I-Process
,	1509,1510	O	O
physiology	1511,1521	O	B-Process
and	1522,1525	O	O
structural	1526,1536	O	B-Material
integrity	1537,1546	O	I-Material
of	1547,1549	O	O
this	1550,1554	O	B-Material
key	1555,1558	O	I-Material
reef	1559,1563	O	I-Material
framework	1564,1573	O	I-Material
forming	1574,1581	O	I-Material
species	1582,1589	O	I-Material
.	1589,1590	O	O

-DOCSTART- (S1750583613004192)

To	0,2	O	O
prevent	3,10	O	B-Process
ocean	11,16	O	B-Process
acidification	17,30	O	I-Process
and	31,34	O	O
mitigate	35,43	O	B-Process
greenhouse	44,54	O	B-Process
gas	55,58	O	I-Process
emissions	59,68	O	I-Process
,	68,69	O	O
it	70,72	O	O
is	73,75	O	O
necessary	76,85	O	O
to	86,88	O	O
capture	89,96	O	B-Process
and	97,100	O	O
store	101,106	O	B-Process
carbon	107,113	O	B-Material
dioxide	114,121	O	I-Material
.	121,122	O	O

The	123,126	O	B-Material
Sleipner	127,135	O	I-Material
storage	136,143	O	I-Material
site	144,148	O	I-Material
,	148,149	O	O
offshore	150,158	O	O
Norway	159,165	O	O
,	165,166	O	O
is	167,169	O	O
the	170,173	O	O
world	174,179	O	O
's	179,181	O	O
first	182,187	O	O
and	188,191	O	O
largest	192,199	O	O
engineered	200,210	O	O
waste	211,216	O	B-Material
repository	217,227	O	I-Material
for	228,231	O	O
a	232,233	O	B-Material
greenhouse	234,244	O	I-Material
gas	245,248	O	I-Material
.	248,249	O	O

CO2	250,253	O	B-Material
is	254,256	O	O
separated	257,266	O	B-Process
from	267,271	O	O
the	272,275	O	B-Material
Sleipner	276,284	O	I-Material
gas	285,288	O	I-Material
condensate	289,299	O	I-Material
field	300,305	O	I-Material
and	306,309	O	O
stored	310,316	O	B-Process
in	317,319	O	O
the	320,323	O	B-Material
pore	324,328	O	I-Material
space	329,334	O	I-Material
of	335,337	O	O
the	338,341	O	B-Material
Utsira	342,348	O	I-Material
Formation	349,358	O	I-Material
,	358,359	O	O
a	360,361	O	B-Material
saline	362,368	O	I-Material
aquifer	369,376	O	I-Material
approximately	377,390	O	O
1	391,392	O	B-Data
km	392,394	O	I-Data
below	395,400	O	O
the	401,404	O	B-Material
surface	405,412	O	I-Material
and	413,416	O	O
200	417,420	O	B-Data
km	420,422	O	I-Data
from	423,427	O	O
the	428,431	O	B-Material
coast	432,437	O	I-Material
.	437,438	O	O

Statoil	439,446	O	B-Material
,	446,447	O	O
the	448,451	O	O
field	452,457	O	O
operator	458,466	O	O
,	466,467	O	O
has	468,471	O	O
injected	472,480	O	B-Process
almost	481,487	O	O
1Mt	488,491	O	B-Data
/	491,492	O	I-Data
yr	492,494	O	I-Data
of	495,497	O	O
captured	498,506	O	B-Material
CO2	507,510	O	I-Material
into	511,515	O	O
the	516,519	O	B-Material
storage	520,527	O	I-Material
site	528,532	O	I-Material
since	533,538	O	O
1996	539,543	O	O
.	543,544	O	O

The	545,548	O	B-Material
buoyant	549,556	O	I-Material
CO2	557,560	O	I-Material
plume	561,566	O	I-Material
ascended	567,575	O	B-Process
rapidly	576,583	O	I-Process
through	584,591	O	O
eight	592,597	O	B-Data
thin	598,602	O	B-Material
shale	603,608	O	I-Material
barriers	609,617	O	I-Material
within	618,624	O	O
the	625,628	O	B-Material
aquifer	629,636	O	I-Material
to	637,639	O	O
reach	640,645	O	O
the	646,649	O	B-Material
top	650,653	O	I-Material
seal	654,658	O	I-Material
in	659,661	O	O
less	662,666	O	O
than	667,671	O	O
three	672,677	O	O
years	678,683	O	O
.	683,684	O	O

The	685,688	O	B-Process
plume	689,694	O	I-Process
's	694,696	O	I-Process
progress	697,705	O	I-Process
has	706,709	O	O
been	710,714	O	O
monitored	715,724	O	B-Process
by	725,727	O	O
eight	728,733	O	B-Data
seismic	734,741	O	B-Method
surveys	742,749	O	I-Method
,	749,750	O	O
as	751,753	O	O
well	754,758	O	O
as	759,761	O	O
gravimetric	762,773	O	B-Process
and	774,777	O	I-Process
electromagnetic	778,793	O	I-Process
monitoring	794,804	O	I-Process
,	804,805	O	O
which	806,811	O	O
record	812,818	O	O
the	819,822	O	B-Process
spreading	823,832	O	I-Process
of	833,835	O	O
nine	836,840	O	B-Data
thin	841,845	O	B-Material
CO2	846,849	O	I-Material
layers	850,856	O	I-Material
.	856,857	O	O

This	858,862	O	O
paper	863,868	O	O
presents	869,877	O	O
a	878,879	O	B-Material
capillary	880,889	O	I-Material
flow	890,894	O	I-Material
model	895,900	O	I-Material
using	901,906	O	O
invasion	907,915	O	B-Process
percolation	916,927	O	I-Process
physics	928,935	O	I-Process
that	936,940	O	O
accurately	941,951	O	O
matches	952,959	O	O
the	960,963	O	B-Material
plume	964,969	O	I-Material
's	969,971	O	I-Material
geometry	972,980	O	B-Data
.	980,981	O	O

The	982,985	O	O
approach	986,994	O	O
differs	995,1002	O	O
from	1003,1007	O	O
standard	1008,1016	O	B-Material
Darcy	1017,1022	O	I-Material
flow	1023,1027	O	I-Material
simulations	1028,1039	O	I-Material
,	1039,1040	O	O
which	1041,1046	O	O
fail	1047,1051	O	O
to	1052,1054	O	O
match	1055,1060	O	O
the	1061,1064	O	B-Data
plume	1065,1070	O	I-Data
geometry	1071,1079	O	I-Data
.	1079,1080	O	O

The	1081,1084	O	B-Material
calibrated	1085,1095	O	I-Material
capillary	1096,1105	O	I-Material
flow	1106,1110	O	I-Material
simulation	1111,1121	O	I-Material
indicates	1122,1131	O	O
that	1132,1136	O	O
a	1137,1138	O	B-Data
mass	1139,1143	O	I-Data
balance	1144,1151	O	O
for	1152,1155	O	O
the	1156,1159	O	B-Material
plume	1160,1165	O	I-Material
is	1166,1168	O	O
likely	1169,1175	O	O
,	1175,1176	O	O
but	1177,1180	O	O
can	1181,1184	O	O
only	1185,1189	O	O
replicate	1190,1199	O	B-Process
the	1200,1203	O	B-Data
plume	1204,1209	O	I-Data
geometry	1210,1218	O	I-Data
if	1219,1221	O	O
the	1222,1225	O	B-Material
thin	1226,1230	O	I-Material
intra	1231,1236	O	I-Material
-	1236,1237	O	I-Material
formational	1237,1248	O	I-Material
shale	1249,1254	O	I-Material
barriers	1255,1263	O	I-Material
are	1264,1267	O	O
fractured	1268,1277	O	B-Process
.	1277,1278	O	O

The	1279,1282	O	B-Material
model	1283,1288	O	I-Material
enables	1289,1296	O	O
an	1297,1299	O	B-Data
estimate	1300,1308	O	I-Data
of	1309,1311	O	O
the	1312,1315	O	B-Material
shale	1316,1321	O	I-Material
barrier	1322,1329	O	I-Material
behavior	1330,1338	O	O
and	1339,1342	O	O
caprock	1343,1350	O	B-Data
performance	1351,1362	O	I-Data
.	1362,1363	O	O

The	1364,1367	O	B-Material
fractures	1368,1377	O	I-Material
are	1378,1381	O	O
very	1382,1386	O	O
unlikely	1387,1395	O	O
to	1396,1398	O	O
have	1399,1403	O	O
been	1404,1408	O	O
caused	1409,1415	O	O
by	1416,1418	O	O
CO2	1419,1422	O	B-Process
injection	1423,1432	O	I-Process
given	1433,1438	O	O
the	1439,1442	O	B-Process
confining	1443,1452	O	I-Process
stress	1453,1459	O	I-Process
of	1460,1462	O	O
the	1463,1466	O	B-Material
rock	1467,1471	O	I-Material
and	1472,1475	O	O
weak	1476,1480	O	B-Process
overpressure	1481,1493	O	I-Process
of	1494,1496	O	O
the	1497,1500	O	B-Material
plume	1501,1506	O	I-Material
,	1506,1507	O	O
and	1508,1511	O	O
so	1512,1514	O	O
fracturing	1515,1525	O	B-Process
must	1526,1530	O	O
pre	1531,1534	O	O
-	1534,1535	O	O
date	1535,1539	O	O
injection	1540,1549	O	B-Process
.	1549,1550	O	O

A	1551,1552	O	O
novel	1553,1558	O	O
mechanism	1559,1568	O	O
is	1569,1571	O	O
suggested	1572,1581	O	O
:	1581,1582	O	O
the	1583,1586	O	B-Process
deglaciation	1587,1599	O	I-Process
of	1600,1602	O	O
regional	1603,1611	O	B-Material
ice	1612,1615	O	I-Material
sheets	1616,1622	O	I-Material
that	1623,1627	O	O
have	1628,1632	O	O
rapidly	1633,1640	O	O
and	1641,1644	O	O
repeatedly	1645,1655	O	O
unloaded	1656,1664	O	B-Process
approximately	1665,1678	O	B-Material
1	1679,1680	O	I-Material
km	1680,1682	O	I-Material
of	1683,1685	O	O
ice	1686,1689	O	B-Material
.	1689,1690	O	O

The	1691,1694	O	B-Process
induced	1695,1702	O	I-Process
transient	1703,1712	O	I-Process
pore	1713,1717	O	I-Process
pressures	1718,1727	O	I-Process
are	1728,1731	O	O
sufficient	1732,1742	O	O
to	1743,1745	O	O
hydro	1746,1751	O	B-Process
-	1751,1752	O	I-Process
fracture	1752,1760	O	I-Process
thin	1761,1765	O	B-Material
shales	1766,1772	O	I-Material
.	1772,1773	O	O

The	1774,1777	O	B-Material
fractures	1778,1787	O	I-Material
enable	1788,1794	O	O
fast	1795,1799	O	B-Process
CO2	1800,1803	O	I-Process
ascent	1804,1810	O	I-Process
,	1810,1811	O	O
resulting	1812,1821	O	O
in	1822,1824	O	O
a	1825,1826	O	B-Material
multi	1827,1832	O	I-Material
-	1832,1833	O	I-Material
layered	1833,1840	O	I-Material
plume	1841,1846	O	I-Material
.	1846,1847	O	O

Shallow	1848,1855	O	B-Material
CO2	1856,1859	O	I-Material
storage	1860,1867	O	I-Material
sites	1868,1873	O	I-Material
in	1874,1876	O	O
the	1877,1880	O	O
Northern	1881,1889	O	O
North	1890,1895	O	O
Sea	1896,1899	O	O
and	1900,1903	O	O
other	1904,1909	O	O
regions	1910,1917	O	O
that	1918,1922	O	O
have	1923,1927	O	O
been	1928,1932	O	O
loaded	1933,1939	O	O
by	1940,1942	O	O
Quaternary	1943,1953	O	B-Material
ice	1954,1957	O	I-Material
sheets	1958,1964	O	I-Material
are	1965,1968	O	O
likely	1969,1975	O	O
to	1976,1978	O	O
behave	1979,1985	O	O
in	1986,1988	O	O
a	1989,1990	O	O
similar	1991,1998	O	O
manner	1999,2005	O	O
.	2005,2006	O	O

