-DOCSTART- (S0012821X13002185)

The	0,3	O	O
abrupt	4,10	O	O
onset	11,16	O	O
of	17,19	O	O
Antarctic	20,29	O	B-Process
glaciation	30,40	O	I-Process
during	41,47	O	O
the	48,51	O	B-Process
Eocene	52,58	O	I-Process
-	58,59	O	I-Process
Oligocene	59,68	O	I-Process
Transition	69,79	O	I-Process
(	80,81	O	O
∼33.7Ma	81,88	O	B-Data
,	88,89	O	I-Data
Oi1	90,93	O	I-Data
)	93,94	O	O
is	95,97	O	O
linked	98,104	O	O
to	105,107	O	O
declining	108,117	O	B-Process
atmospheric	118,129	O	B-Data
pCO2	130,134	O	I-Data
levels	135,141	O	I-Data
,	141,142	O	O
yet	143,146	O	O
the	147,150	O	B-Process
mechanisms	151,161	O	I-Process
that	162,166	O	O
forced	167,173	O	O
pCO2	174,178	O	B-Process
decline	179,186	O	I-Process
remain	187,193	O	O
elusive	194,201	O	O
.	201,202	O	O

Biogenic	203,211	O	B-Process
silicon	212,219	O	I-Process
cycling	220,227	O	I-Process
is	228,230	O	O
inextricably	231,243	O	O
linked	244,250	O	O
to	251,253	O	O
both	254,258	O	O
long	259,263	O	B-Process
and	264,267	O	I-Process
short	268,273	O	I-Process
term	274,278	O	I-Process
carbon	279,285	O	I-Process
cycling	286,293	O	I-Process
through	294,301	O	O
the	302,305	O	B-Material
diatoms	306,313	O	I-Material
,	313,314	O	O
siliceous	315,324	O	B-Material
walled	325,331	O	I-Material
autotrophs	332,342	O	I-Material
which	343,348	O	O
today	349,354	O	O
account	355,362	O	O
for	363,366	O	O
up	367,369	O	B-Data
to	370,372	O	I-Data
40	373,375	O	I-Data
%	375,376	O	I-Data
of	377,379	O	O
primary	380,387	O	B-Process
production	388,398	O	I-Process
.	398,399	O	O

It	400,402	O	O
is	403,405	O	O
hypothesised	406,418	O	O
that	419,423	O	O
during	424,430	O	B-Data
the	431,434	O	I-Data
Late	435,439	O	I-Data
Eocene	440,446	O	I-Data
a	447,448	O	B-Process
sharp	449,454	O	I-Process
rise	455,459	O	I-Process
in	460,462	O	O
diatom	463,469	O	B-Material
abundance	470,479	O	I-Material
could	480,485	O	O
have	486,490	O	O
contributed	491,502	O	O
to	503,505	O	O
pCO2	506,510	O	B-Process
drawdown	511,519	O	I-Process
and	520,523	O	O
global	524,530	O	B-Process
cooling	531,538	O	I-Process
by	539,541	O	O
increasing	542,552	O	B-Process
the	553,556	O	B-Data
proportion	557,567	O	I-Data
of	568,570	O	O
organic	571,578	O	B-Material
carbon	579,585	O	I-Material
buried	586,592	O	B-Process
in	593,595	O	O
marine	596,602	O	B-Material
sediment	603,611	O	I-Material
.	611,612	O	O

Diatom	613,619	O	B-Data
and	620,623	O	I-Data
sponge	624,630	O	I-Data
silicon	631,638	O	I-Data
isotope	639,646	O	I-Data
ratios	647,653	O	I-Data
(	654,655	O	I-Data
δ30Si	655,660	O	I-Data
)	660,661	O	I-Data
are	662,665	O	O
here	666,670	O	O
combined	671,679	O	B-Process
for	680,683	O	O
the	684,687	O	O
first	688,693	O	O
time	694,698	O	O
to	699,701	O	O
reconstruct	702,713	O	B-Process
the	714,717	O	B-Process
late	718,722	O	I-Process
Eocene	723,729	O	I-Process
-	729,730	O	I-Process
early	730,735	O	I-Process
Oligocene	736,745	O	I-Process
ocean	746,751	O	I-Process
silicon	752,759	O	I-Process
cycle	760,765	O	I-Process
and	766,769	O	O
provide	770,777	O	O
new	778,781	O	O
insight	782,789	O	O
into	790,794	O	O
the	795,798	O	B-Process
role	799,803	O	I-Process
of	804,806	O	I-Process
diatom	807,813	O	I-Process
productivity	814,826	O	I-Process
in	827,829	O	O
Antarctic	830,839	O	B-Process
glaciation	840,850	O	I-Process
.	850,851	O	O

At	852,854	O	O
ODP	855,858	O	B-Material
site	859,863	O	I-Material
1090	864,868	O	I-Material
in	869,871	O	O
the	872,875	O	O
Southern	876,884	O	O
Ocean	885,890	O	O
,	890,891	O	O
a	892,893	O	B-Data
0.6‰	894,898	O	I-Data
rise	899,903	O	I-Data
in	904,906	O	O
diatom	907,913	O	B-Material
δ30Si	914,919	O	I-Material
through	920,927	O	O
the	928,931	O	B-Data
late	932,936	O	I-Data
Eocene	937,943	O	I-Data
documents	944,953	O	O
increasing	954,964	O	B-Process
diatom	965,971	O	I-Process
silicic	972,979	O	I-Process
acid	980,984	O	I-Process
utilisation	985,996	O	I-Process
with	997,1001	O	O
high	1002,1006	O	B-Data
,	1006,1007	O	I-Data
near	1008,1012	O	I-Data
modern	1013,1019	O	I-Data
values	1020,1026	O	I-Data
attained	1027,1035	O	O
by	1036,1038	O	O
the	1039,1042	O	B-Data
earliest	1043,1051	O	I-Data
Oligocene	1052,1061	O	I-Data
.	1061,1062	O	O

A	1063,1064	O	B-Data
concomitant	1065,1076	O	I-Data
1.5‰	1077,1081	O	I-Data
decline	1082,1089	O	I-Data
in	1090,1092	O	O
sponge	1093,1099	O	B-Material
δ30Si	1100,1105	O	I-Material
at	1106,1108	O	O
ODP	1109,1112	O	B-Material
site	1113,1117	O	I-Material
689	1118,1121	O	I-Material
on	1122,1124	O	O
the	1125,1128	O	B-Material
Maud	1129,1133	O	I-Material
Rise	1134,1138	O	I-Material
tracks	1139,1145	O	B-Process
an	1146,1148	O	O
approximate	1149,1160	O	O
doubling	1161,1169	O	B-Process
of	1170,1172	O	O
intermediate	1173,1185	O	B-Data
depth	1186,1191	O	I-Data
silicic	1192,1199	O	I-Data
acid	1200,1204	O	I-Data
concentration	1205,1218	O	I-Data
in	1219,1221	O	O
the	1222,1225	O	B-Material
high	1226,1230	O	I-Material
southern	1231,1239	O	I-Material
latitudes	1240,1249	O	I-Material
.	1249,1250	O	O

Intermediate	1251,1263	O	B-Data
depth	1264,1269	O	I-Data
silicic	1270,1277	O	I-Data
acid	1278,1282	O	I-Data
concentration	1283,1296	O	I-Data
peaked	1297,1303	O	B-Process
at	1304,1306	O	O
∼31.5Ma	1307,1314	O	B-Data
,	1314,1315	O	O
coincident	1316,1326	O	O
with	1327,1331	O	O
the	1332,1335	O	O
final	1336,1341	O	O
establishment	1342,1355	O	O
of	1356,1358	O	O
a	1359,1360	O	B-Material
deepwater	1361,1370	O	I-Material
pathway	1371,1378	O	I-Material
through	1379,1386	O	O
the	1387,1390	O	B-Material
Tasman	1391,1397	O	I-Material
Gateway	1398,1405	O	I-Material
and	1406,1409	O	O
Drake	1410,1415	O	B-Material
Passage	1416,1423	O	I-Material
.	1423,1424	O	O

These	1425,1430	O	O
results	1431,1438	O	O
suggest	1439,1446	O	O
that	1447,1451	O	O
upwelling	1452,1461	O	B-Process
intensification	1462,1477	O	I-Process
related	1478,1485	O	O
to	1486,1488	O	O
the	1489,1492	O	B-Process
spin	1493,1497	O	I-Process
-	1497,1498	O	I-Process
up	1498,1500	O	I-Process
of	1501,1503	O	I-Process
a	1504,1505	O	I-Process
circum	1506,1512	O	I-Process
-	1512,1513	O	I-Process
Antarctic	1513,1522	O	I-Process
current	1523,1530	O	I-Process
may	1531,1534	O	O
have	1535,1539	O	O
driven	1540,1546	O	O
late	1547,1551	O	B-Process
Eocene	1552,1558	O	I-Process
diatom	1559,1565	O	I-Process
proliferation	1566,1579	O	I-Process
.	1579,1580	O	O

Organic	1581,1588	O	B-Process
carbon	1589,1595	O	I-Process
burial	1596,1602	O	I-Process
associated	1603,1613	O	O
with	1614,1618	O	O
higher	1619,1625	O	B-Material
diatom	1626,1632	O	I-Material
abundance	1633,1642	O	I-Material
and	1643,1646	O	O
export	1647,1653	O	B-Process
provides	1654,1662	O	O
a	1663,1664	O	O
mechanism	1665,1674	O	O
that	1675,1679	O	O
can	1680,1683	O	O
account	1684,1691	O	O
for	1692,1695	O	O
pCO2	1696,1700	O	B-Process
drawdown	1701,1709	O	I-Process
not	1710,1713	O	O
only	1714,1718	O	O
at	1719,1721	O	O
,	1721,1722	O	O
but	1723,1726	O	O
also	1727,1731	O	O
prior	1732,1737	O	O
to	1738,1740	O	O
,	1740,1741	O	O
Antarctic	1742,1751	O	B-Process
glaciation	1752,1762	O	I-Process
as	1763,1765	O	O
required	1766,1774	O	O
by	1775,1777	O	O
a	1778,1779	O	B-Process
pCO2	1780,1784	O	I-Process
'	1785,1786	O	I-Process
threshold	1786,1795	O	I-Process
'	1795,1796	O	I-Process
mechanism	1797,1806	O	I-Process
for	1807,1810	O	O
ice	1811,1814	O	B-Process
sheet	1815,1820	O	I-Process
growth	1821,1827	O	I-Process
.	1827,1828	O	O

Graphical	1829,1838	O	O
Abstract	1839,1847	O	O
Highlights	1848,1858	O	O
•	1859,1860	O	O
Diatom	1861,1867	O	B-Material
and	1868,1871	O	I-Material
sponge	1872,1878	O	I-Material
δ30Si	1879,1884	O	I-Material
used	1885,1889	O	O
to	1890,1892	O	O
reconstruct	1893,1904	O	B-Process
the	1905,1908	O	B-Process
Eocene	1909,1915	O	I-Process
-	1915,1916	O	I-Process
Oligocene	1916,1925	O	I-Process
silicon	1926,1933	O	I-Process
cycle	1934,1939	O	I-Process
.	1939,1940	O	O
•	1941,1942	O	O

0.6‰	1943,1947	O	B-Data
late	1948,1952	O	I-Data
Eocene	1953,1959	O	I-Data
rise	1960,1964	O	I-Data
in	1965,1967	O	O
diatom	1968,1974	O	B-Material
δ30Si	1975,1980	O	I-Material

(	1981,1982	O	O
increasing	1982,1992	O	O
silicic	1993,2000	O	B-Process
acid	2001,2005	O	I-Process
utilisation	2006,2017	O	I-Process
)	2017,2018	O	O
.	2018,2019	O	O

•	2020,2021	O	O

1.5‰	2022,2026	O	B-Data
late	2027,2031	O	I-Data
Eocene	2032,2038	O	I-Data
/	2038,2039	O	I-Data
early	2039,2044	O	I-Data
Oligocene	2045,2054	O	I-Data
sponge	2055,2061	O	I-Data

δ30Si	2062,2067	O	I-Data
fall	2068,2072	O	I-Data
(	2073,2074	O	O
increasing	2074,2084	O	O
silicic	2085,2092	O	B-Data
acid	2093,2097	O	I-Data
concentration	2098,2111	O	I-Data
)	2111,2112	O	O
.	2112,2113	O	O

•	2114,2115	O	O

Upwelling	2116,2125	O	B-Process
related	2126,2133	O	O
to	2134,2136	O	O
proto	2137,2142	O	B-Process
-	2142,2143	O	I-Process
ACC	2143,2146	O	I-Process
facilitated	2147,2158	O	O
late	2159,2163	O	B-Process
Eocene	2164,2170	O	I-Process
diatom	2171,2177	O	I-Process
proliferation	2178,2191	O	I-Process
.	2191,2192	O	O
•	2193,2194	O	O

Diatom	2195,2201	O	B-Process
driven	2202,2208	O	I-Process
carbon	2209,2215	O	I-Process
burial	2216,2222	O	I-Process
contributed	2223,2234	O	O
to	2235,2237	O	O
pCO2	2238,2242	O	B-Process
decline	2243,2250	O	I-Process
before	2251,2257	O	O
Antarctic	2258,2267	O	B-Process
glaciation	2268,2278	O	I-Process
.	2278,2279	O	O

-DOCSTART- (S0012821X13007309)

High	0,4	O	B-Method
-	4,5	O	I-Method
resolution	5,15	O	I-Method
osmium	16,22	O	I-Method
(	23,24	O	I-Method
Os	24,26	O	I-Method
)	26,27	O	I-Method
isotope	28,35	O	I-Method
stratigraphy	36,48	O	I-Method
across	49,55	O	O
the	56,59	O	B-Data
Cenomanian	60,70	O	I-Data
-	70,71	O	I-Data
Turonian	71,79	O	I-Data
Boundary	80,88	O	I-Data
Interval	89,97	O	I-Data
from	98,102	O	O
6	103,104	O	B-Data
sections	105,113	O	I-Data
for	114,117	O	O
four	118,122	O	B-Data
transcontinental	123,139	O	I-Data
settings	140,148	O	I-Data
has	149,152	O	O
produced	153,161	O	O
a	162,163	O	B-Data
record	164,170	O	I-Data
of	171,173	O	I-Data
seawater	174,182	O	I-Data
chemistry	183,192	O	I-Data
that	193,197	O	O
demonstrates	198,210	O	O
regional	211,219	O	B-Process
variability	220,231	O	I-Process
as	232,234	O	O
a	235,236	O	O
function	237,245	O	O
of	246,248	O	O
terrestrial	249,260	O	B-Material
and	261,264	O	I-Material
hydrothermal	265,277	O	I-Material
inputs	278,284	O	I-Material
,	284,285	O	O
revealing	286,295	O	O
the	296,299	O	B-Process
impact	300,306	O	I-Process
of	307,309	O	I-Process
palaeoenvironmental	310,329	O	I-Process
processes	330,339	O	I-Process
.	339,340	O	O

In	341,343	O	O
every	344,349	O	O
section	350,357	O	O
the	358,361	O	B-Data
187Os/188Os	362,373	O	I-Data
profiles	374,382	O	I-Data
show	383,387	O	O
a	388,389	O	O
comparable	390,400	O	O
trend	401,406	O	O
;	406,407	O	O
radiogenic	408,418	O	B-Data
values	419,425	O	I-Data
in	426,428	O	O
the	429,432	O	O
lead	433,437	O	O
up	438,440	O	O
to	441,443	O	O
Oceanic	444,451	O	B-Process
Anoxic	452,458	O	I-Process
Event	459,464	O	I-Process
2	465,466	O	I-Process
(	467,468	O	I-Process
OAE	468,471	O	I-Process
2	472,473	O	I-Process
)	473,474	O	I-Process
;	474,475	O	O
an	476,478	O	B-Process
abrupt	479,485	O	I-Process
unradiogenic	486,498	O	I-Process
trend	499,504	O	I-Process
at	505,507	O	O
the	508,511	O	B-Process
onset	512,517	O	I-Process
of	518,520	O	I-Process
OAE	521,524	O	I-Process
2	525,526	O	I-Process
;	526,527	O	O
an	528,530	O	B-Process
unradiogenic	531,543	O	I-Process
interval	544,552	O	I-Process
during	553,559	O	O
the	560,563	O	B-Process
first	564,569	O	I-Process
part	570,574	O	I-Process
of	575,577	O	I-Process
OAE	578,581	O	I-Process
2	582,583	O	I-Process
;	583,584	O	O
and	585,588	O	O
a	589,590	O	B-Process
return	591,597	O	I-Process
to	598,600	O	O
radiogenic	601,611	O	B-Data
values	612,618	O	I-Data
towards	619,626	O	O
the	627,630	O	O
end	631,634	O	O
of	635,637	O	O
the	638,641	O	O
event	642,647	O	O
,	647,648	O	O
above	649,654	O	O
the	655,658	O	B-Data
Cenomanian	659,669	O	I-Data
-	669,670	O	I-Data
Turonian	670,678	O	I-Data
boundary	679,687	O	I-Data
.	687,688	O	O

The	689,692	O	B-Process
unradiogenic	693,705	O	I-Process
trend	706,711	O	I-Process
in	712,714	O	O
187Os/188Os	715,726	O	B-Data
is	727,729	O	O
synchronous	730,741	O	B-Process
in	742,744	O	O
all	745,748	O	B-Material
sections	749,757	O	I-Material
.	757,758	O	O

Previous	759,767	O	O
work	768,772	O	O
suggests	773,781	O	O
that	782,786	O	O
activity	787,795	O	B-Process
of	796,798	O	O
the	799,802	O	B-Material
Caribbean	803,812	O	I-Material
LIP	813,816	O	I-Material
(	817,818	O	I-Material
Large	818,823	O	I-Material
Igneous	824,831	O	I-Material
Province	832,840	O	I-Material
)	840,841	O	I-Material
was	842,845	O	O
the	846,849	O	O
source	850,856	O	O
of	857,859	O	O
unradiogenic	860,872	O	B-Material
Os	873,875	O	I-Material
across	876,882	O	O
the	883,886	O	B-Process
OAE	887,890	O	I-Process
2	891,892	O	I-Process
and	893,896	O	O
possibly	897,905	O	O
an	906,908	O	B-Process
instigator	909,919	O	I-Process
of	920,922	O	O
anoxia	923,929	O	B-Process
in	930,932	O	O
the	933,936	O	B-Material
oceans	937,943	O	I-Material
.	943,944	O	O

Here	945,949	O	O
we	950,952	O	O
assess	953,959	O	B-Process
this	960,964	O	O
hypothesis	965,975	O	O
and	976,979	O	O
consider	980,988	O	O
the	989,992	O	O
influence	993,1002	O	O
of	1003,1005	O	O
activity	1006,1014	O	O
from	1015,1019	O	O
other	1020,1025	O	B-Material
LIPs	1026,1030	O	I-Material
;	1030,1031	O	O
such	1032,1036	O	O
as	1037,1039	O	O
the	1040,1043	O	B-Material
High	1044,1048	O	I-Material
Arctic	1049,1055	O	I-Material
LIP	1056,1059	O	I-Material
.	1059,1060	O	O

A	1061,1062	O	O
brief	1063,1068	O	O
shift	1069,1074	O	O
to	1075,1077	O	O
high	1078,1082	O	B-Data
radiogenic	1083,1093	O	I-Data
187Os/188Os	1094,1105	O	I-Data
values	1106,1112	O	I-Data
occurred	1113,1121	O	O
in	1122,1124	O	O
the	1125,1128	O	B-Material
Western	1129,1136	O	I-Material
Interior	1137,1145	O	I-Material
Seaway	1146,1152	O	I-Material
before	1153,1159	O	O
the	1160,1163	O	B-Process
onset	1164,1169	O	I-Process
of	1170,1172	O	I-Process
OAE	1173,1176	O	I-Process
2	1177,1178	O	I-Process
.	1178,1179	O	O

We	1180,1182	O	O
evaluate	1183,1191	O	B-Process
this	1192,1196	O	B-Data
trend	1197,1202	O	I-Data
and	1203,1206	O	O
suggest	1207,1214	O	O
that	1215,1219	O	O
a	1220,1221	O	B-Data
combination	1222,1233	O	I-Data
of	1234,1236	O	I-Data
factors	1237,1244	O	I-Data
collectively	1245,1257	O	O
played	1258,1264	O	O
critical	1265,1273	O	O
roles	1274,1279	O	O
in	1280,1282	O	O
the	1283,1286	O	B-Process
initiation	1287,1297	O	I-Process
of	1298,1300	O	I-Process
OAE	1301,1304	O	I-Process
2	1305,1306	O	I-Process
;	1306,1307	O	O
differential	1308,1320	O	O
input	1321,1326	O	O
of	1327,1329	O	O
nutrients	1330,1339	O	B-Material
from	1340,1344	O	O
continental	1345,1356	O	B-Material
and	1357,1360	O	I-Material
volcanogenic	1361,1373	O	I-Material
sources	1374,1381	O	I-Material
,	1381,1382	O	O
coupled	1383,1390	O	B-Process
with	1391,1395	O	O
efficient	1396,1405	O	O
palaeocirculation	1406,1423	O	B-Process
of	1424,1426	O	O
the	1427,1430	O	B-Material
global	1431,1437	O	I-Material
ocean	1438,1443	O	I-Material
and	1444,1447	O	I-Material
epeiric	1448,1455	O	I-Material
seas	1456,1460	O	I-Material
,	1460,1461	O	O
enhanced	1462,1470	O	B-Process
productivity	1471,1483	O	I-Process
due	1484,1487	O	O
to	1488,1490	O	O
higher	1491,1497	O	B-Data
nutrient	1498,1506	O	I-Data
availability	1507,1519	O	I-Data
,	1519,1520	O	O
which	1521,1526	O	O
permitted	1527,1536	O	O
penecontemporaneous	1537,1556	O	B-Process
transport	1557,1566	O	I-Process
of	1567,1569	O	O
continental	1570,1581	O	B-Material
and	1582,1585	O	I-Material
LIP	1586,1589	O	I-Material
-	1589,1590	O	I-Material
derived	1590,1597	O	I-Material
nutrients	1598,1607	O	I-Material
to	1608,1610	O	O
trans	1611,1616	O	B-Material
-	1616,1617	O	I-Material
equatorial	1617,1627	O	I-Material
basins	1628,1634	O	I-Material
.	1634,1635	O	O

Highlights	1636,1646	O	O

•	1647,1648	O	O
Use	1649,1652	O	O
Osi	1653,1656	O	B-Method
isotope	1657,1664	O	I-Method
stratigraphy	1665,1677	O	I-Method
to	1678,1680	O	O
infer	1681,1686	O	O
driving	1687,1694	O	B-Process
mechanism(s	1695,1706	O	I-Process
)	1706,1707	O	I-Process
of	1708,1710	O	O
Oceanic	1711,1718	O	B-Process
Anoxic	1719,1725	O	I-Process
Event	1726,1731	O	I-Process
2	1732,1733	O	I-Process
.	1733,1734	O	O
•	1735,1736	O	O

Osi	1737,1740	O	B-Data
profiles	1741,1749	O	I-Data
from	1750,1754	O	O
6	1755,1756	O	B-Material
sites	1757,1762	O	I-Material
illustrate	1763,1773	O	O
the	1774,1777	O	B-Process
regional	1778,1786	O	I-Process
variability	1787,1798	O	I-Process
of	1799,1801	O	O
seawater	1802,1810	O	B-Data
chemistry	1811,1820	O	I-Data
.	1820,1821	O	O
•	1822,1823	O	O

δ13Corg	1824,1831	O	B-Data
and	1832,1835	O	I-Data
Osi	1836,1839	O	I-Data
records	1840,1847	O	I-Data
combined	1848,1856	O	O
generate	1857,1865	O	O
an	1866,1868	O	B-Material
integrated	1869,1879	O	I-Material
timescale	1880,1889	O	I-Material
model	1890,1895	O	I-Material
based	1896,1901	O	O
on	1902,1904	O	O
the	1905,1908	O	B-Material
GSSP	1909,1913	O	I-Material
.	1913,1914	O	O
•	1915,1916	O	O

Anoxia	1917,1923	O	B-Process
is	1924,1926	O	O
a	1927,1928	O	O
function	1929,1937	O	O
of	1938,1940	O	O
feedback	1941,1949	O	B-Data
based	1950,1955	O	O
on	1956,1958	O	O
climate	1959,1966	O	B-Process
change	1967,1973	O	I-Process
and	1974,1977	O	O
volcanism	1978,1987	O	B-Process
.	1987,1988	O	O

•	1989,1990	O	O

Quantitatively	1991,2005	O	O
constrain	2006,2015	O	O
the	2016,2019	O	B-Data
duration	2020,2028	O	I-Data
of	2029,2031	O	O
volcanism	2032,2041	O	B-Process
from	2042,2046	O	O
Caribbean	2047,2056	O	B-Material
LIP	2057,2060	O	I-Material
.	2060,2061	O	O

-DOCSTART- (S0025322712001600)

We	0,2	O	O
present	3,10	O	O
a	11,12	O	B-Data
multi	13,18	O	I-Data
-	18,19	O	I-Data
proxy	19,24	O	I-Data
mineral	25,32	O	I-Data
record	33,39	O	I-Data
based	40,45	O	O
on	46,48	O	O
X	49,50	O	B-Method
-	50,51	O	I-Method
ray	51,54	O	I-Method
diffraction	55,66	O	I-Method
and	67,70	O	I-Method
diffuse	71,78	O	I-Method
reflectance	79,90	O	I-Method
spectrophotometry	91,108	O	I-Method
analysis	109,117	O	I-Method
for	118,121	O	O
two	122,125	O	B-Material
cores	126,131	O	I-Material
from	132,136	O	O
the	137,140	O	B-Material
western	141,148	O	I-Material
Indus	149,154	O	I-Material
Shelf	155,160	O	I-Material
in	161,163	O	O
order	164,169	O	O
to	170,172	O	O
reconstruct	173,184	O	B-Process
changing	185,193	O	B-Data
weathering	194,204	O	I-Data
intensities	205,216	O	I-Data
,	216,217	O	O
sediment	218,226	O	B-Process
transport	227,236	O	I-Process
,	236,237	O	O
and	238,241	O	O
provenance	242,252	O	B-Process
variations	253,263	O	I-Process
since	264,269	O	O
13ka	270,274	O	B-Data
.	274,275	O	O

Core	276,280	O	B-Material
Indus-10	281,289	O	I-Material
is	290,292	O	O
located	293,300	O	O
northwest	301,310	O	O
of	311,313	O	O
the	314,317	O	O
Indus	318,323	O	O
Canyon	324,330	O	O
and	331,334	O	O
exhibits	335,343	O	O
fluctuations	344,356	O	B-Process
in	357,359	O	O
smectite/(illite+chlorite	360,385	O	B-Data
)	385,386	O	I-Data
ratios	387,393	O	I-Data
that	394,398	O	O
correlate	399,408	O	B-Process
with	409,413	O	O
monsoon	414,421	O	B-Data
intensity	422,431	O	I-Data
.	431,432	O	O

Higher	433,439	O	B-Data
smectite/(illite+chlorite	440,465	O	B-Material
)	465,466	O	I-Material
and	467,470	O	O
lower	471,476	O	B-Data
illite	477,483	O	B-Material
crystallinity	484,497	O	I-Material
,	497,498	O	O
normally	499,507	O	O
associated	508,518	O	O
with	519,523	O	O
stronger	524,532	O	B-Process
weathering	533,543	O	I-Process
,	543,544	O	O
peaked	545,551	O	B-Process
during	552,558	O	O
the	559,562	O	B-Data
Early	563,568	O	I-Data
-	568,569	O	I-Data
Mid	569,572	O	I-Data
Holocene	573,581	O	I-Data
,	581,582	O	O
the	583,586	O	B-Data
period	587,593	O	I-Data
of	594,596	O	O
maximum	597,604	O	B-Data
summer	605,611	O	B-Material
monsoon	612,619	O	I-Material
.	619,620	O	O

Hematite	621,629	O	B-Process
/	629,630	O	I-Process
goethite	630,638	O	I-Process
and	639,642	O	I-Process
magnetic	643,651	O	I-Process
susceptibility	652,666	O	I-Process
do	667,669	O	O
not	670,673	O	O
show	674,678	O	O
clear	679,684	O	B-Data
co	685,687	O	B-Process
-	687,688	O	I-Process
variation	688,697	O	I-Process
,	697,698	O	O
although	699,707	O	O
they	708,712	O	O
both	713,717	O	O
increase	718,726	O	O
at	727,729	O	O
Indus-10	730,738	O	B-Material
after	739,744	O	O
10ka	745,749	O	B-Data
,	749,750	O	O
as	751,753	O	O
the	754,757	O	B-Material
monsoon	758,765	O	I-Material
weakened	766,774	O	B-Process
.	774,775	O	O

At	776,778	O	O
Indus-23	779,787	O	B-Material
,	787,788	O	O
located	789,796	O	O
on	797,799	O	O
a	800,801	O	B-Material
clinoform	802,811	O	I-Material
just	812,816	O	O
west	817,821	O	O
of	822,824	O	O
the	825,828	O	B-Material
canyon	829,835	O	I-Material
,	835,836	O	O
hematite	837,845	O	B-Material
/	845,846	O	I-Material
goethite	846,854	O	I-Material
increased	855,864	O	B-Process
during	865,871	O	O
a	872,873	O	B-Data
period	874,880	O	I-Data
of	881,883	O	O
monsoon	884,891	O	B-Material
strengthening	892,905	O	B-Process
from	906,910	O	B-Data
10	911,913	O	I-Data
to	914,916	O	I-Data
8ka	917,920	O	I-Data
,	920,921	O	O
consistent	922,932	O	O
with	933,937	O	O
increased	938,947	O	B-Process
seasonality	948,959	O	I-Process
and/or	960,966	O	O
reworking	967,976	O	B-Process
of	977,979	O	O
sediment	980,988	O	B-Material
deposited	989,998	O	I-Material
prior	999,1004	O	O
to	1005,1007	O	O
or	1008,1010	O	O
during	1011,1017	O	O
the	1018,1021	O	B-Process
glacial	1022,1029	O	I-Process
maximum	1030,1037	O	I-Process
.	1037,1038	O	O

After	1039,1044	O	O
2ka	1045,1048	O	B-Data
terrigenous	1049,1060	O	I-Data
sediment	1061,1069	O	I-Data
accumulation	1070,1082	O	I-Data
rates	1083,1088	O	I-Data
in	1089,1091	O	O
both	1092,1096	O	B-Material
cores	1097,1102	O	I-Material
increased	1103,1112	O	B-Process
together	1113,1121	O	O
with	1122,1126	O	O
redness	1127,1134	O	B-Data
and	1135,1138	O	O
hematite	1139,1147	O	B-Material
/	1147,1148	O	I-Material
goethite	1148,1156	O	I-Material
,	1156,1157	O	O
which	1158,1163	O	O
we	1164,1166	O	O
attribute	1167,1176	O	O
to	1177,1179	O	O
widespread	1180,1190	O	B-Process
cultivation	1191,1202	O	I-Process
of	1203,1205	O	O
the	1206,1209	O	B-Material
floodplain	1210,1220	O	I-Material
triggering	1221,1231	O	B-Process
reworking	1232,1241	O	B-Process
,	1241,1242	O	O
especially	1243,1253	O	O
after	1254,1259	O	O
200years	1260,1268	O	B-Data
ago	1269,1272	O	I-Data
.	1272,1273	O	O

Over	1274,1278	O	O
Holocene	1279,1287	O	B-Material
timescales	1288,1298	O	I-Material
sediment	1299,1307	O	B-Data
composition	1308,1319	O	I-Data
and	1320,1323	O	O
mineralogy	1324,1334	O	B-Process
in	1335,1337	O	O
two	1338,1341	O	B-Material
localities	1342,1352	O	I-Material
on	1353,1355	O	O
the	1356,1359	O	B-Material
high	1360,1364	O	I-Material
-	1364,1365	O	I-Material
energy	1365,1371	O	I-Material
shelf	1372,1377	O	I-Material
were	1378,1382	O	O
controlled	1383,1393	O	O
by	1394,1396	O	O
varying	1397,1404	O	B-Data
degrees	1405,1412	O	I-Data
of	1413,1415	O	O
reworking	1416,1425	O	B-Process
,	1425,1426	O	O
as	1427,1429	O	O
well	1430,1434	O	O
as	1435,1437	O	O
climatically	1438,1450	O	B-Process
modulated	1451,1460	O	I-Process
chemical	1461,1469	O	I-Process
weathering	1470,1480	O	I-Process
.	1480,1481	O	O

Highlights	1482,1492	O	O

►	1493,1494	O	O

We	1495,1497	O	O
examine	1498,1505	O	O
a	1506,1507	O	B-Data
high	1508,1512	O	I-Data
resolution	1513,1523	O	I-Data
multi	1524,1529	O	I-Data
-	1529,1530	O	I-Data
proxy	1530,1535	O	I-Data
physical	1536,1544	O	I-Data
properties	1545,1555	O	I-Data
from	1556,1560	O	O
two	1561,1564	O	B-Material
marine	1565,1571	O	I-Material
cores	1572,1577	O	I-Material
.	1577,1578	O	O

►	1579,1580	O	O

Little	1581,1587	O	B-Data
correlation	1588,1599	O	I-Data
between	1600,1607	O	O
physical	1608,1616	O	B-Material
proxies	1617,1624	O	I-Material
and	1625,1628	O	O
climate	1629,1636	O	B-Material
in	1637,1639	O	O
early	1640,1645	O	B-Data
Holocene	1646,1654	O	I-Data
►	1655,1656	O	O
Reworking	1657,1666	O	B-Process
probable	1667,1675	O	O
cause	1676,1681	O	O
of	1682,1684	O	O
poor	1685,1689	O	B-Data
correlation	1690,1701	O	I-Data
in	1702,1704	O	O
Early	1705,1710	O	B-Data
Holocene	1711,1719	O	I-Data
►	1720,1721	O	O
Possible	1722,1730	O	O
anthropogenic	1731,1744	O	B-Process
influence	1745,1754	O	I-Process
on	1755,1757	O	O
sedimentation	1758,1771	O	B-Process
in	1772,1774	O	O
the	1775,1778	O	B-Data
last	1779,1783	O	I-Data
200	1784,1787	O	I-Data
years	1788,1793	O	I-Data

-DOCSTART- (S092181811300218X)

Shallow	0,7	O	B-Data
-	7,8	O	I-Data
marine	8,14	O	I-Data
sediment	15,23	O	I-Data
records	24,31	O	I-Data
have	32,36	O	O
the	37,40	O	O
strong	41,47	O	O
potential	48,57	O	O
to	58,60	O	O
display	61,68	O	O
sensitive	69,78	O	B-Data
environmental	79,92	O	I-Data
changes	93,100	O	I-Data
in	101,103	O	O
sedimentary	104,115	O	B-Data
geometries	116,126	O	I-Data
and	127,130	O	O
skeletal	131,139	O	B-Data
content	140,147	O	I-Data
.	147,148	O	O

However	149,156	O	O
,	156,157	O	O
the	158,161	O	B-Data
time	162,166	O	I-Data
resolution	167,177	O	I-Data
of	178,180	O	O
most	181,185	O	B-Data
neritic	186,193	O	I-Data
carbonate	194,203	O	I-Data
records	204,211	O	I-Data
is	212,214	O	O
not	215,218	O	O
high	219,223	O	O
enough	224,230	O	O
to	231,233	O	O
be	234,236	O	O
compared	237,245	O	B-Process
with	246,250	O	O
climatic	251,259	O	B-Process
events	260,266	O	I-Process
as	267,269	O	O
recorded	270,278	O	B-Process
in	279,281	O	O
the	282,285	O	B-Material
deep	286,290	O	I-Material
-	290,291	O	I-Material
sea	291,294	O	I-Material
sediment	295,303	O	I-Material
archives	304,312	O	I-Material
.	312,313	O	O

In	314,316	O	O
order	317,322	O	O
to	323,325	O	O
resolve	326,333	O	O
the	334,337	O	B-Data
paleoceanographic	338,355	O	I-Data
and	356,359	O	I-Data
paleoclimatic	360,373	O	I-Data
changes	374,381	O	I-Data
during	382,388	O	O
the	389,392	O	B-Process
Oligocene	393,402	O	I-Process
-	402,403	O	I-Process
Miocene	403,410	O	I-Process
transition	411,421	O	I-Process
in	422,424	O	O
the	425,428	O	B-Material
Mediterranean	429,442	O	I-Material
shallow	443,450	O	I-Material
water	451,456	O	I-Material
carbonate	457,466	O	I-Material
systems	467,474	O	I-Material
with	475,479	O	O
the	480,483	O	B-Data
best	484,488	O	I-Data
possible	489,497	O	I-Data
time	498,502	O	I-Data
resolution	503,513	O	I-Data
,	513,514	O	O
we	515,517	O	O
re	518,520	O	B-Process
-	520,521	O	I-Process
evaluated	521,530	O	I-Process
the	531,534	O	B-Material
Decontra	535,543	O	I-Material
section	544,551	O	I-Material
on	552,554	O	I-Material
the	555,558	O	I-Material
Maiella	559,566	O	I-Material
Platform	567,575	O	I-Material
(	576,577	O	I-Material
central	577,584	O	I-Material
Apennines	585,594	O	I-Material
,	594,595	O	I-Material
Italy	596,601	O	I-Material
)	601,602	O	I-Material
,	602,603	O	O
which	604,609	O	O
acts	610,614	O	O
as	615,617	O	O
a	618,619	O	O
reference	620,629	O	O
for	630,633	O	O
the	634,637	O	B-Process
correlation	638,649	O	I-Process
of	650,652	O	O
Oligocene	653,662	O	B-Material
-	662,663	O	I-Material
Miocene	663,670	O	I-Material
shallow	671,678	O	I-Material
water	679,684	O	I-Material
deposits	685,693	O	I-Material
in	694,696	O	O
the	697,700	O	B-Material
Mediterranean	701,714	O	I-Material
region	715,721	O	I-Material
.	721,722	O	O

The	723,726	O	B-Data
120-m	727,732	O	I-Data
-	732,733	O	I-Data
thick	733,738	O	I-Data
late	739,743	O	B-Process
Oligocene	744,753	O	I-Process
-	753,754	O	I-Process
late	754,758	O	I-Process
Miocene	759,766	O	I-Process
carbonate	767,776	O	I-Process
succession	777,787	O	I-Process
is	788,790	O	O
composed	791,799	O	O
of	800,802	O	O
larger	803,809	O	B-Data
foraminiferal	810,823	O	B-Material
,	823,824	O	I-Material
bryozoan	825,833	O	I-Material
and	834,837	O	I-Material
corallinacean	838,851	O	I-Material
limestones	852,862	O	I-Material
interlayered	863,875	O	B-Process
with	876,880	O	O
distinct	881,889	O	O
planktonic	890,900	O	B-Material
foraminiferal	901,914	O	I-Material
carbonates	915,925	O	I-Material
representing	926,938	O	O
a	939,940	O	B-Material
mostly	941,947	O	I-Material
outer	948,953	O	I-Material
neritic	954,961	O	I-Material
setting	962,969	O	I-Material
.	969,970	O	O

Integrated	971,981	O	B-Process
multi	982,987	O	I-Process
-	987,988	O	I-Process
proxy	988,993	O	I-Process
and	994,997	O	I-Process
facies	998,1004	O	I-Process
analyses	1005,1013	O	I-Process
indicate	1014,1022	O	O
that	1023,1027	O	O
CaCO3	1028,1033	O	B-Material
and	1034,1037	O	O
total	1038,1043	O	B-Material
organic	1044,1051	O	I-Material
carbon	1052,1058	O	I-Material
contents	1059,1067	O	I-Material
as	1068,1070	O	O
well	1071,1075	O	O
as	1076,1078	O	O
gamma	1079,1084	O	B-Material
-	1084,1085	O	I-Material
ray	1085,1088	O	I-Material
display	1089,1096	O	B-Process
only	1097,1101	O	O
local	1102,1107	O	O
to	1108,1110	O	O
regional	1111,1119	O	B-Process
processes	1120,1129	O	I-Process
on	1130,1132	O	O
the	1133,1136	O	B-Material
carbonate	1137,1146	O	I-Material
platform	1147,1155	O	I-Material
and	1156,1159	O	O
are	1160,1163	O	O
not	1164,1167	O	O
suited	1168,1174	O	O
for	1175,1178	O	O
stratigraphic	1179,1192	O	B-Process
correlation	1193,1204	O	I-Process
on	1205,1207	O	O
a	1208,1209	O	B-Data
wider	1210,1215	O	I-Data
scale	1216,1221	O	I-Data
.	1221,1222	O	O

In	1223,1225	O	O
contrast	1226,1234	O	O
,	1234,1235	O	O
new	1236,1239	O	B-Data
biostratigraphic	1240,1256	O	I-Data
data	1257,1261	O	I-Data
correlate	1262,1271	O	B-Process
the	1272,1275	O	B-Data
Decontra	1276,1284	O	I-Data
stable	1285,1291	O	I-Data
carbon	1292,1298	O	I-Data
isotope	1299,1306	O	I-Data
record	1307,1313	O	I-Data
to	1314,1316	O	O
the	1317,1320	O	B-Data
global	1321,1327	O	I-Data
deep	1328,1332	O	I-Data
-	1332,1333	O	I-Data
sea	1333,1336	O	I-Data
carbon	1337,1343	O	I-Data
isotope	1344,1351	O	I-Data
record	1352,1358	O	I-Data
.	1358,1359	O	O

This	1360,1364	O	O
links	1365,1370	O	O
relative	1371,1379	O	O
sea	1380,1383	O	B-Process
level	1384,1389	O	I-Process
fluctuations	1390,1402	O	I-Process
,	1402,1403	O	O
which	1404,1409	O	O
are	1410,1413	O	O
reflected	1414,1423	O	B-Process
by	1424,1426	O	O
facies	1427,1433	O	B-Data
and	1434,1437	O	I-Data
magnetic	1438,1446	O	I-Data
susceptibility	1447,1461	O	I-Data
changes	1462,1469	O	I-Data
,	1469,1470	O	O
to	1471,1473	O	O
third	1474,1479	O	B-Data
-	1479,1480	O	I-Data
order	1480,1485	O	I-Data
eustatic	1486,1494	O	B-Process
cycles	1495,1501	O	I-Process
.	1501,1502	O	O

The	1503,1506	O	B-Material
new	1507,1510	O	I-Material
integrated	1511,1521	O	I-Material
bio-	1522,1526	O	I-Material
,	1526,1527	O	I-Material
chemo-	1528,1534	O	I-Material
,	1534,1535	O	I-Material
and	1536,1539	O	I-Material
sequence	1540,1548	O	I-Material
stratigraphic	1549,1562	O	I-Material
framework	1563,1572	O	I-Material
enables	1573,1580	O	O
a	1581,1582	O	B-Data
more	1583,1587	O	I-Data
precise	1588,1595	O	I-Data
timing	1596,1602	O	I-Data
of	1603,1605	O	O
environmental	1606,1619	O	B-Process
changes	1620,1627	O	I-Process
within	1628,1634	O	O
the	1635,1638	O	B-Data
studied	1639,1646	O	I-Data
time	1647,1651	O	I-Data
interval	1652,1660	O	I-Data
and	1661,1664	O	O
identifies	1665,1675	O	O
Decontra	1676,1684	O	B-Material
as	1685,1687	O	O
an	1688,1690	O	B-Material
important	1691,1700	O	I-Material
locality	1701,1709	O	I-Material
for	1710,1713	O	O
correlating	1714,1725	O	B-Process
not	1726,1729	O	O
only	1730,1734	O	O
shallow	1735,1742	O	B-Material
and	1743,1746	O	I-Material
deep	1747,1751	O	I-Material
water	1752,1757	O	I-Material
sediments	1758,1767	O	I-Material
of	1768,1770	O	O
the	1771,1774	O	B-Material
Mediterranean	1775,1788	O	I-Material
region	1789,1795	O	I-Material
but	1796,1799	O	O
also	1800,1804	O	O
on	1805,1807	O	O
a	1808,1809	O	B-Data
global	1810,1816	O	I-Data
scale	1817,1822	O	I-Data
.	1822,1823	O	O

Highlights	1824,1834	O	O
•	1835,1836	O	O

We	1837,1839	O	O
establish	1840,1849	O	O
a	1850,1851	O	B-Method
new	1852,1855	O	I-Method
age	1856,1859	O	I-Method
model	1860,1865	O	I-Method
for	1866,1869	O	O
the	1870,1873	O	B-Material
Oligo	1874,1879	O	I-Material
-	1879,1880	O	I-Material
Miocene	1880,1887	O	I-Material
Decontra	1888,1896	O	I-Material
section	1897,1904	O	I-Material
.	1904,1905	O	O

•	1906,1907	O	O

The	1908,1911	O	B-Data
local	1912,1917	O	I-Data
carbon	1918,1924	O	I-Data
isotope	1925,1932	O	I-Data
record	1933,1939	O	I-Data
is	1940,1942	O	O
correlated	1943,1953	O	B-Process
with	1954,1958	O	O
the	1959,1962	O	B-Data
global	1963,1969	O	I-Data
δ13C	1970,1974	O	I-Data
curve	1975,1980	O	I-Data
.	1980,1981	O	O

•	1982,1983	O	O

This	1984,1988	O	O
correlates	1989,1999	O	B-Process
Mediterranean	2000,2013	O	B-Data
shallow	2014,2021	O	I-Data
water	2022,2027	O	I-Data
records	2028,2035	O	I-Data
with	2036,2040	O	O
oceanic	2041,2048	O	B-Process
/	2048,2049	O	I-Process
climatic	2049,2057	O	I-Process
events	2058,2064	O	I-Process
.	2064,2065	O	O

-DOCSTART- (S0921818113002245)

We	0,2	O	O
studied	3,10	O	O
the	11,14	O	B-Data
paleomagnetic	15,28	O	I-Data
properties	29,39	O	I-Data
of	40,42	O	O
relatively	43,53	O	B-Material
organic	54,61	O	I-Material
rich	62,66	O	I-Material
,	66,67	O	I-Material
annually	68,76	O	I-Material
laminated	77,86	O	I-Material
(	87,88	O	I-Material
varved	88,94	O	I-Material
)	94,95	O	I-Material
sediments	96,105	O	I-Material
of	106,108	O	O
Holocene	109,117	O	B-Data
age	118,121	O	I-Data
in	122,124	O	O
Gyltigesjön	125,136	O	O
,	136,137	O	O
which	138,143	O	O
is	144,146	O	O
a	147,148	O	O
lake	149,153	O	O
in	154,156	O	O
southern	157,165	O	O
Sweden	166,172	O	O
.	172,173	O	O

An	174,176	O	B-Material
age	177,180	O	I-Material
-	180,181	O	I-Material
depth	181,186	O	I-Material
model	187,192	O	I-Material
was	193,196	O	O
based	197,202	O	O
on	203,205	O	O
a	206,207	O	B-Material
regional	208,216	O	I-Material
lead	217,221	O	I-Material
pollution	222,231	O	I-Material
isochron	232,240	O	I-Material
and	241,244	O	O
Bayesian	245,253	O	B-Method
modelling	254,263	O	I-Method
of	264,266	O	O
radiocarbon	267,278	O	B-Data
ages	279,283	O	I-Data
of	284,286	O	O
bulk	287,291	O	B-Material
sediments	292,301	O	I-Material
and	302,305	O	O
terrestrial	306,317	O	B-Material
macrofossils	318,330	O	I-Material
,	330,331	O	O
which	332,337	O	O
included	338,346	O	O
a	347,348	O	B-Material
radiocarbon	349,360	O	I-Material
wiggle	361,367	O	I-Material
-	367,368	O	I-Material
matched	368,375	O	I-Material
series	376,382	O	I-Material
of	383,385	O	O
873	386,389	O	B-Data
varves	390,396	O	B-Material
that	397,401	O	O
accumulated	402,413	O	O
between	414,421	O	B-Data
3000	422,426	O	I-Data
and	427,430	O	I-Data
2000	431,435	O	I-Data
Cal	436,439	O	I-Data
a	440,441	O	I-Data
BP	442,444	O	I-Data
(	445,446	O	O
Mellström	446,455	O	O
et	456,458	O	O
al	459,461	O	O
.	461,462	O	O
,	462,463	O	O
2013	464,468	O	O
)	468,469	O	O
.	469,470	O	O

Mineral	471,478	O	B-Data
magnetic	479,487	O	I-Data
data	488,492	O	I-Data
and	493,496	O	O
first	497,502	O	B-Data
order	503,508	O	I-Data
reversal	509,517	O	I-Data
curves	518,524	O	I-Data
suggest	525,532	O	O
that	533,537	O	O
the	538,541	O	B-Process
natural	542,549	O	I-Process
remanent	550,558	O	I-Process
magnetization	559,572	O	I-Process
is	573,575	O	O
carried	576,583	O	O
by	584,586	O	O
stable	587,593	O	B-Material
single	594,600	O	I-Material
-	600,601	O	I-Material
domain	601,607	O	I-Material
grains	608,614	O	I-Material
of	615,617	O	I-Material
magnetite	618,627	O	I-Material
,	627,628	O	O
probably	629,637	O	O
of	638,640	O	O
magnetosomal	641,653	O	B-Process
origin	654,660	O	I-Process
.	660,661	O	O

Discrete	662,670	O	B-Material
samples	671,678	O	I-Material
taken	679,684	O	O
from	685,689	O	O
overlapping	690,701	O	B-Material
piston	702,708	O	I-Material
cores	709,714	O	I-Material
were	715,719	O	O
used	720,724	O	O
to	725,727	O	O
produce	728,735	O	O
smoothed	736,744	O	B-Process
paleomagnetic	745,758	O	I-Process
secular	759,766	O	I-Process
variation	767,776	O	I-Process
(	777,778	O	I-Process
inclination	778,789	O	I-Process
and	790,793	O	I-Process
declination	794,805	O	I-Process
)	805,806	O	I-Process
and	807,810	O	O
relative	811,819	O	B-Material
paleointensity	820,834	O	I-Material
data	835,839	O	I-Material
sets	840,844	O	I-Material
.	844,845	O	O

Alternative	846,857	O	O
temporal	858,866	O	B-Process
trends	867,873	O	I-Process
in	874,876	O	O
the	877,880	O	B-Material
paleomagnetic	881,894	O	I-Material
data	895,899	O	I-Material
were	900,904	O	O
obtained	905,913	O	O
by	914,916	O	O
correcting	917,927	O	B-Process
for	928,931	O	O
paleomagnetic	932,945	O	B-Data
lock	946,950	O	I-Data
-	950,951	O	I-Data
in	951,953	O	I-Data
depths	954,960	O	I-Data
between	961,968	O	B-Data
0	969,970	O	I-Data
and	971,974	O	I-Data
70	975,977	O	I-Data
cm	977,979	O	I-Data
and	980,983	O	O
taking	984,990	O	O
into	991,995	O	O
account	996,1003	O	O
changes	1004,1011	O	B-Data
in	1012,1014	O	I-Data
sediment	1015,1023	O	I-Data
accumulation	1024,1036	O	I-Data
rate	1037,1041	O	I-Data
.	1041,1042	O	O

These	1043,1048	O	B-Data
temporal	1049,1057	O	I-Data
trends	1058,1064	O	I-Data
were	1065,1069	O	O
regressed	1070,1079	O	B-Process
against	1080,1087	O	O
reference	1088,1097	O	B-Data
curves	1098,1104	O	I-Data
for	1105,1108	O	O
the	1109,1112	O	B-Material
same	1113,1117	O	I-Material
region	1118,1124	O	I-Material
(	1125,1126	O	I-Material
FENNOSTACK	1126,1136	O	I-Material
and	1137,1140	O	I-Material
FENNORPIS	1141,1150	O	I-Material
;	1150,1151	O	I-Material
Snowball	1152,1160	O	I-Material
et	1161,1163	O	I-Material
al	1164,1166	O	I-Material
.	1166,1167	O	I-Material
,	1167,1168	O	I-Material
2007	1169,1173	O	I-Material
)	1173,1174	O	I-Material
.	1174,1175	O	O

The	1176,1179	O	O
best	1180,1184	O	O
statistical	1185,1196	O	O
matches	1197,1204	O	O
to	1205,1207	O	O
the	1208,1211	O	B-Data
reference	1212,1221	O	I-Data
curves	1222,1228	O	I-Data
are	1229,1232	O	O
obtained	1233,1241	O	O
when	1242,1246	O	O
we	1247,1249	O	O
apply	1250,1255	O	O
lock	1256,1260	O	B-Data
-	1260,1261	O	I-Data
in	1261,1263	O	I-Data
depths	1264,1270	O	I-Data
of	1271,1273	O	I-Data
21	1274,1276	O	I-Data
-	1276,1277	O	I-Data
34	1277,1279	O	I-Data
cm	1279,1281	O	I-Data
to	1282,1284	O	O
the	1285,1288	O	B-Material
Gyltigesjön	1289,1300	O	I-Material
paleomagnetic	1301,1314	O	I-Material
data	1315,1319	O	I-Material
,	1319,1320	O	O
although	1321,1329	O	O
these	1330,1335	O	O
are	1336,1339	O	O
most	1340,1344	O	O
likely	1345,1351	O	O
minimum	1352,1359	O	B-Data
estimates	1360,1369	O	I-Data
.	1369,1370	O	O

Our	1371,1374	O	O
study	1375,1380	O	O
suggests	1381,1389	O	O
that	1390,1394	O	O
a	1395,1396	O	B-Data
significant	1397,1408	O	I-Data
paleomagnetic	1409,1422	O	I-Data
lock	1423,1427	O	I-Data
-	1427,1428	O	I-Data
in	1428,1430	O	I-Data
depth	1431,1436	O	I-Data
can	1437,1440	O	O
affect	1441,1447	O	O
the	1448,1451	O	O
acquisition	1452,1463	O	O
of	1464,1466	O	O
post	1467,1471	O	B-Process
-	1471,1472	O	I-Process
depositional	1472,1484	O	I-Process
remanent	1485,1493	O	I-Process
magnetization	1494,1507	O	I-Process
even	1508,1512	O	O
where	1513,1518	O	O
bioturbation	1519,1531	O	B-Material
is	1532,1534	O	O
absent	1535,1541	O	O
and	1542,1545	O	O
no	1546,1548	O	O
mixed	1549,1554	O	B-Material
sediment	1555,1563	O	I-Material
surface	1564,1571	O	I-Material
layer	1572,1577	O	I-Material
exists	1578,1584	O	O
.	1584,1585	O	O

Highlights	1586,1596	O	O
•	1597,1598	O	O

Paleomagnetic	1599,1612	O	B-Material
data	1613,1617	O	I-Material
obtained	1618,1626	O	O
from	1627,1631	O	O
organic	1632,1639	O	B-Material
rich	1640,1644	O	I-Material
varved	1645,1651	O	I-Material
lake	1652,1656	O	I-Material
sediments	1657,1666	O	I-Material
.	1666,1667	O	O

•	1668,1669	O	O

Chronology	1670,1680	O	B-Process
based	1681,1686	O	O
on	1687,1689	O	O
14C	1690,1693	O	B-Data
wiggle	1694,1700	O	I-Data
-	1700,1701	O	I-Data
matching	1701,1709	O	I-Data
and	1710,1713	O	O
14C	1714,1717	O	B-Data
ages	1718,1722	O	I-Data
of	1723,1725	O	O
terrestrial	1726,1737	O	B-Material
macrofossils	1738,1750	O	I-Material
.	1750,1751	O	O

•	1752,1753	O	O

Paleomagnetic	1754,1767	O	B-Data
lock	1768,1772	O	I-Data
-	1772,1773	O	I-Data
in	1773,1775	O	I-Data
delay	1776,1781	O	I-Data
quantified	1782,1792	O	B-Process
to	1793,1795	O	O
at	1796,1798	O	B-Data
least	1799,1804	O	I-Data
21	1805,1807	O	I-Data
cm	1807,1809	O	I-Data
.	1809,1810	O	O

-DOCSTART- (S1367912013002277)

Ti	0,2	O	B-Data
/	2,3	O	I-Data
Al	3,5	O	I-Data
molar	6,11	O	I-Data
ratios	12,18	O	I-Data
of	19,21	O	O
sediments	22,31	O	B-Material
in	32,34	O	O
various	35,42	O	B-Material
sedimentary	43,54	O	I-Material
environments	55,67	O	I-Material
are	68,71	O	O
used	72,76	O	O
to	77,79	O	O
explain	80,87	O	O
sediment	88,96	O	B-Process
transportation	97,111	O	I-Process
from	112,116	O	O
source	117,123	O	B-Material
regions	124,131	O	I-Material
to	132,134	O	O
sink	135,139	O	B-Material
areas	140,145	O	I-Material
.	145,146	O	O

Samples	147,154	O	B-Material
were	155,159	O	O
collected	160,169	O	B-Process
from	170,174	O	O
outcrops	175,183	O	B-Material
,	183,184	O	I-Material
soils	185,190	O	I-Material
,	190,191	O	I-Material
fluvial	192,199	O	I-Material
,	199,200	O	I-Material
lake	201,205	O	I-Material
,	205,206	O	I-Material
and	207,210	O	I-Material
marine	211,217	O	I-Material
sediment	218,226	O	I-Material
environments	227,239	O	I-Material
.	239,240	O	O

Initial	241,248	O	B-Data
Ti	249,251	O	I-Data
/	251,252	O	I-Data
Al	252,254	O	I-Data
molar	255,260	O	I-Data
ratios	261,267	O	I-Data
of	268,270	O	O
sediments	271,280	O	B-Material
are	281,284	O	O
controlled	285,295	O	O
by	296,298	O	O
those	299,304	O	O
of	305,307	O	O
parent	308,314	O	B-Material
soils	315,320	O	I-Material
or	321,323	O	I-Material
rocks	324,329	O	I-Material
.	329,330	O	O

These	331,336	O	B-Data
ratios	337,343	O	I-Data
tend	344,348	O	O
to	349,351	O	O
decline	352,359	O	B-Process
gradually	360,369	O	I-Process
as	370,372	O	O
a	373,374	O	O
result	375,381	O	O
of	382,384	O	O
heavy	385,390	O	B-Process
-	390,391	O	I-Process
mineral	391,398	O	I-Process
gravity	399,406	O	I-Process
fractionation	407,420	O	I-Process
during	421,427	O	O
transportation	428,442	O	B-Process
.	442,443	O	O

Sedimentary	444,455	O	B-Data
Ti	456,458	O	I-Data
/	458,459	O	I-Data
Al	459,461	O	I-Data
molar	462,467	O	I-Data
ratios	468,474	O	I-Data
in	475,477	O	O
sink	478,482	O	B-Material
areas	483,488	O	I-Material
such	489,493	O	O
as	494,496	O	O
lakes	497,502	O	B-Material
and	503,506	O	I-Material
pelagic	507,514	O	I-Material
environments	515,527	O	I-Material
are	528,531	O	O
lower	532,537	O	O
than	538,542	O	O
those	543,548	O	O
in	549,551	O	O
source	552,558	O	B-Material
regions	559,566	O	I-Material
.	566,567	O	O

In	568,570	O	O
this	571,575	O	O
study	576,581	O	O
,	581,582	O	O
for	583,586	O	O
the	587,590	O	B-Material
Changjiang	591,601	O	I-Material
River	602,607	O	I-Material
,	607,608	O	O
Huanghe	609,616	O	B-Material
River	617,622	O	I-Material
,	622,623	O	O
and	624,627	O	O
Kaoping	628,635	O	B-Material
River	636,641	O	I-Material
,	641,642	O	O
Ti	643,645	O	B-Data
/	645,646	O	I-Data
Al	646,648	O	I-Data
molar	649,654	O	I-Data
ratios	655,661	O	I-Data
decline	662,669	O	B-Process
considerably	670,682	O	I-Process
from	683,687	O	O
downstream	688,698	O	B-Material
to	699,701	O	O
estuary	702,709	O	B-Material
environments	710,722	O	I-Material
.	722,723	O	O

Additionally	724,736	O	O
,	736,737	O	O
well	738,742	O	B-Material
sorted	743,749	O	I-Material
aeolian	750,757	O	I-Material
sands	758,763	O	I-Material
have	764,768	O	O
extremely	769,778	O	O
low	779,782	O	B-Data
Ti	783,785	O	B-Data
/	785,786	O	I-Data
Al	786,788	O	I-Data
molar	789,794	O	I-Data
ratios	795,801	O	I-Data
in	802,804	O	O
northern	805,813	O	O
China	814,819	O	O
.	819,820	O	O

The	821,824	O	B-Data
Ti	825,827	O	I-Data
/	827,828	O	I-Data
Al	828,830	O	I-Data
molar	831,836	O	I-Data
ratios	837,843	O	I-Data
of	844,846	O	O
aerosol	847,854	O	B-Material
particles	855,864	O	I-Material
found	865,870	O	O
in	871,873	O	O
Taiwan	874,880	O	O
and	881,884	O	O
the	885,888	O	O
East	889,893	O	O
China	894,899	O	O
Sea	900,903	O	O
show	904,908	O	O
reduced	909,916	O	B-Data
ratios	917,923	O	I-Data
as	924,926	O	O
a	927,928	O	O
result	929,935	O	O
of	936,938	O	O
Asia	939,943	O	B-Process
Dust	944,948	O	I-Process
Storm	949,954	O	I-Process
episodes	955,963	O	I-Process
.	963,964	O	O

Furthermore	965,976	O	O
,	976,977	O	O
lower	978,983	O	B-Data
Ti	984,986	O	B-Data
/	986,987	O	I-Data
Al	987,989	O	I-Data
molar	990,995	O	I-Data
ratios	996,1002	O	I-Data
in	1003,1005	O	O
deep	1006,1010	O	B-Material
ocean	1011,1016	O	I-Material
sediments	1017,1026	O	I-Material
were	1027,1031	O	O
discovered	1032,1042	O	O
by	1043,1045	O	O
tracing	1046,1053	O	B-Process
the	1054,1057	O	B-Data
distribution	1058,1070	O	I-Data
of	1071,1073	O	I-Data
sedimentary	1074,1085	O	I-Data
Ti	1086,1088	O	I-Data
/	1088,1089	O	I-Data
Al	1089,1091	O	I-Data
molar	1092,1097	O	I-Data
ratios	1098,1104	O	I-Data
in	1105,1107	O	O
the	1108,1111	O	O
South	1112,1117	O	O
China	1118,1123	O	O
Sea	1124,1127	O	O
.	1127,1128	O	O

When	1129,1133	O	O
sea	1134,1137	O	B-Data
levels	1138,1144	O	I-Data
dropped	1145,1152	O	B-Process
during	1153,1159	O	O
glacial	1160,1167	O	B-Process
periods	1168,1175	O	I-Process
,	1175,1176	O	O
the	1177,1180	O	B-Material
river	1181,1186	O	I-Material
estuary	1187,1194	O	I-Material
was	1195,1198	O	O
closer	1199,1205	O	O
to	1206,1208	O	O
deep	1209,1213	O	B-Material
marine	1214,1220	O	I-Material
areas	1221,1226	O	I-Material
and	1227,1230	O	O
carried	1231,1238	O	O
more	1239,1243	O	B-Material
terrestrial	1244,1255	O	I-Material
sediments	1256,1265	O	I-Material
into	1266,1270	O	O
deep	1271,1275	O	B-Material
marine	1276,1282	O	I-Material
environments	1283,1295	O	I-Material
.	1295,1296	O	O

The	1297,1300	O	B-Material
closer	1301,1307	O	I-Material
estuary	1308,1315	O	I-Material
with	1316,1320	O	O
relatively	1321,1331	O	O
higher	1332,1338	O	B-Data
Ti	1339,1341	O	B-Data
/	1341,1342	O	I-Data
Al	1342,1344	O	I-Data
ratio	1345,1350	O	I-Data
would	1351,1356	O	O
lead	1357,1361	O	O
increase	1362,1370	O	O
of	1371,1373	O	O
Ti	1374,1376	O	B-Data
/	1376,1377	O	I-Data
Al	1377,1379	O	I-Data
molar	1380,1385	O	I-Data
ratios	1386,1392	O	I-Data
in	1393,1395	O	O
deep	1396,1400	O	B-Material
sea	1401,1404	O	I-Material
sediments	1405,1414	O	I-Material
.	1414,1415	O	O

In	1416,1418	O	O
this	1419,1423	O	O
study	1424,1429	O	O
,	1429,1430	O	O
Ti	1431,1433	O	B-Data
/	1433,1434	O	I-Data
Al	1434,1436	O	I-Data
molar	1437,1442	O	I-Data
ratio	1443,1448	O	I-Data
is	1449,1451	O	O
promoted	1452,1460	O	O
as	1461,1463	O	O
a	1464,1465	O	B-Material
new	1466,1469	O	I-Material
proxy	1470,1475	O	I-Material
to	1476,1478	O	O
help	1479,1483	O	O
with	1484,1488	O	O
understanding	1489,1502	O	O
changes	1503,1510	O	B-Process
in	1511,1513	O	I-Process
sedimentary	1514,1525	O	I-Process
environments	1526,1538	O	I-Process
.	1538,1539	O	O

-DOCSTART- (S175058361300203X)

Temperature	0,11	O	B-Data
is	12,14	O	O
one	15,18	O	O
of	19,21	O	O
the	22,25	O	O
main	26,30	O	O
parameters	31,41	O	O
influencing	42,53	O	O
the	54,57	O	B-Data
properties	58,68	O	I-Data
of	69,71	O	O
CO2	72,75	O	B-Material
during	76,82	O	O
storage	83,90	O	B-Process
in	91,93	O	O
saline	94,100	O	B-Material
aquifers	101,109	O	I-Material
since	110,115	O	O
it	116,118	O	O
along	119,124	O	O
with	125,129	O	O
pressure	130,138	O	B-Process
and	139,142	O	O
co	143,145	O	B-Material
-	145,146	O	I-Material
constituents	146,158	O	I-Material
controls	159,167	O	O
the	168,171	O	B-Process
phase	172,177	O	I-Process
behavior	178,186	O	I-Process
of	187,189	O	O
the	190,193	O	B-Material
CO2/brine	194,203	O	I-Material
mixture	204,211	O	I-Material
.	211,212	O	O

When	213,217	O	O
the	218,221	O	B-Material
CO2	222,225	O	I-Material
replaces	226,234	O	O
brine	235,240	O	B-Material
as	241,243	O	O
a	244,245	O	B-Material
free	246,250	O	I-Material
gas	251,254	O	I-Material
it	255,257	O	O
is	258,260	O	O
well	261,265	O	O
known	266,271	O	O
to	272,274	O	O
affect	275,281	O	O
the	282,285	O	B-Data
elastic	286,293	O	I-Data
properties	294,304	O	I-Data
of	305,307	O	O
porous	308,314	O	B-Material
media	315,320	O	I-Material
considerably	321,333	O	O
.	333,334	O	O

In	335,337	O	O
order	338,343	O	O
to	344,346	O	O
track	347,352	O	O
the	353,356	O	B-Process
migration	357,366	O	I-Process
of	367,369	O	O
geologically	370,382	O	B-Material
stored	383,389	O	I-Material
CO2	390,393	O	I-Material
at	394,396	O	I-Material
the	397,400	O	I-Material
Ketzin	401,407	O	I-Material
site	408,412	O	I-Material
,	412,413	O	O
3D	414,416	O	B-Data
time	417,421	O	I-Data
-	421,422	O	I-Data
lapse	422,427	O	I-Data
seismic	428,435	O	I-Data
data	436,440	O	I-Data
were	441,445	O	O
acquired	446,454	O	O
by	455,457	O	O
means	458,463	O	O
of	464,466	O	O
a	467,468	O	B-Method
baseline	469,477	O	I-Method
(	478,479	O	I-Method
pre	479,482	O	I-Method
-	482,483	O	I-Method
injection	483,492	O	I-Method
)	492,493	O	I-Method
survey	494,500	O	I-Method
in	501,503	O	O
autumn	504,510	O	O
2005	511,515	O	O
and	516,519	O	O
a	520,521	O	B-Method
first	522,527	O	I-Method
monitor	528,535	O	I-Method
survey	536,542	O	I-Method
in	543,545	O	O
autumn	546,552	O	O
2009	553,557	O	O
.	557,558	O	O

During	559,565	O	O
this	566,570	O	O
period	571,577	O	O
the	578,581	O	B-Data
temperature	582,593	O	I-Data
in	594,596	O	O
the	597,600	O	B-Material
storage	601,608	O	I-Material
reservoir	609,618	O	I-Material
near	619,623	O	I-Material
the	624,627	O	I-Material
injection	628,637	O	I-Material
well	638,642	O	I-Material
was	643,646	O	O
observed	647,655	O	O
to	656,658	O	O
have	659,663	O	O
increased	664,673	O	B-Process
from	674,678	O	B-Data
34	679,681	O	I-Data
°	681,682	O	I-Data
C	682,683	O	I-Data
to	684,686	O	I-Data
38	687,689	O	I-Data
°	689,690	O	I-Data
C	690,691	O	I-Data
.	691,692	O	O

This	693,697	O	B-Data
temperature	698,709	O	I-Data
increase	710,718	O	B-Process
led	719,722	O	O
us	723,725	O	O
to	726,728	O	O
investigate	729,740	O	O
the	741,744	O	O
potential	745,754	O	O
impact	755,761	O	O
of	762,764	O	O
temperature	765,776	O	B-Data
on	777,779	O	O
the	780,783	O	B-Process
seismic	784,791	O	I-Process
response	792,800	O	I-Process
to	801,803	O	O
the	804,807	O	B-Process
CO2	808,811	O	I-Process
injection	812,821	O	I-Process
and	822,825	O	O
on	826,828	O	O
the	829,832	O	B-Data
CO2	833,836	O	I-Data
mass	837,841	O	I-Data
estimations	842,853	O	I-Data
based	854,859	O	O
on	860,862	O	O
the	863,866	O	B-Data
Ketzin	867,873	O	I-Data
4D	874,876	O	I-Data
seismic	877,884	O	I-Data
data	885,889	O	I-Data
.	889,890	O	O

Two	891,894	O	B-Data
temperature	895,906	O	B-Data
scenarios	907,916	O	O
in	917,919	O	O
the	920,923	O	B-Material
reservoir	924,933	O	I-Material
(	934,935	O	O
34	935,937	O	B-Data
°	937,938	O	I-Data
C	938,939	O	I-Data
and	940,943	O	I-Data
38	944,946	O	I-Data
°	946,947	O	I-Data
C	947,948	O	I-Data
)	948,949	O	O
were	950,954	O	O
studied	955,962	O	O
using	963,968	O	O
multiphase	969,979	O	B-Material
fluid	980,985	O	I-Material
flow	986,990	O	I-Material
modeling	991,999	O	I-Material
.	999,1000	O	O

The	1001,1004	O	O
simulations	1005,1016	O	O
show	1017,1021	O	O
that	1022,1026	O	O
the	1027,1030	O	O
impact	1031,1037	O	O
of	1038,1040	O	O
temperature	1041,1052	O	B-Data
on	1053,1055	O	O
the	1056,1059	O	B-Process
seismic	1060,1067	O	I-Process
response	1068,1076	O	I-Process
is	1077,1079	O	O
minor	1080,1085	O	B-Data
,	1085,1086	O	O
but	1087,1090	O	O
that	1091,1095	O	O
the	1096,1099	O	O
impact	1100,1106	O	O
of	1107,1109	O	O
the	1110,1113	O	B-Data
temperature	1114,1125	O	I-Data
on	1126,1128	O	O
the	1129,1132	O	B-Data
CO2	1133,1136	O	I-Data
mass	1137,1141	O	I-Data
estimations	1142,1153	O	I-Data
is	1154,1156	O	O
significant	1157,1168	O	O
and	1169,1172	O	O
can	1173,1176	O	O
,	1176,1177	O	O
with	1178,1182	O	O
the	1183,1186	O	O
help	1187,1191	O	O
of	1192,1194	O	O
the	1195,1198	O	B-Material
multiphase	1199,1209	O	I-Material
fluid	1210,1215	O	I-Material
flow	1216,1220	O	I-Material
simulations	1221,1232	O	I-Material
,	1232,1233	O	O
be	1234,1236	O	O
explained	1237,1246	O	O
mostly	1247,1253	O	O
by	1254,1256	O	O
the	1257,1260	O	O
impact	1261,1267	O	O
on	1268,1270	O	O
the	1271,1274	O	B-Data
density	1275,1282	O	I-Data
of	1283,1285	O	O
the	1286,1289	O	B-Material
CO2	1290,1293	O	I-Material
.	1293,1294	O	O

-DOCSTART- (S1750583613004192)

To	0,2	O	O
prevent	3,10	O	B-Process
ocean	11,16	O	B-Process
acidification	17,30	O	I-Process
and	31,34	O	O
mitigate	35,43	O	B-Process
greenhouse	44,54	O	B-Process
gas	55,58	O	I-Process
emissions	59,68	O	I-Process
,	68,69	O	O
it	70,72	O	O
is	73,75	O	O
necessary	76,85	O	O
to	86,88	O	O
capture	89,96	O	B-Process
and	97,100	O	O
store	101,106	O	B-Process
carbon	107,113	O	B-Material
dioxide	114,121	O	I-Material
.	121,122	O	O

The	123,126	O	B-Material
Sleipner	127,135	O	I-Material
storage	136,143	O	I-Material
site	144,148	O	I-Material
,	148,149	O	O
offshore	150,158	O	O
Norway	159,165	O	O
,	165,166	O	O
is	167,169	O	O
the	170,173	O	O
world	174,179	O	O
's	179,181	O	O
first	182,187	O	O
and	188,191	O	O
largest	192,199	O	O
engineered	200,210	O	O
waste	211,216	O	B-Material
repository	217,227	O	I-Material
for	228,231	O	O
a	232,233	O	B-Material
greenhouse	234,244	O	I-Material
gas	245,248	O	I-Material
.	248,249	O	O

CO2	250,253	O	B-Material
is	254,256	O	O
separated	257,266	O	B-Process
from	267,271	O	O
the	272,275	O	B-Material
Sleipner	276,284	O	I-Material
gas	285,288	O	I-Material
condensate	289,299	O	I-Material
field	300,305	O	I-Material
and	306,309	O	O
stored	310,316	O	B-Process
in	317,319	O	O
the	320,323	O	B-Material
pore	324,328	O	I-Material
space	329,334	O	I-Material
of	335,337	O	O
the	338,341	O	B-Material
Utsira	342,348	O	I-Material
Formation	349,358	O	I-Material
,	358,359	O	O
a	360,361	O	B-Material
saline	362,368	O	I-Material
aquifer	369,376	O	I-Material
approximately	377,390	O	O
1	391,392	O	B-Data
km	392,394	O	I-Data
below	395,400	O	O
the	401,404	O	B-Material
surface	405,412	O	I-Material
and	413,416	O	O
200	417,420	O	B-Data
km	420,422	O	I-Data
from	423,427	O	O
the	428,431	O	B-Material
coast	432,437	O	I-Material
.	437,438	O	O

Statoil	439,446	O	B-Material
,	446,447	O	O
the	448,451	O	O
field	452,457	O	O
operator	458,466	O	O
,	466,467	O	O
has	468,471	O	O
injected	472,480	O	B-Process
almost	481,487	O	O
1Mt	488,491	O	B-Data
/	491,492	O	I-Data
yr	492,494	O	I-Data
of	495,497	O	O
captured	498,506	O	B-Material
CO2	507,510	O	I-Material
into	511,515	O	O
the	516,519	O	B-Material
storage	520,527	O	I-Material
site	528,532	O	I-Material
since	533,538	O	O
1996	539,543	O	O
.	543,544	O	O

The	545,548	O	B-Material
buoyant	549,556	O	I-Material
CO2	557,560	O	I-Material
plume	561,566	O	I-Material
ascended	567,575	O	B-Process
rapidly	576,583	O	I-Process
through	584,591	O	O
eight	592,597	O	B-Data
thin	598,602	O	B-Material
shale	603,608	O	I-Material
barriers	609,617	O	I-Material
within	618,624	O	O
the	625,628	O	B-Material
aquifer	629,636	O	I-Material
to	637,639	O	O
reach	640,645	O	O
the	646,649	O	B-Material
top	650,653	O	I-Material
seal	654,658	O	I-Material
in	659,661	O	O
less	662,666	O	O
than	667,671	O	O
three	672,677	O	O
years	678,683	O	O
.	683,684	O	O

The	685,688	O	B-Process
plume	689,694	O	I-Process
's	694,696	O	I-Process
progress	697,705	O	I-Process
has	706,709	O	O
been	710,714	O	O
monitored	715,724	O	B-Process
by	725,727	O	O
eight	728,733	O	B-Data
seismic	734,741	O	B-Method
surveys	742,749	O	I-Method
,	749,750	O	O
as	751,753	O	O
well	754,758	O	O
as	759,761	O	O
gravimetric	762,773	O	B-Process
and	774,777	O	I-Process
electromagnetic	778,793	O	I-Process
monitoring	794,804	O	I-Process
,	804,805	O	O
which	806,811	O	O
record	812,818	O	O
the	819,822	O	B-Process
spreading	823,832	O	I-Process
of	833,835	O	O
nine	836,840	O	B-Data
thin	841,845	O	B-Material
CO2	846,849	O	I-Material
layers	850,856	O	I-Material
.	856,857	O	O

This	858,862	O	O
paper	863,868	O	O
presents	869,877	O	O
a	878,879	O	B-Material
capillary	880,889	O	I-Material
flow	890,894	O	I-Material
model	895,900	O	I-Material
using	901,906	O	O
invasion	907,915	O	B-Process
percolation	916,927	O	I-Process
physics	928,935	O	I-Process
that	936,940	O	O
accurately	941,951	O	O
matches	952,959	O	O
the	960,963	O	B-Material
plume	964,969	O	I-Material
's	969,971	O	I-Material
geometry	972,980	O	B-Data
.	980,981	O	O

The	982,985	O	O
approach	986,994	O	O
differs	995,1002	O	O
from	1003,1007	O	O
standard	1008,1016	O	B-Material
Darcy	1017,1022	O	I-Material
flow	1023,1027	O	I-Material
simulations	1028,1039	O	I-Material
,	1039,1040	O	O
which	1041,1046	O	O
fail	1047,1051	O	O
to	1052,1054	O	O
match	1055,1060	O	O
the	1061,1064	O	B-Data
plume	1065,1070	O	I-Data
geometry	1071,1079	O	I-Data
.	1079,1080	O	O

The	1081,1084	O	B-Material
calibrated	1085,1095	O	I-Material
capillary	1096,1105	O	I-Material
flow	1106,1110	O	I-Material
simulation	1111,1121	O	I-Material
indicates	1122,1131	O	O
that	1132,1136	O	O
a	1137,1138	O	B-Data
mass	1139,1143	O	I-Data
balance	1144,1151	O	O
for	1152,1155	O	O
the	1156,1159	O	B-Material
plume	1160,1165	O	I-Material
is	1166,1168	O	O
likely	1169,1175	O	O
,	1175,1176	O	O
but	1177,1180	O	O
can	1181,1184	O	O
only	1185,1189	O	O
replicate	1190,1199	O	B-Process
the	1200,1203	O	B-Data
plume	1204,1209	O	I-Data
geometry	1210,1218	O	I-Data
if	1219,1221	O	O
the	1222,1225	O	B-Material
thin	1226,1230	O	I-Material
intra	1231,1236	O	I-Material
-	1236,1237	O	I-Material
formational	1237,1248	O	I-Material
shale	1249,1254	O	I-Material
barriers	1255,1263	O	I-Material
are	1264,1267	O	O
fractured	1268,1277	O	B-Process
.	1277,1278	O	O

The	1279,1282	O	B-Material
model	1283,1288	O	I-Material
enables	1289,1296	O	O
an	1297,1299	O	B-Data
estimate	1300,1308	O	I-Data
of	1309,1311	O	O
the	1312,1315	O	B-Material
shale	1316,1321	O	I-Material
barrier	1322,1329	O	I-Material
behavior	1330,1338	O	O
and	1339,1342	O	O
caprock	1343,1350	O	B-Data
performance	1351,1362	O	I-Data
.	1362,1363	O	O

The	1364,1367	O	B-Material
fractures	1368,1377	O	I-Material
are	1378,1381	O	O
very	1382,1386	O	O
unlikely	1387,1395	O	O
to	1396,1398	O	O
have	1399,1403	O	O
been	1404,1408	O	O
caused	1409,1415	O	O
by	1416,1418	O	O
CO2	1419,1422	O	B-Process
injection	1423,1432	O	I-Process
given	1433,1438	O	O
the	1439,1442	O	B-Process
confining	1443,1452	O	I-Process
stress	1453,1459	O	I-Process
of	1460,1462	O	O
the	1463,1466	O	B-Material
rock	1467,1471	O	I-Material
and	1472,1475	O	O
weak	1476,1480	O	B-Process
overpressure	1481,1493	O	I-Process
of	1494,1496	O	O
the	1497,1500	O	B-Material
plume	1501,1506	O	I-Material
,	1506,1507	O	O
and	1508,1511	O	O
so	1512,1514	O	O
fracturing	1515,1525	O	B-Process
must	1526,1530	O	O
pre	1531,1534	O	O
-	1534,1535	O	O
date	1535,1539	O	O
injection	1540,1549	O	B-Process
.	1549,1550	O	O

A	1551,1552	O	O
novel	1553,1558	O	O
mechanism	1559,1568	O	O
is	1569,1571	O	O
suggested	1572,1581	O	O
:	1581,1582	O	O
the	1583,1586	O	B-Process
deglaciation	1587,1599	O	I-Process
of	1600,1602	O	O
regional	1603,1611	O	B-Material
ice	1612,1615	O	I-Material
sheets	1616,1622	O	I-Material
that	1623,1627	O	O
have	1628,1632	O	O
rapidly	1633,1640	O	O
and	1641,1644	O	O
repeatedly	1645,1655	O	O
unloaded	1656,1664	O	B-Process
approximately	1665,1678	O	B-Material
1	1679,1680	O	I-Material
km	1680,1682	O	I-Material
of	1683,1685	O	O
ice	1686,1689	O	B-Material
.	1689,1690	O	O

The	1691,1694	O	B-Process
induced	1695,1702	O	I-Process
transient	1703,1712	O	I-Process
pore	1713,1717	O	I-Process
pressures	1718,1727	O	I-Process
are	1728,1731	O	O
sufficient	1732,1742	O	O
to	1743,1745	O	O
hydro	1746,1751	O	B-Process
-	1751,1752	O	I-Process
fracture	1752,1760	O	I-Process
thin	1761,1765	O	B-Material
shales	1766,1772	O	I-Material
.	1772,1773	O	O

The	1774,1777	O	B-Material
fractures	1778,1787	O	I-Material
enable	1788,1794	O	O
fast	1795,1799	O	B-Process
CO2	1800,1803	O	I-Process
ascent	1804,1810	O	I-Process
,	1810,1811	O	O
resulting	1812,1821	O	O
in	1822,1824	O	O
a	1825,1826	O	B-Material
multi	1827,1832	O	I-Material
-	1832,1833	O	I-Material
layered	1833,1840	O	I-Material
plume	1841,1846	O	I-Material
.	1846,1847	O	O

Shallow	1848,1855	O	B-Material
CO2	1856,1859	O	I-Material
storage	1860,1867	O	I-Material
sites	1868,1873	O	I-Material
in	1874,1876	O	O
the	1877,1880	O	O
Northern	1881,1889	O	O
North	1890,1895	O	O
Sea	1896,1899	O	O
and	1900,1903	O	O
other	1904,1909	O	O
regions	1910,1917	O	O
that	1918,1922	O	O
have	1923,1927	O	O
been	1928,1932	O	O
loaded	1933,1939	O	O
by	1940,1942	O	O
Quaternary	1943,1953	O	B-Material
ice	1954,1957	O	I-Material
sheets	1958,1964	O	I-Material
are	1965,1968	O	O
likely	1969,1975	O	O
to	1976,1978	O	O
behave	1979,1985	O	O
in	1986,1988	O	O
a	1989,1990	O	O
similar	1991,1998	O	O
manner	1999,2005	O	O
.	2005,2006	O	O

