{
  "$id": "coursePrerequisites.json",
  "$schema": "http://json-schema.org/draft-07/schema#",
  "title": "Course Prerequisites",
  "description": "Requirements for taking the Course.",
  "type": "array",
  "items": {
    "type": "string"
  }
}
