{
  "$id": "multilingualString.json",
  "$schema": "http://json-schema.org/draft-07/schema#",
  "title": "multilingual string",
  "description": "a string for multiple languages",
  "type": "array",
  "minItems" : 1,
  "items" : {
    "type": "object",
    "properties": {
      "@language" : {
        "description" : "The language used in the described entity. A string formatted according to iso 639-1 language code.",
        "pattern" : "^[a-z]{2}$",
        "type" : "string"
      },
      "@value" : {
        "description" : "String to describe the entity.",
        "type" : "string"
      }
    },
    "required": ["@value"]
  }
}
