{
  "$id": "about.json",
  "$schema": "http://json-schema.org/draft-07/schema#",
  "title": "Subject",
  "description": "The subject of the resource, taken from Destatis classification or OpenEduHub-Fächersystematik",
  "type": "array",
  "items": {
    "type": "object",
    "properties": {
      "type": {
        "type": "string",
        "enum": ["Concept"]
      },
      "id": {
        "type": "string",
        "format": "uri"
      },
      "prefLabel": {
        "title": "The preferred label of the concept",
        "description": "A localized string for prefLabel of a SKOS concept",
        "$ref": "localizedString.json"
      }
    },
    "required": ["id"]
  },
  "contains": {
    "type": "object",
    "properties": {
      "id": {
        "type": "string",
        "format": "uri",
        "pattern": "(^https://w3id.org/kim/hochschulfaechersystematik/.*|http://w3id.org/kim/schulfaecher/.*)"
      }
    },
    "required": ["id"]
  }
}
