{
  "$id": "dateModified.json",
  "$schema": "http://json-schema.org/draft-07/schema#",
  "title": "Modification Date",
  "description": "The modification date in ISO 8601 format: YYYY-MM-DD or CCYY-MM-DDThh:mm:ss[Z|(+|-)hh:mm]",
  "$ref": "iso8601date.json"
}
