{
  "$id": "localizedString.json",
  "$schema": "http://json-schema.org/draft-07/schema#",
  "title": "Localized String",
  "description": "A language-tagged string using JSON-LD \"language maps\", see https://www.w3.org/TR/json-ld/#language-maps",
  "type": "object",
  "properties": {
    "aa": {
      "type": "string"
    },
    "ab": {
      "type": "string"
    },
    "ae": {
      "type": "string"
    },
    "af": {
      "type": "string"
    },
    "ak": {
      "type": "string"
    },
    "am": {
      "type": "string"
    },
    "an": {
      "type": "string"
    },
    "ar": {
      "type": "string"
    },
    "as": {
      "type": "string"
    },
    "av": {
      "type": "string"
    },
    "ay": {
      "type": "string"
    },
    "az": {
      "type": "string"
    },
    "ba": {
      "type": "string"
    },
    "be": {
      "type": "string"
    },
    "bg": {
      "type": "string"
    },
    "bi": {
      "type": "string"
    },
    "bm": {
      "type": "string"
    },
    "bn": {
      "type": "string"
    },
    "bo": {
      "type": "string"
    },
    "br": {
      "type": "string"
    },
    "bs": {
      "type": "string"
    },
    "ca": {
      "type": "string"
    },
    "ce": {
      "type": "string"
    },
    "ch": {
      "type": "string"
    },
    "co": {
      "type": "string"
    },
    "cr": {
      "type": "string"
    },
    "cs": {
      "type": "string"
    },
    "cu": {
      "type": "string"
    },
    "cv": {
      "type": "string"
    },
    "cy": {
      "type": "string"
    },
    "da": {
      "type": "string"
    },
    "de": {
      "type": "string"
    },
    "dv": {
      "type": "string"
    },
    "dz": {
      "type": "string"
    },
    "ee": {
      "type": "string"
    },
    "el": {
      "type": "string"
    },
    "en": {
      "type": "string"
    },
    "eo": {
      "type": "string"
    },
    "es": {
      "type": "string"
    },
    "et": {
      "type": "string"
    },
    "eu": {
      "type": "string"
    },
    "fa": {
      "type": "string"
    },
    "ff": {
      "type": "string"
    },
    "fi": {
      "type": "string"
    },
    "fj": {
      "type": "string"
    },
    "fo": {
      "type": "string"
    },
    "fr": {
      "type": "string"
    },
    "fy": {
      "type": "string"
    },
    "ga": {
      "type": "string"
    },
    "gd": {
      "type": "string"
    },
    "gl": {
      "type": "string"
    },
    "gn": {
      "type": "string"
    },
    "gu": {
      "type": "string"
    },
    "gv": {
      "type": "string"
    },
    "ha": {
      "type": "string"
    },
    "he": {
      "type": "string"
    },
    "hi": {
      "type": "string"
    },
    "ho": {
      "type": "string"
    },
    "hr": {
      "type": "string"
    },
    "ht": {
      "type": "string"
    },
    "hu": {
      "type": "string"
    },
    "hy": {
      "type": "string"
    },
    "hz": {
      "type": "string"
    },
    "ia": {
      "type": "string"
    },
    "id": {
      "type": "string"
    },
    "ie": {
      "type": "string"
    },
    "ig": {
      "type": "string"
    },
    "ii": {
      "type": "string"
    },
    "ik": {
      "type": "string"
    },
    "io": {
      "type": "string"
    },
    "is": {
      "type": "string"
    },
    "it": {
      "type": "string"
    },
    "iu": {
      "type": "string"
    },
    "ja": {
      "type": "string"
    },
    "jv": {
      "type": "string"
    },
    "ka": {
      "type": "string"
    },
    "kg": {
      "type": "string"
    },
    "ki": {
      "type": "string"
    },
    "kj": {
      "type": "string"
    },
    "kk": {
      "type": "string"
    },
    "kl": {
      "type": "string"
    },
    "km": {
      "type": "string"
    },
    "kn": {
      "type": "string"
    },
    "ko": {
      "type": "string"
    },
    "kr": {
      "type": "string"
    },
    "ks": {
      "type": "string"
    },
    "ku": {
      "type": "string"
    },
    "kv": {
      "type": "string"
    },
    "kw": {
      "type": "string"
    },
    "ky": {
      "type": "string"
    },
    "la": {
      "type": "string"
    },
    "lb": {
      "type": "string"
    },
    "lg": {
      "type": "string"
    },
    "li": {
      "type": "string"
    },
    "ln": {
      "type": "string"
    },
    "lo": {
      "type": "string"
    },
    "lt": {
      "type": "string"
    },
    "lu": {
      "type": "string"
    },
    "lv": {
      "type": "string"
    },
    "mg": {
      "type": "string"
    },
    "mh": {
      "type": "string"
    },
    "mi": {
      "type": "string"
    },
    "mk": {
      "type": "string"
    },
    "ml": {
      "type": "string"
    },
    "mn": {
      "type": "string"
    },
    "mr": {
      "type": "string"
    },
    "ms": {
      "type": "string"
    },
    "mt": {
      "type": "string"
    },
    "my": {
      "type": "string"
    },
    "na": {
      "type": "string"
    },
    "nb": {
      "type": "string"
    },
    "nd": {
      "type": "string"
    },
    "ne": {
      "type": "string"
    },
    "ng": {
      "type": "string"
    },
    "nl": {
      "type": "string"
    },
    "nn": {
      "type": "string"
    },
    "no": {
      "type": "string"
    },
    "nr": {
      "type": "string"
    },
    "nv": {
      "type": "string"
    },
    "ny": {
      "type": "string"
    },
    "oc": {
      "type": "string"
    },
    "oj": {
      "type": "string"
    },
    "om": {
      "type": "string"
    },
    "or": {
      "type": "string"
    },
    "os": {
      "type": "string"
    },
    "pa": {
      "type": "string"
    },
    "pi": {
      "type": "string"
    },
    "pl": {
      "type": "string"
    },
    "ps": {
      "type": "string"
    },
    "pt": {
      "type": "string"
    },
    "qu": {
      "type": "string"
    },
    "rm": {
      "type": "string"
    },
    "rn": {
      "type": "string"
    },
    "ro": {
      "type": "string"
    },
    "ru": {
      "type": "string"
    },
    "rw": {
      "type": "string"
    },
    "sa": {
      "type": "string"
    },
    "sc": {
      "type": "string"
    },
    "sd": {
      "type": "string"
    },
    "se": {
      "type": "string"
    },
    "sg": {
      "type": "string"
    },
    "si": {
      "type": "string"
    },
    "sk": {
      "type": "string"
    },
    "sl": {
      "type": "string"
    },
    "sm": {
      "type": "string"
    },
    "sn": {
      "type": "string"
    },
    "so": {
      "type": "string"
    },
    "sq": {
      "type": "string"
    },
    "sr": {
      "type": "string"
    },
    "ss": {
      "type": "string"
    },
    "st": {
      "type": "string"
    },
    "su": {
      "type": "string"
    },
    "sv": {
      "type": "string"
    },
    "sw": {
      "type": "string"
    },
    "ta": {
      "type": "string"
    },
    "te": {
      "type": "string"
    },
    "tg": {
      "type": "string"
    },
    "th": {
      "type": "string"
    },
    "ti": {
      "type": "string"
    },
    "tk": {
      "type": "string"
    },
    "tl": {
      "type": "string"
    },
    "tn": {
      "type": "string"
    },
    "to": {
      "type": "string"
    },
    "tr": {
      "type": "string"
    },
    "ts": {
      "type": "string"
    },
    "tt": {
      "type": "string"
    },
    "tw": {
      "type": "string"
    },
    "ty": {
      "type": "string"
    },
    "ug": {
      "type": "string"
    },
    "uk": {
      "type": "string"
    },
    "ur": {
      "type": "string"
    },
    "uz": {
      "type": "string"
    },
    "ve": {
      "type": "string"
    },
    "vi": {
      "type": "string"
    },
    "vo": {
      "type": "string"
    },
    "wa": {
      "type": "string"
    },
    "wo": {
      "type": "string"
    },
    "xh": {
      "type": "string"
    },
    "yi": {
      "type": "string"
    },
    "yo": {
      "type": "string"
    },
    "za": {
      "type": "string"
    },
    "zh": {
      "type": "string"
    },
    "zu": {
      "type": "string"
    }
  },
  "additionalProperties": false
}
