{
  "id":12345679,
  "description":"desc",
  "name":"noMetadata",
  "name_with_namespace":"test / noMetadata",
  "path":"noMetadata",
  "path_with_namespace":"test/noMetadata",
  "created_at":"2020-12-22T15:49:02.838Z",
  "default_branch":"master",
  "tag_list":[
    "Beispiel",
    "Kurs",
    "git",
    "University Courses"
  ],
  "topics":[
    "Beispiel",
    "Kurs",
    "git",
    "University Courses"
  ],
  "ssh_url_to_repo":"git@gitlab.com:test/noMetadata.git",
  "http_url_to_repo":"https://gitlab.com/test/noMetadata.git",
  "web_url":"https://gitlab.com/test/noMetadata",
  "readme_url":"https://gitlab.com/test/noMetadata/-/blob/master/README.md",
  "avatar_url":"None",
  "forks_count":0,
  "star_count":0,
  "last_activity_at":"2021-06-28T19:56:09.854Z",
  "namespace":{
    "id":9262926,
    "name":"Test",
    "path":"test",
    "kind":"user",
    "full_path":"test",
    "parent_id":"None",
    "web_url":"https://gitlab.com/test"
  }
}
