participant_id	age	left-handed	Do you like this session?	session	stim_file	response	response_time	trial_type	trial
15	20	False	Yes	post	../../stimuli/shapes/target_square.jpg	1	0.4999952973626232	practice	shapes
15	20	False	Yes	post	../../stimuli/shapes/target_plus.jpg	1	0.9489866473051144	practice	shapes
15	20	False	Yes	post	../../stimuli/shapes/target_cross.jpg	1	0.9789485677416336	practice	shapes
15	20	False	Yes	post	../../stimuli/shapes/target_plus.jpg	1	0.6998823289559681	practice	shapes
15	20	False	Yes	post	../../stimuli/shapes/target_plus.jpg	1	0.4001007858660084	practice	shapes
15	20	False	Yes	post	../../stimuli/shapes/target_square.jpg	1	0.5621837703657069	practice	shapes
15	20	False	Yes	post	../../stimuli/shapes/target_plus.jpg	0	0.5571735100879494	experiment	shapes
15	20	False	Yes	post	../../stimuli/shapes/target_cross.jpg	0	0.3609120528119521	experiment	shapes
15	20	False	Yes	post	../../stimuli/shapes/target_plus.jpg	1	0.6897494376497315	experiment	shapes
15	20	False	Yes	post	../../stimuli/shapes/target_plus.jpg	1	0.8915845960472244	experiment	shapes
15	20	False	Yes	post	../../stimuli/shapes/target_plus.jpg	1	0.8571484710004516	experiment	shapes
15	20	False	Yes	post	../../stimuli/shapes/target_square.jpg	1	0.4225861980912472	experiment	shapes
15	20	False	Yes	post	../../stimuli/shapes/target_cross.jpg	0	0.7709352300887267	experiment	shapes
15	20	False	Yes	post	../../stimuli/shapes/target_square.jpg	1	0.454352984404953	experiment	shapes
15	20	False	Yes	post	../../stimuli/shapes/target_square.jpg	1	0.4527452741865205	experiment	shapes
15	20	False	Yes	post	../../stimuli/shapes/target_square.jpg	0	0.9118502413136296	experiment	shapes
15	20	False	Yes	post	../../stimuli/shapes/target_square.jpg	1	0.4747682669181611	experiment	shapes
15	20	False	Yes	post	../../stimuli/shapes/target_square.jpg	0	0.4842731425626078	experiment	shapes
15	20	False	Yes	post	../../stimuli/shapes/target_wombat.jpg	1	0.6208265162113027	practice	images
15	20	False	Yes	post	../../stimuli/shapes/target_platypus.jpg	0	0.5458535711441466	practice	images
15	20	False	Yes	post	../../stimuli/images/target_capybara.jpg	1	0.3656435683799115	practice	images
15	20	False	Yes	post	../../stimuli/images/target_capybara.jpg	1	0.6402913396504468	practice	images
15	20	False	Yes	post	../../stimuli/shapes/target_wombat.jpg	1	0.9445177552398448	practice	images
15	20	False	Yes	post	../../stimuli/shapes/target_wombat.jpg	1	0.3280413833354861	practice	images
15	20	False	Yes	post	../../stimuli/shapes/target_platypus.jpg	1	0.4452786553439924	experiment	images
15	20	False	Yes	post	../../stimuli/shapes/target_wombat.jpg	0	0.4667026575659874	experiment	images
15	20	False	Yes	post	../../stimuli/shapes/target_platypus.jpg	0	0.9359041863155626	experiment	images
15	20	False	Yes	post	../../stimuli/images/target_capybara.jpg	1	0.627648337964003	experiment	images
15	20	False	Yes	post	../../stimuli/images/target_capybara.jpg	1	0.6264095890578731	experiment	images
15	20	False	Yes	post	../../stimuli/shapes/target_platypus.jpg	1	0.8324029497186975	experiment	images
15	20	False	Yes	post	../../stimuli/shapes/target_wombat.jpg	1	0.408144542803448	experiment	images
15	20	False	Yes	post	../../stimuli/shapes/target_platypus.jpg	1	0.6410857478700356	experiment	images
15	20	False	Yes	post	../../stimuli/shapes/target_wombat.jpg	0	0.6009896498847418	experiment	images
15	20	False	Yes	post	../../stimuli/images/target_capybara.jpg	1	0.7178374833826593	experiment	images
15	20	False	Yes	post	../../stimuli/shapes/target_wombat.jpg	1	0.9996903922753068	experiment	images
15	20	False	Yes	post	../../stimuli/shapes/target_platypus.jpg	1	0.838614225857433	experiment	images
