participant_id	age	left-handed	Do you like this session?	session	stim_file	response	response_time	trial_type	trial
2	37	False	No	post	../../stimuli/shapes/target_cross.jpg	1	0.7957268369082398	practice	shapes
2	37	False	No	post	../../stimuli/shapes/target_plus.jpg	1	0.6371668915748807	practice	shapes
2	37	False	No	post	../../stimuli/shapes/target_cross.jpg	1	0.5645913130855781	practice	shapes
2	37	False	No	post	../../stimuli/shapes/target_square.jpg	1	0.7935590550076619	practice	shapes
2	37	False	No	post	../../stimuli/shapes/target_plus.jpg	0	0.4741069081012015	practice	shapes
2	37	False	No	post	../../stimuli/shapes/target_plus.jpg	1	0.531176770313369	practice	shapes
2	37	False	No	post	../../stimuli/shapes/target_square.jpg	1	0.4775775217111971	experiment	shapes
2	37	False	No	post	../../stimuli/shapes/target_plus.jpg	1	0.583641460746992	experiment	shapes
2	37	False	No	post	../../stimuli/shapes/target_plus.jpg	0	0.7000311176435075	experiment	shapes
2	37	False	No	post	../../stimuli/shapes/target_cross.jpg	0	0.8186817026374678	experiment	shapes
2	37	False	No	post	../../stimuli/shapes/target_plus.jpg	1	0.8370363971760002	experiment	shapes
2	37	False	No	post	../../stimuli/shapes/target_square.jpg	1	0.8759532463136852	experiment	shapes
2	37	False	No	post	../../stimuli/shapes/target_cross.jpg	1	0.8209481598603086	experiment	shapes
2	37	False	No	post	../../stimuli/shapes/target_cross.jpg	1	0.7767275989678363	experiment	shapes
2	37	False	No	post	../../stimuli/shapes/target_square.jpg	0	0.4662545299047289	experiment	shapes
2	37	False	No	post	../../stimuli/shapes/target_square.jpg	1	0.5801560250104174	experiment	shapes
2	37	False	No	post	../../stimuli/shapes/target_cross.jpg	1	0.6344004236161593	experiment	shapes
2	37	False	No	post	../../stimuli/shapes/target_plus.jpg	1	0.3580239251853479	experiment	shapes
2	37	False	No	post	../../stimuli/shapes/target_wombat.jpg	1	0.3303805483087209	practice	images
2	37	False	No	post	../../stimuli/images/target_capybara.jpg	1	0.9472503311565172	practice	images
2	37	False	No	post	../../stimuli/shapes/target_wombat.jpg	1	0.9433810006950616	practice	images
2	37	False	No	post	../../stimuli/images/target_capybara.jpg	0	0.4770931175924687	practice	images
2	37	False	No	post	../../stimuli/shapes/target_wombat.jpg	0	0.7867877861746533	practice	images
2	37	False	No	post	../../stimuli/shapes/target_platypus.jpg	0	0.3528041829628384	practice	images
2	37	False	No	post	../../stimuli/shapes/target_wombat.jpg	0	0.4517663746105438	experiment	images
2	37	False	No	post	../../stimuli/shapes/target_wombat.jpg	1	0.5061457627876009	experiment	images
2	37	False	No	post	../../stimuli/images/target_capybara.jpg	1	0.9970819625205594	experiment	images
2	37	False	No	post	../../stimuli/images/target_capybara.jpg	1	0.7878475391046703	experiment	images
2	37	False	No	post	../../stimuli/images/target_capybara.jpg	1	0.5689412819654539	experiment	images
2	37	False	No	post	../../stimuli/shapes/target_wombat.jpg	1	0.8159704940901134	experiment	images
2	37	False	No	post	../../stimuli/shapes/target_platypus.jpg	1	0.9406780391683744	experiment	images
2	37	False	No	post	../../stimuli/images/target_capybara.jpg	1	0.9710916851854924	experiment	images
2	37	False	No	post	../../stimuli/images/target_capybara.jpg	1	0.3405047284303951	experiment	images
2	37	False	No	post	../../stimuli/shapes/target_wombat.jpg	1	0.5761652590256909	experiment	images
2	37	False	No	post	../../stimuli/images/target_capybara.jpg	1	0.374729246155119	experiment	images
2	37	False	No	post	../../stimuli/shapes/target_platypus.jpg	1	0.5349620453578742	experiment	images
