participant_id	age	left-handed	Do you like this session?	session	stim_file	response	response_time	trial_type	trial
7	24	False	Yes	post	../../stimuli/shapes/target_plus.jpg	1	0.943574381250092	practice	shapes
7	24	False	Yes	post	../../stimuli/shapes/target_cross.jpg	0	0.6478744380340811	practice	shapes
7	24	False	Yes	post	../../stimuli/shapes/target_square.jpg	1	0.9945106103763188	practice	shapes
7	24	False	Yes	post	../../stimuli/shapes/target_plus.jpg	1	0.895997470421567	practice	shapes
7	24	False	Yes	post	../../stimuli/shapes/target_plus.jpg	0	0.445957360050135	practice	shapes
7	24	False	Yes	post	../../stimuli/shapes/target_cross.jpg	1	0.9514166502507412	practice	shapes
7	24	False	Yes	post	../../stimuli/shapes/target_square.jpg	1	0.872214795943834	experiment	shapes
7	24	False	Yes	post	../../stimuli/shapes/target_square.jpg	1	0.566436305433606	experiment	shapes
7	24	False	Yes	post	../../stimuli/shapes/target_square.jpg	1	0.9145820243115486	experiment	shapes
7	24	False	Yes	post	../../stimuli/shapes/target_cross.jpg	0	0.9076396830752153	experiment	shapes
7	24	False	Yes	post	../../stimuli/shapes/target_square.jpg	0	0.8641477800823347	experiment	shapes
7	24	False	Yes	post	../../stimuli/shapes/target_cross.jpg	1	0.8530213054149429	experiment	shapes
7	24	False	Yes	post	../../stimuli/shapes/target_cross.jpg	0	0.5132753973686286	experiment	shapes
7	24	False	Yes	post	../../stimuli/shapes/target_cross.jpg	1	0.3566434981358765	experiment	shapes
7	24	False	Yes	post	../../stimuli/shapes/target_plus.jpg	0	0.582086125135613	experiment	shapes
7	24	False	Yes	post	../../stimuli/shapes/target_square.jpg	1	0.421467160490556	experiment	shapes
7	24	False	Yes	post	../../stimuli/shapes/target_square.jpg	1	0.7864657622317232	experiment	shapes
7	24	False	Yes	post	../../stimuli/shapes/target_cross.jpg	1	0.5422698085764499	experiment	shapes
7	24	False	Yes	post	../../stimuli/shapes/target_wombat.jpg	1	0.6409433431732551	practice	images
7	24	False	Yes	post	../../stimuli/images/target_capybara.jpg	1	0.7243770564256842	practice	images
7	24	False	Yes	post	../../stimuli/shapes/target_wombat.jpg	1	0.8353668606320968	practice	images
7	24	False	Yes	post	../../stimuli/images/target_capybara.jpg	1	0.4223870390822887	practice	images
7	24	False	Yes	post	../../stimuli/shapes/target_platypus.jpg	1	0.6517962535244097	practice	images
7	24	False	Yes	post	../../stimuli/shapes/target_wombat.jpg	1	0.5790641194406192	practice	images
7	24	False	Yes	post	../../stimuli/images/target_capybara.jpg	1	0.557274095604072	experiment	images
7	24	False	Yes	post	../../stimuli/shapes/target_wombat.jpg	0	0.3477206165698455	experiment	images
7	24	False	Yes	post	../../stimuli/images/target_capybara.jpg	1	0.3180683348646408	experiment	images
7	24	False	Yes	post	../../stimuli/images/target_capybara.jpg	1	0.3946164024083759	experiment	images
7	24	False	Yes	post	../../stimuli/shapes/target_wombat.jpg	0	0.9741805781124216	experiment	images
7	24	False	Yes	post	../../stimuli/shapes/target_platypus.jpg	1	0.6846706751265119	experiment	images
7	24	False	Yes	post	../../stimuli/images/target_capybara.jpg	1	0.976075512807254	experiment	images
7	24	False	Yes	post	../../stimuli/images/target_capybara.jpg	0	0.6027485148310924	experiment	images
7	24	False	Yes	post	../../stimuli/images/target_capybara.jpg	1	0.5182712931596817	experiment	images
7	24	False	Yes	post	../../stimuli/shapes/target_platypus.jpg	1	0.6542993039881708	experiment	images
7	24	False	Yes	post	../../stimuli/shapes/target_platypus.jpg	0	0.6076581820430371	experiment	images
7	24	False	Yes	post	../../stimuli/shapes/target_wombat.jpg	1	0.3739652789832207	experiment	images
