participant_id	age	left-handed	Do you like this session?	session	stim_file	response	response_time	trial_type	trial
1	24	False	Yes	post	../../stimuli/shapes/target_plus.jpg	1	0.5137547022410753	practice	shapes
1	24	False	Yes	post	../../stimuli/shapes/target_cross.jpg	0	0.6399296275103585	practice	shapes
1	24	False	Yes	post	../../stimuli/shapes/target_square.jpg	1	0.6138969000903731	practice	shapes
1	24	False	Yes	post	../../stimuli/shapes/target_plus.jpg	1	0.9961202238275744	practice	shapes
1	24	False	Yes	post	../../stimuli/shapes/target_square.jpg	1	0.4231476768741417	practice	shapes
1	24	False	Yes	post	../../stimuli/shapes/target_square.jpg	1	0.3126527545308646	practice	shapes
1	24	False	Yes	post	../../stimuli/shapes/target_cross.jpg	1	0.4251758964549301	experiment	shapes
1	24	False	Yes	post	../../stimuli/shapes/target_plus.jpg	1	0.5565281492080019	experiment	shapes
1	24	False	Yes	post	../../stimuli/shapes/target_plus.jpg	0	0.8209193661395935	experiment	shapes
1	24	False	Yes	post	../../stimuli/shapes/target_cross.jpg	1	0.8046579469764905	experiment	shapes
1	24	False	Yes	post	../../stimuli/shapes/target_cross.jpg	1	0.5156425542966725	experiment	shapes
1	24	False	Yes	post	../../stimuli/shapes/target_plus.jpg	1	0.6797781613884295	experiment	shapes
1	24	False	Yes	post	../../stimuli/shapes/target_plus.jpg	1	0.656169853787132	experiment	shapes
1	24	False	Yes	post	../../stimuli/shapes/target_cross.jpg	1	0.7454328327301267	experiment	shapes
1	24	False	Yes	post	../../stimuli/shapes/target_square.jpg	1	0.4753232730239088	experiment	shapes
1	24	False	Yes	post	../../stimuli/shapes/target_square.jpg	0	0.7129095932923807	experiment	shapes
1	24	False	Yes	post	../../stimuli/shapes/target_cross.jpg	0	0.9852250007925064	experiment	shapes
1	24	False	Yes	post	../../stimuli/shapes/target_square.jpg	1	0.6407195070716185	experiment	shapes
1	24	False	Yes	post	../../stimuli/shapes/target_wombat.jpg	1	0.4611296877690887	practice	images
1	24	False	Yes	post	../../stimuli/images/target_capybara.jpg	1	0.6494353659193266	practice	images
1	24	False	Yes	post	../../stimuli/images/target_capybara.jpg	1	0.7004029394464282	practice	images
1	24	False	Yes	post	../../stimuli/shapes/target_platypus.jpg	1	0.8379878100144162	practice	images
1	24	False	Yes	post	../../stimuli/shapes/target_platypus.jpg	1	0.3305226402281036	practice	images
1	24	False	Yes	post	../../stimuli/images/target_capybara.jpg	1	0.9961853575581388	practice	images
1	24	False	Yes	post	../../stimuli/images/target_capybara.jpg	1	0.495692239257731	experiment	images
1	24	False	Yes	post	../../stimuli/shapes/target_platypus.jpg	1	0.9184458155863812	experiment	images
1	24	False	Yes	post	../../stimuli/shapes/target_platypus.jpg	0	0.8234031417281897	experiment	images
1	24	False	Yes	post	../../stimuli/shapes/target_platypus.jpg	1	0.9671502929167672	experiment	images
1	24	False	Yes	post	../../stimuli/shapes/target_wombat.jpg	1	0.5315252132693595	experiment	images
1	24	False	Yes	post	../../stimuli/images/target_capybara.jpg	1	0.6869354767848429	experiment	images
1	24	False	Yes	post	../../stimuli/shapes/target_platypus.jpg	1	0.7006047284195868	experiment	images
1	24	False	Yes	post	../../stimuli/images/target_capybara.jpg	1	0.986232108601232	experiment	images
1	24	False	Yes	post	../../stimuli/shapes/target_wombat.jpg	1	0.3527423792042897	experiment	images
1	24	False	Yes	post	../../stimuli/shapes/target_wombat.jpg	1	0.5139879135010272	experiment	images
1	24	False	Yes	post	../../stimuli/shapes/target_platypus.jpg	1	0.4336377218052422	experiment	images
1	24	False	Yes	post	../../stimuli/shapes/target_wombat.jpg	1	0.4879323998231097	experiment	images
