participant_id	age	left-handed	Do you like this session?	session	stim_file	response	response_time	trial_type	trial
20	23	False	No	post	../../stimuli/shapes/target_cross.jpg	1	0.897760017499297	practice	shapes
20	23	False	No	post	../../stimuli/shapes/target_square.jpg	1	0.3092601690337058	practice	shapes
20	23	False	No	post	../../stimuli/shapes/target_plus.jpg	1	0.6582463195986364	practice	shapes
20	23	False	No	post	../../stimuli/shapes/target_square.jpg	0	0.8386098055950897	practice	shapes
20	23	False	No	post	../../stimuli/shapes/target_cross.jpg	1	0.9543568622449484	practice	shapes
20	23	False	No	post	../../stimuli/shapes/target_cross.jpg	1	0.9364414953445408	practice	shapes
20	23	False	No	post	../../stimuli/shapes/target_square.jpg	1	0.9217339447629128	experiment	shapes
20	23	False	No	post	../../stimuli/shapes/target_plus.jpg	0	0.4394537800859535	experiment	shapes
20	23	False	No	post	../../stimuli/shapes/target_cross.jpg	1	0.4989290069982101	experiment	shapes
20	23	False	No	post	../../stimuli/shapes/target_cross.jpg	1	0.502277967444741	experiment	shapes
20	23	False	No	post	../../stimuli/shapes/target_plus.jpg	1	0.5639377517011892	experiment	shapes
20	23	False	No	post	../../stimuli/shapes/target_cross.jpg	0	0.575324469269632	experiment	shapes
20	23	False	No	post	../../stimuli/shapes/target_square.jpg	1	0.6811887272582728	experiment	shapes
20	23	False	No	post	../../stimuli/shapes/target_cross.jpg	1	0.4119158343565089	experiment	shapes
20	23	False	No	post	../../stimuli/shapes/target_cross.jpg	1	0.7838726646501925	experiment	shapes
20	23	False	No	post	../../stimuli/shapes/target_plus.jpg	1	0.4172965775131545	experiment	shapes
20	23	False	No	post	../../stimuli/shapes/target_square.jpg	1	0.5172159374731833	experiment	shapes
20	23	False	No	post	../../stimuli/shapes/target_plus.jpg	1	0.6523415914243078	experiment	shapes
20	23	False	No	post	../../stimuli/shapes/target_wombat.jpg	0	0.5641542237576556	practice	images
20	23	False	No	post	../../stimuli/shapes/target_wombat.jpg	1	0.5894615712029714	practice	images
20	23	False	No	post	../../stimuli/shapes/target_platypus.jpg	1	0.3278680076120276	practice	images
20	23	False	No	post	../../stimuli/shapes/target_platypus.jpg	1	0.4917916696289802	practice	images
20	23	False	No	post	../../stimuli/shapes/target_platypus.jpg	0	0.9689546270865426	practice	images
20	23	False	No	post	../../stimuli/images/target_capybara.jpg	1	0.9675428254807824	practice	images
20	23	False	No	post	../../stimuli/shapes/target_wombat.jpg	0	0.3301700762638268	experiment	images
20	23	False	No	post	../../stimuli/shapes/target_platypus.jpg	1	0.425366457529727	experiment	images
20	23	False	No	post	../../stimuli/shapes/target_wombat.jpg	1	0.574552455403478	experiment	images
20	23	False	No	post	../../stimuli/images/target_capybara.jpg	1	0.9634457885784607	experiment	images
20	23	False	No	post	../../stimuli/images/target_capybara.jpg	0	0.3988393444760294	experiment	images
20	23	False	No	post	../../stimuli/images/target_capybara.jpg	0	0.8344610905677485	experiment	images
20	23	False	No	post	../../stimuli/images/target_capybara.jpg	1	0.3760777775622844	experiment	images
20	23	False	No	post	../../stimuli/shapes/target_wombat.jpg	0	0.9868803041738938	experiment	images
20	23	False	No	post	../../stimuli/images/target_capybara.jpg	1	0.5671315493763944	experiment	images
20	23	False	No	post	../../stimuli/images/target_capybara.jpg	0	0.8426641772293391	experiment	images
20	23	False	No	post	../../stimuli/shapes/target_platypus.jpg	1	0.5398137579677922	experiment	images
20	23	False	No	post	../../stimuli/images/target_capybara.jpg	0	0.739368214011166	experiment	images
