<?xml version="1.0" encoding="UTF-8" standalone="no"?>
<svg
   xmlns:dc="http://purl.org/dc/elements/1.1/"
   xmlns:cc="http://creativecommons.org/ns#"
   xmlns:rdf="http://www.w3.org/1999/02/22-rdf-syntax-ns#"
   xmlns:svg="http://www.w3.org/2000/svg"
   xmlns="http://www.w3.org/2000/svg"
   xmlns:sodipodi="http://sodipodi.sourceforge.net/DTD/sodipodi-0.dtd"
   xmlns:inkscape="http://www.inkscape.org/namespaces/inkscape"
   enable-background="new 0 0 16 16"
   version="1.1"
   viewBox="0 0 16 16"
   xml:space="preserve"
   id="svg26"
   sodipodi:docname="icon.svg"
   inkscape:export-filename="icon.png"
   inkscape:export-xdpi="768"
   inkscape:export-ydpi="768"
   inkscape:version="1.0.2 (e86c870, 2021-01-15)"><path
   style="color:#000000;font-style:normal;font-variant:normal;font-weight:normal;font-stretch:normal;font-size:medium;line-height:normal;font-family:sans-serif;font-variant-ligatures:normal;font-variant-position:normal;font-variant-caps:normal;font-variant-numeric:normal;font-variant-alternates:normal;font-variant-east-asian:normal;font-feature-settings:normal;font-variation-settings:normal;text-indent:0;text-align:start;text-decoration:none;text-decoration-line:none;text-decoration-style:solid;text-decoration-color:#000000;letter-spacing:normal;word-spacing:normal;text-transform:none;writing-mode:lr-tb;direction:ltr;text-orientation:mixed;dominant-baseline:auto;baseline-shift:baseline;text-anchor:start;white-space:normal;shape-padding:0;shape-margin:0;inline-size:0;clip-rule:nonzero;display:inline;overflow:visible;visibility:visible;opacity:1;isolation:auto;mix-blend-mode:normal;color-interpolation:sRGB;color-interpolation-filters:linearRGB;solid-color:#000000;solid-opacity:1;vector-effect:none;fill:#f6f6f6;fill-opacity:1;fill-rule:evenodd;stroke:none;stroke-linecap:round;stroke-linejoin:miter;stroke-miterlimit:4;stroke-dasharray:none;stroke-dashoffset:0;stroke-opacity:1;paint-order:stroke fill markers;color-rendering:auto;image-rendering:auto;shape-rendering:auto;text-rendering:auto;enable-background:accumulate;stop-color:#000000;stop-opacity:1"
   d="m 1.5,1.5 v 1 12 H 5 v -4.263672 c 0.4141614,0.703019 1.1303728,1.099461 1.9179688,1.375 C 7.3211087,13.260174 8.7563134,14.499736 10.5,14.5 h 4 V 1.5 H 11 V 5.765625 C 10.583809,5.0583066 9.8637529,4.6611554 9.0703125,4.3867188 8.6707762,2.7516593 7.2546273,1.5 5.5,1.5 Z"
   id="path848"
   sodipodi:nodetypes="ccccccccccccsc" /><path
   id="path836"
   style="font-variation-settings:normal;opacity:1;vector-effect:none;fill:#424242;fill-opacity:1;fill-rule:evenodd;stroke:none;stroke-width:2;stroke-linecap:round;stroke-linejoin:miter;stroke-miterlimit:4;stroke-dasharray:none;stroke-dashoffset:0;stroke-opacity:1;paint-order:stroke fill markers;stop-color:#000000;stop-opacity:1"
   d="M 2.5 2.5 L 2.5 13.5 L 4 13.5 L 4 8 L 5.5 8 L 5.5 8.5996094 C 5.5000002 9.8460982 6.4935081 10.858829 7.7597656 10.976562 A 2.75 2.75 0 0 0 10.5 13.5 L 13.5 13.5 L 13.5 2.5 L 12 2.5 L 12 8 L 10.5 8 L 10.5 7.4003906 C 10.5 6.1493866 9.4994071 5.1330391 8.2265625 5.0214844 C 8.1086545 3.6113839 6.9405676 2.5 5.5 2.5 L 2.5 2.5 z M 4 4 L 5.5 4 C 6.1903559 4 6.75 4.5596441 6.75 5.25 C 6.75 5.2801338 6.7423313 5.3082906 6.7402344 5.3378906 C 6.2745232 5.6007038 5.9027873 5.9971456 5.6933594 6.4804688 C 5.6299164 6.4903909 5.5662276 6.5 5.5 6.5 L 4 6.5 L 4 4 z M 8 6.5 C 8.5522847 6.5 9 6.9477153 9 7.5 C 8.9994343 7.6554103 9.0003506 8.243 9 8.4003906 C 9 8.4190666 8.991245 8.4347014 8.9902344 8.453125 A 2.75 2.75 0 0 0 8.1191406 9.3769531 C 8.0782325 9.3820489 8.0422883 9.4003906 8 9.4003906 C 7.4477153 9.4003906 7 8.9526753 7 8.4003906 C 7.0002617 8.24432 6.9999563 7.6567308 7 7.5 C 7 6.9477153 7.4477153 6.5 8 6.5 z M 10.5 9.5 L 12 9.5 L 12 12 L 10.5 12 A 1.25 1.25 0 0 1 9.25 10.75 A 1.25 1.25 0 0 1 10.5 9.5 z " /><defs
   id="defs30" /><sodipodi:namedview
   pagecolor="#505050"
   bordercolor="#ffffff"
   borderopacity="1"
   objecttolerance="10"
   gridtolerance="10"
   guidetolerance="10"
   inkscape:pageopacity="0"
   inkscape:pageshadow="2"
   inkscape:window-width="640"
   inkscape:window-height="480"
   id="namedview28"
   showgrid="true"
   inkscape:snap-bbox="true"
   inkscape:bbox-nodes="true"
   inkscape:bbox-paths="true"
   inkscape:snap-bbox-edge-midpoints="false"
   inkscape:object-paths="true"
   inkscape:snap-smooth-nodes="true"
   inkscape:snap-intersection-paths="true"
   inkscape:current-layer="svg26"
   showguides="true"
   inkscape:document-rotation="0"
   inkscape:snap-nodes="true"><inkscape:grid
     type="xygrid"
     id="grid869" /></sodipodi:namedview><metadata
   id="metadata2"><rdf:RDF><cc:Work
       rdf:about=""><dc:format>image/svg+xml</dc:format><dc:type
         rdf:resource="http://purl.org/dc/dcmitype/StillImage" /><dc:title /></cc:Work></rdf:RDF></metadata>
<style
   type="text/css"
   id="style4">
	.icon_x002D_canvas_x002D_transparent{opacity:0;fill:#F6F6F6;}
	.icon_x002D_vs_x002D_out{fill:#F6F6F6;}
	.icon_x002D_vs_x002D_bg{fill:#424242;}
	.icon_x002D_vs_x002D_fg{fill:#F0EFF1;}
	.icon_x002D_vs_x002D_blue{fill:#1BA1E2;}
</style>
	

<style
   type="text/css"
   id="style24">.icon-canvas-transparent{opacity:0;fill:#F6F6F6;} .icon-vs-out{fill:#F6F6F6;} .icon-vs-bg{fill:#424242;} .icon-vs-fg{fill:#F0EFF1;}</style></svg>
