00:00:00.011656 main     VirtualBox XPCOM Server 6.1.14 r140239 linux.amd64 (Sep  7 2020 21:01:30) release log
00:00:00.011659 main     Log opened 2020-09-29T02:14:29.814946000Z
00:00:00.011660 main     Build Type: release
00:00:00.011667 main     OS Product: Linux
00:00:00.011668 main     OS Release: 5.8.12-arch1-1
00:00:00.011669 main     OS Version: #1 SMP PREEMPT Sat, 26 Sep 2020 21:42:58 +0000
00:00:00.011691 main     DMI Product Name: 33543XG
00:00:00.011701 main     DMI Product Version: ThinkPad Edge E330
00:00:00.011710 main     Firmware type: BIOS
00:00:00.011753 main     Host RAM: 3384MB (3.3GB) total, 2987MB (2.9GB) available
00:00:00.011756 main     Executable: /usr/lib/virtualbox/VBoxSVC
00:00:00.011757 main     Process ID: 810
00:00:00.011757 main     Package type: LINUX_64BITS_GENERIC (OSE)
00:00:00.013869 main     IPC socket path: /tmp/.vbox-ed-ipc/ipcd
00:00:00.119976 nspr-2   VirtualBox: object creation starts
00:00:00.120118 nspr-2   Home directory: '/home/ed/.config/VirtualBox'
00:00:00.133635 nspr-2   Loading settings file "/home/ed/.config/VirtualBox/VirtualBox.xml" with version "1.12-linux"
00:00:00.156754 nspr-2   Successfully initialised host USB using sysfs
00:00:00.163323 nspr-2   NetIfAdpCtlOut: VBoxNetAdpCtl: Error while retrieving link speed for wlp3s0: VBoxNetAdpCtl: ioctl failed: Operation not supported
00:00:00.163863 nspr-2   HostDnsMonitor: initializing
00:00:00.164214 nspr-2   NAT: resolv.conf: nameserver 8.8.8.8
00:00:00.164233 nspr-2   NAT: resolv.conf: nameserver 4.4.4.4
00:00:00.164248 nspr-2   HostDnsMonitor: updating information
00:00:00.164269 nspr-2   HostDnsMonitor: old information
00:00:00.164274 nspr-2     no server entries
00:00:00.164278 nspr-2     no domain set
00:00:00.164282 nspr-2     no search string entries
00:00:00.164285 nspr-2   HostDnsMonitor: new information
00:00:00.164289 nspr-2     server 1: 8.8.8.8
00:00:00.164293 nspr-2     server 2: 4.4.4.4
00:00:00.164297 nspr-2     no domain set
00:00:00.164300 nspr-2     no search string entries
00:00:00.168320 nspr-2   VD: VDInit finished with VINF_SUCCESS
00:00:00.252043 nspr-2   Loading settings file "/home/ed/VirtualBox VMs/Debian/Debian.vbox" with version "1.16-linux"
00:00:00.277907 nspr-2   Loading settings file "/home/ed/VirtualBox VMs/Win-10/Win-10.vbox" with version "1.15-linux"
00:00:00.279986 nspr-2   OCI: Local config file '/home/ed/.config/VirtualBox/oci_config' does not exist
00:00:00.280010 nspr-2   OCI: Original config file '/home/ed/.oci/config' does not exist
00:00:00.280014 nspr-2   OCI: Reading profiles finished with status NS_OK
00:00:00.280020 nspr-2   ExtPack: Created cloud provider 'OCI' (hrc=NS_OK)
00:00:00.280033 nspr-2   VirtualBox: object created
00:00:07.312179 nspr-5   Launched VM: 671099520 pid: 838 (0x346) frontend: GUI/Qt name: Debian
00:00:08.421700 nspr-2   Load [/usr/lib/virtualbox/ExtensionPacks/Oracle_VM_VirtualBox_Extension_Pack/linux.amd64/VBoxHostWebcam.so] vrc=VINF_SUCCESS
00:00:08.533956 nspr-2   ERROR [COM]: aRC=VBOX_E_IPRT_ERROR (0x80bb0005) aIID={85632c68-b5bb-4316-a900-5eb28d3413df} aComponent={SessionMachine} aText={Saved screenshot data is not available (VERR_NOT_SUPPORTED)}, preserve=false aResultDetail=-37
00:00:08.569919 nspr-2   NetIfAdpCtlOut: VBoxNetAdpCtl: Error while retrieving link speed for wlp3s0: VBoxNetAdpCtl: ioctl failed: Operation not supported
00:10:55.904691 nspr-3   Saving settings file "/home/ed/VirtualBox VMs/Debian/Debian.vbox" with version "1.16-linux"
00:10:58.213660 nspr-5   Launched VM: 335550896 pid: 934 (0x3a6) frontend: GUI/Qt name: Win-10
00:10:59.154656 nspr-2   Load [/usr/lib/virtualbox/ExtensionPacks/Oracle_VM_VirtualBox_Extension_Pack/linux.amd64/VBoxHostWebcam.so] vrc=VINF_SUCCESS
00:10:59.259372 nspr-6   ERROR [COM]: aRC=VBOX_E_IPRT_ERROR (0x80bb0005) aIID={85632c68-b5bb-4316-a900-5eb28d3413df} aComponent={SessionMachine} aText={Saved screenshot data is not available (VERR_NOT_SUPPORTED)}, preserve=false aResultDetail=-37
00:10:59.280522 nspr-5   NetIfAdpCtlOut: VBoxNetAdpCtl: Error while retrieving link speed for wlp3s0: VBoxNetAdpCtl: ioctl failed: Operation not supported
00:26:39.444237 nspr-4   Saving settings file "/home/ed/VirtualBox VMs/Win-10/Win-10.vbox" with version "1.15-linux"
00:26:46.701963 nspr-8   Saving settings file "/home/ed/.config/VirtualBox/VirtualBox.xml" with version "1.12-linux"
00:26:46.803412 nspr-2   Saving settings file "/home/ed/.config/VirtualBox/VirtualBox.xml" with version "1.12-linux"
00:26:52.384783 main     VirtualBox: object deletion starts
00:26:52.384847 main     ERROR [COM]: aRC=VBOX_E_OBJECT_IN_USE (0x80bb000c) aIID={ad47ad09-787b-44ab-b343-a082a3f2dfb1} aComponent={MediumWrap} aText={Medium '/home/ed/VirtualBox VMs/Debian/Debian.vdi' cannot be closed because it is still attached to 1 virtual machines}, preserve=false aResultDetail=0
00:26:52.385023 main     ERROR [COM]: aRC=VBOX_E_OBJECT_IN_USE (0x80bb000c) aIID={ad47ad09-787b-44ab-b343-a082a3f2dfb1} aComponent={MediumWrap} aText={Medium '/home/ed/VirtualBox VMs/Win-10/Win-10.vdi' cannot be closed because it is still attached to 1 virtual machines}, preserve=false aResultDetail=0
00:26:52.385429 main     HostDnsMonitor: shutting down ...
00:26:52.392358 main     HostDnsMonitor: shut down
00:26:52.453403 Watcher  ERROR [COM]: aRC=E_ACCESSDENIED (0x80070005) aIID={d0a0163f-e254-4e5b-a1f2-011cf991c38d} aComponent={VirtualBoxWrap} aText={The object is not ready}, preserve=false aResultDetail=0
00:26:57.392780 main     {00007feb2c016dc0} HostPowerServiceLinux::~HostPowerServiceLinux: RTThreadWait() for 5000 ms failed with VERR_TIMEOUT
00:26:57.393558 main     VirtualBox: object deleted
