<svg id="american_express" data-name="american express" xmlns="http://www.w3.org/2000/svg" width="36" height="23" viewBox="0 0 36 23">
  <defs>
    <style>
      .cls-1, .cls-3 {
        fill: #0078a9;
      }

      .cls-2 {
        fill: #f5f7fa;
      }

      .cls-2, .cls-3 {
        fill-rule: evenodd;
      }
    </style>
  </defs>
  <rect id="card" class="cls-1" width="36" height="23" rx="1.3" ry="1.3"/>
  <g id="american_express_logo" data-name="american express logo">
    <path id="amex_white" data-name="amex white" class="cls-2" d="M430.757,366.958v-0.375l-0.183.375h-1.58l-0.2-.4v0.4H425.84l-0.349-.813H424.9l-0.37.813H423V364.5l1.123-2.5h2.151l0.3,0.708v-0.7H429.2l0.579,1.193,0.566-1.2h8.3a1.438,1.438,0,0,1,.722.192l0-.192h2.091v0.271a1.725,1.725,0,0,1,.933-0.271h3.691l0.324,0.719V362h2.365l0.429,0.719V362h2.261v4.961H449.14l-0.546-.865v0.86h-2.887l-0.406-.886h-0.566l-0.38.886h-1.748a2.289,2.289,0,0,1-1.14-.352v0.352h-3.479V365.8a0.129,0.129,0,0,0-.13-0.157H437.73v1.314h-6.973Zm-1.736,1.075h4.571l0.66,0.735,0.674-.735h3.515a1.637,1.637,0,0,1,.643.172v-0.172h3.13a1.614,1.614,0,0,1,.73.195v-0.195h4.023v0.18a1.385,1.385,0,0,1,.672-0.18h2.621v0.18a1.622,1.622,0,0,1,.679-0.18H453v4.675a1.142,1.142,0,0,1-.83.3h-2.713V372.86a1.405,1.405,0,0,1-.651.149H441.6V371.8c0-.119-0.052-0.141-0.16-0.141h-0.1v1.349h-2.252v-1.341a1.529,1.529,0,0,1-.667.133h-0.81v1.208h-2.776l-0.631-.758-0.675.758h-4.5v-4.976Z" transform="translate(-420 -356)"/>
    <path id="amex_blue" data-name="amex blue" class="cls-3" d="M443.427,368.779H446.3v0.757h-1.991v0.66h1.935v0.667h-1.935v0.695H446.3V372.3h-2.869v-3.517Zm8.411,1.37a0.994,0.994,0,0,1,1.168,1.15,1.038,1.038,0,0,1-1.125,1.013h-1.843v-0.754h1.436c0.243,0,.606,0,0.606-0.338,0-.16-0.064-0.263-0.323-0.289-0.115-.017-0.541-0.04-0.606-0.041a1.006,1.006,0,0,1-1.2-1.083,0.978,0.978,0,0,1,1.046-1.02h1.842v0.754H451.49c-0.307,0-.638-0.036-0.638.305,0,0.216.163,0.259,0.371,0.279C451.3,370.125,451.773,370.15,451.838,370.149Zm-3.3,0a0.994,0.994,0,0,1,1.169,1.15,1.038,1.038,0,0,1-1.125,1.013h-1.843v-0.754h1.436c0.243,0,.606,0,0.606-0.338,0-.16-0.064-0.263-0.323-0.289-0.115-.017-0.542-0.04-0.606-0.041a1,1,0,0,1-1.2-1.083,0.977,0.977,0,0,1,1.044-1.02h1.843v0.754h-1.348c-0.307,0-.638-0.036-0.638.305,0,0.216.164,0.259,0.371,0.279C447.991,370.125,448.47,370.15,448.534,370.149Zm-10.4-1.363h-3.079l-1,1.092-0.973-1.1h-3.458V372.3h3.346l1.053-1.162,1.029,1.171h1.684V371.11h1.18a1.09,1.09,0,0,0,1.285-1.248A0.983,0.983,0,0,0,438.13,368.786Zm-5.627,2.772H430.48v-0.695h1.935V370.2H430.48v-0.66l2.134,0,0.854,0.957Zm3.354,0.408L434.6,370.5l1.261-1.374v2.842Zm1.978-1.58h-1.093v-0.845h1.1A0.427,0.427,0,1,1,437.835,370.386Zm4.534,0.316a0.958,0.958,0,0,0,.606-0.974,0.938,0.938,0,0,0-1.053-.941h-2.281v3.518h0.878v-1.242h1.148a0.512,0.512,0,0,1,.431.6l0.023,0.645h0.854l-0.032-.723C442.943,371.016,442.784,370.749,442.369,370.7Zm-0.758-.364h-1.092v-0.8h1.1a0.419,0.419,0,0,1,.483.405A0.39,0.39,0,0,1,441.611,370.338Zm-0.741-4.11v-3.522h-0.877v3.522h0.877Zm-8.06-3.518h2.867v0.758h-1.99v0.66h1.934V364.8h-1.934v0.694h1.99v0.739H432.81V362.71Zm6.117,1.916a0.958,0.958,0,0,0,.606-0.974,0.938,0.938,0,0,0-1.053-.942H436.2v3.518h0.878v-1.241h1.148a0.511,0.511,0,0,1,.431.6l0.024,0.644h0.854l-0.032-.723C439.5,364.94,439.342,364.673,438.927,364.626Zm-0.759-.364h-1.092v-0.8h1.1a0.418,0.418,0,0,1,.482.4A0.391,0.391,0,0,1,438.168,364.262Zm-7.382-1.552-1.077,2.36-1.073-2.36H427.26V366.1l-1.531-3.388h-1.161L423,366.228h0.926l0.342-.785h1.752l0.347,0.785h1.766v-2.611l1.173,2.611h0.8l1.2-2.568v2.568h0.877V362.71h-1.4Zm-6.182,1.974,0.523-1.23,0.545,1.23H424.6Zm25.32-1.975v2.435l-1.48-2.435h-1.3v3.3l-1.5-3.3h-1.161l-1.209,2.725s-0.51,0-.562-0.012a0.7,0.7,0,0,1-.546-0.81v-0.255c0-.825.455-0.885,1.038-0.885h0.542v-0.764h-1.146c-0.4,0-1.267.3-1.3,1.744a1.481,1.481,0,0,0,1.384,1.777h1.157l0.343-.786h1.75l0.348,0.786h1.731v-2.576l1.579,2.576h1.2v-3.521h-0.878Zm-5.389,1.976,0.522-1.229,0.551,1.229h-1.073Z" transform="translate(-420 -356)"/>
  </g>
</svg>
