00:00:00.785220 VirtualBox GUI VM Selector Window 6.1.14 r140239 linux.amd64 (Sep  7 2020 21:01:30) release log
00:00:00.785221 Log opened 2020-09-25T06:46:14.600097000Z
00:00:00.785222 Build Type: release
00:00:00.785224 OS Product: Linux
00:00:00.785225 OS Release: 5.8.10-arch1-1
00:00:00.785225 OS Version: #1 SMP PREEMPT Thu, 17 Sep 2020 18:01:06 +0000
00:00:00.785243 DMI Product Name: 33543XG
00:00:00.785251 DMI Product Version: ThinkPad Edge E330
00:00:00.785258 Firmware type: BIOS
00:00:00.785289 Host RAM: 3384MB (3.3GB) total, 1963MB available
00:00:00.785291 Executable: /usr/lib/virtualbox/VirtualBox
00:00:00.785291 Process ID: 3213
00:00:00.785292 Package type: LINUX_64BITS_GENERIC (OSE)
00:00:00.785316 Qt version: 5.15.1
00:00:00.946705 GUI: UIMediumEnumerator: Medium-enumeration started...
00:00:03.161328 GUI: UIDesktopWidgetWatchdog::sltHandleHostScreenAvailableGeometryCalculated: Screen 0 work area is actually resized to: 0x18 x 1366x750
00:00:03.182256 GUI: UIMediumEnumerator: Medium-enumeration finished!
