00:00:00.812228 VirtualBox GUI VM Selector Window 6.1.14 r140239 linux.amd64 (Sep  7 2020 21:01:30) release log
00:00:00.812232 Log opened 2020-10-01T15:41:59.902365000Z
00:00:00.812234 Build Type: release
00:00:00.812238 OS Product: Linux
00:00:00.812240 OS Release: 5.8.12-arch1-1
00:00:00.812242 OS Version: #1 SMP PREEMPT Sat, 26 Sep 2020 21:42:58 +0000
00:00:00.812277 DMI Product Name: 33543XG
00:00:00.812294 DMI Product Version: ThinkPad Edge E330
00:00:00.812311 Firmware type: BIOS
00:00:00.812378 Host RAM: 3384MB (3.3GB) total, 2856MB (2.7GB) available
00:00:00.812398 Executable: /usr/lib/virtualbox/VirtualBox
00:00:00.812399 Process ID: 933
00:00:00.812400 Package type: LINUX_64BITS_GENERIC (OSE)
00:00:00.812452 Qt version: 5.15.1
00:00:01.028434 GUI: UIMediumEnumerator: Medium-enumeration started...
00:00:03.511465 GUI: UIDesktopWidgetWatchdog::sltHandleHostScreenAvailableGeometryCalculated: Screen 0 work area is actually resized to: 0x18 x 1366x750
00:00:03.531829 GUI: UIMediumEnumerator: Medium-enumeration finished!
