00:00:00.009735 main     VirtualBox XPCOM Server 6.1.14 r140239 linux.amd64 (Sep  7 2020 21:01:30) release log
00:00:00.009738 main     Log opened 2020-09-25T06:46:14.190923000Z
00:00:00.009739 main     Build Type: release
00:00:00.009742 main     OS Product: Linux
00:00:00.009744 main     OS Release: 5.8.10-arch1-1
00:00:00.009745 main     OS Version: #1 SMP PREEMPT Thu, 17 Sep 2020 18:01:06 +0000
00:00:00.009769 main     DMI Product Name: 33543XG
00:00:00.009781 main     DMI Product Version: ThinkPad Edge E330
00:00:00.009791 main     Firmware type: BIOS
00:00:00.009830 main     Host RAM: 3384MB (3.3GB) total, 1966MB available
00:00:00.009833 main     Executable: /usr/lib/virtualbox/VBoxSVC
00:00:00.009833 main     Process ID: 3240
00:00:00.009834 main     Package type: LINUX_64BITS_GENERIC (OSE)
00:00:00.011467 main     IPC socket path: /tmp/.vbox-ed-ipc/ipcd
00:00:00.118338 nspr-2   VirtualBox: object creation starts
00:00:00.118499 nspr-2   Home directory: '/home/ed/.config/VirtualBox'
00:00:00.132383 nspr-2   Loading settings file "/home/ed/.config/VirtualBox/VirtualBox.xml" with version "1.12-linux"
00:00:00.154962 nspr-2   Successfully initialised host USB using sysfs
00:00:00.160352 nspr-2   NetIfAdpCtlOut: VBoxNetAdpCtl: Error while retrieving link speed for wlp3s0: VBoxNetAdpCtl: ioctl failed: Operation not supported
00:00:00.160937 nspr-2   HostDnsMonitor: initializing
00:00:00.161404 nspr-2   NAT: resolv.conf: nameserver 8.8.8.8
00:00:00.161416 nspr-2   NAT: resolv.conf: nameserver 4.4.4.4
00:00:00.161425 nspr-2   HostDnsMonitor: updating information
00:00:00.161437 nspr-2   HostDnsMonitor: old information
00:00:00.161440 nspr-2     no server entries
00:00:00.161443 nspr-2     no domain set
00:00:00.161445 nspr-2     no search string entries
00:00:00.161448 nspr-2   HostDnsMonitor: new information
00:00:00.161450 nspr-2     server 1: 8.8.8.8
00:00:00.161453 nspr-2     server 2: 4.4.4.4
00:00:00.161456 nspr-2     no domain set
00:00:00.161458 nspr-2     no search string entries
00:00:00.165007 nspr-2   VD: VDInit finished with VINF_SUCCESS
00:00:00.233589 nspr-2   Loading settings file "/home/ed/VirtualBox VMs/Debian/Debian.vbox" with version "1.16-linux"
00:00:00.268135 nspr-2   Loading settings file "/home/ed/VirtualBox VMs/Win-10/Win-10.vbox" with version "1.15-linux"
00:00:00.269700 nspr-2   OCI: Local config file '/home/ed/.config/VirtualBox/oci_config' does not exist
00:00:00.269744 nspr-2   OCI: Original config file '/home/ed/.oci/config' does not exist
00:00:00.269754 nspr-2   OCI: Reading profiles finished with status NS_OK
00:00:00.269767 nspr-2   ExtPack: Created cloud provider 'OCI' (hrc=NS_OK)
00:00:00.269801 nspr-2   VirtualBox: object created
00:00:04.951891 nspr-5   Launched VM: 10704 pid: 3268 (0xcc4) frontend: GUI/Qt name: Win-10
00:00:06.063920 nspr-4   Load [/usr/lib/virtualbox/ExtensionPacks/Oracle_VM_VirtualBox_Extension_Pack/linux.amd64/VBoxHostWebcam.so] vrc=VINF_SUCCESS
00:00:06.180810 nspr-4   ERROR [COM]: aRC=VBOX_E_IPRT_ERROR (0x80bb0005) aIID={85632c68-b5bb-4316-a900-5eb28d3413df} aComponent={SessionMachine} aText={Saved screenshot data is not available (VERR_NOT_SUPPORTED)}, preserve=false aResultDetail=-37
00:00:06.211896 nspr-6   NetIfAdpCtlOut: VBoxNetAdpCtl: Error while retrieving link speed for wlp3s0: VBoxNetAdpCtl: ioctl failed: Operation not supported
00:15:40.039910 nspr-6   Saving settings file "/home/ed/VirtualBox VMs/Win-10/Win-10.vbox" with version "1.15-linux"
00:15:54.193610 nspr-5   Saving settings file "/home/ed/.config/VirtualBox/VirtualBox.xml" with version "1.12-linux"
00:15:54.332362 nspr-7   Saving settings file "/home/ed/.config/VirtualBox/VirtualBox.xml" with version "1.12-linux"
00:15:54.407374 nspr-2   Saving settings file "/home/ed/.config/VirtualBox/VirtualBox.xml" with version "1.12-linux"
00:16:00.044058 main     VirtualBox: object deletion starts
00:16:00.044291 main     ERROR [COM]: aRC=VBOX_E_OBJECT_IN_USE (0x80bb000c) aIID={ad47ad09-787b-44ab-b343-a082a3f2dfb1} aComponent={MediumWrap} aText={Medium '/home/ed/VirtualBox VMs/Debian/Debian.vdi' cannot be closed because it is still attached to 1 virtual machines}, preserve=false aResultDetail=0
00:16:00.085527 main     ERROR [COM]: aRC=VBOX_E_OBJECT_IN_USE (0x80bb000c) aIID={ad47ad09-787b-44ab-b343-a082a3f2dfb1} aComponent={MediumWrap} aText={Medium '/home/ed/VirtualBox VMs/Win-10/Win-10.vdi' cannot be closed because it is still attached to 1 virtual machines}, preserve=false aResultDetail=0
00:16:00.141213 main     HostDnsMonitor: shutting down ...
00:16:00.147514 main     HostDnsMonitor: shut down
00:16:00.435745 Watcher  ERROR [COM]: aRC=E_ACCESSDENIED (0x80070005) aIID={d0a0163f-e254-4e5b-a1f2-011cf991c38d} aComponent={VirtualBoxWrap} aText={The object is not ready}, preserve=false aResultDetail=0
00:16:05.147895 main     {00007fad040171d0} HostPowerServiceLinux::~HostPowerServiceLinux: RTThreadWait() for 5000 ms failed with VERR_TIMEOUT
00:16:05.169822 main     VirtualBox: object deleted
