<svg width="18" height="16" xmlns="http://www.w3.org/2000/svg">

 <g>
  <title>background</title>
  <rect fill="none" id="canvas_background" height="402" width="582" y="-1" x="-1"/>
 </g>
 <g>
  <title>Layer 1</title>
  <path id="svg_1" d="m7.25024,12.96316c0.83847,0 1.52066,0.68219 1.52069,1.5207c0,0.83851 -0.68218,1.5207 -1.52069,1.5207c-0.83852,0 -1.5207,-0.68219 -1.5207,-1.5207c0,-0.83851 0.68218,-1.5207 1.5207,-1.5207zm5.33404,0c0.83848,0 1.52066,0.68219 1.5207,1.5207c0,0.83851 -0.68219,1.5207 -1.5207,1.5207c-0.83852,0 -1.5207,-0.68219 -1.5207,-1.5207c0,-0.83851 0.68218,-1.5207 1.5207,-1.5207zm-5.33404,0.84902c-0.37031,0 -0.67162,0.30127 -0.67162,0.67161c0,0.37031 0.30128,0.67162 0.67162,0.67162c0.3703,0 0.67161,-0.30125 0.67161,-0.67162c0,-0.3703 -0.30131,-0.67161 -0.67161,-0.67161zm5.33404,0c-0.37031,0 -0.67162,0.30127 -0.67162,0.67161c0,0.37031 0.30128,0.67162 0.67162,0.67162c0.3703,0 0.67161,-0.30125 0.67161,-0.67162c0,-0.3703 -0.30127,-0.67161 -0.67161,-0.67161zm-12.54906,-13.55204c0.09331,-0.21506 0.34332,-0.31377 0.55845,-0.22032l0,0l1.86341,0.80882c0.25332,0.11 0.43778,0.33708 0.49353,0.60752l0,0l0.26707,1.29645l13.22405,0c0.25636,0 0.49627,0.11395 0.65817,0.31266c0.16194,0.19868 0.22516,0.45666 0.17345,0.70765l0,0l-1.18751,5.76395c-0.08088,0.3927 -0.43065,0.67773 -0.83159,0.67773l0,0l-10.49929,0l0.24987,1.21294l10.1708,0c0.23448,0 0.42455,0.19006 0.42455,0.42454c0,0.23447 -0.19007,0.42454 -0.42455,0.42454l0,0l-10.17083,0c-0.40097,0 -0.75071,-0.28503 -0.83162,-0.67773l0,0l-2.05419,-9.97141l-1.86344,-0.80886c-0.21503,-0.09331 -0.31374,-0.34335 -0.22033,-0.55848zm16.40647,3.34152l-13.04907,0l1.18744,5.76392l10.67419,0l1.18744,-5.76392zm-3.81415,3.55979c0.23444,0 0.42451,0.1901 0.42451,0.42454c0,0.23448 -0.19007,0.42455 -0.42454,0.42455l0,0l-5.42158,0c-0.23448,0 -0.42454,-0.19007 -0.42454,-0.42455c0,-0.23447 0.19006,-0.42454 0.42454,-0.42454l0,0l5.42161,0zm0.33113,-2.2046c0.23447,0 0.42454,0.19003 0.42454,0.42454c0,0.23447 -0.19007,0.42454 -0.42454,0.42454l0,0l-6.08391,0c-0.23444,0 -0.42454,-0.19007 -0.42454,-0.42454c0,-0.23448 0.19007,-0.42454 0.42454,-0.42454l0,0l6.08391,0z" fill="#055b08"/>
 </g>
</svg>