00:00:01.822644 VirtualBox GUI VM Selector Window 6.1.14 r140239 linux.amd64 (Sep  7 2020 21:01:30) release log
00:00:01.822650 Log opened 2020-09-24T13:27:23.667810000Z
00:00:01.822652 Build Type: release
00:00:01.822658 OS Product: Linux
00:00:01.822661 OS Release: 5.8.10-arch1-1
00:00:01.822664 OS Version: #1 SMP PREEMPT Thu, 17 Sep 2020 18:01:06 +0000
00:00:01.822711 DMI Product Name: 33543XG
00:00:01.822735 DMI Product Version: ThinkPad Edge E330
00:00:01.822753 Firmware type: BIOS
00:00:01.822839 Host RAM: 3384MB (3.3GB) total, 2992MB (2.9GB) available
00:00:01.822846 Executable: /usr/lib/virtualbox/VirtualBox
00:00:01.822849 Process ID: 711
00:00:01.822850 Package type: LINUX_64BITS_GENERIC (OSE)
00:00:01.822923 Qt version: 5.15.1
00:00:02.270808 GUI: UIMediumEnumerator: Medium-enumeration started...
00:00:05.094760 GUI: UIDesktopWidgetWatchdog::sltHandleHostScreenAvailableGeometryCalculated: Screen 0 work area is actually resized to: 0x18 x 1366x750
00:00:05.107130 GUI: UIMediumEnumerator: Medium-enumeration finished!
