00:00:02.702272 VirtualBox GUI VM Selector Window 6.1.14 r140239 linux.amd64 (Sep  7 2020 21:01:30) release log
00:00:02.702275 Log opened 2020-10-01T11:56:24.557535000Z
00:00:02.702276 Build Type: release
00:00:02.702279 OS Product: Linux
00:00:02.702280 OS Release: 5.8.12-arch1-1
00:00:02.702282 OS Version: #1 SMP PREEMPT Sat, 26 Sep 2020 21:42:58 +0000
00:00:02.702311 DMI Product Name: 33543XG
00:00:02.702321 DMI Product Version: ThinkPad Edge E330
00:00:02.702331 Firmware type: BIOS
00:00:02.702377 Host RAM: 3384MB (3.3GB) total, 1987MB available
00:00:02.702380 Executable: /usr/lib/virtualbox/VirtualBox
00:00:02.702381 Process ID: 14168
00:00:02.702381 Package type: LINUX_64BITS_GENERIC (OSE)
00:00:02.702416 Qt version: 5.15.1
00:00:03.113410 GUI: UIMediumEnumerator: Medium-enumeration started...
00:00:05.613607 GUI: UIDesktopWidgetWatchdog::sltHandleHostScreenAvailableGeometryCalculated: Screen 0 work area is actually resized to: 0x18 x 1366x750
00:00:05.634632 GUI: UIMediumEnumerator: Medium-enumeration finished!
