00:00:00.050645 main     VirtualBox XPCOM Server 6.1.14 r140239 linux.amd64 (Sep  7 2020 21:01:30) release log
00:00:00.050651 main     Log opened 2020-10-01T11:56:23.637632000Z
00:00:00.050653 main     Build Type: release
00:00:00.050658 main     OS Product: Linux
00:00:00.050660 main     OS Release: 5.8.12-arch1-1
00:00:00.050662 main     OS Version: #1 SMP PREEMPT Sat, 26 Sep 2020 21:42:58 +0000
00:00:00.050797 main     DMI Product Name: 33543XG
00:00:00.050825 main     DMI Product Version: ThinkPad Edge E330
00:00:00.050844 main     Firmware type: BIOS
00:00:00.050924 main     Host RAM: 3384MB (3.3GB) total, 1991MB available
00:00:00.050930 main     Executable: /usr/lib/virtualbox/VBoxSVC
00:00:00.050931 main     Process ID: 14195
00:00:00.050932 main     Package type: LINUX_64BITS_GENERIC (OSE)
00:00:00.054580 main     IPC socket path: /tmp/.vbox-ed-ipc/ipcd
00:00:00.187316 nspr-2   VirtualBox: object creation starts
00:00:00.187475 nspr-2   Home directory: '/home/ed/.config/VirtualBox'
00:00:00.207854 nspr-2   Loading settings file "/home/ed/.config/VirtualBox/VirtualBox.xml" with version "1.12-linux"
00:00:00.242361 nspr-2   Successfully initialised host USB using sysfs
00:00:00.259140 nspr-2   NetIfAdpCtlOut: VBoxNetAdpCtl: Error while retrieving link speed for wlp3s0: VBoxNetAdpCtl: ioctl failed: Operation not supported
00:00:00.270682 nspr-2   HostDnsMonitor: initializing
00:00:00.271157 nspr-2   NAT: resolv.conf: nameserver 8.8.8.8
00:00:00.271188 nspr-2   NAT: resolv.conf: nameserver 4.4.4.4
00:00:00.271215 nspr-2   HostDnsMonitor: updating information
00:00:00.271244 nspr-2   HostDnsMonitor: old information
00:00:00.271253 nspr-2     no server entries
00:00:00.271260 nspr-2     no domain set
00:00:00.271267 nspr-2     no search string entries
00:00:00.271273 nspr-2   HostDnsMonitor: new information
00:00:00.271279 nspr-2     server 1: 8.8.8.8
00:00:00.271287 nspr-2     server 2: 4.4.4.4
00:00:00.271294 nspr-2     no domain set
00:00:00.271300 nspr-2     no search string entries
00:00:00.383777 nspr-2   VD: VDInit finished with VINF_SUCCESS
00:00:00.519625 nspr-2   Loading settings file "/home/ed/VirtualBox VMs/Debian/Debian.vbox" with version "1.16-linux"
00:00:00.578637 nspr-2   Loading settings file "/home/ed/VirtualBox VMs/Win-10/Win-10.vbox" with version "1.15-linux"
00:00:00.625278 nspr-2   OCI: Local config file '/home/ed/.config/VirtualBox/oci_config' does not exist
00:00:00.625330 nspr-2   OCI: Original config file '/home/ed/.oci/config' does not exist
00:00:00.625342 nspr-2   OCI: Reading profiles finished with status NS_OK
00:00:00.625357 nspr-2   ExtPack: Created cloud provider 'OCI' (hrc=NS_OK)
00:00:00.625401 nspr-2   VirtualBox: object created
00:00:06.129594 nspr-3   Saving settings file "/home/ed/.config/VirtualBox/VirtualBox.xml" with version "1.12-linux"
00:00:06.201202 nspr-4   Saving settings file "/home/ed/.config/VirtualBox/VirtualBox.xml" with version "1.12-linux"
00:00:11.765966 main     VirtualBox: object deletion starts
00:00:11.766108 main     ERROR [COM]: aRC=VBOX_E_OBJECT_IN_USE (0x80bb000c) aIID={ad47ad09-787b-44ab-b343-a082a3f2dfb1} aComponent={MediumWrap} aText={Medium '/home/ed/VirtualBox VMs/Debian/Debian.vdi' cannot be closed because it is still attached to 1 virtual machines}, preserve=false aResultDetail=0
00:00:11.766577 main     ERROR [COM]: aRC=VBOX_E_OBJECT_IN_USE (0x80bb000c) aIID={ad47ad09-787b-44ab-b343-a082a3f2dfb1} aComponent={MediumWrap} aText={Medium '/home/ed/VirtualBox VMs/Win-10/Win-10.vdi' cannot be closed because it is still attached to 1 virtual machines}, preserve=false aResultDetail=0
00:00:11.767268 main     HostDnsMonitor: shutting down ...
00:00:11.780228 main     HostDnsMonitor: shut down
00:00:12.127928 Watcher  ERROR [COM]: aRC=E_ACCESSDENIED (0x80070005) aIID={d0a0163f-e254-4e5b-a1f2-011cf991c38d} aComponent={VirtualBoxWrap} aText={The object is not ready}, preserve=false aResultDetail=0
00:00:16.780682 main     {00007f5e48016cf0} HostPowerServiceLinux::~HostPowerServiceLinux: RTThreadWait() for 5000 ms failed with VERR_TIMEOUT
00:00:16.781079 main     VirtualBox: object deleted
