00:00:00.008822 main     VirtualBox XPCOM Server 6.1.14 r140239 linux.amd64 (Sep  7 2020 21:01:30) release log
00:00:00.008826 main     Log opened 2020-09-24T13:27:22.962641000Z
00:00:00.008827 main     Build Type: release
00:00:00.008831 main     OS Product: Linux
00:00:00.008832 main     OS Release: 5.8.10-arch1-1
00:00:00.008843 main     OS Version: #1 SMP PREEMPT Thu, 17 Sep 2020 18:01:06 +0000
00:00:00.008876 main     DMI Product Name: 33543XG
00:00:00.008890 main     DMI Product Version: ThinkPad Edge E330
00:00:00.008902 main     Firmware type: BIOS
00:00:00.008960 main     Host RAM: 3384MB (3.3GB) total, 2995MB (2.9GB) available
00:00:00.008965 main     Executable: /usr/lib/virtualbox/VBoxSVC
00:00:00.008966 main     Process ID: 738
00:00:00.008967 main     Package type: LINUX_64BITS_GENERIC (OSE)
00:00:00.010962 main     IPC socket path: /tmp/.vbox-ed-ipc/ipcd
00:00:00.118137 nspr-2   VirtualBox: object creation starts
00:00:00.118278 nspr-2   Home directory: '/home/ed/.config/VirtualBox'
00:00:00.126687 nspr-2   Loading settings file "/home/ed/.config/VirtualBox/VirtualBox.xml" with version "1.12-linux"
00:00:00.149885 nspr-2   Successfully initialised host USB using sysfs
00:00:00.156185 nspr-2   NetIfAdpCtlOut: VBoxNetAdpCtl: Error while retrieving link speed for wlp3s0: VBoxNetAdpCtl: ioctl failed: Operation not supported
00:00:00.156733 nspr-2   HostDnsMonitor: initializing
00:00:00.157179 nspr-2   NAT: resolv.conf: nameserver 8.8.8.8
00:00:00.157196 nspr-2   NAT: resolv.conf: nameserver 4.4.4.4
00:00:00.157211 nspr-2   HostDnsMonitor: updating information
00:00:00.157228 nspr-2   HostDnsMonitor: old information
00:00:00.157232 nspr-2     no server entries
00:00:00.157237 nspr-2     no domain set
00:00:00.157240 nspr-2     no search string entries
00:00:00.157244 nspr-2   HostDnsMonitor: new information
00:00:00.157247 nspr-2     server 1: 8.8.8.8
00:00:00.157251 nspr-2     server 2: 4.4.4.4
00:00:00.157255 nspr-2     no domain set
00:00:00.157258 nspr-2     no search string entries
00:00:00.161861 nspr-2   VD: VDInit finished with VINF_SUCCESS
00:00:00.243363 nspr-2   Loading settings file "/home/ed/VirtualBox VMs/Debian/Debian.vbox" with version "1.16-linux"
00:00:00.279256 nspr-2   Loading settings file "/home/ed/VirtualBox VMs/Win-10/Win-10.vbox" with version "1.15-linux"
00:00:00.281368 nspr-2   OCI: Local config file '/home/ed/.config/VirtualBox/oci_config' does not exist
00:00:00.281401 nspr-2   OCI: Original config file '/home/ed/.oci/config' does not exist
00:00:00.281407 nspr-2   OCI: Reading profiles finished with status NS_OK
00:00:00.281416 nspr-2   ExtPack: Created cloud provider 'OCI' (hrc=NS_OK)
00:00:00.281438 nspr-2   VirtualBox: object created
00:00:07.464388 nspr-5   Launched VM: 603990448 pid: 766 (0x2fe) frontend: GUI/Qt name: Win-10
00:00:08.626582 nspr-3   Load [/usr/lib/virtualbox/ExtensionPacks/Oracle_VM_VirtualBox_Extension_Pack/linux.amd64/VBoxHostWebcam.so] vrc=VINF_SUCCESS
00:00:08.734856 nspr-3   ERROR [COM]: aRC=VBOX_E_IPRT_ERROR (0x80bb0005) aIID={85632c68-b5bb-4316-a900-5eb28d3413df} aComponent={SessionMachine} aText={Saved screenshot data is not available (VERR_NOT_SUPPORTED)}, preserve=false aResultDetail=-37
00:00:08.756440 nspr-4   NetIfAdpCtlOut: VBoxNetAdpCtl: Error while retrieving link speed for wlp3s0: VBoxNetAdpCtl: ioctl failed: Operation not supported
00:12:20.606130 nspr-7   Saving settings file "/home/ed/VirtualBox VMs/Win-10/Win-10.vbox" with version "1.15-linux"
00:21:47.878837 nspr-3   Launched VM: 402658560 pid: 1357 (0x54d) frontend: GUI/Qt name: Debian
00:21:48.834573 nspr-4   Load [/usr/lib/virtualbox/ExtensionPacks/Oracle_VM_VirtualBox_Extension_Pack/linux.amd64/VBoxHostWebcam.so] vrc=VINF_SUCCESS
00:21:48.936185 nspr-4   ERROR [COM]: aRC=VBOX_E_IPRT_ERROR (0x80bb0005) aIID={85632c68-b5bb-4316-a900-5eb28d3413df} aComponent={SessionMachine} aText={Saved screenshot data is not available (VERR_NOT_SUPPORTED)}, preserve=false aResultDetail=-37
00:21:48.989926 nspr-4   NetIfAdpCtlOut: VBoxNetAdpCtl: Error while retrieving link speed for wlp3s0: VBoxNetAdpCtl: ioctl failed: Operation not supported
00:24:09.470921 nspr-2   Saving settings file "/home/ed/VirtualBox VMs/Debian/Debian.vbox" with version "1.16-linux"
00:24:11.463935 nspr-6   Saving settings file "/home/ed/.config/VirtualBox/VirtualBox.xml" with version "1.12-linux"
00:24:11.529890 nspr-4   Saving settings file "/home/ed/.config/VirtualBox/VirtualBox.xml" with version "1.12-linux"
00:24:11.591609 nspr-5   Saving settings file "/home/ed/.config/VirtualBox/VirtualBox.xml" with version "1.12-linux"
