{
  "shell_port": 48665,
  "iopub_port": 43327,
  "stdin_port": 58655,
  "control_port": 56189,
  "hb_port": 37459,
  "ip": "127.0.0.1",
  "key": "7c086839-a823ee4d2ffcdf2446a2369c",
  "transport": "tcp",
  "signature_scheme": "hmac-sha256",
  "kernel_name": ""
}