{
  "base_url": "/",
  "hostname": "localhost",
  "notebook_dir": "/home/ed/Downloads",
  "password": false,
  "pid": 16354,
  "port": 8888,
  "secure": false,
  "sock": "",
  "token": "c51e6b5fe7d0bc43daeccd04f878d61a04f785a7f5654741",
  "url": "http://localhost:8888/"
}