<svg id="authy_logo" data-name="authy logo" xmlns="http://www.w3.org/2000/svg" width="24" height="24" viewBox="0 0 24 24">
  <metadata><?xpacket begin="﻿" id="W5M0MpCehiHzreSzNTczkc9d"?>
<x:xmpmeta xmlns:x="adobe:ns:meta/" x:xmptk="Adobe XMP Core 5.6-c138 79.159824, 2016/09/14-01:09:01        ">
   <rdf:RDF xmlns:rdf="http://www.w3.org/1999/02/22-rdf-syntax-ns#">
      <rdf:Description rdf:about=""/>
   </rdf:RDF>
</x:xmpmeta>
                                                                                                    
                                                                                                    
                                                                                                    
                                                                                                    
                                                                                                    
                                                                                                    
                                                                                                    
                                                                                                    
                                                                                                    
                                                                                                    
                                                                                                    
                                                                                                    
                                                                                                    
                                                                                                    
                                                                                                    
                                                                                                    
                                                                                                    
                                                                                                    
                                                                                                    
                                                                                                    
                           
<?xpacket end="w"?></metadata>
<defs>
    <style>
      .cls-1 {
        fill: #ec1c24;
      }

      .cls-1, .cls-2 {
        fill-rule: evenodd;
      }

      .cls-2 {
        fill: #fff;
      }
    </style>
  </defs>
  <path id="background" class="cls-1" d="M448,359a12,12,0,1,1-12-12,12,12,0,0,1,12,12h0Z" transform="translate(-424 -347)"/>
  <path id="shape" class="cls-2" d="M434.971,356.458l2.877,2.877a1.065,1.065,0,0,0,1.506-1.506l-2.877-2.877a5.379,5.379,0,0,0-7.489-.105c-0.02.017-.039,0.034-0.057,0.052s-0.017.019-.026,0.027-0.019.017-.027,0.026a0.662,0.662,0,0,0-.051.056,5.379,5.379,0,0,0,.1,7.49l2.878,2.877a1.065,1.065,0,0,0,1.506-1.506l-2.877-2.877A3.206,3.206,0,1,1,434.971,356.458Zm3.714-3.831a1.063,1.063,0,0,0,0,1.5l2.876,2.878a3.206,3.206,0,1,1-4.533,4.533l-2.878-2.877a1.065,1.065,0,0,0-1.506,1.506l2.877,2.877a5.378,5.378,0,0,0,7.489.105l0.058-.051,0.025-.028a0.229,0.229,0,0,0,.027-0.027,0.664,0.664,0,0,0,.051-0.055,5.379,5.379,0,0,0-.1-7.49l-2.878-2.876A1.063,1.063,0,0,0,438.685,352.627Z" transform="translate(-424 -347)"/>
</svg>
