<svg id="blue_background" data-name="blue background" xmlns="http://www.w3.org/2000/svg" xmlns:xlink="http://www.w3.org/1999/xlink" width="320" height="100" viewBox="0 0 320 100">
  <defs>
    <style>
      .cls-1 {
        fill: #325b78;
        fill-rule: evenodd;
      }

      .cls-2 {
        opacity: 0.24;
        mix-blend-mode: overlay;
        fill: url(#radial-gradient);
      }
    </style>
    <radialGradient id="radial-gradient" cx="156.5" cy="190.5" r="255.5" gradientUnits="userSpaceOnUse">
      <stop offset="0.5" stop-color="#fff"/>
      <stop offset="0.699" stop-color="#fff"/>
      <stop offset="1" stop-color="#fff" stop-opacity="0.051"/>
    </radialGradient>
  </defs>
  <path id="background" class="cls-1" d="M0,100.031V0H320V100Z"/>
  <circle id="top_glow" data-name="top glow" class="cls-2" cx="156.5" cy="190.5" r="255.5"/>
</svg>
