<svg id="warning_icon" data-name="warning icon" xmlns="http://www.w3.org/2000/svg" width="18" height="18" viewBox="0 0 18 18">
  <metadata><?xpacket begin="﻿" id="W5M0MpCehiHzreSzNTczkc9d"?>
<x:xmpmeta xmlns:x="adobe:ns:meta/" x:xmptk="Adobe XMP Core 5.6-c138 79.159824, 2016/09/14-01:09:01        ">
   <rdf:RDF xmlns:rdf="http://www.w3.org/1999/02/22-rdf-syntax-ns#">
      <rdf:Description rdf:about=""/>
   </rdf:RDF>
</x:xmpmeta>
                                                                                                    
                                                                                                    
                                                                                                    
                                                                                                    
                                                                                                    
                                                                                                    
                                                                                                    
                                                                                                    
                                                                                                    
                                                                                                    
                                                                                                    
                                                                                                    
                                                                                                    
                                                                                                    
                                                                                                    
                                                                                                    
                                                                                                    
                                                                                                    
                                                                                                    
                                                                                                    
                           
<?xpacket end="w"?></metadata>
<defs>
    <style>
      .cls-1 {
        fill: #ef9400;
      }

      .cls-2 {
        fill: #fff;
        fill-rule: evenodd;
      }
    </style>
  </defs>
  <circle id="orange_background" data-name="orange background" class="cls-1" cx="9" cy="9" r="9"/>
  <path id="_" data-name="!" class="cls-2" d="M434.26,337.187a1.326,1.326,0,0,1-2.64,0v-0.028a1.326,1.326,0,0,1,2.64,0v0.028Zm0.03-8.088-0.653,5.307a0.7,0.7,0,0,1-1.394,0l-0.653-5.31a0.6,0.6,0,0,1,.606-0.721h1.485a0.6,0.6,0,0,1,.609.724h0Z" transform="translate(-424 -324)"/>
</svg>
