00:00:01.275238 VirtualBox GUI VM Selector Window 6.1.14 r140239 linux.amd64 (Sep  7 2020 21:01:30) release log
00:00:01.275244 Log opened 2020-09-24T06:03:24.912979000Z
00:00:01.275246 Build Type: release
00:00:01.275250 OS Product: Linux
00:00:01.275253 OS Release: 5.8.10-arch1-1
00:00:01.275255 OS Version: #1 SMP PREEMPT Thu, 17 Sep 2020 18:01:06 +0000
00:00:01.275301 DMI Product Name: 33543XG
00:00:01.275323 DMI Product Version: ThinkPad Edge E330
00:00:01.275343 Firmware type: BIOS
00:00:01.275422 Host RAM: 3384MB (3.3GB) total, 2928MB (2.8GB) available
00:00:01.275428 Executable: /usr/lib/virtualbox/VirtualBox
00:00:01.275429 Process ID: 4500
00:00:01.275430 Package type: LINUX_64BITS_GENERIC (OSE)
00:00:01.275502 Qt version: 5.15.1
00:00:01.467525 GUI: UIMediumEnumerator: Medium-enumeration started...
00:00:04.115028 GUI: UIDesktopWidgetWatchdog::sltHandleHostScreenAvailableGeometryCalculated: Screen 0 work area is actually resized to: 0x18 x 1366x750
00:00:04.128649 GUI: UIMediumEnumerator: Medium-enumeration finished!
