00:00:00.010717 main     VirtualBox XPCOM Server 6.1.14 r140239 linux.amd64 (Sep  7 2020 21:01:30) release log
00:00:00.010719 main     Log opened 2020-09-23T09:50:22.329856000Z
00:00:00.010720 main     Build Type: release
00:00:00.010722 main     OS Product: Linux
00:00:00.010723 main     OS Release: 5.8.10-arch1-1
00:00:00.010724 main     OS Version: #1 SMP PREEMPT Thu, 17 Sep 2020 18:01:06 +0000
00:00:00.010742 main     DMI Product Name: 33543XG
00:00:00.010749 main     DMI Product Version: ThinkPad Edge E330
00:00:00.010760 main     Firmware type: BIOS
00:00:00.010795 main     Host RAM: 3384MB (3.3GB) total, 2994MB (2.9GB) available
00:00:00.010797 main     Executable: /usr/lib/virtualbox/VBoxSVC
00:00:00.010798 main     Process ID: 766
00:00:00.010798 main     Package type: LINUX_64BITS_GENERIC (OSE)
00:00:00.012875 main     IPC socket path: /tmp/.vbox-ed-ipc/ipcd
00:00:00.119844 nspr-2   VirtualBox: object creation starts
00:00:00.119987 nspr-2   Home directory: '/home/ed/.config/VirtualBox'
00:00:00.135554 nspr-2   Loading settings file "/home/ed/.config/VirtualBox/VirtualBox.xml" with version "1.12-linux"
00:00:00.156295 nspr-2   Successfully initialised host USB using sysfs
00:00:00.163024 nspr-2   NetIfAdpCtlOut: VBoxNetAdpCtl: Error while retrieving link speed for wlp3s0: VBoxNetAdpCtl: ioctl failed: Operation not supported
00:00:00.163615 nspr-2   HostDnsMonitor: initializing
00:00:00.163982 nspr-2   NAT: resolv.conf: nameserver 8.8.8.8
00:00:00.164006 nspr-2   NAT: resolv.conf: nameserver 4.4.4.4
00:00:00.164019 nspr-2   HostDnsMonitor: updating information
00:00:00.164036 nspr-2   HostDnsMonitor: old information
00:00:00.164041 nspr-2     no server entries
00:00:00.164045 nspr-2     no domain set
00:00:00.164049 nspr-2     no search string entries
00:00:00.164052 nspr-2   HostDnsMonitor: new information
00:00:00.164055 nspr-2     server 1: 8.8.8.8
00:00:00.164059 nspr-2     server 2: 4.4.4.4
00:00:00.164063 nspr-2     no domain set
00:00:00.164066 nspr-2     no search string entries
00:00:00.167223 nspr-2   VD: VDInit finished with VINF_SUCCESS
00:00:00.240865 nspr-2   Loading settings file "/home/ed/VirtualBox VMs/Debian/Debian.vbox" with version "1.16-linux"
00:00:00.268099 nspr-2   Loading settings file "/home/ed/VirtualBox VMs/Win-10/Win-10.vbox" with version "1.15-linux"
00:00:00.270220 nspr-2   OCI: Local config file '/home/ed/.config/VirtualBox/oci_config' does not exist
00:00:00.270268 nspr-2   OCI: Original config file '/home/ed/.oci/config' does not exist
00:00:00.270279 nspr-2   OCI: Reading profiles finished with status NS_OK
00:00:00.270292 nspr-2   ExtPack: Created cloud provider 'OCI' (hrc=NS_OK)
00:00:00.270325 nspr-2   VirtualBox: object created
00:00:10.186785 nspr-3   Launched VM: 134226832 pid: 795 (0x31b) frontend: GUI/Qt name: Win-10
00:00:11.290586 nspr-2   Load [/usr/lib/virtualbox/ExtensionPacks/Oracle_VM_VirtualBox_Extension_Pack/linux.amd64/VBoxHostWebcam.so] vrc=VINF_SUCCESS
00:00:11.399147 nspr-2   ERROR [COM]: aRC=VBOX_E_IPRT_ERROR (0x80bb0005) aIID={85632c68-b5bb-4316-a900-5eb28d3413df} aComponent={SessionMachine} aText={Saved screenshot data is not available (VERR_NOT_SUPPORTED)}, preserve=false aResultDetail=-37
00:00:11.428339 nspr-4   NetIfAdpCtlOut: VBoxNetAdpCtl: Error while retrieving link speed for wlp3s0: VBoxNetAdpCtl: ioctl failed: Operation not supported
00:16:23.677546 nspr-7   Saving settings file "/home/ed/VirtualBox VMs/Win-10/Win-10.vbox" with version "1.15-linux"
00:16:28.233521 nspr-4   Saving settings file "/home/ed/.config/VirtualBox/VirtualBox.xml" with version "1.12-linux"
00:16:28.330311 nspr-6   Saving settings file "/home/ed/.config/VirtualBox/VirtualBox.xml" with version "1.12-linux"
00:16:33.925302 main     VirtualBox: object deletion starts
00:16:33.925351 main     ERROR [COM]: aRC=VBOX_E_OBJECT_IN_USE (0x80bb000c) aIID={ad47ad09-787b-44ab-b343-a082a3f2dfb1} aComponent={MediumWrap} aText={Medium '/home/ed/VirtualBox VMs/Debian/Debian.vdi' cannot be closed because it is still attached to 1 virtual machines}, preserve=false aResultDetail=0
00:16:33.925544 main     ERROR [COM]: aRC=VBOX_E_OBJECT_IN_USE (0x80bb000c) aIID={ad47ad09-787b-44ab-b343-a082a3f2dfb1} aComponent={MediumWrap} aText={Medium '/home/ed/VirtualBox VMs/Win-10/Win-10.vdi' cannot be closed because it is still attached to 1 virtual machines}, preserve=false aResultDetail=0
00:16:33.926016 main     HostDnsMonitor: shutting down ...
00:16:33.929715 main     HostDnsMonitor: shut down
00:16:34.184526 Watcher  ERROR [COM]: aRC=E_ACCESSDENIED (0x80070005) aIID={d0a0163f-e254-4e5b-a1f2-011cf991c38d} aComponent={VirtualBoxWrap} aText={The object is not ready}, preserve=false aResultDetail=0
00:16:38.929995 main     {00007f810c016dc0} HostPowerServiceLinux::~HostPowerServiceLinux: RTThreadWait() for 5000 ms failed with VERR_TIMEOUT
00:16:38.930789 main     VirtualBox: object deleted
