00:00:01.775452 VirtualBox GUI VM Selector Window 6.1.14 r140239 linux.amd64 (Sep  7 2020 21:01:30) release log
00:00:01.775456 Log opened 2020-09-29T02:14:30.426378000Z
00:00:01.775458 Build Type: release
00:00:01.775462 OS Product: Linux
00:00:01.775464 OS Release: 5.8.12-arch1-1
00:00:01.775466 OS Version: #1 SMP PREEMPT Sat, 26 Sep 2020 21:42:58 +0000
00:00:01.775503 DMI Product Name: 33543XG
00:00:01.775520 DMI Product Version: ThinkPad Edge E330
00:00:01.775534 Firmware type: BIOS
00:00:01.775601 Host RAM: 3384MB (3.3GB) total, 2984MB (2.9GB) available
00:00:01.775606 Executable: /usr/lib/virtualbox/VirtualBox
00:00:01.775607 Process ID: 783
00:00:01.775608 Package type: LINUX_64BITS_GENERIC (OSE)
00:00:01.775656 Qt version: 5.15.1
00:00:02.215880 GUI: UIMediumEnumerator: Medium-enumeration started...
00:00:04.769951 GUI: UIDesktopWidgetWatchdog::sltHandleHostScreenAvailableGeometryCalculated: Screen 0 work area is actually resized to: 0x18 x 1366x750
00:00:04.789044 GUI: UIMediumEnumerator: Medium-enumeration finished!
