<svg xmlns="http://www.w3.org/2000/svg" width="14" height="11" viewBox="0 0 14 11">
  <path fill="#6E7783" d="M1,0 L5,0 C5.55228475,-1.01453063e-16 6,0.44771525 6,1 L6,4 C6,4.55228475 5.55228475,5 5,5 L1,5 C0.44771525,5 6.76353751e-17,4.55228475 0,4 L0,1 C-6.76353751e-17,0.44771525 0.44771525,1.01453063e-16 1,0 Z M1,6 L5,6 C5.55228475,6 6,6.44771525 6,7 L6,10 C6,10.5522847 5.55228475,11 5,11 L1,11 C0.44771525,11 6.76353751e-17,10.5522847 0,10 L0,7 C-6.76353751e-17,6.44771525 0.44771525,6 1,6 Z M9,0 L13,0 C13.5522847,-1.01453063e-16 14,0.44771525 14,1 L14,4 C14,4.55228475 13.5522847,5 13,5 L9,5 C8.44771525,5 8,4.55228475 8,4 L8,1 C8,0.44771525 8.44771525,1.01453063e-16 9,0 Z M9,6 L13,6 C13.5522847,6 14,6.44771525 14,7 L14,10 C14,10.5522847 13.5522847,11 13,11 L9,11 C8.44771525,11 8,10.5522847 8,10 L8,7 C8,6.44771525 8.44771525,6 9,6 Z"/>
</svg>
