<svg xmlns="http://www.w3.org/2000/svg" width="36" height="23" viewBox="0 0 36 23">
  <g fill="none">
    <path fill="#E7ECED" d="M34.0032414,23 L1.99675862,23 C0.893793103,23 0,22.2114286 0,21.2383095 L0,1.76169048 C0,0.788571429 0.893793103,0 1.99675862,0 L34.0032414,0 C35.1062069,0 36,0.788571429 36,1.76169048 L36,21.2383095 C36,22.2114286 35.1062069,23 34.0032414,23 Z"/>
    <path fill="#3B6E90" d="M13.6018571,15.4089048 L11.5389762,14.3552857 C11.3982381,14.2835476 11.3095238,14.1384286 11.3095238,13.9807143 L11.3095238,13.3493095 C12.3680714,12.8931429 12.9764762,12.0070952 13.2727381,10.8987143 C13.7190476,10.7601667 14.047619,10.3472619 14.047619,9.85714286 L14.047619,9.30952381 C14.047619,8.89004762 13.806119,8.52807143 13.4572857,8.34407143 C13.2157857,6.28447619 11.8544048,5.451 9.66666667,5.451 C9.56316667,5.451 9.46130952,5.45483333 9.36164286,5.46304762 C8.61797619,5.52219048 7.86554762,5.38254762 7.2467381,4.9652619 C6.98935714,4.79221429 6.77304762,4.60766667 6.62080952,4.41435714 C6.5512619,4.32619048 6.41271429,4.38259524 6.42530952,4.4937619 C6.44721429,4.68542857 6.48007143,4.90885714 6.5282619,5.15309524 C6.70897619,6.06214286 6.60109524,5.92961905 6.24952381,6.78719048 C6.05511905,7.26142857 5.92971429,7.78769048 5.87166667,8.34516667 C5.52557143,8.53080952 5.28571429,8.89169048 5.28571429,9.30952381 L5.28571429,9.85714286 C5.28571429,10.3472619 5.61428571,10.7601667 6.06059524,10.8987143 C6.35685714,12.0065476 6.96471429,12.8931429 8.02380952,13.3493095 L8.02380952,13.9763333 C8.02380952,14.1367857 7.93290476,14.283 7.78888095,14.3541905 L5.67452381,15.3952143 C5.09733333,15.7100952 4.73809524,16.3146667 4.73809524,16.9723571 L4.73809524,17.4739762 C4.73809524,17.4739762 4.73809524,17.6212857 4.73809524,17.6979524 C4.73809524,18.3167619 6.94445238,18.6190476 9.66666667,18.6190476 C12.388881,18.6190476 14.5952381,18.3167619 14.5952381,17.6979524 C14.5952381,17.6212857 14.5952381,17.4739762 14.5952381,17.4739762 L14.5952381,17.0161667 C14.5952381,16.3360238 14.2108095,15.713381 13.6018571,15.4089048 Z"/>
    <g fill="#AFB6BB" transform="translate(17.333 6.571)">
      <path d="M.547619048 1.0952381L6.02380952 1.0952381C6.32664286 1.0952381 6.57142857.850452381 6.57142857.547619048 6.57142857.244785714 6.32664286 0 6.02380952 0L.547619048 0C.244785714 0 0 .244785714 0 .547619048 0 .850452381.244785714 1.0952381.547619048 1.0952381zM8.21428571 1.0952381L8.76190476 1.0952381C9.0647381 1.0952381 9.30952381.850452381 9.30952381.547619048 9.30952381.244785714 9.0647381 0 8.76190476 0L8.21428571 0C7.91145238 0 7.66666667.244785714 7.66666667.547619048 7.66666667.850452381 7.91145238 1.0952381 8.21428571 1.0952381zM1.0952381 9.30952381L.547619048 9.30952381C.244785714 9.30952381 0 9.55430952 0 9.85714286 0 10.1599762.244785714 10.4047619.547619048 10.4047619L1.0952381 10.4047619C1.39807143 10.4047619 1.64285714 10.1599762 1.64285714 9.85714286 1.64285714 9.55430952 1.39807143 9.30952381 1.0952381 9.30952381zM4.38095238 9.30952381L3.28571429 9.30952381C2.98288095 9.30952381 2.73809524 9.55430952 2.73809524 9.85714286 2.73809524 10.1599762 2.98288095 10.4047619 3.28571429 10.4047619L4.38095238 10.4047619C4.68378571 10.4047619 4.92857143 10.1599762 4.92857143 9.85714286 4.92857143 9.55430952 4.68378571 9.30952381 4.38095238 9.30952381zM7.11904762 9.30952381L6.57142857 9.30952381C6.26859524 9.30952381 6.02380952 9.55430952 6.02380952 9.85714286 6.02380952 10.1599762 6.26859524 10.4047619 6.57142857 10.4047619L7.11904762 10.4047619C7.42188095 10.4047619 7.66666667 10.1599762 7.66666667 9.85714286 7.66666667 9.55430952 7.42188095 9.30952381 7.11904762 9.30952381zM10.4047619 9.30952381L9.30952381 9.30952381C9.00669048 9.30952381 8.76190476 9.55430952 8.76190476 9.85714286 8.76190476 10.1599762 9.00669048 10.4047619 9.30952381 10.4047619L10.4047619 10.4047619C10.7075952 10.4047619 10.952381 10.1599762 10.952381 9.85714286 10.952381 9.55430952 10.7075952 9.30952381 10.4047619 9.30952381zM12.2064286 9.46833333C12.1073095 9.57183333 12.047619 9.7147619 12.047619 9.85714286 12.047619 9.99952381 12.1073095 10.1419048 12.2064286 10.2459524 12.3099286 10.3445238 12.4528571 10.4047619 12.5952381 10.4047619 12.737619 10.4047619 12.88 10.3445238 12.9840476 10.2459524 13.082619 10.1419048 13.1428571 9.99952381 13.1428571 9.85714286 13.1428571 9.7147619 13.082619 9.57183333 12.9840476 9.46833333 12.7759524 9.26571429 12.4090476 9.26571429 12.2064286 9.46833333zM.547619048 4.38095238L12.5952381 4.38095238C12.8980714 4.38095238 13.1428571 4.13616667 13.1428571 3.83333333 13.1428571 3.5305 12.8980714 3.28571429 12.5952381 3.28571429L.547619048 3.28571429C.244785714 3.28571429 0 3.5305 0 3.83333333 0 4.13616667.244785714 4.38095238.547619048 4.38095238zM12.5952381 6.57142857L.547619048 6.57142857C.244785714 6.57142857 0 6.81621429 0 7.11904762 0 7.42188095.244785714 7.66666667.547619048 7.66666667L12.5952381 7.66666667C12.8980714 7.66666667 13.1428571 7.42188095 13.1428571 7.11904762 13.1428571 6.81621429 12.8980714 6.57142857 12.5952381 6.57142857z"/>
    </g>
  </g>
</svg>
