<svg id="synchronize_icon" xmlns="http://www.w3.org/2000/svg" xmlns:xlink="http://www.w3.org/1999/xlink" width="58" height="58" viewBox="0 0 58 58">
  <defs>
    <style>
      .cls-1 {
        fill: #fff;
      }

      .cls-2 {
        fill-rule: evenodd;
        fill: url(#linear-gradient);
      }
    </style>
    <linearGradient id="linear-gradient" x1="477" y1="252.888" x2="419" y2="305.112" gradientUnits="userSpaceOnUse">
      <stop offset="0" stop-color="#247eb9"/>
      <stop offset="0.964" stop-color="#ee5a3f"/>
      <stop offset="1" stop-color="#ee5a3f"/>
    </linearGradient>
  </defs>
  <circle id="white_background" data-name="white background" class="cls-1" cx="29" cy="29" r="29"/>
  <path id="icon_copy_2" data-name="icon copy 2" class="cls-2" d="M447.4,263.314c7.8,0,14.23,5.625,14.949,12.788l-5.691-3.849-0.82,1.051,8.062,5.272,4.114-7.713-1.239-.584L463.724,276c-0.776-7.832-7.8-13.987-16.326-13.987-9.044,0-16.4,6.922-16.4,15.43h1.386C432.384,269.65,439.118,263.314,447.4,263.314Zm1.214,32.392c-7.8,0-14.23-5.624-14.947-12.789l5.691,3.85,0.82-1.05-7.962-5.421-0.1.147L428,288.158l1.241,0.584,3.048-5.717c0.776,7.834,7.8,13.986,16.324,13.986,9.046,0,16.4-6.921,16.4-15.428h-1.386C463.628,289.371,456.892,295.706,448.612,295.706ZM448,250a29,29,0,1,1-29,29A29,29,0,0,1,448,250Zm0,1.624A27.376,27.376,0,1,1,420.624,279,27.376,27.376,0,0,1,448,251.624Z" transform="translate(-419 -250)"/>
</svg>
