00:00:00.000318 main     VirtualBox XPCOM Server 6.1.14 r140239 linux.amd64 (Sep  7 2020 21:01:30) release log
00:00:00.000320 main     Log opened 2020-09-29T08:45:11.894333000Z
00:00:00.000321 main     Build Type: release
00:00:00.000323 main     OS Product: Linux
00:00:00.000323 main     OS Release: 5.8.12-arch1-1
00:00:00.000324 main     OS Version: #1 SMP PREEMPT Sat, 26 Sep 2020 21:42:58 +0000
00:00:00.000341 main     DMI Product Name: 33543XG
00:00:00.000348 main     DMI Product Version: ThinkPad Edge E330
00:00:00.000356 main     Firmware type: BIOS
00:00:00.000385 main     Host RAM: 3384MB (3.3GB) total, 2542MB (2.4GB) available
00:00:00.000387 main     Executable: /usr/lib/virtualbox/VBoxSVC
00:00:00.000387 main     Process ID: 1945
00:00:00.000388 main     Package type: LINUX_64BITS_GENERIC (OSE)
00:00:00.001916 main     IPC socket path: /tmp/.vbox-ed-ipc/ipcd
00:00:00.109809 nspr-2   VirtualBox: object creation starts
00:00:00.109945 nspr-2   Home directory: '/home/ed/.config/VirtualBox'
00:00:00.126736 nspr-2   Loading settings file "/home/ed/.config/VirtualBox/VirtualBox.xml" with version "1.12-linux"
00:00:00.152182 nspr-2   Successfully initialised host USB using sysfs
00:00:00.156896 nspr-2   NetIfAdpCtlOut: VBoxNetAdpCtl: Error while retrieving link speed for wlp3s0: VBoxNetAdpCtl: ioctl failed: Operation not supported
00:00:00.157473 nspr-2   HostDnsMonitor: initializing
00:00:00.157862 nspr-2   NAT: resolv.conf: nameserver 8.8.8.8
00:00:00.157877 nspr-2   NAT: resolv.conf: nameserver 4.4.4.4
00:00:00.157895 nspr-2   HostDnsMonitor: updating information
00:00:00.157907 nspr-2   HostDnsMonitor: old information
00:00:00.157910 nspr-2     no server entries
00:00:00.157913 nspr-2     no domain set
00:00:00.157915 nspr-2     no search string entries
00:00:00.157918 nspr-2   HostDnsMonitor: new information
00:00:00.157920 nspr-2     server 1: 8.8.8.8
00:00:00.157923 nspr-2     server 2: 4.4.4.4
00:00:00.157925 nspr-2     no domain set
00:00:00.157928 nspr-2     no search string entries
00:00:00.161020 nspr-2   VD: VDInit finished with VINF_SUCCESS
00:00:00.221628 nspr-2   Loading settings file "/home/ed/VirtualBox VMs/Debian/Debian.vbox" with version "1.16-linux"
00:00:00.242658 nspr-2   Loading settings file "/home/ed/VirtualBox VMs/Win-10/Win-10.vbox" with version "1.15-linux"
00:00:00.244654 nspr-2   OCI: Local config file '/home/ed/.config/VirtualBox/oci_config' does not exist
00:00:00.244674 nspr-2   OCI: Original config file '/home/ed/.oci/config' does not exist
00:00:00.244678 nspr-2   OCI: Reading profiles finished with status NS_OK
00:00:00.244684 nspr-2   ExtPack: Created cloud provider 'OCI' (hrc=NS_OK)
00:00:00.244697 nspr-2   VirtualBox: object created
00:00:06.825594 nspr-5   Launched VM: 201332704 pid: 1974 (0x7b6) frontend: GUI/Qt name: Win-10
00:00:07.945851 nspr-2   Load [/usr/lib/virtualbox/ExtensionPacks/Oracle_VM_VirtualBox_Extension_Pack/linux.amd64/VBoxHostWebcam.so] vrc=VINF_SUCCESS
00:00:08.084158 nspr-5   ERROR [COM]: aRC=VBOX_E_IPRT_ERROR (0x80bb0005) aIID={85632c68-b5bb-4316-a900-5eb28d3413df} aComponent={SessionMachine} aText={Saved screenshot data is not available (VERR_NOT_SUPPORTED)}, preserve=false aResultDetail=-37
00:00:08.126447 nspr-2   NetIfAdpCtlOut: VBoxNetAdpCtl: Error while retrieving link speed for wlp3s0: VBoxNetAdpCtl: ioctl failed: Operation not supported
00:16:55.598107 nspr-5   Saving settings file "/home/ed/VirtualBox VMs/Win-10/Win-10.vbox" with version "1.15-linux"
00:17:05.924162 nspr-5   Saving settings file "/home/ed/.config/VirtualBox/VirtualBox.xml" with version "1.12-linux"
00:17:06.053903 nspr-4   Saving settings file "/home/ed/.config/VirtualBox/VirtualBox.xml" with version "1.12-linux"
00:17:11.760658 main     VirtualBox: object deletion starts
00:17:11.801446 main     ERROR [COM]: aRC=VBOX_E_OBJECT_IN_USE (0x80bb000c) aIID={ad47ad09-787b-44ab-b343-a082a3f2dfb1} aComponent={MediumWrap} aText={Medium '/home/ed/VirtualBox VMs/Debian/Debian.vdi' cannot be closed because it is still attached to 1 virtual machines}, preserve=false aResultDetail=0
00:17:11.818825 main     ERROR [COM]: aRC=VBOX_E_OBJECT_IN_USE (0x80bb000c) aIID={ad47ad09-787b-44ab-b343-a082a3f2dfb1} aComponent={MediumWrap} aText={Medium '/home/ed/VirtualBox VMs/Win-10/Win-10.vdi' cannot be closed because it is still attached to 1 virtual machines}, preserve=false aResultDetail=0
00:17:11.845892 main     HostDnsMonitor: shutting down ...
00:17:11.857863 main     HostDnsMonitor: shut down
00:17:11.985144 Watcher  ERROR [COM]: aRC=E_ACCESSDENIED (0x80070005) aIID={d0a0163f-e254-4e5b-a1f2-011cf991c38d} aComponent={VirtualBoxWrap} aText={The object is not ready}, preserve=false aResultDetail=0
00:17:16.858189 main     {00007fd9100171d0} HostPowerServiceLinux::~HostPowerServiceLinux: RTThreadWait() for 5000 ms failed with VERR_TIMEOUT
00:17:16.911432 main     VirtualBox: object deleted
