00:00:00.023533 main     VirtualBox XPCOM Server 6.1.14 r140239 linux.amd64 (Sep  7 2020 21:01:30) release log
00:00:00.023537 main     Log opened 2020-09-24T06:03:24.326524000Z
00:00:00.023538 main     Build Type: release
00:00:00.023542 main     OS Product: Linux
00:00:00.023543 main     OS Release: 5.8.10-arch1-1
00:00:00.023544 main     OS Version: #1 SMP PREEMPT Thu, 17 Sep 2020 18:01:06 +0000
00:00:00.023590 main     DMI Product Name: 33543XG
00:00:00.023606 main     DMI Product Version: ThinkPad Edge E330
00:00:00.023618 main     Firmware type: BIOS
00:00:00.023687 main     Host RAM: 3384MB (3.3GB) total, 2931MB (2.8GB) available
00:00:00.023690 main     Executable: /usr/lib/virtualbox/VBoxSVC
00:00:00.023691 main     Process ID: 4528
00:00:00.023691 main     Package type: LINUX_64BITS_GENERIC (OSE)
00:00:00.025342 main     IPC socket path: /tmp/.vbox-ed-ipc/ipcd
00:00:00.145740 nspr-2   VirtualBox: object creation starts
00:00:00.145834 nspr-2   Home directory: '/home/ed/.config/VirtualBox'
00:00:00.165976 nspr-2   Loading settings file "/home/ed/.config/VirtualBox/VirtualBox.xml" with version "1.12-linux"
00:00:00.191521 nspr-2   Successfully initialised host USB using sysfs
00:00:00.198965 nspr-2   NetIfAdpCtlOut: VBoxNetAdpCtl: Error while retrieving link speed for wlp3s0: VBoxNetAdpCtl: ioctl failed: Operation not supported
00:00:00.199463 nspr-2   HostDnsMonitor: initializing
00:00:00.199950 nspr-2   NAT: resolv.conf: nameserver 8.8.8.8
00:00:00.199971 nspr-2   NAT: resolv.conf: nameserver 4.4.4.4
00:00:00.199988 nspr-2   HostDnsMonitor: updating information
00:00:00.200009 nspr-2   HostDnsMonitor: old information
00:00:00.200015 nspr-2     no server entries
00:00:00.200019 nspr-2     no domain set
00:00:00.200023 nspr-2     no search string entries
00:00:00.200027 nspr-2   HostDnsMonitor: new information
00:00:00.200031 nspr-2     server 1: 8.8.8.8
00:00:00.200035 nspr-2     server 2: 4.4.4.4
00:00:00.200039 nspr-2     no domain set
00:00:00.200043 nspr-2     no search string entries
00:00:00.253703 nspr-2   VD: VDInit finished with VINF_SUCCESS
00:00:00.345581 nspr-2   Loading settings file "/home/ed/VirtualBox VMs/Debian/Debian.vbox" with version "1.16-linux"
00:00:00.399015 nspr-2   Loading settings file "/home/ed/VirtualBox VMs/Win-10/Win-10.vbox" with version "1.15-linux"
00:00:00.429335 nspr-2   OCI: Local config file '/home/ed/.config/VirtualBox/oci_config' does not exist
00:00:00.429381 nspr-2   OCI: Original config file '/home/ed/.oci/config' does not exist
00:00:00.429392 nspr-2   OCI: Reading profiles finished with status NS_OK
00:00:00.429413 nspr-2   ExtPack: Created cloud provider 'OCI' (hrc=NS_OK)
00:00:00.429446 nspr-2   VirtualBox: object created
00:00:05.924768 nspr-5   Launched VM: 4160759024 pid: 4556 (0x11cc) frontend: GUI/Qt name: Win-10
00:00:07.103497 nspr-2   Load [/usr/lib/virtualbox/ExtensionPacks/Oracle_VM_VirtualBox_Extension_Pack/linux.amd64/VBoxHostWebcam.so] vrc=VINF_SUCCESS
00:00:07.288208 nspr-2   ERROR [COM]: aRC=VBOX_E_IPRT_ERROR (0x80bb0005) aIID={85632c68-b5bb-4316-a900-5eb28d3413df} aComponent={SessionMachine} aText={Saved screenshot data is not available (VERR_NOT_SUPPORTED)}, preserve=false aResultDetail=-37
00:00:07.323237 nspr-3   NetIfAdpCtlOut: VBoxNetAdpCtl: Error while retrieving link speed for wlp3s0: VBoxNetAdpCtl: ioctl failed: Operation not supported
00:34:07.158234 nspr-3   Saving settings file "/home/ed/VirtualBox VMs/Win-10/Win-10.vbox" with version "1.15-linux"
00:34:13.712285 nspr-6   Saving settings file "/home/ed/.config/VirtualBox/VirtualBox.xml" with version "1.12-linux"
00:34:13.789413 nspr-5   Saving settings file "/home/ed/.config/VirtualBox/VirtualBox.xml" with version "1.12-linux"
00:34:19.352306 main     VirtualBox: object deletion starts
00:34:19.352372 main     ERROR [COM]: aRC=VBOX_E_OBJECT_IN_USE (0x80bb000c) aIID={ad47ad09-787b-44ab-b343-a082a3f2dfb1} aComponent={MediumWrap} aText={Medium '/home/ed/VirtualBox VMs/Debian/Debian.vdi' cannot be closed because it is still attached to 1 virtual machines}, preserve=false aResultDetail=0
00:34:19.352629 main     ERROR [COM]: aRC=VBOX_E_OBJECT_IN_USE (0x80bb000c) aIID={ad47ad09-787b-44ab-b343-a082a3f2dfb1} aComponent={MediumWrap} aText={Medium '/home/ed/VirtualBox VMs/Win-10/Win-10.vdi' cannot be closed because it is still attached to 1 virtual machines}, preserve=false aResultDetail=0
00:34:19.376831 main     HostDnsMonitor: shutting down ...
00:34:19.388923 main     HostDnsMonitor: shut down
00:34:19.728675 Watcher  ERROR [COM]: aRC=E_ACCESSDENIED (0x80070005) aIID={d0a0163f-e254-4e5b-a1f2-011cf991c38d} aComponent={VirtualBoxWrap} aText={The object is not ready}, preserve=false aResultDetail=0
00:34:24.389156 main     {00007f18fc016dc0} HostPowerServiceLinux::~HostPowerServiceLinux: RTThreadWait() for 5000 ms failed with VERR_TIMEOUT
00:34:24.389857 main     VirtualBox: object deleted
