00:00:00.025784 main     VirtualBox XPCOM Server 6.1.14 r140239 linux.amd64 (Sep  7 2020 21:01:30) release log
00:00:00.025798 main     Log opened 2020-09-30T16:49:40.224630000Z
00:00:00.025800 main     Build Type: release
00:00:00.025806 main     OS Product: Linux
00:00:00.025809 main     OS Release: 5.8.12-arch1-1
00:00:00.025811 main     OS Version: #1 SMP PREEMPT Sat, 26 Sep 2020 21:42:58 +0000
00:00:00.025941 main     DMI Product Name: 33543XG
00:00:00.025966 main     DMI Product Version: ThinkPad Edge E330
00:00:00.025995 main     Firmware type: BIOS
00:00:00.026075 main     Host RAM: 3384MB (3.3GB) total, 2271MB (2.2GB) available
00:00:00.026083 main     Executable: /usr/lib/virtualbox/VBoxSVC
00:00:00.026084 main     Process ID: 7165
00:00:00.026086 main     Package type: LINUX_64BITS_GENERIC (OSE)
00:00:00.029795 main     IPC socket path: /tmp/.vbox-ed-ipc/ipcd
00:00:00.168483 nspr-2   VirtualBox: object creation starts
00:00:00.168676 nspr-2   Home directory: '/home/ed/.config/VirtualBox'
00:00:00.199959 nspr-2   Loading settings file "/home/ed/.config/VirtualBox/VirtualBox.xml" with version "1.12-linux"
00:00:00.232705 nspr-2   Successfully initialised host USB using sysfs
00:00:00.247939 nspr-2   NetIfAdpCtlOut: VBoxNetAdpCtl: Error while retrieving link speed for wlp3s0: VBoxNetAdpCtl: ioctl failed: Operation not supported
00:00:00.262251 nspr-2   HostDnsMonitor: initializing
00:00:00.262699 nspr-2   NAT: resolv.conf: nameserver 8.8.8.8
00:00:00.262735 nspr-2   NAT: resolv.conf: nameserver 4.4.4.4
00:00:00.262760 nspr-2   HostDnsMonitor: updating information
00:00:00.262797 nspr-2   HostDnsMonitor: old information
00:00:00.262805 nspr-2     no server entries
00:00:00.262812 nspr-2     no domain set
00:00:00.262818 nspr-2     no search string entries
00:00:00.262824 nspr-2   HostDnsMonitor: new information
00:00:00.262829 nspr-2     server 1: 8.8.8.8
00:00:00.262836 nspr-2     server 2: 4.4.4.4
00:00:00.262843 nspr-2     no domain set
00:00:00.262848 nspr-2     no search string entries
00:00:00.381272 nspr-2   VD: VDInit finished with VINF_SUCCESS
00:00:00.493821 nspr-2   Loading settings file "/home/ed/VirtualBox VMs/Debian/Debian.vbox" with version "1.16-linux"
00:00:00.559244 nspr-2   Loading settings file "/home/ed/VirtualBox VMs/Win-10/Win-10.vbox" with version "1.15-linux"
00:00:00.602230 nspr-2   OCI: Local config file '/home/ed/.config/VirtualBox/oci_config' does not exist
00:00:00.602320 nspr-2   OCI: Original config file '/home/ed/.oci/config' does not exist
00:00:00.602336 nspr-2   OCI: Reading profiles finished with status NS_OK
00:00:00.602357 nspr-2   ExtPack: Created cloud provider 'OCI' (hrc=NS_OK)
00:00:00.602416 nspr-2   VirtualBox: object created
00:00:08.256049 nspr-3   Launched VM: 3892325408 pid: 7195 (0x1c1b) frontend: GUI/Qt name: Debian
00:00:09.434764 nspr-4   Load [/usr/lib/virtualbox/ExtensionPacks/Oracle_VM_VirtualBox_Extension_Pack/linux.amd64/VBoxHostWebcam.so] vrc=VINF_SUCCESS
00:00:09.593459 nspr-5   ERROR [COM]: aRC=VBOX_E_IPRT_ERROR (0x80bb0005) aIID={85632c68-b5bb-4316-a900-5eb28d3413df} aComponent={SessionMachine} aText={Saved screenshot data is not available (VERR_NOT_SUPPORTED)}, preserve=false aResultDetail=-37
00:00:09.618014 nspr-6   NetIfAdpCtlOut: VBoxNetAdpCtl: Error while retrieving link speed for wlp3s0: VBoxNetAdpCtl: ioctl failed: Operation not supported
00:47:16.898309 nspr-3   Saving settings file "/home/ed/VirtualBox VMs/Debian/Debian.vbox" with version "1.16-linux"
00:47:24.844590 nspr-7   Saving settings file "/home/ed/.config/VirtualBox/VirtualBox.xml" with version "1.12-linux"
00:47:24.901684 nspr-2   Saving settings file "/home/ed/.config/VirtualBox/VirtualBox.xml" with version "1.12-linux"
00:47:24.960317 nspr-6   Saving settings file "/home/ed/.config/VirtualBox/VirtualBox.xml" with version "1.12-linux"
00:47:30.529926 main     VirtualBox: object deletion starts
00:47:30.529994 main     ERROR [COM]: aRC=VBOX_E_OBJECT_IN_USE (0x80bb000c) aIID={ad47ad09-787b-44ab-b343-a082a3f2dfb1} aComponent={MediumWrap} aText={Medium '/home/ed/VirtualBox VMs/Debian/Debian.vdi' cannot be closed because it is still attached to 1 virtual machines}, preserve=false aResultDetail=0
00:47:30.530152 main     ERROR [COM]: aRC=VBOX_E_OBJECT_IN_USE (0x80bb000c) aIID={ad47ad09-787b-44ab-b343-a082a3f2dfb1} aComponent={MediumWrap} aText={Medium '/home/ed/VirtualBox VMs/Win-10/Win-10.vdi' cannot be closed because it is still attached to 1 virtual machines}, preserve=false aResultDetail=0
00:47:30.556526 main     HostDnsMonitor: shutting down ...
00:47:30.568635 main     HostDnsMonitor: shut down
00:47:30.907940 Watcher  ERROR [COM]: aRC=E_ACCESSDENIED (0x80070005) aIID={d0a0163f-e254-4e5b-a1f2-011cf991c38d} aComponent={VirtualBoxWrap} aText={The object is not ready}, preserve=false aResultDetail=0
00:47:35.569103 main     {00007ff1ec016ad0} HostPowerServiceLinux::~HostPowerServiceLinux: RTThreadWait() for 5000 ms failed with VERR_TIMEOUT
00:47:35.569771 main     VirtualBox: object deleted
