<svg xmlns="http://www.w3.org/2000/svg" width="27" height="14" viewBox="0 0 27 14">
  <defs>
    <style>
      .cls-1 {
        fill: #f05636;
        fill-rule: evenodd;
      }
    </style>
  </defs>
  <path id="Upload_button" data-name="Upload button" class="cls-1" d="M1571,108l-13.5-14L1544,108h27Z" transform="translate(-1544 -94)"/>
</svg>
