{
  "shell_port": 43533,
  "iopub_port": 52227,
  "stdin_port": 38307,
  "control_port": 54227,
  "hb_port": 42135,
  "ip": "127.0.0.1",
  "key": "982c31b8-a5c719a02560d3a5a057e385",
  "transport": "tcp",
  "signature_scheme": "hmac-sha256",
  "kernel_name": ""
}