00:00:01.753869 VirtualBox GUI VM Selector Window 6.1.14 r140239 linux.amd64 (Sep  7 2020 21:01:30) release log
00:00:01.753873 Log opened 2020-09-29T08:45:12.466701000Z
00:00:01.753875 Build Type: release
00:00:01.753879 OS Product: Linux
00:00:01.753881 OS Release: 5.8.12-arch1-1
00:00:01.753883 OS Version: #1 SMP PREEMPT Sat, 26 Sep 2020 21:42:58 +0000
00:00:01.753918 DMI Product Name: 33543XG
00:00:01.753935 DMI Product Version: ThinkPad Edge E330
00:00:01.753951 Firmware type: BIOS
00:00:01.754018 Host RAM: 3384MB (3.3GB) total, 2539MB (2.4GB) available
00:00:01.754023 Executable: /usr/lib/virtualbox/VirtualBox
00:00:01.754025 Process ID: 1918
00:00:01.754026 Package type: LINUX_64BITS_GENERIC (OSE)
00:00:01.754077 Qt version: 5.15.1
00:00:02.172218 GUI: UIMediumEnumerator: Medium-enumeration started...
00:00:04.654773 GUI: UIDesktopWidgetWatchdog::sltHandleHostScreenAvailableGeometryCalculated: Screen 0 work area is actually resized to: 0x18 x 1366x750
00:00:04.679639 GUI: UIMediumEnumerator: Medium-enumeration finished!
