00:00:02.126758 VirtualBox GUI VM Selector Window 6.1.14 r140239 linux.amd64 (Sep  7 2020 21:01:30) release log
00:00:02.126761 Log opened 2020-09-26T10:10:11.270045000Z
00:00:02.126761 Build Type: release
00:00:02.126764 OS Product: Linux
00:00:02.126765 OS Release: 5.8.10-arch1-1
00:00:02.126766 OS Version: #1 SMP PREEMPT Thu, 17 Sep 2020 18:01:06 +0000
00:00:02.126787 DMI Product Name: 33543XG
00:00:02.126797 DMI Product Version: ThinkPad Edge E330
00:00:02.126806 Firmware type: BIOS
00:00:02.126845 Host RAM: 3384MB (3.3GB) total, 2902MB (2.8GB) available
00:00:02.126849 Executable: /usr/lib/virtualbox/VirtualBox
00:00:02.126849 Process ID: 6614
00:00:02.126850 Package type: LINUX_64BITS_GENERIC (OSE)
00:00:02.126883 Qt version: 5.15.1
00:00:02.407874 GUI: UIMediumEnumerator: Medium-enumeration started...
00:00:04.738644 GUI: UIDesktopWidgetWatchdog::sltHandleHostScreenAvailableGeometryCalculated: Screen 0 work area is actually resized to: 0x18 x 1366x750
00:00:04.767744 GUI: UIMediumEnumerator: Medium-enumeration finished!
00:27:08.065803 GUI: UIDesktopWidgetWatchdog::sltHandleHostScreenWorkAreaResized: Screen 0 work area is formally resized to: 0x20 x 1366x748
00:27:08.102479 GUI: UIDesktopWidgetWatchdog::sltHandleHostScreenAvailableGeometryCalculated: Screen 0 work area is actually resized to: 0x20 x 1366x748
00:27:10.981048 GUI: UIDesktopWidgetWatchdog::sltHandleHostScreenWorkAreaResized: Screen 0 work area is formally resized to: 0x18 x 1366x750
00:27:10.992369 GUI: UIDesktopWidgetWatchdog::sltHandleHostScreenAvailableGeometryCalculated: Screen 0 work area is actually resized to: 0x18 x 1366x750
