00:00:00.021157 main     VirtualBox XPCOM Server 6.1.14 r140239 linux.amd64 (Sep  7 2020 21:01:30) release log
00:00:00.021163 main     Log opened 2020-09-26T10:10:10.640980000Z
00:00:00.021164 main     Build Type: release
00:00:00.021170 main     OS Product: Linux
00:00:00.021172 main     OS Release: 5.8.10-arch1-1
00:00:00.021174 main     OS Version: #1 SMP PREEMPT Thu, 17 Sep 2020 18:01:06 +0000
00:00:00.021236 main     DMI Product Name: 33543XG
00:00:00.021280 main     DMI Product Version: ThinkPad Edge E330
00:00:00.021301 main     Firmware type: BIOS
00:00:00.021380 main     Host RAM: 3384MB (3.3GB) total, 2906MB (2.8GB) available
00:00:00.021386 main     Executable: /usr/lib/virtualbox/VBoxSVC
00:00:00.021388 main     Process ID: 6641
00:00:00.021389 main     Package type: LINUX_64BITS_GENERIC (OSE)
00:00:00.024825 main     IPC socket path: /tmp/.vbox-ed-ipc/ipcd
00:00:00.136164 nspr-2   VirtualBox: object creation starts
00:00:00.136304 nspr-2   Home directory: '/home/ed/.config/VirtualBox'
00:00:00.145922 nspr-2   Loading settings file "/home/ed/.config/VirtualBox/VirtualBox.xml" with version "1.12-linux"
00:00:00.172531 nspr-2   Successfully initialised host USB using sysfs
00:00:00.180142 nspr-2   NetIfAdpCtlOut: VBoxNetAdpCtl: Error while retrieving link speed for wlp3s0: VBoxNetAdpCtl: ioctl failed: Operation not supported
00:00:00.180847 nspr-2   HostDnsMonitor: initializing
00:00:00.181324 nspr-2   NAT: resolv.conf: nameserver 8.8.8.8
00:00:00.181339 nspr-2   NAT: resolv.conf: nameserver 4.4.4.4
00:00:00.181349 nspr-2   HostDnsMonitor: updating information
00:00:00.181365 nspr-2   HostDnsMonitor: old information
00:00:00.181368 nspr-2     no server entries
00:00:00.181372 nspr-2     no domain set
00:00:00.181374 nspr-2     no search string entries
00:00:00.181377 nspr-2   HostDnsMonitor: new information
00:00:00.181380 nspr-2     server 1: 8.8.8.8
00:00:00.181383 nspr-2     server 2: 4.4.4.4
00:00:00.181386 nspr-2     no domain set
00:00:00.181388 nspr-2     no search string entries
00:00:00.215754 nspr-2   VD: VDInit finished with VINF_SUCCESS
00:00:00.436065 nspr-2   Loading settings file "/home/ed/VirtualBox VMs/Debian/Debian.vbox" with version "1.16-linux"
00:00:00.496141 nspr-2   Loading settings file "/home/ed/VirtualBox VMs/Win-10/Win-10.vbox" with version "1.15-linux"
00:00:00.515793 nspr-2   OCI: Local config file '/home/ed/.config/VirtualBox/oci_config' does not exist
00:00:00.515844 nspr-2   OCI: Original config file '/home/ed/.oci/config' does not exist
00:00:00.515853 nspr-2   OCI: Reading profiles finished with status NS_OK
00:00:00.515866 nspr-2   ExtPack: Created cloud provider 'OCI' (hrc=NS_OK)
00:00:00.515900 nspr-2   VirtualBox: object created
00:00:08.896044 nspr-3   Launched VM: 1543509792 pid: 6670 (0x1a0e) frontend: GUI/Qt name: Win-10
00:00:10.091398 nspr-2   Load [/usr/lib/virtualbox/ExtensionPacks/Oracle_VM_VirtualBox_Extension_Pack/linux.amd64/VBoxHostWebcam.so] vrc=VINF_SUCCESS
00:00:10.257838 nspr-2   ERROR [COM]: aRC=VBOX_E_IPRT_ERROR (0x80bb0005) aIID={85632c68-b5bb-4316-a900-5eb28d3413df} aComponent={SessionMachine} aText={Saved screenshot data is not available (VERR_NOT_SUPPORTED)}, preserve=false aResultDetail=-37
00:00:10.287981 nspr-6   NetIfAdpCtlOut: VBoxNetAdpCtl: Error while retrieving link speed for wlp3s0: VBoxNetAdpCtl: ioctl failed: Operation not supported
00:20:46.559029 nspr-3   Saving settings file "/home/ed/VirtualBox VMs/Win-10/Win-10.vbox" with version "1.15-linux"
00:31:38.937402 nspr-4   Saving settings file "/home/ed/.config/VirtualBox/VirtualBox.xml" with version "1.12-linux"
00:31:39.052215 nspr-7   Saving settings file "/home/ed/.config/VirtualBox/VirtualBox.xml" with version "1.12-linux"
00:31:39.108915 nspr-5   Saving settings file "/home/ed/.config/VirtualBox/VirtualBox.xml" with version "1.12-linux"
00:31:44.682661 main     VirtualBox: object deletion starts
00:31:44.682753 main     ERROR [COM]: aRC=VBOX_E_OBJECT_IN_USE (0x80bb000c) aIID={ad47ad09-787b-44ab-b343-a082a3f2dfb1} aComponent={MediumWrap} aText={Medium '/home/ed/VirtualBox VMs/Debian/Debian.vdi' cannot be closed because it is still attached to 1 virtual machines}, preserve=false aResultDetail=0
00:31:44.683094 main     ERROR [COM]: aRC=VBOX_E_OBJECT_IN_USE (0x80bb000c) aIID={ad47ad09-787b-44ab-b343-a082a3f2dfb1} aComponent={MediumWrap} aText={Medium '/home/ed/VirtualBox VMs/Win-10/Win-10.vdi' cannot be closed because it is still attached to 1 virtual machines}, preserve=false aResultDetail=0
00:31:44.717796 main     HostDnsMonitor: shutting down ...
00:31:44.724405 main     HostDnsMonitor: shut down
00:31:44.789316 Watcher  ERROR [COM]: aRC=E_ACCESSDENIED (0x80070005) aIID={d0a0163f-e254-4e5b-a1f2-011cf991c38d} aComponent={VirtualBoxWrap} aText={The object is not ready}, preserve=false aResultDetail=0
00:31:49.725062 main     {00007f7760016ad0} HostPowerServiceLinux::~HostPowerServiceLinux: RTThreadWait() for 5000 ms failed with VERR_TIMEOUT
00:31:49.725970 main     VirtualBox: object deleted
