{
  "base_url": "/",
  "hostname": "localhost",
  "notebook_dir": "/home/ed",
  "password": false,
  "pid": 12359,
  "port": 8888,
  "secure": false,
  "sock": "",
  "token": "a244cae263db3c57707ba499bc14c1d304c3f6bcefef43ab",
  "url": "http://localhost:8888/"
}