00:00:00.008195 main     VirtualBox XPCOM Server 6.1.14 r140239 linux.amd64 (Sep  7 2020 21:01:30) release log
00:00:00.008198 main     Log opened 2020-10-01T15:41:59.455352000Z
00:00:00.008198 main     Build Type: release
00:00:00.008203 main     OS Product: Linux
00:00:00.008204 main     OS Release: 5.8.12-arch1-1
00:00:00.008205 main     OS Version: #1 SMP PREEMPT Sat, 26 Sep 2020 21:42:58 +0000
00:00:00.008222 main     DMI Product Name: 33543XG
00:00:00.008229 main     DMI Product Version: ThinkPad Edge E330
00:00:00.008236 main     Firmware type: BIOS
00:00:00.008267 main     Host RAM: 3384MB (3.3GB) total, 2859MB (2.7GB) available
00:00:00.008270 main     Executable: /usr/lib/virtualbox/VBoxSVC
00:00:00.008270 main     Process ID: 960
00:00:00.008271 main     Package type: LINUX_64BITS_GENERIC (OSE)
00:00:00.009830 main     IPC socket path: /tmp/.vbox-ed-ipc/ipcd
00:00:00.115985 nspr-2   VirtualBox: object creation starts
00:00:00.116065 nspr-2   Home directory: '/home/ed/.config/VirtualBox'
00:00:00.132250 nspr-2   Loading settings file "/home/ed/.config/VirtualBox/VirtualBox.xml" with version "1.12-linux"
00:00:00.152451 nspr-2   Successfully initialised host USB using sysfs
00:00:00.159858 nspr-2   NetIfAdpCtlOut: VBoxNetAdpCtl: Error while retrieving link speed for wlp3s0: VBoxNetAdpCtl: ioctl failed: Operation not supported
00:00:00.160412 nspr-2   HostDnsMonitor: initializing
00:00:00.160737 nspr-2   NAT: resolv.conf: nameserver 8.8.8.8
00:00:00.160760 nspr-2   NAT: resolv.conf: nameserver 4.4.4.4
00:00:00.160772 nspr-2   HostDnsMonitor: updating information
00:00:00.160787 nspr-2   HostDnsMonitor: old information
00:00:00.160791 nspr-2     no server entries
00:00:00.160795 nspr-2     no domain set
00:00:00.160798 nspr-2     no search string entries
00:00:00.160801 nspr-2   HostDnsMonitor: new information
00:00:00.160804 nspr-2     server 1: 8.8.8.8
00:00:00.160807 nspr-2     server 2: 4.4.4.4
00:00:00.160810 nspr-2     no domain set
00:00:00.160813 nspr-2     no search string entries
00:00:00.164374 nspr-2   VD: VDInit finished with VINF_SUCCESS
00:00:00.235687 nspr-2   Loading settings file "/home/ed/VirtualBox VMs/Debian/Debian.vbox" with version "1.16-linux"
00:00:00.269337 nspr-2   Loading settings file "/home/ed/VirtualBox VMs/Win-10/Win-10.vbox" with version "1.15-linux"
00:00:00.271363 nspr-2   OCI: Local config file '/home/ed/.config/VirtualBox/oci_config' does not exist
00:00:00.271405 nspr-2   OCI: Original config file '/home/ed/.oci/config' does not exist
00:00:00.271415 nspr-2   OCI: Reading profiles finished with status NS_OK
00:00:00.271428 nspr-2   ExtPack: Created cloud provider 'OCI' (hrc=NS_OK)
00:00:00.271462 nspr-2   VirtualBox: object created
00:00:11.699764 nspr-2   Launched VM: 2550147936 pid: 989 (0x3dd) frontend: GUI/Qt name: Win-10
00:00:12.803421 nspr-4   Load [/usr/lib/virtualbox/ExtensionPacks/Oracle_VM_VirtualBox_Extension_Pack/linux.amd64/VBoxHostWebcam.so] vrc=VINF_SUCCESS
00:00:12.911594 nspr-4   ERROR [COM]: aRC=VBOX_E_IPRT_ERROR (0x80bb0005) aIID={85632c68-b5bb-4316-a900-5eb28d3413df} aComponent={SessionMachine} aText={Saved screenshot data is not available (VERR_NOT_SUPPORTED)}, preserve=false aResultDetail=-37
00:00:12.946365 nspr-6   NetIfAdpCtlOut: VBoxNetAdpCtl: Error while retrieving link speed for wlp3s0: VBoxNetAdpCtl: ioctl failed: Operation not supported
00:24:03.457821 nspr-9   Saving settings file "/home/ed/VirtualBox VMs/Win-10/Win-10.vbox" with version "1.15-linux"
00:24:09.045568 nspr-8   Saving settings file "/home/ed/.config/VirtualBox/VirtualBox.xml" with version "1.12-linux"
00:24:09.161892 nspr-3   Saving settings file "/home/ed/.config/VirtualBox/VirtualBox.xml" with version "1.12-linux"
00:24:09.247976 nspr-9   Saving settings file "/home/ed/.config/VirtualBox/VirtualBox.xml" with version "1.12-linux"
00:24:09.317726 nspr-5   Saving settings file "/home/ed/.config/VirtualBox/VirtualBox.xml" with version "1.12-linux"
00:24:14.957458 main     VirtualBox: object deletion starts
00:24:14.957582 main     ERROR [COM]: aRC=VBOX_E_OBJECT_IN_USE (0x80bb000c) aIID={ad47ad09-787b-44ab-b343-a082a3f2dfb1} aComponent={MediumWrap} aText={Medium '/home/ed/VirtualBox VMs/Debian/Debian.vdi' cannot be closed because it is still attached to 1 virtual machines}, preserve=false aResultDetail=0
00:24:14.957941 main     ERROR [COM]: aRC=VBOX_E_OBJECT_IN_USE (0x80bb000c) aIID={ad47ad09-787b-44ab-b343-a082a3f2dfb1} aComponent={MediumWrap} aText={Medium '/home/ed/VirtualBox VMs/Win-10/Win-10.vdi' cannot be closed because it is still attached to 1 virtual machines}, preserve=false aResultDetail=0
00:24:14.966771 Watcher  ERROR [COM]: aRC=E_ACCESSDENIED (0x80070005) aIID={d0a0163f-e254-4e5b-a1f2-011cf991c38d} aComponent={VirtualBoxWrap} aText={The object is not ready}, preserve=false aResultDetail=0
00:24:14.975915 main     HostDnsMonitor: shutting down ...
00:24:14.982047 main     HostDnsMonitor: shut down
00:24:19.982477 main     {00007f0c9c016dc0} HostPowerServiceLinux::~HostPowerServiceLinux: RTThreadWait() for 5000 ms failed with VERR_TIMEOUT
00:24:19.983381 main     VirtualBox: object deleted
