<svg xmlns="http://www.w3.org/2000/svg" width="10.907" height="12.5" viewBox="0 0 10.907 12.5">
  <metadata><?xpacket begin="﻿" id="W5M0MpCehiHzreSzNTczkc9d"?>
<x:xmpmeta xmlns:x="adobe:ns:meta/" x:xmptk="Adobe XMP Core 5.6-c138 79.159824, 2016/09/14-01:09:01        ">
   <rdf:RDF xmlns:rdf="http://www.w3.org/1999/02/22-rdf-syntax-ns#">
      <rdf:Description rdf:about=""/>
   </rdf:RDF>
</x:xmpmeta>
                                                                                                    
                                                                                                    
                                                                                                    
                                                                                                    
                                                                                                    
                                                                                                    
                                                                                                    
                                                                                                    
                                                                                                    
                                                                                                    
                                                                                                    
                                                                                                    
                                                                                                    
                                                                                                    
                                                                                                    
                                                                                                    
                                                                                                    
                                                                                                    
                                                                                                    
                                                                                                    
                           
<?xpacket end="w"?></metadata>
<defs>
    <style>
      .cls-1 {
        fill: #ea583e;
        fill-rule: evenodd;
      }
    </style>
  </defs>
  <path id="Shape_1_copy_3" data-name="Shape 1 copy 3" class="cls-1" d="M288.172,557.613a0.692,0.692,0,0,1,.058-0.89l1.628-1.493h-7.286a0.639,0.639,0,0,1,0-1.272h7.286l-1.628-1.493a0.694,0.694,0,0,1-.058-0.89,0.549,0.549,0,0,1,.808-0.064l2.742,2.606a0.629,0.629,0,0,1,0,.924l-2.742,2.637A0.546,0.546,0,0,1,288.172,557.613Zm-3.406-6a0.692,0.692,0,0,0-.059-0.89l-1.628-1.493h7.286a0.639,0.639,0,0,0,0-1.272h-7.286l1.628-1.493a0.7,0.7,0,0,0,.059-0.89,0.55,0.55,0,0,0-.809-0.064l-2.741,2.606a0.628,0.628,0,0,0,0,.924l2.741,2.637A0.547,0.547,0,0,0,284.766,551.613Z" transform="translate(-281.031 -545.344)"/>
</svg>
