00:00:01.575732 VirtualBox GUI VM Selector Window 6.1.14 r140239 linux.amd64 (Sep  7 2020 21:01:30) release log
00:00:01.575734 Log opened 2020-09-30T16:49:40.958203000Z
00:00:01.575735 Build Type: release
00:00:01.575738 OS Product: Linux
00:00:01.575739 OS Release: 5.8.12-arch1-1
00:00:01.575741 OS Version: #1 SMP PREEMPT Sat, 26 Sep 2020 21:42:58 +0000
00:00:01.575769 DMI Product Name: 33543XG
00:00:01.575780 DMI Product Version: ThinkPad Edge E330
00:00:01.575791 Firmware type: BIOS
00:00:01.575836 Host RAM: 3384MB (3.3GB) total, 2268MB (2.2GB) available
00:00:01.575839 Executable: /usr/lib/virtualbox/VirtualBox
00:00:01.575840 Process ID: 7138
00:00:01.575841 Package type: LINUX_64BITS_GENERIC (OSE)
00:00:01.575875 Qt version: 5.15.1
00:00:01.758152 GUI: UIMediumEnumerator: Medium-enumeration started...
00:00:04.346084 GUI: UIDesktopWidgetWatchdog::sltHandleHostScreenAvailableGeometryCalculated: Screen 0 work area is actually resized to: 0x18 x 1366x750
00:00:04.363929 GUI: UIMediumEnumerator: Medium-enumeration finished!
