{
  "error": "no such element",
  "message": "no such element: Unable to locate element: {\"method\":\"xpath\",\"selector\":\"//*[text()=\"Breakdowncover\"]/../following-sibling::td[text()=\"Roadside\"]\"}\n  (Session info: chrome=117.0.5938.149)",
  "stacktrace": "\tGetHandleVerifier [0x00007FF691387D12+55474]\n\t(No symbol) [0x00007FF6912F77C2]\n\t(No symbol) [0x00007FF6911AE0EB]\n\t(No symbol) [0x00007FF6911EEBAC]\n\t(No symbol) [0x00007FF6911EED2C]\n\t(No symbol) [0x00007FF691229F77]\n\t(No symbol) [0x00007FF69120F19F]\n\t(No symbol) [0x00007FF691227EF2]\n\t(No symbol) [0x00007FF69120EF33]\n\t(No symbol) [0x00007FF6911E3D41]\n\t(No symbol) [0x00007FF6911E4F84]\n\tGetHandleVerifier [0x00007FF6916EB762+3609346]\n\tGetHandleVerifier [0x00007FF691741A80+3962400]\n\tGetHandleVerifier [0x00007FF691739F0F+3930799]\n\tGetHandleVerifier [0x00007FF691423CA6+694342]\n\t(No symbol) [0x00007FF691302218]\n\t(No symbol) [0x00007FF6912FE484]\n\t(No symbol) [0x00007FF6912FE5B2]\n\t(No symbol) [0x00007FF6912EEE13]\n\tBaseThreadInitThunk [0x00007FF905E8257D+29]\n\tRtlUserThreadStart [0x00007FF90754AA78+40]\n"
}