{
  "error": "no such element",
  "message": "no such element: Unable to locate element: {\"method\":\"xpath\",\"selector\":\"//*[text()=\"Breakdowncover\"]/../following-sibling::td[text()=\"Roadside\"]\"}\n  (Session info: chrome=117.0.5938.149)",
  "stacktrace": "\tGetHandleVerifier [0x00007FF771717D12+55474]\n\t(No symbol) [0x00007FF7716877C2]\n\t(No symbol) [0x00007FF77153E0EB]\n\t(No symbol) [0x00007FF77157EBAC]\n\t(No symbol) [0x00007FF77157ED2C]\n\t(No symbol) [0x00007FF7715B9F77]\n\t(No symbol) [0x00007FF77159F19F]\n\t(No symbol) [0x00007FF7715B7EF2]\n\t(No symbol) [0x00007FF77159EF33]\n\t(No symbol) [0x00007FF771573D41]\n\t(No symbol) [0x00007FF771574F84]\n\tGetHandleVerifier [0x00007FF771A7B762+3609346]\n\tGetHandleVerifier [0x00007FF771AD1A80+3962400]\n\tGetHandleVerifier [0x00007FF771AC9F0F+3930799]\n\tGetHandleVerifier [0x00007FF7717B3CA6+694342]\n\t(No symbol) [0x00007FF771692218]\n\t(No symbol) [0x00007FF77168E484]\n\t(No symbol) [0x00007FF77168E5B2]\n\t(No symbol) [0x00007FF77167EE13]\n\tBaseThreadInitThunk [0x00007FF8E53A257D+29]\n\tRtlUserThreadStart [0x00007FF8E698AA78+40]\n"
}