{
  "using": "xpath",
  "value": "./option[. = \"Academic\"]|./option[normalize-space(text()) = \"Academic\"]|./optgroup/option[. = \"Academic\"]|./optgroup/option[normalize-space(text()) = \"Academic\"]"
}