"Date";"Césars avt W*";"Césars cours W*";"Forceps";"Spatules";"Ventouse";"Ventouse+ Forceps";"Forceps sur tête dernière";"Grande extraction";"Petite extraction";"VB normale";"TOTAL**"
"Janvier 2021";"35";"38";"15";"2";"23";"0";"0";"2";"4";"248";"369"
"Pourcent Janvier 2021";"10.64";"11.45";"1.63";"1.63";"1.63";"0";"0";"0.54";"1.08";"67.21";"100"
"Février 2021";"39";"41";"20";"2";"38";"6";"0";"1";"2";"230";"383"
"Pourcent Février 2021";"11.54";"12.06";"0.78";"0.78";"0.78";"1.99";"0";"0.26";"0.52";"60.05";"100"
"Mars 2021";"50";"37";"34";"2";"36";"5";"0";"3";"1";"259";"432"
"Pourcent Mars 2021";"12.82";"9.81";"0.93";"0.93";"0.93";"1.47";"0";"0.69";"0.23";"59.95";"100"
"Avril 2021";"35";"46";"27";"2";"38";"8";"1";"1";"4";"228";"391"
"Pourcent Avril 2021";"10.17";"12.96";"1.53";"1.53";"1.53";"2.56";"0.26";"0.26";"1.02";"58.31";"100"
"Mai 2021";"40";"50";"37";"2";"40";"10";"0";"1";"6";"231";"423"
"Pourcent Mai 2021";"10.9";"13.26";"1.65";"1.65";"1.65";"3.06";"0";"0.24";"1.42";"54.61";"100"
"Juin 2021";"55";"38";"34";"2";"32";"3";"0";"2";"3";"272";"442"
"Pourcent Juin 2021";"13.65";"9.84";"1.13";"1.13";"1.13";"0.86";"0";"0.45";"0.68";"61.54";"100"
"Juillet 2021";"55";"55";"24";"0";"46";"4";"0";"0";"5";"297";"488"
"Pourcent Juillet 2021";"12.76";"12.76";"1.02";"0";"1.02";"1.06";"0";"0";"1.02";"60.86";"100"
"Aout 2021";"39";"44";"31";"0";"49";"6";"0";"3";"9";"294";"481"
"Pourcent Aout 2021";"9.05";"10.09";"2.49";"0";"2.49";"1.52";"0";"0.62";"1.87";"61.12";"100"
"Septembre 2021";"43";"43";"17";"3";"45";"1";"0";"0";"8";"269";"432"
"Pourcent Septembre 2021";"11.14";"11.14";"1.85";"1.85";"1.85";"0.29";"0";"0";"1.85";"62.27";"100"
"Octobre 2021";"50";"57";"28";"3";"48";"4";"0";"3";"9";"266";"476"
"Pourcent Octobre 2021";"12.17";"13.64";"2.52";"2.52";"2.52";"1.1";"0";"0.63";"1.89";"55.88";"100"
"Novembre 2021";"36";"41";"23";"3";"44";"4";"0";"2";"6";"249";"410"
"Pourcent Novembre 2021";"9.81";"11.02";"1.95";"1.95";"1.95";"1.21";"0";"0.49";"1.46";"60.73";"100"
"Décembre 2021";"38";"36";"28";"0";"47";"4";"1";"2";"4";"299";"460"
"Pourcent Décembre 2021";"8.98";"8.55";"1.52";"0";"1.52";"1.03";"0.22";"0.43";"0.87";"65";"100"
"Total 2021";"515";"526";"318";"21";"486";"55";"2";"20";"61";"3142";"5187"
"Pourcent Total 2021";"11.15";"11.36";"7.71";"0.51";"11.79";"1.34";"0.24";"0.47";"1.18";"60.57";"100"
