date ;total_accouchement ;total_cesarienne;total_voiebasse ;total_IMG
2005;4296;768;3528;100
2006;4616;801;3815;134
2007;4852;985;3867;104
2008;4929;839;4090;124
2009;5089;788;4301;126
2010;5261;866;4395;128
2011;5231;866;4365;125
2012;5381;1006;4375;124
2013;5337;981;4356;120
2014;5435;995;4440;101
2015;5482;892;4590;117
2016;5484;1028;4456;129
2017;5328;969;4359;121
2018;5209;1047;4162;108
2019;5444;1045;4399;146
2020;5281;1058;4223;139
2021;5217;1079;4105;33
