"cesarienne";"cesariennes$Urgence";"frequence"
"CESARIENNE +DIFFICULTES OPERATOIRES";"Non";3
"CESARIENNE AVANT TRAVAIL CODE ORANGE";"Oui";18
"CESARIENNE AVANT TRAVAIL CODE ROUGE";"Oui";6
"CESARIENNE AVANT TRAVAIL CODE VERT";"Non";1
"CESARIENNE AVANT TRAVAIL CODE VERT";"Oui";22
"CESARIENNE EN COURS DE TRAVAIL CODE ORANGE";"Oui";22
"CESARIENNE EN COURS DE TRAVAIL CODE ROUGE";"Oui";16
"CESARIENNE EN COURS DE TRAVAIL VERT";"Non";1
"CESARIENNE EN COURS DE TRAVAIL VERT";"Oui";40
"CESARIENNE REPRISE";"Oui";1
"CESARIENNE SIMPLE";"Non";37
"CESARIENNE UTERUS MULTI-CICATRICIEL";"Non";14
"REFECTION PERINEALE";"Oui";1
"REPRISE INTERVENTION OBSTETRICALE";"Non";1
"REPRISE INTERVENTION OBSTETRICALE";"Oui";4
