Data file,difference results,RMSE,Graph
all_kits_sorted_withsensorquality.csv,difference_with_activities+SQ.csv,46.1,Pm2.5_with_activity+sensorQuality.png
all_kits_,difference_none.csv,8.4,PM2.5_without_extension_same_dataset.png
,,40.8,
