{
  "openapi": "3.0.1",
  "info": {
      "title": "Đặc tả api truyền tải lệnh vận chuyển",
      "termsOfService": "https://benxe.gov.vn/doc/",
      "contact": {
          "name": "Cục Đường Bộ Việt Nam",
          "email": "lenhvanchuyen.drvn@gmail.com"
      },
      "version": "v1",
      "description": "<a rel=\"noopener noreferrer\" class=\"link\" target=\"_blank\" href=\"https://docs.benxe.gov.vn/huong-dan-tich-hop\" style=\"text-decoration: none;\">Các tài liệu liên quan khác</a>"
  },
  "servers": [{
      "url": "https://thunghiem-truyentailenhvanchuyen.benxe.gov.vn"
  }],
  "paths": {
      "/api/TiepNhanTruyenTai/doanh-nghiep-truyen-tai-lenh-van-chuyen-ben-xe-di-da-xac-minh": {
          "post": {
              "tags": [
                  "Dành cho đơn vị vận tải"
              ],
              "summary": "Truyền tải lệnh đã xác minh bởi bến xe đi.",
              "description": "Sau khi bến xe khách thực hiện ký số để xác nhận trên LVC và cho xe xuất bến hoặc xe đến bến thì phải truyền dữ liệu về máy chủ Cục ĐBVN.",
              "requestBody": {
                  "content": {
                      "application/json": {
                          "schema": {
                              "$ref": "#/components/schemas/TiepNhanTruyenTai"
                          }
                      }
                  }
              },
              "responses": {
                  "200": {
                      "description": "Success",
                      "content": {
                          "application/json": {
                              "schema": {
                                  "$ref": "#/components/schemas/PhanHoiTiepNhanLenhDataResponsive"
                              }
                          }
                      }
                  }
              }
          }
      },
      "/api/TiepNhanTruyenTai/doanh-nghiep-truyen-tai-lenh-van-chuyen-ben-xe-den-da-xac-minh": {
          "post": {
              "tags": [
                  "Dành cho đơn vị vận tải"
              ],
              "summary": "Truyền tải lệnh đã xác minh bởi bến xe đến.",
              "description": "Sau khi bến xe khách thực hiện ký số để xác nhận trên LVC và cho xe xuất bến hoặc xe đến bến thì phải truyền dữ liệu về máy chủ Cục ĐBVN.",
              "requestBody": {
                  "content": {
                      "application/json": {
                          "schema": {
                              "$ref": "#/components/schemas/TiepNhanTruyenTai"
                          }
                      }
                  }
              },
              "responses": {
                  "200": {
                      "description": "Success",
                      "content": {
                          "application/json": {
                              "schema": {
                                  "$ref": "#/components/schemas/PhanHoiTiepNhanLenhDataResponsive"
                              }
                          }
                      }
                  }
              }
          }
      },
      "/api/TiepNhanTruyenTai/doanh-nghiep-truyen-tai-lenh-van-chuyen-dien-tu-da-ky-cho-xe-buyt": {
          "post": {
              "tags": [
                  "Dành cho đơn vị vận tải"
              ],
              "summary": "Truyền tải lệnh đã ký dành cho xe buýt.",
              "description": "Sau khi bến xe khách thực hiện ký số để xác nhận trên LVC và cho xe xuất bến hoặc xe đến bến thì phải truyền dữ liệu về máy chủ Cục ĐBVN.",
              "requestBody": {
                  "content": {
                      "application/json": {
                          "schema": {
                              "$ref": "#/components/schemas/TiepNhanTruyenTai"
                          }
                      }
                  }
              },
              "responses": {
                  "200": {
                      "description": "Success",
                      "content": {
                          "application/json": {
                              "schema": {
                                  "$ref": "#/components/schemas/PhanHoiTiepNhanLenhDataResponsive"
                              }
                          }
                      }
                  }
              }
          }
      },
      "/api/TiepNhanTruyenTai/doanh-nghiep-truyen-tai-tren-duong-lenh-van-chuyen-dien-tu": {
          "post": {
              "tags": [
                  "Dành cho đơn vị vận tải"
              ],
              "summary": "Truyền tải thông tin khi xe hoạt động trên đường.",
              "description": "Đơn vị vận tải/đơn vị truyền dữ liệu thực hiện truyền tải khi có thay đổi số lượng hành khách sau khi xe xuất bến. Nội dung này chỉ áp dụng cho xe khách tuyến cố định, không áp dụng cho xe buýt.",
              "requestBody": {
                  "content": {
                      "application/json": {
                          "schema": {
                              "$ref": "#/components/schemas/TruyenTaiDuLieuDangHoatDong"
                          }
                      }
                  }
              },
              "responses": {
                  "200": {
                      "description": "Success",
                      "content": {
                          "application/json": {
                              "schema": {
                                  "$ref": "#/components/schemas/BooleanDataResponsive"
                              }
                          }
                      }
                  }
              }
          }
      },
      "/api/TiepNhanTruyenTai/doanh-nghiep-truyen-tai-lenh-van-chuyen-dien-tu-thay-the-da-ky": {
          "post": {
              "tags": [
                  "Dành cho đơn vị vận tải"
              ],
              "summary": "Truyền tải khi thực hiện thay thế xe trên lệnh vận chuyển cũ.",
              "description": "Sau khi doanh nghiệp thực hiện ký và phát hành lệnh thì cần phải truyền tải thông tin lệnh vận chuyển.",
              "requestBody": {
                  "content": {
                      "application/json": {
                          "schema": {
                              "$ref": "#/components/schemas/TruyenTaiDuLieuLenhThayThe"
                          }
                      }
                  }
              },
              "responses": {
                  "200": {
                      "description": "Success",
                      "content": {
                          "application/json": {
                              "schema": {
                                  "$ref": "#/components/schemas/PhanHoiTiepNhanLenhDataResponsive"
                              }
                          }
                      }
                  }
              }
          }
      },
      "/api/TiepNhanTruyenTai/ben-xe-di-truyen-tai-lenh-van-chuyen-dien-tu-da-ky": {
          "post": {
              "tags": [
                  "Dành cho bến xe khách"
              ],
              "summary": "Truyền tải dữ liệu lệnh khi xe xuất bến.",
              "description": "Sau khi bến xe khách thực hiện ký số để xác nhận trên LVC và cho xe xuất bến hoặc xe đến bến thì phải truyền dữ liệu về máy chủ Cục ĐBVN.",
              "requestBody": {
                  "content": {
                      "application/json": {
                          "schema": {
                              "$ref": "#/components/schemas/TiepNhanTruyenTai"
                          }
                      }
                  }
              },
              "responses": {
                  "200": {
                      "description": "Success",
                      "content": {
                          "application/json": {
                              "schema": {
                                  "$ref": "#/components/schemas/PhanHoiTiepNhanLenhDataResponsive"
                              }
                          }
                      }
                  }
              }
          }
      },
      "/api/TiepNhanTruyenTai/ben-xe-den-truyen-tai-lenh-van-chuyen-dien-tu-da-ky": {
          "post": {
              "tags": [
                  "Dành cho bến xe khách"
              ],
              "summary": "Truyền tải dữ liệu lệnh khi xe đến bến trả khách.",
              "description": "Sau khi bến xe khách thực hiện ký số để xác nhận trên LVC và cho xe xuất bến hoặc xe đến bến thì phải truyền dữ liệu về máy chủ Cục ĐBVN.",
              "requestBody": {
                  "content": {
                      "application/json": {
                          "schema": {
                              "$ref": "#/components/schemas/TiepNhanTruyenTai"
                          }
                      }
                  }
              },
              "responses": {
                  "200": {
                      "description": "Success",
                      "content": {
                          "application/json": {
                              "schema": {
                                  "$ref": "#/components/schemas/PhanHoiTiepNhanLenhDataResponsive"
                              }
                          }
                      }
                  }
              }
          }
      }
  },
  "components": {
      "schemas": {
          "BooleanDataResponsive": {
              "type": "object",
              "properties": {
                  "status": {
                      "description": "Trạng thái.",
                      "type": "boolean"
                  },
                  "message": {
                      "description": "Thông tin báo phản hồi từ máy chủ.",
                      "type": "string",
                      "nullable": true
                  },
                  "errorCode": {
                      "description": "Mã lỗi (Giá trị 200 nếu request thành công).",
                      "type": "integer",
                      "format": "int32"
                  },
                  "data": {
                      "description": "Trạng thái truyền tải<br/>True: <i>Truyền tải thành công</i><br/>False: <i>Truyền tải thất bại</i>",
                      "type": "boolean"
                  }
              },
              "additionalProperties": false
          },
          "PhanHoiTiepNhanLenh": {
              "type": "object",
              "properties": {
                  "maLenhVanChuyen": {
                      "description": "Mã lệnh vận chuyển được định danh trên Máy chủ của Cục ĐBVN sau khi được tiếp nhận thành công.",
                      "type": "string",
                      "nullable": true
                  }
              },
              "additionalProperties": false
          },
          "PhanHoiTiepNhanLenhDataResponsive": {
              "type": "object",
              "properties": {
                  "status": {
                      "description": "Trạng thái.",
                      "type": "boolean"
                  },
                  "message": {
                      "description": "Thông tin báo phản hồi từ máy chủ.",
                      "type": "string",
                      "nullable": true
                  },
                  "errorCode": {
                      "description": "Mã lỗi (Giá trị 200 nếu request thành công).",
                      "type": "integer",
                      "format": "int32"
                  },
                  "data": {
                      "description": "Dữ liệu trả về.",
                      "$ref": "#/components/schemas/PhanHoiTiepNhanLenh"
                  }
              },
              "additionalProperties": false
          },
          "TepDinhKem": {
              "required": [
                  "data",
                  "loai"
              ],
              "type": "object",
              "properties": {
                  "loai": {
                      "description": "Loại định dạng tệp <i>(chỉ nhận 02 định dạng: jpg, pdf)</i>",
                      "type": "string"
                  },
                  "data": {
                      "description": "Dữ liệu của tệp đính kèm mã hóa dạng Base64",
                      "type": "string"
                  }
              },
              "additionalProperties": false
          },
          "TiepNhanTruyenTai": {
              "required": [
                  "checksum",
                  "maLenh",
                  "xml"
              ],
              "type": "object",
              "properties": {
                  "maLenh": {
                      "description": "Mã lệnh được định danh duy nhất tại đơn vị quản lý lệnh.<br/>(Khuyến cáo sử dụng UUID)",
                      "type": "string"
                  },
                  "xml": {
                      "description": "Tệp dữ liệu xml mã hóa dạng Base64.<br/>Tệp dữ liệu lệnh vận chuyển điện tử đã được bến xe ký số.",
                      "type": "string"
                  },
                  "danhSachTepDinhKem": {
                      "description": "Bản thể hiện của lệnh vận chuyển điện tử.<br/><i>(Lưu ý nên truyền để người dùng xem xét đảm bảo trực quan)</i>",
                      "type": "array",
                      "items": {
                          "$ref": "#/components/schemas/TepDinhKem"
                      },
                      "nullable": true
                  },
                  "checksum": {
                      "description": "Chuỗi xác thực tính đúng đắn của dữ liệu.<br/>Các chi tiết quy định về chuỗi xác thực (checksum) được công bố tại địa chỉ: https://benxe.gov.vn/doc",
                      "type": "string"
                  }
              },
              "additionalProperties": false
          },
          "TruyenTaiDuLieuDangHoatDong": {
              "required": [
                  "checksum",
                  "maLenh",
                  "maLenhVanChuyen",
                  "soKhach"
              ],
              "type": "object",
              "properties": {
                  "maLenhVanChuyen": {
                      "description": "Mã lệnh vận chuyển được định danh trên Máy chủ của Cục ĐBVN sau khi truyền tải theo “API truyền tải lệnh vận chuyển điện tử khi đã được bến xe nơi đi ký số” thành công trả về dữ liệu “Mã lệnh vận chuyển”.",
                      "type": "string",
                      "format": "uuid"
                  },
                  "maLenh": {
                      "description": "Mã lệnh được định danh duy nhất tại đơn vị quản lý lệnh.<br/>(Khuyến cáo sử dụng UUID)",
                      "type": "string"
                  },
                  "soKhach": {
                      "description": "Số lượng khách thực tế trên xe.",
                      "type": "string"
                  },
                  "toaDoGPS": {
                      "description": "Tọa độ GPS của xe khi truyền dữ liệu.<br/>Định dạng tọa độ dạng: kinh độ, vĩ độ<br/><i>Ví dụ: 41.40338, 2.17403</i>",
                      "type": "string",
                      "nullable": true
                  },
                  "checksum": {
                      "description": "Chuỗi xác thực tính đúng đắn của dữ liệu.<br/>Các chi tiết quy định về chuỗi xác thực (checksum) được công bố tại địa chỉ: https://benxe.gov.vn/doc",
                      "type": "string"
                  }
              },
              "additionalProperties": false
          },
          "TruyenTaiDuLieuLenhThayThe": {
              "required": [
                  "checksum",
                  "danhSachTepDinhKem",
                  "maLenh",
                  "maLenhBiThayThe",
                  "maLenhVanChuyen",
                  "xml"
              ],
              "type": "object",
              "properties": {
                  "maLenh": {
                      "description": "Mã lệnh được định danh duy nhất tại đơn vị quản lý lệnh.<br/>(Khuyến cáo sử dụng UUID)",
                      "type": "string"
                  },
                  "maLenhBiThayThe": {
                      "description": "Mã lệnh được định danh duy nhất tại đơn vị quản lý lệnh.<br/>(Khuyến cáo sử dụng UUID)",
                      "type": "string"
                  },
                  "maLenhVanChuyen": {
                      "description": "Mã lệnh vận chuyển đã được định danh trên Máy chủ của Cục ĐBVN sau khi được tiếp nhận thành công.",
                      "type": "string",
                      "format": "uuid"
                  },
                  "xml": {
                      "description": "Tệp dữ liệu xml mã hóa dạng Base64.<br/>Tệp dữ liệu lệnh vận chuyển điện tử đã được bến xe ký số.",
                      "type": "string"
                  },
                  "danhSachTepDinhKem": {
                      "description": "Bản thể hiện của lệnh vận chuyển điện tử.<br/><i>(Lưu ý nên truyền để người dùng xem xét đảm bảo trực quan)</i>",
                      "type": "array",
                      "items": {
                          "$ref": "#/components/schemas/TepDinhKem"
                      }
                  },
                  "checksum": {
                      "description": "Chuỗi xác thực tính đúng đắn của dữ liệu.<br/>Các chi tiết quy định về chuỗi xác thực (checksum) được công bố tại địa chỉ: https://benxe.gov.vn/doc",
                      "type": "string"
                  }
              },
              "additionalProperties": false
          }
      },
      "securitySchemes": {
          "oauth2": {
              "type": "oauth2",
              "flows": {
                  "password": {
                      "tokenUrl": "https://dangnhap.benxe.gov.vn/realms/CucDuongBo/protocol/openid-connect/token",
                      "refreshUrl": "https://dangnhap.benxe.gov.vn/realms/CucDuongBo/protocol/openid-connect/token",
                      "scopes": {}
                  }
              }
          }
      }
  },
  "security": [{
      "oauth2": []
  }]
}