PCBNEW-LibModule-V1  
# encoding utf-8
Units mm
$INDEX
SOT323
$EndINDEX
$MODULE SOT323
Po 0 0 0 15 00000000 00000000 ~~
Li SOT323
Cd 
Sc 00000000
At SMD
Op 0 0 0
.SolderMask 0
.SolderPaste 0
T0 -0.313691 -2.08779 0.321013 0.321013 0 0.05 N V 21 "SOT323"
T1 -0.100119 -1.51455 0.320391 0.320391 0 0.05 N V 21 "VAL**"
DS 1.1224 -0.6604 1.1224 0.6604 0.1524 24
DS 1.1224 0.6604 -1.1224 0.6604 0.1524 24
DS -1.1224 0.6604 -1.1224 -0.6604 0.1524 24
DS -1.1224 -0.6604 1.1224 -0.6604 0.1524 24
DS -0.8 -0.7 -1.1 -0.7 0.2032 21
DS -1.1 -0.7 -1.1 0.1 0.2032 21
DS 0.8 -0.7 1.1 -0.7 0.2032 21
DS 1.1 -0.7 1.1 0.1 0.2032 21
$PAD
Sh "1" R 0.7 0.7 0 0 0
At SMD N 00888000
.SolderMask 0
.SolderPaste 0
Ne 0 ""
Po -0.65 0.925
$EndPAD
$PAD
Sh "2" R 0.7 0.7 0 0 0
At SMD N 00888000
.SolderMask 0
.SolderPaste 0
Ne 0 ""
Po 0.65 0.925
$EndPAD
$PAD
Sh "3" R 0.7 0.7 0 0 0
At SMD N 00888000
.SolderMask 0
.SolderPaste 0
Ne 0 ""
Po 0 -0.925
$EndPAD
$EndMODULE SOT323
