PCBNEW-LibModule-V1  
# encoding utf-8
Units mm
$INDEX
VMT3
$EndINDEX
$MODULE VMT3
Po 0 0 0 15 00000000 00000000 ~~
Li VMT3
Cd 
Sc 00000000
At SMD
Op 0 0 0
.SolderMask 0
.SolderPaste 0
T0 0 0 1 0.9 0 0.05 N H 21 "VMT3"
T1 0 0 1 0.9 0 0.05 N H 21 "VAL**"
DP 0 0 0 0 4 0 24
Dl -0.60134 -0.4
Dl 0.6 -0.4
Dl 0.6 0.400893
Dl -0.60134 0.400893
DP 0 0 0 0 4 0 24
Dl -0.150367 -0.6
Dl 0.15 -0.6
Dl 0.15 -0.400977
Dl -0.150367 -0.400977
DP 0 0 0 0 4 0 24
Dl -0.501154 0.4
Dl -0.3 0.4
Dl -0.3 0.601384
Dl -0.501154 0.601384
DP 0 0 0 0 4 0 24
Dl 0.300852 0.4
Dl 0.5 0.4
Dl 0.5 0.601705
Dl 0.300852 0.601705
DS -0.5 0.15 -0.5 -0.3 0.15 21
DS -0.5 -0.3 -0.4 -0.3 0.15 21
DS 0.4 -0.3 0.5 -0.3 0.15 21
DS 0.5 -0.3 0.5 0.15 0.15 21
DS -0.05 0.3 0.05 0.3 0.15 21
$PAD
Sh "1" R 0.4 0.4 0 0 900
At SMD N 00888000
.SolderMask 0
.SolderPaste 0
Ne 0 ""
Po -0.4 0.5
$EndPAD
$PAD
Sh "2" R 0.4 0.4 0 0 900
At SMD N 00888000
.SolderMask 0
.SolderPaste 0
Ne 0 ""
Po 0.4 0.5
$EndPAD
$PAD
Sh "3" R 0.5 0.4 0 0 0
At SMD N 00888000
.SolderMask 0
.SolderPaste 0
Ne 0 ""
Po 0 -0.5
$EndPAD
$EndMODULE VMT3
