EESchema Schematic File Version 2
LIBS:power
LIBS:device
LIBS:switches
LIBS:relays
LIBS:motors
LIBS:transistors
LIBS:conn
LIBS:linear
LIBS:regul
LIBS:74xx
LIBS:cmos4000
LIBS:adc-dac
LIBS:memory
LIBS:xilinx
LIBS:microcontrollers
LIBS:dsp
LIBS:microchip
LIBS:analog_switches
LIBS:motorola
LIBS:texas
LIBS:intel
LIBS:audio
LIBS:interface
LIBS:digital-audio
LIBS:philips
LIBS:display
LIBS:cypress
LIBS:siliconi
LIBS:opto
LIBS:atmel
LIBS:contrib
LIBS:valves
LIBS:M95
LIBS:M95A-02-NCH-STD
LIBS:MIC29302AWU-TR
LIBS:MSP430G2553IPW20
LIBS:TPD4E004DRYR
LIBS:SIM_78646-3001
LIBS:MSP430FR2311
LIBS:U.FL-R-SMT_10_
LIBS:Diode_SOD123
LIBS:SIM_Holder
LIBS:GSM_M95-cache
EELAYER 25 0
EELAYER END
$Descr A4 11693 8268
encoding utf-8
Sheet 1 1
Title "Hub Mother Board"
Date "2018-07-11"
Rev "v1.1"
Comp "Soil Agritech Pvt. Ltd."
Comment1 "Designed by SRS"
Comment2 ""
Comment3 ""
Comment4 ""
$EndDescr
$Comp
L MIC29302AWU-TR IC1
U 1 1 5B879F3E
P 2250 1300
F 0 "IC1" H 2450 1050 50  0001 L BNN
F 1 "MIC29302AWU-TR" H 1900 1750 50  0001 L BNN
F 2 "TO-263:TO263-5" H 2100 1050 50  0001 L BNN
F 3 "MIC29302AWU-TR" H 1900 1750 50  0001 L BNN
	1    2250 1300
	1    0    0    -1  
$EndComp
Text Notes 2150 1700 0    60   ~ 0
LDO
$Comp
L GND #PWR01
U 1 1 5B879F4E
P 1250 2200
F 0 "#PWR01" H 1250 1950 50  0001 C CNN
F 1 "GND" H 1250 2050 50  0000 C CNN
F 2 "" H 1250 2200 50  0001 C CNN
F 3 "" H 1250 2200 50  0001 C CNN
	1    1250 2200
	1    0    0    -1  
$EndComp
$Comp
L CP1 C3
U 1 1 5B879F58
P 950 1650
F 0 "C3" H 975 1750 50  0000 L CNN
F 1 "470u" H 975 1550 50  0000 L CNN
F 2 "Capacitors_THT:CP_Radial_D5.0mm_P2.50mm" H 950 1650 50  0001 C CNN
F 3 "" H 950 1650 50  0001 C CNN
	1    950  1650
	1    0    0    -1  
$EndComp
$Comp
L C C4
U 1 1 5B879F59
P 1250 1650
F 0 "C4" H 1275 1750 50  0000 L CNN
F 1 "100n" H 1275 1550 50  0000 L CNN
F 2 "Capacitors_SMD:C_0805_HandSoldering" H 1288 1500 50  0001 C CNN
F 3 "" H 1250 1650 50  0001 C CNN
	1    1250 1650
	1    0    0    -1  
$EndComp
$Comp
L R R1
U 1 1 5B879F5A
P 3100 1400
F 0 "R1" V 3180 1400 50  0000 C CNN
F 1 "30k" V 3100 1400 50  0000 C CNN
F 2 "Resistors_SMD:R_1206" V 3030 1400 50  0001 C CNN
F 3 "" H 3100 1400 50  0001 C CNN
	1    3100 1400
	1    0    0    -1  
$EndComp
$Comp
L R R3
U 1 1 5B879F5B
P 3100 1850
F 0 "R3" V 3180 1850 50  0000 C CNN
F 1 "16k" V 3100 1850 50  0000 C CNN
F 2 "Resistors_SMD:R_1206" V 3030 1850 50  0001 C CNN
F 3 "" H 3100 1850 50  0001 C CNN
	1    3100 1850
	1    0    0    -1  
$EndComp
$Comp
L R R2
U 1 1 5B879F5C
P 3500 1600
F 0 "R2" V 3580 1600 50  0000 C CNN
F 1 "330E" V 3500 1600 50  0000 C CNN
F 2 "Resistors_SMD:R_0805_HandSoldering" V 3430 1600 50  0001 C CNN
F 3 "" H 3500 1600 50  0001 C CNN
	1    3500 1600
	1    0    0    -1  
$EndComp
$Comp
L CP1 C1
U 1 1 5B879F5D
P 3800 1600
F 0 "C1" H 3825 1700 50  0000 L CNN
F 1 "470u" H 3825 1500 50  0000 L CNN
F 2 "Capacitors_THT:CP_Radial_D5.0mm_P2.50mm" H 3800 1600 50  0001 C CNN
F 3 "" H 3800 1600 50  0001 C CNN
	1    3800 1600
	1    0    0    -1  
$EndComp
$Comp
L C C2
U 1 1 5B879F5E
P 4100 1600
F 0 "C2" H 4125 1700 50  0000 L CNN
F 1 "100n" H 4125 1500 50  0000 L CNN
F 2 "Capacitors_SMD:C_0805_HandSoldering" H 4138 1450 50  0001 C CNN
F 3 "" H 4100 1600 50  0001 C CNN
	1    4100 1600
	1    0    0    -1  
$EndComp
$Comp
L GND #PWR02
U 1 1 5B879F5F
P 3950 2200
F 0 "#PWR02" H 3950 1950 50  0001 C CNN
F 1 "GND" H 3950 2050 50  0000 C CNN
F 2 "" H 3950 2200 50  0001 C CNN
F 3 "" H 3950 2200 50  0001 C CNN
	1    3950 2200
	1    0    0    -1  
$EndComp
Text GLabel 4600 1200 2    60   Input ~ 0
VBUS
Text Notes 1950 700  0    60   ~ 0
Power Supply
Text Notes 4500 1800 0    59   ~ 0
1N4733
Text Notes 4500 2100 0    60   ~ 0
5.1V, 1W\nZener \nDiode
$Comp
L +5V #PWR03
U 1 1 5B879F57
P 850 1050
F 0 "#PWR03" H 850 900 50  0001 C CNN
F 1 "+5V" H 850 1190 50  0000 C CNN
F 2 "" H 850 1050 50  0001 C CNN
F 3 "" H 850 1050 50  0001 C CNN
	1    850  1050
	1    0    0    -1  
$EndComp
$Comp
L M95A-02-NCH-STD U1
U 1 1 5B87BF61
P 6050 4050
F 0 "U1" H 5300 5400 50  0000 L BNN
F 1 "M95A-02-NCH-STD" H 5439 2478 50  0000 L BNN
F 2 "M95A-02-NCH-STD:XCVR_M95A-02-NCH-STD" H 6050 4050 50  0001 L BNN
F 3 "Quectel" H 6050 4050 50  0001 L BNN
F 4 "Quad-Band GSM/GPRS Module LCC" H 6050 4050 50  0001 L BNN "Field4"
F 5 "M95A-02-NCH-STD" H 6050 4050 50  0001 L BNN "Field5"
F 6 "None" H 6050 4050 50  0001 L BNN "Field6"
F 7 "None" H 6050 4050 50  0001 L BNN "Field7"
F 8 "Unavailable" H 6050 4050 50  0001 L BNN "Field8"
	1    6050 4050
	1    0    0    -1  
$EndComp
$Comp
L GND #PWR04
U 1 1 5B87DF79
P 5700 7400
F 0 "#PWR04" H 5700 7150 50  0001 C CNN
F 1 "GND" H 5700 7250 50  0000 C CNN
F 2 "" H 5700 7400 50  0001 C CNN
F 3 "" H 5700 7400 50  0001 C CNN
	1    5700 7400
	1    0    0    -1  
$EndComp
$Comp
L +5V #PWR05
U 1 1 5B87DFA1
P 6150 7050
F 0 "#PWR05" H 6150 6900 50  0001 C CNN
F 1 "+5V" H 6150 7190 50  0000 C CNN
F 2 "" H 6150 7050 50  0001 C CNN
F 3 "" H 6150 7050 50  0001 C CNN
	1    6150 7050
	1    0    0    -1  
$EndComp
$Comp
L PWR_FLAG #FLG06
U 1 1 5B87E187
P 5700 7050
F 0 "#FLG06" H 5700 7125 50  0001 C CNN
F 1 "PWR_FLAG" H 5700 7200 50  0000 C CNN
F 2 "" H 5700 7050 50  0001 C CNN
F 3 "" H 5700 7050 50  0001 C CNN
	1    5700 7050
	1    0    0    -1  
$EndComp
$Comp
L PWR_FLAG #FLG07
U 1 1 5B87E1B0
P 6150 7400
F 0 "#FLG07" H 6150 7475 50  0001 C CNN
F 1 "PWR_FLAG" H 6150 7550 50  0000 C CNN
F 2 "" H 6150 7400 50  0001 C CNN
F 3 "" H 6150 7400 50  0001 C CNN
	1    6150 7400
	-1   0    0    1   
$EndComp
$Comp
L GND #PWR08
U 1 1 5B87E976
P 7050 5600
F 0 "#PWR08" H 7050 5350 50  0001 C CNN
F 1 "GND" H 7050 5450 50  0000 C CNN
F 2 "" H 7050 5600 50  0001 C CNN
F 3 "" H 7050 5600 50  0001 C CNN
	1    7050 5600
	1    0    0    -1  
$EndComp
$Comp
L TPD4E004DRYR U3
U 1 1 5B8A9222
P 8450 5500
F 0 "U3" H 8450 5500 50  0001 L BNN
F 1 "TPD4E004DRYR" H 8450 5500 50  0001 L BNN
F 2 "TPD4E004DRYR:SON-6" H 8450 5500 50  0001 L BNN
F 3 "None" H 8450 5500 50  0001 L BNN
F 4 "4-Channel ESD Protection Array for High-Speed Data Interfaces 6-SON -40 to 85" H 8450 5500 50  0001 L BNN "Field4"
F 5 "SON-6 Texas Instruments" H 8450 5500 50  0001 L BNN "Field5"
F 6 "Texas Instruments" H 8450 5500 50  0001 L BNN "Field6"
F 7 "Unavailable" H 8450 5500 50  0001 L BNN "Field7"
F 8 "TPD4E004DRYR" H 8150 5100 50  0000 L BNN "Field8"
	1    8450 5500
	1    0    0    -1  
$EndComp
Text GLabel 8750 2650 2    60   Input ~ 0
VBUS
$Comp
L GND #PWR09
U 1 1 5B8D456D
P 7900 5850
F 0 "#PWR09" H 7900 5600 50  0001 C CNN
F 1 "GND" H 7900 5700 50  0000 C CNN
F 2 "" H 7900 5850 50  0001 C CNN
F 3 "" H 7900 5850 50  0001 C CNN
	1    7900 5850
	1    0    0    -1  
$EndComp
$Comp
L GND #PWR010
U 1 1 5B8D4599
P 10800 5100
F 0 "#PWR010" H 10800 4850 50  0001 C CNN
F 1 "GND" H 10800 4950 50  0000 C CNN
F 2 "" H 10800 5100 50  0001 C CNN
F 3 "" H 10800 5100 50  0001 C CNN
	1    10800 5100
	1    0    0    -1  
$EndComp
$Comp
L C C15
U 1 1 5B8D48BD
P 9250 5500
F 0 "C15" H 9275 5600 50  0000 L CNN
F 1 "0.1u" H 9275 5400 50  0000 L CNN
F 2 "Capacitors_SMD:C_0805_HandSoldering" H 9288 5350 50  0001 C CNN
F 3 "" H 9250 5500 50  0001 C CNN
	1    9250 5500
	1    0    0    -1  
$EndComp
$Comp
L GND #PWR011
U 1 1 5B8D4AEE
P 9250 5800
F 0 "#PWR011" H 9250 5550 50  0001 C CNN
F 1 "GND" H 9250 5650 50  0000 C CNN
F 2 "" H 9250 5800 50  0001 C CNN
F 3 "" H 9250 5800 50  0001 C CNN
	1    9250 5800
	1    0    0    -1  
$EndComp
$Comp
L R R12
U 1 1 5B8D51BB
P 7050 4550
F 0 "R12" V 7130 4550 50  0000 C CNN
F 1 "22E" V 7050 4550 50  0000 C CNN
F 2 "Resistors_SMD:R_0805_HandSoldering" V 6980 4550 50  0001 C CNN
F 3 "" H 7050 4550 50  0001 C CNN
	1    7050 4550
	0    1    1    0   
$EndComp
$Comp
L R R13
U 1 1 5B8D5267
P 7250 4650
F 0 "R13" V 7330 4650 50  0000 C CNN
F 1 "22E" V 7250 4650 50  0000 C CNN
F 2 "Resistors_SMD:R_0805_HandSoldering" V 7180 4650 50  0001 C CNN
F 3 "" H 7250 4650 50  0001 C CNN
	1    7250 4650
	0    1    1    0   
$EndComp
Text GLabel 9400 5300 2    60   Input ~ 0
VBUS
$Comp
L C C11
U 1 1 5B8D65C4
P 10800 4500
F 0 "C11" H 10825 4600 50  0000 L CNN
F 1 "100n" H 10825 4400 50  0000 L CNN
F 2 "Capacitors_SMD:C_0805_HandSoldering" H 10838 4350 50  0001 C CNN
F 3 "" H 10800 4500 50  0001 C CNN
	1    10800 4500
	1    0    0    -1  
$EndComp
$Comp
L R R15
U 1 1 5B8D7052
P 7550 6100
F 0 "R15" V 7630 6100 50  0000 C CNN
F 1 "22E" V 7550 6100 50  0000 C CNN
F 2 "Resistors_SMD:R_0805_HandSoldering" V 7480 6100 50  0001 C CNN
F 3 "" H 7550 6100 50  0001 C CNN
	1    7550 6100
	0    1    1    0   
$EndComp
$Comp
L C C16
U 1 1 5B8D7B4A
P 7100 6250
F 0 "C16" H 7125 6350 50  0000 L CNN
F 1 "33p" H 7125 6150 50  0000 L CNN
F 2 "Capacitors_SMD:C_0805_HandSoldering" H 7138 6100 50  0001 C CNN
F 3 "" H 7100 6250 50  0001 C CNN
	1    7100 6250
	1    0    0    -1  
$EndComp
$Comp
L GND #PWR012
U 1 1 5B8D7C04
P 7100 6400
F 0 "#PWR012" H 7100 6150 50  0001 C CNN
F 1 "GND" H 7250 6350 50  0000 C CNN
F 2 "" H 7100 6400 50  0001 C CNN
F 3 "" H 7100 6400 50  0001 C CNN
	1    7100 6400
	1    0    0    -1  
$EndComp
$Comp
L C C12
U 1 1 5B8D7D4B
P 7450 4900
F 0 "C12" H 7475 5000 50  0000 L CNN
F 1 "33p" H 7475 4800 50  0000 L CNN
F 2 "Capacitors_SMD:C_0805_HandSoldering" H 7488 4750 50  0001 C CNN
F 3 "" H 7450 4900 50  0001 C CNN
	1    7450 4900
	1    0    0    -1  
$EndComp
$Comp
L C C13
U 1 1 5B8D7DCF
P 7650 4900
F 0 "C13" H 7675 5000 50  0000 L CNN
F 1 "33p" H 7675 4800 50  0000 L CNN
F 2 "Capacitors_SMD:C_0805_HandSoldering" H 7688 4750 50  0001 C CNN
F 3 "" H 7650 4900 50  0001 C CNN
	1    7650 4900
	1    0    0    -1  
$EndComp
$Comp
L GND #PWR013
U 1 1 5B8D7FDA
P 7550 5150
F 0 "#PWR013" H 7550 4900 50  0001 C CNN
F 1 "GND" H 7550 5000 50  0000 C CNN
F 2 "" H 7550 5150 50  0001 C CNN
F 3 "" H 7550 5150 50  0001 C CNN
	1    7550 5150
	1    0    0    -1  
$EndComp
$Comp
L C C9
U 1 1 5B8D83BD
P 7450 3250
F 0 "C9" H 7475 3350 50  0000 L CNN
F 1 "33p" H 7475 3150 50  0000 L CNN
F 2 "Capacitors_SMD:C_0805_HandSoldering" H 7488 3100 50  0001 C CNN
F 3 "" H 7450 3250 50  0001 C CNN
	1    7450 3250
	1    0    0    -1  
$EndComp
$Comp
L GND #PWR014
U 1 1 5B8D85AD
P 7450 3450
F 0 "#PWR014" H 7450 3200 50  0001 C CNN
F 1 "GND" H 7450 3300 50  0000 C CNN
F 2 "" H 7450 3450 50  0001 C CNN
F 3 "" H 7450 3450 50  0001 C CNN
	1    7450 3450
	1    0    0    -1  
$EndComp
Text Notes 9700 4050 0    60   ~ 0
Micro SIM Holder
$Comp
L C C10
U 1 1 5B8E7B5F
P 4100 6800
F 0 "C10" H 4125 6900 50  0000 L CNN
F 1 "0.1u" H 4125 6700 50  0000 L CNN
F 2 "Capacitors_SMD:C_0805_HandSoldering" H 4138 6650 50  0001 C CNN
F 3 "" H 4100 6800 50  0001 C CNN
	1    4100 6800
	1    0    0    -1  
$EndComp
$Comp
L GND #PWR015
U 1 1 5B8E7D99
P 4100 7000
F 0 "#PWR015" H 4100 6750 50  0001 C CNN
F 1 "GND" H 4100 6850 50  0000 C CNN
F 2 "" H 4100 7000 50  0001 C CNN
F 3 "" H 4100 7000 50  0001 C CNN
	1    4100 7000
	1    0    0    -1  
$EndComp
$Comp
L C C5
U 1 1 5B8EDCB1
P 7550 2800
F 0 "C5" H 7575 2900 50  0000 L CNN
F 1 "33p" H 7575 2700 50  0000 L CNN
F 2 "Capacitors_SMD:C_0805_HandSoldering" H 7588 2650 50  0001 C CNN
F 3 "" H 7550 2800 50  0001 C CNN
	1    7550 2800
	1    0    0    -1  
$EndComp
$Comp
L C C6
U 1 1 5B8EDD1F
P 7850 2800
F 0 "C6" H 7875 2900 50  0000 L CNN
F 1 "10p" H 7875 2700 50  0000 L CNN
F 2 "Capacitors_SMD:C_0805_HandSoldering" H 7888 2650 50  0001 C CNN
F 3 "" H 7850 2800 50  0001 C CNN
	1    7850 2800
	1    0    0    -1  
$EndComp
$Comp
L C C7
U 1 1 5B8EDD8C
P 8150 2800
F 0 "C7" H 8175 2900 50  0000 L CNN
F 1 "100N" H 8175 2700 50  0000 L CNN
F 2 "Capacitors_SMD:C_0805_HandSoldering" H 8188 2650 50  0001 C CNN
F 3 "" H 8150 2800 50  0001 C CNN
	1    8150 2800
	1    0    0    -1  
$EndComp
$Comp
L GND #PWR016
U 1 1 5B8EE8C4
P 8000 3450
F 0 "#PWR016" H 8000 3200 50  0001 C CNN
F 1 "GND" H 8000 3300 50  0000 C CNN
F 2 "" H 8000 3450 50  0001 C CNN
F 3 "" H 8000 3450 50  0001 C CNN
	1    8000 3450
	1    0    0    -1  
$EndComp
$Comp
L U.FL-R-SMT(10) J2
U 1 1 5B8EF184
P 3800 4650
F 0 "J2" H 3950 4700 50  0000 L BNN
F 1 "U.FL-R-SMT(10)" H 3550 4850 50  0000 L BNN
F 2 "U.FL-R-SMT_10_:HRS_U.FL-R-SMT(10)" H 3800 4650 50  0001 L BNN
F 3 "Hirose" H 3800 4650 50  0001 L BNN
F 4 "FakePackage u" H 3800 4650 50  0001 L BNN "Field4"
F 5 "U.FL-R-SMT_10_" H 3800 4650 50  0001 L BNN "Field5"
F 6 "U.FL Series 50 Ohm Receptacle Male Pins Ultra Small SMT Coaxial Connector" H 3800 4650 50  0001 L BNN "Field6"
F 7 "Unavailable" H 3800 4650 50  0001 L BNN "Field7"
F 8 "None" H 3800 4650 50  0001 L BNN "Field8"
	1    3800 4650
	-1   0    0    -1  
$EndComp
Text GLabel 5000 4250 0    60   Input ~ 0
TX
Text GLabel 7200 4250 2    60   Input ~ 0
RX
$Comp
L GND #PWR017
U 1 1 5B8F16FD
P 4100 3100
F 0 "#PWR017" H 4100 2850 50  0001 C CNN
F 1 "GND" H 4100 2950 50  0000 C CNN
F 2 "" H 4100 3100 50  0001 C CNN
F 3 "" H 4100 3100 50  0001 C CNN
	1    4100 3100
	1    0    0    -1  
$EndComp
$Comp
L R R4
U 1 1 5B8F192D
P 4750 3250
F 0 "R4" V 4830 3250 50  0000 C CNN
F 1 "1k" V 4750 3250 50  0000 C CNN
F 2 "Resistors_SMD:R_0805_HandSoldering" V 4680 3250 50  0001 C CNN
F 3 "" H 4750 3250 50  0001 C CNN
	1    4750 3250
	-1   0    0    1   
$EndComp
$Comp
L R R5
U 1 1 5B8F1D9E
P 4950 3550
F 0 "R5" V 5030 3550 50  0000 C CNN
F 1 "1k" V 4950 3550 50  0000 C CNN
F 2 "Resistors_SMD:R_0805_HandSoldering" V 4880 3550 50  0001 C CNN
F 3 "" H 4950 3550 50  0001 C CNN
	1    4950 3550
	0    -1   -1   0   
$EndComp
$Comp
L Q_NPN_BCE Q1
U 1 1 5B8EF0F7
P 4500 3550
F 0 "Q1" H 4700 3600 50  0000 L CNN
F 1 "Q_NPN_BCE" H 4700 3500 50  0000 L CNN
F 2 "MMBT2222AM3T5G_SOT-723:VMT3" H 4700 3650 50  0001 C CNN
F 3 "" H 4500 3550 50  0001 C CNN
	1    4500 3550
	-1   0    0    1   
$EndComp
$Comp
L GND #PWR018
U 1 1 5B8F37B0
P 3800 5250
F 0 "#PWR018" H 3800 5000 50  0001 C CNN
F 1 "GND" H 3800 5100 50  0000 C CNN
F 2 "" H 3800 5250 50  0001 C CNN
F 3 "" H 3800 5250 50  0001 C CNN
	1    3800 5250
	1    0    0    -1  
$EndComp
Text Notes 7150 1650 0    197  ~ 39
GSM M95 Stack
NoConn ~ 6850 2950
NoConn ~ 6850 3150
NoConn ~ 6850 3350
NoConn ~ 6850 3450
NoConn ~ 6850 3550
NoConn ~ 6850 3650
NoConn ~ 6850 3750
NoConn ~ 6850 4050
NoConn ~ 5250 3950
NoConn ~ 5250 4050
NoConn ~ 5250 3350
NoConn ~ 5250 3450
NoConn ~ 5250 3550
NoConn ~ 5250 3650
NoConn ~ 10550 4350
$Comp
L LED D2
U 1 1 5B8FC721
P 7400 3850
F 0 "D2" H 7400 3950 50  0000 C CNN
F 1 "LED" H 7400 3750 50  0000 C CNN
F 2 "LEDs:LED_0805_HandSoldering" H 7400 3850 50  0001 C CNN
F 3 "" H 7400 3850 50  0001 C CNN
	1    7400 3850
	-1   0    0    1   
$EndComp
$Comp
L R R16
U 1 1 5B8FCA70
P 7050 3850
F 0 "R16" V 7130 3850 50  0000 C CNN
F 1 "150E" V 7050 3850 50  0000 C CNN
F 2 "Resistors_SMD:R_0805_HandSoldering" V 6980 3850 50  0001 C CNN
F 3 "" H 7050 3850 50  0001 C CNN
	1    7050 3850
	0    1    1    0   
$EndComp
$Comp
L GND #PWR019
U 1 1 5B8FCDD3
P 7650 3900
F 0 "#PWR019" H 7650 3650 50  0001 C CNN
F 1 "GND" H 7650 3750 50  0000 C CNN
F 2 "" H 7650 3900 50  0001 C CNN
F 3 "" H 7650 3900 50  0001 C CNN
	1    7650 3900
	1    0    0    -1  
$EndComp
$Comp
L R R14
U 1 1 5B8F8907
P 4550 4650
F 0 "R14" V 4630 4650 50  0000 C CNN
F 1 "0E" V 4550 4650 50  0000 C CNN
F 2 "Resistors_SMD:R_0805_HandSoldering" V 4480 4650 50  0001 C CNN
F 3 "" H 4550 4650 50  0001 C CNN
	1    4550 4650
	0    1    1    0   
$EndComp
$Comp
L C C14
U 1 1 5B8F8B3C
P 4300 4950
F 0 "C14" H 4325 5050 50  0000 L CNN
F 1 "NM" H 4325 4850 50  0000 L CNN
F 2 "Resistors_SMD:R_0805" H 4338 4800 50  0001 C CNN
F 3 "" H 4300 4950 50  0001 C CNN
	1    4300 4950
	1    0    0    -1  
$EndComp
$Comp
L C C17
U 1 1 5B8F8BEF
P 4800 4950
F 0 "C17" H 4825 5050 50  0000 L CNN
F 1 "NM" H 4825 4850 50  0000 L CNN
F 2 "Resistors_SMD:R_0805" H 4838 4800 50  0001 C CNN
F 3 "" H 4800 4950 50  0001 C CNN
	1    4800 4950
	1    0    0    -1  
$EndComp
$Comp
L GND #PWR020
U 1 1 5B8F92D1
P 4550 5300
F 0 "#PWR020" H 4550 5050 50  0001 C CNN
F 1 "GND" H 4550 5150 50  0000 C CNN
F 2 "" H 4550 5300 50  0001 C CNN
F 3 "" H 4550 5300 50  0001 C CNN
	1    4550 5300
	1    0    0    -1  
$EndComp
$Comp
L MSP430FR2311IPW20R U2
U 1 1 5B9108D8
P 2550 6800
F 0 "U2" H 2199 7503 50  0000 L BNN
F 1 "MSP430FR2433IPW20R" H 2100 6000 50  0000 L BNN
F 2 "MSP430FR2433IRGER:QFN50P400X400X100-25N" H 2400 6850 50  0001 L BNN
F 3 "Texas Instruments" H 2400 6850 50  0001 L BNN
F 4 "None" H 2400 6850 50  0001 L BNN "Field4"
F 5 "Unavailable" H 2400 6850 50  0001 L BNN "Field5"
F 6 "TSSOP-20 Texas Instruments" H 2400 6850 50  0001 L BNN "Field6"
F 7 "MSP430FR2433IPW20R" H 2400 6850 50  0001 L BNN "Field7"
F 8 "MSP430FRxx, Mixed Signal Microcontroller 20-TSSOP -40 to 85" H 2400 6850 50  0001 L BNN "Field8"
	1    2550 6800
	1    0    0    -1  
$EndComp
Text GLabel 3350 6150 1    60   Input ~ 0
VBUS
$Comp
L GND #PWR021
U 1 1 5B9193BE
P 3350 7550
F 0 "#PWR021" H 3350 7300 50  0001 C CNN
F 1 "GND" H 3350 7400 50  0000 C CNN
F 2 "" H 3350 7550 50  0001 C CNN
F 3 "" H 3350 7550 50  0001 C CNN
	1    3350 7550
	1    0    0    -1  
$EndComp
Text GLabel 1600 6150 1    60   Input ~ 0
RX
$Comp
L Conn_01x06_Male J5
U 1 1 5B9209F1
P 1200 7150
F 0 "J5" H 1200 7450 50  0000 C CNN
F 1 "Conn_01x06_Male" H 1200 7500 50  0000 C CNN
F 2 "6PIN:06x2.50mm" H 1200 7150 50  0001 C CNN
F 3 "" H 1200 7150 50  0001 C CNN
	1    1200 7150
	1    0    0    1   
$EndComp
Text GLabel 1800 6150 1    60   Input ~ 0
TX
$Comp
L Conn_01x02_Male J3
U 1 1 5B98C40B
P 1200 6250
F 0 "J3" H 1200 6350 50  0000 C CNN
F 1 "Conn_01x02_Male" H 1200 5900 50  0000 C CNN
F 2 "2PIN:02x2.5mm" H 1200 6250 50  0001 C CNN
F 3 "" H 1200 6250 50  0001 C CNN
	1    1200 6250
	1    0    0    -1  
$EndComp
$Comp
L CP1 C8
U 1 1 5B98E4E7
P 8450 2800
F 0 "C8" H 8475 2900 50  0000 L CNN
F 1 "100u" H 8475 2700 50  0000 L CNN
F 2 "Capacitors_THT:CP_Radial_D5.0mm_P2.50mm" H 8450 2800 50  0001 C CNN
F 3 "" H 8450 2800 50  0001 C CNN
	1    8450 2800
	1    0    0    -1  
$EndComp
Text GLabel 3500 6950 2    60   Input ~ 0
SIMO
Text GLabel 3500 7050 2    60   Input ~ 0
SOMI
Text GLabel 3500 7150 2    60   Input ~ 0
SCLK
Text GLabel 5100 3450 1    60   Input ~ 0
PWRKEY
Text GLabel 5250 4150 0    60   Input ~ 0
DTR
Text GLabel 7200 4450 2    60   Input ~ 0
RI
$Comp
L GND #PWR022
U 1 1 5B99313C
P 1950 4250
F 0 "#PWR022" H 1950 4000 50  0001 C CNN
F 1 "GND" H 2100 4250 50  0000 C CNN
F 2 "" H 1950 4250 50  0001 C CNN
F 3 "" H 1950 4250 50  0001 C CNN
	1    1950 4250
	1    0    0    -1  
$EndComp
Text GLabel 1400 4650 2    60   Input ~ 0
SIMO
Text GLabel 1400 4750 2    60   Input ~ 0
SOMI
Text GLabel 1400 4850 2    60   Input ~ 0
SCLK
Text GLabel 1400 4950 2    60   Input ~ 0
SS
Text GLabel 1400 5050 2    60   Input ~ 0
GPIO
Text Notes 2000 3250 0    60   ~ 0
Power \nConnector
Text Notes 1700 5150 0    60   ~ 0
SPI GSM
Text Notes 1500 5500 0    60   ~ 0
SS & GPIO\nof other stack
Text GLabel 1500 6750 0    60   Input ~ 0
PWRKEY
Text GLabel 1800 6650 0    60   Input ~ 0
DTR
Text GLabel 6850 4150 2    60   Input ~ 0
CTS
Text GLabel 6850 4350 2    60   Input ~ 0
DCD
Text GLabel 3500 7250 2    60   Input ~ 0
SS
Text GLabel 3500 7350 2    60   Input ~ 0
GPIO
Text GLabel 5200 4350 0    60   Input ~ 0
RTS
Text GLabel 3500 6150 1    60   Input ~ 0
CTS
Text GLabel 3650 6150 1    60   Input ~ 0
DCD
Text GLabel 3950 6150 1    60   Input ~ 0
RI
Text GLabel 3800 6150 1    60   Input ~ 0
RTS
$Comp
L Conn_01x02_Male J4
U 1 1 5B9BE87E
P 1200 6450
F 0 "J4" H 1100 6550 50  0000 C CNN
F 1 "Conn_01x02_Male" H 1200 6300 50  0000 C CNN
F 2 "2PIN:02x2.5mm" H 1200 6450 50  0001 C CNN
F 3 "" H 1200 6450 50  0001 C CNN
	1    1200 6450
	1    0    0    -1  
$EndComp
$Comp
L Conn_01x08_Male J6
U 1 1 5B9C5676
P 1200 3150
F 0 "J6" H 1200 3550 50  0000 C CNN
F 1 "Conn_01x08_Male" H 1200 2650 50  0000 C CNN
F 2 "8PIN:08x2.50mm" H 1200 3150 50  0001 C CNN
F 3 "" H 1200 3150 50  0001 C CNN
	1    1200 3150
	1    0    0    -1  
$EndComp
$Comp
L +5V #PWR023
U 1 1 5B9C571B
P 1600 2800
F 0 "#PWR023" H 1600 2650 50  0001 C CNN
F 1 "+5V" H 1600 2940 50  0000 C CNN
F 2 "" H 1600 2800 50  0001 C CNN
F 3 "" H 1600 2800 50  0001 C CNN
	1    1600 2800
	1    0    0    -1  
$EndComp
$Comp
L GND #PWR024
U 1 1 5B9C579E
P 1600 3600
F 0 "#PWR024" H 1600 3350 50  0001 C CNN
F 1 "GND" H 1600 3450 50  0000 C CNN
F 2 "" H 1600 3600 50  0001 C CNN
F 3 "" H 1600 3600 50  0001 C CNN
	1    1600 3600
	1    0    0    -1  
$EndComp
NoConn ~ 1400 5450
NoConn ~ 1400 5350
NoConn ~ 1400 5250
NoConn ~ 1400 5150
Text GLabel 2600 4450 2    60   Input ~ 0
VBUS
Text Notes 5800 6800 0    60   ~ 0
Flags
Text Notes 2450 6000 0    60   ~ 0
MCU
Text Notes 8150 5050 0    60   ~ 0
ESD Protector
$Comp
L C C18
U 1 1 5B9D55D4
P 2400 4650
F 0 "C18" H 2425 4750 50  0000 L CNN
F 1 "0.1u" H 2425 4550 50  0000 L CNN
F 2 "Capacitors_SMD:C_0805_HandSoldering" H 2438 4500 50  0001 C CNN
F 3 "" H 2400 4650 50  0001 C CNN
	1    2400 4650
	1    0    0    -1  
$EndComp
$Comp
L GND #PWR025
U 1 1 5B9D55DA
P 2400 4950
F 0 "#PWR025" H 2400 4700 50  0001 C CNN
F 1 "GND" H 2550 4900 50  0000 C CNN
F 2 "" H 2400 4950 50  0001 C CNN
F 3 "" H 2400 4950 50  0001 C CNN
	1    2400 4950
	1    0    0    -1  
$EndComp
$Comp
L C C19
U 1 1 5B9D686D
P 1750 3200
F 0 "C19" H 1775 3300 50  0000 L CNN
F 1 "0.1u" H 1775 3100 50  0000 L CNN
F 2 "Capacitors_SMD:C_0805_HandSoldering" H 1788 3050 50  0001 C CNN
F 3 "" H 1750 3200 50  0001 C CNN
	1    1750 3200
	1    0    0    -1  
$EndComp
$Comp
L Conn_01x14_Male J7
U 1 1 5B9F70FC
P 1200 4750
F 0 "J7" H 1200 5450 50  0000 C CNN
F 1 "Conn_01x14_Male" H 1200 3950 50  0000 C CNN
F 2 "14PIN:14x2.50mm_Straight" H 1200 4750 50  0001 C CNN
F 3 "" H 1200 4750 50  0001 C CNN
	1    1200 4750
	1    0    0    -1  
$EndComp
$Comp
L R R6
U 1 1 5B9F85DC
P 2050 4550
F 0 "R6" V 2130 4550 50  0000 C CNN
F 1 "47k" V 2050 4550 50  0000 C CNN
F 2 "Resistors_SMD:R_0805_HandSoldering" V 1980 4550 50  0001 C CNN
F 3 "" H 2050 4550 50  0001 C CNN
	1    2050 4550
	0    -1   -1   0   
$EndComp
$Comp
L C C20
U 1 1 5B9F9600
P 1850 4750
F 0 "C20" H 1875 4850 50  0000 L CNN
F 1 "1000p" H 1875 4650 50  0000 L CNN
F 2 "Capacitors_SMD:C_0805_HandSoldering" H 1888 4600 50  0001 C CNN
F 3 "" H 1850 4750 50  0001 C CNN
	1    1850 4750
	1    0    0    -1  
$EndComp
$Comp
L GND #PWR026
U 1 1 5B9F9764
P 1850 4950
F 0 "#PWR026" H 1850 4700 50  0001 C CNN
F 1 "GND" H 2000 4900 50  0000 C CNN
F 2 "" H 1850 4950 50  0001 C CNN
F 3 "" H 1850 4950 50  0001 C CNN
	1    1850 4950
	1    0    0    -1  
$EndComp
Text GLabel 1650 4050 1    60   Input ~ 0
~RST
Wire Notes Line
	3050 3800 450  3800
Connection ~ 1650 4550
Wire Wire Line
	1650 4050 1650 4550
Connection ~ 1850 4550
Wire Wire Line
	1850 4550 1850 4600
Wire Wire Line
	1850 4950 1850 4900
Connection ~ 2250 4450
Wire Wire Line
	2250 4450 2250 4550
Wire Wire Line
	2250 4550 2200 4550
Wire Wire Line
	1400 4550 1900 4550
Connection ~ 1850 4450
Wire Wire Line
	1850 4350 1850 4450
Wire Wire Line
	1400 4350 1850 4350
Connection ~ 1850 4250
Wire Wire Line
	1850 4150 1850 4250
Wire Wire Line
	1400 4150 1850 4150
Wire Wire Line
	1750 3450 1750 3350
Wire Wire Line
	1750 2950 1750 3050
Connection ~ 2400 4450
Wire Wire Line
	2400 4450 2400 4500
Wire Wire Line
	2400 4950 2400 4800
Connection ~ 8150 3000
Wire Wire Line
	8150 3000 8150 2950
Connection ~ 8000 3000
Wire Wire Line
	8000 3000 8000 3450
Connection ~ 8450 2650
Connection ~ 8150 2650
Connection ~ 7850 2650
Connection ~ 7550 2650
Wire Wire Line
	6950 2650 8750 2650
Wire Notes Line
	6950 6550 5000 6550
Wire Notes Line
	5000 5700 5000 7800
Wire Notes Line
	450  5700 5000 5700
Wire Notes Line
	3050 2550 3050 5700
Wire Notes Line
	450  2550 11250 2550
Wire Notes Line
	5000 450  5000 2550
Wire Wire Line
	3250 6250 4100 6250
Wire Wire Line
	1400 7350 1850 7350
Wire Wire Line
	1400 7250 1850 7250
Wire Wire Line
	1400 7150 1850 7150
Wire Wire Line
	1400 7050 1850 7050
Wire Wire Line
	1400 6950 1850 6950
Wire Wire Line
	1400 6850 1850 6850
Wire Wire Line
	1400 4450 2600 4450
Wire Wire Line
	1400 4250 1950 4250
Connection ~ 1600 3450
Wire Wire Line
	1400 3450 1750 3450
Connection ~ 1600 3350
Wire Wire Line
	1400 3350 1600 3350
Connection ~ 1600 3550
Wire Wire Line
	1400 3250 1600 3250
Connection ~ 1600 3050
Wire Wire Line
	1600 3150 1400 3150
Connection ~ 1600 2950
Wire Wire Line
	1600 3050 1400 3050
Connection ~ 1600 2850
Wire Wire Line
	1400 2950 1750 2950
Wire Wire Line
	1600 2800 1600 3150
Wire Wire Line
	1400 2850 1600 2850
Wire Wire Line
	1600 3550 1400 3550
Wire Wire Line
	1600 3250 1600 3600
Wire Wire Line
	4100 6250 4100 6650
Wire Wire Line
	3950 6750 3250 6750
Wire Wire Line
	3800 6650 3250 6650
Wire Wire Line
	3650 6550 3250 6550
Wire Wire Line
	3500 6450 3250 6450
Wire Wire Line
	3250 6350 3350 6350
Wire Wire Line
	1800 6650 1850 6650
Wire Wire Line
	1500 6750 1850 6750
Wire Wire Line
	3800 6150 3800 6650
Wire Wire Line
	3950 6150 3950 6750
Wire Wire Line
	3650 6150 3650 6550
Wire Wire Line
	3500 6150 3500 6450
Wire Wire Line
	3250 7250 3500 7250
Wire Wire Line
	3500 7350 3250 7350
Wire Wire Line
	3500 7150 3250 7150
Wire Wire Line
	3250 7050 3500 7050
Wire Wire Line
	3250 6950 3500 6950
Wire Wire Line
	3250 6850 3350 6850
Wire Wire Line
	5250 4150 5250 4150
Wire Wire Line
	5100 3550 5100 3450
Connection ~ 1600 6550
Wire Wire Line
	1600 6150 1600 6550
Connection ~ 1800 6450
Wire Wire Line
	1800 6150 1800 6450
Wire Wire Line
	1400 6550 1850 6550
Wire Wire Line
	1400 6450 1850 6450
Wire Wire Line
	1400 6350 1850 6350
Wire Wire Line
	1400 6250 1850 6250
Wire Wire Line
	8950 5500 9000 5500
Wire Wire Line
	7950 5300 7850 5300
Connection ~ 9000 3050
Wire Wire Line
	9000 5500 9000 3050
Connection ~ 7850 4650
Wire Wire Line
	7850 5300 7850 4650
Connection ~ 3350 7450
Wire Wire Line
	3350 7450 3250 7450
Connection ~ 3350 6850
Connection ~ 3350 6250
Wire Wire Line
	3350 6250 3350 6150
Wire Wire Line
	3350 6350 3350 7550
Connection ~ 4550 5300
Wire Wire Line
	4800 5300 4800 5100
Wire Wire Line
	4300 5300 4300 5100
Wire Wire Line
	4300 5300 4800 5300
Connection ~ 4300 4650
Wire Wire Line
	4300 4800 4300 4650
Connection ~ 4800 4650
Wire Wire Line
	4800 4800 4800 4650
Wire Wire Line
	4700 4650 5250 4650
Wire Wire Line
	4200 4650 4400 4650
Wire Wire Line
	7650 3850 7550 3850
Wire Wire Line
	7650 3900 7650 3850
Wire Wire Line
	7200 3850 7250 3850
Wire Wire Line
	6850 3850 6900 3850
Wire Wire Line
	5700 7400 5700 7050
Wire Wire Line
	3800 5250 3800 5200
Connection ~ 4400 3050
Wire Wire Line
	4750 3050 4750 3100
Connection ~ 4750 3550
Wire Wire Line
	4750 3400 4750 3550
Wire Wire Line
	4700 3550 4800 3550
Wire Wire Line
	4100 3050 4100 3100
Wire Wire Line
	4100 3050 4750 3050
Wire Wire Line
	4400 3350 4400 3050
Wire Wire Line
	4400 3850 5250 3850
Wire Wire Line
	4400 3750 4400 3850
Wire Wire Line
	6850 4450 7200 4450
Wire Wire Line
	6850 4250 7200 4250
Wire Wire Line
	5000 4250 5250 4250
Connection ~ 7850 3000
Wire Wire Line
	7850 2950 7850 3000
Wire Wire Line
	7550 3000 7550 2950
Wire Wire Line
	7550 3000 8450 3000
Wire Wire Line
	8450 3000 8450 2950
Connection ~ 6950 2750
Wire Wire Line
	6950 2850 6850 2850
Wire Wire Line
	6950 2650 6950 2850
Wire Wire Line
	6950 2750 6850 2750
Wire Wire Line
	4100 7000 4100 6950
Wire Wire Line
	7450 3450 7450 3400
Connection ~ 7450 3050
Wire Wire Line
	7450 3100 7450 3050
Connection ~ 7550 5150
Wire Wire Line
	7650 5150 7650 5050
Wire Wire Line
	7450 5150 7450 5050
Wire Wire Line
	7450 5150 7650 5150
Connection ~ 7650 4650
Wire Wire Line
	7650 4750 7650 4650
Connection ~ 7450 4550
Wire Wire Line
	7450 4750 7450 4550
Connection ~ 7100 6100
Wire Wire Line
	5150 6100 7400 6100
Wire Wire Line
	7100 6400 7100 6400
Connection ~ 7800 6100
Wire Wire Line
	7800 5500 7800 6100
Wire Wire Line
	7950 5500 7800 5500
Wire Wire Line
	7700 6100 10650 6100
Connection ~ 10800 4950
Wire Wire Line
	10550 4950 10800 4950
Wire Wire Line
	10650 6100 10650 4650
Wire Wire Line
	10650 4650 10550 4650
Wire Wire Line
	5150 4550 5150 6100
Wire Wire Line
	5250 4550 5150 4550
Connection ~ 10800 4250
Wire Wire Line
	10800 4250 10550 4250
Wire Wire Line
	10800 3050 10800 4350
Wire Wire Line
	6850 3050 10800 3050
Wire Wire Line
	1500 1400 1700 1400
Wire Wire Line
	850  1200 1700 1200
Wire Wire Line
	1500 1200 1500 1300
Wire Wire Line
	1500 1300 1700 1300
Wire Wire Line
	850  1200 850  1050
Connection ~ 1500 1200
Wire Wire Line
	950  1500 950  1200
Connection ~ 950  1200
Wire Wire Line
	1250 1200 1250 1500
Connection ~ 1250 1200
Wire Wire Line
	950  1800 950  2100
Wire Wire Line
	950  2100 1500 2100
Wire Wire Line
	1250 1800 1250 2200
Connection ~ 1250 2100
Wire Wire Line
	4100 1200 4100 1450
Connection ~ 4100 1200
Wire Wire Line
	3800 1200 3800 1450
Connection ~ 3800 1200
Wire Wire Line
	3100 1250 3100 1200
Connection ~ 3100 1200
Wire Wire Line
	2800 1300 2800 1650
Wire Wire Line
	2800 1650 3100 1650
Wire Wire Line
	3100 1550 3100 1700
Connection ~ 3100 1650
Wire Wire Line
	3500 1200 3500 1450
Connection ~ 3500 1200
Wire Wire Line
	3100 2000 3100 2100
Wire Wire Line
	3100 2100 4450 2100
Wire Wire Line
	3950 2100 3950 2200
Connection ~ 3950 2100
Wire Wire Line
	4100 2100 4100 1750
Connection ~ 4100 2100
Wire Wire Line
	3800 2100 3800 1750
Connection ~ 3800 2100
Wire Wire Line
	3500 1750 3500 2100
Connection ~ 3500 2100
Connection ~ 4450 1200
Wire Notes Line
	11250 3200 11250 3250
Wire Wire Line
	1500 2100 1500 1400
Wire Wire Line
	1700 1500 1500 1500
Connection ~ 1500 1500
Wire Wire Line
	4450 1200 4450 1550
Wire Wire Line
	4450 2100 4450 1750
Wire Wire Line
	2800 1200 4600 1200
Wire Wire Line
	6150 7400 6150 7050
Wire Wire Line
	6850 4850 7050 4850
Wire Wire Line
	7050 4850 7050 5600
Wire Wire Line
	7050 5450 6850 5450
Connection ~ 7050 5450
Wire Wire Line
	6850 4950 7050 4950
Connection ~ 7050 4950
Wire Wire Line
	7050 5050 6850 5050
Connection ~ 7050 5050
Wire Wire Line
	7050 5150 6850 5150
Connection ~ 7050 5150
Wire Wire Line
	7050 5250 6850 5250
Connection ~ 7050 5250
Wire Wire Line
	7050 5350 6850 5350
Connection ~ 7050 5350
Wire Wire Line
	10800 4650 10800 5100
Wire Wire Line
	7950 5700 7900 5700
Wire Wire Line
	7900 5700 7900 5850
Wire Wire Line
	9250 5350 9250 5300
Wire Wire Line
	8950 5300 9400 5300
Wire Wire Line
	9250 5800 9250 5650
Wire Wire Line
	6850 4550 6900 4550
Wire Wire Line
	6850 4650 7100 4650
Connection ~ 9250 5300
Wire Wire Line
	7200 4550 9550 4550
Wire Wire Line
	7400 4650 9550 4650
Wire Wire Line
	9100 5700 8950 5700
Wire Wire Line
	9100 4550 9100 5700
Connection ~ 9100 4550
Text GLabel 1450 6150 1    60   Input ~ 0
~RST
Wire Wire Line
	1450 6150 1450 6250
Connection ~ 1450 6250
Wire Wire Line
	5200 4350 5250 4350
$Comp
L MMSZ5224BT1G D1
U 1 1 5BA8A999
P 4450 1650
F 0 "D1" H 4380 1725 50  0000 L BNN
F 1 "MMSZ5224BT1G" H 4150 1400 50  0001 L BNN
F 2 "SOD3716X117N" H 4450 1650 50  0001 L BNN
F 3 "SOD-123 ON Semiconductor" H 4450 1650 50  0001 L BNN
F 4 "MMSZ5224BT1G" H 4450 1650 50  0001 L BNN "Field4"
F 5 "Zener Voltage Regulators 500 mW SOD123 Surface Mount" H 4450 1650 50  0001 L BNN "Field5"
F 6 "ON Semiconductor" H 4450 1650 50  0001 L BNN "Field6"
F 7 "Warning" H 4450 1650 50  0001 L BNN "Field7"
F 8 "0.03 USD" H 4450 1650 50  0001 L BNN "Field8"
	1    4450 1650
	0    -1   -1   0   
$EndComp
$Comp
L SIM_Holder J1
U 1 1 5BA8FEB6
P 10050 4550
F 0 "J1" H 9769 4971 50  0000 L BNN
F 1 "SIM_Holder" H 9759 3968 50  0000 L BNN
F 2 "SIM_Holder:SIM_holder_6pin" H 10050 4550 50  0001 L BNN
F 3 "Good" H 10050 4550 50  0001 L BNN
F 4 "None" H 10050 4550 50  0001 L BNN "Field4"
F 5 "SIM_Holder" H 10050 4550 50  0001 L BNN "Field5"
F 6 "SIM_Holder" H 10050 4550 50  0001 L BNN "Field6"
F 7 "SIM_Holder" H 10050 4550 50  0001 L BNN "Field7"
F 8 "Molex" H 10050 4550 50  0001 L BNN "Field8"
	1    10050 4550
	1    0    0    -1  
$EndComp
$EndSCHEMATC
