M48
;DRILL file {KiCad 4.0.7-e2-6376~58~ubuntu16.04.1} date Wed May  9 17:01:02 2018
;FORMAT={2:4/ absolute / inch / suppress leading zeros}
FMAT,2
INCH,TZ
T1C0.031
T2C0.035
T3C0.047
T4C0.060
T5C0.126
%
G90
G05
M72
T1
X59300Y-31200
X59300Y-32200
X59350Y-37000
X59350Y-38000
X59350Y-42500
X59350Y-43500
X62300Y-31200
X62300Y-32200
X62350Y-37000
X62350Y-38000
X62350Y-42500
X62350Y-43500
T2
X64016Y-38000
X65000Y-38000
X65300Y-41750
X65300Y-42734
T3
X46050Y-31200
X46100Y-37000
X46100Y-42500
X58050Y-31200
X58100Y-37000
X58100Y-42500
T4
X43550Y-30200
X43550Y-32200
X43600Y-36000
X43600Y-38000
X43600Y-41500
X43600Y-43500
T5
X60500Y-34500
X60550Y-40250
T0
M30
