PCBNEW-LibModule-V1  
# encoding utf-8
Units mm
$INDEX
QFP50P1600X1600X160-100N
$EndINDEX
$MODULE QFP50P1600X1600X160-100N
Po 0 0 0 15 00000000 00000000 ~~
Li QFP50P1600X1600X160-100N
Cd 
Sc 00000000
At SMD
Op 0 0 0
.SolderMask 0
.SolderPaste 0
T0 -5.27287 -9.65856 1.00244 1.00244 0 0.05 N V 21 "QFP50P1600X1600X160-100N"
T1 -4.93273 9.68014 1.00156 1.00156 0 0.05 N V 21 "VAL**"
DS -6.6 -6.6 6.6 -6.6 0.2 21
DS 6.6 -6.6 6.6 6.6 0.2 21
DS 6.6 6.6 -6.6 6.6 0.2 21
DS -6.6 6.6 -6.6 -6.6 0.2 21
DS -8.7 -8.7 8.7 -8.7 0.05 24
DS 8.7 -8.7 8.7 8.7 0.05 24
DS 8.7 8.7 -8.7 8.7 0.05 24
DS -8.7 8.7 -8.7 -8.7 0.05 24
DC -7.8 -6.7 -7.6 -6.7 0 21
DC -5.5 -5.5 -5.1 -5.5 0 24
DC -5.5 -5.5 -5.13945 -5.5 0.3 21
DC -5.5 -5.5 -5.35858 -5.5 0.3 21
$PAD
Sh "1" R 1.5 0.3 0 0 0
At SMD N 00888000
.SolderMask 0
.SolderPaste 0
Ne 0 ""
Po -7.7 -6
$EndPAD
$PAD
Sh "2" R 1.5 0.3 0 0 0
At SMD N 00888000
.SolderMask 0
.SolderPaste 0
Ne 0 ""
Po -7.7 -5.5
$EndPAD
$PAD
Sh "3" R 1.5 0.3 0 0 0
At SMD N 00888000
.SolderMask 0
.SolderPaste 0
Ne 0 ""
Po -7.7 -5
$EndPAD
$PAD
Sh "4" R 1.5 0.3 0 0 0
At SMD N 00888000
.SolderMask 0
.SolderPaste 0
Ne 0 ""
Po -7.7 -4.5
$EndPAD
$PAD
Sh "5" R 1.5 0.3 0 0 0
At SMD N 00888000
.SolderMask 0
.SolderPaste 0
Ne 0 ""
Po -7.7 -4
$EndPAD
$PAD
Sh "6" R 1.5 0.3 0 0 0
At SMD N 00888000
.SolderMask 0
.SolderPaste 0
Ne 0 ""
Po -7.7 -3.5
$EndPAD
$PAD
Sh "7" R 1.5 0.3 0 0 0
At SMD N 00888000
.SolderMask 0
.SolderPaste 0
Ne 0 ""
Po -7.7 -3
$EndPAD
$PAD
Sh "8" R 1.5 0.3 0 0 0
At SMD N 00888000
.SolderMask 0
.SolderPaste 0
Ne 0 ""
Po -7.7 -2.5
$EndPAD
$PAD
Sh "9" R 1.5 0.3 0 0 0
At SMD N 00888000
.SolderMask 0
.SolderPaste 0
Ne 0 ""
Po -7.7 -2
$EndPAD
$PAD
Sh "10" R 1.5 0.3 0 0 0
At SMD N 00888000
.SolderMask 0
.SolderPaste 0
Ne 0 ""
Po -7.7 -1.5
$EndPAD
$PAD
Sh "11" R 1.5 0.3 0 0 0
At SMD N 00888000
.SolderMask 0
.SolderPaste 0
Ne 0 ""
Po -7.7 -1
$EndPAD
$PAD
Sh "12" R 1.5 0.3 0 0 0
At SMD N 00888000
.SolderMask 0
.SolderPaste 0
Ne 0 ""
Po -7.7 -0.5
$EndPAD
$PAD
Sh "13" R 1.5 0.3 0 0 0
At SMD N 00888000
.SolderMask 0
.SolderPaste 0
Ne 0 ""
Po -7.7 0
$EndPAD
$PAD
Sh "14" R 1.5 0.3 0 0 0
At SMD N 00888000
.SolderMask 0
.SolderPaste 0
Ne 0 ""
Po -7.7 0.5
$EndPAD
$PAD
Sh "15" R 1.5 0.3 0 0 0
At SMD N 00888000
.SolderMask 0
.SolderPaste 0
Ne 0 ""
Po -7.7 1
$EndPAD
$PAD
Sh "16" R 1.5 0.3 0 0 0
At SMD N 00888000
.SolderMask 0
.SolderPaste 0
Ne 0 ""
Po -7.7 1.5
$EndPAD
$PAD
Sh "17" R 1.5 0.3 0 0 0
At SMD N 00888000
.SolderMask 0
.SolderPaste 0
Ne 0 ""
Po -7.7 2
$EndPAD
$PAD
Sh "18" R 1.5 0.3 0 0 0
At SMD N 00888000
.SolderMask 0
.SolderPaste 0
Ne 0 ""
Po -7.7 2.5
$EndPAD
$PAD
Sh "19" R 1.5 0.3 0 0 0
At SMD N 00888000
.SolderMask 0
.SolderPaste 0
Ne 0 ""
Po -7.7 3
$EndPAD
$PAD
Sh "20" R 1.5 0.3 0 0 0
At SMD N 00888000
.SolderMask 0
.SolderPaste 0
Ne 0 ""
Po -7.7 3.5
$EndPAD
$PAD
Sh "21" R 1.5 0.3 0 0 0
At SMD N 00888000
.SolderMask 0
.SolderPaste 0
Ne 0 ""
Po -7.7 4
$EndPAD
$PAD
Sh "22" R 1.5 0.3 0 0 0
At SMD N 00888000
.SolderMask 0
.SolderPaste 0
Ne 0 ""
Po -7.7 4.5
$EndPAD
$PAD
Sh "23" R 1.5 0.3 0 0 0
At SMD N 00888000
.SolderMask 0
.SolderPaste 0
Ne 0 ""
Po -7.7 5
$EndPAD
$PAD
Sh "24" R 1.5 0.3 0 0 0
At SMD N 00888000
.SolderMask 0
.SolderPaste 0
Ne 0 ""
Po -7.7 5.5
$EndPAD
$PAD
Sh "25" R 1.5 0.3 0 0 0
At SMD N 00888000
.SolderMask 0
.SolderPaste 0
Ne 0 ""
Po -7.7 6
$EndPAD
$PAD
Sh "26" R 1.5 0.3 0 0 900
At SMD N 00888000
.SolderMask 0
.SolderPaste 0
Ne 0 ""
Po -6 7.7
$EndPAD
$PAD
Sh "27" R 1.5 0.3 0 0 900
At SMD N 00888000
.SolderMask 0
.SolderPaste 0
Ne 0 ""
Po -5.5 7.7
$EndPAD
$PAD
Sh "28" R 1.5 0.3 0 0 900
At SMD N 00888000
.SolderMask 0
.SolderPaste 0
Ne 0 ""
Po -5 7.7
$EndPAD
$PAD
Sh "29" R 1.5 0.3 0 0 900
At SMD N 00888000
.SolderMask 0
.SolderPaste 0
Ne 0 ""
Po -4.5 7.7
$EndPAD
$PAD
Sh "30" R 1.5 0.3 0 0 900
At SMD N 00888000
.SolderMask 0
.SolderPaste 0
Ne 0 ""
Po -4 7.7
$EndPAD
$PAD
Sh "31" R 1.5 0.3 0 0 900
At SMD N 00888000
.SolderMask 0
.SolderPaste 0
Ne 0 ""
Po -3.5 7.7
$EndPAD
$PAD
Sh "32" R 1.5 0.3 0 0 900
At SMD N 00888000
.SolderMask 0
.SolderPaste 0
Ne 0 ""
Po -3 7.7
$EndPAD
$PAD
Sh "33" R 1.5 0.3 0 0 900
At SMD N 00888000
.SolderMask 0
.SolderPaste 0
Ne 0 ""
Po -2.5 7.7
$EndPAD
$PAD
Sh "34" R 1.5 0.3 0 0 900
At SMD N 00888000
.SolderMask 0
.SolderPaste 0
Ne 0 ""
Po -2 7.7
$EndPAD
$PAD
Sh "35" R 1.5 0.3 0 0 900
At SMD N 00888000
.SolderMask 0
.SolderPaste 0
Ne 0 ""
Po -1.5 7.7
$EndPAD
$PAD
Sh "36" R 1.5 0.3 0 0 900
At SMD N 00888000
.SolderMask 0
.SolderPaste 0
Ne 0 ""
Po -1 7.7
$EndPAD
$PAD
Sh "37" R 1.5 0.3 0 0 900
At SMD N 00888000
.SolderMask 0
.SolderPaste 0
Ne 0 ""
Po -0.5 7.7
$EndPAD
$PAD
Sh "38" R 1.5 0.3 0 0 900
At SMD N 00888000
.SolderMask 0
.SolderPaste 0
Ne 0 ""
Po 0 7.7
$EndPAD
$PAD
Sh "39" R 1.5 0.3 0 0 900
At SMD N 00888000
.SolderMask 0
.SolderPaste 0
Ne 0 ""
Po 0.5 7.7
$EndPAD
$PAD
Sh "40" R 1.5 0.3 0 0 900
At SMD N 00888000
.SolderMask 0
.SolderPaste 0
Ne 0 ""
Po 1 7.7
$EndPAD
$PAD
Sh "41" R 1.5 0.3 0 0 900
At SMD N 00888000
.SolderMask 0
.SolderPaste 0
Ne 0 ""
Po 1.5 7.7
$EndPAD
$PAD
Sh "42" R 1.5 0.3 0 0 900
At SMD N 00888000
.SolderMask 0
.SolderPaste 0
Ne 0 ""
Po 2 7.7
$EndPAD
$PAD
Sh "43" R 1.5 0.3 0 0 900
At SMD N 00888000
.SolderMask 0
.SolderPaste 0
Ne 0 ""
Po 2.5 7.7
$EndPAD
$PAD
Sh "44" R 1.5 0.3 0 0 900
At SMD N 00888000
.SolderMask 0
.SolderPaste 0
Ne 0 ""
Po 3 7.7
$EndPAD
$PAD
Sh "45" R 1.5 0.3 0 0 900
At SMD N 00888000
.SolderMask 0
.SolderPaste 0
Ne 0 ""
Po 3.5 7.7
$EndPAD
$PAD
Sh "46" R 1.5 0.3 0 0 900
At SMD N 00888000
.SolderMask 0
.SolderPaste 0
Ne 0 ""
Po 4 7.7
$EndPAD
$PAD
Sh "47" R 1.5 0.3 0 0 900
At SMD N 00888000
.SolderMask 0
.SolderPaste 0
Ne 0 ""
Po 4.5 7.7
$EndPAD
$PAD
Sh "48" R 1.5 0.3 0 0 900
At SMD N 00888000
.SolderMask 0
.SolderPaste 0
Ne 0 ""
Po 5 7.7
$EndPAD
$PAD
Sh "49" R 1.5 0.3 0 0 900
At SMD N 00888000
.SolderMask 0
.SolderPaste 0
Ne 0 ""
Po 5.5 7.7
$EndPAD
$PAD
Sh "50" R 1.5 0.3 0 0 900
At SMD N 00888000
.SolderMask 0
.SolderPaste 0
Ne 0 ""
Po 6 7.7
$EndPAD
$PAD
Sh "51" R 1.5 0.3 0 0 1800
At SMD N 00888000
.SolderMask 0
.SolderPaste 0
Ne 0 ""
Po 7.7 6
$EndPAD
$PAD
Sh "52" R 1.5 0.3 0 0 1800
At SMD N 00888000
.SolderMask 0
.SolderPaste 0
Ne 0 ""
Po 7.7 5.5
$EndPAD
$PAD
Sh "53" R 1.5 0.3 0 0 1800
At SMD N 00888000
.SolderMask 0
.SolderPaste 0
Ne 0 ""
Po 7.7 5
$EndPAD
$PAD
Sh "54" R 1.5 0.3 0 0 1800
At SMD N 00888000
.SolderMask 0
.SolderPaste 0
Ne 0 ""
Po 7.7 4.5
$EndPAD
$PAD
Sh "55" R 1.5 0.3 0 0 1800
At SMD N 00888000
.SolderMask 0
.SolderPaste 0
Ne 0 ""
Po 7.7 4
$EndPAD
$PAD
Sh "56" R 1.5 0.3 0 0 1800
At SMD N 00888000
.SolderMask 0
.SolderPaste 0
Ne 0 ""
Po 7.7 3.5
$EndPAD
$PAD
Sh "57" R 1.5 0.3 0 0 1800
At SMD N 00888000
.SolderMask 0
.SolderPaste 0
Ne 0 ""
Po 7.7 3
$EndPAD
$PAD
Sh "58" R 1.5 0.3 0 0 1800
At SMD N 00888000
.SolderMask 0
.SolderPaste 0
Ne 0 ""
Po 7.7 2.5
$EndPAD
$PAD
Sh "59" R 1.5 0.3 0 0 1800
At SMD N 00888000
.SolderMask 0
.SolderPaste 0
Ne 0 ""
Po 7.7 2
$EndPAD
$PAD
Sh "60" R 1.5 0.3 0 0 1800
At SMD N 00888000
.SolderMask 0
.SolderPaste 0
Ne 0 ""
Po 7.7 1.5
$EndPAD
$PAD
Sh "61" R 1.5 0.3 0 0 1800
At SMD N 00888000
.SolderMask 0
.SolderPaste 0
Ne 0 ""
Po 7.7 1
$EndPAD
$PAD
Sh "62" R 1.5 0.3 0 0 1800
At SMD N 00888000
.SolderMask 0
.SolderPaste 0
Ne 0 ""
Po 7.7 0.5
$EndPAD
$PAD
Sh "63" R 1.5 0.3 0 0 1800
At SMD N 00888000
.SolderMask 0
.SolderPaste 0
Ne 0 ""
Po 7.7 0
$EndPAD
$PAD
Sh "64" R 1.5 0.3 0 0 1800
At SMD N 00888000
.SolderMask 0
.SolderPaste 0
Ne 0 ""
Po 7.7 -0.5
$EndPAD
$PAD
Sh "65" R 1.5 0.3 0 0 1800
At SMD N 00888000
.SolderMask 0
.SolderPaste 0
Ne 0 ""
Po 7.7 -1
$EndPAD
$PAD
Sh "66" R 1.5 0.3 0 0 1800
At SMD N 00888000
.SolderMask 0
.SolderPaste 0
Ne 0 ""
Po 7.7 -1.5
$EndPAD
$PAD
Sh "67" R 1.5 0.3 0 0 1800
At SMD N 00888000
.SolderMask 0
.SolderPaste 0
Ne 0 ""
Po 7.7 -2
$EndPAD
$PAD
Sh "68" R 1.5 0.3 0 0 1800
At SMD N 00888000
.SolderMask 0
.SolderPaste 0
Ne 0 ""
Po 7.7 -2.5
$EndPAD
$PAD
Sh "69" R 1.5 0.3 0 0 1800
At SMD N 00888000
.SolderMask 0
.SolderPaste 0
Ne 0 ""
Po 7.7 -3
$EndPAD
$PAD
Sh "70" R 1.5 0.3 0 0 1800
At SMD N 00888000
.SolderMask 0
.SolderPaste 0
Ne 0 ""
Po 7.7 -3.5
$EndPAD
$PAD
Sh "71" R 1.5 0.3 0 0 1800
At SMD N 00888000
.SolderMask 0
.SolderPaste 0
Ne 0 ""
Po 7.7 -4
$EndPAD
$PAD
Sh "72" R 1.5 0.3 0 0 1800
At SMD N 00888000
.SolderMask 0
.SolderPaste 0
Ne 0 ""
Po 7.7 -4.5
$EndPAD
$PAD
Sh "73" R 1.5 0.3 0 0 1800
At SMD N 00888000
.SolderMask 0
.SolderPaste 0
Ne 0 ""
Po 7.7 -5
$EndPAD
$PAD
Sh "74" R 1.5 0.3 0 0 1800
At SMD N 00888000
.SolderMask 0
.SolderPaste 0
Ne 0 ""
Po 7.7 -5.5
$EndPAD
$PAD
Sh "75" R 1.5 0.3 0 0 1800
At SMD N 00888000
.SolderMask 0
.SolderPaste 0
Ne 0 ""
Po 7.7 -6
$EndPAD
$PAD
Sh "76" R 1.5 0.3 0 0 2700
At SMD N 00888000
.SolderMask 0
.SolderPaste 0
Ne 0 ""
Po 6 -7.7
$EndPAD
$PAD
Sh "77" R 1.5 0.3 0 0 2700
At SMD N 00888000
.SolderMask 0
.SolderPaste 0
Ne 0 ""
Po 5.5 -7.7
$EndPAD
$PAD
Sh "78" R 1.5 0.3 0 0 2700
At SMD N 00888000
.SolderMask 0
.SolderPaste 0
Ne 0 ""
Po 5 -7.7
$EndPAD
$PAD
Sh "79" R 1.5 0.3 0 0 2700
At SMD N 00888000
.SolderMask 0
.SolderPaste 0
Ne 0 ""
Po 4.5 -7.7
$EndPAD
$PAD
Sh "80" R 1.5 0.3 0 0 2700
At SMD N 00888000
.SolderMask 0
.SolderPaste 0
Ne 0 ""
Po 4 -7.7
$EndPAD
$PAD
Sh "81" R 1.5 0.3 0 0 2700
At SMD N 00888000
.SolderMask 0
.SolderPaste 0
Ne 0 ""
Po 3.5 -7.7
$EndPAD
$PAD
Sh "82" R 1.5 0.3 0 0 2700
At SMD N 00888000
.SolderMask 0
.SolderPaste 0
Ne 0 ""
Po 3 -7.7
$EndPAD
$PAD
Sh "83" R 1.5 0.3 0 0 2700
At SMD N 00888000
.SolderMask 0
.SolderPaste 0
Ne 0 ""
Po 2.5 -7.7
$EndPAD
$PAD
Sh "84" R 1.5 0.3 0 0 2700
At SMD N 00888000
.SolderMask 0
.SolderPaste 0
Ne 0 ""
Po 2 -7.7
$EndPAD
$PAD
Sh "85" R 1.5 0.3 0 0 2700
At SMD N 00888000
.SolderMask 0
.SolderPaste 0
Ne 0 ""
Po 1.5 -7.7
$EndPAD
$PAD
Sh "86" R 1.5 0.3 0 0 2700
At SMD N 00888000
.SolderMask 0
.SolderPaste 0
Ne 0 ""
Po 1 -7.7
$EndPAD
$PAD
Sh "87" R 1.5 0.3 0 0 2700
At SMD N 00888000
.SolderMask 0
.SolderPaste 0
Ne 0 ""
Po 0.5 -7.7
$EndPAD
$PAD
Sh "88" R 1.5 0.3 0 0 2700
At SMD N 00888000
.SolderMask 0
.SolderPaste 0
Ne 0 ""
Po 0 -7.7
$EndPAD
$PAD
Sh "89" R 1.5 0.3 0 0 2700
At SMD N 00888000
.SolderMask 0
.SolderPaste 0
Ne 0 ""
Po -0.5 -7.7
$EndPAD
$PAD
Sh "90" R 1.5 0.3 0 0 2700
At SMD N 00888000
.SolderMask 0
.SolderPaste 0
Ne 0 ""
Po -1 -7.7
$EndPAD
$PAD
Sh "91" R 1.5 0.3 0 0 2700
At SMD N 00888000
.SolderMask 0
.SolderPaste 0
Ne 0 ""
Po -1.5 -7.7
$EndPAD
$PAD
Sh "92" R 1.5 0.3 0 0 2700
At SMD N 00888000
.SolderMask 0
.SolderPaste 0
Ne 0 ""
Po -2 -7.7
$EndPAD
$PAD
Sh "93" R 1.5 0.3 0 0 2700
At SMD N 00888000
.SolderMask 0
.SolderPaste 0
Ne 0 ""
Po -2.5 -7.7
$EndPAD
$PAD
Sh "94" R 1.5 0.3 0 0 2700
At SMD N 00888000
.SolderMask 0
.SolderPaste 0
Ne 0 ""
Po -3 -7.7
$EndPAD
$PAD
Sh "95" R 1.5 0.3 0 0 2700
At SMD N 00888000
.SolderMask 0
.SolderPaste 0
Ne 0 ""
Po -3.5 -7.7
$EndPAD
$PAD
Sh "96" R 1.5 0.3 0 0 2700
At SMD N 00888000
.SolderMask 0
.SolderPaste 0
Ne 0 ""
Po -4 -7.7
$EndPAD
$PAD
Sh "97" R 1.5 0.3 0 0 2700
At SMD N 00888000
.SolderMask 0
.SolderPaste 0
Ne 0 ""
Po -4.5 -7.7
$EndPAD
$PAD
Sh "98" R 1.5 0.3 0 0 2700
At SMD N 00888000
.SolderMask 0
.SolderPaste 0
Ne 0 ""
Po -5 -7.7
$EndPAD
$PAD
Sh "99" R 1.5 0.3 0 0 2700
At SMD N 00888000
.SolderMask 0
.SolderPaste 0
Ne 0 ""
Po -5.5 -7.7
$EndPAD
$PAD
Sh "100" R 1.5 0.3 0 0 2700
At SMD N 00888000
.SolderMask 0
.SolderPaste 0
Ne 0 ""
Po -6 -7.7
$EndPAD
$EndMODULE QFP50P1600X1600X160-100N
