(module DC_JACK:DC_JACK (layer F.Cu) (tedit 5B362D84)
  (fp_text reference J2 (at -4.06619 -7.24288) (layer F.SilkS)
    (effects (font (size 1.40075 1.40075) (thickness 0.05)))
  )
  (fp_text value Jack-DC (at -3.18273 6.74738) (layer F.SilkS)
    (effects (font (size 1.4034 1.4034) (thickness 0.05)))
  )
  (fp_line (start 7.25 4.5) (end 3.75 4.5) (layer Dwgs.User) (width 0.127))
  (fp_line (start 3.75 4.5) (end -7.25 4.5) (layer Dwgs.User) (width 0.127))
  (fp_line (start -7.25 4.5) (end -7.25 -4.5) (layer Dwgs.User) (width 0.127))
  (fp_line (start -7.25 -4.5) (end 3.75 -4.5) (layer Dwgs.User) (width 0.127))
  (fp_line (start 3.75 -4.5) (end 7.25 -4.5) (layer Dwgs.User) (width 0.127))
  (fp_line (start 7.25 -4.5) (end 7.25 4.5) (layer Dwgs.User) (width 0.127))
  (fp_line (start 7.25 4.5) (end -7.25 4.5) (layer F.SilkS) (width 0.127))
  (fp_line (start -7.25 4.5) (end -7.25 2.7) (layer F.SilkS) (width 0.127))
  (fp_line (start -7.25 -2.5) (end -7.25 -4.5) (layer F.SilkS) (width 0.127))
  (fp_line (start -7.25 -4.5) (end -5.7 -4.5) (layer F.SilkS) (width 0.127))
  (fp_line (start 7.25 4.5) (end 7.25 -4.5) (layer F.SilkS) (width 0.127))
  (fp_line (start 7.25 -4.5) (end -1 -4.5) (layer F.SilkS) (width 0.127))
  (fp_line (start 0.05 1.5) (end -0.95 1.5) (layer Eco2.User) (width 0.01))
  (fp_line (start -0.95 1.5) (end -0.95 -1.5) (layer Eco2.User) (width 0.01))
  (fp_line (start -0.95 -1.5) (end 0.05 -1.5) (layer Eco2.User) (width 0.01))
  (fp_line (start 0.05 -1.5) (end 0.05 1.5) (layer Eco2.User) (width 0.000009))
  (fp_line (start -6.15 1.75) (end -7.15 1.75) (layer Eco2.User) (width 0.01))
  (fp_line (start -7.15 1.75) (end -7.15 -1.75) (layer Eco2.User) (width 0.01))
  (fp_line (start -7.15 -1.75) (end -6.15 -1.75) (layer Eco2.User) (width 0.01))
  (fp_line (start -6.15 -1.75) (end -6.15 1.75) (layer Eco2.User) (width 0.01))
  (fp_line (start -1.95 -4.2) (end -4.95 -4.2) (layer Eco2.User) (width 0.01))
  (fp_line (start -4.95 -4.2) (end -4.95 -5.2) (layer Eco2.User) (width 0.01))
  (fp_line (start -4.95 -5.2) (end -1.95 -5.2) (layer Eco2.User) (width 0.01))
  (fp_line (start -1.95 -5.2) (end -1.95 -4.2) (layer Eco2.User) (width 0.01))
  (fp_line (start 3.75 4.5) (end 3.75 -4.5) (layer Dwgs.User) (width 0.127))
  (fp_circle (center -8.5 0) (end -8.35 0) (layer F.SilkS) (width 0.3))
  (fp_line (start -8.2 -6.2) (end -8.2 5) (layer Eco1.User) (width 0.05))
  (fp_line (start -8.2 5) (end 7.7 5) (layer Eco1.User) (width 0.05))
  (fp_line (start 7.7 5) (end 7.7 -6.2) (layer Eco1.User) (width 0.05))
  (fp_line (start 7.7 -6.2) (end -8.2 -6.2) (layer Eco1.User) (width 0.05))
  (pad 2 thru_hole oval (at -0.45 0 270) (size 5 2.5) (drill oval 2 0.5) (layers *.Cu *.Mask))
  (pad 3 thru_hole oval (at -3.45 -4.7) (size 5 2.5) (drill oval 2 0.5) (layers *.Cu *.Mask))
  (pad 1 thru_hole oval (at -6.65 0 90) (size 5 2.5) (drill oval 2 0.5) (layers *.Cu *.Mask))
)
