PCBNEW-LibModule-V1  
# encoding utf-8
Units mm
$INDEX
XCVR_RF-LORA-868-SO
$EndINDEX
$MODULE XCVR_RF-LORA-868-SO
Po 0 0 0 15 00000000 00000000 ~~
Li XCVR_RF-LORA-868-SO
Cd 
Sc 00000000
At SMD
Op 0 0 0
.SolderMask 0
.SolderPaste 0
T0 -6.45787 -13.4179 1.40302 1.40302 0 0.05 N V 21 "XCVR_RF-LORA-868-SO"
T1 -5.77046 13.1462 1.40376 1.40376 0 0.05 N V 21 "VAL**"
DS -9.975 11.575 -9.975 -11.575 0.127 24
DS -9.975 -11.575 9.975 -11.575 0.127 24
DS 9.975 -11.575 9.975 11.575 0.127 24
DS 9.975 11.575 -9.975 11.575 0.127 24
DS -9.975 11.575 9.975 11.575 0.127 21
DS 9.975 -11.575 -9.975 -11.575 0.127 21
DS -10.225 -11.825 10.225 -11.825 0.05 26
DS 10.225 -11.825 10.225 11.825 0.05 26
DS 10.225 11.825 -10.225 11.825 0.05 26
DS -10.225 11.825 -10.225 -11.825 0.05 26
DC -10.6 -8.9 -10.45 -8.9 0.3 21
DC -10.6 -8.9 -10.45 -8.9 0.3 24
DS -9.975 -11.575 -9.975 -10.4 0.127 21
DS 9.975 11.575 9.975 10.2 0.127 21
DS -9.975 11.575 -9.975 10.2 0.127 21
DS 9.975 -11.575 9.975 -10.4 0.127 21
$PAD
Sh "4" R 2.5 1.78 0 0 1800
At SMD N 00888000
.SolderMask 0
.SolderPaste 0
Ne 0 ""
Po -8.725 -1.605
$EndPAD
$PAD
Sh "3" R 2.5 1.78 0 0 1800
At SMD N 00888000
.SolderMask 0
.SolderPaste 0
Ne 0 ""
Po -8.725 -4.145
$EndPAD
$PAD
Sh "5" R 2.5 1.78 0 0 1800
At SMD N 00888000
.SolderMask 0
.SolderPaste 0
Ne 0 ""
Po -8.725 0.935
$EndPAD
$PAD
Sh "2" R 2.5 1.78 0 0 1800
At SMD N 00888000
.SolderMask 0
.SolderPaste 0
Ne 0 ""
Po -8.725 -6.685
$EndPAD
$PAD
Sh "1" R 2.5 1.78 0 0 1800
At SMD N 00888000
.SolderMask 0
.SolderPaste 0
Ne 0 ""
Po -8.725 -9.225
$EndPAD
$PAD
Sh "6" R 2.5 1.78 0 0 1800
At SMD N 00888000
.SolderMask 0
.SolderPaste 0
Ne 0 ""
Po -8.725 3.475
$EndPAD
$PAD
Sh "7" R 2.5 1.78 0 0 1800
At SMD N 00888000
.SolderMask 0
.SolderPaste 0
Ne 0 ""
Po -8.725 6.015
$EndPAD
$PAD
Sh "8" R 2.5 1.78 0 0 1800
At SMD N 00888000
.SolderMask 0
.SolderPaste 0
Ne 0 ""
Po -8.725 8.555
$EndPAD
$PAD
Sh "9" R 2.5 1.78 0 0 1800
At SMD N 00888000
.SolderMask 0
.SolderPaste 0
Ne 0 ""
Po 8.725 8.555
$EndPAD
$PAD
Sh "10" R 2.5 1.78 0 0 1800
At SMD N 00888000
.SolderMask 0
.SolderPaste 0
Ne 0 ""
Po 8.725 6.015
$EndPAD
$PAD
Sh "11" R 2.5 1.78 0 0 1800
At SMD N 00888000
.SolderMask 0
.SolderPaste 0
Ne 0 ""
Po 8.725 3.475
$EndPAD
$PAD
Sh "12" R 2.5 1.78 0 0 1800
At SMD N 00888000
.SolderMask 0
.SolderPaste 0
Ne 0 ""
Po 8.725 0.935
$EndPAD
$PAD
Sh "13" R 2.5 1.78 0 0 1800
At SMD N 00888000
.SolderMask 0
.SolderPaste 0
Ne 0 ""
Po 8.725 -1.605
$EndPAD
$PAD
Sh "14" R 2.5 1.78 0 0 1800
At SMD N 00888000
.SolderMask 0
.SolderPaste 0
Ne 0 ""
Po 8.725 -4.145
$EndPAD
$PAD
Sh "15" R 2.5 1.78 0 0 1800
At SMD N 00888000
.SolderMask 0
.SolderPaste 0
Ne 0 ""
Po 8.725 -6.685
$EndPAD
$PAD
Sh "16" R 2.5 1.78 0 0 1800
At SMD N 00888000
.SolderMask 0
.SolderPaste 0
Ne 0 ""
Po 8.725 -9.225
$EndPAD
$EndMODULE XCVR_RF-LORA-868-SO
