PCBNEW-LibModule-V1  
# encoding utf-8
Units mm
$INDEX
SOT95P270X145-5N(SOT23-5)
$EndINDEX
$MODULE SOT95P270X145-5N(SOT23-5)
Po 0 0 0 15 00000000 00000000 ~~
Li SOT95P270X145-5N(SOT23-5)
Cd 
Sc 00000000
At SMD
Op 0 0 0
.SolderMask 0
.SolderPaste 0
T0 1.23783 -9.10836 2.28891 2.28891 0 0.05 N V 21 "SOT95P270X145-5N(SOT23-5)"
T1 2.84039 9.408 2.41575 2.41575 0 0.05 N V 21 "VAL**"
DS 1.32777 0.640581 -1.51623 0.640581 0.1524 24
DS -1.51623 -0.979419 1.32777 -0.979419 0.1524 24
DP 0 0 0 0 4 0 24
Dl -3.09952 0.680581
Dl -0.794234 0.680581
Dl -0.794234 3.18667
Dl -3.09952 3.18667
DP 0 0 0 0 4 0 24
Dl -0.820498 0.680581
Dl 0.155766 0.680581
Dl 0.155766 3.17158
Dl -0.820498 3.17158
DP 0 0 0 0 4 0 24
Dl 1.43742 0.680581
Dl 1.10577 0.680581
Dl 1.10577 3.15719
Dl 1.43742 3.15719
DP 0 0 0 0 4 0 24
Dl 1.4593 -1.66942
Dl 1.10577 -1.66942
Dl 1.10577 -2.45578
Dl 1.4593 -2.45578
DP 0 0 0 0 4 0 24
Dl -3.07705 -1.66942
Dl -0.794234 -1.66942
Dl -0.794234 -2.42344
Dl -3.07705 -2.42344
$PAD
Sh "1" R 0.55 1.2 0 0 0
At SMD N 00888000
.SolderMask 0
.SolderPaste 0
Ne 0 ""
Po -1.04423 1.13058
$EndPAD
$PAD
Sh "2" R 0.55 1.2 0 0 0
At SMD N 00888000
.SolderMask 0
.SolderPaste 0
Ne 0 ""
Po -0.0942344 1.13058
$EndPAD
$PAD
Sh "3" R 0.55 1.2 0 0 0
At SMD N 00888000
.SolderMask 0
.SolderPaste 0
Ne 0 ""
Po 0.855766 1.13058
$EndPAD
$PAD
Sh "4" R 0.55 1.2 0 0 0
At SMD N 00888000
.SolderMask 0
.SolderPaste 0
Ne 0 ""
Po 0.855766 -1.46942
$EndPAD
$PAD
Sh "5" R 0.55 1.2 0 0 0
At SMD N 00888000
.SolderMask 0
.SolderPaste 0
Ne 0 ""
Po -1.04423 -1.46942
$EndPAD
$EndMODULE SOT95P270X145-5N(SOT23-5)
