PCBNEW-LibModule-V1  
# encoding utf-8
Units mm
$INDEX
SOIC127P490X600X175-8N
$EndINDEX
$MODULE SOIC127P490X600X175-8N
Po 0 0 0 15 00000000 00000000 ~~
Li SOIC127P490X600X175-8N
Cd 
Sc 00000000
At SMD
Op 0 0 0
.SolderMask 0
.SolderPaste 0
T0 -1.38035 -4.4696 1.35975 1.35975 0 0.05 N V 21 "SOIC127P490X600X175-8N"
T1 -0.511903 4.42758 1.34699 1.34699 0 0.05 N V 21 "VAL**"
DC -4.205 -2.495 -4.005 -2.495 0 21
DC -4.205 -2.495 -4.005 -2.495 0 24
DS -1.95 -2.45 1.95 -2.45 0.127 24
DS -1.95 2.45 1.95 2.45 0.127 24
DS -1.95 -2.45 1.95 -2.45 0.127 21
DS -1.95 2.45 1.95 2.45 0.127 21
DS -1.95 -2.45 -1.95 2.45 0.127 24
DS 1.95 -2.45 1.95 2.45 0.127 24
DS -3.665 -2.7 3.665 -2.7 0.05 26
DS -3.665 2.7 3.665 2.7 0.05 26
DS -3.665 -2.7 -3.665 2.7 0.05 26
DS 3.665 -2.7 3.665 2.7 0.05 26
$PAD
Sh "1" R 1.58 0.59 0 0 0
At SMD N 00888000
.SolderMask 0
.SolderPaste 0
Ne 0 ""
Po -2.625 -1.905
$EndPAD
$PAD
Sh "2" R 1.58 0.59 0 0 0
At SMD N 00888000
.SolderMask 0
.SolderPaste 0
Ne 0 ""
Po -2.625 -0.635
$EndPAD
$PAD
Sh "3" R 1.58 0.59 0 0 0
At SMD N 00888000
.SolderMask 0
.SolderPaste 0
Ne 0 ""
Po -2.625 0.635
$EndPAD
$PAD
Sh "4" R 1.58 0.59 0 0 0
At SMD N 00888000
.SolderMask 0
.SolderPaste 0
Ne 0 ""
Po -2.625 1.905
$EndPAD
$PAD
Sh "5" R 1.58 0.59 0 0 0
At SMD N 00888000
.SolderMask 0
.SolderPaste 0
Ne 0 ""
Po 2.625 1.905
$EndPAD
$PAD
Sh "6" R 1.58 0.59 0 0 0
At SMD N 00888000
.SolderMask 0
.SolderPaste 0
Ne 0 ""
Po 2.625 0.635
$EndPAD
$PAD
Sh "7" R 1.58 0.59 0 0 0
At SMD N 00888000
.SolderMask 0
.SolderPaste 0
Ne 0 ""
Po 2.625 -0.635
$EndPAD
$PAD
Sh "8" R 1.58 0.59 0 0 0
At SMD N 00888000
.SolderMask 0
.SolderPaste 0
Ne 0 ""
Po 2.625 -1.905
$EndPAD
$EndMODULE SOIC127P490X600X175-8N
