PCBNEW-LibModule-V1  
# encoding utf-8
Units mm
$INDEX
DIOAD1060W80L520D270
$EndINDEX
$MODULE DIOAD1060W80L520D270
Po 0 0 0 15 00000000 00000000 ~~
Li DIOAD1060W80L520D270
Cd 
Sc 00000000
At STD
Op 0 0 0
.SolderMask 0
.SolderPaste 0
T0 4.94915 1.70733 0.320775 0.320775 0 0.05 N V 21 "DIOAD1060W80L520D270"
T1 4.74988 -1.80283 0.321074 0.321074 0 0.05 N V 21 "VAL**"
DS 2.6 -1.35 -1.775 -1.35 0.127 21
DS -1.775 -1.35 -2.6 -1.35 0.127 21
DS -2.6 1.35 -1.775 1.35 0.127 21
DS -1.775 1.35 2.6 1.35 0.127 21
DS -6.375 1.5 6.375 1.5 0.05 26
DS 6.375 1.5 6.375 -1.5 0.05 26
DS 6.375 -1.5 -6.375 -1.5 0.05 26
DS -6.375 -1.5 -6.375 1.5 0.05 26
DS -1.775 1.35 -1.775 -1.35 0.127 21
DS -2.6 -1.35 -2.6 0 0.127 21
DS -2.6 0 -2.6 1.35 0.127 21
DS 2.6 1.35 2.6 0 0.127 21
DS 2.6 0 2.6 -1.35 0.127 21
DS -2.6 0 -3.9 0 0.1524 21
DS 2.6 0 3.9 0 0.1524 21
$PAD
Sh "A" C 1.65 1.65 0 0 1800
Dr 1.1 0 0
At STD N 00C0FFFF
.SolderMask 0
Ne 0 ""
Po 5.3 0
$EndPAD
$PAD
Sh "C" R 1.65 1.65 0 0 1800
Dr 1.1 0 0
At STD N 00C0FFFF
.SolderMask 0
Ne 0 ""
Po -5.3 0
$EndPAD
$EndMODULE DIOAD1060W80L520D270
