(module 03x2.50mm_Straight (layer F.Cu) (tedit 5BA4A1DC)
  (descr "JST EH series connector, B03B-EH-A, 2.50mm pitch, top entry")
  (tags "connector jst eh top vertical straight")
  (fp_text reference REF** (at 2.5 -3) (layer F.SilkS)
    (effects (font (size 1 1) (thickness 0.15)))
  )
  (fp_text value JST_EH_B03B-EH-A_03x2.50mm_Straight (at 2.5 3.5) (layer F.Fab)
    (effects (font (size 1 1) (thickness 0.15)))
  )
  (fp_text user %R (at 2.5 -3) (layer F.Fab)
    (effects (font (size 1 1) (thickness 0.15)))
  )
  (pad 1 thru_hole circle (at 0 0) (size 1.85 1.85) (drill 0.8) (layers *.Cu *.Mask))
  (pad 2 thru_hole circle (at 2.5 0) (size 1.85 1.85) (drill 0.8) (layers *.Cu *.Mask))
  (pad 3 thru_hole circle (at 5 0) (size 1.85 1.85) (drill 0.8) (layers *.Cu *.Mask))
  (model Connectors_JST.3dshapes/JST_EH_B03B-EH-A_03x2.50mm_Straight.wrl
    (at (xyz 0 0 0))
    (scale (xyz 1 1 1))
    (rotate (xyz 0 0 0))
  )
)
