EESchema Schematic File Version 2
LIBS:power
LIBS:device
LIBS:switches
LIBS:relays
LIBS:motors
LIBS:transistors
LIBS:conn
LIBS:linear
LIBS:regul
LIBS:74xx
LIBS:cmos4000
LIBS:adc-dac
LIBS:memory
LIBS:xilinx
LIBS:microcontrollers
LIBS:dsp
LIBS:microchip
LIBS:analog_switches
LIBS:motorola
LIBS:texas
LIBS:intel
LIBS:audio
LIBS:interface
LIBS:digital-audio
LIBS:philips
LIBS:display
LIBS:cypress
LIBS:siliconi
LIBS:opto
LIBS:atmel
LIBS:contrib
LIBS:valves
LIBS:NE555
LIBS:LM358AN
LIBS:Sensor-cache
EELAYER 25 0
EELAYER END
$Descr A4 11693 8268
encoding utf-8
Sheet 1 1
Title "Capacitive Soil Moisture Sensor"
Date "2018-05-28"
Rev "v1.0"
Comp "Soil Agritech Pvt. Ltd."
Comment1 "Designed by Swaroop Sadarjoshi"
Comment2 ""
Comment3 ""
Comment4 ""
$EndDescr
$Comp
L NE555 U2
U 1 1 5B0BDA2E
P 4250 3400
F 0 "U2" H 3850 3750 50  0000 L CNN
F 1 "NE555" H 4350 3750 50  0000 L CNN
F 2 "NE555:DIP8_300" H 4250 3400 50  0001 C CNN
F 3 "" H 4250 3400 50  0001 C CNN
	1    4250 3400
	1    0    0    -1  
$EndComp
$Comp
L LM358 U1
U 1 1 5B0BDADB
P 6300 3300
F 0 "U1" H 6300 3500 50  0000 L CNN
F 1 "LM358" H 6300 3100 50  0000 L CNN
F 2 "LM358AN:DIP254P762X533-8" H 6300 3300 50  0001 C CNN
F 3 "" H 6300 3300 50  0001 C CNN
	1    6300 3300
	1    0    0    -1  
$EndComp
$Comp
L LM358 U1
U 2 1 5B0BDB34
P 6450 4300
F 0 "U1" H 6450 4500 50  0000 L CNN
F 1 "LM358" H 6450 4100 50  0000 L CNN
F 2 "LM358AN:DIP254P762X533-8" H 6450 4300 50  0001 C CNN
F 3 "" H 6450 4300 50  0001 C CNN
	2    6450 4300
	1    0    0    -1  
$EndComp
$Comp
L R R3
U 1 1 5B0BDB71
P 5550 3200
F 0 "R3" V 5630 3200 50  0000 C CNN
F 1 "30k" V 5550 3200 50  0000 C CNN
F 2 "Resistors_THT:R_Axial_DIN0204_L3.6mm_D1.6mm_P7.62mm_Horizontal" V 5480 3200 50  0001 C CNN
F 3 "" H 5550 3200 50  0001 C CNN
	1    5550 3200
	0    1    1    0   
$EndComp
$Comp
L R R2
U 1 1 5B0BDC6B
P 5200 3450
F 0 "R2" V 5280 3450 50  0000 C CNN
F 1 "47k" V 5200 3450 50  0000 C CNN
F 2 "Resistors_THT:R_Axial_DIN0204_L3.6mm_D1.6mm_P7.62mm_Horizontal" V 5130 3450 50  0001 C CNN
F 3 "" H 5200 3450 50  0001 C CNN
	1    5200 3450
	-1   0    0    1   
$EndComp
$Comp
L R R5
U 1 1 5B0BDD86
P 6950 3450
F 0 "R5" V 7030 3450 50  0000 C CNN
F 1 "30k" V 6950 3450 50  0000 C CNN
F 2 "Resistors_THT:R_Axial_DIN0204_L3.6mm_D1.6mm_P7.62mm_Horizontal" V 6880 3450 50  0001 C CNN
F 3 "" H 6950 3450 50  0001 C CNN
	1    6950 3450
	-1   0    0    1   
$EndComp
$Comp
L R R4
U 1 1 5B0BDDE7
P 5800 3950
F 0 "R4" V 5880 3950 50  0000 C CNN
F 1 "100k" V 5800 3950 50  0000 C CNN
F 2 "Resistors_THT:R_Axial_DIN0204_L3.6mm_D1.6mm_P7.62mm_Horizontal" V 5730 3950 50  0001 C CNN
F 3 "" H 5800 3950 50  0001 C CNN
	1    5800 3950
	-1   0    0    1   
$EndComp
$Comp
L R R6
U 1 1 5B0BDE77
P 7150 4300
F 0 "R6" V 7230 4300 50  0000 C CNN
F 1 "4.7k" V 7150 4300 50  0000 C CNN
F 2 "Resistors_THT:R_Axial_DIN0204_L3.6mm_D1.6mm_P7.62mm_Horizontal" V 7080 4300 50  0001 C CNN
F 3 "" H 7150 4300 50  0001 C CNN
	1    7150 4300
	0    -1   -1   0   
$EndComp
$Comp
L C C4
U 1 1 5B0BDEF3
P 5800 4600
F 0 "C4" H 5825 4700 50  0000 L CNN
F 1 "2.2n" H 5825 4500 50  0000 L CNN
F 2 "Capacitors_THT:CP_Radial_D10.0mm_P3.50mm" H 5838 4450 50  0001 C CNN
F 3 "" H 5800 4600 50  0001 C CNN
	1    5800 4600
	1    0    0    -1  
$EndComp
$Comp
L C C5
U 1 1 5B0BE066
P 7450 4600
F 0 "C5" H 7475 4700 50  0000 L CNN
F 1 "100n" H 7475 4500 50  0000 L CNN
F 2 "Capacitors_THT:CP_Radial_D10.0mm_P3.50mm" H 7488 4450 50  0001 C CNN
F 3 "" H 7450 4600 50  0001 C CNN
	1    7450 4600
	1    0    0    -1  
$EndComp
$Comp
L C C3
U 1 1 5B0BE181
P 3400 3750
F 0 "C3" H 3425 3850 50  0000 L CNN
F 1 "C" H 3425 3650 50  0000 L CNN
F 2 "Capacitors_THT:CP_Radial_D10.0mm_P3.50mm" H 3438 3600 50  0001 C CNN
F 3 "" H 3400 3750 50  0001 C CNN
	1    3400 3750
	1    0    0    -1  
$EndComp
$Comp
L C C1
U 1 1 5B0BE1FE
P 3400 2900
F 0 "C1" H 3425 3000 50  0000 L CNN
F 1 "C" H 3425 2800 50  0000 L CNN
F 2 "Capacitors_THT:CP_Radial_D10.0mm_P3.50mm" H 3438 2750 50  0001 C CNN
F 3 "" H 3400 2900 50  0001 C CNN
	1    3400 2900
	1    0    0    -1  
$EndComp
$Comp
L +3.3V #PWR01
U 1 1 5B0BE5C2
P 5150 6950
F 0 "#PWR01" H 5150 6800 50  0001 C CNN
F 1 "+3.3V" H 5150 7090 50  0000 C CNN
F 2 "" H 5150 6950 50  0001 C CNN
F 3 "" H 5150 6950 50  0001 C CNN
	1    5150 6950
	-1   0    0    1   
$EndComp
$Comp
L GND #PWR02
U 1 1 5B0BE5F2
P 4800 6950
F 0 "#PWR02" H 4800 6700 50  0001 C CNN
F 1 "GND" H 4800 6800 50  0000 C CNN
F 2 "" H 4800 6950 50  0001 C CNN
F 3 "" H 4800 6950 50  0001 C CNN
	1    4800 6950
	1    0    0    -1  
$EndComp
$Comp
L PWR_FLAG #FLG03
U 1 1 5B0BE64C
P 4800 6750
F 0 "#FLG03" H 4800 6825 50  0001 C CNN
F 1 "PWR_FLAG" H 4800 6900 50  0000 C CNN
F 2 "" H 4800 6750 50  0001 C CNN
F 3 "" H 4800 6750 50  0001 C CNN
	1    4800 6750
	1    0    0    -1  
$EndComp
$Comp
L PWR_FLAG #FLG04
U 1 1 5B0BE688
P 5150 6750
F 0 "#FLG04" H 5150 6825 50  0001 C CNN
F 1 "PWR_FLAG" H 5150 6900 50  0000 C CNN
F 2 "" H 5150 6750 50  0001 C CNN
F 3 "" H 5150 6750 50  0001 C CNN
	1    5150 6750
	1    0    0    -1  
$EndComp
$Comp
L +3.3V #PWR05
U 1 1 5B0BE806
P 4250 2450
F 0 "#PWR05" H 4250 2300 50  0001 C CNN
F 1 "+3.3V" H 4250 2590 50  0000 C CNN
F 2 "" H 4250 2450 50  0001 C CNN
F 3 "" H 4250 2450 50  0001 C CNN
	1    4250 2450
	1    0    0    -1  
$EndComp
$Comp
L +3.3V #PWR06
U 1 1 5B0BF41C
P 6200 2900
F 0 "#PWR06" H 6200 2750 50  0001 C CNN
F 1 "+3.3V" H 6200 3040 50  0000 C CNN
F 2 "" H 6200 2900 50  0001 C CNN
F 3 "" H 6200 2900 50  0001 C CNN
	1    6200 2900
	1    0    0    -1  
$EndComp
$Comp
L +3.3V #PWR07
U 1 1 5B0BF451
P 6350 3900
F 0 "#PWR07" H 6350 3750 50  0001 C CNN
F 1 "+3.3V" H 6350 4040 50  0000 C CNN
F 2 "" H 6350 3900 50  0001 C CNN
F 3 "" H 6350 3900 50  0001 C CNN
	1    6350 3900
	1    0    0    -1  
$EndComp
$Comp
L GND #PWR08
U 1 1 5B0BF4A2
P 6350 4800
F 0 "#PWR08" H 6350 4550 50  0001 C CNN
F 1 "GND" H 6350 4650 50  0000 C CNN
F 2 "" H 6350 4800 50  0001 C CNN
F 3 "" H 6350 4800 50  0001 C CNN
	1    6350 4800
	1    0    0    -1  
$EndComp
$Comp
L GND #PWR09
U 1 1 5B0BF51D
P 5800 4800
F 0 "#PWR09" H 5800 4550 50  0001 C CNN
F 1 "GND" H 5800 4650 50  0000 C CNN
F 2 "" H 5800 4800 50  0001 C CNN
F 3 "" H 5800 4800 50  0001 C CNN
	1    5800 4800
	1    0    0    -1  
$EndComp
$Comp
L GND #PWR010
U 1 1 5B0BF552
P 6200 3750
F 0 "#PWR010" H 6200 3500 50  0001 C CNN
F 1 "GND" H 6200 3600 50  0000 C CNN
F 2 "" H 6200 3750 50  0001 C CNN
F 3 "" H 6200 3750 50  0001 C CNN
	1    6200 3750
	1    0    0    -1  
$EndComp
$Comp
L GND #PWR011
U 1 1 5B0BF667
P 7450 4800
F 0 "#PWR011" H 7450 4550 50  0001 C CNN
F 1 "GND" H 7450 4650 50  0000 C CNN
F 2 "" H 7450 4800 50  0001 C CNN
F 3 "" H 7450 4800 50  0001 C CNN
	1    7450 4800
	1    0    0    -1  
$EndComp
$Comp
L GND #PWR012
U 1 1 5B0BF728
P 5200 4100
F 0 "#PWR012" H 5200 3850 50  0001 C CNN
F 1 "GND" H 5200 3950 50  0000 C CNN
F 2 "" H 5200 4100 50  0001 C CNN
F 3 "" H 5200 4100 50  0001 C CNN
	1    5200 4100
	1    0    0    -1  
$EndComp
$Comp
L GND #PWR013
U 1 1 5B0BF787
P 3400 4100
F 0 "#PWR013" H 3400 3850 50  0001 C CNN
F 1 "GND" H 3400 3950 50  0000 C CNN
F 2 "" H 3400 4100 50  0001 C CNN
F 3 "" H 3400 4100 50  0001 C CNN
	1    3400 4100
	1    0    0    -1  
$EndComp
$Comp
L GND #PWR014
U 1 1 5B0BF81E
P 3400 3150
F 0 "#PWR014" H 3400 2900 50  0001 C CNN
F 1 "GND" H 3400 3000 50  0000 C CNN
F 2 "" H 3400 3150 50  0001 C CNN
F 3 "" H 3400 3150 50  0001 C CNN
	1    3400 3150
	1    0    0    -1  
$EndComp
$Comp
L Screw_Terminal_01x03 J1
U 1 1 5B0BFE03
P 4200 4600
F 0 "J1" H 4200 4800 50  0000 C CNN
F 1 "Screw_Terminal_01x03" H 4200 4400 50  0000 C CNN
F 2 "Connectors_JST:JST_EH_B03B-EH-A_03x2.50mm_Straight" H 4200 4600 50  0001 C CNN
F 3 "" H 4200 4600 50  0001 C CNN
	1    4200 4600
	1    0    0    -1  
$EndComp
$Comp
L GND #PWR015
U 1 1 5B0C023D
P 3800 4900
F 0 "#PWR015" H 3800 4650 50  0001 C CNN
F 1 "GND" H 3800 4750 50  0000 C CNN
F 2 "" H 3800 4900 50  0001 C CNN
F 3 "" H 3800 4900 50  0001 C CNN
	1    3800 4900
	1    0    0    -1  
$EndComp
$Comp
L +3.3V #PWR016
U 1 1 5B0C02B6
P 3800 4400
F 0 "#PWR016" H 3800 4250 50  0001 C CNN
F 1 "+3.3V" H 3800 4540 50  0000 C CNN
F 2 "" H 3800 4400 50  0001 C CNN
F 3 "" H 3800 4400 50  0001 C CNN
	1    3800 4400
	1    0    0    -1  
$EndComp
Text GLabel 3700 4700 0    60   Input ~ 0
Data
Text GLabel 7850 4300 2    60   Input ~ 0
Data
$Comp
L GND #PWR017
U 1 1 5B0C1BEA
P 4250 4100
F 0 "#PWR017" H 4250 3850 50  0001 C CNN
F 1 "GND" H 4250 3950 50  0000 C CNN
F 2 "" H 4250 4100 50  0001 C CNN
F 3 "" H 4250 4100 50  0001 C CNN
	1    4250 4100
	1    0    0    -1  
$EndComp
$Comp
L Screw_Terminal_01x02 J2
U 1 1 5B0BFC40
P 5400 3850
F 0 "J2" H 5400 3950 50  0000 C CNN
F 1 "Screw_Terminal_01x02" H 5300 3350 50  0000 C CNN
F 2 "Connectors_JST:JST_EH_B02B-EH-A_02x2.50mm_Straight" H 5400 3850 50  0001 C CNN
F 3 "" H 5400 3850 50  0001 C CNN
	1    5400 3850
	1    0    0    -1  
$EndComp
$Comp
L POT_TRIM R1
U 1 1 5B0C075C
P 5200 2850
F 0 "R1" V 5025 2850 50  0000 C CNN
F 1 "10k" V 5100 2850 50  0000 C CNN
F 2 "Potentiometers:Potentiometer_Trimmer_Bourns_3296W" H 5200 2850 50  0001 C CNN
F 3 "" H 5200 2850 50  0001 C CNN
	1    5200 2850
	-1   0    0    1   
$EndComp
Wire Wire Line
	5150 6950 5150 6750
Wire Wire Line
	4800 6950 4800 6750
Wire Wire Line
	4250 2450 4250 3000
Wire Wire Line
	4750 3600 5200 3600
Wire Wire Line
	5700 3200 6000 3200
Wire Wire Line
	3400 3600 3400 3400
Wire Wire Line
	3400 3400 3750 3400
Wire Wire Line
	3750 3600 3650 3600
Wire Wire Line
	3650 3600 3650 2900
Wire Wire Line
	3650 2900 4250 2900
Wire Wire Line
	3750 3200 3550 3200
Wire Wire Line
	3550 3200 3550 3850
Wire Wire Line
	3550 3850 4950 3850
Wire Wire Line
	4950 3850 4950 3600
Wire Wire Line
	6950 3300 6600 3300
Wire Wire Line
	6950 3600 6950 3700
Wire Wire Line
	6950 3700 5800 3700
Wire Wire Line
	5800 3400 5800 3800
Wire Wire Line
	6000 3400 5800 3400
Connection ~ 5800 3700
Wire Wire Line
	5800 4100 5800 4450
Wire Wire Line
	6150 4200 5800 4200
Connection ~ 5800 4200
Wire Wire Line
	6150 4400 6000 4400
Wire Wire Line
	6000 4400 6000 4700
Wire Wire Line
	6000 4700 6850 4700
Wire Wire Line
	6850 4700 6850 4300
Wire Wire Line
	6750 4300 7000 4300
Connection ~ 6850 4300
Wire Wire Line
	7300 4300 7850 4300
Wire Wire Line
	3400 3150 3400 3050
Wire Wire Line
	3400 4100 3400 3900
Wire Wire Line
	6200 3750 6200 3600
Wire Wire Line
	6350 4000 6350 3900
Wire Wire Line
	6350 4800 6350 4600
Wire Wire Line
	5800 4800 5800 4750
Wire Wire Line
	7450 4800 7450 4750
Wire Wire Line
	4000 4500 3800 4500
Wire Wire Line
	3800 4500 3800 4400
Wire Wire Line
	6200 3000 6200 2900
Wire Wire Line
	7450 4450 7450 4300
Connection ~ 7450 4300
Wire Wire Line
	4250 4100 4250 3800
Wire Wire Line
	5200 3600 5200 3850
Wire Wire Line
	5200 3950 5200 4100
Connection ~ 4950 3600
Wire Wire Line
	5200 3000 5200 3300
Wire Wire Line
	4750 3400 5000 3400
Wire Wire Line
	5000 3400 5000 3250
Wire Wire Line
	5000 3250 5200 3250
Text Notes 4750 4050 0    60   ~ 0
Capacitor \nPCB 
Wire Wire Line
	5400 3200 4750 3200
Wire Wire Line
	3800 4900 3800 4600
Wire Wire Line
	3800 4600 4000 4600
Wire Wire Line
	4000 4700 3700 4700
Wire Wire Line
	5050 3050 5050 2850
Connection ~ 5200 3250
Wire Wire Line
	5050 3050 5200 3050
Connection ~ 5200 3050
Connection ~ 4250 2900
Wire Wire Line
	5200 2650 5200 2700
Wire Wire Line
	3400 2650 5200 2650
Connection ~ 4250 2650
Wire Wire Line
	3400 2750 3400 2650
$EndSCHEMATC
