PCBNEW-LibModule-V1  
# encoding utf-8
Units mm
$INDEX
QFN50P400X400X100-25N
$EndINDEX
$MODULE QFN50P400X400X100-25N
Po 0 0 0 15 00000000 00000000 ~~
Li QFN50P400X400X100-25N
Cd 
Sc 00000000
At SMD
Op 0 0 0
.SolderMask 0
.SolderPaste 0
T0 -0.352399 -3.64044 1.00679 1.00679 0 0.05 N V 21 "QFN50P400X400X100-25N"
T1 0.286405 3.63369 1.00499 1.00499 0 0.05 N V 21 "VAL**"
DC -2.785 -1.22 -2.685 -1.22 0.2 21
DS 2 2 -2 2 0.127 24
DS 2 -2 -2 -2 0.127 24
DS 2 2 2 -2 0.127 24
DS -2 2 -2 -2 0.127 24
DS 2 2 1.65 2 0.127 21
DS 2 -2 1.65 -2 0.127 21
DS -2 2 -1.65 2 0.127 21
DS -2 -2 -1.65 -2 0.127 21
DS 2 2 2 1.65 0.127 21
DS 2 -2 2 -1.65 0.127 21
DS -2 2 -2 1.65 0.127 21
DS -2 -2 -2 -1.65 0.127 21
DS -2.615 2.615 2.615 2.615 0.05 26
DS -2.615 -2.615 2.615 -2.615 0.05 26
DS -2.615 2.615 -2.615 -2.615 0.05 26
DS 2.615 2.615 2.615 -2.615 0.05 26
DP 0 0 0 0 4 0 19
Dl -0.849555 -0.845
Dl -0.105 -0.845
Dl -0.105 -0.105567
Dl -0.849555 -0.105567
DP 0 0 0 0 4 0 19
Dl 0.105422 -0.845
Dl 0.845 -0.845
Dl 0.845 -0.105422
Dl 0.105422 -0.105422
DP 0 0 0 0 4 0 19
Dl -0.848161 0.105
Dl -0.105 0.105
Dl -0.105 0.848161
Dl -0.848161 0.848161
DP 0 0 0 0 4 0 19
Dl 0.105449 0.105
Dl 0.845 0.105
Dl 0.845 0.84862
Dl 0.105449 0.84862
DC -2.785 -1.22 -2.685 -1.22 0.2 24
$PAD
Sh "7" R 0.88 0.26 0 0 900
At SMD N 00888000
.SolderMask 0
.SolderPaste 0
Ne 0 ""
Po -1.25 1.935
$EndPAD
$PAD
Sh "8" R 0.88 0.26 0 0 900
At SMD N 00888000
.SolderMask 0
.SolderPaste 0
Ne 0 ""
Po -0.75 1.935
$EndPAD
$PAD
Sh "9" R 0.88 0.26 0 0 900
At SMD N 00888000
.SolderMask 0
.SolderPaste 0
Ne 0 ""
Po -0.25 1.935
$EndPAD
$PAD
Sh "10" R 0.88 0.26 0 0 900
At SMD N 00888000
.SolderMask 0
.SolderPaste 0
Ne 0 ""
Po 0.25 1.935
$EndPAD
$PAD
Sh "11" R 0.88 0.26 0 0 900
At SMD N 00888000
.SolderMask 0
.SolderPaste 0
Ne 0 ""
Po 0.75 1.935
$EndPAD
$PAD
Sh "12" R 0.88 0.26 0 0 900
At SMD N 00888000
.SolderMask 0
.SolderPaste 0
Ne 0 ""
Po 1.25 1.935
$EndPAD
$PAD
Sh "19" R 0.88 0.26 0 0 900
At SMD N 00888000
.SolderMask 0
.SolderPaste 0
Ne 0 ""
Po 1.25 -1.935
$EndPAD
$PAD
Sh "20" R 0.88 0.26 0 0 900
At SMD N 00888000
.SolderMask 0
.SolderPaste 0
Ne 0 ""
Po 0.75 -1.935
$EndPAD
$PAD
Sh "21" R 0.88 0.26 0 0 900
At SMD N 00888000
.SolderMask 0
.SolderPaste 0
Ne 0 ""
Po 0.25 -1.935
$EndPAD
$PAD
Sh "22" R 0.88 0.26 0 0 900
At SMD N 00888000
.SolderMask 0
.SolderPaste 0
Ne 0 ""
Po -0.25 -1.935
$EndPAD
$PAD
Sh "23" R 0.88 0.26 0 0 900
At SMD N 00888000
.SolderMask 0
.SolderPaste 0
Ne 0 ""
Po -0.75 -1.935
$EndPAD
$PAD
Sh "24" R 0.88 0.26 0 0 900
At SMD N 00888000
.SolderMask 0
.SolderPaste 0
Ne 0 ""
Po -1.25 -1.935
$EndPAD
$PAD
Sh "1" R 0.88 0.26 0 0 0
At SMD N 00888000
.SolderMask 0
.SolderPaste 0
Ne 0 ""
Po -1.935 -1.25
$EndPAD
$PAD
Sh "2" R 0.88 0.26 0 0 0
At SMD N 00888000
.SolderMask 0
.SolderPaste 0
Ne 0 ""
Po -1.935 -0.75
$EndPAD
$PAD
Sh "3" R 0.88 0.26 0 0 0
At SMD N 00888000
.SolderMask 0
.SolderPaste 0
Ne 0 ""
Po -1.935 -0.25
$EndPAD
$PAD
Sh "4" R 0.88 0.26 0 0 0
At SMD N 00888000
.SolderMask 0
.SolderPaste 0
Ne 0 ""
Po -1.935 0.25
$EndPAD
$PAD
Sh "5" R 0.88 0.26 0 0 0
At SMD N 00888000
.SolderMask 0
.SolderPaste 0
Ne 0 ""
Po -1.935 0.75
$EndPAD
$PAD
Sh "6" R 0.88 0.26 0 0 0
At SMD N 00888000
.SolderMask 0
.SolderPaste 0
Ne 0 ""
Po -1.935 1.25
$EndPAD
$PAD
Sh "13" R 0.88 0.26 0 0 0
At SMD N 00888000
.SolderMask 0
.SolderPaste 0
Ne 0 ""
Po 1.935 1.25
$EndPAD
$PAD
Sh "14" R 0.88 0.26 0 0 0
At SMD N 00888000
.SolderMask 0
.SolderPaste 0
Ne 0 ""
Po 1.935 0.75
$EndPAD
$PAD
Sh "15" R 0.88 0.26 0 0 0
At SMD N 00888000
.SolderMask 0
.SolderPaste 0
Ne 0 ""
Po 1.935 0.25
$EndPAD
$PAD
Sh "16" R 0.88 0.26 0 0 0
At SMD N 00888000
.SolderMask 0
.SolderPaste 0
Ne 0 ""
Po 1.935 -0.25
$EndPAD
$PAD
Sh "17" R 0.88 0.26 0 0 0
At SMD N 00888000
.SolderMask 0
.SolderPaste 0
Ne 0 ""
Po 1.935 -0.75
$EndPAD
$PAD
Sh "18" R 0.88 0.26 0 0 0
At SMD N 00888000
.SolderMask 0
.SolderPaste 0
Ne 0 ""
Po 1.935 -1.25
$EndPAD
$PAD
Sh "25" R 2.1 2.1 0 0 0
At SMD N 00888000
.SolderMask 0
Ne 0 ""
Po 0 0
$EndPAD
$EndMODULE QFN50P400X400X100-25N
