(module 13x2.50mm (layer F.Cu) (tedit 5B9BA3AF)
  (descr "JST EH series connector, B13B-EH-A, 2.50mm pitch, top entry")
  (tags "connector jst eh top vertical straight")
  (fp_text reference J7 (at 6.985 3.81) (layer F.SilkS)
    (effects (font (size 1 1) (thickness 0.15)))
  )
  (fp_text value Conn_01x13_Male (at 15 3.5) (layer F.Fab)
    (effects (font (size 1 1) (thickness 0.15)))
  )
  (fp_text user %R (at 6.985 3.81) (layer F.Fab)
    (effects (font (size 1 1) (thickness 0.15)))
  )
  (pad 1 thru_hole circle (at 0 0) (size 1.85 1.85) (drill 0.8) (layers *.Cu *.Mask))
  (pad 2 thru_hole circle (at 2.5 0) (size 1.85 1.85) (drill 0.8) (layers *.Cu *.Mask))
  (pad 3 thru_hole circle (at 5 0) (size 1.85 1.85) (drill 0.8) (layers *.Cu *.Mask))
  (pad 4 thru_hole circle (at 7.5 0) (size 1.85 1.85) (drill 0.8) (layers *.Cu *.Mask))
  (pad 5 thru_hole circle (at 10 0) (size 1.85 1.85) (drill 0.8) (layers *.Cu *.Mask))
  (pad 6 thru_hole circle (at 12.5 0) (size 1.85 1.85) (drill 0.8) (layers *.Cu *.Mask))
  (pad 7 thru_hole circle (at 15 0) (size 1.85 1.85) (drill 0.8) (layers *.Cu *.Mask))
  (pad 8 thru_hole circle (at 17.5 0) (size 1.85 1.85) (drill 0.8) (layers *.Cu *.Mask))
  (pad 9 thru_hole circle (at 20 0) (size 1.85 1.85) (drill 0.8) (layers *.Cu *.Mask))
  (pad 10 thru_hole circle (at 22.5 0) (size 1.85 1.85) (drill 0.8) (layers *.Cu *.Mask))
  (pad 11 thru_hole circle (at 25 0) (size 1.85 1.85) (drill 0.8) (layers *.Cu *.Mask))
  (pad 12 thru_hole circle (at 27.5 0) (size 1.85 1.85) (drill 0.8) (layers *.Cu *.Mask))
  (pad 13 thru_hole circle (at 30 0) (size 1.85 1.85) (drill 0.8) (layers *.Cu *.Mask))
  (model Connectors_JST.3dshapes/JST_EH_B13B-EH-A_13x2.50mm_Straight.wrl
    (at (xyz 0 0 0))
    (scale (xyz 1 1 1))
    (rotate (xyz 0 0 0))
  )
)
