PCBNEW-LibModule-V1  
# encoding utf-8
Units mm
$INDEX
DPAK228P994X241-3N
$EndINDEX
$MODULE DPAK228P994X241-3N
Po 0 0 0 15 00000000 00000000 ~~
Li DPAK228P994X241-3N
Cd 
Sc 00000000
At SMD
Op 0 0 0
.SolderMask 0
.SolderPaste 0
T0 -1.27256 -6.99907 1.00201 1.00201 0 0.05 N V 21 "DPAK228P994X241-3N"
T1 -0.636016 6.99609 1.00158 1.00158 0 0.05 N V 21 "VAL**"
DS -3.37 -4.171 3.37 -4.171 0.127 24
DS 3.37 -4.171 3.37 2.049 0.127 24
DS 3.37 2.049 -3.37 2.049 0.127 24
DS -3.37 2.049 -3.37 -4.171 0.127 24
DS -3.1 -4.171 -3.37 -4.171 0.127 21
DS -3.37 -4.171 -3.37 2.049 0.127 21
DS -3.37 2.049 3.37 2.049 0.127 21
DS 3.37 2.049 3.37 -4.171 0.127 21
DS 3.37 -4.171 3.1 -4.171 0.127 21
DS -3.09 -5.85 3.09 -5.85 0.05 26
DS 3.09 -5.85 3.09 -4.43 0.05 26
DS 3.09 -4.43 3.62 -4.43 0.05 26
DS 3.62 -4.43 3.62 2.31 0.05 26
DS 3.62 2.31 3.03 2.31 0.05 26
DS 3.03 2.31 3.03 5.85 0.05 26
DS 3.03 5.85 -3.03 5.85 0.05 26
DS -3.03 5.85 -3.03 2.31 0.05 26
DS -3.03 2.31 -3.62 2.31 0.05 26
DS -3.62 2.31 -3.62 -4.43 0.05 26
DS -3.62 -4.43 -3.09 -4.43 0.05 26
DS -3.09 -4.43 -3.09 -5.85 0.05 26
DP 0 0 0 0 4 0 19
Dl -0.646473 -3.04
Dl 0.645 -3.04
Dl 0.645 -1.38315
Dl -0.646473 -1.38315
DP 0 0 0 0 4 0 19
Dl -0.646161 -5.3
Dl 0.645 -5.3
Dl 0.645 -3.64655
Dl -0.646161 -3.64655
DP 0 0 0 0 4 0 19
Dl -0.646461 -0.78
Dl 0.645 -0.78
Dl 0.645 0.881993
Dl -0.646461 0.881993
DP 0 0 0 0 4 0 19
Dl -2.53779 -5.3
Dl -1.245 -5.3
Dl -1.245 -3.64399
Dl -2.53779 -3.64399
DP 0 0 0 0 4 0 19
Dl 1.24732 -5.3
Dl 2.535 -5.3
Dl 2.535 -3.64678
Dl 1.24732 -3.64678
DP 0 0 0 0 4 0 19
Dl 1.2471 -3.04
Dl 2.535 -3.04
Dl 2.535 -1.38232
Dl 1.2471 -1.38232
DP 0 0 0 0 4 0 19
Dl -2.5382 -3.04
Dl -1.245 -3.04
Dl -1.245 -1.38174
Dl -2.5382 -1.38174
DP 0 0 0 0 4 0 19
Dl 1.24711 -0.78
Dl 2.535 -0.78
Dl 2.535 0.88149
Dl 1.24711 0.88149
DP 0 0 0 0 4 0 19
Dl -2.54327 -0.78
Dl -1.245 -0.78
Dl -1.245 0.882873
Dl -2.54327 0.882873
$PAD
Sh "1" R 1.85 0.97 0 0 900
At SMD N 00888000
.SolderMask 0
.SolderPaste 0
Ne 0 ""
Po -2.286 4.67
$EndPAD
$PAD
Sh "3" R 1.85 0.97 0 0 900
At SMD N 00888000
.SolderMask 0
.SolderPaste 0
Ne 0 ""
Po 2.286 4.67
$EndPAD
$PAD
Sh "2" R 5.67 6.77 0 0 0
At SMD N 00888000
.SolderMask 0
Ne 0 ""
Po 0 -2.21
$EndPAD
$EndMODULE DPAK228P994X241-3N
