EESchema Schematic File Version 2
LIBS:power
LIBS:device
LIBS:switches
LIBS:relays
LIBS:motors
LIBS:transistors
LIBS:conn
LIBS:linear
LIBS:regul
LIBS:74xx
LIBS:cmos4000
LIBS:adc-dac
LIBS:memory
LIBS:xilinx
LIBS:microcontrollers
LIBS:dsp
LIBS:microchip
LIBS:analog_switches
LIBS:motorola
LIBS:texas
LIBS:intel
LIBS:audio
LIBS:interface
LIBS:digital-audio
LIBS:philips
LIBS:display
LIBS:cypress
LIBS:siliconi
LIBS:opto
LIBS:atmel
LIBS:contrib
LIBS:valves
LIBS:AO4435
LIBS:CN3791
LIBS:CN3791-cache
EELAYER 25 0
EELAYER END
$Descr A4 11693 8268
encoding utf-8
Sheet 1 1
Title "Single Cell MPPT Li-ion Charger CN3791"
Date "2018-07-11"
Rev "v1.0"
Comp "Soil Agritech Pvt. Ltd."
Comment1 "Designed by SRS"
Comment2 ""
Comment3 ""
Comment4 ""
$EndDescr
$Comp
L Screw_Terminal_01x02 J?
U 1 1 5B46155C
P 2050 3100
F 0 "J?" H 2050 3200 50  0000 C CNN
F 1 "Screw_Terminal_01x02" H 2050 2900 50  0000 C CNN
F 2 "" H 2050 3100 50  0001 C CNN
F 3 "" H 2050 3100 50  0001 C CNN
	1    2050 3100
	1    0    0    -1  
$EndComp
$Comp
L Screw_Terminal_01x02 J?
U 1 1 5B4615AE
P 9400 3200
F 0 "J?" H 9400 3300 50  0000 C CNN
F 1 "Screw_Terminal_01x02" H 9400 3000 50  0000 C CNN
F 2 "" H 9400 3200 50  0001 C CNN
F 3 "" H 9400 3200 50  0001 C CNN
	1    9400 3200
	1    0    0    -1  
$EndComp
$Comp
L C C?
U 1 1 5B461622
P 2300 3600
F 0 "C?" H 2325 3700 50  0000 L CNN
F 1 "C" H 2325 3500 50  0000 L CNN
F 2 "" H 2338 3450 50  0001 C CNN
F 3 "" H 2300 3600 50  0001 C CNN
	1    2300 3600
	1    0    0    -1  
$EndComp
$Comp
L CP1 C?
U 1 1 5B46165F
P 8650 3550
F 0 "C?" H 8675 3650 50  0000 L CNN
F 1 "CP1" H 8675 3450 50  0000 L CNN
F 2 "" H 8650 3550 50  0001 C CNN
F 3 "" H 8650 3550 50  0001 C CNN
	1    8650 3550
	1    0    0    -1  
$EndComp
$Comp
L CP1 C?
U 1 1 5B4616FA
P 2600 3650
F 0 "C?" H 2625 3750 50  0000 L CNN
F 1 "CP1" H 2625 3550 50  0000 L CNN
F 2 "" H 2600 3650 50  0001 C CNN
F 3 "" H 2600 3650 50  0001 C CNN
	1    2600 3650
	1    0    0    -1  
$EndComp
$Comp
L C C?
U 1 1 5B461771
P 8900 3650
F 0 "C?" H 8925 3750 50  0000 L CNN
F 1 "C" H 8925 3550 50  0000 L CNN
F 2 "" H 8938 3500 50  0001 C CNN
F 3 "" H 8900 3650 50  0001 C CNN
	1    8900 3650
	1    0    0    -1  
$EndComp
$Comp
L LED D?
U 1 1 5B46181D
P 2700 4050
F 0 "D?" H 2700 4150 50  0000 C CNN
F 1 "LED" H 2700 3950 50  0000 C CNN
F 2 "" H 2700 4050 50  0001 C CNN
F 3 "" H 2700 4050 50  0001 C CNN
	1    2700 4050
	1    0    0    -1  
$EndComp
$Comp
L LED D?
U 1 1 5B46187D
P 3200 4050
F 0 "D?" H 3200 4150 50  0000 C CNN
F 1 "LED" H 3200 3950 50  0000 C CNN
F 2 "" H 3200 4050 50  0001 C CNN
F 3 "" H 3200 4050 50  0001 C CNN
	1    3200 4050
	1    0    0    -1  
$EndComp
$Comp
L C C?
U 1 1 5B4618B1
P 3150 3600
F 0 "C?" H 3175 3700 50  0000 L CNN
F 1 "C" H 3175 3500 50  0000 L CNN
F 2 "" H 3188 3450 50  0001 C CNN
F 3 "" H 3150 3600 50  0001 C CNN
	1    3150 3600
	1    0    0    -1  
$EndComp
$Comp
L C C?
U 1 1 5B4618FA
P 3400 3600
F 0 "C?" H 3425 3700 50  0000 L CNN
F 1 "C" H 3425 3500 50  0000 L CNN
F 2 "" H 3438 3450 50  0001 C CNN
F 3 "" H 3400 3600 50  0001 C CNN
	1    3400 3600
	1    0    0    -1  
$EndComp
$Comp
L R R?
U 1 1 5B46199D
P 4100 3550
F 0 "R?" V 4180 3550 50  0000 C CNN
F 1 "R" V 4100 3550 50  0000 C CNN
F 2 "" V 4030 3550 50  0001 C CNN
F 3 "" H 4100 3550 50  0001 C CNN
	1    4100 3550
	1    0    0    -1  
$EndComp
$Comp
L R R?
U 1 1 5B4619F6
P 4450 3550
F 0 "R?" V 4530 3550 50  0000 C CNN
F 1 "R" V 4450 3550 50  0000 C CNN
F 2 "" V 4380 3550 50  0001 C CNN
F 3 "" H 4450 3550 50  0001 C CNN
	1    4450 3550
	1    0    0    -1  
$EndComp
$Comp
L R R?
U 1 1 5B461A3A
P 4750 3550
F 0 "R?" V 4830 3550 50  0000 C CNN
F 1 "R" V 4750 3550 50  0000 C CNN
F 2 "" V 4680 3550 50  0001 C CNN
F 3 "" H 4750 3550 50  0001 C CNN
	1    4750 3550
	1    0    0    -1  
$EndComp
$Comp
L R R?
U 1 1 5B461A7D
P 5050 3550
F 0 "R?" V 5130 3550 50  0000 C CNN
F 1 "R" V 5050 3550 50  0000 C CNN
F 2 "" V 4980 3550 50  0001 C CNN
F 3 "" H 5050 3550 50  0001 C CNN
	1    5050 3550
	1    0    0    -1  
$EndComp
$Comp
L AO4435 U?
U 1 1 5B461EC0
P 6500 2600
F 0 "U?" H 6500 2250 60  0000 C CNN
F 1 "AO4435" H 6500 3100 60  0000 C CNN
F 2 "" H 6750 2850 60  0001 C CNN
F 3 "" H 6750 2850 60  0001 C CNN
	1    6500 2600
	1    0    0    -1  
$EndComp
$Comp
L CN3791 U?
U 1 1 5B461F13
P 6550 3650
F 0 "U?" H 6550 3150 60  0000 C CNN
F 1 "CN3791" H 6550 4150 60  0000 C CNN
F 2 "" H 6800 3900 60  0001 C CNN
F 3 "" H 6800 3900 60  0001 C CNN
	1    6550 3650
	1    0    0    -1  
$EndComp
$EndSCHEMATC
