(module msp430 (layer F.Cu) (tedit 5B2B727D)
  (fp_text reference REF** (at 24 49) (layer F.SilkS)
    (effects (font (size 1 1) (thickness 0.15)))
  )
  (fp_text value MSP432 (at -26 -49) (layer F.Fab)
    (effects (font (size 1 1) (thickness 0.15)))
  )
  (fp_line (start -33 -48) (end -31 -48) (layer F.SilkS) (width 0.15))
  (fp_line (start -33 47) (end -31 47) (layer F.SilkS) (width 0.15))
  (fp_line (start 27 47) (end 29 47) (layer F.SilkS) (width 0.15))
  (fp_line (start 27 -48) (end 29 -48) (layer F.SilkS) (width 0.15))
  (fp_text user SWITCH (at -30 -7 90) (layer F.SilkS)
    (effects (font (size 1 1) (thickness 0.15)))
  )
  (fp_text user SWITCH (at 26 -7 90) (layer F.SilkS)
    (effects (font (size 1 1) (thickness 0.15)))
  )
  (fp_text user SWITCH (at 19 -45) (layer F.SilkS)
    (effects (font (size 1 1) (thickness 0.15)))
  )
  (fp_text user USB (at -24 -45) (layer F.SilkS)
    (effects (font (size 1 1) (thickness 0.15)))
  )
  (fp_circle (center -32 -7) (end -31 -7) (layer F.SilkS) (width 0.15))
  (fp_circle (center 28 -7) (end 28 -8) (layer F.SilkS) (width 0.15))
  (fp_circle (center 19 -47) (end 19 -46) (layer F.SilkS) (width 0.15))
  (fp_circle (center -24 -47) (end -24 -46) (layer F.SilkS) (width 0.15))
  (fp_line (start 27 -48) (end -31 -48) (layer F.SilkS) (width 0.15))
  (fp_line (start 29 1) (end 29 -48) (layer F.SilkS) (width 0.15))
  (fp_line (start 29 1) (end 29 26) (layer F.SilkS) (width 0.15))
  (fp_line (start 29 26) (end 29 47) (layer F.SilkS) (width 0.15))
  (fp_line (start -31 47) (end 27 47) (layer F.SilkS) (width 0.15))
  (fp_line (start -33 26) (end -33 47) (layer F.SilkS) (width 0.15))
  (fp_line (start -33 1) (end -33 26) (layer F.SilkS) (width 0.15))
  (fp_line (start -33 1) (end -33 -48) (layer F.SilkS) (width 0.15))
  (pad 1 thru_hole rect (at -26 2) (size 1.75 1.75) (drill 0.762) (layers *.Cu *.Mask))
  (pad 21 thru_hole rect (at -23.46 2) (size 1.75 1.75) (drill 0.762) (layers *.Cu *.Mask))
  (pad 2 thru_hole rect (at -26 4.54) (size 1.75 1.75) (drill 0.762) (layers *.Cu *.Mask))
  (pad 22 thru_hole rect (at -23.46 4.54) (size 1.75 1.75) (drill 0.762) (layers *.Cu *.Mask))
  (pad 3 thru_hole rect (at -26 7.08) (size 1.75 1.75) (drill 0.762) (layers *.Cu *.Mask))
  (pad 23 thru_hole rect (at -23.46 7.08) (size 1.75 1.75) (drill 0.762) (layers *.Cu *.Mask))
  (pad 4 thru_hole rect (at -26 9.62) (size 1.75 1.75) (drill 0.762) (layers *.Cu *.Mask))
  (pad 24 thru_hole rect (at -23.46 9.62) (size 1.75 1.75) (drill 0.762) (layers *.Cu *.Mask))
  (pad 5 thru_hole rect (at -26 12.16) (size 1.75 1.75) (drill 0.762) (layers *.Cu *.Mask))
  (pad 25 thru_hole rect (at -23.46 12.16) (size 1.75 1.75) (drill 0.762) (layers *.Cu *.Mask))
  (pad 6 thru_hole rect (at -26 14.7) (size 1.75 1.75) (drill 0.762) (layers *.Cu *.Mask))
  (pad 26 thru_hole rect (at -23.46 14.7) (size 1.75 1.75) (drill 0.762) (layers *.Cu *.Mask))
  (pad 7 thru_hole rect (at -26 17.24) (size 1.75 1.75) (drill 0.762) (layers *.Cu *.Mask))
  (pad 27 thru_hole rect (at -23.46 17.24) (size 1.75 1.75) (drill 0.762) (layers *.Cu *.Mask))
  (pad 8 thru_hole rect (at -26 19.78) (size 1.75 1.75) (drill 0.762) (layers *.Cu *.Mask))
  (pad 28 thru_hole rect (at -23.46 19.78) (size 1.75 1.75) (drill 0.762) (layers *.Cu *.Mask))
  (pad 9 thru_hole rect (at -26 22.32) (size 1.75 1.75) (drill 0.762) (layers *.Cu *.Mask))
  (pad 29 thru_hole rect (at -23.46 22.32) (size 1.75 1.75) (drill 0.762) (layers *.Cu *.Mask))
  (pad 10 thru_hole rect (at -26 24.86) (size 1.75 1.75) (drill 0.762) (layers *.Cu *.Mask))
  (pad 30 thru_hole rect (at -23.46 24.86) (size 1.75 1.75) (drill 0.762) (layers *.Cu *.Mask))
  (pad 40 thru_hole rect (at 19.54 2) (size 1.75 1.75) (drill 0.762) (layers *.Cu *.Mask))
  (pad 22 thru_hole rect (at -23.46 4.54) (size 1.75 1.75) (drill 0.762) (layers *.Cu *.Mask))
  (pad 22 thru_hole rect (at 19.54 4.54) (size 1.75 1.75) (drill 0.762) (layers *.Cu *.Mask))
  (pad 23 thru_hole rect (at -23.46 7.08) (size 1.75 1.75) (drill 0.762) (layers *.Cu *.Mask))
  (pad 23 thru_hole rect (at 19.54 7.08) (size 1.75 1.75) (drill 0.762) (layers *.Cu *.Mask))
  (pad 24 thru_hole rect (at -23.46 9.62) (size 1.75 1.75) (drill 0.762) (layers *.Cu *.Mask))
  (pad 24 thru_hole rect (at 19.54 9.62) (size 1.75 1.75) (drill 0.762) (layers *.Cu *.Mask))
  (pad 25 thru_hole rect (at -23.46 12.16) (size 1.75 1.75) (drill 0.762) (layers *.Cu *.Mask))
  (pad 25 thru_hole rect (at 19.54 12.16) (size 1.75 1.75) (drill 0.762) (layers *.Cu *.Mask))
  (pad 26 thru_hole rect (at -23.46 14.7) (size 1.75 1.75) (drill 0.762) (layers *.Cu *.Mask))
  (pad 35 thru_hole rect (at 19.54 14.7) (size 1.75 1.75) (drill 0.762) (layers *.Cu *.Mask))
  (pad 27 thru_hole rect (at -23.46 17.24) (size 1.75 1.75) (drill 0.762) (layers *.Cu *.Mask))
  (pad 34 thru_hole rect (at 19.54 17.24) (size 1.75 1.75) (drill 0.762) (layers *.Cu *.Mask))
  (pad 28 thru_hole rect (at -23.46 19.78) (size 1.75 1.75) (drill 0.762) (layers *.Cu *.Mask))
  (pad 33 thru_hole rect (at 19.54 19.78) (size 1.75 1.75) (drill 0.762) (layers *.Cu *.Mask))
  (pad 29 thru_hole rect (at -23.46 22.32) (size 1.75 1.75) (drill 0.762) (layers *.Cu *.Mask))
  (pad 30 thru_hole rect (at 19.54 22.32) (size 1.75 1.75) (drill 0.762) (layers *.Cu *.Mask))
  (pad 30 thru_hole rect (at -23.46 24.86) (size 1.75 1.75) (drill 0.762) (layers *.Cu *.Mask))
  (pad 31 thru_hole rect (at 19.54 24.86) (size 1.75 1.75) (drill 0.762) (layers *.Cu *.Mask))
  (pad 20 thru_hole rect (at 22.08 2) (size 1.75 1.75) (drill 0.762) (layers *.Cu *.Mask))
  (pad 39 thru_hole rect (at 19.54 4.54) (size 1.75 1.75) (drill 0.762) (layers *.Cu *.Mask))
  (pad 19 thru_hole rect (at 22.08 4.54) (size 1.75 1.75) (drill 0.762) (layers *.Cu *.Mask))
  (pad 38 thru_hole rect (at 19.54 7.08) (size 1.75 1.75) (drill 0.762) (layers *.Cu *.Mask))
  (pad 18 thru_hole rect (at 22.08 7.08) (size 1.75 1.75) (drill 0.762) (layers *.Cu *.Mask))
  (pad 37 thru_hole rect (at 19.54 9.62) (size 1.75 1.75) (drill 0.762) (layers *.Cu *.Mask))
  (pad 17 thru_hole rect (at 22.08 9.62) (size 1.75 1.75) (drill 0.762) (layers *.Cu *.Mask))
  (pad 36 thru_hole rect (at 19.54 12.16) (size 1.75 1.75) (drill 0.762) (layers *.Cu *.Mask))
  (pad 16 thru_hole rect (at 22.08 12.16) (size 1.75 1.75) (drill 0.762) (layers *.Cu *.Mask))
  (pad 35 thru_hole rect (at 19.54 14.7) (size 1.75 1.75) (drill 0.762) (layers *.Cu *.Mask))
  (pad 15 thru_hole rect (at 22.08 14.7) (size 1.75 1.75) (drill 0.762) (layers *.Cu *.Mask))
  (pad 34 thru_hole rect (at 19.54 17.24) (size 1.75 1.75) (drill 0.762) (layers *.Cu *.Mask))
  (pad 14 thru_hole rect (at 22.08 17.24) (size 1.75 1.75) (drill 0.762) (layers *.Cu *.Mask))
  (pad 33 thru_hole rect (at 19.54 19.78) (size 1.75 1.75) (drill 0.762) (layers *.Cu *.Mask))
  (pad 13 thru_hole rect (at 22.08 19.78) (size 1.75 1.75) (drill 0.762) (layers *.Cu *.Mask))
  (pad 32 thru_hole rect (at 19.54 22.32) (size 1.75 1.75) (drill 0.762) (layers *.Cu *.Mask))
  (pad 12 thru_hole rect (at 22.08 22.32) (size 1.75 1.75) (drill 0.762) (layers *.Cu *.Mask))
  (pad 31 thru_hole rect (at 19.54 24.86) (size 1.75 1.75) (drill 0.762) (layers *.Cu *.Mask))
  (pad 11 thru_hole rect (at 22.08 24.86) (size 1.75 1.75) (drill 0.762) (layers *.Cu *.Mask))
)
