EESchema Schematic File Version 2
LIBS:power
LIBS:device
LIBS:switches
LIBS:relays
LIBS:motors
LIBS:transistors
LIBS:conn
LIBS:linear
LIBS:regul
LIBS:74xx
LIBS:cmos4000
LIBS:adc-dac
LIBS:memory
LIBS:xilinx
LIBS:microcontrollers
LIBS:dsp
LIBS:microchip
LIBS:analog_switches
LIBS:motorola
LIBS:texas
LIBS:intel
LIBS:audio
LIBS:interface
LIBS:digital-audio
LIBS:philips
LIBS:display
LIBS:cypress
LIBS:siliconi
LIBS:opto
LIBS:atmel
LIBS:contrib
LIBS:valves
LIBS:LTV-847
LIBS:SN74HC4066PWR
LIBS:TCMT4106
LIBS:SN74HC4066NSR
LIBS:KitchenX-cache
EELAYER 25 0
EELAYER END
$Descr A4 11693 8268
encoding utf-8
Sheet 1 1
Title "Analog Switch and Opto-isolator Board"
Date "2018-07-27"
Rev "v1.3"
Comp "KitechenX"
Comment1 "Designed by SRS"
Comment2 ""
Comment3 ""
Comment4 ""
$EndDescr
$Comp
L SN74HC4066NSR U1
U 1 1 5B5622CC
P 7850 3500
F 0 "U1" H 7638 4161 50  0000 L BNN
F 1 "SN74HC4066NSR" H 7651 2571 50  0000 L BNN
F 2 "SN74HC4066NSR:SOIC127P780X200-14N" H 7850 3500 50  0001 L BNN
F 3 "SN74HC4066PWR" H 7850 3500 50  0001 L BNN
F 4 "TSSOP-14 Texas Instruments" H 7850 3500 50  0001 L BNN "Field4"
F 5 "0.24 USD" H 7850 3500 50  0001 L BNN "Field5"
F 6 "SN74HC4066PWR ic Analog S W Quad SPST 6V 14-Pin TSS OP T/R RoHS" H 7850 3500 50  0001 L BNN "Field6"
F 7 "Texas Instruments" H 7850 3500 50  0001 L BNN "Field7"
F 8 "Good" H 7850 3500 50  0001 L BNN "Field8"
	1    7850 3500
	1    0    0    -1  
$EndComp
$Comp
L TCMT4106 Q1
U 1 1 5B56234A
P 4500 1900
F 0 "Q1" H 4550 2050 50  0000 L BNN
F 1 "TCMT4106" H 4350 1700 50  0000 L BNN
F 2 "SOIC127P700X210-16N:SOIC127P700X210-16N" H 4550 1900 60  0001 C CNN
F 3 "LTV-847" H 4550 1900 50  0001 L BNN
F 4 "DIP-16 Isocom" H 4550 1900 50  0001 L BNN "Field4"
F 5 "None" H 4550 1900 50  0001 L BNN "Field5"
F 6 "Opto Coupler 16 Pin Photo Transistor In-Line Package" H 4550 1900 50  0001 L BNN "Field6"
F 7 "Isocom" H 4550 1900 50  0001 L BNN "Field7"
F 8 "Warning" H 4550 1900 50  0001 L BNN "Field8"
	1    4500 1900
	1    0    0    -1  
$EndComp
$Comp
L TCMT4106 Q1
U 2 1 5B5623B6
P 4550 2950
F 0 "Q1" H 4600 3100 50  0000 L BNN
F 1 "TCMT4106" H 4400 2750 50  0000 L BNN
F 2 "SOIC127P700X210-16N:SOIC127P700X210-16N" H 4600 2950 60  0001 C CNN
F 3 "LTV-847" H 4600 2950 50  0001 L BNN
F 4 "DIP-16 Isocom" H 4600 2950 50  0001 L BNN "Field4"
F 5 "None" H 4600 2950 50  0001 L BNN "Field5"
F 6 "Opto Coupler 16 Pin Photo Transistor In-Line Package" H 4600 2950 50  0001 L BNN "Field6"
F 7 "Isocom" H 4600 2950 50  0001 L BNN "Field7"
F 8 "Warning" H 4600 2950 50  0001 L BNN "Field8"
	2    4550 2950
	1    0    0    -1  
$EndComp
$Comp
L TCMT4106 Q1
U 3 1 5B5623FE
P 4550 4100
F 0 "Q1" H 4600 4250 50  0000 L BNN
F 1 "TCMT4106" H 4400 3900 50  0000 L BNN
F 2 "SOIC127P700X210-16N:SOIC127P700X210-16N" H 4600 4100 60  0001 C CNN
F 3 "LTV-847" H 4600 4100 50  0001 L BNN
F 4 "DIP-16 Isocom" H 4600 4100 50  0001 L BNN "Field4"
F 5 "None" H 4600 4100 50  0001 L BNN "Field5"
F 6 "Opto Coupler 16 Pin Photo Transistor In-Line Package" H 4600 4100 50  0001 L BNN "Field6"
F 7 "Isocom" H 4600 4100 50  0001 L BNN "Field7"
F 8 "Warning" H 4600 4100 50  0001 L BNN "Field8"
	3    4550 4100
	1    0    0    -1  
$EndComp
$Comp
L TCMT4106 Q1
U 4 1 5B562456
P 4550 5250
F 0 "Q1" H 4600 5400 50  0000 L BNN
F 1 "TCMT4106" H 4400 5050 50  0000 L BNN
F 2 "SOIC127P700X210-16N:SOIC127P700X210-16N" H 4600 5250 60  0001 C CNN
F 3 "LTV-847" H 4600 5250 50  0001 L BNN
F 4 "DIP-16 Isocom" H 4600 5250 50  0001 L BNN "Field4"
F 5 "None" H 4600 5250 50  0001 L BNN "Field5"
F 6 "Opto Coupler 16 Pin Photo Transistor In-Line Package" H 4600 5250 50  0001 L BNN "Field6"
F 7 "Isocom" H 4600 5250 50  0001 L BNN "Field7"
F 8 "Warning" H 4600 5250 50  0001 L BNN "Field8"
	4    4550 5250
	1    0    0    -1  
$EndComp
$Comp
L PWR_FLAG #FLG01
U 1 1 5B5624A6
P 4800 6550
F 0 "#FLG01" H 4800 6625 50  0001 C CNN
F 1 "PWR_FLAG" H 4800 6700 50  0000 C CNN
F 2 "" H 4800 6550 50  0001 C CNN
F 3 "" H 4800 6550 50  0001 C CNN
	1    4800 6550
	1    0    0    -1  
$EndComp
$Comp
L GND #PWR02
U 1 1 5B5624C4
P 4800 7100
F 0 "#PWR02" H 4800 6850 50  0001 C CNN
F 1 "GND" H 4800 6950 50  0000 C CNN
F 2 "" H 4800 7100 50  0001 C CNN
F 3 "" H 4800 7100 50  0001 C CNN
	1    4800 7100
	1    0    0    -1  
$EndComp
$Comp
L VCC #PWR03
U 1 1 5B5624E2
P 5350 6550
F 0 "#PWR03" H 5350 6400 50  0001 C CNN
F 1 "VCC" H 5350 6700 50  0000 C CNN
F 2 "" H 5350 6550 50  0001 C CNN
F 3 "" H 5350 6550 50  0001 C CNN
	1    5350 6550
	1    0    0    -1  
$EndComp
$Comp
L PWR_FLAG #FLG04
U 1 1 5B562521
P 5350 7100
F 0 "#FLG04" H 5350 7175 50  0001 C CNN
F 1 "PWR_FLAG" H 5350 7250 50  0000 C CNN
F 2 "" H 5350 7100 50  0001 C CNN
F 3 "" H 5350 7100 50  0001 C CNN
	1    5350 7100
	-1   0    0    1   
$EndComp
Wire Wire Line
	4800 7100 4800 6550
Wire Wire Line
	5350 6550 5350 7100
Wire Wire Line
	6900 3900 7150 3900
$Comp
L VCC #PWR05
U 1 1 5B56267C
P 6900 3000
F 0 "#PWR05" H 6900 2850 50  0001 C CNN
F 1 "VCC" H 6900 3150 50  0000 C CNN
F 2 "" H 6900 3000 50  0001 C CNN
F 3 "" H 6900 3000 50  0001 C CNN
	1    6900 3000
	1    0    0    -1  
$EndComp
Wire Wire Line
	6900 3000 6900 3200
Text GLabel 7150 3400 0    60   Input ~ 0
1C_I
Text GLabel 7150 3500 0    60   Input ~ 0
2C_I
Text GLabel 7150 3600 0    60   Input ~ 0
3C_I
Text GLabel 7150 3700 0    60   Input ~ 0
4C_I
Text GLabel 8550 3200 2    60   Input ~ 0
1B
Text GLabel 8550 3300 2    60   Input ~ 0
2B
Text GLabel 8550 3400 2    60   Input ~ 0
3B
Text GLabel 8550 3500 2    60   Input ~ 0
4B
Text GLabel 8550 3700 2    60   Input ~ 0
1A
Text GLabel 8550 3800 2    60   Input ~ 0
2A
Text GLabel 8550 3900 2    60   Input ~ 0
3A
Text GLabel 8550 4000 2    60   Input ~ 0
4A
Wire Wire Line
	6900 3200 7150 3200
$Comp
L Conn_01x10 J2
U 1 1 5B56294D
P 10950 3700
F 0 "J2" H 10950 4200 50  0000 C CNN
F 1 "Conn_01x10" H 10950 3100 50  0000 C CNN
F 2 "Connectors_JST:JST_EH_B10B-EH-A_10x2.50mm_Straight" H 10950 3700 50  0001 C CNN
F 3 "" H 10950 3700 50  0001 C CNN
	1    10950 3700
	1    0    0    -1  
$EndComp
$Comp
L Conn_01x05 J1
U 1 1 5B56299A
P 850 3450
F 0 "J1" H 850 3750 50  0000 C CNN
F 1 "Conn_01x05" H 850 3150 50  0000 C CNN
F 2 "Connectors_JST:JST_EH_B05B-EH-A_05x2.50mm_Straight" H 850 3450 50  0001 C CNN
F 3 "" H 850 3450 50  0001 C CNN
	1    850  3450
	-1   0    0    -1  
$EndComp
Text Notes 10850 3100 0    60   ~ 0
CN1
Text GLabel 9800 3400 0    60   Input ~ 0
GND_I
Text GLabel 10750 4000 0    60   Input ~ 0
4B
Text GLabel 10750 3900 0    60   Input ~ 0
4A
Text GLabel 10750 4100 0    60   Input ~ 0
3B
Text GLabel 10750 4200 0    60   Input ~ 0
3A
Text GLabel 10750 3700 0    60   Input ~ 0
2B
Text GLabel 10750 3800 0    60   Input ~ 0
2A
Text GLabel 10750 3600 0    60   Input ~ 0
1B
Text GLabel 10750 3500 0    60   Input ~ 0
1A
Text GLabel 6900 3900 0    60   Input ~ 0
GND_I
$Comp
L GND #PWR06
U 1 1 5B5731D4
P 2100 3400
F 0 "#PWR06" H 2100 3150 50  0001 C CNN
F 1 "GND" H 2100 3250 50  0000 C CNN
F 2 "" H 2100 3400 50  0001 C CNN
F 3 "" H 2100 3400 50  0001 C CNN
	1    2100 3400
	1    0    0    -1  
$EndComp
Text GLabel 1050 3650 2    60   Input ~ 0
4C
Text GLabel 1050 3550 2    60   Input ~ 0
3C
Text GLabel 1050 3450 2    60   Input ~ 0
2C
Text GLabel 1050 3350 2    60   Input ~ 0
1C
Text Notes 950  2950 0    60   ~ 0
CN2
Text Notes 3350 900  0    197  ~ 39
Analog Switch and Opto-isolator Board
Text Notes 900  6250 0    60   ~ 0
Defining Power Paths
Wire Notes Line
	450  6000 11200 6000
Wire Notes Line
	2650 6000 2650 500 
Wire Notes Line
	6200 6000 6200 500 
Wire Notes Line
	9350 6000 9350 450 
$Comp
L R R2
U 1 1 5B573B6C
P 3900 1800
F 0 "R2" V 3980 1800 50  0000 C CNN
F 1 "220" V 3900 1800 50  0000 C CNN
F 2 "Resistors_SMD:R_0603_HandSoldering" V 3830 1800 50  0001 C CNN
F 3 "" H 3900 1800 50  0001 C CNN
	1    3900 1800
	0    1    1    0   
$EndComp
$Comp
L R R4
U 1 1 5B573BC1
P 3900 2850
F 0 "R4" V 3980 2850 50  0000 C CNN
F 1 "220" V 3900 2850 50  0000 C CNN
F 2 "Resistors_SMD:R_0603_HandSoldering" V 3830 2850 50  0001 C CNN
F 3 "" H 3900 2850 50  0001 C CNN
	1    3900 2850
	0    1    1    0   
$EndComp
$Comp
L R R6
U 1 1 5B573C2D
P 3900 4000
F 0 "R6" V 3980 4000 50  0000 C CNN
F 1 "220" V 3900 4000 50  0000 C CNN
F 2 "Resistors_SMD:R_0603_HandSoldering" V 3830 4000 50  0001 C CNN
F 3 "" H 3900 4000 50  0001 C CNN
	1    3900 4000
	0    1    1    0   
$EndComp
$Comp
L R R8
U 1 1 5B573CCF
P 3900 5150
F 0 "R8" V 3980 5150 50  0000 C CNN
F 1 "220" V 3900 5150 50  0000 C CNN
F 2 "Resistors_SMD:R_0603_HandSoldering" V 3830 5150 50  0001 C CNN
F 3 "" H 3900 5150 50  0001 C CNN
	1    3900 5150
	0    1    1    0   
$EndComp
$Comp
L GND #PWR07
U 1 1 5B573D46
P 4000 2050
F 0 "#PWR07" H 4000 1800 50  0001 C CNN
F 1 "GND" H 4000 1900 50  0000 C CNN
F 2 "" H 4000 2050 50  0001 C CNN
F 3 "" H 4000 2050 50  0001 C CNN
	1    4000 2050
	1    0    0    -1  
$EndComp
$Comp
L GND #PWR08
U 1 1 5B573D93
P 4000 3100
F 0 "#PWR08" H 4000 2850 50  0001 C CNN
F 1 "GND" H 4000 2950 50  0000 C CNN
F 2 "" H 4000 3100 50  0001 C CNN
F 3 "" H 4000 3100 50  0001 C CNN
	1    4000 3100
	1    0    0    -1  
$EndComp
$Comp
L GND #PWR09
U 1 1 5B573DEB
P 4000 4250
F 0 "#PWR09" H 4000 4000 50  0001 C CNN
F 1 "GND" H 4000 4100 50  0000 C CNN
F 2 "" H 4000 4250 50  0001 C CNN
F 3 "" H 4000 4250 50  0001 C CNN
	1    4000 4250
	1    0    0    -1  
$EndComp
$Comp
L GND #PWR010
U 1 1 5B573EB1
P 4000 5400
F 0 "#PWR010" H 4000 5150 50  0001 C CNN
F 1 "GND" H 4000 5250 50  0000 C CNN
F 2 "" H 4000 5400 50  0001 C CNN
F 3 "" H 4000 5400 50  0001 C CNN
	1    4000 5400
	1    0    0    -1  
$EndComp
Wire Wire Line
	4000 5400 4000 5350
Wire Wire Line
	4000 5350 4250 5350
Wire Wire Line
	4050 5150 4250 5150
Wire Wire Line
	3750 5150 3650 5150
Wire Wire Line
	3750 4000 3650 4000
Wire Wire Line
	3750 2850 3650 2850
Wire Wire Line
	3750 1800 3650 1800
Wire Wire Line
	4050 1800 4250 1800
Wire Wire Line
	4250 2000 4000 2000
Wire Wire Line
	4000 2000 4000 2050
Wire Wire Line
	4050 2850 4250 2850
Wire Wire Line
	4250 3050 4000 3050
Wire Wire Line
	4000 3050 4000 3100
Wire Wire Line
	4050 4000 4250 4000
Wire Wire Line
	4250 4200 4000 4200
Wire Wire Line
	4000 4200 4000 4250
$Comp
L Ferrite_Bead L1
U 1 1 5B574246
P 1500 3250
F 0 "L1" V 1350 3275 50  0000 C CNN
F 1 "Ferrite_Bead" V 1250 3250 50  0000 C CNN
F 2 "Resistors_SMD:R_0603_HandSoldering" V 1430 3250 50  0001 C CNN
F 3 "" H 1500 3250 50  0001 C CNN
	1    1500 3250
	0    1    1    0   
$EndComp
$Comp
L R R1
U 1 1 5B574490
P 5000 1600
F 0 "R1" V 5080 1600 50  0000 C CNN
F 1 "10k" V 5000 1600 50  0000 C CNN
F 2 "Resistors_SMD:R_0603_HandSoldering" V 4930 1600 50  0001 C CNN
F 3 "" H 5000 1600 50  0001 C CNN
	1    5000 1600
	-1   0    0    1   
$EndComp
Wire Wire Line
	5000 1250 5000 1450
Wire Wire Line
	5000 1750 5000 1800
Wire Wire Line
	4750 1800 5150 1800
Connection ~ 5000 1800
$Comp
L R R3
U 1 1 5B574611
P 5000 2550
F 0 "R3" V 5080 2550 50  0000 C CNN
F 1 "10k" V 5000 2550 50  0000 C CNN
F 2 "Resistors_SMD:R_0603" V 4930 2550 50  0001 C CNN
F 3 "" H 5000 2550 50  0001 C CNN
	1    5000 2550
	-1   0    0    1   
$EndComp
$Comp
L R R5
U 1 1 5B57465F
P 5000 3750
F 0 "R5" V 5080 3750 50  0000 C CNN
F 1 "10k" V 5000 3750 50  0000 C CNN
F 2 "Resistors_SMD:R_0603" V 4930 3750 50  0001 C CNN
F 3 "" H 5000 3750 50  0001 C CNN
	1    5000 3750
	-1   0    0    1   
$EndComp
$Comp
L R R7
U 1 1 5B5746D4
P 5000 4950
F 0 "R7" V 5080 4950 50  0000 C CNN
F 1 "10k" V 5000 4950 50  0000 C CNN
F 2 "Resistors_SMD:R_0603" V 4930 4950 50  0001 C CNN
F 3 "" H 5000 4950 50  0001 C CNN
	1    5000 4950
	-1   0    0    1   
$EndComp
Wire Wire Line
	4750 4000 5150 4000
Wire Wire Line
	5000 4000 5000 3900
Wire Wire Line
	4750 2850 5150 2850
Wire Wire Line
	5000 2850 5000 2700
Wire Wire Line
	4750 5150 5150 5150
Wire Wire Line
	5000 5150 5000 5100
Wire Wire Line
	2100 3250 2100 3400
Text GLabel 3650 1800 0    60   Input ~ 0
1C
Text GLabel 3650 2850 0    60   Input ~ 0
2C
Text GLabel 3650 4000 0    60   Input ~ 0
3C
Text GLabel 3650 5150 0    60   Input ~ 0
4C
Connection ~ 5000 5150
Connection ~ 5000 4000
Connection ~ 5000 2850
Text GLabel 4750 5350 2    60   Input ~ 0
GND_I
Text GLabel 4750 4200 2    60   Input ~ 0
GND_I
Text GLabel 4750 2000 2    60   Input ~ 0
GND_I
Text GLabel 4750 3050 2    60   Input ~ 0
GND_I
Wire Wire Line
	5000 2300 5000 2400
Wire Wire Line
	5000 3400 5000 3600
Wire Wire Line
	5000 4600 5000 4800
Text GLabel 5150 1800 2    60   Input ~ 0
1C_I
Text GLabel 5150 2850 2    60   Input ~ 0
2C_I
Text GLabel 5150 4000 2    60   Input ~ 0
3C_I
Text GLabel 5150 5150 2    60   Input ~ 0
4C_I
$Comp
L PWR_FLAG #FLG011
U 1 1 5B57A1EC
P 4250 6550
F 0 "#FLG011" H 4250 6625 50  0001 C CNN
F 1 "PWR_FLAG" H 4250 6700 50  0000 C CNN
F 2 "" H 4250 6550 50  0001 C CNN
F 3 "" H 4250 6550 50  0001 C CNN
	1    4250 6550
	1    0    0    -1  
$EndComp
$Comp
L PWR_FLAG #FLG012
U 1 1 5B57A227
P 3850 6550
F 0 "#FLG012" H 3850 6625 50  0001 C CNN
F 1 "PWR_FLAG" H 3850 6700 50  0000 C CNN
F 2 "" H 3850 6550 50  0001 C CNN
F 3 "" H 3850 6550 50  0001 C CNN
	1    3850 6550
	1    0    0    -1  
$EndComp
$Comp
L PWR_FLAG #FLG013
U 1 1 5B57A262
P 3400 6550
F 0 "#FLG013" H 3400 6625 50  0001 C CNN
F 1 "PWR_FLAG" H 3400 6700 50  0000 C CNN
F 2 "" H 3400 6550 50  0001 C CNN
F 3 "" H 3400 6550 50  0001 C CNN
	1    3400 6550
	1    0    0    -1  
$EndComp
$Comp
L PWR_FLAG #FLG014
U 1 1 5B57A29D
P 2950 6550
F 0 "#FLG014" H 2950 6625 50  0001 C CNN
F 1 "PWR_FLAG" H 2950 6700 50  0000 C CNN
F 2 "" H 2950 6550 50  0001 C CNN
F 3 "" H 2950 6550 50  0001 C CNN
	1    2950 6550
	1    0    0    -1  
$EndComp
Text GLabel 2950 7150 3    60   Input ~ 0
4C_I
Text GLabel 3400 7150 3    60   Input ~ 0
3C_I
Text GLabel 3850 7150 3    60   Input ~ 0
2C_I
Text GLabel 4250 7150 3    60   Input ~ 0
1C_I
Wire Wire Line
	2950 7150 2950 6550
Wire Wire Line
	3400 7150 3400 6550
Wire Wire Line
	3850 7150 3850 6550
Wire Wire Line
	4250 7150 4250 6550
$Comp
L VCC #PWR015
U 1 1 5B57C402
P 9600 2800
F 0 "#PWR015" H 9600 2650 50  0001 C CNN
F 1 "VCC" H 9600 2950 50  0000 C CNN
F 2 "" H 9600 2800 50  0001 C CNN
F 3 "" H 9600 2800 50  0001 C CNN
	1    9600 2800
	1    0    0    -1  
$EndComp
$Comp
L VCC #PWR016
U 1 1 5B57C583
P 5000 1250
F 0 "#PWR016" H 5000 1100 50  0001 C CNN
F 1 "VCC" H 5000 1400 50  0000 C CNN
F 2 "" H 5000 1250 50  0001 C CNN
F 3 "" H 5000 1250 50  0001 C CNN
	1    5000 1250
	1    0    0    -1  
$EndComp
$Comp
L VCC #PWR017
U 1 1 5B57C5FE
P 5000 2300
F 0 "#PWR017" H 5000 2150 50  0001 C CNN
F 1 "VCC" H 5000 2450 50  0000 C CNN
F 2 "" H 5000 2300 50  0001 C CNN
F 3 "" H 5000 2300 50  0001 C CNN
	1    5000 2300
	1    0    0    -1  
$EndComp
$Comp
L VCC #PWR018
U 1 1 5B57C6A9
P 5000 3400
F 0 "#PWR018" H 5000 3250 50  0001 C CNN
F 1 "VCC" H 5000 3550 50  0000 C CNN
F 2 "" H 5000 3400 50  0001 C CNN
F 3 "" H 5000 3400 50  0001 C CNN
	1    5000 3400
	1    0    0    -1  
$EndComp
$Comp
L VCC #PWR019
U 1 1 5B57C6E4
P 5000 4600
F 0 "#PWR019" H 5000 4450 50  0001 C CNN
F 1 "VCC" H 5000 4750 50  0000 C CNN
F 2 "" H 5000 4600 50  0001 C CNN
F 3 "" H 5000 4600 50  0001 C CNN
	1    5000 4600
	1    0    0    -1  
$EndComp
$Comp
L Fuse F1
U 1 1 5B576839
P 1900 3250
F 0 "F1" V 1980 3250 50  0000 C CNN
F 1 "Fuse" V 1825 3250 50  0000 C CNN
F 2 "Fuse_Holders_and_Fuses:Fuse_SMD1206_HandSoldering" V 1830 3250 50  0001 C CNN
F 3 "" H 1900 3250 50  0001 C CNN
	1    1900 3250
	0    1    1    0   
$EndComp
Wire Wire Line
	2050 3250 2100 3250
Wire Wire Line
	1750 3250 1650 3250
$Comp
L Ferrite_Bead L2
U 1 1 5B577761
P 10450 3400
F 0 "L2" V 10300 3425 50  0000 C CNN
F 1 "Ferrite_Bead" V 10200 3400 50  0000 C CNN
F 2 "Resistors_SMD:R_0603_HandSoldering" V 10380 3400 50  0001 C CNN
F 3 "" H 10450 3400 50  0001 C CNN
	1    10450 3400
	0    1    1    0   
$EndComp
$Comp
L Fuse F2
U 1 1 5B577768
P 10050 3400
F 0 "F2" V 10130 3400 50  0000 C CNN
F 1 "Fuse" V 9975 3400 50  0000 C CNN
F 2 "Fuse_Holders_and_Fuses:Fuse_SMD1206_HandSoldering" V 9980 3400 50  0001 C CNN
F 3 "" H 10050 3400 50  0001 C CNN
	1    10050 3400
	0    1    1    0   
$EndComp
Wire Wire Line
	9900 3400 9800 3400
Wire Wire Line
	10200 3400 10300 3400
Wire Wire Line
	10600 3400 10750 3400
Wire Wire Line
	10400 3050 10600 3050
$Comp
L Ferrite_Bead L3
U 1 1 5B5A3A28
P 10250 3050
F 0 "L3" V 10100 3075 50  0000 C CNN
F 1 "Ferrite_Bead" V 10000 3050 50  0000 C CNN
F 2 "Resistors_SMD:R_0603_HandSoldering" V 10180 3050 50  0001 C CNN
F 3 "" H 10250 3050 50  0001 C CNN
	1    10250 3050
	0    1    1    0   
$EndComp
$Comp
L Fuse F3
U 1 1 5B5A3A78
P 9900 3050
F 0 "F3" V 9980 3050 50  0000 C CNN
F 1 "Fuse" V 9825 3050 50  0000 C CNN
F 2 "Fuse_Holders_and_Fuses:Fuse_SMD1206_HandSoldering" V 9830 3050 50  0001 C CNN
F 3 "" H 9900 3050 50  0001 C CNN
	1    9900 3050
	0    1    1    0   
$EndComp
Wire Wire Line
	10100 3050 10050 3050
Wire Wire Line
	9750 3050 9600 3050
Wire Wire Line
	9600 3050 9600 2800
Wire Wire Line
	10600 3050 10600 3300
Wire Wire Line
	10600 3300 10750 3300
Wire Wire Line
	1050 3250 1350 3250
$EndSCHEMATC
