PCBNEW-LibModule-V1  
# encoding utf-8
Units mm
$INDEX
DIP8_300
$EndINDEX
$MODULE DIP8_300
Po 0 0 0 15 00000000 00000000 ~~
Li DIP8_300
Cd 
Sc 00000000
At STD
Op 0 0 0
.SolderMask 0
.SolderPaste 0
T0 -4.15076 -3.81972 1.00255 1.00255 0 0.05 N V 21 "DIP8_300"
T1 -4.09366 -3.81397 1.00104 1.00104 0 0.05 N V 21 "VAL**"
DS -6.731 0.635 -6.731 2.032 0.1524 21
DS -6.731 2.032 -0.889 2.032 0.1524 21
DS -0.889 2.032 -0.889 0.635 0.1524 21
DS -0.889 -9.652 -6.731 -9.652 0.1524 21
DS -6.731 -9.652 -6.731 -8.6868 0.1524 21
DS -0.889 -8.255 -0.889 -9.652 0.1524 21
DS -6.604 -7.2136 -6.604 -8.0264 0.1524 24
DS -6.604 -8.0264 -8.0264 -8.0264 0.1524 24
DS -8.0264 -8.0264 -8.0264 -7.2136 0.1524 24
DS -8.0264 -7.2136 -6.604 -7.2136 0.1524 24
DS -6.604 -4.6736 -6.604 -5.4864 0.1524 24
DS -6.604 -5.4864 -8.0264 -5.4864 0.1524 24
DS -8.0264 -5.4864 -8.0264 -4.6736 0.1524 24
DS -8.0264 -4.6736 -6.604 -4.6736 0.1524 24
DS -6.604 -2.1336 -6.604 -2.9464 0.1524 24
DS -6.604 -2.9464 -8.0264 -2.9464 0.1524 24
DS -8.0264 -2.9464 -8.0264 -2.1336 0.1524 24
DS -8.0264 -2.1336 -6.604 -2.1336 0.1524 24
DS -6.604 0.4064 -6.604 -0.4064 0.1524 24
DS -6.604 -0.4064 -8.0264 -0.4064 0.1524 24
DS -8.0264 -0.4064 -8.0264 0.4064 0.1524 24
DS -8.0264 0.4064 -6.604 0.4064 0.1524 24
DS -1.016 -0.4064 -1.016 0.4064 0.1524 24
DS -1.016 0.4064 0.4064 0.4064 0.1524 24
DS 0.4064 0.4064 0.4064 -0.4064 0.1524 24
DS 0.4064 -0.4064 -1.016 -0.4064 0.1524 24
DS -1.016 -2.9464 -1.016 -2.1336 0.1524 24
DS -1.016 -2.1336 0.4064 -2.1336 0.1524 24
DS 0.4064 -2.1336 0.4064 -2.9464 0.1524 24
DS 0.4064 -2.9464 -1.016 -2.9464 0.1524 24
DS -1.016 -5.4864 -1.016 -4.6736 0.1524 24
DS -1.016 -4.6736 0.4064 -4.6736 0.1524 24
DS 0.4064 -4.6736 0.4064 -5.4864 0.1524 24
DS 0.4064 -5.4864 -1.016 -5.4864 0.1524 24
DS -1.016 -8.0264 -1.016 -7.2136 0.1524 24
DS -1.016 -7.2136 0.4064 -7.2136 0.1524 24
DS 0.4064 -7.2136 0.4064 -8.0264 0.1524 24
DS 0.4064 -8.0264 -1.016 -8.0264 0.1524 24
DS -6.604 1.905 -1.016 1.905 0.1524 24
DS -1.016 1.905 -1.016 -9.525 0.1524 24
DS -1.016 -9.525 -3.5052 -9.525 0.1524 24
DS -3.5052 -9.525 -4.1148 -9.525 0.1524 24
DS -4.1148 -9.525 -6.604 -9.525 0.1524 24
DS -6.604 -9.525 -6.604 1.905 0.1524 24
DA -3.81 -9.525 -4.1148 -9.525 -1800 0.1524 24
$PAD
Sh "1" R 1.3208 1.3208 0 0 0
Dr 0.8128 0 0
At STD N 00E0FFFF
.SolderMask 0
Ne 0 ""
Po -7.62 -7.62
$EndPAD
$PAD
Sh "2" C 1.3208 1.3208 0 0 0
Dr 0.8128 0 0
At STD N 00E0FFFF
.SolderMask 0
Ne 0 ""
Po -7.62 -5.08
$EndPAD
$PAD
Sh "3" C 1.3208 1.3208 0 0 0
Dr 0.8128 0 0
At STD N 00E0FFFF
.SolderMask 0
Ne 0 ""
Po -7.62 -2.54
$EndPAD
$PAD
Sh "4" C 1.3208 1.3208 0 0 0
Dr 0.8128 0 0
At STD N 00E0FFFF
.SolderMask 0
Ne 0 ""
Po -7.62 0
$EndPAD
$PAD
Sh "5" C 1.3208 1.3208 0 0 0
Dr 0.8128 0 0
At STD N 00E0FFFF
.SolderMask 0
Ne 0 ""
Po 0 0
$EndPAD
$PAD
Sh "6" C 1.3208 1.3208 0 0 0
Dr 0.8128 0 0
At STD N 00E0FFFF
.SolderMask 0
Ne 0 ""
Po 0 -2.54
$EndPAD
$PAD
Sh "7" C 1.3208 1.3208 0 0 0
Dr 0.8128 0 0
At STD N 00E0FFFF
.SolderMask 0
Ne 0 ""
Po 0 -5.08
$EndPAD
$PAD
Sh "8" C 1.3208 1.3208 0 0 0
Dr 0.8128 0 0
At STD N 00E0FFFF
.SolderMask 0
Ne 0 ""
Po 0 -7.62
$EndPAD
$EndMODULE DIP8_300
