PCBNEW-LibModule-V1  
# encoding utf-8
Units mm
$INDEX
CONN_78646-3001
$EndINDEX
$MODULE CONN_78646-3001
Po 0 0 0 15 00000000 00000000 ~~
Li CONN_78646-3001
Cd 
Sc 00000000
At SMD
Op 0 0 0
.SolderMask 0
.SolderPaste 0
T0 -7.23702 -7.41768 0.316141 0.316141 0 0.05 N V 21 "CONN_78646-3001"
T1 -6.76534 7.78613 0.315209 0.315209 0 0.05 N V 21 "VAL**"
DS -7.69 -6.215 -7.69 6.435 0.127 24
DS 7.76 6.435 -7.69 6.435 0.127 24
DS 7.76 -6.215 7.76 6.435 0.127 24
DS 7.76 -6.215 -7.69 -6.215 0.127 24
DS -7.69 -6.215 -7.69 -4.97 0.127 21
DS -7.69 -6.215 -5.99 -6.215 0.127 21
DS -1.26 -6.215 4.74 -6.215 0.127 21
DS -1.76 6.435 5.24 6.435 0.127 21
DS -7.69 3.11 -7.69 6.435 0.127 21
DS -7.69 6.435 -5.99 6.435 0.127 21
DC -8.76 -2.645 -8.66 -2.645 0.2 21
DS -8.085 -6.94 7.99 -6.94 0.05 26
DS 7.99 -6.94 7.99 7.17 0.05 26
DS 7.99 7.17 -8.085 7.17 0.05 26
DS -8.085 7.17 -8.085 -6.94 0.05 26
$PAD
Sh "C1" R 1.15 0.65 0 0 0
At SMD N 00888000
.SolderMask 0
.SolderPaste 0
Ne 0 ""
Po -7.26 -2.645
$EndPAD
$PAD
Sh "C2" R 1.15 0.65 0 0 0
At SMD N 00888000
.SolderMask 0
.SolderPaste 0
Ne 0 ""
Po -7.26 -0.105
$EndPAD
$PAD
Sh "C3" R 1.15 0.65 0 0 0
At SMD N 00888000
.SolderMask 0
.SolderPaste 0
Ne 0 ""
Po -7.26 2.435
$EndPAD
$PAD
Sh "C5" R 1.15 0.65 0 0 0
At SMD N 00888000
.SolderMask 0
.SolderPaste 0
Ne 0 ""
Po -7.26 -3.915
$EndPAD
$PAD
Sh "C6" R 1.15 0.65 0 0 0
At SMD N 00888000
.SolderMask 0
.SolderPaste 0
Ne 0 ""
Po -7.26 -1.375
$EndPAD
$PAD
Sh "C7" R 1.15 0.65 0 0 0
At SMD N 00888000
.SolderMask 0
.SolderPaste 0
Ne 0 ""
Po -7.26 1.165
$EndPAD
$PAD
Sh "G1" R 1.3 0.45 0 0 0
At SMD N 00888000
.SolderMask 0
.SolderPaste 0
Ne 0 ""
Po -5.09 -6.16
$EndPAD
$PAD
Sh "G2" R 1.3 0.45 0 0 0
At SMD N 00888000
.SolderMask 0
.SolderPaste 0
Ne 0 ""
Po -3.09 -6.16
$EndPAD
$PAD
Sh "G6" R 1.7 1.4 0 0 0
At SMD N 00888000
.SolderMask 0
.SolderPaste 0
Ne 0 ""
Po 6.47 -5.995
$EndPAD
$PAD
Sh "G5" R 1.7 1.4 0 0 0
At SMD N 00888000
.SolderMask 0
.SolderPaste 0
Ne 0 ""
Po 6.47 6.215
$EndPAD
$PAD
Sh "G4" R 1.3 0.45 0 0 0
At SMD N 00888000
.SolderMask 0
.SolderPaste 0
Ne 0 ""
Po -3.09 6.38
$EndPAD
$PAD
Sh "G3" R 1.3 0.45 0 0 0
At SMD N 00888000
.SolderMask 0
.SolderPaste 0
Ne 0 ""
Po -5.09 6.38
$EndPAD
$PAD
Sh "X2" R 0.8 0.54 0 0 0
At SMD N 00888000
.SolderMask 0
.SolderPaste 0
Ne 0 ""
Po 5.89 2.65
$EndPAD
$PAD
Sh "X1" R 0.8 0.54 0 0 0
At SMD N 00888000
.SolderMask 0
.SolderPaste 0
Ne 0 ""
Po 5.89 -2.43
$EndPAD
$EndMODULE CONN_78646-3001
