(export (version D)
  (design
    (source "/mnt/Upanishad/SOiL/SOIL-Automated-Smart-Irrigation-System/PCB Design/Sensor/Sensor.sch")
    (date "Tue 29 May 2018 11:41:31 IST")
    (tool "Eeschema 4.0.7-e2-6376~58~ubuntu16.04.1")
    (sheet (number 1) (name /) (tstamps /)
      (title_block
        (title "Capacitive Soil Moisture Sensor")
        (company "Soil Agritech Pvt. Ltd.")
        (rev v1.0)
        (date 2018-05-28)
        (source Sensor.sch)
        (comment (number 1) (value "Designed by Swaroop Sadarjoshi"))
        (comment (number 2) (value ""))
        (comment (number 3) (value ""))
        (comment (number 4) (value "")))))
  (components
    (comp (ref U2)
      (value NE555)
      (footprint NE555:DIP8_300)
      (libsource (lib linear) (part NE555))
      (sheetpath (names /) (tstamps /))
      (tstamp 5B0BDA2E))
    (comp (ref U1)
      (value LM358)
      (footprint LM358AN:DIP254P762X533-8)
      (libsource (lib linear) (part LM358))
      (sheetpath (names /) (tstamps /))
      (tstamp 5B0BDADB))
    (comp (ref R3)
      (value 30k)
      (footprint Resistors_THT:R_Axial_DIN0204_L3.6mm_D1.6mm_P7.62mm_Horizontal)
      (libsource (lib device) (part R))
      (sheetpath (names /) (tstamps /))
      (tstamp 5B0BDB71))
    (comp (ref R2)
      (value 47k)
      (footprint Resistors_THT:R_Axial_DIN0204_L3.6mm_D1.6mm_P7.62mm_Horizontal)
      (libsource (lib device) (part R))
      (sheetpath (names /) (tstamps /))
      (tstamp 5B0BDC6B))
    (comp (ref R5)
      (value 30k)
      (footprint Resistors_THT:R_Axial_DIN0204_L3.6mm_D1.6mm_P7.62mm_Horizontal)
      (libsource (lib device) (part R))
      (sheetpath (names /) (tstamps /))
      (tstamp 5B0BDD86))
    (comp (ref R4)
      (value 100k)
      (footprint Resistors_THT:R_Axial_DIN0204_L3.6mm_D1.6mm_P7.62mm_Horizontal)
      (libsource (lib device) (part R))
      (sheetpath (names /) (tstamps /))
      (tstamp 5B0BDDE7))
    (comp (ref R6)
      (value 4.7k)
      (footprint Resistors_THT:R_Axial_DIN0204_L3.6mm_D1.6mm_P7.62mm_Horizontal)
      (libsource (lib device) (part R))
      (sheetpath (names /) (tstamps /))
      (tstamp 5B0BDE77))
    (comp (ref C4)
      (value 2.2n)
      (footprint Capacitors_THT:CP_Radial_D10.0mm_P3.50mm)
      (libsource (lib device) (part C))
      (sheetpath (names /) (tstamps /))
      (tstamp 5B0BDEF3))
    (comp (ref C5)
      (value 100n)
      (footprint Capacitors_THT:CP_Radial_D10.0mm_P3.50mm)
      (libsource (lib device) (part C))
      (sheetpath (names /) (tstamps /))
      (tstamp 5B0BE066))
    (comp (ref C3)
      (value C)
      (footprint Capacitors_THT:CP_Radial_D10.0mm_P3.50mm)
      (libsource (lib device) (part C))
      (sheetpath (names /) (tstamps /))
      (tstamp 5B0BE181))
    (comp (ref C1)
      (value C)
      (footprint Capacitors_THT:CP_Radial_D10.0mm_P3.50mm)
      (libsource (lib device) (part C))
      (sheetpath (names /) (tstamps /))
      (tstamp 5B0BE1FE))
    (comp (ref J1)
      (value Screw_Terminal_01x03)
      (footprint Connectors_JST:JST_EH_B03B-EH-A_03x2.50mm_Straight)
      (libsource (lib conn) (part Screw_Terminal_01x03))
      (sheetpath (names /) (tstamps /))
      (tstamp 5B0BFE03))
    (comp (ref J2)
      (value Screw_Terminal_01x02)
      (footprint Connectors_JST:JST_EH_B02B-EH-A_02x2.50mm_Straight)
      (libsource (lib conn) (part Screw_Terminal_01x02))
      (sheetpath (names /) (tstamps /))
      (tstamp 5B0BFC40))
    (comp (ref R1)
      (value 10k)
      (footprint Potentiometers:Potentiometer_Trimmer_Bourns_3296W)
      (libsource (lib device) (part POT_TRIM))
      (sheetpath (names /) (tstamps /))
      (tstamp 5B0C075C)))
  (libparts
    (libpart (lib device) (part C)
      (description "Unpolarized capacitor")
      (footprints
        (fp C_*))
      (fields
        (field (name Reference) C)
        (field (name Value) C))
      (pins
        (pin (num 1) (name ~) (type passive))
        (pin (num 2) (name ~) (type passive))))
    (libpart (lib linear) (part LM2904)
      (aliases
        (alias LM358)
        (alias AD8620)
        (alias LMC6062)
        (alias LMC6082)
        (alias TL062)
        (alias TL072)
        (alias TL082)
        (alias NE5532)
        (alias SA5532)
        (alias RC4558)
        (alias RC4560)
        (alias RC4580)
        (alias LMV358)
        (alias TS912)
        (alias TSV912IDT)
        (alias TSV912IST)
        (alias TLC272)
        (alias TLC277)
        (alias MCP602)
        (alias OPA2134)
        (alias OPA2340)
        (alias OPA2376xxD)
        (alias OPA2376xxDGK)
        (alias MC33078)
        (alias MC33178)
        (alias LM4562)
        (alias OP249)
        (alias OP275)
        (alias ADA4075-2)
        (alias MCP6002-xP)
        (alias MCP6002-xSN)
        (alias MCP6002-xMS)
        (alias LM7332)
        (alias OPA2333xxD)
        (alias OPA2333xxDGK)
        (alias LMC6482)
        (alias LT1492)
        (alias LTC6081xMS8)
        (alias LM6172)
        (alias MCP6L92)
        (alias NJM2043)
        (alias NJM2114)
        (alias NJM4556A)
        (alias NJM4558)
        (alias NJM4559)
        (alias NJM4560)
        (alias NJM4580)
        (alias NJM5532)
        (alias ADA4807-2ARM)
        (alias OPA2691))
      (description "Dual Operational Amplifiers, DIP-8/SOIC-8/TSSOP-8/VSSOP-8")
      (docs http://www.ti.com/lit/ds/symlink/lm358.pdf)
      (footprints
        (fp SOIC*3.9x4.9mm*Pitch1.27mm*)
        (fp DIP*W7.62mm*)
        (fp TO*99*)
        (fp OnSemi*Micro8*)
        (fp TSSOP*3x3mm*Pitch0.65mm*)
        (fp TSSOP*4.4x3mm*Pitch0.65mm*)
        (fp MSOP*3x3mm*Pitch0.65mm*)
        (fp SSOP*3.9x4.9mm*Pitch0.635mm*)
        (fp LFCSP*2x2mm*Pitch0.5mm*)
        (fp *SIP*)
        (fp SOIC*5.3x6.2mm*Pitch1.27mm*))
      (fields
        (field (name Reference) U)
        (field (name Value) LM2904))
      (pins
        (pin (num 1) (name ~) (type output))
        (pin (num 2) (name -) (type input))
        (pin (num 3) (name +) (type input))
        (pin (num 4) (name V-) (type power_in))
        (pin (num 5) (name +) (type input))
        (pin (num 6) (name -) (type input))
        (pin (num 7) (name ~) (type output))
        (pin (num 8) (name V+) (type power_in))))
    (libpart (lib linear) (part LM555)
      (aliases
        (alias ICM7555)
        (alias LMC555xM)
        (alias LMC555xMM)
        (alias LMC555xN)
        (alias TLC555CD)
        (alias TLC555CP)
        (alias TLC555CPS)
        (alias NA555)
        (alias NE555)
        (alias SE555)
        (alias SA555))
      (description "Timer, DIP-8/SOIC-8/SSOP-8")
      (docs http://www.ti.com/lit/ds/symlink/lm555.pdf)
      (footprints
        (fp SOIC*3.9x4.9mm*Pitch1.27mm*)
        (fp DIP*W7.62mm*)
        (fp TSSOP*3x3mm*Pitch0.65mm*))
      (fields
        (field (name Reference) U)
        (field (name Value) LM555))
      (pins
        (pin (num 1) (name GND) (type power_in))
        (pin (num 2) (name TR) (type input))
        (pin (num 3) (name Q) (type output))
        (pin (num 4) (name R) (type input))
        (pin (num 5) (name CV) (type input))
        (pin (num 6) (name THR) (type input))
        (pin (num 7) (name DIS) (type input))
        (pin (num 8) (name VCC) (type power_in))))
    (libpart (lib device) (part POT_TRIM)
      (description Trim-Potentiometer)
      (footprints
        (fp Potentiometer*))
      (fields
        (field (name Reference) RV)
        (field (name Value) POT_TRIM))
      (pins
        (pin (num 1) (name 1) (type passive))
        (pin (num 2) (name 2) (type passive))
        (pin (num 3) (name 3) (type passive))))
    (libpart (lib device) (part R)
      (description Resistor)
      (footprints
        (fp R_*)
        (fp R_*))
      (fields
        (field (name Reference) R)
        (field (name Value) R))
      (pins
        (pin (num 1) (name ~) (type passive))
        (pin (num 2) (name ~) (type passive))))
    (libpart (lib conn) (part Screw_Terminal_01x02)
      (description "Generic screw terminal, single row, 01x02")
      (docs ~)
      (footprints
        (fp Connector*Terminal*Block*:*)
        (fp TerminalBlock*))
      (fields
        (field (name Reference) J)
        (field (name Value) Screw_Terminal_01x02))
      (pins
        (pin (num 1) (name Pin_1) (type passive))
        (pin (num 2) (name Pin_2) (type passive))))
    (libpart (lib conn) (part Screw_Terminal_01x03)
      (description "Generic screw terminal, single row, 01x03")
      (docs ~)
      (footprints
        (fp Connector*Terminal*Block*:*)
        (fp TerminalBlock*))
      (fields
        (field (name Reference) J)
        (field (name Value) Screw_Terminal_01x03))
      (pins
        (pin (num 1) (name Pin_1) (type passive))
        (pin (num 2) (name Pin_2) (type passive))
        (pin (num 3) (name Pin_3) (type passive)))))
  (libraries
    (library (logical device)
      (uri /usr/share/kicad/library/device.lib))
    (library (logical conn)
      (uri /usr/share/kicad/library/conn.lib))
    (library (logical linear)
      (uri /usr/share/kicad/library/linear.lib)))
  (nets
    (net (code 1) (name "Net-(J2-Pad1)")
      (node (ref U2) (pin 6))
      (node (ref U2) (pin 2))
      (node (ref R2) (pin 1))
      (node (ref J2) (pin 1)))
    (net (code 2) (name "Net-(R5-Pad2)")
      (node (ref R5) (pin 2))
      (node (ref U1) (pin 1)))
    (net (code 3) (name "Net-(R4-Pad2)")
      (node (ref R4) (pin 2))
      (node (ref R5) (pin 1))
      (node (ref U1) (pin 2)))
    (net (code 4) (name "Net-(C4-Pad1)")
      (node (ref C4) (pin 1))
      (node (ref U1) (pin 5))
      (node (ref R4) (pin 1)))
    (net (code 5) (name "Net-(R6-Pad1)")
      (node (ref U1) (pin 7))
      (node (ref U1) (pin 6))
      (node (ref R6) (pin 1)))
    (net (code 6) (name GND)
      (node (ref C4) (pin 2))
      (node (ref C5) (pin 2))
      (node (ref C3) (pin 2))
      (node (ref U1) (pin 4))
      (node (ref C1) (pin 2))
      (node (ref U2) (pin 1))
      (node (ref J1) (pin 2))
      (node (ref J2) (pin 2)))
    (net (code 7) (name "Net-(R1-Pad1)")
      (node (ref U2) (pin 7))
      (node (ref R1) (pin 2))
      (node (ref R1) (pin 1))
      (node (ref R2) (pin 2)))
    (net (code 8) (name "Net-(R3-Pad1)")
      (node (ref U1) (pin 3))
      (node (ref R3) (pin 1)))
    (net (code 9) (name "Net-(C3-Pad1)")
      (node (ref U2) (pin 5))
      (node (ref C3) (pin 1)))
    (net (code 10) (name "Net-(R3-Pad2)")
      (node (ref U2) (pin 3))
      (node (ref R3) (pin 2)))
    (net (code 11) (name +3V3)
      (node (ref J1) (pin 1))
      (node (ref R1) (pin 3))
      (node (ref C1) (pin 1))
      (node (ref U1) (pin 8))
      (node (ref U2) (pin 8))
      (node (ref U2) (pin 4)))
    (net (code 12) (name Data)
      (node (ref C5) (pin 1))
      (node (ref R6) (pin 2))
      (node (ref J1) (pin 3)))))