<?xml version="1.0" encoding="utf-8"?>
<!DOCTYPE eagle SYSTEM "eagle.dtd">
<eagle version="9.0.0">
<drawing>
<settings>
<setting alwaysvectorfont="no"/>
<setting verticaltext="up"/>
</settings>
<grid distance="0.1" unitdist="inch" unit="inch" style="lines" multiple="1" display="no" altdistance="0.01" altunitdist="inch" altunit="inch"/>
<layers>
<layer number="1" name="Top" color="4" fill="1" visible="no" active="no"/>
<layer number="16" name="Bottom" color="1" fill="1" visible="no" active="no"/>
<layer number="17" name="Pads" color="2" fill="1" visible="no" active="no"/>
<layer number="18" name="Vias" color="2" fill="1" visible="no" active="no"/>
<layer number="19" name="Unrouted" color="6" fill="1" visible="no" active="no"/>
<layer number="20" name="Dimension" color="24" fill="1" visible="no" active="no"/>
<layer number="21" name="tPlace" color="7" fill="1" visible="no" active="no"/>
<layer number="22" name="bPlace" color="7" fill="1" visible="no" active="no"/>
<layer number="23" name="tOrigins" color="15" fill="1" visible="no" active="no"/>
<layer number="24" name="bOrigins" color="15" fill="1" visible="no" active="no"/>
<layer number="25" name="tNames" color="7" fill="1" visible="no" active="no"/>
<layer number="26" name="bNames" color="7" fill="1" visible="no" active="no"/>
<layer number="27" name="tValues" color="7" fill="1" visible="no" active="no"/>
<layer number="28" name="bValues" color="7" fill="1" visible="no" active="no"/>
<layer number="29" name="tStop" color="7" fill="3" visible="no" active="no"/>
<layer number="30" name="bStop" color="7" fill="6" visible="no" active="no"/>
<layer number="31" name="tCream" color="7" fill="4" visible="no" active="no"/>
<layer number="32" name="bCream" color="7" fill="5" visible="no" active="no"/>
<layer number="33" name="tFinish" color="6" fill="3" visible="no" active="no"/>
<layer number="34" name="bFinish" color="6" fill="6" visible="no" active="no"/>
<layer number="35" name="tGlue" color="7" fill="4" visible="no" active="no"/>
<layer number="36" name="bGlue" color="7" fill="5" visible="no" active="no"/>
<layer number="37" name="tTest" color="7" fill="1" visible="no" active="no"/>
<layer number="38" name="bTest" color="7" fill="1" visible="no" active="no"/>
<layer number="39" name="tKeepout" color="4" fill="11" visible="no" active="no"/>
<layer number="40" name="bKeepout" color="1" fill="11" visible="no" active="no"/>
<layer number="41" name="tRestrict" color="4" fill="10" visible="no" active="no"/>
<layer number="42" name="bRestrict" color="1" fill="10" visible="no" active="no"/>
<layer number="43" name="vRestrict" color="2" fill="10" visible="no" active="no"/>
<layer number="44" name="Drills" color="7" fill="1" visible="no" active="no"/>
<layer number="45" name="Holes" color="7" fill="1" visible="no" active="no"/>
<layer number="46" name="Milling" color="3" fill="1" visible="no" active="no"/>
<layer number="47" name="Measures" color="7" fill="1" visible="no" active="no"/>
<layer number="48" name="Document" color="7" fill="1" visible="no" active="no"/>
<layer number="49" name="Reference" color="7" fill="1" visible="no" active="no"/>
<layer number="50" name="dxf" color="7" fill="1" visible="no" active="no"/>
<layer number="51" name="tDocu" color="7" fill="1" visible="no" active="no"/>
<layer number="52" name="bDocu" color="7" fill="1" visible="no" active="no"/>
<layer number="53" name="tGND_GNDA" color="7" fill="9" visible="no" active="no"/>
<layer number="54" name="bGND_GNDA" color="1" fill="9" visible="no" active="no"/>
<layer number="56" name="wert" color="7" fill="1" visible="no" active="no"/>
<layer number="57" name="tCAD" color="7" fill="1" visible="no" active="no"/>
<layer number="59" name="tCarbon" color="7" fill="1" visible="no" active="no"/>
<layer number="60" name="bCarbon" color="7" fill="1" visible="no" active="no"/>
<layer number="88" name="SimResults" color="9" fill="1" visible="yes" active="yes"/>
<layer number="89" name="SimProbes" color="9" fill="1" visible="yes" active="yes"/>
<layer number="90" name="Modules" color="5" fill="1" visible="yes" active="yes"/>
<layer number="91" name="Nets" color="2" fill="1" visible="yes" active="yes"/>
<layer number="92" name="Busses" color="1" fill="1" visible="yes" active="yes"/>
<layer number="93" name="Pins" color="2" fill="1" visible="no" active="yes"/>
<layer number="94" name="Symbols" color="4" fill="1" visible="yes" active="yes"/>
<layer number="95" name="Names" color="7" fill="1" visible="yes" active="yes"/>
<layer number="96" name="Values" color="7" fill="1" visible="yes" active="yes"/>
<layer number="97" name="Info" color="7" fill="1" visible="yes" active="yes"/>
<layer number="98" name="Guide" color="6" fill="1" visible="yes" active="yes"/>
<layer number="99" name="SpiceOrder" color="7" fill="1" visible="yes" active="yes"/>
<layer number="100" name="Muster" color="7" fill="1" visible="no" active="no"/>
<layer number="101" name="Patch_Top" color="12" fill="4" visible="yes" active="yes"/>
<layer number="102" name="Vscore" color="7" fill="1" visible="yes" active="yes"/>
<layer number="103" name="tMap" color="7" fill="1" visible="yes" active="yes"/>
<layer number="104" name="Name" color="16" fill="1" visible="yes" active="yes"/>
<layer number="105" name="tPlate" color="7" fill="1" visible="yes" active="yes"/>
<layer number="106" name="bPlate" color="7" fill="1" visible="yes" active="yes"/>
<layer number="107" name="Crop" color="7" fill="1" visible="yes" active="yes"/>
<layer number="108" name="tplace-old" color="10" fill="1" visible="yes" active="yes"/>
<layer number="109" name="ref-old" color="11" fill="1" visible="yes" active="yes"/>
<layer number="110" name="fp0" color="7" fill="1" visible="yes" active="yes"/>
<layer number="111" name="LPC17xx" color="7" fill="1" visible="yes" active="yes"/>
<layer number="112" name="tSilk" color="7" fill="1" visible="yes" active="yes"/>
<layer number="113" name="IDFDebug" color="4" fill="1" visible="yes" active="yes"/>
<layer number="114" name="Badge_Outline" color="7" fill="1" visible="yes" active="yes"/>
<layer number="115" name="ReferenceISLANDS" color="7" fill="1" visible="yes" active="yes"/>
<layer number="116" name="Patch_BOT" color="9" fill="4" visible="yes" active="yes"/>
<layer number="118" name="Rect_Pads" color="7" fill="1" visible="yes" active="yes"/>
<layer number="121" name="_tsilk" color="7" fill="1" visible="yes" active="yes"/>
<layer number="122" name="_bsilk" color="7" fill="1" visible="yes" active="yes"/>
<layer number="123" name="tTestmark" color="7" fill="1" visible="yes" active="yes"/>
<layer number="124" name="bTestmark" color="7" fill="1" visible="yes" active="yes"/>
<layer number="125" name="_tNames" color="7" fill="1" visible="yes" active="yes"/>
<layer number="126" name="_bNames" color="7" fill="1" visible="yes" active="yes"/>
<layer number="127" name="_tValues" color="7" fill="1" visible="yes" active="yes"/>
<layer number="128" name="_bValues" color="7" fill="1" visible="yes" active="yes"/>
<layer number="129" name="Mask" color="7" fill="1" visible="yes" active="yes"/>
<layer number="131" name="tAdjust" color="7" fill="1" visible="yes" active="yes"/>
<layer number="132" name="bAdjust" color="7" fill="1" visible="yes" active="yes"/>
<layer number="144" name="Drill_legend" color="7" fill="1" visible="yes" active="yes"/>
<layer number="150" name="Notes" color="7" fill="1" visible="yes" active="yes"/>
<layer number="151" name="HeatSink" color="7" fill="1" visible="yes" active="yes"/>
<layer number="152" name="_bDocu" color="7" fill="1" visible="yes" active="yes"/>
<layer number="153" name="FabDoc1" color="7" fill="1" visible="yes" active="yes"/>
<layer number="154" name="FabDoc2" color="7" fill="1" visible="yes" active="yes"/>
<layer number="155" name="FabDoc3" color="7" fill="1" visible="yes" active="yes"/>
<layer number="199" name="Contour" color="7" fill="1" visible="yes" active="yes"/>
<layer number="200" name="200bmp" color="1" fill="10" visible="yes" active="yes"/>
<layer number="201" name="201bmp" color="2" fill="10" visible="yes" active="yes"/>
<layer number="202" name="202bmp" color="3" fill="10" visible="yes" active="yes"/>
<layer number="203" name="203bmp" color="4" fill="10" visible="yes" active="yes"/>
<layer number="204" name="204bmp" color="5" fill="10" visible="yes" active="yes"/>
<layer number="205" name="205bmp" color="6" fill="10" visible="yes" active="yes"/>
<layer number="206" name="206bmp" color="7" fill="10" visible="yes" active="yes"/>
<layer number="207" name="207bmp" color="8" fill="10" visible="yes" active="yes"/>
<layer number="208" name="208bmp" color="9" fill="10" visible="yes" active="yes"/>
<layer number="209" name="209bmp" color="7" fill="1" visible="yes" active="yes"/>
<layer number="210" name="210bmp" color="7" fill="1" visible="yes" active="yes"/>
<layer number="211" name="211bmp" color="7" fill="1" visible="yes" active="yes"/>
<layer number="212" name="212bmp" color="7" fill="1" visible="yes" active="yes"/>
<layer number="213" name="213bmp" color="7" fill="1" visible="yes" active="yes"/>
<layer number="214" name="214bmp" color="7" fill="1" visible="yes" active="yes"/>
<layer number="215" name="215bmp" color="7" fill="1" visible="yes" active="yes"/>
<layer number="216" name="216bmp" color="7" fill="1" visible="yes" active="yes"/>
<layer number="217" name="217bmp" color="18" fill="1" visible="no" active="no"/>
<layer number="218" name="218bmp" color="19" fill="1" visible="no" active="no"/>
<layer number="219" name="219bmp" color="20" fill="1" visible="no" active="no"/>
<layer number="220" name="220bmp" color="21" fill="1" visible="no" active="no"/>
<layer number="221" name="221bmp" color="22" fill="1" visible="no" active="no"/>
<layer number="222" name="222bmp" color="23" fill="1" visible="no" active="no"/>
<layer number="223" name="223bmp" color="24" fill="1" visible="no" active="no"/>
<layer number="224" name="224bmp" color="25" fill="1" visible="no" active="no"/>
<layer number="225" name="225bmp" color="7" fill="1" visible="yes" active="yes"/>
<layer number="226" name="226bmp" color="7" fill="1" visible="yes" active="yes"/>
<layer number="227" name="227bmp" color="7" fill="1" visible="yes" active="yes"/>
<layer number="228" name="228bmp" color="7" fill="1" visible="yes" active="yes"/>
<layer number="229" name="229bmp" color="7" fill="1" visible="yes" active="yes"/>
<layer number="230" name="230bmp" color="7" fill="1" visible="yes" active="yes"/>
<layer number="231" name="231bmp" color="7" fill="1" visible="yes" active="yes"/>
<layer number="232" name="Eagle3D_PG2" color="7" fill="1" visible="yes" active="yes"/>
<layer number="233" name="Eagle3D_PG3" color="7" fill="1" visible="yes" active="yes"/>
<layer number="248" name="Housing" color="7" fill="1" visible="yes" active="yes"/>
<layer number="249" name="Edge" color="7" fill="1" visible="yes" active="yes"/>
<layer number="250" name="Descript" color="3" fill="1" visible="no" active="no"/>
<layer number="251" name="SMDround" color="12" fill="11" visible="no" active="no"/>
<layer number="254" name="cooling" color="7" fill="1" visible="yes" active="yes"/>
<layer number="255" name="routoute" color="7" fill="1" visible="yes" active="yes"/>
</layers>
<schematic xreflabel="%F%N/%S.%C%R" xrefpart="/%S.%C%R">
<libraries>
<library name="SparkFun-Connectors" urn="urn:adsk.eagle:library:513">
<description>&lt;h3&gt;SparkFun Connectors&lt;/h3&gt;
This library contains electrically-functional connectors. 
&lt;br&gt;
&lt;br&gt;
We've spent an enormous amount of time creating and checking these footprints and parts, but it is &lt;b&gt; the end user's responsibility&lt;/b&gt; to ensure correctness and suitablity for a given componet or application. 
&lt;br&gt;
&lt;br&gt;If you enjoy using this library, please buy one of our products at &lt;a href=" www.sparkfun.com"&gt;SparkFun.com&lt;/a&gt;.
&lt;br&gt;
&lt;br&gt;
&lt;b&gt;Licensing:&lt;/b&gt; Creative Commons ShareAlike 4.0 International - https://creativecommons.org/licenses/by-sa/4.0/ 
&lt;br&gt;
&lt;br&gt;
You are welcome to use this library for commercial purposes. For attribution, we ask that when you begin to sell your device using our footprint, you email us with a link to the product being sold. We want bragging rights that we helped (in a very small part) to create your 8th world wonder. We would like the opportunity to feature your device on our homepage.</description>
<packages>
<package name="1X02" urn="urn:adsk.eagle:footprint:37654/1" library_version="1">
<description>&lt;h3&gt;Plated Through Hole&lt;/h3&gt;
&lt;p&gt;Specifications:
&lt;ul&gt;&lt;li&gt;Pin count:2&lt;/li&gt;
&lt;li&gt;Pin pitch:0.1"&lt;/li&gt;
&lt;/ul&gt;&lt;/p&gt;
&lt;p&gt;Example device(s):
&lt;ul&gt;&lt;li&gt;CONN_02&lt;/li&gt;
&lt;/ul&gt;&lt;/p&gt;</description>
<wire x1="-0.635" y1="1.27" x2="0.635" y2="1.27" width="0.2032" layer="21"/>
<wire x1="0.635" y1="1.27" x2="1.27" y2="0.635" width="0.2032" layer="21"/>
<wire x1="1.27" y1="-0.635" x2="0.635" y2="-1.27" width="0.2032" layer="21"/>
<wire x1="1.27" y1="0.635" x2="1.905" y2="1.27" width="0.2032" layer="21"/>
<wire x1="1.905" y1="1.27" x2="3.175" y2="1.27" width="0.2032" layer="21"/>
<wire x1="3.175" y1="1.27" x2="3.81" y2="0.635" width="0.2032" layer="21"/>
<wire x1="3.81" y1="-0.635" x2="3.175" y2="-1.27" width="0.2032" layer="21"/>
<wire x1="3.175" y1="-1.27" x2="1.905" y2="-1.27" width="0.2032" layer="21"/>
<wire x1="1.905" y1="-1.27" x2="1.27" y2="-0.635" width="0.2032" layer="21"/>
<wire x1="-1.27" y1="0.635" x2="-1.27" y2="-0.635" width="0.2032" layer="21"/>
<wire x1="-0.635" y1="1.27" x2="-1.27" y2="0.635" width="0.2032" layer="21"/>
<wire x1="-1.27" y1="-0.635" x2="-0.635" y2="-1.27" width="0.2032" layer="21"/>
<wire x1="0.635" y1="-1.27" x2="-0.635" y2="-1.27" width="0.2032" layer="21"/>
<wire x1="3.81" y1="0.635" x2="3.81" y2="-0.635" width="0.2032" layer="21"/>
<pad name="1" x="0" y="0" drill="1.016" diameter="1.8796" rot="R90"/>
<pad name="2" x="2.54" y="0" drill="1.016" diameter="1.8796" rot="R90"/>
<rectangle x1="2.286" y1="-0.254" x2="2.794" y2="0.254" layer="51"/>
<rectangle x1="-0.254" y1="-0.254" x2="0.254" y2="0.254" layer="51"/>
<text x="-1.27" y="1.397" size="0.6096" layer="25" font="vector" ratio="20">&gt;NAME</text>
<text x="-1.27" y="-2.032" size="0.6096" layer="27" font="vector" ratio="20">&gt;VALUE</text>
</package>
<package name="MOLEX-1X2" urn="urn:adsk.eagle:footprint:37655/1" library_version="1">
<description>&lt;h3&gt;Molex 2-Pin Plated Through-Hole&lt;/h3&gt;
&lt;p&gt;Specifications:
&lt;ul&gt;&lt;li&gt;Pin count:2&lt;/li&gt;
&lt;li&gt;Pin pitch:0.1"&lt;/li&gt;
&lt;/ul&gt;&lt;/p&gt;
&lt;p&gt;&lt;a href=”https://www.sparkfun.com/datasheets/Prototyping/2pin_molex_set_19iv10.pdf”&gt;Datasheet referenced for footprint&lt;/a&gt;&lt;/p&gt;
&lt;p&gt;Example device(s):
&lt;ul&gt;&lt;li&gt;CONN_02&lt;/li&gt;
&lt;/ul&gt;&lt;/p&gt;</description>
<wire x1="-1.27" y1="3.048" x2="-1.27" y2="-2.54" width="0.127" layer="21"/>
<wire x1="3.81" y1="3.048" x2="3.81" y2="-2.54" width="0.127" layer="21"/>
<wire x1="3.81" y1="3.048" x2="-1.27" y2="3.048" width="0.127" layer="21"/>
<wire x1="3.81" y1="-2.54" x2="2.54" y2="-2.54" width="0.127" layer="21"/>
<wire x1="2.54" y1="-2.54" x2="0" y2="-2.54" width="0.127" layer="21"/>
<wire x1="0" y1="-2.54" x2="-1.27" y2="-2.54" width="0.127" layer="21"/>
<wire x1="0" y1="-2.54" x2="0" y2="-1.27" width="0.127" layer="21"/>
<wire x1="0" y1="-1.27" x2="2.54" y2="-1.27" width="0.127" layer="21"/>
<wire x1="2.54" y1="-1.27" x2="2.54" y2="-2.54" width="0.127" layer="21"/>
<pad name="1" x="0" y="0" drill="1.016" diameter="1.8796" shape="square"/>
<pad name="2" x="2.54" y="0" drill="1.016" diameter="1.8796"/>
<text x="-1.27" y="3.302" size="0.6096" layer="25" font="vector" ratio="20">&gt;NAME</text>
<text x="-1.27" y="-2.794" size="0.6096" layer="27" font="vector" ratio="20" align="top-left">&gt;VALUE</text>
</package>
<package name="SCREWTERMINAL-3.5MM-2" urn="urn:adsk.eagle:footprint:37656/1" library_version="1">
<description>&lt;h3&gt;Screw Terminal  3.5mm Pitch - 2 Pin PTH&lt;/h3&gt;
&lt;p&gt;Specifications:
&lt;ul&gt;&lt;li&gt;Pin count: 2&lt;/li&gt;
&lt;li&gt;Pin pitch: 3.5mm/138mil&lt;/li&gt;
&lt;/ul&gt;&lt;/p&gt;
&lt;p&gt;&lt;a href=”https://www.sparkfun.com/datasheets/Prototyping/Screw-Terminal-3.5mm.pdf”&gt;Datasheet referenced for footprint&lt;/a&gt;&lt;/p&gt;
&lt;p&gt;Example device(s):
&lt;ul&gt;&lt;li&gt;CONN_02&lt;/li&gt;
&lt;/ul&gt;&lt;/p&gt;</description>
<circle x="2" y="3" radius="0.2828" width="0.127" layer="51"/>
<wire x1="-1.75" y1="3.4" x2="5.25" y2="3.4" width="0.2032" layer="21"/>
<wire x1="5.25" y1="3.4" x2="5.25" y2="-2.8" width="0.2032" layer="21"/>
<wire x1="5.25" y1="-2.8" x2="5.25" y2="-3.6" width="0.2032" layer="21"/>
<wire x1="5.25" y1="-3.6" x2="-1.75" y2="-3.6" width="0.2032" layer="21"/>
<wire x1="-1.75" y1="-3.6" x2="-1.75" y2="-2.8" width="0.2032" layer="21"/>
<wire x1="-1.75" y1="-2.8" x2="-1.75" y2="3.4" width="0.2032" layer="21"/>
<wire x1="5.25" y1="-2.8" x2="-1.75" y2="-2.8" width="0.2032" layer="21"/>
<wire x1="-1.75" y1="-1.35" x2="-2.25" y2="-1.35" width="0.2032" layer="51"/>
<wire x1="-2.25" y1="-1.35" x2="-2.25" y2="-2.35" width="0.2032" layer="51"/>
<wire x1="-2.25" y1="-2.35" x2="-1.75" y2="-2.35" width="0.2032" layer="51"/>
<wire x1="5.25" y1="3.15" x2="5.75" y2="3.15" width="0.2032" layer="51"/>
<wire x1="5.75" y1="3.15" x2="5.75" y2="2.15" width="0.2032" layer="51"/>
<wire x1="5.75" y1="2.15" x2="5.25" y2="2.15" width="0.2032" layer="51"/>
<pad name="1" x="0" y="0" drill="1.2" diameter="2.032" shape="square"/>
<pad name="2" x="3.5" y="0" drill="1.2" diameter="2.032"/>
<text x="-1.27" y="2.54" size="0.6096" layer="25" font="vector" ratio="20">&gt;NAME</text>
<text x="-1.27" y="1.27" size="0.6096" layer="27" font="vector" ratio="20">&gt;VALUE</text>
</package>
<package name="JST-2-SMD" urn="urn:adsk.eagle:footprint:37657/1" library_version="1">
<description>&lt;h3&gt;JST-Right Angle Male Header SMT&lt;/h3&gt;
&lt;p&gt;Specifications:
&lt;ul&gt;&lt;li&gt;Pin count: 2&lt;/li&gt;
&lt;li&gt;Pin pitch: 2mm&lt;/li&gt;
&lt;/ul&gt;&lt;/p&gt;
&lt;p&gt;&lt;a href=”http://www.4uconnector.com/online/object/4udrawing/20404.pdf”&gt;Datasheet referenced for footprint&lt;/a&gt;&lt;/p&gt;
&lt;p&gt;Example device(s):
&lt;ul&gt;&lt;li&gt;CONN_02&lt;/li&gt;
&lt;li&gt;JST_2MM_MALE&lt;/li&gt;
&lt;/ul&gt;&lt;/p&gt;</description>
<wire x1="-4" y1="-1" x2="-4" y2="-4.5" width="0.2032" layer="21"/>
<wire x1="-4" y1="-4.5" x2="-3.2" y2="-4.5" width="0.2032" layer="21"/>
<wire x1="-3.2" y1="-4.5" x2="-3.2" y2="-2" width="0.2032" layer="21"/>
<wire x1="-3.2" y1="-2" x2="-2" y2="-2" width="0.2032" layer="21"/>
<wire x1="2" y1="-2" x2="3.2" y2="-2" width="0.2032" layer="21"/>
<wire x1="3.2" y1="-2" x2="3.2" y2="-4.5" width="0.2032" layer="21"/>
<wire x1="3.2" y1="-4.5" x2="4" y2="-4.5" width="0.2032" layer="21"/>
<wire x1="4" y1="-4.5" x2="4" y2="-1" width="0.2032" layer="21"/>
<wire x1="2" y1="3" x2="-2" y2="3" width="0.2032" layer="21"/>
<smd name="1" x="-1" y="-3.7" dx="1" dy="4.6" layer="1"/>
<smd name="2" x="1" y="-3.7" dx="1" dy="4.6" layer="1"/>
<smd name="NC1" x="-3.4" y="1.5" dx="3.4" dy="1.6" layer="1" rot="R90"/>
<smd name="NC2" x="3.4" y="1.5" dx="3.4" dy="1.6" layer="1" rot="R90"/>
<text x="-1.397" y="1.778" size="0.6096" layer="25" font="vector" ratio="20">&gt;NAME</text>
<text x="-1.651" y="0.635" size="0.6096" layer="27" font="vector" ratio="20">&gt;VALUE</text>
</package>
<package name="1X02_BIG" urn="urn:adsk.eagle:footprint:37658/1" library_version="1">
<description>&lt;h3&gt;Plated Through Hole&lt;/h3&gt;
&lt;p&gt;Specifications:
&lt;ul&gt;&lt;li&gt;Pin count:2&lt;/li&gt;
&lt;li&gt;Pin pitch:0.15"&lt;/li&gt;
&lt;/ul&gt;&lt;/p&gt;
&lt;p&gt;Example device(s):
&lt;ul&gt;&lt;li&gt;CONN_02&lt;/li&gt;
&lt;/ul&gt;&lt;/p&gt;</description>
<wire x1="-1.27" y1="1.27" x2="-1.27" y2="-1.27" width="0.127" layer="21"/>
<wire x1="-1.27" y1="-1.27" x2="5.08" y2="-1.27" width="0.127" layer="21"/>
<wire x1="5.08" y1="-1.27" x2="5.08" y2="1.27" width="0.127" layer="21"/>
<wire x1="5.08" y1="1.27" x2="-1.27" y2="1.27" width="0.127" layer="21"/>
<pad name="P$1" x="0" y="0" drill="1.0668"/>
<pad name="P$2" x="3.81" y="0" drill="1.0668"/>
<text x="-1.27" y="1.397" size="0.6096" layer="25" font="vector" ratio="20">&gt;NAME</text>
<text x="-1.27" y="-2.032" size="0.6096" layer="27" font="vector" ratio="20">&gt;VALUE</text>
</package>
<package name="JST-2-SMD-VERT" urn="urn:adsk.eagle:footprint:37659/1" library_version="1">
<description>&lt;h3&gt;JST-Vertical Male Header SMT &lt;/h3&gt;
&lt;p&gt;Specifications:
&lt;ul&gt;&lt;li&gt;Pin count: 2&lt;/li&gt;
&lt;li&gt;Pin pitch: 2mm&lt;/li&gt;
&lt;/ul&gt;&lt;/p&gt;
&lt;p&gt;&lt;a href=”http://www.4uconnector.com/online/object/4udrawing/20404.pdf”&gt;Datasheet referenced for footprint&lt;/a&gt;&lt;/p&gt;
&lt;p&gt;Example device(s):
&lt;ul&gt;&lt;li&gt;CONN_02&lt;/li&gt;
&lt;/ul&gt;&lt;/p&gt;</description>
<wire x1="-4.1" y1="2.97" x2="4.2" y2="2.97" width="0.2032" layer="51"/>
<wire x1="4.2" y1="2.97" x2="4.2" y2="-2.13" width="0.2032" layer="51"/>
<wire x1="4.2" y1="-2.13" x2="-4.1" y2="-2.13" width="0.2032" layer="51"/>
<wire x1="-4.1" y1="-2.13" x2="-4.1" y2="2.97" width="0.2032" layer="51"/>
<wire x1="-4.1" y1="3" x2="4.2" y2="3" width="0.2032" layer="21"/>
<wire x1="4.2" y1="3" x2="4.2" y2="2.3" width="0.2032" layer="21"/>
<wire x1="-4.1" y1="3" x2="-4.1" y2="2.3" width="0.2032" layer="21"/>
<wire x1="2" y1="-2.1" x2="4.2" y2="-2.1" width="0.2032" layer="21"/>
<wire x1="4.2" y1="-2.1" x2="4.2" y2="-1.7" width="0.2032" layer="21"/>
<wire x1="-2" y1="-2.1" x2="-4.1" y2="-2.1" width="0.2032" layer="21"/>
<wire x1="-4.1" y1="-2.1" x2="-4.1" y2="-1.8" width="0.2032" layer="21"/>
<smd name="P$1" x="-3.4" y="0.27" dx="3" dy="1.6" layer="1" rot="R90"/>
<smd name="P$2" x="3.4" y="0.27" dx="3" dy="1.6" layer="1" rot="R90"/>
<smd name="VCC" x="-1" y="-2" dx="1" dy="5.5" layer="1"/>
<smd name="GND" x="1" y="-2" dx="1" dy="5.5" layer="1"/>
<text x="-3.81" y="3.302" size="0.6096" layer="25" font="vector" ratio="20">&gt;Name</text>
<text x="-3.81" y="2.21" size="0.6096" layer="27" font="vector" ratio="20">&gt;Value</text>
</package>
<package name="SCREWTERMINAL-5MM-2" urn="urn:adsk.eagle:footprint:37660/1" library_version="1">
<description>&lt;h3&gt;Screw Terminal  5mm Pitch -2 Pin PTH&lt;/h3&gt;
&lt;p&gt;Specifications:
&lt;ul&gt;&lt;li&gt;Pin count: 2&lt;/li&gt;
&lt;li&gt;Pin pitch: 5mm/197mil&lt;/li&gt;
&lt;/ul&gt;&lt;/p&gt;
&lt;p&gt;&lt;a href=”https://www.sparkfun.com/datasheets/Prototyping/Screw-Terminal-5mm.pdf”&gt;Datasheet referenced for footprint&lt;/a&gt;&lt;/p&gt;
&lt;p&gt;Example device(s):
&lt;ul&gt;&lt;li&gt;CONN_02&lt;/li&gt;
&lt;/ul&gt;&lt;/p&gt;</description>
<wire x1="-3.1" y1="4.2" x2="8.1" y2="4.2" width="0.2032" layer="21"/>
<wire x1="8.1" y1="4.2" x2="8.1" y2="-2.3" width="0.2032" layer="21"/>
<wire x1="8.1" y1="-2.3" x2="8.1" y2="-3.3" width="0.2032" layer="21"/>
<wire x1="8.1" y1="-3.3" x2="-3.1" y2="-3.3" width="0.2032" layer="21"/>
<wire x1="-3.1" y1="-3.3" x2="-3.1" y2="-2.3" width="0.2032" layer="21"/>
<wire x1="-3.1" y1="-2.3" x2="-3.1" y2="4.2" width="0.2032" layer="21"/>
<wire x1="8.1" y1="-2.3" x2="-3.1" y2="-2.3" width="0.2032" layer="21"/>
<wire x1="-3.1" y1="-1.35" x2="-3.7" y2="-1.35" width="0.2032" layer="51"/>
<wire x1="-3.7" y1="-1.35" x2="-3.7" y2="-2.35" width="0.2032" layer="51"/>
<wire x1="-3.7" y1="-2.35" x2="-3.1" y2="-2.35" width="0.2032" layer="51"/>
<wire x1="8.1" y1="4" x2="8.7" y2="4" width="0.2032" layer="51"/>
<wire x1="8.7" y1="4" x2="8.7" y2="3" width="0.2032" layer="51"/>
<wire x1="8.7" y1="3" x2="8.1" y2="3" width="0.2032" layer="51"/>
<circle x="2.5" y="3.7" radius="0.2828" width="0.127" layer="51"/>
<pad name="1" x="0" y="0" drill="1.3" diameter="2.032" shape="square"/>
<pad name="2" x="5" y="0" drill="1.3" diameter="2.032"/>
<text x="-1.27" y="2.54" size="0.6096" layer="25" font="vector" ratio="20">&gt;NAME</text>
<text x="-1.27" y="1.27" size="0.6096" layer="27" font="vector" ratio="20">&gt;VALUE</text>
</package>
<package name="1X02_LOCK" urn="urn:adsk.eagle:footprint:37661/1" library_version="1">
<description>&lt;h3&gt;Plated Through Hole - Locking Footprint&lt;/h3&gt;
Holes are staggered by 0.005" from center to hold pins while soldering. 
&lt;p&gt;Specifications:
&lt;ul&gt;&lt;li&gt;Pin count:2&lt;/li&gt;
&lt;li&gt;Pin pitch:0.1"&lt;/li&gt;
&lt;/ul&gt;&lt;/p&gt;
&lt;p&gt;Example device(s):
&lt;ul&gt;&lt;li&gt;CONN_02&lt;/li&gt;
&lt;/ul&gt;&lt;/p&gt;</description>
<wire x1="-0.635" y1="1.27" x2="0.635" y2="1.27" width="0.2032" layer="21"/>
<wire x1="0.635" y1="1.27" x2="1.27" y2="0.635" width="0.2032" layer="21"/>
<wire x1="1.27" y1="-0.635" x2="0.635" y2="-1.27" width="0.2032" layer="21"/>
<wire x1="1.27" y1="0.635" x2="1.905" y2="1.27" width="0.2032" layer="21"/>
<wire x1="1.905" y1="1.27" x2="3.175" y2="1.27" width="0.2032" layer="21"/>
<wire x1="3.175" y1="1.27" x2="3.81" y2="0.635" width="0.2032" layer="21"/>
<wire x1="3.81" y1="-0.635" x2="3.175" y2="-1.27" width="0.2032" layer="21"/>
<wire x1="3.175" y1="-1.27" x2="1.905" y2="-1.27" width="0.2032" layer="21"/>
<wire x1="1.905" y1="-1.27" x2="1.27" y2="-0.635" width="0.2032" layer="21"/>
<wire x1="-1.27" y1="0.635" x2="-1.27" y2="-0.635" width="0.2032" layer="21"/>
<wire x1="-0.635" y1="1.27" x2="-1.27" y2="0.635" width="0.2032" layer="21"/>
<wire x1="-1.27" y1="-0.635" x2="-0.635" y2="-1.27" width="0.2032" layer="21"/>
<wire x1="0.635" y1="-1.27" x2="-0.635" y2="-1.27" width="0.2032" layer="21"/>
<wire x1="3.81" y1="0.635" x2="3.81" y2="-0.635" width="0.2032" layer="21"/>
<pad name="1" x="-0.1778" y="0" drill="1.016" diameter="1.8796" rot="R90"/>
<pad name="2" x="2.7178" y="0" drill="1.016" diameter="1.8796" rot="R90"/>
<rectangle x1="-0.2921" y1="-0.2921" x2="0.2921" y2="0.2921" layer="51"/>
<rectangle x1="2.2479" y1="-0.2921" x2="2.8321" y2="0.2921" layer="51"/>
<text x="-1.27" y="1.397" size="0.6096" layer="25" font="vector" ratio="20">&gt;NAME</text>
<text x="-1.27" y="-2.032" size="0.6096" layer="27" font="vector" ratio="20">&gt;VALUE</text>
</package>
<package name="MOLEX-1X2_LOCK" urn="urn:adsk.eagle:footprint:37662/1" library_version="1">
<description>&lt;h3&gt;Molex 2-Pin Plated Through-Hole Locking Footprint&lt;/h3&gt;
Holes are offset from center by 0.005" to hold pins in place during soldering. 
&lt;p&gt;Specifications:
&lt;ul&gt;&lt;li&gt;Pin count:2&lt;/li&gt;
&lt;li&gt;Pin pitch:0.1"&lt;/li&gt;
&lt;/ul&gt;&lt;/p&gt;
&lt;p&gt;&lt;a href=”https://www.sparkfun.com/datasheets/Prototyping/2pin_molex_set_19iv10.pdf”&gt;Datasheet referenced for footprint&lt;/a&gt;&lt;/p&gt;
&lt;p&gt;Example device(s):
&lt;ul&gt;&lt;li&gt;CONN_02&lt;/li&gt;
&lt;/ul&gt;&lt;/p&gt;</description>
<wire x1="-1.27" y1="3.048" x2="-1.27" y2="-2.54" width="0.127" layer="21"/>
<wire x1="3.81" y1="3.048" x2="3.81" y2="-2.54" width="0.127" layer="21"/>
<wire x1="3.81" y1="3.048" x2="-1.27" y2="3.048" width="0.127" layer="21"/>
<wire x1="3.81" y1="-2.54" x2="2.54" y2="-2.54" width="0.127" layer="21"/>
<wire x1="2.54" y1="-2.54" x2="0" y2="-2.54" width="0.127" layer="21"/>
<wire x1="0" y1="-2.54" x2="-1.27" y2="-2.54" width="0.127" layer="21"/>
<wire x1="0" y1="-2.54" x2="0" y2="-1.27" width="0.127" layer="21"/>
<wire x1="0" y1="-1.27" x2="2.54" y2="-1.27" width="0.127" layer="21"/>
<wire x1="2.54" y1="-1.27" x2="2.54" y2="-2.54" width="0.127" layer="21"/>
<pad name="1" x="-0.127" y="0" drill="1.016" diameter="1.8796" shape="square"/>
<pad name="2" x="2.667" y="0" drill="1.016" diameter="1.8796"/>
<rectangle x1="-0.2921" y1="-0.2921" x2="0.2921" y2="0.2921" layer="51"/>
<rectangle x1="2.2479" y1="-0.2921" x2="2.8321" y2="0.2921" layer="51"/>
<text x="-1.27" y="3.302" size="0.6096" layer="25" font="vector" ratio="20">&gt;NAME</text>
<text x="-1.27" y="-2.794" size="0.6096" layer="27" font="vector" ratio="20" align="top-left">&gt;VALUE</text>
</package>
<package name="1X02_LOCK_LONGPADS" urn="urn:adsk.eagle:footprint:37663/1" library_version="1">
<description>&lt;h3&gt;Plated Through Hole - Long Pads with Locking Footprint&lt;/h3&gt;
Pins are staggered by 0.005" from center to hold pins in place while soldering. 
&lt;p&gt;Specifications:
&lt;ul&gt;&lt;li&gt;Pin count:2&lt;/li&gt;
&lt;li&gt;Pin pitch:0.1"&lt;/li&gt;
&lt;/ul&gt;&lt;/p&gt;
&lt;p&gt;Example device(s):
&lt;ul&gt;&lt;li&gt;CONN_02&lt;/li&gt;
&lt;/ul&gt;&lt;/p&gt;</description>
<wire x1="1.651" y1="0" x2="0.889" y2="0" width="0.2032" layer="21"/>
<wire x1="-1.27" y1="0" x2="-1.016" y2="0" width="0.2032" layer="21"/>
<wire x1="-1.27" y1="0" x2="-1.27" y2="0.9906" width="0.2032" layer="21"/>
<wire x1="-1.27" y1="0.9906" x2="-0.9906" y2="1.27" width="0.2032" layer="21"/>
<wire x1="-1.27" y1="0" x2="-1.27" y2="-0.9906" width="0.2032" layer="21"/>
<wire x1="-1.27" y1="-0.9906" x2="-0.9906" y2="-1.27" width="0.2032" layer="21"/>
<wire x1="3.81" y1="0" x2="3.556" y2="0" width="0.2032" layer="21"/>
<wire x1="3.81" y1="0" x2="3.81" y2="-0.9906" width="0.2032" layer="21"/>
<wire x1="3.81" y1="-0.9906" x2="3.5306" y2="-1.27" width="0.2032" layer="21"/>
<wire x1="3.81" y1="0" x2="3.81" y2="0.9906" width="0.2032" layer="21"/>
<wire x1="3.81" y1="0.9906" x2="3.5306" y2="1.27" width="0.2032" layer="21"/>
<pad name="1" x="-0.127" y="0" drill="1.016" shape="long" rot="R90"/>
<pad name="2" x="2.667" y="0" drill="1.016" shape="long" rot="R90"/>
<rectangle x1="-0.2921" y1="-0.2921" x2="0.2921" y2="0.2921" layer="51"/>
<rectangle x1="2.2479" y1="-0.2921" x2="2.8321" y2="0.2921" layer="51"/>
<text x="-1.27" y="1.651" size="0.6096" layer="25" font="vector" ratio="20">&gt;NAME</text>
<text x="-1.27" y="-2.286" size="0.6096" layer="27" font="vector" ratio="20">&gt;VALUE</text>
</package>
<package name="SCREWTERMINAL-3.5MM-2_LOCK" urn="urn:adsk.eagle:footprint:37664/1" library_version="1">
<description>&lt;h3&gt;Screw Terminal  3.5mm Pitch - 2 Pin PTH Locking&lt;/h3&gt;
Holes are offset from center 0.005" to hold pins in place during soldering. 
&lt;p&gt;Specifications:
&lt;ul&gt;&lt;li&gt;Pin count: 2&lt;/li&gt;
&lt;li&gt;Pin pitch: 3.5mm/138mil&lt;/li&gt;
&lt;/ul&gt;&lt;/p&gt;
&lt;p&gt;&lt;a href=”https://www.sparkfun.com/datasheets/Prototyping/Screw-Terminal-3.5mm.pdf”&gt;Datasheet referenced for footprint&lt;/a&gt;&lt;/p&gt;
&lt;p&gt;Example device(s):
&lt;ul&gt;&lt;li&gt;CONN_02&lt;/li&gt;
&lt;/ul&gt;&lt;/p&gt;</description>
<wire x1="-1.75" y1="3.4" x2="5.25" y2="3.4" width="0.2032" layer="21"/>
<wire x1="5.25" y1="3.4" x2="5.25" y2="-2.8" width="0.2032" layer="21"/>
<wire x1="5.25" y1="-2.8" x2="5.25" y2="-3.6" width="0.2032" layer="21"/>
<wire x1="5.25" y1="-3.6" x2="-1.75" y2="-3.6" width="0.2032" layer="21"/>
<wire x1="-1.75" y1="-3.6" x2="-1.75" y2="-2.8" width="0.2032" layer="21"/>
<wire x1="-1.75" y1="-2.8" x2="-1.75" y2="3.4" width="0.2032" layer="21"/>
<wire x1="5.25" y1="-2.8" x2="-1.75" y2="-2.8" width="0.2032" layer="21"/>
<wire x1="-1.75" y1="-1.35" x2="-2.15" y2="-1.35" width="0.2032" layer="51"/>
<wire x1="-2.15" y1="-1.35" x2="-2.15" y2="-2.35" width="0.2032" layer="51"/>
<wire x1="-2.15" y1="-2.35" x2="-1.75" y2="-2.35" width="0.2032" layer="51"/>
<wire x1="5.25" y1="3.15" x2="5.65" y2="3.15" width="0.2032" layer="51"/>
<wire x1="5.65" y1="3.15" x2="5.65" y2="2.15" width="0.2032" layer="51"/>
<wire x1="5.65" y1="2.15" x2="5.25" y2="2.15" width="0.2032" layer="51"/>
<circle x="2" y="3" radius="0.2828" width="0.127" layer="51"/>
<circle x="0" y="0" radius="0.4318" width="0.0254" layer="51"/>
<circle x="3.5" y="0" radius="0.4318" width="0.0254" layer="51"/>
<pad name="1" x="-0.1778" y="0" drill="1.2" diameter="2.032" shape="square"/>
<pad name="2" x="3.6778" y="0" drill="1.2" diameter="2.032"/>
<text x="-1.27" y="2.54" size="0.6096" layer="25" font="vector" ratio="20">&gt;NAME</text>
<text x="-1.27" y="1.27" size="0.6096" layer="27" font="vector" ratio="20">&gt;VALUE</text>
</package>
<package name="1X02_LONGPADS" urn="urn:adsk.eagle:footprint:37665/1" library_version="1">
<description>&lt;h3&gt;Plated Through Hole - Long Pads without Silk Outline&lt;/h3&gt;
&lt;p&gt;Specifications:
&lt;ul&gt;&lt;li&gt;Pin count:2&lt;/li&gt;
&lt;li&gt;Pin pitch:0.1"&lt;/li&gt;
&lt;/ul&gt;&lt;/p&gt;
&lt;p&gt;Example device(s):
&lt;ul&gt;&lt;li&gt;CONN_02&lt;/li&gt;
&lt;/ul&gt;&lt;/p&gt;</description>
<pad name="1" x="0" y="0" drill="1.1176" diameter="1.8796" shape="long" rot="R90"/>
<pad name="2" x="2.54" y="0" drill="1.1176" diameter="1.8796" shape="long" rot="R90"/>
<text x="-1.27" y="2.032" size="0.6096" layer="25" font="vector" ratio="20">&gt;NAME</text>
<text x="-1.397" y="-2.667" size="0.6096" layer="27" font="vector" ratio="20">&gt;VALUE</text>
</package>
<package name="1X02_NO_SILK" urn="urn:adsk.eagle:footprint:37666/1" library_version="1">
<description>&lt;h3&gt;Plated Through Hole - No Silk Outline&lt;/h3&gt;
&lt;p&gt;Specifications:
&lt;ul&gt;&lt;li&gt;Pin count:2&lt;/li&gt;
&lt;li&gt;Pin pitch:0.1"&lt;/li&gt;
&lt;/ul&gt;&lt;/p&gt;
&lt;p&gt;Example device(s):
&lt;ul&gt;&lt;li&gt;CONN_02&lt;/li&gt;
&lt;/ul&gt;&lt;/p&gt;</description>
<pad name="1" x="0" y="0" drill="1.016" diameter="1.8796" rot="R90"/>
<pad name="2" x="2.54" y="0" drill="1.016" diameter="1.8796" rot="R90"/>
<rectangle x1="2.286" y1="-0.254" x2="2.794" y2="0.254" layer="51"/>
<rectangle x1="-0.254" y1="-0.254" x2="0.254" y2="0.254" layer="51"/>
<text x="-1.27" y="1.397" size="0.6096" layer="25" font="vector" ratio="20">&gt;NAME</text>
<text x="-1.27" y="-2.032" size="0.6096" layer="27" font="vector" ratio="20">&gt;VALUE</text>
</package>
<package name="JST-2-PTH" urn="urn:adsk.eagle:footprint:37667/1" library_version="1">
<description>&lt;h3&gt;JST 2 Pin Right Angle Plated Through  Hole&lt;/h3&gt;
tDocu indicate polarity for connections that match SparkFun LiPo battery terminations. 
&lt;p&gt;Specifications:
&lt;ul&gt;&lt;li&gt;Pin count: 2&lt;/li&gt;
&lt;li&gt;Pin pitch:2mm&lt;/li&gt;
&lt;/ul&gt;&lt;/p&gt;
&lt;p&gt;&lt;a href=”https://www.sparkfun.com/datasheets/Prototyping/Connectors/JST%282%29-01548.pdf”&gt;Datasheet referenced for footprint&lt;/a&gt;&lt;/p&gt;
&lt;p&gt;Example device(s):
&lt;ul&gt;&lt;li&gt;CONN_02&lt;/li&gt;
&lt;/ul&gt;&lt;/p&gt;</description>
<pad name="1" x="-1" y="0" drill="0.7" diameter="1.6"/>
<pad name="2" x="1" y="0" drill="0.7" diameter="1.6"/>
<text x="-1.27" y="5.27" size="0.6096" layer="25" font="vector" ratio="20">&gt;Name</text>
<text x="-1.27" y="2.73" size="0.6096" layer="27" font="vector" ratio="20">&gt;Value</text>
<text x="0.6" y="0.7" size="1.27" layer="51">+</text>
<text x="-1.4" y="0.7" size="1.27" layer="51">-</text>
<wire x1="-2.95" y1="-1.6" x2="-2.95" y2="6" width="0.2032" layer="21"/>
<wire x1="-2.95" y1="6" x2="2.95" y2="6" width="0.2032" layer="21"/>
<wire x1="2.95" y1="6" x2="2.95" y2="-1.6" width="0.2032" layer="21"/>
<wire x1="-2.95" y1="-1.6" x2="-2.3" y2="-1.6" width="0.2032" layer="21"/>
<wire x1="2.95" y1="-1.6" x2="2.3" y2="-1.6" width="0.2032" layer="21"/>
<wire x1="-2.3" y1="-1.6" x2="-2.3" y2="0" width="0.2032" layer="21"/>
<wire x1="2.3" y1="-1.6" x2="2.3" y2="0" width="0.2032" layer="21"/>
</package>
<package name="1X02_XTRA_BIG" urn="urn:adsk.eagle:footprint:37668/1" library_version="1">
<description>&lt;h3&gt;Plated Through Hole - 0.1" holes&lt;/h3&gt;
&lt;p&gt;Specifications:
&lt;ul&gt;&lt;li&gt;Pin count:2&lt;/li&gt;
&lt;li&gt;Pin pitch:0.2"&lt;/li&gt;
&lt;/ul&gt;&lt;/p&gt;
&lt;p&gt;Example device(s):
&lt;ul&gt;&lt;li&gt;CONN_02&lt;/li&gt;
&lt;/ul&gt;&lt;/p&gt;</description>
<wire x1="-5.08" y1="2.54" x2="-5.08" y2="-2.54" width="0.127" layer="21"/>
<wire x1="-5.08" y1="-2.54" x2="5.08" y2="-2.54" width="0.127" layer="21"/>
<wire x1="5.08" y1="-2.54" x2="5.08" y2="2.54" width="0.127" layer="21"/>
<wire x1="5.08" y1="2.54" x2="-5.08" y2="2.54" width="0.127" layer="21"/>
<pad name="1" x="-2.54" y="0" drill="2.0574" diameter="3.556"/>
<pad name="2" x="2.54" y="0" drill="2.0574" diameter="3.556"/>
<text x="-5.08" y="2.667" size="0.6096" layer="25" font="vector" ratio="20">&gt;NAME</text>
<text x="-5.08" y="-3.302" size="0.6096" layer="27" font="vector" ratio="20">&gt;VALUE</text>
</package>
<package name="1X02_PP_HOLES_ONLY" urn="urn:adsk.eagle:footprint:37669/1" library_version="1">
<description>&lt;h3&gt;Pogo Pins Connector - No Silk Outline&lt;/h3&gt;
&lt;p&gt;Specifications:
&lt;ul&gt;&lt;li&gt;Pin count:2&lt;/li&gt;
&lt;li&gt;Pin pitch:0.1"&lt;/li&gt;
&lt;/ul&gt;&lt;/p&gt;
&lt;p&gt;Example device(s):
&lt;ul&gt;&lt;li&gt;CONN_02&lt;/li&gt;
&lt;/ul&gt;&lt;/p&gt;</description>
<circle x="0" y="0" radius="0.635" width="0.127" layer="51"/>
<circle x="2.54" y="0" radius="0.635" width="0.127" layer="51"/>
<pad name="1" x="0" y="0" drill="0.889" diameter="0.8128" rot="R90"/>
<pad name="2" x="2.54" y="0" drill="0.889" diameter="0.8128" rot="R90"/>
<hole x="0" y="0" drill="1.4732"/>
<hole x="2.54" y="0" drill="1.4732"/>
<text x="-1.27" y="1.143" size="0.6096" layer="25" font="vector" ratio="20">&gt;NAME</text>
<text x="-1.27" y="-1.778" size="0.6096" layer="27" font="vector" ratio="20">&gt;VALUE</text>
</package>
<package name="SCREWTERMINAL-3.5MM-2-NS" urn="urn:adsk.eagle:footprint:37670/1" library_version="1">
<description>&lt;h3&gt;Screw Terminal  3.5mm Pitch - 2 Pin PTH No Silk Outline&lt;/h3&gt;
&lt;p&gt;Specifications:
&lt;ul&gt;&lt;li&gt;Pin count: 2&lt;/li&gt;
&lt;li&gt;Pin pitch: 3.5mm/138mil&lt;/li&gt;
&lt;/ul&gt;&lt;/p&gt;
&lt;p&gt;&lt;a href=”https://www.sparkfun.com/datasheets/Prototyping/Screw-Terminal-3.5mm.pdf”&gt;Datasheet referenced for footprint&lt;/a&gt;&lt;/p&gt;
&lt;p&gt;Example device(s):
&lt;ul&gt;&lt;li&gt;CONN_02&lt;/li&gt;
&lt;/ul&gt;&lt;/p&gt;</description>
<wire x1="-1.75" y1="3.4" x2="5.25" y2="3.4" width="0.2032" layer="51"/>
<wire x1="5.25" y1="3.4" x2="5.25" y2="-2.8" width="0.2032" layer="51"/>
<wire x1="5.25" y1="-2.8" x2="5.25" y2="-3.6" width="0.2032" layer="51"/>
<wire x1="5.25" y1="-3.6" x2="-1.75" y2="-3.6" width="0.2032" layer="51"/>
<wire x1="-1.75" y1="-3.6" x2="-1.75" y2="-2.8" width="0.2032" layer="51"/>
<wire x1="-1.75" y1="-2.8" x2="-1.75" y2="3.4" width="0.2032" layer="51"/>
<wire x1="5.25" y1="-2.8" x2="-1.75" y2="-2.8" width="0.2032" layer="51"/>
<wire x1="-1.75" y1="-1.35" x2="-2.15" y2="-1.35" width="0.2032" layer="51"/>
<wire x1="-2.15" y1="-1.35" x2="-2.15" y2="-2.35" width="0.2032" layer="51"/>
<wire x1="-2.15" y1="-2.35" x2="-1.75" y2="-2.35" width="0.2032" layer="51"/>
<wire x1="5.25" y1="3.15" x2="5.65" y2="3.15" width="0.2032" layer="51"/>
<wire x1="5.65" y1="3.15" x2="5.65" y2="2.15" width="0.2032" layer="51"/>
<wire x1="5.65" y1="2.15" x2="5.25" y2="2.15" width="0.2032" layer="51"/>
<circle x="2" y="3" radius="0.2828" width="0.127" layer="51"/>
<pad name="1" x="0" y="0" drill="1.2" diameter="2.032" shape="square"/>
<pad name="2" x="3.5" y="0" drill="1.2" diameter="2.032"/>
<text x="-1.27" y="2.54" size="0.6096" layer="25" font="vector" ratio="20">&gt;NAME</text>
<text x="-1.27" y="1.27" size="0.6096" layer="27" font="vector" ratio="20">&gt;VALUE</text>
</package>
<package name="JST-2-PTH-NS" urn="urn:adsk.eagle:footprint:37671/1" library_version="1">
<description>&lt;h3&gt;JST 2 Pin Right Angle Plated Through  Hole- No Silk&lt;/h3&gt;
tDocu indicate polarity for connections that match SparkFun LiPo battery terminations. 
&lt;br&gt; No silk outline of connector. 
&lt;p&gt;Specifications:
&lt;ul&gt;&lt;li&gt;Pin count: 2&lt;/li&gt;
&lt;li&gt;Pin pitch:2mm&lt;/li&gt;
&lt;/ul&gt;&lt;/p&gt;
&lt;p&gt;&lt;a href=”https://www.sparkfun.com/datasheets/Prototyping/Connectors/JST%282%29-01548.pdf”&gt;Datasheet referenced for footprint&lt;/a&gt;&lt;/p&gt;
&lt;p&gt;Example device(s):
&lt;ul&gt;&lt;li&gt;CONN_02&lt;/li&gt;
&lt;/ul&gt;&lt;/p&gt;</description>
<wire x1="-2" y1="0" x2="-2" y2="-1.8" width="0.2032" layer="51"/>
<wire x1="-2" y1="-1.8" x2="-3" y2="-1.8" width="0.2032" layer="51"/>
<wire x1="-3" y1="-1.8" x2="-3" y2="6" width="0.2032" layer="51"/>
<wire x1="-3" y1="6" x2="3" y2="6" width="0.2032" layer="51"/>
<wire x1="3" y1="6" x2="3" y2="-1.8" width="0.2032" layer="51"/>
<wire x1="3" y1="-1.8" x2="2" y2="-1.8" width="0.2032" layer="51"/>
<wire x1="2" y1="-1.8" x2="2" y2="0" width="0.2032" layer="51"/>
<pad name="1" x="-1" y="0" drill="0.7" diameter="1.6"/>
<pad name="2" x="1" y="0" drill="0.7" diameter="1.6"/>
<text x="-1.27" y="5.27" size="0.6096" layer="25" font="vector" ratio="20">&gt;Name</text>
<text x="-1.27" y="4" size="0.6096" layer="27" font="vector" ratio="20">&gt;Value</text>
<text x="0.6" y="0.7" size="1.27" layer="51">+</text>
<text x="-1.4" y="0.7" size="1.27" layer="51">-</text>
</package>
<package name="JST-2-PTH-KIT" urn="urn:adsk.eagle:footprint:37672/1" library_version="1">
<description>&lt;h3&gt;JST 2 Pin Right Angle Plated Through  Hole - KIT&lt;/h3&gt;
tDocu indicate polarity for connections that match SparkFun LiPo battery terminations. 
&lt;br&gt; This package has a smaller diameter top stop mask, which doesn't cover the diameter of the pad.
&lt;br&gt; This means only the bottom side of the pads' copper will be exposed. You'll only be able to solder to the bottom side.
&lt;p&gt;Specifications:
&lt;ul&gt;&lt;li&gt;Pin count: 2&lt;/li&gt;
&lt;li&gt;Pin pitch:2mm&lt;/li&gt;
&lt;/ul&gt;&lt;/p&gt;
&lt;p&gt;&lt;a href=”https://www.sparkfun.com/datasheets/Prototyping/Connectors/JST%282%29-01548.pdf”&gt;Datasheet referenced for footprint&lt;/a&gt;&lt;/p&gt;
&lt;p&gt;Example device(s):
&lt;ul&gt;&lt;li&gt;CONN_02&lt;/li&gt;
&lt;/ul&gt;&lt;/p&gt;</description>
<wire x1="-2" y1="0" x2="-2" y2="-1.8" width="0.2032" layer="51"/>
<wire x1="-2" y1="-1.8" x2="-3" y2="-1.8" width="0.2032" layer="51"/>
<wire x1="-3" y1="-1.8" x2="-3" y2="6" width="0.2032" layer="51"/>
<wire x1="-3" y1="6" x2="3" y2="6" width="0.2032" layer="51"/>
<wire x1="3" y1="6" x2="3" y2="-1.8" width="0.2032" layer="51"/>
<wire x1="3" y1="-1.8" x2="2" y2="-1.8" width="0.2032" layer="51"/>
<wire x1="2" y1="-1.8" x2="2" y2="0" width="0.2032" layer="51"/>
<pad name="1" x="-1" y="0" drill="0.7" diameter="1.4478" stop="no"/>
<pad name="2" x="1" y="0" drill="0.7" diameter="1.4478" stop="no"/>
<text x="-1.27" y="5.27" size="0.6096" layer="25" font="vector" ratio="20">&gt;Name</text>
<text x="-1.27" y="4" size="0.6096" layer="27" font="vector" ratio="20">&gt;Value</text>
<text x="0.6" y="0.7" size="1.27" layer="51">+</text>
<text x="-1.4" y="0.7" size="1.27" layer="51">-</text>
<polygon width="0.127" layer="30">
<vertex x="-0.9975" y="-0.6604" curve="-90.025935"/>
<vertex x="-1.6604" y="0" curve="-90.017354"/>
<vertex x="-1" y="0.6604" curve="-90"/>
<vertex x="-0.3396" y="0" curve="-90.078137"/>
</polygon>
<polygon width="0.127" layer="29">
<vertex x="-1" y="-0.2865" curve="-90.08005"/>
<vertex x="-1.2865" y="0" curve="-90.040011"/>
<vertex x="-1" y="0.2865" curve="-90"/>
<vertex x="-0.7135" y="0" curve="-90"/>
</polygon>
<polygon width="0.127" layer="30">
<vertex x="1.0025" y="-0.6604" curve="-90.025935"/>
<vertex x="0.3396" y="0" curve="-90.017354"/>
<vertex x="1" y="0.6604" curve="-90"/>
<vertex x="1.6604" y="0" curve="-90.078137"/>
</polygon>
<polygon width="0.127" layer="29">
<vertex x="1" y="-0.2865" curve="-90.08005"/>
<vertex x="0.7135" y="0" curve="-90.040011"/>
<vertex x="1" y="0.2865" curve="-90"/>
<vertex x="1.2865" y="0" curve="-90"/>
</polygon>
</package>
<package name="SPRINGTERMINAL-2.54MM-2" urn="urn:adsk.eagle:footprint:37673/1" library_version="1">
<description>&lt;h3&gt;Spring Terminal- PCB Mount 2 Pin PTH&lt;/h3&gt;
tDocu marks the spring arms
&lt;p&gt;Specifications:
&lt;ul&gt;&lt;li&gt;Pin count: 4&lt;/li&gt;
&lt;li&gt;Pin pitch: 0.1"&lt;/li&gt;
&lt;/ul&gt;&lt;/p&gt;
&lt;p&gt;&lt;a href=”https://www.sparkfun.com/datasheets/Prototyping/SpringTerminal.pdf”&gt;Datasheet referenced for footprint&lt;/a&gt;&lt;/p&gt;
&lt;p&gt;Example device(s):
&lt;ul&gt;&lt;li&gt;CONN_02&lt;/li&gt;
&lt;/ul&gt;&lt;/p&gt;</description>
<wire x1="-4.2" y1="7.88" x2="-4.2" y2="-2.8" width="0.254" layer="21"/>
<wire x1="-4.2" y1="-2.8" x2="-4.2" y2="-4.72" width="0.254" layer="51"/>
<wire x1="-4.2" y1="-4.72" x2="3.44" y2="-4.72" width="0.254" layer="51"/>
<wire x1="3.44" y1="-4.72" x2="3.44" y2="-2.8" width="0.254" layer="51"/>
<wire x1="3.44" y1="7.88" x2="-4.2" y2="7.88" width="0.254" layer="21"/>
<wire x1="0" y1="0" x2="0" y2="5.08" width="0.254" layer="1"/>
<wire x1="0" y1="0" x2="0" y2="5.08" width="0.254" layer="16"/>
<wire x1="2.54" y1="0" x2="2.54" y2="5.08" width="0.254" layer="16"/>
<wire x1="2.54" y1="0" x2="2.54" y2="5.08" width="0.254" layer="1"/>
<wire x1="-4.2" y1="-2.8" x2="3.44" y2="-2.8" width="0.254" layer="21"/>
<wire x1="3.44" y1="4" x2="3.44" y2="1" width="0.254" layer="21"/>
<wire x1="3.44" y1="7.88" x2="3.44" y2="6" width="0.254" layer="21"/>
<wire x1="3.44" y1="-0.9" x2="3.44" y2="-2.8" width="0.254" layer="21"/>
<pad name="1" x="0" y="0" drill="1.1" diameter="1.9"/>
<pad name="P$2" x="0" y="5.08" drill="1.1" diameter="1.9"/>
<pad name="P$3" x="2.54" y="5.08" drill="1.1" diameter="1.9"/>
<pad name="2" x="2.54" y="0" drill="1.1" diameter="1.9"/>
</package>
<package name="1X02_2.54_SCREWTERM" urn="urn:adsk.eagle:footprint:37674/1" library_version="1">
<description>&lt;h3&gt;2 Pin Screw Terminal - 2.54mm&lt;/h3&gt;
&lt;p&gt;Specifications:
&lt;ul&gt;&lt;li&gt;Pin count:2&lt;/li&gt;
&lt;li&gt;Pin pitch:0.1"&lt;/li&gt;
&lt;/ul&gt;&lt;/p&gt;
&lt;p&gt;Example device(s):
&lt;ul&gt;&lt;li&gt;CONN_02&lt;/li&gt;
&lt;/ul&gt;&lt;/p&gt;</description>
<pad name="P2" x="0" y="0" drill="1.016" shape="square"/>
<pad name="P1" x="2.54" y="0" drill="1.016" shape="square"/>
<wire x1="-1.5" y1="3.25" x2="4" y2="3.25" width="0.2032" layer="21"/>
<wire x1="4" y1="3.25" x2="4" y2="2.5" width="0.2032" layer="21"/>
<wire x1="4" y1="2.5" x2="4" y2="-3.25" width="0.2032" layer="21"/>
<wire x1="4" y1="-3.25" x2="-1.5" y2="-3.25" width="0.2032" layer="21"/>
<wire x1="-1.5" y1="-3.25" x2="-1.5" y2="2.5" width="0.2032" layer="21"/>
<wire x1="-1.5" y1="2.5" x2="-1.5" y2="3.25" width="0.2032" layer="21"/>
<wire x1="-1.5" y1="2.5" x2="4" y2="2.5" width="0.2032" layer="21"/>
<text x="-1.27" y="3.429" size="0.6096" layer="25" font="vector" ratio="20">&gt;NAME</text>
<text x="-1.27" y="-4.064" size="0.6096" layer="27" font="vector" ratio="20">&gt;VALUE</text>
</package>
<package name="1X02_POKEHOME" urn="urn:adsk.eagle:footprint:37675/1" library_version="1">
<description>2 pin poke-home connector

part number 2062-2P from STA</description>
<wire x1="-7" y1="-4" x2="-7" y2="2" width="0.2032" layer="21"/>
<wire x1="-7" y1="2" x2="-7" y2="4" width="0.2032" layer="21"/>
<wire x1="4.7" y1="4" x2="4.7" y2="-4" width="0.2032" layer="21"/>
<wire x1="4.7" y1="-4" x2="-7" y2="-4" width="0.2032" layer="21"/>
<wire x1="-7" y1="4" x2="4.7" y2="4" width="0.2032" layer="21"/>
<smd name="P2" x="5.25" y="-2" dx="3.5" dy="2" layer="1"/>
<smd name="P1" x="5.25" y="2" dx="3.5" dy="2" layer="1"/>
<smd name="P4" x="-4" y="-2" dx="6" dy="2" layer="1"/>
<smd name="P3" x="-4" y="2" dx="6" dy="2" layer="1"/>
<text x="0.635" y="-3.175" size="0.4064" layer="25">&gt;NAME</text>
<text x="0.635" y="-1.905" size="0.4064" layer="27">&gt;VALUE</text>
</package>
<package name="1X02_RA_PTH_FEMALE" urn="urn:adsk.eagle:footprint:37676/1" library_version="1">
<wire x1="-2.79" y1="4.25" x2="-2.79" y2="-4.25" width="0.1778" layer="21"/>
<wire x1="2.79" y1="4.25" x2="2.79" y2="-4.25" width="0.1778" layer="21"/>
<wire x1="-2.79" y1="4.25" x2="2.79" y2="4.25" width="0.1778" layer="21"/>
<wire x1="-2.79" y1="-4.25" x2="2.79" y2="-4.25" width="0.1778" layer="21"/>
<text x="-1.397" y="0.762" size="0.6096" layer="25" font="vector" ratio="20">&gt;NAME</text>
<text x="-1.524" y="-1.27" size="0.6096" layer="27" font="vector" ratio="20">&gt;VALUE</text>
<pad name="2" x="-1.27" y="-5.85" drill="0.8"/>
<pad name="1" x="1.27" y="-5.85" drill="0.8"/>
</package>
</packages>
<packages3d>
<package3d name="1X02" urn="urn:adsk.eagle:package:38039/1" type="box" library_version="1">
<description>Plated Through Hole
Specifications:
Pin count:2
Pin pitch:0.1"

Example device(s):
CONN_02
</description>
<packageinstances>
<packageinstance name="1X02"/>
</packageinstances>
</package3d>
<package3d name="MOLEX-1X2" urn="urn:adsk.eagle:package:38040/1" type="box" library_version="1">
<description>Molex 2-Pin Plated Through-Hole
Specifications:
Pin count:2
Pin pitch:0.1"

Datasheet referenced for footprint
Example device(s):
CONN_02
</description>
<packageinstances>
<packageinstance name="MOLEX-1X2"/>
</packageinstances>
</package3d>
<package3d name="SCREWTERMINAL-3.5MM-2" urn="urn:adsk.eagle:package:38050/1" type="box" library_version="1">
<description>Screw Terminal  3.5mm Pitch - 2 Pin PTH
Specifications:
Pin count: 2
Pin pitch: 3.5mm/138mil

Datasheet referenced for footprint
Example device(s):
CONN_02
</description>
<packageinstances>
<packageinstance name="SCREWTERMINAL-3.5MM-2"/>
</packageinstances>
</package3d>
<package3d name="JST-2-SMD" urn="urn:adsk.eagle:package:38042/1" type="box" library_version="1">
<description>JST-Right Angle Male Header SMT
Specifications:
Pin count: 2
Pin pitch: 2mm

Datasheet referenced for footprint
Example device(s):
CONN_02
JST_2MM_MALE
</description>
<packageinstances>
<packageinstance name="JST-2-SMD"/>
</packageinstances>
</package3d>
<package3d name="1X02_BIG" urn="urn:adsk.eagle:package:38043/1" type="box" library_version="1">
<description>Plated Through Hole
Specifications:
Pin count:2
Pin pitch:0.15"

Example device(s):
CONN_02
</description>
<packageinstances>
<packageinstance name="1X02_BIG"/>
</packageinstances>
</package3d>
<package3d name="JST-2-SMD-VERT" urn="urn:adsk.eagle:package:38052/1" type="box" library_version="1">
<description>JST-Vertical Male Header SMT 
Specifications:
Pin count: 2
Pin pitch: 2mm

Datasheet referenced for footprint
Example device(s):
CONN_02
</description>
<packageinstances>
<packageinstance name="JST-2-SMD-VERT"/>
</packageinstances>
</package3d>
<package3d name="SCREWTERMINAL-5MM-2" urn="urn:adsk.eagle:package:38044/1" type="box" library_version="1">
<description>Screw Terminal  5mm Pitch -2 Pin PTH
Specifications:
Pin count: 2
Pin pitch: 5mm/197mil

Datasheet referenced for footprint
Example device(s):
CONN_02
</description>
<packageinstances>
<packageinstance name="SCREWTERMINAL-5MM-2"/>
</packageinstances>
</package3d>
<package3d name="1X02_LOCK" urn="urn:adsk.eagle:package:38045/1" type="box" library_version="1">
<description>Plated Through Hole - Locking Footprint
Holes are staggered by 0.005" from center to hold pins while soldering. 
Specifications:
Pin count:2
Pin pitch:0.1"

Example device(s):
CONN_02
</description>
<packageinstances>
<packageinstance name="1X02_LOCK"/>
</packageinstances>
</package3d>
<package3d name="MOLEX-1X2_LOCK" urn="urn:adsk.eagle:package:38046/1" type="box" library_version="1">
<description>Molex 2-Pin Plated Through-Hole Locking Footprint
Holes are offset from center by 0.005" to hold pins in place during soldering. 
Specifications:
Pin count:2
Pin pitch:0.1"

Datasheet referenced for footprint
Example device(s):
CONN_02
</description>
<packageinstances>
<packageinstance name="MOLEX-1X2_LOCK"/>
</packageinstances>
</package3d>
<package3d name="1X02_LOCK_LONGPADS" urn="urn:adsk.eagle:package:38047/1" type="box" library_version="1">
<description>Plated Through Hole - Long Pads with Locking Footprint
Pins are staggered by 0.005" from center to hold pins in place while soldering. 
Specifications:
Pin count:2
Pin pitch:0.1"

Example device(s):
CONN_02
</description>
<packageinstances>
<packageinstance name="1X02_LOCK_LONGPADS"/>
</packageinstances>
</package3d>
<package3d name="SCREWTERMINAL-3.5MM-2_LOCK" urn="urn:adsk.eagle:package:38049/1" type="box" library_version="1">
<description>Screw Terminal  3.5mm Pitch - 2 Pin PTH Locking
Holes are offset from center 0.005" to hold pins in place during soldering. 
Specifications:
Pin count: 2
Pin pitch: 3.5mm/138mil

Datasheet referenced for footprint
Example device(s):
CONN_02
</description>
<packageinstances>
<packageinstance name="SCREWTERMINAL-3.5MM-2_LOCK"/>
</packageinstances>
</package3d>
<package3d name="1X02_LONGPADS" urn="urn:adsk.eagle:package:38048/1" type="box" library_version="1">
<description>Plated Through Hole - Long Pads without Silk Outline
Specifications:
Pin count:2
Pin pitch:0.1"

Example device(s):
CONN_02
</description>
<packageinstances>
<packageinstance name="1X02_LONGPADS"/>
</packageinstances>
</package3d>
<package3d name="1X02_NO_SILK" urn="urn:adsk.eagle:package:38051/1" type="box" library_version="1">
<description>Plated Through Hole - No Silk Outline
Specifications:
Pin count:2
Pin pitch:0.1"

Example device(s):
CONN_02
</description>
<packageinstances>
<packageinstance name="1X02_NO_SILK"/>
</packageinstances>
</package3d>
<package3d name="JST-2-PTH" urn="urn:adsk.eagle:package:38053/1" type="box" library_version="1">
<description>JST 2 Pin Right Angle Plated Through  Hole
tDocu indicate polarity for connections that match SparkFun LiPo battery terminations. 
Specifications:
Pin count: 2
Pin pitch:2mm

Datasheet referenced for footprint
Example device(s):
CONN_02
</description>
<packageinstances>
<packageinstance name="JST-2-PTH"/>
</packageinstances>
</package3d>
<package3d name="1X02_XTRA_BIG" urn="urn:adsk.eagle:package:38054/1" type="box" library_version="1">
<description>Plated Through Hole - 0.1" holes
Specifications:
Pin count:2
Pin pitch:0.2"

Example device(s):
CONN_02
</description>
<packageinstances>
<packageinstance name="1X02_XTRA_BIG"/>
</packageinstances>
</package3d>
<package3d name="1X02_PP_HOLES_ONLY" urn="urn:adsk.eagle:package:38058/1" type="box" library_version="1">
<description>Pogo Pins Connector - No Silk Outline
Specifications:
Pin count:2
Pin pitch:0.1"

Example device(s):
CONN_02
</description>
<packageinstances>
<packageinstance name="1X02_PP_HOLES_ONLY"/>
</packageinstances>
</package3d>
<package3d name="SCREWTERMINAL-3.5MM-2-NS" urn="urn:adsk.eagle:package:38055/1" type="box" library_version="1">
<description>Screw Terminal  3.5mm Pitch - 2 Pin PTH No Silk Outline
Specifications:
Pin count: 2
Pin pitch: 3.5mm/138mil

Datasheet referenced for footprint
Example device(s):
CONN_02
</description>
<packageinstances>
<packageinstance name="SCREWTERMINAL-3.5MM-2-NS"/>
</packageinstances>
</package3d>
<package3d name="JST-2-PTH-NS" urn="urn:adsk.eagle:package:38056/1" type="box" library_version="1">
<description>JST 2 Pin Right Angle Plated Through  Hole- No Silk
tDocu indicate polarity for connections that match SparkFun LiPo battery terminations. 
 No silk outline of connector. 
Specifications:
Pin count: 2
Pin pitch:2mm

Datasheet referenced for footprint
Example device(s):
CONN_02
</description>
<packageinstances>
<packageinstance name="JST-2-PTH-NS"/>
</packageinstances>
</package3d>
<package3d name="JST-2-PTH-KIT" urn="urn:adsk.eagle:package:38057/1" type="box" library_version="1">
<description>JST 2 Pin Right Angle Plated Through  Hole - KIT
tDocu indicate polarity for connections that match SparkFun LiPo battery terminations. 
 This package has a smaller diameter top stop mask, which doesn't cover the diameter of the pad.
 This means only the bottom side of the pads' copper will be exposed. You'll only be able to solder to the bottom side.
Specifications:
Pin count: 2
Pin pitch:2mm

Datasheet referenced for footprint
Example device(s):
CONN_02
</description>
<packageinstances>
<packageinstance name="JST-2-PTH-KIT"/>
</packageinstances>
</package3d>
<package3d name="SPRINGTERMINAL-2.54MM-2" urn="urn:adsk.eagle:package:38061/1" type="box" library_version="1">
<description>Spring Terminal- PCB Mount 2 Pin PTH
tDocu marks the spring arms
Specifications:
Pin count: 4
Pin pitch: 0.1"

Datasheet referenced for footprint
Example device(s):
CONN_02
</description>
<packageinstances>
<packageinstance name="SPRINGTERMINAL-2.54MM-2"/>
</packageinstances>
</package3d>
<package3d name="1X02_2.54_SCREWTERM" urn="urn:adsk.eagle:package:38059/1" type="box" library_version="1">
<description>2 Pin Screw Terminal - 2.54mm
Specifications:
Pin count:2
Pin pitch:0.1"

Example device(s):
CONN_02
</description>
<packageinstances>
<packageinstance name="1X02_2.54_SCREWTERM"/>
</packageinstances>
</package3d>
<package3d name="1X02_POKEHOME" urn="urn:adsk.eagle:package:38060/1" type="box" library_version="1">
<description>2 pin poke-home connector

part number 2062-2P from STA</description>
<packageinstances>
<packageinstance name="1X02_POKEHOME"/>
</packageinstances>
</package3d>
<package3d name="1X02_RA_PTH_FEMALE" urn="urn:adsk.eagle:package:38062/1" type="box" library_version="1">
<packageinstances>
<packageinstance name="1X02_RA_PTH_FEMALE"/>
</packageinstances>
</package3d>
</packages3d>
<symbols>
<symbol name="CONN_02" urn="urn:adsk.eagle:symbol:37653/1" library_version="1">
<description>&lt;h3&gt;2 Pin Connection&lt;/h3&gt;</description>
<wire x1="3.81" y1="-2.54" x2="-2.54" y2="-2.54" width="0.4064" layer="94"/>
<wire x1="1.27" y1="2.54" x2="2.54" y2="2.54" width="0.6096" layer="94"/>
<wire x1="1.27" y1="0" x2="2.54" y2="0" width="0.6096" layer="94"/>
<wire x1="-2.54" y1="5.08" x2="-2.54" y2="-2.54" width="0.4064" layer="94"/>
<wire x1="3.81" y1="-2.54" x2="3.81" y2="5.08" width="0.4064" layer="94"/>
<wire x1="-2.54" y1="5.08" x2="3.81" y2="5.08" width="0.4064" layer="94"/>
<text x="-2.54" y="-4.826" size="1.778" layer="96" font="vector">&gt;VALUE</text>
<text x="-2.54" y="5.588" size="1.778" layer="95" font="vector">&gt;NAME</text>
<pin name="1" x="7.62" y="0" visible="pad" length="middle" direction="pas" swaplevel="1" rot="R180"/>
<pin name="2" x="7.62" y="2.54" visible="pad" length="middle" direction="pas" swaplevel="1" rot="R180"/>
</symbol>
</symbols>
<devicesets>
<deviceset name="CONN_02" urn="urn:adsk.eagle:component:38323/1" prefix="J" uservalue="yes" library_version="1">
<description>&lt;h3&gt;Multi connection point. Often used as Generic Header-pin footprint for 0.1 inch spaced/style header connections&lt;/h3&gt;

&lt;p&gt;&lt;/p&gt;
&lt;b&gt;On any of the 0.1 inch spaced packages, you can populate with these:&lt;/b&gt;
&lt;ul&gt;
&lt;li&gt;&lt;a href="https://www.sparkfun.com/products/116"&gt; Break Away Headers - Straight&lt;/a&gt; (PRT-00116)&lt;/li&gt;
&lt;li&gt;&lt;a href="https://www.sparkfun.com/products/553"&gt; Break Away Male Headers - Right Angle&lt;/a&gt; (PRT-00553)&lt;/li&gt;
&lt;li&gt;&lt;a href="https://www.sparkfun.com/products/115"&gt; Female Headers&lt;/a&gt; (PRT-00115)&lt;/li&gt;
&lt;li&gt;&lt;a href="https://www.sparkfun.com/products/117"&gt; Break Away Headers - Machine Pin&lt;/a&gt; (PRT-00117)&lt;/li&gt;
&lt;li&gt;&lt;a href="https://www.sparkfun.com/products/743"&gt; Break Away Female Headers - Swiss Machine Pin&lt;/a&gt; (PRT-00743)&lt;/li&gt;
&lt;/ul&gt;

&lt;p&gt;&lt;/p&gt;
&lt;b&gt; For SCREWTERMINALS and SPRING TERMINALS visit here:&lt;/b&gt;
&lt;ul&gt;
&lt;li&gt;&lt;a href="https://www.sparkfun.com/search/results?term=Screw+Terminals"&gt; Screw Terimnals on SparkFun.com&lt;/a&gt; (5mm/3.5mm/2.54mm spacing)&lt;/li&gt;
&lt;/ul&gt;

&lt;p&gt;&lt;/p&gt;
&lt;b&gt;This device is also useful as a general connection point to wire up your design to another part of your project. Our various solder wires solder well into these plated through hole pads.&lt;/b&gt;
&lt;ul&gt;
&lt;li&gt;&lt;a href="https://www.sparkfun.com/products/11375"&gt; Hook-Up Wire - Assortment (Stranded, 22 AWG)&lt;/a&gt; (PRT-11375)&lt;/li&gt;
&lt;li&gt;&lt;a href="https://www.sparkfun.com/products/11367"&gt; Hook-Up Wire - Assortment (Solid Core, 22 AWG)&lt;/a&gt; (PRT-11367)&lt;/li&gt;
&lt;li&gt;&lt;a href="https://www.sparkfun.com/categories/141"&gt; View the entire wire category on our website here&lt;/a&gt;&lt;/li&gt;
&lt;p&gt;&lt;/p&gt;
&lt;/ul&gt;

&lt;p&gt;&lt;/p&gt;
&lt;b&gt;Special notes:&lt;/b&gt;

 Molex polarized connector foot print use with: PRT-08233 with associated crimp pins and housings.&lt;br&gt;&lt;br&gt;

2.54_SCREWTERM for use with  PRT-10571.&lt;br&gt;&lt;br&gt;

3.5mm Screw Terminal footprints for  PRT-08084&lt;br&gt;&lt;br&gt;

5mm Screw Terminal footprints for use with PRT-08432</description>
<gates>
<gate name="G$1" symbol="CONN_02" x="-2.54" y="0"/>
</gates>
<devices>
<device name="" package="1X02">
<connects>
<connect gate="G$1" pin="1" pad="1"/>
<connect gate="G$1" pin="2" pad="2"/>
</connects>
<package3dinstances>
<package3dinstance package3d_urn="urn:adsk.eagle:package:38039/1"/>
</package3dinstances>
<technologies>
<technology name=""/>
</technologies>
</device>
<device name="POLAR" package="MOLEX-1X2">
<connects>
<connect gate="G$1" pin="1" pad="1"/>
<connect gate="G$1" pin="2" pad="2"/>
</connects>
<package3dinstances>
<package3dinstance package3d_urn="urn:adsk.eagle:package:38040/1"/>
</package3dinstances>
<technologies>
<technology name="">
<attribute name="SF_ID" value="PRT-09918" constant="no"/>
</technology>
</technologies>
</device>
<device name="3.5MM" package="SCREWTERMINAL-3.5MM-2">
<connects>
<connect gate="G$1" pin="1" pad="1"/>
<connect gate="G$1" pin="2" pad="2"/>
</connects>
<package3dinstances>
<package3dinstance package3d_urn="urn:adsk.eagle:package:38050/1"/>
</package3dinstances>
<technologies>
<technology name="">
<attribute name="PROD_ID" value="CONN-08399" constant="no"/>
</technology>
</technologies>
</device>
<device name="-JST-2MM-SMT" package="JST-2-SMD">
<connects>
<connect gate="G$1" pin="1" pad="2"/>
<connect gate="G$1" pin="2" pad="1"/>
</connects>
<package3dinstances>
<package3dinstance package3d_urn="urn:adsk.eagle:package:38042/1"/>
</package3dinstances>
<technologies>
<technology name="">
<attribute name="PROD_ID" value="CONN-11443"/>
</technology>
</technologies>
</device>
<device name="PTH2" package="1X02_BIG">
<connects>
<connect gate="G$1" pin="1" pad="P$1"/>
<connect gate="G$1" pin="2" pad="P$2"/>
</connects>
<package3dinstances>
<package3dinstance package3d_urn="urn:adsk.eagle:package:38043/1"/>
</package3dinstances>
<technologies>
<technology name=""/>
</technologies>
</device>
<device name="4UCON-15767" package="JST-2-SMD-VERT">
<connects>
<connect gate="G$1" pin="1" pad="GND"/>
<connect gate="G$1" pin="2" pad="VCC"/>
</connects>
<package3dinstances>
<package3dinstance package3d_urn="urn:adsk.eagle:package:38052/1"/>
</package3dinstances>
<technologies>
<technology name=""/>
</technologies>
</device>
<device name="5MM" package="SCREWTERMINAL-5MM-2">
<connects>
<connect gate="G$1" pin="1" pad="1"/>
<connect gate="G$1" pin="2" pad="2"/>
</connects>
<package3dinstances>
<package3dinstance package3d_urn="urn:adsk.eagle:package:38044/1"/>
</package3dinstances>
<technologies>
<technology name="">
<attribute name="SF_SKU" value="PRT-08432" constant="no"/>
</technology>
</technologies>
</device>
<device name="LOCK" package="1X02_LOCK">
<connects>
<connect gate="G$1" pin="1" pad="1"/>
<connect gate="G$1" pin="2" pad="2"/>
</connects>
<package3dinstances>
<package3dinstance package3d_urn="urn:adsk.eagle:package:38045/1"/>
</package3dinstances>
<technologies>
<technology name=""/>
</technologies>
</device>
<device name="POLAR_LOCK" package="MOLEX-1X2_LOCK">
<connects>
<connect gate="G$1" pin="1" pad="1"/>
<connect gate="G$1" pin="2" pad="2"/>
</connects>
<package3dinstances>
<package3dinstance package3d_urn="urn:adsk.eagle:package:38046/1"/>
</package3dinstances>
<technologies>
<technology name="">
<attribute name="SF_ID" value="PRT-09918" constant="no"/>
</technology>
</technologies>
</device>
<device name="LOCK_LONGPADS" package="1X02_LOCK_LONGPADS">
<connects>
<connect gate="G$1" pin="1" pad="1"/>
<connect gate="G$1" pin="2" pad="2"/>
</connects>
<package3dinstances>
<package3dinstance package3d_urn="urn:adsk.eagle:package:38047/1"/>
</package3dinstances>
<technologies>
<technology name=""/>
</technologies>
</device>
<device name="3.5MM_LOCK" package="SCREWTERMINAL-3.5MM-2_LOCK">
<connects>
<connect gate="G$1" pin="1" pad="1"/>
<connect gate="G$1" pin="2" pad="2"/>
</connects>
<package3dinstances>
<package3dinstance package3d_urn="urn:adsk.eagle:package:38049/1"/>
</package3dinstances>
<technologies>
<technology name="">
<attribute name="PROD_ID" value="CONN-08399" constant="no"/>
</technology>
</technologies>
</device>
<device name="PTH3" package="1X02_LONGPADS">
<connects>
<connect gate="G$1" pin="1" pad="1"/>
<connect gate="G$1" pin="2" pad="2"/>
</connects>
<package3dinstances>
<package3dinstance package3d_urn="urn:adsk.eagle:package:38048/1"/>
</package3dinstances>
<technologies>
<technology name=""/>
</technologies>
</device>
<device name="1X02_NO_SILK" package="1X02_NO_SILK">
<connects>
<connect gate="G$1" pin="1" pad="1"/>
<connect gate="G$1" pin="2" pad="2"/>
</connects>
<package3dinstances>
<package3dinstance package3d_urn="urn:adsk.eagle:package:38051/1"/>
</package3dinstances>
<technologies>
<technology name=""/>
</technologies>
</device>
<device name="JST-PTH-2" package="JST-2-PTH">
<connects>
<connect gate="G$1" pin="1" pad="1"/>
<connect gate="G$1" pin="2" pad="2"/>
</connects>
<package3dinstances>
<package3dinstance package3d_urn="urn:adsk.eagle:package:38053/1"/>
</package3dinstances>
<technologies>
<technology name="">
<attribute name="PROD_ID" value="CONN-09863" constant="no"/>
<attribute name="SKU" value="PRT-09914" constant="no"/>
</technology>
</technologies>
</device>
<device name="PTH4" package="1X02_XTRA_BIG">
<connects>
<connect gate="G$1" pin="1" pad="1"/>
<connect gate="G$1" pin="2" pad="2"/>
</connects>
<package3dinstances>
<package3dinstance package3d_urn="urn:adsk.eagle:package:38054/1"/>
</package3dinstances>
<technologies>
<technology name=""/>
</technologies>
</device>
<device name="POGO_PIN_HOLES_ONLY" package="1X02_PP_HOLES_ONLY">
<connects>
<connect gate="G$1" pin="1" pad="1"/>
<connect gate="G$1" pin="2" pad="2"/>
</connects>
<package3dinstances>
<package3dinstance package3d_urn="urn:adsk.eagle:package:38058/1"/>
</package3dinstances>
<technologies>
<technology name=""/>
</technologies>
</device>
<device name="3.5MM-NO_SILK" package="SCREWTERMINAL-3.5MM-2-NS">
<connects>
<connect gate="G$1" pin="1" pad="1"/>
<connect gate="G$1" pin="2" pad="2"/>
</connects>
<package3dinstances>
<package3dinstance package3d_urn="urn:adsk.eagle:package:38055/1"/>
</package3dinstances>
<technologies>
<technology name="">
<attribute name="PROD_ID" value="CONN-08399" constant="no"/>
</technology>
</technologies>
</device>
<device name="-JST-2-PTH-NO_SILK" package="JST-2-PTH-NS">
<connects>
<connect gate="G$1" pin="1" pad="1"/>
<connect gate="G$1" pin="2" pad="2"/>
</connects>
<package3dinstances>
<package3dinstance package3d_urn="urn:adsk.eagle:package:38056/1"/>
</package3dinstances>
<technologies>
<technology name=""/>
</technologies>
</device>
<device name="JST-PTH-2-KIT" package="JST-2-PTH-KIT">
<connects>
<connect gate="G$1" pin="1" pad="1"/>
<connect gate="G$1" pin="2" pad="2"/>
</connects>
<package3dinstances>
<package3dinstance package3d_urn="urn:adsk.eagle:package:38057/1"/>
</package3dinstances>
<technologies>
<technology name=""/>
</technologies>
</device>
<device name="SPRING-2.54-RA" package="SPRINGTERMINAL-2.54MM-2">
<connects>
<connect gate="G$1" pin="1" pad="1"/>
<connect gate="G$1" pin="2" pad="2"/>
</connects>
<package3dinstances>
<package3dinstance package3d_urn="urn:adsk.eagle:package:38061/1"/>
</package3dinstances>
<technologies>
<technology name=""/>
</technologies>
</device>
<device name="2.54MM_SCREWTERM" package="1X02_2.54_SCREWTERM">
<connects>
<connect gate="G$1" pin="1" pad="P1"/>
<connect gate="G$1" pin="2" pad="P2"/>
</connects>
<package3dinstances>
<package3dinstance package3d_urn="urn:adsk.eagle:package:38059/1"/>
</package3dinstances>
<technologies>
<technology name=""/>
</technologies>
</device>
<device name="SMALL_POKEHOME" package="1X02_POKEHOME">
<connects>
<connect gate="G$1" pin="1" pad="P1 P3"/>
<connect gate="G$1" pin="2" pad="P2 P4"/>
</connects>
<package3dinstances>
<package3dinstance package3d_urn="urn:adsk.eagle:package:38060/1"/>
</package3dinstances>
<technologies>
<technology name="">
<attribute name="PROD_ID" value="CONN-13512"/>
</technology>
</technologies>
</device>
<device name="PTH_RA_FEMALE" package="1X02_RA_PTH_FEMALE">
<connects>
<connect gate="G$1" pin="1" pad="1"/>
<connect gate="G$1" pin="2" pad="2"/>
</connects>
<package3dinstances>
<package3dinstance package3d_urn="urn:adsk.eagle:package:38062/1"/>
</package3dinstances>
<technologies>
<technology name="">
<attribute name="PROD_ID" value="CONN-13700"/>
</technology>
</technologies>
</device>
</devices>
</deviceset>
</devicesets>
</library>
<library name="frames" urn="urn:adsk.eagle:library:229">
<description>&lt;b&gt;Frames for Sheet and Layout&lt;/b&gt;</description>
<packages>
</packages>
<symbols>
<symbol name="A5L-LOC" urn="urn:adsk.eagle:symbol:13879/1" library_version="1">
<wire x1="85.09" y1="3.81" x2="85.09" y2="24.13" width="0.1016" layer="94"/>
<wire x1="85.09" y1="24.13" x2="139.065" y2="24.13" width="0.1016" layer="94"/>
<wire x1="139.065" y1="24.13" x2="180.34" y2="24.13" width="0.1016" layer="94"/>
<wire x1="170.18" y1="3.81" x2="170.18" y2="8.89" width="0.1016" layer="94"/>
<wire x1="170.18" y1="8.89" x2="180.34" y2="8.89" width="0.1016" layer="94"/>
<wire x1="170.18" y1="8.89" x2="139.065" y2="8.89" width="0.1016" layer="94"/>
<wire x1="139.065" y1="8.89" x2="139.065" y2="3.81" width="0.1016" layer="94"/>
<wire x1="139.065" y1="8.89" x2="139.065" y2="13.97" width="0.1016" layer="94"/>
<wire x1="139.065" y1="13.97" x2="180.34" y2="13.97" width="0.1016" layer="94"/>
<wire x1="139.065" y1="13.97" x2="139.065" y2="19.05" width="0.1016" layer="94"/>
<wire x1="139.065" y1="19.05" x2="180.34" y2="19.05" width="0.1016" layer="94"/>
<wire x1="139.065" y1="19.05" x2="139.065" y2="24.13" width="0.1016" layer="94"/>
<text x="140.97" y="15.24" size="2.54" layer="94">&gt;DRAWING_NAME</text>
<text x="140.97" y="10.16" size="2.286" layer="94">&gt;LAST_DATE_TIME</text>
<text x="154.305" y="5.08" size="2.54" layer="94">&gt;SHEET</text>
<text x="140.716" y="4.953" size="2.54" layer="94">Sheet:</text>
<frame x1="0" y1="0" x2="184.15" y2="133.35" columns="4" rows="4" layer="94"/>
</symbol>
</symbols>
<devicesets>
<deviceset name="DINA5_L" urn="urn:adsk.eagle:component:13932/1" prefix="FRAME" uservalue="yes" library_version="1">
<description>&lt;b&gt;FRAME&lt;/b&gt;&lt;p&gt;
DIN A5, landscape with doc field</description>
<gates>
<gate name="G$1" symbol="A5L-LOC" x="0" y="0"/>
</gates>
<devices>
<device name="">
<technologies>
<technology name=""/>
</technologies>
</device>
</devices>
</deviceset>
</devicesets>
</library>
<library name="SparkFun-PowerSymbols">
<description>&lt;h3&gt;SparkFun Power Symbols&lt;/h3&gt;
This library contains power, ground, and voltage-supply symbols.
&lt;br&gt;
&lt;br&gt;
We've spent an enormous amount of time creating and checking these footprints and parts, but it is &lt;b&gt; the end user's responsibility&lt;/b&gt; to ensure correctness and suitablity for a given componet or application. 
&lt;br&gt;
&lt;br&gt;If you enjoy using this library, please buy one of our products at &lt;a href=" www.sparkfun.com"&gt;SparkFun.com&lt;/a&gt;.
&lt;br&gt;
&lt;br&gt;
&lt;b&gt;Licensing:&lt;/b&gt; Creative Commons ShareAlike 4.0 International - https://creativecommons.org/licenses/by-sa/4.0/ 
&lt;br&gt;
&lt;br&gt;
You are welcome to use this library for commercial purposes. For attribution, we ask that when you begin to sell your device using our footprint, you email us with a link to the product being sold. We want bragging rights that we helped (in a very small part) to create your 8th world wonder. We would like the opportunity to feature your device on our homepage.</description>
<packages>
</packages>
<symbols>
<symbol name="VCC">
<description>&lt;h3&gt;VCC Voltage Supply&lt;/h3&gt;</description>
<wire x1="0.762" y1="1.27" x2="0" y2="2.54" width="0.254" layer="94"/>
<wire x1="0" y1="2.54" x2="-0.762" y2="1.27" width="0.254" layer="94"/>
<pin name="VCC" x="0" y="0" visible="off" length="short" direction="sup" rot="R90"/>
<text x="0" y="2.794" size="1.778" layer="96" align="bottom-center">&gt;VALUE</text>
</symbol>
</symbols>
<devicesets>
<deviceset name="VCC" prefix="SUPPLY">
<description>&lt;h3&gt;VCC Voltage Supply&lt;/h3&gt;
&lt;p&gt;Positive voltage supply (traditionally for a BJT device, C=collector).&lt;/p&gt;</description>
<gates>
<gate name="G$1" symbol="VCC" x="0" y="0"/>
</gates>
<devices>
<device name="">
<technologies>
<technology name=""/>
</technologies>
</device>
</devices>
</deviceset>
</devicesets>
</library>
<library name="supply2" urn="urn:adsk.eagle:library:372">
<description>&lt;b&gt;Supply Symbols&lt;/b&gt;&lt;p&gt;
GND, VCC, 0V, +5V, -5V, etc.&lt;p&gt;
Please keep in mind, that these devices are necessary for the
automatic wiring of the supply signals.&lt;p&gt;
The pin name defined in the symbol is identical to the net which is to be wired automatically.&lt;p&gt;
In this library the device names are the same as the pin names of the symbols, therefore the correct signal names appear next to the supply symbols in the schematic.&lt;p&gt;
&lt;author&gt;Created by librarian@cadsoft.de&lt;/author&gt;</description>
<packages>
</packages>
<symbols>
<symbol name="GND" urn="urn:adsk.eagle:symbol:26990/1" library_version="2">
<wire x1="-1.27" y1="0" x2="1.27" y2="0" width="0.254" layer="94"/>
<wire x1="1.27" y1="0" x2="0" y2="-1.27" width="0.254" layer="94"/>
<wire x1="0" y1="-1.27" x2="-1.27" y2="0" width="0.254" layer="94"/>
<text x="-1.905" y="-3.175" size="1.778" layer="96">&gt;VALUE</text>
<pin name="GND" x="0" y="2.54" visible="off" length="short" direction="sup" rot="R270"/>
</symbol>
</symbols>
<devicesets>
<deviceset name="GND" urn="urn:adsk.eagle:component:27037/1" prefix="SUPPLY" library_version="2">
<description>&lt;b&gt;SUPPLY SYMBOL&lt;/b&gt;</description>
<gates>
<gate name="GND" symbol="GND" x="0" y="0"/>
</gates>
<devices>
<device name="">
<technologies>
<technology name=""/>
</technologies>
</device>
</devices>
</deviceset>
</devicesets>
</library>
</libraries>
<attributes>
</attributes>
<variantdefs>
</variantdefs>
<classes>
<class number="0" name="default" width="0" drill="0">
</class>
</classes>
<parts>
<part name="J1" library="SparkFun-Connectors" library_urn="urn:adsk.eagle:library:513" deviceset="CONN_02" device="LOCK_LONGPADS" package3d_urn="urn:adsk.eagle:package:38047/1"/>
<part name="FRAME1" library="frames" library_urn="urn:adsk.eagle:library:229" deviceset="DINA5_L" device=""/>
<part name="SUPPLY1" library="SparkFun-PowerSymbols" deviceset="VCC" device=""/>
<part name="SUPPLY2" library="supply2" library_urn="urn:adsk.eagle:library:372" deviceset="GND" device=""/>
</parts>
<sheets>
<sheet>
<plain>
</plain>
<instances>
<instance part="J1" gate="G$1" x="78.74" y="71.12"/>
<instance part="FRAME1" gate="G$1" x="0" y="0"/>
<instance part="SUPPLY1" gate="G$1" x="114.3" y="73.66"/>
<instance part="SUPPLY2" gate="GND" x="106.68" y="66.04"/>
</instances>
<busses>
</busses>
<nets>
<net name="VCC" class="0">
<segment>
<pinref part="J1" gate="G$1" pin="1"/>
<label x="93.98" y="68.58" size="1.778" layer="95"/>
<pinref part="SUPPLY1" gate="G$1" pin="VCC"/>
<wire x1="86.36" y1="71.12" x2="114.3" y2="71.12" width="0.1524" layer="91"/>
<wire x1="114.3" y1="71.12" x2="114.3" y2="73.66" width="0.1524" layer="91"/>
</segment>
</net>
<net name="GND" class="0">
<segment>
<pinref part="J1" gate="G$1" pin="2"/>
<label x="93.98" y="73.66" size="1.778" layer="95"/>
<wire x1="86.36" y1="73.66" x2="106.68" y2="73.66" width="0.1524" layer="91"/>
<pinref part="SUPPLY2" gate="GND" pin="GND"/>
<wire x1="106.68" y1="68.58" x2="106.68" y2="73.66" width="0.1524" layer="91"/>
</segment>
</net>
</nets>
</sheet>
</sheets>
</schematic>
</drawing>
<compatibility>
<note version="8.2" severity="warning">
Since Version 8.2, EAGLE supports online libraries. The ids
of those online libraries will not be understood (or retained)
with this version.
</note>
<note version="8.3" severity="warning">
Since Version 8.3, EAGLE supports URNs for individual library
assets (packages, symbols, and devices). The URNs of those assets
will not be understood (or retained) with this version.
</note>
<note version="8.3" severity="warning">
Since Version 8.3, EAGLE supports the association of 3D packages
with devices in libraries, schematics, and board files. Those 3D
packages will not be understood (or retained) with this version.
</note>
</compatibility>
</eagle>
