PCBNEW-LibModule-V1  
# encoding utf-8
Units mm
$INDEX
XCVR_ESP32-WROVER-I
$EndINDEX
$MODULE XCVR_ESP32-WROVER-I
Po 0 0 0 15 00000000 00000000 ~~
Li XCVR_ESP32-WROVER-I
Cd 
Sc 00000000
At SMD
Op 0 0 0
.SolderMask 0
.SolderPaste 0
T0 -5.87861 -16.8384 1.00318 1.00318 0 0.05 N V 21 "XCVR_ESP32-WROVER-I"
T1 -5.29059 16.7644 1.00296 1.00296 0 0.05 N V 21 "VAL**"
DS -9 -15.7 9 -15.7 0.127 24
DS 9 -15.7 9 15.7 0.127 24
DS 9 15.7 -9 15.7 0.127 24
DS -9 15.7 -9 -15.7 0.127 24
DS -9 -8.95 -9 -15.7 0.127 21
DS -9 -15.7 9 -15.7 0.127 21
DS 9 -15.7 9 -8.95 0.127 21
DS -9 15.7 9 15.7 0.127 21
DS 9 15.7 9 15.5 0.127 21
DS -9 15.55 -9 15.7 0.127 21
DC -10.1 -8.4 -9.98 -8.4 0.24 21
DS -9.8 -15.95 9.8 -15.95 0.05 26
DS 9.8 -15.95 9.8 15.95 0.05 26
DS 9.8 15.95 -9.8 15.95 0.05 26
DS -9.8 15.95 -9.8 -15.95 0.05 26
DP 0 0 0 0 4 0 19
Dl -2.65344 -1.735
Dl -0.115 -1.735
Dl -0.115 0.797539
Dl -2.65344 0.797539
DP 0 0 0 0 4 0 24
Dl -9.03981 -15.7
Dl 9 -15.7
Dl 9 -9.34113
Dl -9.03981 -9.34113
DP 0 0 0 0 4 0 24
Dl -9.03389 -15.7
Dl 9 -15.7
Dl 9 -9.33502
Dl -9.03389 -9.33502
DP 0 0 0 0 4 0 24
Dl -9.04575 -15.7
Dl 9 -15.7
Dl 9 -9.34726
Dl -9.04575 -9.34726
$PAD
Sh "1" R 1.45 0.93 0 0 0
At SMD N 00888000
.SolderMask 0
.SolderPaste 0
Ne 0 ""
Po -8.81 -8.26
$EndPAD
$PAD
Sh "2" R 1.45 0.93 0 0 0
At SMD N 00888000
.SolderMask 0
.SolderPaste 0
Ne 0 ""
Po -8.81 -6.99
$EndPAD
$PAD
Sh "3" R 1.45 0.93 0 0 0
At SMD N 00888000
.SolderMask 0
.SolderPaste 0
Ne 0 ""
Po -8.81 -5.72
$EndPAD
$PAD
Sh "4" R 1.45 0.93 0 0 0
At SMD N 00888000
.SolderMask 0
.SolderPaste 0
Ne 0 ""
Po -8.81 -4.45
$EndPAD
$PAD
Sh "5" R 1.45 0.93 0 0 0
At SMD N 00888000
.SolderMask 0
.SolderPaste 0
Ne 0 ""
Po -8.81 -3.18
$EndPAD
$PAD
Sh "6" R 1.45 0.93 0 0 0
At SMD N 00888000
.SolderMask 0
.SolderPaste 0
Ne 0 ""
Po -8.81 -1.91
$EndPAD
$PAD
Sh "7" R 1.45 0.93 0 0 0
At SMD N 00888000
.SolderMask 0
.SolderPaste 0
Ne 0 ""
Po -8.81 -0.64
$EndPAD
$PAD
Sh "8" R 1.45 0.93 0 0 0
At SMD N 00888000
.SolderMask 0
.SolderPaste 0
Ne 0 ""
Po -8.81 0.63
$EndPAD
$PAD
Sh "9" R 1.45 0.93 0 0 0
At SMD N 00888000
.SolderMask 0
.SolderPaste 0
Ne 0 ""
Po -8.81 1.9
$EndPAD
$PAD
Sh "10" R 1.45 0.93 0 0 0
At SMD N 00888000
.SolderMask 0
.SolderPaste 0
Ne 0 ""
Po -8.81 3.17
$EndPAD
$PAD
Sh "11" R 1.45 0.93 0 0 0
At SMD N 00888000
.SolderMask 0
.SolderPaste 0
Ne 0 ""
Po -8.81 4.44
$EndPAD
$PAD
Sh "12" R 1.45 0.93 0 0 0
At SMD N 00888000
.SolderMask 0
.SolderPaste 0
Ne 0 ""
Po -8.81 5.71
$EndPAD
$PAD
Sh "13" R 1.45 0.93 0 0 0
At SMD N 00888000
.SolderMask 0
.SolderPaste 0
Ne 0 ""
Po -8.81 6.98
$EndPAD
$PAD
Sh "14" R 1.45 0.93 0 0 0
At SMD N 00888000
.SolderMask 0
.SolderPaste 0
Ne 0 ""
Po -8.81 8.25
$EndPAD
$PAD
Sh "15" R 1.45 0.93 0 0 0
At SMD N 00888000
.SolderMask 0
.SolderPaste 0
Ne 0 ""
Po -8.81 9.52
$EndPAD
$PAD
Sh "16" R 1.45 0.93 0 0 0
At SMD N 00888000
.SolderMask 0
.SolderPaste 0
Ne 0 ""
Po -8.81 10.79
$EndPAD
$PAD
Sh "17" R 1.45 0.93 0 0 0
At SMD N 00888000
.SolderMask 0
.SolderPaste 0
Ne 0 ""
Po -8.81 12.06
$EndPAD
$PAD
Sh "18" R 1.45 0.93 0 0 0
At SMD N 00888000
.SolderMask 0
.SolderPaste 0
Ne 0 ""
Po -8.81 13.33
$EndPAD
$PAD
Sh "19" R 1.45 0.93 0 0 0
At SMD N 00888000
.SolderMask 0
.SolderPaste 0
Ne 0 ""
Po -8.81 14.6
$EndPAD
$PAD
Sh "20" R 1.45 0.93 0 0 1800
At SMD N 00888000
.SolderMask 0
.SolderPaste 0
Ne 0 ""
Po 8.81 14.6
$EndPAD
$PAD
Sh "21" R 1.45 0.93 0 0 1800
At SMD N 00888000
.SolderMask 0
.SolderPaste 0
Ne 0 ""
Po 8.81 13.33
$EndPAD
$PAD
Sh "22" R 1.45 0.93 0 0 1800
At SMD N 00888000
.SolderMask 0
.SolderPaste 0
Ne 0 ""
Po 8.81 12.06
$EndPAD
$PAD
Sh "23" R 1.45 0.93 0 0 1800
At SMD N 00888000
.SolderMask 0
.SolderPaste 0
Ne 0 ""
Po 8.81 10.79
$EndPAD
$PAD
Sh "24" R 1.45 0.93 0 0 1800
At SMD N 00888000
.SolderMask 0
.SolderPaste 0
Ne 0 ""
Po 8.81 9.52
$EndPAD
$PAD
Sh "25" R 1.45 0.93 0 0 1800
At SMD N 00888000
.SolderMask 0
.SolderPaste 0
Ne 0 ""
Po 8.81 8.25
$EndPAD
$PAD
Sh "26" R 1.45 0.93 0 0 1800
At SMD N 00888000
.SolderMask 0
.SolderPaste 0
Ne 0 ""
Po 8.81 6.98
$EndPAD
$PAD
Sh "27" R 1.45 0.93 0 0 1800
At SMD N 00888000
.SolderMask 0
.SolderPaste 0
Ne 0 ""
Po 8.81 5.71
$EndPAD
$PAD
Sh "28" R 1.45 0.93 0 0 1800
At SMD N 00888000
.SolderMask 0
.SolderPaste 0
Ne 0 ""
Po 8.81 4.44
$EndPAD
$PAD
Sh "29" R 1.45 0.93 0 0 1800
At SMD N 00888000
.SolderMask 0
.SolderPaste 0
Ne 0 ""
Po 8.81 3.17
$EndPAD
$PAD
Sh "30" R 1.45 0.93 0 0 1800
At SMD N 00888000
.SolderMask 0
.SolderPaste 0
Ne 0 ""
Po 8.81 1.9
$EndPAD
$PAD
Sh "31" R 1.45 0.93 0 0 1800
At SMD N 00888000
.SolderMask 0
.SolderPaste 0
Ne 0 ""
Po 8.81 0.63
$EndPAD
$PAD
Sh "32" R 1.45 0.93 0 0 1800
At SMD N 00888000
.SolderMask 0
.SolderPaste 0
Ne 0 ""
Po 8.81 -0.64
$EndPAD
$PAD
Sh "33" R 1.45 0.93 0 0 1800
At SMD N 00888000
.SolderMask 0
.SolderPaste 0
Ne 0 ""
Po 8.81 -1.91
$EndPAD
$PAD
Sh "34" R 1.45 0.93 0 0 1800
At SMD N 00888000
.SolderMask 0
.SolderPaste 0
Ne 0 ""
Po 8.81 -3.18
$EndPAD
$PAD
Sh "35" R 1.45 0.93 0 0 1800
At SMD N 00888000
.SolderMask 0
.SolderPaste 0
Ne 0 ""
Po 8.81 -4.45
$EndPAD
$PAD
Sh "36" R 1.45 0.93 0 0 1800
At SMD N 00888000
.SolderMask 0
.SolderPaste 0
Ne 0 ""
Po 8.81 -5.72
$EndPAD
$PAD
Sh "37" R 1.45 0.93 0 0 1800
At SMD N 00888000
.SolderMask 0
.SolderPaste 0
Ne 0 ""
Po 8.81 -6.99
$EndPAD
$PAD
Sh "38" R 1.45 0.93 0 0 1800
At SMD N 00888000
.SolderMask 0
.SolderPaste 0
Ne 0 ""
Po 8.81 -8.26
$EndPAD
$PAD
Sh "39" R 4 4 0 0 0
At SMD N 00888000
.SolderMask 0
Ne 0 ""
Po -1.38 -0.47
$EndPAD
$EndMODULE XCVR_ESP32-WROVER-I
