EESchema Schematic File Version 2
LIBS:power
LIBS:device
LIBS:switches
LIBS:relays
LIBS:motors
LIBS:transistors
LIBS:conn
LIBS:linear
LIBS:regul
LIBS:74xx
LIBS:cmos4000
LIBS:adc-dac
LIBS:memory
LIBS:xilinx
LIBS:microcontrollers
LIBS:dsp
LIBS:microchip
LIBS:analog_switches
LIBS:motorola
LIBS:texas
LIBS:intel
LIBS:audio
LIBS:interface
LIBS:digital-audio
LIBS:philips
LIBS:display
LIBS:cypress
LIBS:siliconi
LIBS:opto
LIBS:atmel
LIBS:contrib
LIBS:valves
LIBS:gprsquectel
LIBS:esda6v8v6
LIBS:M95-cache
EELAYER 25 0
EELAYER END
$Descr A4 11693 8268
encoding utf-8
Sheet 1 1
Title "M95_Module"
Date "2018-06-27"
Rev "v2.0"
Comp "Soil Agritech Pvt. Ltd."
Comment1 "Prepared by Raman "
Comment2 ""
Comment3 ""
Comment4 ""
$EndDescr
$Comp
L Conn_01x10_Female J1
U 1 1 5B28AC9F
P 1250 3600
F 0 "J1" H 1250 4100 50  0000 C CNN
F 1 "Conn_01x10_Female" H 1450 2950 50  0000 R CNN
F 2 "Pin_Headers:Pin_Header_Straight_1x10_Pitch2.54mm" H 1250 3600 50  0001 C CNN
F 3 "" H 1250 3600 50  0001 C CNN
	1    1250 3600
	-1   0    0    -1  
$EndComp
$Comp
L CP C1
U 1 1 5B28C2B3
P 3550 3050
F 0 "C1" H 3575 3150 50  0000 L CNN
F 1 "100uf" H 3450 2950 50  0000 L CNN
F 2 "Capacitors_THT:CP_Radial_D5.0mm_P2.50mm" H 3588 2900 50  0001 C CNN
F 3 "" H 3550 3050 50  0001 C CNN
	1    3550 3050
	1    0    0    -1  
$EndComp
$Comp
L C C2
U 1 1 5B28C377
P 3750 3050
F 0 "C2" H 3775 3150 50  0000 L CNN
F 1 "100nf" H 3700 2950 50  0000 L CNN
F 2 "Capacitors_THT:CP_Radial_D5.0mm_P2.50mm" H 3788 2900 50  0001 C CNN
F 3 "" H 3750 3050 50  0001 C CNN
	1    3750 3050
	1    0    0    -1  
$EndComp
$Comp
L C C4
U 1 1 5B28C43F
P 4150 3050
F 0 "C4" H 4175 3150 50  0000 L CNN
F 1 "33pf" H 4150 2950 50  0000 L CNN
F 2 "Capacitors_THT:CP_Radial_D5.0mm_P2.50mm" H 4188 2900 50  0001 C CNN
F 3 "" H 4150 3050 50  0001 C CNN
	1    4150 3050
	1    0    0    -1  
$EndComp
$Comp
L R R6
U 1 1 5B28DC0F
P 4650 4000
F 0 "R6" V 4730 4000 50  0000 C CNN
F 1 "5.6k" V 4650 4000 50  0000 C CNN
F 2 "Resistors_THT:R_Axial_DIN0207_L6.3mm_D2.5mm_P7.62mm_Horizontal" V 4580 4000 50  0001 C CNN
F 3 "" H 4650 4000 50  0001 C CNN
	1    4650 4000
	1    0    0    -1  
$EndComp
$Comp
L R R2
U 1 1 5B28DCC4
P 4200 3650
F 0 "R2" V 4200 3700 50  0000 C CNN
F 1 "1k" V 4200 3600 50  0000 C CNN
F 2 "Resistors_THT:R_Axial_DIN0207_L6.3mm_D2.5mm_P7.62mm_Horizontal" V 4130 3650 50  0001 C CNN
F 3 "" H 4200 3650 50  0001 C CNN
	1    4200 3650
	0    1    1    0   
$EndComp
$Comp
L Q_NPN_BCE Q1
U 1 1 5B292DBF
P 4850 4650
F 0 "Q1" H 4800 4900 50  0000 L CNN
F 1 "Q_NPN_BCE" H 4500 4800 50  0000 L CNN
F 2 "Transistors_OldSowjetAera:OldSowjetaera_Transistor_Type-II_BigPads" H 5050 4750 50  0001 C CNN
F 3 "" H 4850 4650 50  0001 C CNN
	1    4850 4650
	1    0    0    -1  
$EndComp
$Comp
L R R7
U 1 1 5B292F14
P 4300 4650
F 0 "R7" V 4380 4650 50  0000 C CNN
F 1 "4.7k" V 4300 4650 50  0000 C CNN
F 2 "Resistors_THT:R_Axial_DIN0207_L6.3mm_D2.5mm_P7.62mm_Horizontal" V 4230 4650 50  0001 C CNN
F 3 "" H 4300 4650 50  0001 C CNN
	1    4300 4650
	0    1    1    0   
$EndComp
$Comp
L R R8
U 1 1 5B292F7E
P 4650 4850
F 0 "R8" V 4730 4850 50  0000 C CNN
F 1 "47k" V 4650 4850 50  0000 C CNN
F 2 "Resistors_THT:R_Axial_DIN0207_L6.3mm_D2.5mm_P7.62mm_Horizontal" V 4580 4850 50  0001 C CNN
F 3 "" H 4650 4850 50  0001 C CNN
	1    4650 4850
	1    0    0    -1  
$EndComp
$Comp
L GND #PWR01
U 1 1 5B2962BD
P 4950 5150
F 0 "#PWR01" H 4950 4900 50  0001 C CNN
F 1 "GND" H 4950 5000 50  0000 C CNN
F 2 "" H 4950 5150 50  0001 C CNN
F 3 "" H 4950 5150 50  0001 C CNN
	1    4950 5150
	1    0    0    -1  
$EndComp
$Comp
L Conn_02x03_Top_Bottom J2
U 1 1 5B2A4E70
P 4100 7150
F 0 "J2" H 4150 7350 50  0000 C CNN
F 1 "Conn_02x03_Top_Bottom" H 4150 6950 50  0000 C CNN
F 2 "library:sim12" H 4100 7150 50  0001 C CNN
F 3 "" H 4100 7150 50  0001 C CNN
	1    4100 7150
	-1   0    0    -1  
$EndComp
$Comp
L C C5
U 1 1 5B2A5ECC
P 7400 2700
F 0 "C5" H 7300 2600 50  0000 L CNN
F 1 "33pf" H 7200 2800 50  0000 L CNN
F 2 "Capacitors_THT:CP_Radial_D5.0mm_P2.50mm" H 7438 2550 50  0001 C CNN
F 3 "" H 7400 2700 50  0001 C CNN
	1    7400 2700
	1    0    0    -1  
$EndComp
$Comp
L R R10
U 1 1 5B2A625A
P 6900 2950
F 0 "R10" V 6900 3000 50  0000 C CNN
F 1 "22" V 6900 2900 50  0000 C CNN
F 2 "Resistors_THT:R_Axial_DIN0207_L6.3mm_D2.5mm_P7.62mm_Horizontal" V 6830 2950 50  0001 C CNN
F 3 "" H 6900 2950 50  0001 C CNN
	1    6900 2950
	0    1    1    0   
$EndComp
$Comp
L R R9
U 1 1 5B2A62CB
P 6900 3050
F 0 "R9" V 6900 3100 50  0000 C CNN
F 1 "22" V 6900 3000 50  0000 C CNN
F 2 "Resistors_THT:R_Axial_DIN0207_L6.3mm_D2.5mm_P7.62mm_Horizontal" V 6830 3050 50  0001 C CNN
F 3 "" H 6900 3050 50  0001 C CNN
	1    6900 3050
	0    1    1    0   
$EndComp
$Comp
L C C9
U 1 1 5B2A643D
P 7400 3550
F 0 "C9" H 7425 3650 50  0000 L CNN
F 1 "100nf" H 7425 3450 50  0000 L CNN
F 2 "Capacitors_THT:CP_Radial_D5.0mm_P2.50mm" H 7438 3400 50  0001 C CNN
F 3 "" H 7400 3550 50  0001 C CNN
	1    7400 3550
	1    0    0    -1  
$EndComp
Text GLabel 1450 3200 2    60   Input ~ 0
NET
Text GLabel 1450 3300 2    60   Input ~ 0
VBAT
Text GLabel 1450 3500 2    60   Input ~ 0
ANT
Text GLabel 1450 3600 2    60   Input ~ 0
RX
Text GLabel 1450 3700 2    60   Input ~ 0
TX
Text GLabel 1450 3800 2    60   Input ~ 0
STAT
Text GLabel 1450 3900 2    60   Input ~ 0
RI
Text GLabel 1450 4000 2    60   Input ~ 0
DTR
Text GLabel 1450 4100 2    60   Input ~ 0
PWRKEY
Text GLabel 5000 2950 0    60   Input ~ 0
NET
Text GLabel 3350 2850 0    60   Input ~ 0
VBAT
Text GLabel 5000 3250 0    60   Input ~ 0
ANT
$Comp
L C C3
U 1 1 5B28C40E
P 3950 3050
F 0 "C3" H 3975 3150 50  0000 L CNN
F 1 "10pf" H 3950 2950 50  0000 L CNN
F 2 "Capacitors_THT:CP_Radial_D5.0mm_P2.50mm" H 3988 2900 50  0001 C CNN
F 3 "" H 3950 3050 50  0001 C CNN
	1    3950 3050
	1    0    0    -1  
$EndComp
$Comp
L GND #PWR02
U 1 1 5B2A6483
P 4600 3200
F 0 "#PWR02" H 4600 2950 50  0001 C CNN
F 1 "GND" H 4450 3150 50  0000 C CNN
F 2 "" H 4600 3200 50  0001 C CNN
F 3 "" H 4600 3200 50  0001 C CNN
	1    4600 3200
	1    0    0    -1  
$EndComp
$Comp
L GND #PWR03
U 1 1 5B2A6615
P 1900 3500
F 0 "#PWR03" H 1900 3250 50  0001 C CNN
F 1 "GND" H 1900 3350 50  0000 C CNN
F 2 "" H 1900 3500 50  0001 C CNN
F 3 "" H 1900 3500 50  0001 C CNN
	1    1900 3500
	1    0    0    -1  
$EndComp
$Comp
L GND #PWR04
U 1 1 5B2A68F8
P 3300 3250
F 0 "#PWR04" H 3300 3000 50  0001 C CNN
F 1 "GND" H 3300 3100 50  0000 C CNN
F 2 "" H 3300 3250 50  0001 C CNN
F 3 "" H 3300 3250 50  0001 C CNN
	1    3300 3250
	1    0    0    -1  
$EndComp
$Comp
L R R1
U 1 1 5B2A6F8F
P 4200 3350
F 0 "R1" V 4200 3400 50  0000 C CNN
F 1 "1k" V 4200 3300 50  0000 C CNN
F 2 "Resistors_THT:R_Axial_DIN0207_L6.3mm_D2.5mm_P7.62mm_Horizontal" V 4130 3350 50  0001 C CNN
F 3 "" H 4200 3350 50  0001 C CNN
	1    4200 3350
	0    1    1    0   
$EndComp
Text GLabel 3950 3350 0    60   Input ~ 0
RX
$Comp
L R R3
U 1 1 5B2A759A
P 4200 3450
F 0 "R3" V 4200 3500 50  0000 C CNN
F 1 "1k" V 4200 3400 50  0000 C CNN
F 2 "Resistors_THT:R_Axial_DIN0207_L6.3mm_D2.5mm_P7.62mm_Horizontal" V 4130 3450 50  0001 C CNN
F 3 "" H 4200 3450 50  0001 C CNN
	1    4200 3450
	0    1    1    0   
$EndComp
Text GLabel 3950 3450 0    60   Input ~ 0
TX
Text GLabel 5000 3550 0    60   Input ~ 0
STAT
Text GLabel 3950 3650 0    60   Input ~ 0
RI
Text GLabel 3950 3750 0    60   Input ~ 0
DTR
$Comp
L R R4
U 1 1 5B2A7F22
P 4200 3750
F 0 "R4" V 4200 3800 50  0000 C CNN
F 1 "1k" V 4200 3700 50  0000 C CNN
F 2 "Resistors_THT:R_Axial_DIN0207_L6.3mm_D2.5mm_P7.62mm_Horizontal" V 4130 3750 50  0001 C CNN
F 3 "" H 4200 3750 50  0001 C CNN
	1    4200 3750
	0    1    1    0   
$EndComp
Text GLabel 4050 4650 0    60   Input ~ 0
PWRKEY
$Comp
L R R5
U 1 1 5B2A56C2
P 4450 4000
F 0 "R5" V 4530 4000 50  0000 C CNN
F 1 "5.6k" V 4450 4000 50  0000 C CNN
F 2 "Resistors_THT:R_Axial_DIN0207_L6.3mm_D2.5mm_P7.62mm_Horizontal" V 4380 4000 50  0001 C CNN
F 3 "" H 4450 4000 50  0001 C CNN
	1    4450 4000
	1    0    0    -1  
$EndComp
$Comp
L GND #PWR05
U 1 1 5B2A58F2
P 4550 4250
F 0 "#PWR05" H 4550 4000 50  0001 C CNN
F 1 "GND" H 4550 4100 50  0000 C CNN
F 2 "" H 4550 4250 50  0001 C CNN
F 3 "" H 4550 4250 50  0001 C CNN
	1    4550 4250
	1    0    0    -1  
$EndComp
Text GLabel 4300 7050 2    60   Input ~ 0
SIM_VDD
Text GLabel 4300 7150 2    60   Input ~ 0
SIM_RST
Text GLabel 4300 7250 2    60   Input ~ 0
SIM_CLK
NoConn ~ 3800 7150
Text GLabel 3800 7250 0    60   Input ~ 0
SIM_DATA
$Comp
L GND #PWR06
U 1 1 5B2A675E
P 3450 7000
F 0 "#PWR06" H 3450 6750 50  0001 C CNN
F 1 "GND" H 3450 6850 50  0000 C CNN
F 2 "" H 3450 7000 50  0001 C CNN
F 3 "" H 3450 7000 50  0001 C CNN
	1    3450 7000
	1    0    0    -1  
$EndComp
Text GLabel 7800 3250 2    60   Input ~ 0
SIM_VDD
Text GLabel 7800 2950 2    60   Input ~ 0
SIM_RST
$Comp
L C C7
U 1 1 5B2A63E1
P 7650 2700
F 0 "C7" H 7675 2800 50  0000 L CNN
F 1 "33pf" H 7700 2600 50  0000 L CNN
F 2 "Capacitors_THT:CP_Radial_D5.0mm_P2.50mm" H 7688 2550 50  0001 C CNN
F 3 "" H 7650 2700 50  0001 C CNN
	1    7650 2700
	-1   0    0    1   
$EndComp
$Comp
L C C6
U 1 1 5B2A6388
P 7150 2700
F 0 "C6" H 7175 2800 50  0000 L CNN
F 1 "33pf" H 7175 2600 50  0000 L CNN
F 2 "Capacitors_THT:CP_Radial_D5.0mm_P2.50mm" H 7188 2550 50  0001 C CNN
F 3 "" H 7150 2700 50  0001 C CNN
	1    7150 2700
	-1   0    0    1   
$EndComp
Text GLabel 7800 3050 2    60   Input ~ 0
SIM_CLK
$Comp
L R R11
U 1 1 5B2A8D26
P 6900 3150
F 0 "R11" V 6900 3200 50  0000 C CNN
F 1 "22" V 6900 3100 50  0000 C CNN
F 2 "Resistors_THT:R_Axial_DIN0207_L6.3mm_D2.5mm_P7.62mm_Horizontal" V 6830 3150 50  0001 C CNN
F 3 "" H 6900 3150 50  0001 C CNN
	1    6900 3150
	0    1    1    0   
$EndComp
Text GLabel 7800 3150 2    60   Input ~ 0
SIM_DATA
Wire Wire Line
	4150 2850 4150 2900
Connection ~ 4150 2850
Wire Wire Line
	3950 2850 3950 2900
Connection ~ 3950 2850
Wire Wire Line
	3750 2850 3750 2900
Connection ~ 3750 2850
Wire Wire Line
	3550 2900 3550 2850
Connection ~ 3550 2850
Wire Wire Line
	4450 4650 4650 4650
Wire Wire Line
	4650 4650 4650 4700
Wire Wire Line
	4950 4850 4950 5150
Wire Wire Line
	4650 5000 4650 5050
Wire Wire Line
	4650 5050 4950 5050
Connection ~ 4950 5050
Wire Wire Line
	4950 3850 4950 4450
Wire Wire Line
	4950 3850 5000 3850
Wire Wire Line
	4350 3350 5000 3350
Wire Wire Line
	4350 3450 5000 3450
Wire Wire Line
	4600 3200 4600 3150
Wire Wire Line
	4600 3150 5000 3150
Wire Wire Line
	1450 3400 1900 3400
Wire Wire Line
	1900 3400 1900 3500
Wire Wire Line
	3300 3200 4150 3200
Connection ~ 3950 3200
Connection ~ 3750 3200
Wire Wire Line
	3300 3200 3300 3250
Connection ~ 3550 3200
Wire Wire Line
	4050 3350 3950 3350
Wire Wire Line
	5000 3050 4450 3050
Wire Wire Line
	4450 2850 4450 3050
Wire Wire Line
	3350 2850 4450 2850
Wire Wire Line
	4050 3450 3950 3450
Wire Wire Line
	4350 3650 5000 3650
Wire Wire Line
	4050 3650 3950 3650
Wire Wire Line
	4350 3750 5000 3750
Wire Wire Line
	4050 3750 3950 3750
Wire Wire Line
	4150 4650 4050 4650
Wire Wire Line
	4450 3850 4450 3350
Connection ~ 4450 3350
Wire Wire Line
	4650 3850 4650 3750
Connection ~ 4650 3750
Wire Wire Line
	4450 4150 4450 4200
Wire Wire Line
	4450 4200 4650 4200
Wire Wire Line
	4650 4200 4650 4150
Wire Wire Line
	4550 4200 4550 4250
Connection ~ 4550 4200
Wire Wire Line
	3800 7050 3800 6950
Wire Wire Line
	3800 6950 3450 6950
Wire Wire Line
	3450 6950 3450 7000
Wire Wire Line
	6650 3750 7400 3750
Wire Wire Line
	6650 3250 7800 3250
Wire Wire Line
	6750 2950 6650 2950
Wire Wire Line
	7050 2950 7800 2950
Wire Wire Line
	7150 2950 7150 2850
Connection ~ 7150 2950
Wire Wire Line
	6750 3050 6650 3050
Wire Wire Line
	7050 3050 7800 3050
Wire Wire Line
	7400 2850 7400 3050
Connection ~ 7400 3050
Wire Wire Line
	7050 3150 7800 3150
Wire Wire Line
	7650 2850 7650 3150
Connection ~ 7650 3150
Wire Wire Line
	7150 2550 7150 2450
Wire Wire Line
	7150 2450 8000 2450
Wire Wire Line
	8000 2450 8000 2550
Wire Wire Line
	7650 2550 7650 2450
Connection ~ 7650 2450
Wire Wire Line
	7400 2550 7400 2450
Connection ~ 7400 2450
$Comp
L GND #PWR07
U 1 1 5B2A91EF
P 8000 2550
F 0 "#PWR07" H 8000 2300 50  0001 C CNN
F 1 "GND" H 8000 2400 50  0000 C CNN
F 2 "" H 8000 2550 50  0001 C CNN
F 3 "" H 8000 2550 50  0001 C CNN
	1    8000 2550
	1    0    0    -1  
$EndComp
Wire Wire Line
	6750 3150 6650 3150
Wire Wire Line
	7400 3400 7400 3250
Connection ~ 7400 3250
Wire Wire Line
	7400 3700 7400 3800
Text GLabel 6650 3850 2    60   Input ~ 0
NRESET
$Comp
L gprsquectel U1
U 1 1 5B2A2F2C
P 5500 3350
F 0 "U1" H 5250 3900 60  0000 C CNN
F 1 "gprsquectel" H 6200 2700 60  0000 C CNN
F 2 "QUECTEL_M95:gprs" H 6100 3350 60  0001 C CNN
F 3 "" H 6100 3350 60  0001 C CNN
	1    5500 3350
	1    0    0    -1  
$EndComp
Text GLabel 9750 3600 0    60   Input ~ 0
NRESET
$Comp
L GND #PWR08
U 1 1 5B2ACC86
P 9250 3600
F 0 "#PWR08" H 9250 3350 50  0001 C CNN
F 1 "GND" H 9250 3450 50  0000 C CNN
F 2 "" H 9250 3600 50  0001 C CNN
F 3 "" H 9250 3600 50  0001 C CNN
	1    9250 3600
	1    0    0    -1  
$EndComp
$Comp
L PWR_FLAG #FLG09
U 1 1 5B2B53C3
P 5850 7050
F 0 "#FLG09" H 5850 7125 50  0001 C CNN
F 1 "PWR_FLAG" H 5850 7200 50  0000 C CNN
F 2 "" H 5850 7050 50  0001 C CNN
F 3 "" H 5850 7050 50  0001 C CNN
	1    5850 7050
	1    0    0    -1  
$EndComp
$Comp
L PWR_FLAG #FLG010
U 1 1 5B2B5409
P 6350 7050
F 0 "#FLG010" H 6350 7125 50  0001 C CNN
F 1 "PWR_FLAG" H 6350 7200 50  0000 C CNN
F 2 "" H 6350 7050 50  0001 C CNN
F 3 "" H 6350 7050 50  0001 C CNN
	1    6350 7050
	1    0    0    -1  
$EndComp
$Comp
L GND #PWR011
U 1 1 5B2B54E5
P 5850 7350
F 0 "#PWR011" H 5850 7100 50  0001 C CNN
F 1 "GND" H 5850 7200 50  0000 C CNN
F 2 "" H 5850 7350 50  0001 C CNN
F 3 "" H 5850 7350 50  0001 C CNN
	1    5850 7350
	1    0    0    -1  
$EndComp
Text GLabel 6350 7250 3    60   Input ~ 0
VBAT
Wire Wire Line
	6350 7250 6350 7050
Wire Wire Line
	5850 7350 5850 7050
$Comp
L GND #PWR012
U 1 1 5B2B71FE
P 7400 3800
F 0 "#PWR012" H 7400 3550 50  0001 C CNN
F 1 "GND" H 7400 3650 50  0000 C CNN
F 2 "" H 7400 3800 50  0001 C CNN
F 3 "" H 7400 3800 50  0001 C CNN
	1    7400 3800
	1    0    0    -1  
$EndComp
Connection ~ 7400 3750
Text Notes 850  7150 0    60   ~ 0
Note:\nC1 = 100uF Electrolytic Capacitor\nCheck BJT pin out before soldering
Text Notes 3600 6750 0    60   ~ 0
6 pin SIM Card Holder
Text Notes 9400 2950 0    60   ~ 0
1x2_2.54mm Pin Header
Text Notes 1050 2900 0    60   ~ 0
1x10_2.54mm Pin Header
Text Notes 5200 2450 0    60   ~ 0
Quectel M95 Pin Out_2mm
Text Notes 5750 6750 0    60   ~ 0
Power Flags
Wire Notes Line
	2850 7900 2850 450 
Wire Notes Line
	2850 450  2750 450 
Wire Notes Line
	8800 450  8850 450 
Text Notes 4300 1150 0    118  ~ 24
GSM Quectel M95 Standalone Board
Wire Notes Line
	7000 6550 500  6550
Wire Notes Line
	5250 7800 5250 6550
Wire Notes Line
	5250 6550 5200 6550
Wire Notes Line
	8800 500  8800 6550
$Comp
L Conn_01x02 J3
U 1 1 5B3390B3
P 10000 3500
F 0 "J3" H 10000 3600 50  0000 C CNN
F 1 "Conn_01x02" H 10000 3300 50  0000 C CNN
F 2 "Pin_Headers:Pin_Header_Straight_1x02_Pitch2.54mm" H 10000 3500 50  0001 C CNN
F 3 "" H 10000 3500 50  0001 C CNN
	1    10000 3500
	1    0    0    -1  
$EndComp
Wire Wire Line
	9800 3600 9750 3600
NoConn ~ 6650 3350
NoConn ~ 6650 3450
NoConn ~ 6650 3550
NoConn ~ 6650 3650
Wire Wire Line
	9250 3600 9250 3500
Wire Wire Line
	9250 3500 9800 3500
$EndSCHEMATC
