PCBNEW-LibModule-V1  
# encoding utf-8
Units mm
$INDEX
TE_1734366-3
$EndINDEX
$MODULE TE_1734366-3
Po 0 0 0 15 00000000 00000000 ~~
Li TE_1734366-3
Cd 
Sc 00000000
At STD
Op 0 0 0
.SolderMask 0
.SolderPaste 0
T0 -5.26355 -5.77487 1.0024 1.0024 0 0.05 N V 21 "TE_1734366-3"
T1 -5.00402 4.9896 1.0008 1.0008 0 0.05 N V 21 "VAL**"
DS -7.5 -3.81 -7.5 3.81 0.127 24
DS -7.5 3.81 7.5 3.81 0.127 24
DS 7.5 3.81 7.5 -3.81 0.127 24
DS 7.5 -3.81 -7.5 -3.81 0.127 24
DS -7.5018 -0.0992 -7.5018 -3.8105 0.127 21
DS -7.5018 -3.8105 7.5017 -3.8105 0.127 21
DS 7.5017 -3.8105 7.5017 -0.1872 0.127 21
DS -7.5006 2.6864 -7.5006 3.8086 0.127 21
DS -7.5006 3.8086 7.5006 3.8086 0.127 21
DS 7.5006 3.8086 7.5006 2.7855 0.127 21
DS 7.5006 2.7855 7.4999 2.7855 0.127 21
DS -7.75 -4.06 -7.75 0.66 0.05 26
DS -7.75 0.66 -8 0.66 0.05 26
DS -8 0.66 -8 2.16 0.05 26
DS -8 2.16 -7.75 2.16 0.05 26
DS -7.75 2.16 -7.75 4.06 0.05 26
DS -7.75 4.06 7.75 4.06 0.05 26
DS 7.75 4.06 7.75 2.16 0.05 26
DS 7.75 2.16 8 2.16 0.05 26
DS 8 2.16 8 0.66 0.05 26
DS 8 0.66 7.75 0.66 0.05 26
DS 7.75 0.66 7.75 -4.06 0.05 26
DS 7.75 -4.06 -7.75 -4.06 0.05 26
DC -3.683 -4.572 -3.583 -4.572 0.2 21
$PAD
Sh "1" R 1.428 1.428 0 0 0
Dr 0.92 0 0
At STD N 00C0FFFF
.SolderMask 0
Ne 0 ""
Po -3.5 -1.3
$EndPAD
$PAD
Sh "2" C 1.428 1.428 0 0 0
Dr 0.92 0 0
At STD N 00C0FFFF
.SolderMask 0
Ne 0 ""
Po -1 -1.3
$EndPAD
$PAD
Sh "3" C 1.428 1.428 0 0 0
Dr 0.92 0 0
At STD N 00C0FFFF
.SolderMask 0
Ne 0 ""
Po 1 -1.3
$EndPAD
$PAD
Sh "4" C 1.428 1.428 0 0 0
Dr 0.92 0 0
At STD N 00C0FFFF
.SolderMask 0
Ne 0 ""
Po 3.5 -1.3
$EndPAD
$PAD
Sh "Hole" C 2.3 2.3 0 0 0
Dr 2.3 0 0
At HOLE N 0
Po -6.57 1.41
$EndPAD
$PAD
Sh "Hole" C 2.3 2.3 0 0 0
Dr 2.3 0 0
At HOLE N 0
Po 6.57 1.41
$EndPAD
$EndMODULE TE_1734366-3
