PCBNEW-LibModule-V1  
# encoding utf-8
Units mm
$INDEX
INDC2520X18N
$EndINDEX
$MODULE INDC2520X18N
Po 0 0 0 15 00000000 00000000 ~~
Li INDC2520X18N
Cd 
Sc 00000000
At SMD
Op 0 0 0
.SolderMask 0
.SolderPaste 0
T0 -0.432518 -2.67142 1.64272 1.64272 0 0.05 N V 21 "INDC2520X18N"
T1 -0.382843 2.62883 1.64792 1.64792 0 0.05 N V 21 "VAL**"
DS -0.8382 1.0922 -0.8382 -1.0922 0.1524 24
DS -0.8382 -1.0922 -1.3462 -1.0922 0.1524 24
DS -1.3462 1.0922 -0.8382 1.0922 0.1524 24
DS 0.8382 -1.0922 0.8382 1.0922 0.1524 24
DS 0.8382 1.0922 1.3462 1.0922 0.1524 24
DS 1.3462 -1.0922 0.8382 -1.0922 0.1524 24
DS -0.8382 1.0922 0.8382 1.0922 0.1524 24
DS 1.3462 1.0922 1.3462 -1.0922 0.1524 24
DS 0.8382 -1.0922 -0.8382 -1.0922 0.1524 24
DS -1.3462 -1.0922 -1.3462 1.0922 0.1524 24
$PAD
Sh "1" R 0.8636 2.2098 0 0 0
At SMD N 00888000
.SolderMask 0
.SolderPaste 0
Ne 0 ""
Po -1.27 0
$EndPAD
$PAD
Sh "2" R 0.8636 2.2098 0 0 0
At SMD N 00888000
.SolderMask 0
.SolderPaste 0
Ne 0 ""
Po 1.27 0
$EndPAD
$EndMODULE INDC2520X18N
