PCBNEW-LibModule-V1  
# encoding utf-8
Units mm
$INDEX
1008
$EndINDEX
$MODULE 1008
Po 0 0 0 15 00000000 00000000 ~~
Li 1008
Cd SMD Multilayer
Sc 00000000
At SMD
Op 0 0 0
.SolderMask 0
.SolderPaste 0
T0 11977.9 52471.5 22182.1 22182.1 0 0.05 N V 21 "1008"
T1 29598.4 -53788.3 25194.7 25194.7 0 0.05 N V 21 "VAL**"
DS -1.25 1 -1.25 -1 0.127 24
DS 1.25 1 1.25 -1 0.127 24
DS -1.25 -1 1.25 -1 0.127 21
DS -1.25 1 1.25 1 0.127 21
$PAD
Sh "1" R 1.25 1.5 0 0 0
At SMD N 00888000
.SolderMask 0
.SolderPaste 0
Ne 0 ""
Po -1.375 0
$EndPAD
$PAD
Sh "2" R 1.25 1.5 0 0 0
At SMD N 00888000
.SolderMask 0
.SolderPaste 0
Ne 0 ""
Po 1.375 0
$EndPAD
$EndMODULE 1008
