(export (version D)
  (design
    (source "/mnt/Upanishad/SOiL/SOIL-Automated-Smart-Irrigation-System/PCB Design/sim pcb (copy)/sim.sch")
    (date "Thu 21 Jun 2018 16:57:27 IST")
    (tool "Eeschema 4.0.7-e2-6376~58~ubuntu16.04.1")
    (sheet (number 1) (name /) (tstamps /)
      (title_block
        (title M95_Module)
        (company "Soil Agritech Pvt. Ltd.")
        (rev v1.0)
        (date 2018-06-20)
        (source sim.sch)
        (comment (number 1) (value "Prepared by Raman "))
        (comment (number 2) (value ""))
        (comment (number 3) (value ""))
        (comment (number 4) (value "")))))
  (components
    (comp (ref J1)
      (value Conn_01x10_Female)
      (footprint Socket_Strips:Socket_Strip_Straight_1x10_Pitch2.54mm)
      (libsource (lib conn) (part Conn_01x10_Female))
      (sheetpath (names /) (tstamps /))
      (tstamp 5B28AC9F))
    (comp (ref J5)
      (value Conn_01x10_Female)
      (footprint Socket_Strips:Socket_Strip_Straight_1x10_Pitch2.54mm)
      (libsource (lib conn) (part Conn_01x10_Female))
      (sheetpath (names /) (tstamps /))
      (tstamp 5B28B579))
    (comp (ref C1)
      (value 100uf)
      (footprint Capacitors_THT:CP_Radial_D5.0mm_P2.50mm)
      (libsource (lib device) (part CP))
      (sheetpath (names /) (tstamps /))
      (tstamp 5B28C2B3))
    (comp (ref C2)
      (value 100nf)
      (footprint Capacitors_THT:CP_Radial_D5.0mm_P2.50mm)
      (libsource (lib device) (part C))
      (sheetpath (names /) (tstamps /))
      (tstamp 5B28C377))
    (comp (ref C4)
      (value 33pf)
      (footprint Capacitors_THT:CP_Radial_D5.0mm_P2.50mm)
      (libsource (lib device) (part C))
      (sheetpath (names /) (tstamps /))
      (tstamp 5B28C43F))
    (comp (ref R6)
      (value 5.6k)
      (footprint Resistors_THT:R_Axial_DIN0207_L6.3mm_D2.5mm_P7.62mm_Horizontal)
      (libsource (lib device) (part R))
      (sheetpath (names /) (tstamps /))
      (tstamp 5B28DC0F))
    (comp (ref R2)
      (value 1k)
      (footprint Resistors_THT:R_Axial_DIN0207_L6.3mm_D2.5mm_P7.62mm_Horizontal)
      (libsource (lib device) (part R))
      (sheetpath (names /) (tstamps /))
      (tstamp 5B28DCC4))
    (comp (ref Q1)
      (value Q_NPN_BCE)
      (footprint Transistors_OldSowjetAera:OldSowjetaera_Transistor_Type-II_BigPads)
      (libsource (lib device) (part Q_NPN_BCE))
      (sheetpath (names /) (tstamps /))
      (tstamp 5B292DBF))
    (comp (ref R7)
      (value 4.7k)
      (footprint Resistors_THT:R_Axial_DIN0207_L6.3mm_D2.5mm_P7.62mm_Horizontal)
      (libsource (lib device) (part R))
      (sheetpath (names /) (tstamps /))
      (tstamp 5B292F14))
    (comp (ref R8)
      (value 47k)
      (footprint Resistors_THT:R_Axial_DIN0207_L6.3mm_D2.5mm_P7.62mm_Horizontal)
      (libsource (lib device) (part R))
      (sheetpath (names /) (tstamps /))
      (tstamp 5B292F7E))
    (comp (ref J2)
      (value Conn_02x03_Top_Bottom)
      (footprint library:sim12)
      (libsource (lib conn) (part Conn_02x03_Top_Bottom))
      (sheetpath (names /) (tstamps /))
      (tstamp 5B2A4E70))
    (comp (ref C5)
      (value 33pf)
      (footprint Capacitors_THT:CP_Radial_D5.0mm_P2.50mm)
      (libsource (lib device) (part C))
      (sheetpath (names /) (tstamps /))
      (tstamp 5B2A5ECC))
    (comp (ref R10)
      (value 22)
      (footprint Resistors_THT:R_Axial_DIN0207_L6.3mm_D2.5mm_P7.62mm_Horizontal)
      (libsource (lib device) (part R))
      (sheetpath (names /) (tstamps /))
      (tstamp 5B2A625A))
    (comp (ref R9)
      (value 22)
      (footprint Resistors_THT:R_Axial_DIN0207_L6.3mm_D2.5mm_P7.62mm_Horizontal)
      (libsource (lib device) (part R))
      (sheetpath (names /) (tstamps /))
      (tstamp 5B2A62CB))
    (comp (ref C9)
      (value 100nf)
      (footprint Capacitors_THT:CP_Radial_D5.0mm_P2.50mm)
      (libsource (lib device) (part C))
      (sheetpath (names /) (tstamps /))
      (tstamp 5B2A643D))
    (comp (ref C3)
      (value 10pf)
      (footprint Capacitors_THT:CP_Radial_D5.0mm_P2.50mm)
      (libsource (lib device) (part C))
      (sheetpath (names /) (tstamps /))
      (tstamp 5B28C40E))
    (comp (ref R1)
      (value 1k)
      (footprint Resistors_THT:R_Axial_DIN0207_L6.3mm_D2.5mm_P7.62mm_Horizontal)
      (libsource (lib device) (part R))
      (sheetpath (names /) (tstamps /))
      (tstamp 5B2A6F8F))
    (comp (ref R3)
      (value 1k)
      (footprint Resistors_THT:R_Axial_DIN0207_L6.3mm_D2.5mm_P7.62mm_Horizontal)
      (libsource (lib device) (part R))
      (sheetpath (names /) (tstamps /))
      (tstamp 5B2A759A))
    (comp (ref R4)
      (value 1k)
      (footprint Resistors_THT:R_Axial_DIN0207_L6.3mm_D2.5mm_P7.62mm_Horizontal)
      (libsource (lib device) (part R))
      (sheetpath (names /) (tstamps /))
      (tstamp 5B2A7F22))
    (comp (ref R5)
      (value 5.6k)
      (footprint Resistors_THT:R_Axial_DIN0207_L6.3mm_D2.5mm_P7.62mm_Horizontal)
      (libsource (lib device) (part R))
      (sheetpath (names /) (tstamps /))
      (tstamp 5B2A56C2))
    (comp (ref C7)
      (value 33pf)
      (footprint Capacitors_THT:CP_Radial_D5.0mm_P2.50mm)
      (libsource (lib device) (part C))
      (sheetpath (names /) (tstamps /))
      (tstamp 5B2A63E1))
    (comp (ref C6)
      (value 33pf)
      (footprint Capacitors_THT:CP_Radial_D5.0mm_P2.50mm)
      (libsource (lib device) (part C))
      (sheetpath (names /) (tstamps /))
      (tstamp 5B2A6388))
    (comp (ref R11)
      (value 22)
      (footprint Resistors_THT:R_Axial_DIN0207_L6.3mm_D2.5mm_P7.62mm_Horizontal)
      (libsource (lib device) (part R))
      (sheetpath (names /) (tstamps /))
      (tstamp 5B2A8D26))
    (comp (ref U1)
      (value gprsquectel)
      (footprint QUECTEL_M95:gprs)
      (libsource (lib gprsquectel) (part gprsquectel))
      (sheetpath (names /) (tstamps /))
      (tstamp 5B2A2F2C)))
  (libparts
    (libpart (lib device) (part C)
      (description "Unpolarized capacitor")
      (footprints
        (fp C_*))
      (fields
        (field (name Reference) C)
        (field (name Value) C))
      (pins
        (pin (num 1) (name ~) (type passive))
        (pin (num 2) (name ~) (type passive))))
    (libpart (lib device) (part CP)
      (description "Polarised capacitor")
      (footprints
        (fp CP_*))
      (fields
        (field (name Reference) C)
        (field (name Value) CP))
      (pins
        (pin (num 1) (name ~) (type passive))
        (pin (num 2) (name ~) (type passive))))
    (libpart (lib conn) (part Conn_01x10_Female)
      (description "Generic connector, single row, 01x10")
      (docs ~)
      (footprints
        (fp Connector*:*_??x*mm*)
        (fp Connector*:*1x??x*mm*)
        (fp Socket?Strip?Straight?1X*)
        (fp Socket?Strip?Angled?1X*))
      (fields
        (field (name Reference) J)
        (field (name Value) Conn_01x10_Female))
      (pins
        (pin (num 1) (name Pin_1) (type passive))
        (pin (num 2) (name Pin_2) (type passive))
        (pin (num 3) (name Pin_3) (type passive))
        (pin (num 4) (name Pin_4) (type passive))
        (pin (num 5) (name Pin_5) (type passive))
        (pin (num 6) (name Pin_6) (type passive))
        (pin (num 7) (name Pin_7) (type passive))
        (pin (num 8) (name Pin_8) (type passive))
        (pin (num 9) (name Pin_9) (type passive))
        (pin (num 10) (name Pin_10) (type passive))))
    (libpart (lib conn) (part Conn_02x03_Top_Bottom)
      (description "Generic connector, double row, 02x03, top/bottom pin numbering scheme (row 1: 1...pins_per_row, row2: pins_per_row+1 ... num_pins)")
      (docs ~)
      (footprints
        (fp Connector*:*2x??x*mm*)
        (fp Connector*:*2x???Pitch*))
      (fields
        (field (name Reference) J)
        (field (name Value) Conn_02x03_Top_Bottom))
      (pins
        (pin (num 1) (name Pin_1) (type passive))
        (pin (num 2) (name Pin_2) (type passive))
        (pin (num 3) (name Pin_3) (type passive))
        (pin (num 4) (name Pin_4) (type passive))
        (pin (num 5) (name Pin_5) (type passive))
        (pin (num 6) (name Pin_6) (type passive))))
    (libpart (lib device) (part Q_NPN_BCE)
      (description "Transistor NPN (general)")
      (fields
        (field (name Reference) Q)
        (field (name Value) Q_NPN_BCE))
      (pins
        (pin (num 1) (name B) (type input))
        (pin (num 2) (name C) (type passive))
        (pin (num 3) (name E) (type passive))))
    (libpart (lib device) (part R)
      (description Resistor)
      (footprints
        (fp R_*)
        (fp R_*))
      (fields
        (field (name Reference) R)
        (field (name Value) R))
      (pins
        (pin (num 1) (name ~) (type passive))
        (pin (num 2) (name ~) (type passive))))
    (libpart (lib gprsquectel) (part gprsquectel)
      (fields
        (field (name Reference) U)
        (field (name Value) gprsquectel))
      (pins
        (pin (num 1) (name NET) (type input))
        (pin (num 2) (name VBAT) (type input))
        (pin (num 3) (name GND) (type input))
        (pin (num 4) (name ANT) (type input))
        (pin (num 5) (name RX) (type input))
        (pin (num 6) (name TX) (type input))
        (pin (num 7) (name STAT) (type input))
        (pin (num 8) (name RI) (type input))
        (pin (num 9) (name DTR) (type input))
        (pin (num 10) (name PWRKY) (type input))
        (pin (num 11) (name NRESET) (type input))
        (pin (num 12) (name GND) (type input))
        (pin (num 13) (name MLK_P) (type input))
        (pin (num 14) (name MLK_N) (type input))
        (pin (num 15) (name SPK_P) (type input))
        (pin (num 16) (name SPK_N) (type input))
        (pin (num 17) (name SIM_VDD) (type input))
        (pin (num 18) (name SIM_DATA) (type input))
        (pin (num 19) (name SIM_CLK) (type input))
        (pin (num 20) (name SIM_RST) (type input)))))
  (libraries
    (library (logical device)
      (uri /usr/share/kicad/library/device.lib))
    (library (logical conn)
      (uri /usr/share/kicad/library/conn.lib))
    (library (logical gprsquectel)
      (uri "/mnt/Upanishad/SOiL/SOIL-Automated-Smart-Irrigation-System/PCB Design/sim pcb (copy)/gprsquectel.lib")))
  (nets
    (net (code 1) (name "Net-(R1-Pad1)")
      (node (ref R1) (pin 1))
      (node (ref U1) (pin 5))
      (node (ref R5) (pin 1)))
    (net (code 2) (name "Net-(R4-Pad1)")
      (node (ref R6) (pin 1))
      (node (ref U1) (pin 9))
      (node (ref R4) (pin 1)))
    (net (code 3) (name "Net-(R10-Pad2)")
      (node (ref R10) (pin 2))
      (node (ref U1) (pin 20)))
    (net (code 4) (name "Net-(R9-Pad2)")
      (node (ref R9) (pin 2))
      (node (ref U1) (pin 19)))
    (net (code 5) (name "Net-(Q1-Pad1)")
      (node (ref Q1) (pin 1))
      (node (ref R7) (pin 1))
      (node (ref R8) (pin 1)))
    (net (code 6) (name "Net-(Q1-Pad2)")
      (node (ref U1) (pin 10))
      (node (ref Q1) (pin 2)))
    (net (code 7) (name "Net-(R3-Pad1)")
      (node (ref R3) (pin 1))
      (node (ref U1) (pin 6)))
    (net (code 8) (name "Net-(R2-Pad1)")
      (node (ref U1) (pin 8))
      (node (ref R2) (pin 1)))
    (net (code 9) (name "Net-(R11-Pad2)")
      (node (ref R11) (pin 2))
      (node (ref U1) (pin 18)))
    (net (code 10) (name GND)
      (node (ref C4) (pin 2))
      (node (ref C1) (pin 2))
      (node (ref J5) (pin 9))
      (node (ref R6) (pin 2))
      (node (ref R5) (pin 2))
      (node (ref J1) (pin 3))
      (node (ref C9) (pin 2))
      (node (ref C2) (pin 2))
      (node (ref C7) (pin 2))
      (node (ref C5) (pin 1))
      (node (ref C6) (pin 2))
      (node (ref J2) (pin 4))
      (node (ref R8) (pin 2))
      (node (ref Q1) (pin 3))
      (node (ref U1) (pin 12))
      (node (ref U1) (pin 3))
      (node (ref C3) (pin 2)))
    (net (code 11) (name VBAT)
      (node (ref J1) (pin 2))
      (node (ref C4) (pin 1))
      (node (ref C2) (pin 1))
      (node (ref C1) (pin 1))
      (node (ref C3) (pin 1))
      (node (ref U1) (pin 2)))
    (net (code 12) (name "Net-(J2-Pad5)")
      (node (ref J2) (pin 5)))
    (net (code 13) (name SPK_N)
      (node (ref J5) (pin 5))
      (node (ref U1) (pin 16)))
    (net (code 14) (name ANT)
      (node (ref J1) (pin 4))
      (node (ref U1) (pin 4)))
    (net (code 15) (name RX)
      (node (ref J1) (pin 5))
      (node (ref R1) (pin 2)))
    (net (code 16) (name TX)
      (node (ref R3) (pin 2))
      (node (ref J1) (pin 6)))
    (net (code 17) (name STAT)
      (node (ref J1) (pin 7))
      (node (ref U1) (pin 7)))
    (net (code 18) (name RI)
      (node (ref J1) (pin 8))
      (node (ref R2) (pin 2)))
    (net (code 19) (name DTR)
      (node (ref J1) (pin 9))
      (node (ref R4) (pin 2)))
    (net (code 20) (name PWRKEY)
      (node (ref R7) (pin 2))
      (node (ref J1) (pin 10)))
    (net (code 21) (name SIM_RST)
      (node (ref J2) (pin 2))
      (node (ref R10) (pin 1))
      (node (ref J5) (pin 1))
      (node (ref C6) (pin 1)))
    (net (code 22) (name SIM_CLK)
      (node (ref J2) (pin 3))
      (node (ref C5) (pin 2))
      (node (ref J5) (pin 2))
      (node (ref R9) (pin 1)))
    (net (code 23) (name SIM_DATA)
      (node (ref R11) (pin 1))
      (node (ref J2) (pin 6))
      (node (ref C7) (pin 1))
      (node (ref J5) (pin 3)))
    (net (code 24) (name SIM_VDD)
      (node (ref J5) (pin 4))
      (node (ref C9) (pin 1))
      (node (ref U1) (pin 17))
      (node (ref J2) (pin 1)))
    (net (code 25) (name SPK_P)
      (node (ref U1) (pin 15))
      (node (ref J5) (pin 6)))
    (net (code 26) (name MLK_N)
      (node (ref U1) (pin 14))
      (node (ref J5) (pin 7)))
    (net (code 27) (name MLK_P)
      (node (ref J5) (pin 8))
      (node (ref U1) (pin 13)))
    (net (code 28) (name NRESET)
      (node (ref U1) (pin 11))
      (node (ref J5) (pin 10)))
    (net (code 29) (name NET)
      (node (ref J1) (pin 1))
      (node (ref U1) (pin 1)))))