PCBNEW-LibModule-V1  
# encoding utf-8
Units mm
$INDEX
DIO_SBR10U200P5-13
$EndINDEX
$MODULE DIO_SBR10U200P5-13
Po 0 0 0 15 00000000 00000000 ~~
Li DIO_SBR10U200P5-13
Cd 
Sc 00000000
At SMD
Op 0 0 0
.SolderMask 0
.SolderPaste 0
T0 -0.405571 -4.72942 1.55814 1.55814 0 0.05 N V 21 "DIO_SBR10U200P5-13"
T1 0.117172 4.64035 1.56497 1.56497 0 0.05 N V 21 "VAL**"
DS 2.725 2.025 2.725 -2.025 0.127 24
DS 2.725 -2.025 -2.725 -2.025 0.127 21
DS -2.725 -2.025 -2.725 2.025 0.127 24
DS -2.725 2.025 2.725 2.025 0.127 21
DS -3.8 2.3 -3.8 -2.3 0.05 26
DS -3.8 -2.3 3.8 -2.3 0.05 26
DS 3.8 -2.3 3.8 2.3 0.05 26
DS 3.8 2.3 -3.8 2.3 0.05 26
DC -4.4 -0.2 -4.17639 -0.2 0.127 21
$PAD
Sh "1" R 3.36 4.86 0 0 900
At SMD N 00888000
.SolderMask 0
.SolderPaste 0
Ne 0 ""
Po -1.126 0
$EndPAD
$PAD
Sh "2" R 1.39 1.4 0 0 900
At SMD N 00888000
.SolderMask 0
.SolderPaste 0
Ne 0 ""
Po 2.856 0.92
$EndPAD
$PAD
Sh "3" R 1.39 1.4 0 0 900
At SMD N 00888000
.SolderMask 0
.SolderPaste 0
Ne 0 ""
Po 2.856 -0.92
$EndPAD
$EndMODULE DIO_SBR10U200P5-13
