PCBNEW-LibModule-V1  
# encoding utf-8
Units mm
$INDEX
SOP65P640X120-14N
$EndINDEX
$MODULE SOP65P640X120-14N
Po 0 0 0 15 00000000 00000000 ~~
Li SOP65P640X120-14N
Cd 
Sc 00000000
At SMD
Op 0 0 0
.SolderMask 0
.SolderPaste 0
T0 -0.53416 -4.65477 1.64231 1.64231 0 0.05 N V 21 "SOP65P640X120-14N"
T1 -0.458277 4.55736 1.64388 1.64388 0 0.05 N V 21 "VAL**"
DS -2.2606 -1.8034 -2.2606 -2.1082 0.1524 24
DS -2.2606 -2.1082 -3.302 -2.1082 0.1524 24
DS -3.302 -2.1082 -3.302 -1.8034 0.1524 24
DS -3.302 -1.8034 -2.2606 -1.8034 0.1524 24
DS -2.2606 -1.143 -2.2606 -1.4478 0.1524 24
DS -2.2606 -1.4478 -3.302 -1.4478 0.1524 24
DS -3.302 -1.4478 -3.302 -1.143 0.1524 24
DS -3.302 -1.143 -2.2606 -1.143 0.1524 24
DS -2.2606 -0.508 -2.2606 -0.7874 0.1524 24
DS -2.2606 -0.7874 -3.302 -0.7874 0.1524 24
DS -3.302 -0.7874 -3.302 -0.508 0.1524 24
DS -3.302 -0.508 -2.2606 -0.508 0.1524 24
DS -2.2606 0.1524 -2.2606 -0.1524 0.1524 24
DS -2.2606 -0.1524 -3.302 -0.1524 0.1524 24
DS -3.302 -0.1524 -3.302 0.1524 0.1524 24
DS -3.302 0.1524 -2.2606 0.1524 0.1524 24
DS -2.2606 0.7874 -2.2606 0.508 0.1524 24
DS -2.2606 0.508 -3.302 0.508 0.1524 24
DS -3.302 0.508 -3.302 0.7874 0.1524 24
DS -3.302 0.7874 -2.2606 0.7874 0.1524 24
DS -2.2606 1.4478 -2.2606 1.143 0.1524 24
DS -2.2606 1.143 -3.302 1.143 0.1524 24
DS -3.302 1.143 -3.302 1.4478 0.1524 24
DS -3.302 1.4478 -2.2606 1.4478 0.1524 24
DS -2.2606 2.1082 -2.2606 1.8034 0.1524 24
DS -2.2606 1.8034 -3.302 1.8034 0.1524 24
DS -3.302 1.8034 -3.302 2.1082 0.1524 24
DS -3.302 2.1082 -2.2606 2.1082 0.1524 24
DS 2.2606 1.8034 2.2606 2.1082 0.1524 24
DS 2.2606 2.1082 3.302 2.1082 0.1524 24
DS 3.302 2.1082 3.302 1.8034 0.1524 24
DS 3.302 1.8034 2.2606 1.8034 0.1524 24
DS 2.2606 1.143 2.2606 1.4478 0.1524 24
DS 2.2606 1.4478 3.302 1.4478 0.1524 24
DS 3.302 1.4478 3.302 1.143 0.1524 24
DS 3.302 1.143 2.2606 1.143 0.1524 24
DS 2.2606 0.508 2.2606 0.7874 0.1524 24
DS 2.2606 0.7874 3.302 0.7874 0.1524 24
DS 3.302 0.7874 3.302 0.508 0.1524 24
DS 3.302 0.508 2.2606 0.508 0.1524 24
DS 2.2606 -0.1524 2.2606 0.1524 0.1524 24
DS 2.2606 0.1524 3.302 0.1524 0.1524 24
DS 3.302 0.1524 3.302 -0.1524 0.1524 24
DS 3.302 -0.1524 2.2606 -0.1524 0.1524 24
DS 2.2606 -0.7874 2.2606 -0.508 0.1524 24
DS 2.2606 -0.508 3.302 -0.508 0.1524 24
DS 3.302 -0.508 3.302 -0.7874 0.1524 24
DS 3.302 -0.7874 2.2606 -0.7874 0.1524 24
DS 2.2606 -1.4478 2.2606 -1.143 0.1524 24
DS 2.2606 -1.143 3.302 -1.143 0.1524 24
DS 3.302 -1.143 3.302 -1.4478 0.1524 24
DS 3.302 -1.4478 2.2606 -1.4478 0.1524 24
DS 2.2606 -2.1082 2.2606 -1.8034 0.1524 24
DS 2.2606 -1.8034 3.302 -1.8034 0.1524 24
DS 3.302 -1.8034 3.302 -2.1082 0.1524 24
DS 3.302 -2.1082 2.2606 -2.1082 0.1524 24
DS -2.2606 2.54 2.2606 2.54 0.1524 24
DS 2.2606 2.54 2.2606 -2.54 0.1524 24
DS 2.2606 -2.54 0.3048 -2.54 0.1524 24
DS 0.3048 -2.54 -0.3048 -2.54 0.1524 24
DS -0.3048 -2.54 -2.2606 -2.54 0.1524 24
DS -2.2606 -2.54 -2.2606 2.54 0.1524 24
DA 0 -2.54 -0.3048 -2.54 -1800 0 24
DS -2.2606 2.54 2.2606 2.54 0.1524 21
DS 2.2606 -2.54 0.3048 -2.54 0.1524 21
DS 0.3048 -2.54 -0.3048 -2.54 0.1524 21
DS -0.3048 -2.54 -2.2606 -2.54 0.1524 21
DA 0 -2.54 -0.3048 -2.54 -1800 0 21
$PAD
Sh "1" R 1.4732 0.3556 0 0 0
At SMD N 00888000
.SolderMask 0
.SolderPaste 0
Ne 0 ""
Po -2.921 -1.9558
$EndPAD
$PAD
Sh "2" R 1.4732 0.3556 0 0 0
At SMD N 00888000
.SolderMask 0
.SolderPaste 0
Ne 0 ""
Po -2.921 -1.2954
$EndPAD
$PAD
Sh "3" R 1.4732 0.3556 0 0 0
At SMD N 00888000
.SolderMask 0
.SolderPaste 0
Ne 0 ""
Po -2.921 -0.6604
$EndPAD
$PAD
Sh "4" R 1.4732 0.3556 0 0 0
At SMD N 00888000
.SolderMask 0
.SolderPaste 0
Ne 0 ""
Po -2.921 0
$EndPAD
$PAD
Sh "5" R 1.4732 0.3556 0 0 0
At SMD N 00888000
.SolderMask 0
.SolderPaste 0
Ne 0 ""
Po -2.921 0.6604
$EndPAD
$PAD
Sh "6" R 1.4732 0.3556 0 0 0
At SMD N 00888000
.SolderMask 0
.SolderPaste 0
Ne 0 ""
Po -2.921 1.2954
$EndPAD
$PAD
Sh "7" R 1.4732 0.3556 0 0 0
At SMD N 00888000
.SolderMask 0
.SolderPaste 0
Ne 0 ""
Po -2.921 1.9558
$EndPAD
$PAD
Sh "8" R 1.4732 0.3556 0 0 0
At SMD N 00888000
.SolderMask 0
.SolderPaste 0
Ne 0 ""
Po 2.921 1.9558
$EndPAD
$PAD
Sh "9" R 1.4732 0.3556 0 0 0
At SMD N 00888000
.SolderMask 0
.SolderPaste 0
Ne 0 ""
Po 2.921 1.2954
$EndPAD
$PAD
Sh "10" R 1.4732 0.3556 0 0 0
At SMD N 00888000
.SolderMask 0
.SolderPaste 0
Ne 0 ""
Po 2.921 0.6604
$EndPAD
$PAD
Sh "11" R 1.4732 0.3556 0 0 0
At SMD N 00888000
.SolderMask 0
.SolderPaste 0
Ne 0 ""
Po 2.921 0
$EndPAD
$PAD
Sh "12" R 1.4732 0.3556 0 0 0
At SMD N 00888000
.SolderMask 0
.SolderPaste 0
Ne 0 ""
Po 2.921 -0.6604
$EndPAD
$PAD
Sh "13" R 1.4732 0.3556 0 0 0
At SMD N 00888000
.SolderMask 0
.SolderPaste 0
Ne 0 ""
Po 2.921 -1.2954
$EndPAD
$PAD
Sh "14" R 1.4732 0.3556 0 0 0
At SMD N 00888000
.SolderMask 0
.SolderPaste 0
Ne 0 ""
Po 2.921 -1.9558
$EndPAD
$EndMODULE SOP65P640X120-14N
