EESchema Schematic File Version 2
LIBS:power
LIBS:device
LIBS:switches
LIBS:relays
LIBS:motors
LIBS:transistors
LIBS:conn
LIBS:linear
LIBS:regul
LIBS:74xx
LIBS:cmos4000
LIBS:adc-dac
LIBS:memory
LIBS:xilinx
LIBS:microcontrollers
LIBS:dsp
LIBS:microchip
LIBS:analog_switches
LIBS:motorola
LIBS:texas
LIBS:intel
LIBS:audio
LIBS:interface
LIBS:digital-audio
LIBS:philips
LIBS:display
LIBS:cypress
LIBS:siliconi
LIBS:opto
LIBS:atmel
LIBS:contrib
LIBS:valves
LIBS:M95
LIBS:M95A-02-NCH-STD
LIBS:MIC29302AWU-TR
LIBS:MSP430G2553IPW20
LIBS:TPD4E004DRYR
LIBS:SIM_78646-3001
LIBS:MSP430FR2311
LIBS:U.FL-R-SMT_10_
LIBS:RF-LORA-868-SO
LIBS:Lora_DRF1276G
LIBS:PAM2305D
LIBS:MSP430FR5969
LIBS:FR5969-cache
EELAYER 25 0
EELAYER END
$Descr A4 11693 8268
encoding utf-8
Sheet 1 1
Title "FR5969 Board"
Date "2018-09-26"
Rev "v1.1"
Comp "Soil Agritech Pvt. Ltd."
Comment1 "Designed by SRS"
Comment2 ""
Comment3 ""
Comment4 ""
$EndDescr
$Comp
L GND #PWR01
U 1 1 5B879F4E
P 2250 2200
F 0 "#PWR01" H 2250 1950 50  0001 C CNN
F 1 "GND" H 2250 2050 50  0000 C CNN
F 2 "" H 2250 2200 50  0001 C CNN
F 3 "" H 2250 2200 50  0001 C CNN
	1    2250 2200
	1    0    0    -1  
$EndComp
$Comp
L C C1
U 1 1 5B879F59
P 1600 1650
F 0 "C1" H 1625 1750 50  0000 L CNN
F 1 "0.1u" H 1625 1550 50  0000 L CNN
F 2 "Capacitors_SMD:C_0805_HandSoldering" H 1638 1500 50  0001 C CNN
F 3 "" H 1600 1650 50  0001 C CNN
	1    1600 1650
	1    0    0    -1  
$EndComp
$Comp
L C C3
U 1 1 5B879F5E
P 3450 1400
F 0 "C3" H 3475 1500 50  0000 L CNN
F 1 "0.1u" H 3475 1300 50  0000 L CNN
F 2 "Capacitors_SMD:C_0805_HandSoldering" H 3488 1250 50  0001 C CNN
F 3 "" H 3450 1400 50  0001 C CNN
	1    3450 1400
	1    0    0    -1  
$EndComp
Text GLabel 4150 1200 2    60   Input ~ 0
VBUS
Text Notes 1950 800  0    79   ~ 16
Power Supply
$Comp
L +5V #PWR02
U 1 1 5B879F57
P 1200 1050
F 0 "#PWR02" H 1200 900 50  0001 C CNN
F 1 "+5V" H 1200 1190 50  0000 C CNN
F 2 "" H 1200 1050 50  0001 C CNN
F 3 "" H 1200 1050 50  0001 C CNN
	1    1200 1050
	1    0    0    -1  
$EndComp
$Comp
L GND #PWR03
U 1 1 5B87DF79
P 5700 7400
F 0 "#PWR03" H 5700 7150 50  0001 C CNN
F 1 "GND" H 5700 7250 50  0000 C CNN
F 2 "" H 5700 7400 50  0001 C CNN
F 3 "" H 5700 7400 50  0001 C CNN
	1    5700 7400
	1    0    0    -1  
$EndComp
$Comp
L +5V #PWR04
U 1 1 5B87DFA1
P 6150 7050
F 0 "#PWR04" H 6150 6900 50  0001 C CNN
F 1 "+5V" H 6150 7190 50  0000 C CNN
F 2 "" H 6150 7050 50  0001 C CNN
F 3 "" H 6150 7050 50  0001 C CNN
	1    6150 7050
	1    0    0    -1  
$EndComp
$Comp
L PWR_FLAG #FLG05
U 1 1 5B87E187
P 5700 7050
F 0 "#FLG05" H 5700 7125 50  0001 C CNN
F 1 "PWR_FLAG" H 5700 7200 50  0000 C CNN
F 2 "" H 5700 7050 50  0001 C CNN
F 3 "" H 5700 7050 50  0001 C CNN
	1    5700 7050
	1    0    0    -1  
$EndComp
$Comp
L PWR_FLAG #FLG06
U 1 1 5B87E1B0
P 6150 7400
F 0 "#FLG06" H 6150 7475 50  0001 C CNN
F 1 "PWR_FLAG" H 6150 7550 50  0000 C CNN
F 2 "" H 6150 7400 50  0001 C CNN
F 3 "" H 6150 7400 50  0001 C CNN
	1    6150 7400
	-1   0    0    1   
$EndComp
$Comp
L C C10
U 1 1 5B8E7B5F
P 4100 6500
F 0 "C10" H 4125 6600 50  0000 L CNN
F 1 "0.1u" H 4125 6400 50  0000 L CNN
F 2 "Capacitors_SMD:C_0805_HandSoldering" H 4138 6350 50  0001 C CNN
F 3 "" H 4100 6500 50  0001 C CNN
	1    4100 6500
	1    0    0    -1  
$EndComp
$Comp
L GND #PWR07
U 1 1 5B8E7D99
P 4100 6750
F 0 "#PWR07" H 4100 6500 50  0001 C CNN
F 1 "GND" H 4100 6600 50  0000 C CNN
F 2 "" H 4100 6750 50  0001 C CNN
F 3 "" H 4100 6750 50  0001 C CNN
	1    4100 6750
	1    0    0    -1  
$EndComp
Text Notes 6150 1050 0    197  ~ 39
MSP430FR5969 Main Board
$Comp
L MSP430FR2311IPW20R U2
U 1 1 5B9108D8
P 2550 6800
F 0 "U2" H 2199 7503 50  0000 L BNN
F 1 "MSP430FR2433IPW20R" H 2100 6000 50  0000 L BNN
F 2 "MSP430FR2433IRGER:QFN50P400X400X100-25N" H 2400 6850 50  0001 L BNN
F 3 "Texas Instruments" H 2400 6850 50  0001 L BNN
F 4 "None" H 2400 6850 50  0001 L BNN "Field4"
F 5 "Unavailable" H 2400 6850 50  0001 L BNN "Field5"
F 6 "TSSOP-20 Texas Instruments" H 2400 6850 50  0001 L BNN "Field6"
F 7 "MSP430FR2433IPW20R" H 2400 6850 50  0001 L BNN "Field7"
F 8 "MSP430FRxx, Mixed Signal Microcontroller 20-TSSOP -40 to 85" H 2400 6850 50  0001 L BNN "Field8"
	1    2550 6800
	1    0    0    -1  
$EndComp
Text GLabel 3350 6150 1    60   Input ~ 0
VBUS
$Comp
L GND #PWR08
U 1 1 5B9193BE
P 3350 7550
F 0 "#PWR08" H 3350 7300 50  0001 C CNN
F 1 "GND" H 3350 7400 50  0000 C CNN
F 2 "" H 3350 7550 50  0001 C CNN
F 3 "" H 3350 7550 50  0001 C CNN
	1    3350 7550
	1    0    0    -1  
$EndComp
Text GLabel 1600 6150 1    60   Input ~ 0
MISO
$Comp
L Conn_01x06_Male J5
U 1 1 5B9209F1
P 1200 7150
F 0 "J5" H 1200 7450 50  0000 C CNN
F 1 "Conn_01x06_Male" H 1200 7500 50  0000 C CNN
F 2 "6PIN:06x2.50mm" H 1200 7150 50  0001 C CNN
F 3 "" H 1200 7150 50  0001 C CNN
	1    1200 7150
	1    0    0    1   
$EndComp
Text GLabel 1800 6150 1    60   Input ~ 0
MOSI
$Comp
L Conn_01x02_Male J3
U 1 1 5B98C40B
P 1200 6250
F 0 "J3" H 1200 6350 50  0000 C CNN
F 1 "Conn_01x02_Male" H 1200 5900 50  0000 C CNN
F 2 "2PIN:02x2.5mm" H 1200 6250 50  0001 C CNN
F 3 "" H 1200 6250 50  0001 C CNN
	1    1200 6250
	1    0    0    -1  
$EndComp
Text GLabel 3500 6950 2    60   Input ~ 0
SIMO
Text GLabel 3500 7050 2    60   Input ~ 0
SOMI
Text GLabel 3500 7150 2    60   Input ~ 0
SCLK
$Comp
L GND #PWR09
U 1 1 5B99313C
P 1950 4250
F 0 "#PWR09" H 1950 4000 50  0001 C CNN
F 1 "GND" H 2100 4250 50  0000 C CNN
F 2 "" H 1950 4250 50  0001 C CNN
F 3 "" H 1950 4250 50  0001 C CNN
	1    1950 4250
	1    0    0    -1  
$EndComp
Text GLabel 1400 4650 2    60   Input ~ 0
SIMO
Text GLabel 1400 4750 2    60   Input ~ 0
SOMI
Text GLabel 1400 4850 2    60   Input ~ 0
SCLK
Text GLabel 1400 5150 2    60   Input ~ 0
SS
Text GLabel 1400 5250 2    60   Input ~ 0
GPIO
Text Notes 2000 3250 0    60   ~ 0
Power \nConnector
Text Notes 1700 5150 0    60   ~ 0
SPI LoRa
Text Notes 1500 5500 0    60   ~ 0
SS & GPIO\nof other stack
Text GLabel 1550 6750 0    60   Input ~ 0
NSS
Text GLabel 1800 6650 0    60   Input ~ 0
SCK
Text GLabel 3500 7250 2    60   Input ~ 0
SS
Text GLabel 3500 7350 2    60   Input ~ 0
GPIO
Text GLabel 3550 6150 1    60   Input ~ 0
NRST
$Comp
L Conn_01x08_Male J6
U 1 1 5B9C5676
P 1200 3150
F 0 "J6" H 1200 3550 50  0000 C CNN
F 1 "Conn_01x08_Male" H 1200 2650 50  0000 C CNN
F 2 "8PIN:08x2.50mm" H 1200 3150 50  0001 C CNN
F 3 "" H 1200 3150 50  0001 C CNN
	1    1200 3150
	1    0    0    -1  
$EndComp
$Comp
L +5V #PWR010
U 1 1 5B9C571B
P 1600 2800
F 0 "#PWR010" H 1600 2650 50  0001 C CNN
F 1 "+5V" H 1600 2940 50  0000 C CNN
F 2 "" H 1600 2800 50  0001 C CNN
F 3 "" H 1600 2800 50  0001 C CNN
	1    1600 2800
	1    0    0    -1  
$EndComp
$Comp
L GND #PWR011
U 1 1 5B9C579E
P 1600 3600
F 0 "#PWR011" H 1600 3350 50  0001 C CNN
F 1 "GND" H 1600 3450 50  0000 C CNN
F 2 "" H 1600 3600 50  0001 C CNN
F 3 "" H 1600 3600 50  0001 C CNN
	1    1600 3600
	1    0    0    -1  
$EndComp
NoConn ~ 1400 5450
NoConn ~ 1400 5350
NoConn ~ 1400 5050
NoConn ~ 1400 4950
Text GLabel 2600 4450 2    60   Input ~ 0
VBUS
Text Notes 5800 6800 0    60   ~ 0
Flags
Text Notes 2450 6000 0    60   ~ 0
MCU
$Comp
L C C18
U 1 1 5B9D55D4
P 2400 4650
F 0 "C18" H 2425 4750 50  0000 L CNN
F 1 "0.1u" H 2425 4550 50  0000 L CNN
F 2 "Capacitors_SMD:C_0805_HandSoldering" H 2438 4500 50  0001 C CNN
F 3 "" H 2400 4650 50  0001 C CNN
	1    2400 4650
	1    0    0    -1  
$EndComp
$Comp
L GND #PWR012
U 1 1 5B9D55DA
P 2400 4950
F 0 "#PWR012" H 2400 4700 50  0001 C CNN
F 1 "GND" H 2550 4900 50  0000 C CNN
F 2 "" H 2400 4950 50  0001 C CNN
F 3 "" H 2400 4950 50  0001 C CNN
	1    2400 4950
	1    0    0    -1  
$EndComp
$Comp
L C C19
U 1 1 5B9D686D
P 1750 3200
F 0 "C19" H 1775 3300 50  0000 L CNN
F 1 "0.1u" H 1775 3100 50  0000 L CNN
F 2 "Capacitors_SMD:C_0805_HandSoldering" H 1788 3050 50  0001 C CNN
F 3 "" H 1750 3200 50  0001 C CNN
	1    1750 3200
	1    0    0    -1  
$EndComp
$Comp
L Conn_01x14_Male J7
U 1 1 5B9F70FC
P 1200 4750
F 0 "J7" H 1200 5450 50  0000 C CNN
F 1 "Conn_01x14_Male" H 1200 3950 50  0000 C CNN
F 2 "14PIN:14x2.50mm_Straight" H 1200 4750 50  0001 C CNN
F 3 "" H 1200 4750 50  0001 C CNN
	1    1200 4750
	1    0    0    -1  
$EndComp
$Comp
L R R6
U 1 1 5B9F85DC
P 2050 4550
F 0 "R6" V 2130 4550 50  0000 C CNN
F 1 "47k" V 2050 4550 50  0000 C CNN
F 2 "Resistors_SMD:R_0805_HandSoldering" V 1980 4550 50  0001 C CNN
F 3 "" H 2050 4550 50  0001 C CNN
	1    2050 4550
	0    -1   -1   0   
$EndComp
$Comp
L C C20
U 1 1 5B9F9600
P 1850 4750
F 0 "C20" H 1875 4850 50  0000 L CNN
F 1 "1000p" H 1875 4650 50  0000 L CNN
F 2 "Capacitors_SMD:C_0805_HandSoldering" H 1888 4600 50  0001 C CNN
F 3 "" H 1850 4750 50  0001 C CNN
	1    1850 4750
	1    0    0    -1  
$EndComp
$Comp
L GND #PWR013
U 1 1 5B9F9764
P 1850 4950
F 0 "#PWR013" H 1850 4700 50  0001 C CNN
F 1 "GND" H 2000 4900 50  0000 C CNN
F 2 "" H 1850 4950 50  0001 C CNN
F 3 "" H 1850 4950 50  0001 C CNN
	1    1850 4950
	1    0    0    -1  
$EndComp
Text GLabel 1650 4050 1    60   Input ~ 0
~RST
Text GLabel 1450 6150 1    60   Input ~ 0
~RST
$Comp
L GND #PWR014
U 1 1 5BA38D5D
P 4250 4950
F 0 "#PWR014" H 4250 4700 50  0001 C CNN
F 1 "GND" H 4250 4800 50  0000 C CNN
F 2 "" H 4250 4950 50  0001 C CNN
F 3 "" H 4250 4950 50  0001 C CNN
	1    4250 4950
	-1   0    0    -1  
$EndComp
Text GLabel 3800 4650 0    60   Input ~ 0
VBUS
Text GLabel 5050 4900 3    60   Input ~ 0
NSS
Text GLabel 5200 4900 3    60   Input ~ 0
MOSI
Text GLabel 5350 4900 3    60   Input ~ 0
MISO
Text GLabel 5500 4900 3    60   Input ~ 0
SCK
Text GLabel 4400 3750 0    60   Input ~ 0
NRST
$Comp
L Conn_01x05_Male J1
U 1 1 5BA3C6BF
P 3500 4200
F 0 "J1" H 3500 4500 50  0000 C CNN
F 1 "Conn_01x05_Male" H 3500 3900 50  0000 C CNN
F 2 "4PIN:05x2.50mm_Straight" H 3500 4200 50  0001 C CNN
F 3 "" H 3500 4200 50  0001 C CNN
	1    3500 4200
	1    0    0    -1  
$EndComp
$Comp
L C C5
U 1 1 5BA3DD0F
P 3950 4850
F 0 "C5" H 3975 4950 50  0000 L CNN
F 1 "0.1u" H 3975 4750 50  0000 L CNN
F 2 "Capacitors_SMD:C_0805_HandSoldering" H 3988 4700 50  0001 C CNN
F 3 "" H 3950 4850 50  0001 C CNN
	1    3950 4850
	1    0    0    -1  
$EndComp
$Comp
L GND #PWR015
U 1 1 5BA3DEBD
P 3950 5100
F 0 "#PWR015" H 3950 4850 50  0001 C CNN
F 1 "GND" H 3950 4950 50  0000 C CNN
F 2 "" H 3950 5100 50  0001 C CNN
F 3 "" H 3950 5100 50  0001 C CNN
	1    3950 5100
	-1   0    0    -1  
$EndComp
$Comp
L Conn_01x03_Male J8
U 1 1 5BA3EABF
P 3900 6550
F 0 "J8" H 3900 6750 50  0000 C CNN
F 1 "Conn_01x03_Male" H 3900 6350 50  0000 C CNN
F 2 "4PIN:03x2.50mm_Straight" H 3900 6550 50  0001 C CNN
F 3 "" H 3900 6550 50  0001 C CNN
	1    3900 6550
	-1   0    0    -1  
$EndComp
$Comp
L PAM2305D U1
U 1 1 5BAA1C13
P 2250 1300
F 0 "U1" H 2250 1650 60  0000 C CNN
F 1 "PAM2305D" H 2250 1550 60  0000 C CNN
F 2 "TSOT-25-5:SOT23-5" H 2250 1300 60  0001 C CNN
F 3 "" H 2250 1300 60  0001 C CNN
	1    2250 1300
	1    0    0    -1  
$EndComp
$Comp
L R R1
U 1 1 5BAA24E9
P 3200 1400
F 0 "R1" V 3280 1400 50  0000 C CNN
F 1 "680k" V 3200 1400 50  0000 C CNN
F 2 "Resistors_SMD:R_0805_HandSoldering" V 3130 1400 50  0001 C CNN
F 3 "" H 3200 1400 50  0001 C CNN
	1    3200 1400
	1    0    0    -1  
$EndComp
$Comp
L R R2
U 1 1 5BAA2675
P 3200 1850
F 0 "R2" V 3280 1850 50  0000 C CNN
F 1 "150k" V 3200 1850 50  0000 C CNN
F 2 "Resistors_SMD:R_0805_HandSoldering" V 3130 1850 50  0001 C CNN
F 3 "" H 3200 1850 50  0001 C CNN
	1    3200 1850
	1    0    0    -1  
$EndComp
$Comp
L C C2
U 1 1 5BAA28B1
P 3800 1650
F 0 "C2" H 3825 1750 50  0000 L CNN
F 1 "0.1u" H 3825 1550 50  0000 L CNN
F 2 "Capacitors_SMD:C_0805_HandSoldering" H 3838 1500 50  0001 C CNN
F 3 "" H 3800 1650 50  0001 C CNN
	1    3800 1650
	1    0    0    -1  
$EndComp
$Comp
L L L1
U 1 1 5BAA297E
P 2900 1200
F 0 "L1" V 2850 1200 50  0000 C CNN
F 1 "L" V 2975 1200 50  0000 C CNN
F 2 "Inductor_2520:1008" H 2900 1200 50  0001 C CNN
F 3 "" H 2900 1200 50  0001 C CNN
	1    2900 1200
	0    -1   -1   0   
$EndComp
Wire Notes Line
	3050 3800 450  3800
Connection ~ 1650 4550
Wire Wire Line
	1650 4050 1650 4550
Connection ~ 1850 4550
Wire Wire Line
	1850 4550 1850 4600
Wire Wire Line
	1850 4950 1850 4900
Connection ~ 2250 4450
Wire Wire Line
	2250 4450 2250 4550
Wire Wire Line
	2250 4550 2200 4550
Wire Wire Line
	1400 4550 1900 4550
Connection ~ 1850 4450
Wire Wire Line
	1850 4350 1850 4450
Wire Wire Line
	1400 4350 1850 4350
Connection ~ 1850 4250
Wire Wire Line
	1850 4150 1850 4250
Wire Wire Line
	1400 4150 1850 4150
Wire Wire Line
	1750 3450 1750 3350
Wire Wire Line
	1750 2950 1750 3050
Connection ~ 2400 4450
Wire Wire Line
	2400 4450 2400 4500
Wire Wire Line
	2400 4950 2400 4800
Wire Notes Line
	6950 6550 5000 6550
Wire Notes Line
	5000 5700 5000 7800
Wire Notes Line
	450  5700 5000 5700
Wire Notes Line
	3050 2550 3050 5700
Wire Notes Line
	5000 450  5000 2550
Wire Wire Line
	3250 6250 4100 6250
Wire Wire Line
	1400 7350 1850 7350
Wire Wire Line
	1400 7250 1850 7250
Wire Wire Line
	1400 7150 1850 7150
Wire Wire Line
	1400 7050 1850 7050
Wire Wire Line
	1400 6950 1850 6950
Wire Wire Line
	1400 6850 1850 6850
Wire Wire Line
	1400 4450 2600 4450
Wire Wire Line
	1400 4250 1950 4250
Connection ~ 1600 3450
Wire Wire Line
	1400 3450 1750 3450
Connection ~ 1600 3350
Wire Wire Line
	1400 3350 1600 3350
Connection ~ 1600 3550
Wire Wire Line
	1400 3250 1600 3250
Connection ~ 1600 3050
Wire Wire Line
	1600 3150 1400 3150
Connection ~ 1600 2950
Wire Wire Line
	1600 3050 1400 3050
Connection ~ 1600 2850
Wire Wire Line
	1400 2950 1750 2950
Wire Wire Line
	1600 2800 1600 3150
Wire Wire Line
	1400 2850 1600 2850
Wire Wire Line
	1600 3550 1400 3550
Wire Wire Line
	1600 3250 1600 3600
Wire Wire Line
	4100 6250 4100 6350
Wire Wire Line
	3250 6350 3350 6350
Wire Wire Line
	3250 7250 3500 7250
Wire Wire Line
	3500 7350 3250 7350
Wire Wire Line
	3500 7150 3250 7150
Wire Wire Line
	3250 7050 3500 7050
Wire Wire Line
	3250 6950 3500 6950
Wire Wire Line
	3250 6850 3350 6850
Wire Wire Line
	1400 6350 1850 6350
Wire Wire Line
	1400 6250 1850 6250
Connection ~ 3350 7450
Wire Wire Line
	3350 7450 3250 7450
Connection ~ 3350 6850
Connection ~ 3350 6250
Wire Wire Line
	3350 6250 3350 6150
Wire Wire Line
	3350 6350 3350 7550
Wire Wire Line
	5700 7400 5700 7050
Wire Wire Line
	4100 6750 4100 6650
Wire Wire Line
	1200 1200 1200 1050
Wire Notes Line
	11250 3200 11250 3250
Wire Wire Line
	6150 7400 6150 7050
Wire Wire Line
	1450 6150 1450 6250
Connection ~ 1450 6250
Wire Wire Line
	4250 4950 4250 4800
Wire Wire Line
	4250 4800 4400 4800
Wire Wire Line
	3800 4650 4400 4650
Wire Wire Line
	3250 6450 3700 6450
Wire Wire Line
	3250 6550 3700 6550
Wire Wire Line
	3700 4000 3850 4000
Wire Wire Line
	3850 4000 3850 3900
Wire Wire Line
	3850 3900 4400 3900
Wire Wire Line
	3700 4400 3850 4400
Wire Wire Line
	3850 4400 3850 4500
Wire Wire Line
	3850 4500 4400 4500
Wire Wire Line
	3700 4200 4400 4200
Wire Wire Line
	3700 4100 3950 4100
Wire Wire Line
	3950 4100 3950 4050
Wire Wire Line
	3950 4050 4400 4050
Wire Wire Line
	3700 4300 3950 4300
Wire Wire Line
	3950 4300 3950 4350
Wire Wire Line
	3950 4350 4400 4350
Wire Wire Line
	1600 6150 1600 6450
Wire Wire Line
	1800 6150 1800 6550
Wire Wire Line
	3950 4700 3950 4650
Connection ~ 3950 4650
Wire Wire Line
	3950 5100 3950 5000
Wire Wire Line
	3250 6750 3650 6750
Wire Wire Line
	3650 6750 3650 6650
Wire Wire Line
	3650 6650 3700 6650
Wire Wire Line
	3250 6650 3550 6650
Wire Wire Line
	3550 6650 3550 6150
Wire Wire Line
	5550 4650 5000 4650
Wire Wire Line
	5500 4900 5500 4650
Connection ~ 5500 4650
Wire Wire Line
	1800 6650 1850 6650
Wire Wire Line
	1800 6550 1850 6550
Wire Wire Line
	1600 6450 1850 6450
Wire Wire Line
	1550 6750 1850 6750
Wire Wire Line
	1200 1200 1800 1200
Wire Wire Line
	1600 1200 1600 1500
Connection ~ 1600 1200
Wire Wire Line
	1800 1400 1600 1400
Connection ~ 1600 1400
Wire Wire Line
	1600 1800 1600 2100
Wire Wire Line
	1600 2100 3800 2100
Wire Wire Line
	2250 1800 2250 2200
Connection ~ 2250 2100
Wire Wire Line
	2700 1200 2750 1200
Wire Wire Line
	3050 1200 4150 1200
Wire Wire Line
	3200 1250 3200 1200
Connection ~ 3200 1200
Wire Wire Line
	3450 1250 3450 1200
Connection ~ 3450 1200
Wire Wire Line
	3200 1550 3200 1700
Wire Wire Line
	3200 2100 3200 2000
Connection ~ 3200 2100
Wire Wire Line
	3800 2100 3800 1800
Wire Wire Line
	3800 1500 3800 1200
Connection ~ 3800 1200
Wire Wire Line
	2900 1650 3450 1650
Wire Wire Line
	3450 1650 3450 1550
Connection ~ 3200 1650
Wire Wire Line
	2700 1400 2900 1400
Wire Wire Line
	2900 1400 2900 1650
Wire Notes Line
	450  2550 11250 2550
$Comp
L MSP430FR5969IRGZR U3
U 1 1 5BABAD74
P 9100 4550
F 0 "U3" H 9050 6350 50  0000 L BNN
F 1 "MSP430FR5969IRGZR" H 8750 2600 50  0000 L BNN
F 2 "QFN50P700X700X100-49N:QFN50P700X700X100-49N" H 8700 4500 50  0001 L BNN
F 3 "Texas Instruments" H 8700 4500 50  0001 L BNN
F 4 "MSP430FR5969IRGZR " H 8700 4500 50  0001 L BNN "Field4"
	1    9100 4550
	1    0    0    -1  
$EndComp
$EndSCHEMATC
