EESchema Schematic File Version 2
LIBS:Node-rescue
LIBS:power
LIBS:device
LIBS:switches
LIBS:relays
LIBS:motors
LIBS:transistors
LIBS:conn
LIBS:linear
LIBS:regul
LIBS:74xx
LIBS:cmos4000
LIBS:adc-dac
LIBS:memory
LIBS:xilinx
LIBS:microcontrollers
LIBS:dsp
LIBS:microchip
LIBS:analog_switches
LIBS:motorola
LIBS:texas
LIBS:intel
LIBS:audio
LIBS:interface
LIBS:digital-audio
LIBS:philips
LIBS:display
LIBS:cypress
LIBS:siliconi
LIBS:opto
LIBS:atmel
LIBS:contrib
LIBS:valves
LIBS:TSSOP_28PIN
LIBS:Lora_DRF1276DM
LIBS:Node-cache
EELAYER 25 0
EELAYER END
$Descr A4 11693 8268
encoding utf-8
Sheet 1 1
Title "Node PCB"
Date "2018-07-09"
Rev "v1.1"
Comp "Soil Agritech Pvt. Ltd."
Comment1 "Designed by SRS"
Comment2 ""
Comment3 ""
Comment4 ""
$EndDescr
$Comp
L TSSOP_28PIN U2
U 1 1 5B30F689
P 5650 4300
F 0 "U2" H 5650 5000 60  0000 C CNN
F 1 "TSSOP_28PIN" H 5650 5150 60  0000 C CNN
F 2 "TSSOP_28PIN:TSSOP_28PIN" H 5500 4350 60  0001 C CNN
F 3 "" H 5500 4350 60  0001 C CNN
	1    5650 4300
	1    0    0    -1  
$EndComp
$Comp
L C_Small C8
U 1 1 5B30F7F2
P 6700 3600
F 0 "C8" H 6710 3670 50  0000 L CNN
F 1 "12p" H 6710 3520 50  0000 L CNN
F 2 "Capacitors_THT:CP_Radial_D5.0mm_P2.50mm" H 6700 3600 50  0001 C CNN
F 3 "" H 6700 3600 50  0001 C CNN
	1    6700 3600
	1    0    0    -1  
$EndComp
$Comp
L C_Small C9
U 1 1 5B30F82B
P 7250 3600
F 0 "C9" H 7260 3670 50  0000 L CNN
F 1 "12p" H 7260 3520 50  0000 L CNN
F 2 "Capacitors_THT:CP_Radial_D5.0mm_P2.50mm" H 7250 3600 50  0001 C CNN
F 3 "" H 7250 3600 50  0001 C CNN
	1    7250 3600
	1    0    0    -1  
$EndComp
$Comp
L Crystal Y1
U 1 1 5B30F857
P 7000 3750
F 0 "Y1" H 7000 3900 50  0000 C CNN
F 1 "Crystal" H 7000 3550 50  0000 C CNN
F 2 "Crystals:Resonator-2pin_w10.0mm_h5.0mm" H 7000 3750 50  0001 C CNN
F 3 "" H 7000 3750 50  0001 C CNN
	1    7000 3750
	1    0    0    -1  
$EndComp
$Comp
L LED D1
U 1 1 5B30F958
P 4100 2700
F 0 "D1" H 4100 2800 50  0000 C CNN
F 1 "LED" H 4100 2600 50  0000 C CNN
F 2 "LEDs:LED_D5.0mm" H 4100 2700 50  0001 C CNN
F 3 "" H 4100 2700 50  0001 C CNN
	1    4100 2700
	0    1    1    0   
$EndComp
$Comp
L +3.3V #PWR01
U 1 1 5B30FA19
P 4750 2850
F 0 "#PWR01" H 4750 2700 50  0001 C CNN
F 1 "+3.3V" H 4750 2990 50  0000 C CNN
F 2 "" H 4750 2850 50  0001 C CNN
F 3 "" H 4750 2850 50  0001 C CNN
	1    4750 2850
	1    0    0    -1  
$EndComp
$Comp
L +3.3V #PWR02
U 1 1 5B30FA8B
P 7000 3300
F 0 "#PWR02" H 7000 3150 50  0001 C CNN
F 1 "+3.3V" H 7000 3440 50  0000 C CNN
F 2 "" H 7000 3300 50  0001 C CNN
F 3 "" H 7000 3300 50  0001 C CNN
	1    7000 3300
	1    0    0    -1  
$EndComp
$Comp
L GND #PWR03
U 1 1 5B30FCBE
P 6500 3550
F 0 "#PWR03" H 6500 3300 50  0001 C CNN
F 1 "GND" H 6500 3400 50  0000 C CNN
F 2 "" H 6500 3550 50  0001 C CNN
F 3 "" H 6500 3550 50  0001 C CNN
	1    6500 3550
	1    0    0    -1  
$EndComp
$Comp
L R R3
U 1 1 5B31001D
P 7350 4050
F 0 "R3" V 7430 4050 50  0000 C CNN
F 1 "47k" V 7350 4050 50  0000 C CNN
F 2 "Resistors_THT:R_Axial_DIN0204_L3.6mm_D1.6mm_P7.62mm_Horizontal" V 7280 4050 50  0001 C CNN
F 3 "" H 7350 4050 50  0001 C CNN
	1    7350 4050
	0    1    1    0   
$EndComp
$Comp
L R R1
U 1 1 5B31006C
P 4100 3050
F 0 "R1" V 4180 3050 50  0000 C CNN
F 1 "R" V 4100 3050 50  0000 C CNN
F 2 "Resistors_THT:R_Axial_DIN0204_L3.6mm_D1.6mm_P7.62mm_Horizontal" V 4030 3050 50  0001 C CNN
F 3 "" H 4100 3050 50  0001 C CNN
	1    4100 3050
	-1   0    0    1   
$EndComp
$Comp
L +3.3V #PWR04
U 1 1 5B3102A0
P 7650 3950
F 0 "#PWR04" H 7650 3800 50  0001 C CNN
F 1 "+3.3V" H 7650 4090 50  0000 C CNN
F 2 "" H 7650 3950 50  0001 C CNN
F 3 "" H 7650 3950 50  0001 C CNN
	1    7650 3950
	1    0    0    -1  
$EndComp
$Comp
L SW_DIP_x01 SW1
U 1 1 5B31030E
P 8000 4050
F 0 "SW1" H 8000 4200 50  0000 C CNN
F 1 "SW_DIP_x01" H 8000 3900 50  0000 C CNN
F 2 "Buttons_Switches_THT:SW_PUSH_6mm_h8mm" H 8000 4050 50  0001 C CNN
F 3 "" H 8000 4050 50  0001 C CNN
	1    8000 4050
	1    0    0    -1  
$EndComp
$Comp
L GND #PWR05
U 1 1 5B310383
P 8450 4200
F 0 "#PWR05" H 8450 3950 50  0001 C CNN
F 1 "GND" H 8450 4050 50  0000 C CNN
F 2 "" H 8450 4200 50  0001 C CNN
F 3 "" H 8450 4200 50  0001 C CNN
	1    8450 4200
	1    0    0    -1  
$EndComp
$Comp
L Conn_01x02 J3
U 1 1 5B3104EE
P 4350 3400
F 0 "J3" H 4350 3500 50  0000 C CNN
F 1 "Conn_01x02" H 4350 3200 50  0000 C CNN
F 2 "Pin_Headers:Pin_Header_Straight_1x02_Pitch2.54mm" H 4350 3400 50  0001 C CNN
F 3 "" H 4350 3400 50  0001 C CNN
	1    4350 3400
	1    0    0    -1  
$EndComp
$Comp
L GND #PWR06
U 1 1 5B310700
P 4400 2650
F 0 "#PWR06" H 4400 2400 50  0001 C CNN
F 1 "GND" H 4400 2500 50  0000 C CNN
F 2 "" H 4400 2650 50  0001 C CNN
F 3 "" H 4400 2650 50  0001 C CNN
	1    4400 2650
	1    0    0    -1  
$EndComp
$Comp
L R R2
U 1 1 5B3109DB
P 4250 4050
F 0 "R2" V 4330 4050 50  0000 C CNN
F 1 "47k" V 4250 4050 50  0000 C CNN
F 2 "Resistors_THT:R_Axial_DIN0204_L3.6mm_D1.6mm_P7.62mm_Horizontal" V 4180 4050 50  0001 C CNN
F 3 "" H 4250 4050 50  0001 C CNN
	1    4250 4050
	0    1    1    0   
$EndComp
$Comp
L GND #PWR07
U 1 1 5B310425
P 7100 4450
F 0 "#PWR07" H 7100 4200 50  0001 C CNN
F 1 "GND" H 7100 4300 50  0000 C CNN
F 2 "" H 7100 4450 50  0001 C CNN
F 3 "" H 7100 4450 50  0001 C CNN
	1    7100 4450
	1    0    0    -1  
$EndComp
$Comp
L C C10
U 1 1 5B30FF47
P 7100 4250
F 0 "C10" H 7125 4350 50  0000 L CNN
F 1 "1n" H 7125 4150 50  0000 L CNN
F 2 "Capacitors_THT:CP_Radial_D5.0mm_P2.50mm" H 7138 4100 50  0001 C CNN
F 3 "" H 7100 4250 50  0001 C CNN
	1    7100 4250
	1    0    0    -1  
$EndComp
$Comp
L GND #PWR08
U 1 1 5B310B30
P 4450 4500
F 0 "#PWR08" H 4450 4250 50  0001 C CNN
F 1 "GND" H 4450 4350 50  0000 C CNN
F 2 "" H 4450 4500 50  0001 C CNN
F 3 "" H 4450 4500 50  0001 C CNN
	1    4450 4500
	1    0    0    -1  
$EndComp
$Comp
L C C11
U 1 1 5B310B37
P 4450 4300
F 0 "C11" H 4475 4400 50  0000 L CNN
F 1 "100n" H 4475 4200 50  0000 L CNN
F 2 "Capacitors_THT:CP_Radial_D5.0mm_P2.50mm" H 4488 4150 50  0001 C CNN
F 3 "" H 4450 4300 50  0001 C CNN
	1    4450 4300
	1    0    0    -1  
$EndComp
$Comp
L +3.3V #PWR09
U 1 1 5B310C04
P 3950 3950
F 0 "#PWR09" H 3950 3800 50  0001 C CNN
F 1 "+3.3V" H 3950 4090 50  0000 C CNN
F 2 "" H 3950 3950 50  0001 C CNN
F 3 "" H 3950 3950 50  0001 C CNN
	1    3950 3950
	1    0    0    -1  
$EndComp
$Comp
L C C6
U 1 1 5B311358
P 4900 3100
F 0 "C6" H 4925 3200 50  0000 L CNN
F 1 "100n" H 4925 3000 50  0000 L CNN
F 2 "Capacitors_THT:CP_Radial_D5.0mm_P2.50mm" H 4938 2950 50  0001 C CNN
F 3 "" H 4900 3100 50  0001 C CNN
	1    4900 3100
	1    0    0    -1  
$EndComp
$Comp
L GND #PWR010
U 1 1 5B311518
P 5000 3350
F 0 "#PWR010" H 5000 3100 50  0001 C CNN
F 1 "GND" H 5000 3200 50  0000 C CNN
F 2 "" H 5000 3350 50  0001 C CNN
F 3 "" H 5000 3350 50  0001 C CNN
	1    5000 3350
	1    0    0    -1  
$EndComp
$Comp
L C C7
U 1 1 5B311920
P 5150 3100
F 0 "C7" H 5175 3200 50  0000 L CNN
F 1 "10u" H 5175 3000 50  0000 L CNN
F 2 "Capacitors_THT:CP_Radial_D5.0mm_P2.50mm" H 5188 2950 50  0001 C CNN
F 3 "" H 5150 3100 50  0001 C CNN
	1    5150 3100
	1    0    0    -1  
$EndComp
Text Label 5150 5150 0    60   ~ 0
MSP430G2553IPW28
Text GLabel 4950 3750 0    60   Input ~ 0
P1.0
Text GLabel 4950 3850 0    60   Input ~ 0
RX
Text GLabel 4950 3950 0    60   Input ~ 0
TX
Text GLabel 10350 1850 1    60   Input ~ 0
RX
Text GLabel 10200 1850 1    60   Input ~ 0
TX
$Comp
L GND #PWR011
U 1 1 5B31102F
P 9900 2500
F 0 "#PWR011" H 9900 2250 50  0001 C CNN
F 1 "GND" H 9900 2350 50  0000 C CNN
F 2 "" H 9900 2500 50  0001 C CNN
F 3 "" H 9900 2500 50  0001 C CNN
	1    9900 2500
	1    0    0    -1  
$EndComp
NoConn ~ 9700 1800
NoConn ~ 9700 1900
Text GLabel 4950 4150 0    60   Input ~ 0
P1.4
Text GLabel 4950 4250 0    60   Input ~ 0
P1.5
Text GLabel 4950 4350 0    60   Input ~ 0
P3.1
Text GLabel 4950 4450 0    60   Input ~ 0
P3.0
Text GLabel 4950 4550 0    60   Input ~ 0
P2.0
Text GLabel 4950 4650 0    60   Input ~ 0
P2.1
Text GLabel 4950 4750 0    60   Input ~ 0
P2.2
Text GLabel 4950 4850 0    60   Input ~ 0
P3.2
Text GLabel 4950 4950 0    60   Input ~ 0
P3.3
Text GLabel 6350 4150 2    60   Input ~ 0
P1.7
Text GLabel 6350 4250 2    60   Input ~ 0
P1.6
Text GLabel 6350 4350 2    60   Input ~ 0
P3.7
Text GLabel 6350 4450 2    60   Input ~ 0
P3.6
Text GLabel 6350 4550 2    60   Input ~ 0
P3.5
Text GLabel 6350 4650 2    60   Input ~ 0
P2.5
Text GLabel 6350 4750 2    60   Input ~ 0
P2.4
Text GLabel 6350 4850 2    60   Input ~ 0
P2.3
Text GLabel 6350 4950 2    60   Input ~ 0
P3.4
Text GLabel 6350 3950 2    60   Input ~ 0
TEST
$Comp
L Conn_01x03 J2
U 1 1 5B312188
P 1500 6850
F 0 "J2" H 1500 7050 50  0000 C CNN
F 1 "Conn_01x03" H 1500 6650 50  0000 C CNN
F 2 "Connectors_JST:JST_EH_B03B-EH-A_03x2.50mm_Straight" H 1500 6850 50  0001 C CNN
F 3 "" H 1500 6850 50  0001 C CNN
	1    1500 6850
	1    0    0    -1  
$EndComp
Text GLabel 1300 6750 0    60   Input ~ 0
P1.0
$Comp
L AP1117-33 U1
U 1 1 5B3128DF
P 2350 1950
F 0 "U1" H 2200 2075 50  0000 C CNN
F 1 "AP1117-33" H 2350 2075 50  0000 L CNN
F 2 "TO_SOT_Packages_THT:TO-220-3_Vertical" H 2350 2150 50  0001 C CNN
F 3 "" H 2450 1700 50  0001 C CNN
	1    2350 1950
	1    0    0    -1  
$EndComp
$Comp
L GND #PWR012
U 1 1 5B313231
P 2350 2400
F 0 "#PWR012" H 2350 2150 50  0001 C CNN
F 1 "GND" H 2350 2250 50  0000 C CNN
F 2 "" H 2350 2400 50  0001 C CNN
F 3 "" H 2350 2400 50  0001 C CNN
	1    2350 2400
	1    0    0    -1  
$EndComp
$Comp
L GND #PWR013
U 1 1 5B31327C
P 1500 2400
F 0 "#PWR013" H 1500 2150 50  0001 C CNN
F 1 "GND" H 1500 2250 50  0000 C CNN
F 2 "" H 1500 2400 50  0001 C CNN
F 3 "" H 1500 2400 50  0001 C CNN
	1    1500 2400
	1    0    0    -1  
$EndComp
$Comp
L GND #PWR014
U 1 1 5B31336B
P 1800 2400
F 0 "#PWR014" H 1800 2150 50  0001 C CNN
F 1 "GND" H 1800 2250 50  0000 C CNN
F 2 "" H 1800 2400 50  0001 C CNN
F 3 "" H 1800 2400 50  0001 C CNN
	1    1800 2400
	1    0    0    -1  
$EndComp
$Comp
L GND #PWR015
U 1 1 5B3133AF
P 3050 2400
F 0 "#PWR015" H 3050 2150 50  0001 C CNN
F 1 "GND" H 3050 2250 50  0000 C CNN
F 2 "" H 3050 2400 50  0001 C CNN
F 3 "" H 3050 2400 50  0001 C CNN
	1    3050 2400
	1    0    0    -1  
$EndComp
$Comp
L C C1
U 1 1 5B313640
P 1700 2150
F 0 "C1" H 1725 2250 50  0000 L CNN
F 1 "470u" H 1725 2050 50  0000 L CNN
F 2 "Capacitors_THT:CP_Radial_D5.0mm_P2.50mm" H 1738 2000 50  0001 C CNN
F 3 "" H 1700 2150 50  0001 C CNN
	1    1700 2150
	1    0    0    -1  
$EndComp
$Comp
L C C2
U 1 1 5B313774
P 1950 2150
F 0 "C2" H 1975 2250 50  0000 L CNN
F 1 "100n" H 1975 2050 50  0000 L CNN
F 2 "Capacitors_THT:CP_Radial_D5.0mm_P2.50mm" H 1988 2000 50  0001 C CNN
F 3 "" H 1950 2150 50  0001 C CNN
	1    1950 2150
	1    0    0    -1  
$EndComp
$Comp
L C C3
U 1 1 5B3138B0
P 2900 2150
F 0 "C3" H 2925 2250 50  0000 L CNN
F 1 "100n" H 2925 2050 50  0000 L CNN
F 2 "Capacitors_THT:CP_Radial_D5.0mm_P2.50mm" H 2938 2000 50  0001 C CNN
F 3 "" H 2900 2150 50  0001 C CNN
	1    2900 2150
	1    0    0    -1  
$EndComp
$Comp
L C C4
U 1 1 5B3138B6
P 3150 2150
F 0 "C4" H 3175 2250 50  0000 L CNN
F 1 "470u" H 3175 2050 50  0000 L CNN
F 2 "Capacitors_THT:CP_Radial_D5.0mm_P2.50mm" H 3188 2000 50  0001 C CNN
F 3 "" H 3150 2150 50  0001 C CNN
	1    3150 2150
	1    0    0    -1  
$EndComp
$Comp
L +5V #PWR016
U 1 1 5B314185
P 1550 1750
F 0 "#PWR016" H 1550 1600 50  0001 C CNN
F 1 "+5V" H 1550 1890 50  0000 C CNN
F 2 "" H 1550 1750 50  0001 C CNN
F 3 "" H 1550 1750 50  0001 C CNN
	1    1550 1750
	1    0    0    -1  
$EndComp
$Comp
L +5V #PWR017
U 1 1 5B31444B
P 900 6700
F 0 "#PWR017" H 900 6550 50  0001 C CNN
F 1 "+5V" H 900 6840 50  0000 C CNN
F 2 "" H 900 6700 50  0001 C CNN
F 3 "" H 900 6700 50  0001 C CNN
	1    900  6700
	1    0    0    -1  
$EndComp
$Comp
L GND #PWR018
U 1 1 5B314866
P 900 7300
F 0 "#PWR018" H 900 7050 50  0001 C CNN
F 1 "GND" H 900 7150 50  0000 C CNN
F 2 "" H 900 7300 50  0001 C CNN
F 3 "" H 900 7300 50  0001 C CNN
	1    900  7300
	1    0    0    -1  
$EndComp
$Comp
L C C5
U 1 1 5B31486C
P 900 7050
F 0 "C5" H 925 7150 50  0000 L CNN
F 1 "100n" H 925 6950 50  0000 L CNN
F 2 "Capacitors_THT:CP_Radial_D5.0mm_P2.50mm" H 938 6900 50  0001 C CNN
F 3 "" H 900 7050 50  0001 C CNN
	1    900  7050
	1    0    0    -1  
$EndComp
$Comp
L Conn_01x11 J5
U 1 1 5B3161A5
P 10100 4500
F 0 "J5" H 10100 5100 50  0000 C CNN
F 1 "Conn_01x11" H 10100 3900 50  0000 C CNN
F 2 "Pin_Headers:Pin_Header_Straight_1x11_Pitch2.54mm" H 10100 4500 50  0001 C CNN
F 3 "" H 10100 4500 50  0001 C CNN
	1    10100 4500
	1    0    0    1   
$EndComp
$Comp
L Conn_01x09 J4
U 1 1 5B316276
P 1550 4350
F 0 "J4" H 1550 4850 50  0000 C CNN
F 1 "Conn_01x09" H 1550 3850 50  0000 C CNN
F 2 "Pin_Headers:Pin_Header_Straight_1x09_Pitch2.54mm" H 1550 4350 50  0001 C CNN
F 3 "" H 1550 4350 50  0001 C CNN
	1    1550 4350
	-1   0    0    -1  
$EndComp
$Comp
L Conn_01x02 J6
U 1 1 5B31650A
P 10650 2000
F 0 "J6" H 10650 2100 50  0000 C CNN
F 1 "Conn_01x02" H 10650 1800 50  0000 C CNN
F 2 "Pin_Headers:Pin_Header_Straight_1x02_Pitch2.54mm" H 10650 2000 50  0001 C CNN
F 3 "" H 10650 2000 50  0001 C CNN
	1    10650 2000
	1    0    0    -1  
$EndComp
Text GLabel 1750 3950 2    60   Input ~ 0
P1.4
Text GLabel 1750 4050 2    60   Input ~ 0
P1.5
Text GLabel 1750 4150 2    60   Input ~ 0
P3.1
Text GLabel 1750 4250 2    60   Input ~ 0
P3.0
Text GLabel 1750 4350 2    60   Input ~ 0
P2.0
Text GLabel 1750 4450 2    60   Input ~ 0
P2.1
Text GLabel 1750 4550 2    60   Input ~ 0
P2.2
Text GLabel 1750 4650 2    60   Input ~ 0
P3.2
Text GLabel 1750 4750 2    60   Input ~ 0
P3.3
Text GLabel 9900 4000 0    60   Input ~ 0
TEST
Text GLabel 9900 4200 0    60   Input ~ 0
P1.7
Text GLabel 9900 4300 0    60   Input ~ 0
P1.6
Text GLabel 9900 4400 0    60   Input ~ 0
P3.7
Text GLabel 9900 4500 0    60   Input ~ 0
P3.6
Text GLabel 9900 4600 0    60   Input ~ 0
P3.5
Text GLabel 9900 4700 0    60   Input ~ 0
P2.5
Text GLabel 9900 4800 0    60   Input ~ 0
P2.4
Text GLabel 9900 4900 0    60   Input ~ 0
P2.3
Text GLabel 9900 5000 0    60   Input ~ 0
P3.4
Text GLabel 6800 4100 3    60   Input ~ 0
~RST
Text GLabel 9600 4100 0    60   Input ~ 0
~RST
$Comp
L +5V #PWR019
U 1 1 5B3211FB
P 10050 1650
F 0 "#PWR019" H 10050 1500 50  0001 C CNN
F 1 "+5V" H 10050 1790 50  0000 C CNN
F 2 "" H 10050 1650 50  0001 C CNN
F 3 "" H 10050 1650 50  0001 C CNN
	1    10050 1650
	1    0    0    -1  
$EndComp
Text Notes 9800 1800 0    60   ~ 12
NC
Text Notes 9800 1900 0    60   ~ 12
NC
Text Notes 650  6350 0    60   ~ 12
Moisture Sensor
Text Notes 9650 3750 0    60   ~ 12
2.54mm Pin Header
Text Notes 1150 3750 0    60   ~ 12
2.54mm Pin Header
Text Notes 1250 1450 0    60   ~ 12
Power Supply
$Comp
L C C12
U 1 1 5B311466
P 10050 2500
F 0 "C12" H 10075 2600 50  0000 L CNN
F 1 "100n" H 10075 2400 50  0000 L CNN
F 2 "Capacitors_THT:CP_Radial_D5.0mm_P2.50mm" H 10088 2350 50  0001 C CNN
F 3 "" H 10050 2500 50  0001 C CNN
	1    10050 2500
	1    0    0    -1  
$EndComp
$Comp
L GND #PWR020
U 1 1 5B311460
P 10050 2700
F 0 "#PWR020" H 10050 2450 50  0001 C CNN
F 1 "GND" H 10050 2550 50  0000 C CNN
F 2 "" H 10050 2700 50  0001 C CNN
F 3 "" H 10050 2700 50  0001 C CNN
	1    10050 2700
	1    0    0    -1  
$EndComp
$Comp
L C C13
U 1 1 5B322FBC
P 10350 2500
F 0 "C13" H 10375 2600 50  0000 L CNN
F 1 "100u" H 10375 2400 50  0000 L CNN
F 2 "Capacitors_THT:CP_Radial_D5.0mm_P2.50mm" H 10388 2350 50  0001 C CNN
F 3 "" H 10350 2500 50  0001 C CNN
	1    10350 2500
	1    0    0    -1  
$EndComp
$Comp
L GND #PWR021
U 1 1 5B322FC2
P 10350 2700
F 0 "#PWR021" H 10350 2450 50  0001 C CNN
F 1 "GND" H 10350 2550 50  0000 C CNN
F 2 "" H 10350 2700 50  0001 C CNN
F 3 "" H 10350 2700 50  0001 C CNN
	1    10350 2700
	1    0    0    -1  
$EndComp
Text Notes 10600 1800 0    60   ~ 12
Pin Header
Text Notes 3700 3500 0    60   ~ 12
Pin\nHeader
$Comp
L +5V #PWR022
U 1 1 5B32432E
P 5700 6750
F 0 "#PWR022" H 5700 6600 50  0001 C CNN
F 1 "+5V" H 5700 6890 50  0000 C CNN
F 2 "" H 5700 6750 50  0001 C CNN
F 3 "" H 5700 6750 50  0001 C CNN
	1    5700 6750
	1    0    0    -1  
$EndComp
$Comp
L +3.3V #PWR023
U 1 1 5B32437A
P 6100 6750
F 0 "#PWR023" H 6100 6600 50  0001 C CNN
F 1 "+3.3V" H 6100 6890 50  0000 C CNN
F 2 "" H 6100 6750 50  0001 C CNN
F 3 "" H 6100 6750 50  0001 C CNN
	1    6100 6750
	1    0    0    -1  
$EndComp
$Comp
L PWR_FLAG #FLG024
U 1 1 5B3243C6
P 5700 7250
F 0 "#FLG024" H 5700 7325 50  0001 C CNN
F 1 "PWR_FLAG" H 5700 7400 50  0000 C CNN
F 2 "" H 5700 7250 50  0001 C CNN
F 3 "" H 5700 7250 50  0001 C CNN
	1    5700 7250
	-1   0    0    1   
$EndComp
$Comp
L PWR_FLAG #FLG025
U 1 1 5B32442C
P 6100 7250
F 0 "#FLG025" H 6100 7325 50  0001 C CNN
F 1 "PWR_FLAG" H 6100 7400 50  0000 C CNN
F 2 "" H 6100 7250 50  0001 C CNN
F 3 "" H 6100 7250 50  0001 C CNN
	1    6100 7250
	-1   0    0    1   
$EndComp
$Comp
L PWR_FLAG #FLG026
U 1 1 5B32448B
P 6550 6750
F 0 "#FLG026" H 6550 6825 50  0001 C CNN
F 1 "PWR_FLAG" H 6550 6900 50  0000 C CNN
F 2 "" H 6550 6750 50  0001 C CNN
F 3 "" H 6550 6750 50  0001 C CNN
	1    6550 6750
	1    0    0    -1  
$EndComp
$Comp
L GND #PWR027
U 1 1 5B3244D0
P 6550 7250
F 0 "#PWR027" H 6550 7000 50  0001 C CNN
F 1 "GND" H 6550 7100 50  0000 C CNN
F 2 "" H 6550 7250 50  0001 C CNN
F 3 "" H 6550 7250 50  0001 C CNN
	1    6550 7250
	1    0    0    -1  
$EndComp
Text Notes 4050 1450 0    157  ~ 31
Node PCB with MSP430g2553 28Pin
$Comp
L LoRa_DRF1276DM-RESCUE-Node-RESCUE-Node U3
U 1 1 5B323471
P 9200 2100
F 0 "U3" H 9450 1700 60  0000 C CNN
F 1 "LoRa_DRF1276DM" H 9250 2550 60  0000 C CNN
F 2 "LoRa_DRF1276DM:lora" H 9350 2300 60  0001 C CNN
F 3 "" H 9350 2300 60  0001 C CNN
	1    9200 2100
	1    0    0    -1  
$EndComp
$Comp
L +3.3V #PWR028
U 1 1 5B326114
P 2900 1750
F 0 "#PWR028" H 2900 1600 50  0001 C CNN
F 1 "+3.3V" H 2900 1890 50  0000 C CNN
F 2 "" H 2900 1750 50  0001 C CNN
F 3 "" H 2900 1750 50  0001 C CNN
	1    2900 1750
	1    0    0    -1  
$EndComp
Wire Wire Line
	7250 3700 7250 3900
Wire Wire Line
	6350 3650 6400 3650
Wire Wire Line
	6400 3650 6400 3450
Wire Wire Line
	6400 3450 6500 3450
Wire Wire Line
	6500 3450 6500 3550
Wire Wire Line
	6350 3750 6850 3750
Wire Wire Line
	7150 3750 7250 3750
Connection ~ 7250 3750
Wire Wire Line
	6700 3700 6700 3750
Connection ~ 6700 3750
Wire Wire Line
	6700 3500 6700 3450
Wire Wire Line
	6700 3450 7250 3450
Wire Wire Line
	7250 3450 7250 3500
Wire Wire Line
	7000 3300 7000 3450
Connection ~ 7000 3450
Wire Wire Line
	6350 4050 7200 4050
Connection ~ 7100 4050
Wire Wire Line
	7650 4050 7650 3950
Connection ~ 7650 4050
Wire Wire Line
	8300 4050 8450 4050
Wire Wire Line
	8450 4050 8450 4200
Wire Wire Line
	4100 3650 4950 3650
Wire Wire Line
	4100 3650 4100 3500
Wire Wire Line
	4100 3500 4150 3500
Wire Wire Line
	4150 3400 4100 3400
Wire Wire Line
	4100 3400 4100 3200
Wire Wire Line
	4100 2900 4100 2850
Wire Wire Line
	4100 2550 4100 2450
Wire Wire Line
	4100 2450 4400 2450
Wire Wire Line
	4400 2450 4400 2650
Wire Wire Line
	4750 2850 4750 3650
Wire Wire Line
	7100 4450 7100 4400
Wire Wire Line
	7100 4100 7100 4050
Wire Wire Line
	4450 4500 4450 4450
Wire Wire Line
	4450 4050 4450 4150
Wire Wire Line
	4400 4050 4950 4050
Connection ~ 4450 4050
Wire Wire Line
	3950 3950 3950 4050
Wire Wire Line
	4750 2950 5150 2950
Connection ~ 4750 2950
Connection ~ 4900 2950
Wire Wire Line
	1300 1950 2050 1950
Wire Wire Line
	1500 2050 1500 2400
Wire Wire Line
	1300 2050 1500 2050
Wire Wire Line
	1700 2000 1700 1950
Connection ~ 1700 1950
Wire Wire Line
	1950 2000 1950 1950
Connection ~ 1950 1950
Wire Wire Line
	1700 2300 1700 2350
Wire Wire Line
	1700 2350 1950 2350
Wire Wire Line
	1950 2350 1950 2300
Wire Wire Line
	1800 2400 1800 2350
Connection ~ 1800 2350
Wire Wire Line
	2350 2400 2350 2250
Wire Wire Line
	2900 1750 2900 2000
Wire Wire Line
	2650 1950 3150 1950
Wire Wire Line
	3150 1950 3150 2000
Connection ~ 2900 1950
Wire Wire Line
	3150 2350 3150 2300
Wire Wire Line
	2900 2350 3150 2350
Wire Wire Line
	2900 2350 2900 2300
Wire Wire Line
	1550 1950 1550 1750
Connection ~ 1550 1950
Wire Wire Line
	900  6700 900  6900
Wire Wire Line
	700  6850 1300 6850
Wire Wire Line
	900  7200 900  7300
Connection ~ 900  6850
Wire Wire Line
	700  7250 1200 7250
Wire Wire Line
	1200 7250 1200 6950
Wire Wire Line
	1200 6950 1300 6950
Connection ~ 900  7250
Wire Wire Line
	3050 2400 3050 2350
Connection ~ 3050 2350
Wire Wire Line
	9600 4100 9900 4100
Wire Wire Line
	6800 4100 6800 4050
Connection ~ 6800 4050
Wire Wire Line
	3950 4050 4100 4050
Wire Wire Line
	10050 2700 10050 2650
Wire Wire Line
	10350 2700 10350 2650
Wire Wire Line
	5700 7250 5700 6750
Wire Wire Line
	6100 6750 6100 7250
Wire Wire Line
	6550 7250 6550 6750
Wire Wire Line
	6350 3850 6700 3850
Wire Wire Line
	6700 3850 6700 3900
Wire Wire Line
	6700 3900 7250 3900
Wire Wire Line
	9700 2000 10450 2000
Wire Wire Line
	10350 2000 10350 1850
Wire Wire Line
	10200 1850 10200 2100
Wire Wire Line
	9700 2100 10450 2100
Connection ~ 10200 2100
Connection ~ 10350 2000
Wire Wire Line
	9700 2200 9900 2200
Wire Wire Line
	9900 2200 9900 2500
Wire Wire Line
	9700 2400 9900 2400
Connection ~ 9900 2400
Wire Wire Line
	9700 2300 10350 2300
Wire Wire Line
	10350 2300 10350 2350
Wire Wire Line
	10050 1650 10050 2350
Connection ~ 10050 2300
Connection ~ 4750 3650
Wire Wire Line
	4900 3350 5150 3350
Wire Wire Line
	4900 3350 4900 3250
Wire Wire Line
	5150 3350 5150 3250
Connection ~ 5000 3350
Wire Wire Line
	7500 4050 7700 4050
Wire Notes Line
	450  5850 11250 5850
Wire Notes Line
	3500 450  3500 7800
Wire Notes Line
	3500 2900 500  2900
Wire Notes Line
	8600 450  8600 5850
Wire Notes Line
	8600 2950 11250 2950
Text Notes 5900 6350 0    60   ~ 0
Power Flag
$Comp
L Conn_01x03 J7
U 1 1 5B436AC0
P 3100 6850
F 0 "J7" H 3100 7050 50  0000 C CNN
F 1 "Conn_01x03" H 3100 6650 50  0000 C CNN
F 2 "Connectors_JST:JST_EH_B03B-EH-A_03x2.50mm_Straight" H 3100 6850 50  0001 C CNN
F 3 "" H 3100 6850 50  0001 C CNN
	1    3100 6850
	1    0    0    -1  
$EndComp
Text GLabel 2900 6750 0    60   Input ~ 0
P1.4
$Comp
L +5V #PWR029
U 1 1 5B436AC7
P 2500 6700
F 0 "#PWR029" H 2500 6550 50  0001 C CNN
F 1 "+5V" H 2500 6840 50  0000 C CNN
F 2 "" H 2500 6700 50  0001 C CNN
F 3 "" H 2500 6700 50  0001 C CNN
	1    2500 6700
	1    0    0    -1  
$EndComp
$Comp
L GND #PWR030
U 1 1 5B436ACD
P 2500 7300
F 0 "#PWR030" H 2500 7050 50  0001 C CNN
F 1 "GND" H 2500 7150 50  0000 C CNN
F 2 "" H 2500 7300 50  0001 C CNN
F 3 "" H 2500 7300 50  0001 C CNN
	1    2500 7300
	1    0    0    -1  
$EndComp
$Comp
L C C16
U 1 1 5B436AD3
P 2500 7050
F 0 "C16" H 2525 7150 50  0000 L CNN
F 1 "100n" H 2525 6950 50  0000 L CNN
F 2 "Capacitors_THT:CP_Radial_D5.0mm_P2.50mm" H 2538 6900 50  0001 C CNN
F 3 "" H 2500 7050 50  0001 C CNN
	1    2500 7050
	1    0    0    -1  
$EndComp
Text Notes 2450 6350 0    60   ~ 12
Sensor 2
Wire Wire Line
	2500 6700 2500 6900
Wire Wire Line
	2300 6850 2900 6850
Wire Wire Line
	2500 7200 2500 7300
Connection ~ 2500 6850
Wire Wire Line
	2300 7250 2800 7250
Wire Wire Line
	2800 7250 2800 6950
Wire Wire Line
	2800 6950 2900 6950
Connection ~ 2500 7250
$Comp
L Conn_01x03 J8
U 1 1 5B436C42
P 4750 6950
F 0 "J8" H 4750 7150 50  0000 C CNN
F 1 "Conn_01x03" H 4750 6750 50  0000 C CNN
F 2 "Connectors_JST:JST_EH_B03B-EH-A_03x2.50mm_Straight" H 4750 6950 50  0001 C CNN
F 3 "" H 4750 6950 50  0001 C CNN
	1    4750 6950
	1    0    0    -1  
$EndComp
Text GLabel 4550 6850 0    60   Input ~ 0
P1.5
$Comp
L +5V #PWR031
U 1 1 5B436C49
P 4150 6800
F 0 "#PWR031" H 4150 6650 50  0001 C CNN
F 1 "+5V" H 4150 6940 50  0000 C CNN
F 2 "" H 4150 6800 50  0001 C CNN
F 3 "" H 4150 6800 50  0001 C CNN
	1    4150 6800
	1    0    0    -1  
$EndComp
$Comp
L GND #PWR032
U 1 1 5B436C4F
P 4150 7400
F 0 "#PWR032" H 4150 7150 50  0001 C CNN
F 1 "GND" H 4150 7250 50  0000 C CNN
F 2 "" H 4150 7400 50  0001 C CNN
F 3 "" H 4150 7400 50  0001 C CNN
	1    4150 7400
	1    0    0    -1  
$EndComp
$Comp
L C C18
U 1 1 5B436C55
P 4150 7150
F 0 "C18" H 4175 7250 50  0000 L CNN
F 1 "100n" H 4175 7050 50  0000 L CNN
F 2 "Capacitors_THT:CP_Radial_D5.0mm_P2.50mm" H 4188 7000 50  0001 C CNN
F 3 "" H 4150 7150 50  0001 C CNN
	1    4150 7150
	1    0    0    -1  
$EndComp
Text Notes 4100 6350 0    60   ~ 12
Sensor 3
Wire Wire Line
	4150 6800 4150 7000
Wire Wire Line
	3950 6950 4550 6950
Wire Wire Line
	4150 7300 4150 7400
Connection ~ 4150 6950
Wire Wire Line
	3950 7350 4450 7350
Wire Wire Line
	4450 7350 4450 7050
Wire Wire Line
	4450 7050 4550 7050
Connection ~ 4150 7350
$Comp
L C C14
U 1 1 5B438003
P 700 7050
F 0 "C14" H 725 7150 50  0000 L CNN
F 1 "100n" H 725 6950 50  0000 L CNN
F 2 "Capacitors_THT:CP_Radial_D5.0mm_P2.50mm" H 738 6900 50  0001 C CNN
F 3 "" H 700 7050 50  0001 C CNN
	1    700  7050
	1    0    0    -1  
$EndComp
$Comp
L C C15
U 1 1 5B43807A
P 2300 7050
F 0 "C15" H 2325 7150 50  0000 L CNN
F 1 "100n" H 2325 6950 50  0000 L CNN
F 2 "Capacitors_THT:CP_Radial_D5.0mm_P2.50mm" H 2338 6900 50  0001 C CNN
F 3 "" H 2300 7050 50  0001 C CNN
	1    2300 7050
	1    0    0    -1  
$EndComp
$Comp
L C C17
U 1 1 5B43814A
P 3950 7150
F 0 "C17" H 3975 7250 50  0000 L CNN
F 1 "100n" H 3975 7050 50  0000 L CNN
F 2 "Capacitors_THT:CP_Radial_D5.0mm_P2.50mm" H 3988 7000 50  0001 C CNN
F 3 "" H 3950 7150 50  0001 C CNN
	1    3950 7150
	1    0    0    -1  
$EndComp
Wire Wire Line
	700  6900 700  6850
Wire Wire Line
	700  7200 700  7250
Wire Wire Line
	2300 6900 2300 6850
Wire Wire Line
	2300 7200 2300 7250
Wire Wire Line
	3950 7000 3950 6950
Wire Wire Line
	3950 7300 3950 7350
$Comp
L Jack-DC J1
U 1 1 5B439058
P 1000 2050
F 0 "J1" H 1000 2260 50  0000 C CNN
F 1 "Jack-DC" H 1000 1875 50  0000 C CNN
F 2 "DC_JACK:DC_JACK" H 1050 2010 50  0001 C CNN
F 3 "" H 1050 2010 50  0001 C CNN
	1    1000 2050
	1    0    0    -1  
$EndComp
Wire Wire Line
	1300 2150 1400 2150
Wire Wire Line
	1400 2150 1400 2050
Connection ~ 1400 2050
Wire Notes Line
	5400 7800 5400 5850
Wire Notes Line
	1950 5850 1950 7800
$EndSCHEMATC
