PCBNEW-LibModule-V1  
# encoding utf-8
Units mm
$INDEX
SOP65P640X120-20N
$EndINDEX
$MODULE SOP65P640X120-20N
Po 0 0 0 15 00000000 00000000 ~~
Li SOP65P640X120-20N
Cd 
Sc 00000000
At SMD
Op 0 0 0
.SolderMask 0
.SolderPaste 0
T0 -0.805598 -4.05242 0.640952 0.640952 0 0.05 N V 21 "SOP65P640X120-20N"
T1 -0.579553 4.10456 0.641714 0.641714 0 0.05 N V 21 "VAL**"
DS -2.2 3.25 -2.2 -3.25 0.127 24
DS -2.2 -3.25 2.2 -3.25 0.127 24
DS 2.2 -3.25 2.2 3.25 0.127 24
DS 2.2 3.25 -2.2 3.25 0.127 24
DS -2.2 -3.25 2.2 -3.25 0.127 21
DS -2.2 3.25 2.2 3.25 0.127 21
DS -3.91 3.38 -3.91 -3.38 0.05 26
DS -3.91 -3.38 -2.5 -3.38 0.05 26
DS -2.5 -3.38 -2.5 -3.5 0.05 26
DS -2.5 -3.5 2.5 -3.5 0.05 26
DS 2.5 -3.5 2.5 -3.38 0.05 26
DS 2.5 -3.38 3.91 -3.38 0.05 26
DS 3.91 -3.38 3.91 3.38 0.05 26
DS 3.91 3.38 2.5 3.38 0.05 26
DS 2.5 3.38 2.5 3.5 0.05 26
DS 2.5 3.5 -2.5 3.5 0.05 26
DS -2.5 3.5 -2.5 3.38 0.05 26
DS -2.5 3.38 -3.91 3.38 0.05 26
DC -4.32 -2.97 -4.22 -2.97 0.2 21
DC -4.32 -2.97 -4.22 -2.97 0.2 24
$PAD
Sh "1" R 1.57 0.41 0 0 0
At SMD N 00888000
.SolderMask 0
.SolderPaste 0
Ne 0 ""
Po -2.87 -2.925
$EndPAD
$PAD
Sh "2" R 1.57 0.41 0 0 0
At SMD N 00888000
.SolderMask 0
.SolderPaste 0
Ne 0 ""
Po -2.87 -2.275
$EndPAD
$PAD
Sh "3" R 1.57 0.41 0 0 0
At SMD N 00888000
.SolderMask 0
.SolderPaste 0
Ne 0 ""
Po -2.87 -1.625
$EndPAD
$PAD
Sh "4" R 1.57 0.41 0 0 0
At SMD N 00888000
.SolderMask 0
.SolderPaste 0
Ne 0 ""
Po -2.87 -0.975
$EndPAD
$PAD
Sh "5" R 1.57 0.41 0 0 0
At SMD N 00888000
.SolderMask 0
.SolderPaste 0
Ne 0 ""
Po -2.87 -0.325
$EndPAD
$PAD
Sh "6" R 1.57 0.41 0 0 0
At SMD N 00888000
.SolderMask 0
.SolderPaste 0
Ne 0 ""
Po -2.87 0.325
$EndPAD
$PAD
Sh "7" R 1.57 0.41 0 0 0
At SMD N 00888000
.SolderMask 0
.SolderPaste 0
Ne 0 ""
Po -2.87 0.975
$EndPAD
$PAD
Sh "8" R 1.57 0.41 0 0 0
At SMD N 00888000
.SolderMask 0
.SolderPaste 0
Ne 0 ""
Po -2.87 1.625
$EndPAD
$PAD
Sh "9" R 1.57 0.41 0 0 0
At SMD N 00888000
.SolderMask 0
.SolderPaste 0
Ne 0 ""
Po -2.87 2.275
$EndPAD
$PAD
Sh "10" R 1.57 0.41 0 0 0
At SMD N 00888000
.SolderMask 0
.SolderPaste 0
Ne 0 ""
Po -2.87 2.925
$EndPAD
$PAD
Sh "11" R 1.57 0.41 0 0 1800
At SMD N 00888000
.SolderMask 0
.SolderPaste 0
Ne 0 ""
Po 2.87 2.925
$EndPAD
$PAD
Sh "12" R 1.57 0.41 0 0 1800
At SMD N 00888000
.SolderMask 0
.SolderPaste 0
Ne 0 ""
Po 2.87 2.275
$EndPAD
$PAD
Sh "13" R 1.57 0.41 0 0 1800
At SMD N 00888000
.SolderMask 0
.SolderPaste 0
Ne 0 ""
Po 2.87 1.625
$EndPAD
$PAD
Sh "14" R 1.57 0.41 0 0 1800
At SMD N 00888000
.SolderMask 0
.SolderPaste 0
Ne 0 ""
Po 2.87 0.975
$EndPAD
$PAD
Sh "15" R 1.57 0.41 0 0 1800
At SMD N 00888000
.SolderMask 0
.SolderPaste 0
Ne 0 ""
Po 2.87 0.325
$EndPAD
$PAD
Sh "16" R 1.57 0.41 0 0 1800
At SMD N 00888000
.SolderMask 0
.SolderPaste 0
Ne 0 ""
Po 2.87 -0.325
$EndPAD
$PAD
Sh "17" R 1.57 0.41 0 0 1800
At SMD N 00888000
.SolderMask 0
.SolderPaste 0
Ne 0 ""
Po 2.87 -0.975
$EndPAD
$PAD
Sh "18" R 1.57 0.41 0 0 1800
At SMD N 00888000
.SolderMask 0
.SolderPaste 0
Ne 0 ""
Po 2.87 -1.625
$EndPAD
$PAD
Sh "19" R 1.57 0.41 0 0 1800
At SMD N 00888000
.SolderMask 0
.SolderPaste 0
Ne 0 ""
Po 2.87 -2.275
$EndPAD
$PAD
Sh "20" R 1.57 0.41 0 0 1800
At SMD N 00888000
.SolderMask 0
.SolderPaste 0
Ne 0 ""
Po 2.87 -2.925
$EndPAD
$EndMODULE SOP65P640X120-20N
