(module 08x2.50mm (layer F.Cu) (tedit 5B9BA4E3)
  (descr "JST EH series connector, B08B-EH-A, 2.50mm pitch, top entry")
  (tags "connector jst eh top vertical straight")
  (fp_text reference J6 (at 21.523 0.568 90) (layer F.SilkS)
    (effects (font (size 1 1) (thickness 0.15)))
  )
  (fp_text value Conn_01x08_Male (at 8.75 3.5) (layer F.Fab)
    (effects (font (size 1 1) (thickness 0.15)))
  )
  (fp_text user %R (at 21.523 0.568 90) (layer F.Fab)
    (effects (font (size 1 1) (thickness 0.15)))
  )
  (pad 1 thru_hole rect (at 0 0) (size 1.85 1.85) (drill 0.8) (layers *.Cu *.Mask))
  (pad 2 thru_hole rect (at 2.5 0) (size 1.85 1.85) (drill 0.8) (layers *.Cu *.Mask))
  (pad 3 thru_hole rect (at 5 0) (size 1.85 1.85) (drill 0.8) (layers *.Cu *.Mask))
  (pad 4 thru_hole rect (at 7.5 0) (size 1.85 1.85) (drill 0.8) (layers *.Cu *.Mask))
  (pad 5 thru_hole circle (at 10 0) (size 1.85 1.85) (drill 0.8) (layers *.Cu *.Mask))
  (pad 6 thru_hole circle (at 12.5 0) (size 1.85 1.85) (drill 0.8) (layers *.Cu *.Mask))
  (pad 7 thru_hole circle (at 15 0) (size 1.85 1.85) (drill 0.8) (layers *.Cu *.Mask))
  (pad 8 thru_hole circle (at 17.5 0) (size 1.85 1.85) (drill 0.8) (layers *.Cu *.Mask))
  (model Connectors_JST.3dshapes/JST_EH_B08B-EH-A_08x2.50mm_Straight.wrl
    (at (xyz 0 0 0))
    (scale (xyz 1 1 1))
    (rotate (xyz 0 0 0))
  )
)
