(module gprs (layer F.Cu) (tedit 5B2A4A01)
  (fp_text reference REF** (at 13.1 14.9) (layer F.SilkS)
    (effects (font (size 1 1) (thickness 0.15)))
  )
  (fp_text value M95 (at -14 -15.6) (layer F.Fab)
    (effects (font (size 1 1) (thickness 0.15)))
  )
  (fp_line (start 15.2 -14.2) (end -15.8 -14.2) (layer F.SilkS) (width 0.15))
  (fp_line (start 15.2 13.8) (end -15.8 13.8) (layer F.SilkS) (width 0.15))
  (fp_line (start -15.8 13.8) (end -15.8 -14.2) (layer F.SilkS) (width 0.15))
  (fp_line (start 15.2 13.8) (end 15.2 -14.2) (layer F.SilkS) (width 0.15))
  (pad 1 thru_hole oval (at -11.2 -6.25) (size 3 1.25) (drill 0.7) (layers *.Cu *.Mask))
  (pad 2 thru_hole oval (at -11.2 -4.25) (size 3 1.25) (drill 0.7) (layers *.Cu *.Mask))
  (pad 3 thru_hole oval (at -11.2 -2.25) (size 3 1.25) (drill 0.7) (layers *.Cu *.Mask))
  (pad 4 thru_hole oval (at -11.2 -0.25) (size 3 1.25) (drill 0.7) (layers *.Cu *.Mask))
  (pad 5 thru_hole oval (at -11.2 1.75) (size 3 1.25) (drill 0.7) (layers *.Cu *.Mask))
  (pad 6 thru_hole oval (at -11.2 3.75) (size 3 1.25) (drill 0.7) (layers *.Cu *.Mask))
  (pad 7 thru_hole oval (at -11.2 5.75) (size 3 1.25) (drill 0.7) (layers *.Cu *.Mask))
  (pad 8 thru_hole oval (at -11.2 7.75) (size 3 1.25) (drill 0.7) (layers *.Cu *.Mask))
  (pad 9 thru_hole oval (at -11.2 9.75) (size 3 1.25) (drill 0.7) (layers *.Cu *.Mask))
  (pad 10 thru_hole oval (at -11.2 11.75) (size 3 1.25) (drill 0.7) (layers *.Cu *.Mask))
  (pad 11 thru_hole oval (at 11.3 11.75) (size 3 1.25) (drill 0.7) (layers *.Cu *.Mask))
  (pad 12 thru_hole oval (at 11.3 9.75) (size 3 1.25) (drill 0.7) (layers *.Cu *.Mask))
  (pad 13 thru_hole oval (at 11.3 7.75) (size 3 1.25) (drill 0.7) (layers *.Cu *.Mask))
  (pad 14 thru_hole oval (at 11.3 5.75) (size 3 1.25) (drill 0.7) (layers *.Cu *.Mask))
  (pad 15 thru_hole oval (at 11.3 3.75) (size 3 1.25) (drill 0.7) (layers *.Cu *.Mask))
  (pad 16 thru_hole oval (at 11.3 1.75) (size 3 1.25) (drill 0.7) (layers *.Cu *.Mask))
  (pad 17 thru_hole oval (at 11.3 -0.25) (size 3 1.25) (drill 0.7) (layers *.Cu *.Mask))
  (pad 18 thru_hole oval (at 11.3 -2.25) (size 3 1.25) (drill 0.7) (layers *.Cu *.Mask))
  (pad 19 thru_hole oval (at 11.3 -4.25) (size 3 1.25) (drill 0.7) (layers *.Cu *.Mask))
  (pad 20 thru_hole oval (at 11.3 -6.25) (size 3 1.25) (drill 0.7) (layers *.Cu *.Mask))
)
