%!PS-Adobe-3.0
%%Creator: PCBNEW
%%CreationDate: Thu Sep 20 14:43:31 2018
%%Title: /mnt/Upanishad/SOiL/SOIL-Automated-Smart-Irrigation-System/PCB Design/Kitchen (copy)/GERBER/KitchenX-drl_map.ps
%%Pages: 1
%%PageOrder: Ascend
%%BoundingBox: 0 0 596 842
%%DocumentMedia: A4 595 842 0 () ()
%%Orientation: Landscape
%%EndComments
%%BeginProlog
/line { newpath moveto lineto stroke } bind def
/cir0 { newpath 0 360 arc stroke } bind def
/cir1 { newpath 0 360 arc gsave fill grestore stroke } bind def
/cir2 { newpath 0 360 arc gsave fill grestore stroke } bind def
/arc0 { newpath arc stroke } bind def
/arc1 { newpath 4 index 4 index moveto arc closepath gsave fill
    grestore stroke } bind def
/arc2 { newpath 4 index 4 index moveto arc closepath gsave fill
    grestore stroke } bind def
/poly0 { stroke } bind def
/poly1 { closepath gsave fill grestore stroke } bind def
/poly2 { closepath gsave fill grestore stroke } bind def
/rect0 { rectstroke } bind def
/rect1 { rectfill } bind def
/rect2 { rectfill } bind def
/linemode0 { 0 setlinecap 0 setlinejoin 0 setlinewidth } bind def
/linemode1 { 1 setlinecap 1 setlinejoin } bind def
/dashedline { [200] 100 setdash } bind def
/solidline { [] 0 setdash } bind def
/phantomshow { moveto
    /KicadFont findfont 0.000001 scalefont setfont
    show } bind def
/textshow { gsave
    findfont exch scalefont setfont concat 1 scale 0 0 moveto show
    } bind def
/reencodefont {
  findfont dup length dict begin
  { 1 index /FID ne
    { def }
    { pop pop } ifelse
  } forall
  /Encoding ISOLatin1Encoding def
  currentdict
  end } bind def
/KicadFont /Helvetica reencodefont definefont pop
/KicadFont-Bold /Helvetica-Bold reencodefont definefont pop
/KicadFont-Oblique /Helvetica-Oblique reencodefont definefont pop
/KicadFont-BoldOblique /Helvetica-BoldOblique reencodefont definefont pop
%%EndProlog
%%Page: 1 1
%%BeginPageSetup
gsave
0.0072 0.0072 scale
linemode1
82680 0 translate 90 rotate
150 setlinewidth
%%EndPageSetup
0 0 0 setrgbcolor
177.165 setlinewidth
newpath
81496.5 75592.5 moveto
81496.5 40159.5 lineto
stroke
0 0 0 setrgbcolor
newpath
35433.5 75592.5 moveto
81496.5 75592.5 lineto
stroke
0 0 0 setrgbcolor
newpath
35433.5 40159.5 moveto
35433.5 75592.5 lineto
stroke
0 0 0 setrgbcolor
newpath
81496.5 40159.5 moveto
35433.5 40159.5 lineto
stroke
78.7394 setlinewidth
newpath
38681.5 70454.7 moveto
39035.9 70100.4 lineto
stroke
newpath
39035.9 70454.7 moveto
38681.5 70100.4 lineto
stroke
newpath
38681.5 66911.4 moveto
39035.9 66557.1 lineto
stroke
newpath
39035.9 66911.4 moveto
38681.5 66557.1 lineto
stroke
newpath
38724.1 73470.1 moveto
39078.4 73115.8 lineto
stroke
newpath
39078.4 73470.1 moveto
38724.1 73115.8 lineto
stroke
newpath
38874.1 45720.1 moveto
39228.4 45365.8 lineto
stroke
newpath
39228.4 45720.1 moveto
38874.1 45365.8 lineto
stroke
newpath
38874.1 42870.1 moveto
39228.4 42515.8 lineto
stroke
newpath
39228.4 42870.1 moveto
38874.1 42515.8 lineto
stroke
newpath
42174.1 73470.1 moveto
42528.4 73115.8 lineto
stroke
newpath
42528.4 73470.1 moveto
42174.1 73115.8 lineto
stroke
newpath
42224.8 70454.7 moveto
42579.2 70100.4 lineto
stroke
newpath
42579.2 70454.7 moveto
42224.8 70100.4 lineto
stroke
newpath
42224.8 66911.4 moveto
42579.2 66557.1 lineto
stroke
newpath
42579.2 66911.4 moveto
42224.8 66557.1 lineto
stroke
newpath
43524.1 45720.1 moveto
43878.4 45365.8 lineto
stroke
newpath
43878.4 45720.1 moveto
43524.1 45365.8 lineto
stroke
newpath
43524.1 42870.1 moveto
43878.4 42515.8 lineto
stroke
newpath
43878.4 42870.1 moveto
43524.1 42515.8 lineto
stroke
newpath
45768.2 70454.7 moveto
46122.5 70100.4 lineto
stroke
newpath
46122.5 70454.7 moveto
45768.2 70100.4 lineto
stroke
newpath
45774.1 73470.1 moveto
46128.4 73115.8 lineto
stroke
newpath
46128.4 73470.1 moveto
45774.1 73115.8 lineto
stroke
newpath
48624.1 45720.1 moveto
48978.4 45365.8 lineto
stroke
newpath
48978.4 45720.1 moveto
48624.1 45365.8 lineto
stroke
newpath
48624.1 42870.1 moveto
48978.4 42515.8 lineto
stroke
newpath
48978.4 42870.1 moveto
48624.1 42515.8 lineto
stroke
newpath
49311.5 70454.7 moveto
49665.8 70100.4 lineto
stroke
newpath
49665.8 70454.7 moveto
49311.5 70100.4 lineto
stroke
newpath
49374.1 73470.1 moveto
49728.4 73115.8 lineto
stroke
newpath
49728.4 73470.1 moveto
49374.1 73115.8 lineto
stroke
newpath
51224.8 57611.4 moveto
51579.2 57257.1 lineto
stroke
newpath
51579.2 57611.4 moveto
51224.8 57257.1 lineto
stroke
newpath
51224.8 54611.4 moveto
51579.2 54257.1 lineto
stroke
newpath
51579.2 54611.4 moveto
51224.8 54257.1 lineto
stroke
newpath
51224.8 51611.4 moveto
51579.2 51257.1 lineto
stroke
newpath
51579.2 51611.4 moveto
51224.8 51257.1 lineto
stroke
newpath
51224.8 48611.4 moveto
51579.2 48257.1 lineto
stroke
newpath
51579.2 48611.4 moveto
51224.8 48257.1 lineto
stroke
newpath
52824.1 73470.1 moveto
53178.4 73115.8 lineto
stroke
newpath
53178.4 73470.1 moveto
52824.1 73115.8 lineto
stroke
newpath
52854.8 70454.7 moveto
53209.1 70100.4 lineto
stroke
newpath
53209.1 70454.7 moveto
52854.8 70100.4 lineto
stroke
newpath
54174.1 57570.1 moveto
54528.4 57215.8 lineto
stroke
newpath
54528.4 57570.1 moveto
54174.1 57215.8 lineto
stroke
newpath
54174.1 54570.1 moveto
54528.4 54215.8 lineto
stroke
newpath
54528.4 54570.1 moveto
54174.1 54215.8 lineto
stroke
newpath
54174.1 51570.1 moveto
54528.4 51215.8 lineto
stroke
newpath
54528.4 51570.1 moveto
54174.1 51215.8 lineto
stroke
newpath
54174.1 48570.1 moveto
54528.4 48215.8 lineto
stroke
newpath
54528.4 48570.1 moveto
54174.1 48215.8 lineto
stroke
newpath
55074.1 45720.1 moveto
55428.4 45365.8 lineto
stroke
newpath
55428.4 45720.1 moveto
55074.1 45365.8 lineto
stroke
newpath
57324.1 42870.1 moveto
57678.4 42515.8 lineto
stroke
newpath
57678.4 42870.1 moveto
57324.1 42515.8 lineto
stroke
newpath
58224.1 73470.1 moveto
58578.4 73115.8 lineto
stroke
newpath
58578.4 73470.1 moveto
58224.1 73115.8 lineto
stroke
newpath
58224.1 70620.1 moveto
58578.4 70265.8 lineto
stroke
newpath
58578.4 70620.1 moveto
58224.1 70265.8 lineto
stroke
newpath
58224.1 67770.1 moveto
58578.4 67415.8 lineto
stroke
newpath
58578.4 67770.1 moveto
58224.1 67415.8 lineto
stroke
newpath
61974.1 42870.1 moveto
62328.4 42515.8 lineto
stroke
newpath
62328.4 42870.1 moveto
61974.1 42515.8 lineto
stroke
newpath
63774.1 49770.1 moveto
64128.4 49415.8 lineto
stroke
newpath
64128.4 49770.1 moveto
63774.1 49415.8 lineto
stroke
newpath
65424.1 44220.1 moveto
65778.4 43865.8 lineto
stroke
newpath
65778.4 44220.1 moveto
65424.1 43865.8 lineto
stroke
newpath
65874.1 51570.1 moveto
66228.4 51215.8 lineto
stroke
newpath
66228.4 51570.1 moveto
65874.1 51215.8 lineto
stroke
newpath
66174.1 53820.1 moveto
66528.4 53465.8 lineto
stroke
newpath
66528.4 53820.1 moveto
66174.1 53465.8 lineto
stroke
newpath
66324.1 65220.1 moveto
66678.4 64865.8 lineto
stroke
newpath
66678.4 65220.1 moveto
66324.1 64865.8 lineto
stroke
newpath
68574.1 43020.1 moveto
68928.4 42665.8 lineto
stroke
newpath
68928.4 43020.1 moveto
68574.1 42665.8 lineto
stroke
newpath
69774.1 65220.1 moveto
70128.4 64865.8 lineto
stroke
newpath
70128.4 65220.1 moveto
69774.1 64865.8 lineto
stroke
newpath
71124.1 45270.1 moveto
71478.4 44915.8 lineto
stroke
newpath
71478.4 45270.1 moveto
71124.1 44915.8 lineto
stroke
newpath
71424.1 47970.1 moveto
71778.4 47615.8 lineto
stroke
newpath
71778.4 47970.1 moveto
71424.1 47615.8 lineto
stroke
newpath
73224.1 65220.1 moveto
73578.4 64865.8 lineto
stroke
newpath
73578.4 65220.1 moveto
73224.1 64865.8 lineto
stroke
newpath
74124.1 43020.1 moveto
74478.4 42665.8 lineto
stroke
newpath
74478.4 43020.1 moveto
74124.1 42665.8 lineto
stroke
58251.2 62942.9 236.22 cir0
59751.2 60692.9 236.22 cir0
59751.2 55742.9 236.22 cir0
59751.2 45692.9 236.22 cir0
60945.3 62954.7 236.22 cir0
62946.2 65342.9 236.22 cir0
64252.4 62954.7 236.22 cir0
66614.6 60946.9 236.22 cir0
68256.2 57047.9 236.22 cir0
68271.2 55892.9 236.22 cir0
75606.2 57047.9 236.22 cir0
76251.2 55892.9 236.22 cir0
newpath
39351.2 62424.4 moveto
39351.2 61361.4 lineto
stroke
newpath
38819.7 61892.9 moveto
39882.7 61892.9 lineto
stroke
newpath
39351.2 59471.7 moveto
39351.2 58408.7 lineto
stroke
newpath
38819.7 58940.2 moveto
39882.7 58940.2 lineto
stroke
newpath
39351.2 56518.9 moveto
39351.2 55455.9 lineto
stroke
newpath
38819.7 55987.4 moveto
39882.7 55987.4 lineto
stroke
newpath
39351.2 53566.2 moveto
39351.2 52503.2 lineto
stroke
newpath
38819.7 53034.7 moveto
39882.7 53034.7 lineto
stroke
newpath
39351.2 50613.4 moveto
39351.2 49550.4 lineto
stroke
newpath
38819.7 50081.9 moveto
39882.7 50081.9 lineto
stroke
newpath
78501.2 71424.4 moveto
78501.2 70361.4 lineto
stroke
newpath
77969.7 70892.9 moveto
79032.7 70892.9 lineto
stroke
newpath
78501.2 68471.7 moveto
78501.2 67408.7 lineto
stroke
newpath
77969.7 67940.2 moveto
79032.7 67940.2 lineto
stroke
newpath
78501.2 65518.9 moveto
78501.2 64455.9 lineto
stroke
newpath
77969.7 64987.4 moveto
79032.7 64987.4 lineto
stroke
newpath
78501.2 62566.2 moveto
78501.2 61503.2 lineto
stroke
newpath
77969.7 62034.7 moveto
79032.7 62034.7 lineto
stroke
newpath
78501.2 59613.4 moveto
78501.2 58550.4 lineto
stroke
newpath
77969.7 59081.9 moveto
79032.7 59081.9 lineto
stroke
newpath
78501.2 56660.6 moveto
78501.2 55597.7 lineto
stroke
newpath
77969.7 56129.1 moveto
79032.7 56129.1 lineto
stroke
newpath
78501.2 53707.9 moveto
78501.2 52644.9 lineto
stroke
newpath
77969.7 53176.4 moveto
79032.7 53176.4 lineto
stroke
newpath
78501.2 50755.1 moveto
78501.2 49692.1 lineto
stroke
newpath
77969.7 50223.6 moveto
79032.7 50223.6 lineto
stroke
newpath
78501.2 47802.4 moveto
78501.2 46739.4 lineto
stroke
newpath
77969.7 47270.9 moveto
79032.7 47270.9 lineto
stroke
newpath
78501.2 44849.6 moveto
78501.2 43786.6 lineto
stroke
newpath
77969.7 44318.1 moveto
79032.7 44318.1 lineto
stroke
118.11 setlinewidth
newpath
36413.5 38237.4 moveto
36413.5 39418.5 lineto
36694.8 39418.5 lineto
36863.5 39362.2 lineto
36976 39249.7 lineto
37032.2 39137.2 lineto
37088.5 38912.3 lineto
37088.5 38743.5 lineto
37032.2 38518.6 lineto
36976 38406.1 lineto
36863.5 38293.6 lineto
36694.8 38237.4 lineto
36413.5 38237.4 lineto
stroke
newpath
37594.6 38237.4 moveto
37594.6 39024.8 lineto
stroke
newpath
37594.6 38799.8 moveto
37650.9 38912.3 lineto
37707.1 38968.5 lineto
37819.6 39024.8 lineto
37932.1 39024.8 lineto
stroke
newpath
38325.8 38237.4 moveto
38325.8 39024.8 lineto
stroke
newpath
38325.8 39418.5 moveto
38269.6 39362.2 lineto
38325.8 39306 lineto
38382 39362.2 lineto
38325.8 39418.5 lineto
38325.8 39306 lineto
stroke
newpath
39057 38237.4 moveto
38944.5 38293.6 lineto
38888.2 38406.1 lineto
38888.2 39418.5 lineto
stroke
newpath
39675.6 38237.4 moveto
39563.1 38293.6 lineto
39506.9 38406.1 lineto
39506.9 39418.5 lineto
stroke
newpath
41025.5 38237.4 moveto
41025.5 39418.5 lineto
41419.2 38574.8 lineto
41812.9 39418.5 lineto
41812.9 38237.4 lineto
stroke
newpath
42881.5 38237.4 moveto
42881.5 38856 lineto
42825.2 38968.5 lineto
42712.8 39024.8 lineto
42487.8 39024.8 lineto
42375.3 38968.5 lineto
stroke
newpath
42881.5 38293.6 moveto
42769 38237.4 lineto
42487.8 38237.4 lineto
42375.3 38293.6 lineto
42319.1 38406.1 lineto
42319.1 38518.6 lineto
42375.3 38631.1 lineto
42487.8 38687.3 lineto
42769 38687.3 lineto
42881.5 38743.5 lineto
stroke
newpath
43443.9 39024.8 moveto
43443.9 37843.7 lineto
stroke
newpath
43443.9 38968.5 moveto
43556.4 39024.8 lineto
43781.4 39024.8 lineto
43893.9 38968.5 lineto
43950.1 38912.3 lineto
44006.3 38799.8 lineto
44006.3 38462.3 lineto
43950.1 38349.8 lineto
43893.9 38293.6 lineto
43781.4 38237.4 lineto
43556.4 38237.4 lineto
43443.9 38293.6 lineto
stroke
newpath
44512.5 38349.8 moveto
44568.8 38293.6 lineto
44512.5 38237.4 lineto
44456.3 38293.6 lineto
44512.5 38349.8 lineto
44512.5 38237.4 lineto
stroke
newpath
44512.5 38968.5 moveto
44568.8 38912.3 lineto
44512.5 38856 lineto
44456.3 38912.3 lineto
44512.5 38968.5 lineto
44512.5 38856 lineto
stroke
newpath
34990.6 36468.5 moveto
35344.9 36114.2 lineto
stroke
newpath
35344.9 36468.5 moveto
34990.6 36114.2 lineto
stroke
newpath
36638.5 36938.1 moveto
36751 36938.1 lineto
36863.5 36881.9 lineto
36919.7 36825.7 lineto
36976 36713.2 lineto
37032.2 36488.2 lineto
37032.2 36207 lineto
36976 35982 lineto
36919.7 35869.5 lineto
36863.5 35813.3 lineto
36751 35757 lineto
36638.5 35757 lineto
36526 35813.3 lineto
36469.8 35869.5 lineto
36413.5 35982 lineto
36357.3 36207 lineto
36357.3 36488.2 lineto
36413.5 36713.2 lineto
36469.8 36825.7 lineto
36526 36881.9 lineto
36638.5 36938.1 lineto
stroke
newpath
37538.4 35869.5 moveto
37594.6 35813.3 lineto
37538.4 35757 lineto
37482.2 35813.3 lineto
37538.4 35869.5 lineto
37538.4 35757 lineto
stroke
newpath
37988.3 36938.1 moveto
38719.5 36938.1 lineto
38325.8 36488.2 lineto
38494.5 36488.2 lineto
38607 36432 lineto
38663.3 36375.7 lineto
38719.5 36263.2 lineto
38719.5 35982 lineto
38663.3 35869.5 lineto
38607 35813.3 lineto
38494.5 35757 lineto
38157.1 35757 lineto
38044.6 35813.3 lineto
37988.3 35869.5 lineto
stroke
newpath
39450.7 36938.1 moveto
39563.1 36938.1 lineto
39675.6 36881.9 lineto
39731.9 36825.7 lineto
39788.1 36713.2 lineto
39844.4 36488.2 lineto
39844.4 36207 lineto
39788.1 35982 lineto
39731.9 35869.5 lineto
39675.6 35813.3 lineto
39563.1 35757 lineto
39450.7 35757 lineto
39338.2 35813.3 lineto
39281.9 35869.5 lineto
39225.7 35982 lineto
39169.4 36207 lineto
39169.4 36488.2 lineto
39225.7 36713.2 lineto
39281.9 36825.7 lineto
39338.2 36881.9 lineto
39450.7 36938.1 lineto
stroke
newpath
40350.5 35757 moveto
40350.5 36544.4 lineto
stroke
newpath
40350.5 36432 moveto
40406.8 36488.2 lineto
40519.3 36544.4 lineto
40688 36544.4 lineto
40800.5 36488.2 lineto
40856.7 36375.7 lineto
40856.7 35757 lineto
stroke
newpath
40856.7 36375.7 moveto
40913 36488.2 lineto
41025.5 36544.4 lineto
41194.2 36544.4 lineto
41306.7 36488.2 lineto
41362.9 36375.7 lineto
41362.9 35757 lineto
stroke
newpath
41925.3 35757 moveto
41925.3 36544.4 lineto
stroke
newpath
41925.3 36432 moveto
41981.6 36488.2 lineto
42094.1 36544.4 lineto
42262.8 36544.4 lineto
42375.3 36488.2 lineto
42431.5 36375.7 lineto
42431.5 35757 lineto
stroke
newpath
42431.5 36375.7 moveto
42487.8 36488.2 lineto
42600.3 36544.4 lineto
42769 36544.4 lineto
42881.5 36488.2 lineto
42937.7 36375.7 lineto
42937.7 35757 lineto
stroke
newpath
45243.7 36994.4 moveto
44231.3 35475.8 lineto
stroke
newpath
46762.2 36938.1 moveto
46874.7 36938.1 lineto
46987.2 36881.9 lineto
47043.5 36825.7 lineto
47099.7 36713.2 lineto
47155.9 36488.2 lineto
47155.9 36207 lineto
47099.7 35982 lineto
47043.5 35869.5 lineto
46987.2 35813.3 lineto
46874.7 35757 lineto
46762.2 35757 lineto
46649.8 35813.3 lineto
46593.5 35869.5 lineto
46537.3 35982 lineto
46481 36207 lineto
46481 36488.2 lineto
46537.3 36713.2 lineto
46593.5 36825.7 lineto
46649.8 36881.9 lineto
46762.2 36938.1 lineto
stroke
newpath
47662.1 35869.5 moveto
47718.4 35813.3 lineto
47662.1 35757 lineto
47605.9 35813.3 lineto
47662.1 35869.5 lineto
47662.1 35757 lineto
stroke
newpath
48449.5 36938.1 moveto
48562 36938.1 lineto
48674.5 36881.9 lineto
48730.7 36825.7 lineto
48787 36713.2 lineto
48843.2 36488.2 lineto
48843.2 36207 lineto
48787 35982 lineto
48730.7 35869.5 lineto
48674.5 35813.3 lineto
48562 35757 lineto
48449.5 35757 lineto
48337 35813.3 lineto
48280.8 35869.5 lineto
48224.6 35982 lineto
48168.3 36207 lineto
48168.3 36488.2 lineto
48224.6 36713.2 lineto
48280.8 36825.7 lineto
48337 36881.9 lineto
48449.5 36938.1 lineto
stroke
newpath
49968.1 35757 moveto
49293.2 35757 lineto
stroke
newpath
49630.6 35757 moveto
49630.6 36938.1 lineto
49518.1 36769.4 lineto
49405.7 36656.9 lineto
49293.2 36600.7 lineto
stroke
newpath
50418 36825.7 moveto
50474.3 36881.9 lineto
50586.8 36938.1 lineto
50868 36938.1 lineto
50980.5 36881.9 lineto
51036.7 36825.7 lineto
51093 36713.2 lineto
51093 36600.7 lineto
51036.7 36432 lineto
50361.8 35757 lineto
51093 35757 lineto
stroke
newpath
51542.9 36938.1 moveto
51542.9 36713.2 lineto
stroke
newpath
51992.8 36938.1 moveto
51992.8 36713.2 lineto
stroke
newpath
53736.4 35307.1 moveto
53680.1 35363.3 lineto
53567.6 35532.1 lineto
53511.4 35644.6 lineto
53455.2 35813.3 lineto
53398.9 36094.5 lineto
53398.9 36319.5 lineto
53455.2 36600.7 lineto
53511.4 36769.4 lineto
53567.6 36881.9 lineto
53680.1 37050.6 lineto
53736.4 37106.9 lineto
stroke
newpath
54692.5 36544.4 moveto
54692.5 35757 lineto
stroke
newpath
54411.3 36994.4 moveto
54130.1 36150.7 lineto
54861.2 36150.7 lineto
stroke
newpath
55198.7 36938.1 moveto
55929.8 36938.1 lineto
55536.1 36488.2 lineto
55704.9 36488.2 lineto
55817.4 36432 lineto
55873.6 36375.7 lineto
55929.8 36263.2 lineto
55929.8 35982 lineto
55873.6 35869.5 lineto
55817.4 35813.3 lineto
55704.9 35757 lineto
55367.4 35757 lineto
55254.9 35813.3 lineto
55198.7 35869.5 lineto
stroke
newpath
57335.9 35757 moveto
57335.9 36938.1 lineto
stroke
newpath
57842.1 35757 moveto
57842.1 36375.7 lineto
57785.9 36488.2 lineto
57673.4 36544.4 lineto
57504.7 36544.4 lineto
57392.2 36488.2 lineto
57335.9 36432 lineto
stroke
newpath
58573.3 35757 moveto
58460.8 35813.3 lineto
58404.5 35869.5 lineto
58348.3 35982 lineto
58348.3 36319.5 lineto
58404.5 36432 lineto
58460.8 36488.2 lineto
58573.3 36544.4 lineto
58742 36544.4 lineto
58854.5 36488.2 lineto
58910.7 36432 lineto
58967 36319.5 lineto
58967 35982 lineto
58910.7 35869.5 lineto
58854.5 35813.3 lineto
58742 35757 lineto
58573.3 35757 lineto
stroke
newpath
59641.9 35757 moveto
59529.4 35813.3 lineto
59473.2 35925.8 lineto
59473.2 36938.1 lineto
stroke
newpath
60541.8 35813.3 moveto
60429.3 35757 lineto
60204.3 35757 lineto
60091.8 35813.3 lineto
60035.6 35925.8 lineto
60035.6 36375.7 lineto
60091.8 36488.2 lineto
60204.3 36544.4 lineto
60429.3 36544.4 lineto
60541.8 36488.2 lineto
60598 36375.7 lineto
60598 36263.2 lineto
60035.6 36150.7 lineto
stroke
newpath
61048 35813.3 moveto
61160.4 35757 lineto
61385.4 35757 lineto
61497.9 35813.3 lineto
61554.1 35925.8 lineto
61554.1 35982 lineto
61497.9 36094.5 lineto
61385.4 36150.7 lineto
61216.7 36150.7 lineto
61104.2 36207 lineto
61048 36319.5 lineto
61048 36375.7 lineto
61104.2 36488.2 lineto
61216.7 36544.4 lineto
61385.4 36544.4 lineto
61497.9 36488.2 lineto
stroke
newpath
61947.8 35307.1 moveto
62004.1 35363.3 lineto
62116.6 35532.1 lineto
62172.8 35644.6 lineto
62229.1 35813.3 lineto
62285.3 36094.5 lineto
62285.3 36319.5 lineto
62229.1 36600.7 lineto
62172.8 36769.4 lineto
62116.6 36881.9 lineto
62004.1 37050.6 lineto
61947.8 37106.9 lineto
stroke
35108.7 34732.3 236.22 cir0
newpath
36638.5 35379.1 moveto
36751 35379.1 lineto
36863.5 35322.8 lineto
36919.7 35266.6 lineto
36976 35154.1 lineto
37032.2 34929.1 lineto
37032.2 34647.9 lineto
36976 34423 lineto
36919.7 34310.5 lineto
36863.5 34254.2 lineto
36751 34198 lineto
36638.5 34198 lineto
36526 34254.2 lineto
36469.8 34310.5 lineto
36413.5 34423 lineto
36357.3 34647.9 lineto
36357.3 34929.1 lineto
36413.5 35154.1 lineto
36469.8 35266.6 lineto
36526 35322.8 lineto
36638.5 35379.1 lineto
stroke
newpath
37538.4 34310.5 moveto
37594.6 34254.2 lineto
37538.4 34198 lineto
37482.2 34254.2 lineto
37538.4 34310.5 lineto
37538.4 34198 lineto
stroke
newpath
38607 34985.4 moveto
38607 34198 lineto
stroke
newpath
38325.8 35435.3 moveto
38044.6 34591.7 lineto
38775.7 34591.7 lineto
stroke
newpath
39450.7 35379.1 moveto
39563.1 35379.1 lineto
39675.6 35322.8 lineto
39731.9 35266.6 lineto
39788.1 35154.1 lineto
39844.4 34929.1 lineto
39844.4 34647.9 lineto
39788.1 34423 lineto
39731.9 34310.5 lineto
39675.6 34254.2 lineto
39563.1 34198 lineto
39450.7 34198 lineto
39338.2 34254.2 lineto
39281.9 34310.5 lineto
39225.7 34423 lineto
39169.4 34647.9 lineto
39169.4 34929.1 lineto
39225.7 35154.1 lineto
39281.9 35266.6 lineto
39338.2 35322.8 lineto
39450.7 35379.1 lineto
stroke
newpath
40350.5 34198 moveto
40350.5 34985.4 lineto
stroke
newpath
40350.5 34872.9 moveto
40406.8 34929.1 lineto
40519.3 34985.4 lineto
40688 34985.4 lineto
40800.5 34929.1 lineto
40856.7 34816.7 lineto
40856.7 34198 lineto
stroke
newpath
40856.7 34816.7 moveto
40913 34929.1 lineto
41025.5 34985.4 lineto
41194.2 34985.4 lineto
41306.7 34929.1 lineto
41362.9 34816.7 lineto
41362.9 34198 lineto
stroke
newpath
41925.3 34198 moveto
41925.3 34985.4 lineto
stroke
newpath
41925.3 34872.9 moveto
41981.6 34929.1 lineto
42094.1 34985.4 lineto
42262.8 34985.4 lineto
42375.3 34929.1 lineto
42431.5 34816.7 lineto
42431.5 34198 lineto
stroke
newpath
42431.5 34816.7 moveto
42487.8 34929.1 lineto
42600.3 34985.4 lineto
42769 34985.4 lineto
42881.5 34929.1 lineto
42937.7 34816.7 lineto
42937.7 34198 lineto
stroke
newpath
45243.7 35435.3 moveto
44231.3 33916.8 lineto
stroke
newpath
46762.2 35379.1 moveto
46874.7 35379.1 lineto
46987.2 35322.8 lineto
47043.5 35266.6 lineto
47099.7 35154.1 lineto
47155.9 34929.1 lineto
47155.9 34647.9 lineto
47099.7 34423 lineto
47043.5 34310.5 lineto
46987.2 34254.2 lineto
46874.7 34198 lineto
46762.2 34198 lineto
46649.8 34254.2 lineto
46593.5 34310.5 lineto
46537.3 34423 lineto
46481 34647.9 lineto
46481 34929.1 lineto
46537.3 35154.1 lineto
46593.5 35266.6 lineto
46649.8 35322.8 lineto
46762.2 35379.1 lineto
stroke
newpath
47662.1 34310.5 moveto
47718.4 34254.2 lineto
47662.1 34198 lineto
47605.9 34254.2 lineto
47662.1 34310.5 lineto
47662.1 34198 lineto
stroke
newpath
48449.5 35379.1 moveto
48562 35379.1 lineto
48674.5 35322.8 lineto
48730.7 35266.6 lineto
48787 35154.1 lineto
48843.2 34929.1 lineto
48843.2 34647.9 lineto
48787 34423 lineto
48730.7 34310.5 lineto
48674.5 34254.2 lineto
48562 34198 lineto
48449.5 34198 lineto
48337 34254.2 lineto
48280.8 34310.5 lineto
48224.6 34423 lineto
48168.3 34647.9 lineto
48168.3 34929.1 lineto
48224.6 35154.1 lineto
48280.8 35266.6 lineto
48337 35322.8 lineto
48449.5 35379.1 lineto
stroke
newpath
49968.1 34198 moveto
49293.2 34198 lineto
stroke
newpath
49630.6 34198 moveto
49630.6 35379.1 lineto
49518.1 35210.4 lineto
49405.7 35097.9 lineto
49293.2 35041.6 lineto
stroke
newpath
50980.5 35379.1 moveto
50755.5 35379.1 lineto
50643 35322.8 lineto
50586.8 35266.6 lineto
50474.3 35097.9 lineto
50418 34872.9 lineto
50418 34423 lineto
50474.3 34310.5 lineto
50530.5 34254.2 lineto
50643 34198 lineto
50868 34198 lineto
50980.5 34254.2 lineto
51036.7 34310.5 lineto
51093 34423 lineto
51093 34704.2 lineto
51036.7 34816.7 lineto
50980.5 34872.9 lineto
50868 34929.1 lineto
50643 34929.1 lineto
50530.5 34872.9 lineto
50474.3 34816.7 lineto
50418 34704.2 lineto
stroke
newpath
51542.9 35379.1 moveto
51542.9 35154.1 lineto
stroke
newpath
51992.8 35379.1 moveto
51992.8 35154.1 lineto
stroke
newpath
53736.4 33748 moveto
53680.1 33804.3 lineto
53567.6 33973 lineto
53511.4 34085.5 lineto
53455.2 34254.2 lineto
53398.9 34535.4 lineto
53398.9 34760.4 lineto
53455.2 35041.6 lineto
53511.4 35210.4 lineto
53567.6 35322.8 lineto
53680.1 35491.6 lineto
53736.4 35547.8 lineto
stroke
newpath
54805 34198 moveto
54130.1 34198 lineto
stroke
newpath
54467.5 34198 moveto
54467.5 35379.1 lineto
54355 35210.4 lineto
54242.6 35097.9 lineto
54130.1 35041.6 lineto
stroke
newpath
55254.9 35266.6 moveto
55311.2 35322.8 lineto
55423.7 35379.1 lineto
55704.9 35379.1 lineto
55817.4 35322.8 lineto
55873.6 35266.6 lineto
55929.8 35154.1 lineto
55929.8 35041.6 lineto
55873.6 34872.9 lineto
55198.7 34198 lineto
55929.8 34198 lineto
stroke
newpath
57335.9 34198 moveto
57335.9 35379.1 lineto
stroke
newpath
57842.1 34198 moveto
57842.1 34816.7 lineto
57785.9 34929.1 lineto
57673.4 34985.4 lineto
57504.7 34985.4 lineto
57392.2 34929.1 lineto
57335.9 34872.9 lineto
stroke
newpath
58573.3 34198 moveto
58460.8 34254.2 lineto
58404.5 34310.5 lineto
58348.3 34423 lineto
58348.3 34760.4 lineto
58404.5 34872.9 lineto
58460.8 34929.1 lineto
58573.3 34985.4 lineto
58742 34985.4 lineto
58854.5 34929.1 lineto
58910.7 34872.9 lineto
58967 34760.4 lineto
58967 34423 lineto
58910.7 34310.5 lineto
58854.5 34254.2 lineto
58742 34198 lineto
58573.3 34198 lineto
stroke
newpath
59641.9 34198 moveto
59529.4 34254.2 lineto
59473.2 34366.7 lineto
59473.2 35379.1 lineto
stroke
newpath
60541.8 34254.2 moveto
60429.3 34198 lineto
60204.3 34198 lineto
60091.8 34254.2 lineto
60035.6 34366.7 lineto
60035.6 34816.7 lineto
60091.8 34929.1 lineto
60204.3 34985.4 lineto
60429.3 34985.4 lineto
60541.8 34929.1 lineto
60598 34816.7 lineto
60598 34704.2 lineto
60035.6 34591.7 lineto
stroke
newpath
61048 34254.2 moveto
61160.4 34198 lineto
61385.4 34198 lineto
61497.9 34254.2 lineto
61554.1 34366.7 lineto
61554.1 34423 lineto
61497.9 34535.4 lineto
61385.4 34591.7 lineto
61216.7 34591.7 lineto
61104.2 34647.9 lineto
61048 34760.4 lineto
61048 34816.7 lineto
61104.2 34929.1 lineto
61216.7 34985.4 lineto
61385.4 34985.4 lineto
61497.9 34929.1 lineto
stroke
newpath
61947.8 33748 moveto
62004.1 33804.3 lineto
62116.6 33973 lineto
62172.8 34085.5 lineto
62229.1 34254.2 lineto
62285.3 34535.4 lineto
62285.3 34760.4 lineto
62229.1 35041.6 lineto
62172.8 35210.4 lineto
62116.6 35322.8 lineto
62004.1 35491.6 lineto
61947.8 35547.8 lineto
stroke
newpath
34813.4 33704.7 moveto
34813.4 32641.7 lineto
stroke
newpath
34281.9 33173.2 moveto
35344.9 33173.2 lineto
stroke
newpath
36638.5 33820 moveto
36751 33820 lineto
36863.5 33763.8 lineto
36919.7 33707.6 lineto
36976 33595.1 lineto
37032.2 33370.1 lineto
37032.2 33088.9 lineto
36976 32863.9 lineto
36919.7 32751.4 lineto
36863.5 32695.2 lineto
36751 32638.9 lineto
36638.5 32638.9 lineto
36526 32695.2 lineto
36469.8 32751.4 lineto
36413.5 32863.9 lineto
36357.3 33088.9 lineto
36357.3 33370.1 lineto
36413.5 33595.1 lineto
36469.8 33707.6 lineto
36526 33763.8 lineto
36638.5 33820 lineto
stroke
newpath
37538.4 32751.4 moveto
37594.6 32695.2 lineto
37538.4 32638.9 lineto
37482.2 32695.2 lineto
37538.4 32751.4 lineto
37538.4 32638.9 lineto
stroke
newpath
38157.1 32638.9 moveto
38382 32638.9 lineto
38494.5 32695.2 lineto
38550.8 32751.4 lineto
38663.3 32920.1 lineto
38719.5 33145.1 lineto
38719.5 33595.1 lineto
38663.3 33707.6 lineto
38607 33763.8 lineto
38494.5 33820 lineto
38269.6 33820 lineto
38157.1 33763.8 lineto
38100.8 33707.6 lineto
38044.6 33595.1 lineto
38044.6 33313.9 lineto
38100.8 33201.4 lineto
38157.1 33145.1 lineto
38269.6 33088.9 lineto
38494.5 33088.9 lineto
38607 33145.1 lineto
38663.3 33201.4 lineto
38719.5 33313.9 lineto
stroke
newpath
39450.7 33820 moveto
39563.1 33820 lineto
39675.6 33763.8 lineto
39731.9 33707.6 lineto
39788.1 33595.1 lineto
39844.4 33370.1 lineto
39844.4 33088.9 lineto
39788.1 32863.9 lineto
39731.9 32751.4 lineto
39675.6 32695.2 lineto
39563.1 32638.9 lineto
39450.7 32638.9 lineto
39338.2 32695.2 lineto
39281.9 32751.4 lineto
39225.7 32863.9 lineto
39169.4 33088.9 lineto
39169.4 33370.1 lineto
39225.7 33595.1 lineto
39281.9 33707.6 lineto
39338.2 33763.8 lineto
39450.7 33820 lineto
stroke
newpath
40350.5 32638.9 moveto
40350.5 33426.3 lineto
stroke
newpath
40350.5 33313.9 moveto
40406.8 33370.1 lineto
40519.3 33426.3 lineto
40688 33426.3 lineto
40800.5 33370.1 lineto
40856.7 33257.6 lineto
40856.7 32638.9 lineto
stroke
newpath
40856.7 33257.6 moveto
40913 33370.1 lineto
41025.5 33426.3 lineto
41194.2 33426.3 lineto
41306.7 33370.1 lineto
41362.9 33257.6 lineto
41362.9 32638.9 lineto
stroke
newpath
41925.3 32638.9 moveto
41925.3 33426.3 lineto
stroke
newpath
41925.3 33313.9 moveto
41981.6 33370.1 lineto
42094.1 33426.3 lineto
42262.8 33426.3 lineto
42375.3 33370.1 lineto
42431.5 33257.6 lineto
42431.5 32638.9 lineto
stroke
newpath
42431.5 33257.6 moveto
42487.8 33370.1 lineto
42600.3 33426.3 lineto
42769 33426.3 lineto
42881.5 33370.1 lineto
42937.7 33257.6 lineto
42937.7 32638.9 lineto
stroke
newpath
45243.7 33876.3 moveto
44231.3 32357.7 lineto
stroke
newpath
46762.2 33820 moveto
46874.7 33820 lineto
46987.2 33763.8 lineto
47043.5 33707.6 lineto
47099.7 33595.1 lineto
47155.9 33370.1 lineto
47155.9 33088.9 lineto
47099.7 32863.9 lineto
47043.5 32751.4 lineto
46987.2 32695.2 lineto
46874.7 32638.9 lineto
46762.2 32638.9 lineto
46649.8 32695.2 lineto
46593.5 32751.4 lineto
46537.3 32863.9 lineto
46481 33088.9 lineto
46481 33370.1 lineto
46537.3 33595.1 lineto
46593.5 33707.6 lineto
46649.8 33763.8 lineto
46762.2 33820 lineto
stroke
newpath
47662.1 32751.4 moveto
47718.4 32695.2 lineto
47662.1 32638.9 lineto
47605.9 32695.2 lineto
47662.1 32751.4 lineto
47662.1 32638.9 lineto
stroke
newpath
48449.5 33820 moveto
48562 33820 lineto
48674.5 33763.8 lineto
48730.7 33707.6 lineto
48787 33595.1 lineto
48843.2 33370.1 lineto
48843.2 33088.9 lineto
48787 32863.9 lineto
48730.7 32751.4 lineto
48674.5 32695.2 lineto
48562 32638.9 lineto
48449.5 32638.9 lineto
48337 32695.2 lineto
48280.8 32751.4 lineto
48224.6 32863.9 lineto
48168.3 33088.9 lineto
48168.3 33370.1 lineto
48224.6 33595.1 lineto
48280.8 33707.6 lineto
48337 33763.8 lineto
48449.5 33820 lineto
stroke
newpath
49236.9 33820 moveto
49968.1 33820 lineto
49574.4 33370.1 lineto
49743.1 33370.1 lineto
49855.6 33313.9 lineto
49911.8 33257.6 lineto
49968.1 33145.1 lineto
49968.1 32863.9 lineto
49911.8 32751.4 lineto
49855.6 32695.2 lineto
49743.1 32638.9 lineto
49405.7 32638.9 lineto
49293.2 32695.2 lineto
49236.9 32751.4 lineto
stroke
newpath
51036.7 33820 moveto
50474.3 33820 lineto
50418 33257.6 lineto
50474.3 33313.9 lineto
50586.8 33370.1 lineto
50868 33370.1 lineto
50980.5 33313.9 lineto
51036.7 33257.6 lineto
51093 33145.1 lineto
51093 32863.9 lineto
51036.7 32751.4 lineto
50980.5 32695.2 lineto
50868 32638.9 lineto
50586.8 32638.9 lineto
50474.3 32695.2 lineto
50418 32751.4 lineto
stroke
newpath
51542.9 33820 moveto
51542.9 33595.1 lineto
stroke
newpath
51992.8 33820 moveto
51992.8 33595.1 lineto
stroke
newpath
53736.4 32189 moveto
53680.1 32245.2 lineto
53567.6 32414 lineto
53511.4 32526.4 lineto
53455.2 32695.2 lineto
53398.9 32976.4 lineto
53398.9 33201.4 lineto
53455.2 33482.6 lineto
53511.4 33651.3 lineto
53567.6 33763.8 lineto
53680.1 33932.5 lineto
53736.4 33988.8 lineto
stroke
newpath
54805 32638.9 moveto
54130.1 32638.9 lineto
stroke
newpath
54467.5 32638.9 moveto
54467.5 33820 lineto
54355 33651.3 lineto
54242.6 33538.8 lineto
54130.1 33482.6 lineto
stroke
newpath
55873.6 33820 moveto
55311.2 33820 lineto
55254.9 33257.6 lineto
55311.2 33313.9 lineto
55423.7 33370.1 lineto
55704.9 33370.1 lineto
55817.4 33313.9 lineto
55873.6 33257.6 lineto
55929.8 33145.1 lineto
55929.8 32863.9 lineto
55873.6 32751.4 lineto
55817.4 32695.2 lineto
55704.9 32638.9 lineto
55423.7 32638.9 lineto
55311.2 32695.2 lineto
55254.9 32751.4 lineto
stroke
newpath
57335.9 32638.9 moveto
57335.9 33820 lineto
stroke
newpath
57842.1 32638.9 moveto
57842.1 33257.6 lineto
57785.9 33370.1 lineto
57673.4 33426.3 lineto
57504.7 33426.3 lineto
57392.2 33370.1 lineto
57335.9 33313.9 lineto
stroke
newpath
58573.3 32638.9 moveto
58460.8 32695.2 lineto
58404.5 32751.4 lineto
58348.3 32863.9 lineto
58348.3 33201.4 lineto
58404.5 33313.9 lineto
58460.8 33370.1 lineto
58573.3 33426.3 lineto
58742 33426.3 lineto
58854.5 33370.1 lineto
58910.7 33313.9 lineto
58967 33201.4 lineto
58967 32863.9 lineto
58910.7 32751.4 lineto
58854.5 32695.2 lineto
58742 32638.9 lineto
58573.3 32638.9 lineto
stroke
newpath
59641.9 32638.9 moveto
59529.4 32695.2 lineto
59473.2 32807.7 lineto
59473.2 33820 lineto
stroke
newpath
60541.8 32695.2 moveto
60429.3 32638.9 lineto
60204.3 32638.9 lineto
60091.8 32695.2 lineto
60035.6 32807.7 lineto
60035.6 33257.6 lineto
60091.8 33370.1 lineto
60204.3 33426.3 lineto
60429.3 33426.3 lineto
60541.8 33370.1 lineto
60598 33257.6 lineto
60598 33145.1 lineto
60035.6 33032.6 lineto
stroke
newpath
61048 32695.2 moveto
61160.4 32638.9 lineto
61385.4 32638.9 lineto
61497.9 32695.2 lineto
61554.1 32807.7 lineto
61554.1 32863.9 lineto
61497.9 32976.4 lineto
61385.4 33032.6 lineto
61216.7 33032.6 lineto
61104.2 33088.9 lineto
61048 33201.4 lineto
61048 33257.6 lineto
61104.2 33370.1 lineto
61216.7 33426.3 lineto
61385.4 33426.3 lineto
61497.9 33370.1 lineto
stroke
newpath
61947.8 32189 moveto
62004.1 32245.2 lineto
62116.6 32414 lineto
62172.8 32526.4 lineto
62229.1 32695.2 lineto
62285.3 32976.4 lineto
62285.3 33201.4 lineto
62229.1 33482.6 lineto
62172.8 33651.3 lineto
62116.6 33763.8 lineto
62004.1 33932.5 lineto
61947.8 33988.8 lineto
stroke
showpage
grestore
%%EOF
