%!PS-Adobe-3.0
%%Creator: PCBNEW
%%CreationDate: Fri Sep 28 16:13:45 2018
%%Title: /mnt/Upanishad/SOiL/SOIL-Automated-Smart-Irrigation-System/PCB Design/Lora/GERBER/Lora-drl_map.ps
%%Pages: 1
%%PageOrder: Ascend
%%BoundingBox: 0 0 596 842
%%DocumentMedia: A4 595 842 0 () ()
%%Orientation: Landscape
%%EndComments
%%BeginProlog
/line { newpath moveto lineto stroke } bind def
/cir0 { newpath 0 360 arc stroke } bind def
/cir1 { newpath 0 360 arc gsave fill grestore stroke } bind def
/cir2 { newpath 0 360 arc gsave fill grestore stroke } bind def
/arc0 { newpath arc stroke } bind def
/arc1 { newpath 4 index 4 index moveto arc closepath gsave fill
    grestore stroke } bind def
/arc2 { newpath 4 index 4 index moveto arc closepath gsave fill
    grestore stroke } bind def
/poly0 { stroke } bind def
/poly1 { closepath gsave fill grestore stroke } bind def
/poly2 { closepath gsave fill grestore stroke } bind def
/rect0 { rectstroke } bind def
/rect1 { rectfill } bind def
/rect2 { rectfill } bind def
/linemode0 { 0 setlinecap 0 setlinejoin 0 setlinewidth } bind def
/linemode1 { 1 setlinecap 1 setlinejoin } bind def
/dashedline { [200] 100 setdash } bind def
/solidline { [] 0 setdash } bind def
/phantomshow { moveto
    /KicadFont findfont 0.000001 scalefont setfont
    show } bind def
/textshow { gsave
    findfont exch scalefont setfont concat 1 scale 0 0 moveto show
    } bind def
/reencodefont {
  findfont dup length dict begin
  { 1 index /FID ne
    { def }
    { pop pop } ifelse
  } forall
  /Encoding ISOLatin1Encoding def
  currentdict
  end } bind def
/KicadFont /Helvetica reencodefont definefont pop
/KicadFont-Bold /Helvetica-Bold reencodefont definefont pop
/KicadFont-Oblique /Helvetica-Oblique reencodefont definefont pop
/KicadFont-BoldOblique /Helvetica-BoldOblique reencodefont definefont pop
%%EndProlog
%%Page: 1 1
%%BeginPageSetup
gsave
0.0072 0.0072 scale
linemode1
82680 0 translate 90 rotate
96.1055 setlinewidth
%%EndPageSetup
0 0 0 setrgbcolor
113.51 setlinewidth
newpath
35762.9 37065.8 moveto
35762.9 78686.2 lineto
stroke
0 0 0 setrgbcolor
newpath
81167.1 78686.2 moveto
81167.1 37065.8 lineto
stroke
0 0 0 setrgbcolor
newpath
35762.9 78686.2 moveto
81167.1 78686.2 lineto
stroke
0 0 0 setrgbcolor
newpath
35762.9 37065.8 moveto
81167.1 37065.8 lineto
stroke
78.7399 setlinewidth
newpath
38687 70449.9 moveto
38914 70222.9 lineto
stroke
newpath
38914 70449.9 moveto
38687 70222.9 lineto
stroke
newpath
38687 68179.7 moveto
38914 67952.7 lineto
stroke
newpath
38914 68179.7 moveto
38687 67952.7 lineto
stroke
newpath
38687 65909.5 moveto
38914 65682.5 lineto
stroke
newpath
38914 65909.5 moveto
38687 65682.5 lineto
stroke
newpath
38687 63639.3 moveto
38914 63412.3 lineto
stroke
newpath
38914 63639.3 moveto
38687 63412.3 lineto
stroke
newpath
38687 61369.1 moveto
38914 61142.1 lineto
stroke
newpath
38914 61369.1 moveto
38687 61142.1 lineto
stroke
newpath
38687 59098.9 moveto
38914 58871.9 lineto
stroke
newpath
38914 59098.9 moveto
38687 58871.9 lineto
stroke
newpath
40957.2 70449.9 moveto
41184.2 70222.9 lineto
stroke
newpath
41184.2 70449.9 moveto
40957.2 70222.9 lineto
stroke
newpath
40957.2 68179.7 moveto
41184.2 67952.7 lineto
stroke
newpath
41184.2 68179.7 moveto
40957.2 67952.7 lineto
stroke
newpath
40957.2 65909.5 moveto
41184.2 65682.5 lineto
stroke
newpath
41184.2 65909.5 moveto
40957.2 65682.5 lineto
stroke
newpath
40957.2 63639.3 moveto
41184.2 63412.3 lineto
stroke
newpath
41184.2 63639.3 moveto
40957.2 63412.3 lineto
stroke
newpath
40957.2 61369.1 moveto
41184.2 61142.1 lineto
stroke
newpath
41184.2 61369.1 moveto
40957.2 61142.1 lineto
stroke
newpath
40957.2 59098.9 moveto
41184.2 58871.9 lineto
stroke
newpath
41184.2 59098.9 moveto
40957.2 58871.9 lineto
stroke
newpath
42092.3 43775 moveto
42319.3 43548 lineto
stroke
newpath
42319.3 43775 moveto
42092.3 43548 lineto
stroke
newpath
42092.3 42261.5 moveto
42319.3 42034.5 lineto
stroke
newpath
42319.3 42261.5 moveto
42092.3 42034.5 lineto
stroke
newpath
43605.7 43775 moveto
43832.8 43548 lineto
stroke
newpath
43832.8 43775 moveto
43605.7 43548 lineto
stroke
newpath
43605.7 42261.5 moveto
43832.8 42034.5 lineto
stroke
newpath
43832.8 42261.5 moveto
43605.7 42034.5 lineto
stroke
newpath
45119.2 43775 moveto
45346.2 43548 lineto
stroke
newpath
45346.2 43775 moveto
45119.2 43548 lineto
stroke
newpath
45119.2 42261.5 moveto
45346.2 42034.5 lineto
stroke
newpath
45346.2 42261.5 moveto
45119.2 42034.5 lineto
stroke
newpath
46632.7 63071.7 moveto
46859.7 62844.7 lineto
stroke
newpath
46859.7 63071.7 moveto
46632.7 62844.7 lineto
stroke
newpath
47279.7 47458 moveto
47506.7 47231 lineto
stroke
newpath
47506.7 47458 moveto
47279.7 47231 lineto
stroke
newpath
47279.7 46593.1 moveto
47506.7 46366 lineto
stroke
newpath
47506.7 46593.1 moveto
47279.7 46366 lineto
stroke
newpath
48144.6 47458 moveto
48371.7 47231 lineto
stroke
newpath
48371.7 47458 moveto
48144.6 47231 lineto
stroke
newpath
48144.6 46593.1 moveto
48371.7 46366 lineto
stroke
newpath
48371.7 46593.1 moveto
48144.6 46366 lineto
stroke
newpath
48902.9 63071.7 moveto
49129.9 62844.7 lineto
stroke
newpath
49129.9 63071.7 moveto
48902.9 62844.7 lineto
stroke
newpath
49970.6 43325.5 moveto
50197.7 43098.5 lineto
stroke
newpath
50197.7 43325.5 moveto
49970.6 43098.5 lineto
stroke
newpath
51173.1 63071.7 moveto
51400.1 62844.7 lineto
stroke
newpath
51400.1 63071.7 moveto
51173.1 62844.7 lineto
stroke
newpath
51484.1 43325.5 moveto
51711.1 43098.5 lineto
stroke
newpath
51711.1 43325.5 moveto
51484.1 43098.5 lineto
stroke
newpath
52997.6 43325.5 moveto
53224.6 43098.5 lineto
stroke
newpath
53224.6 43325.5 moveto
52997.6 43098.5 lineto
stroke
newpath
53238.2 56443.9 moveto
53465.2 56216.9 lineto
stroke
newpath
53465.2 56443.9 moveto
53238.2 56216.9 lineto
stroke
newpath
53238.2 54714 moveto
53465.2 54487 lineto
stroke
newpath
53465.2 54714 moveto
53238.2 54487 lineto
stroke
newpath
53443.3 63071.7 moveto
53670.3 62844.7 lineto
stroke
newpath
53670.3 63071.7 moveto
53443.3 62844.7 lineto
stroke
newpath
54391.5 57068.6 moveto
54618.5 56841.5 lineto
stroke
newpath
54618.5 57068.6 moveto
54391.5 56841.5 lineto
stroke
newpath
54487.6 53512.7 moveto
54714.6 53285.6 lineto
stroke
newpath
54714.6 53512.7 moveto
54487.6 53285.6 lineto
stroke
newpath
54487.6 48419.1 moveto
54714.6 48192.1 lineto
stroke
newpath
54714.6 48419.1 moveto
54487.6 48192.1 lineto
stroke
newpath
54511.1 43325.5 moveto
54738.1 43098.5 lineto
stroke
newpath
54738.1 43325.5 moveto
54511.1 43098.5 lineto
stroke
newpath
55713.5 63071.7 moveto
55940.5 62844.7 lineto
stroke
newpath
55940.5 63071.7 moveto
55713.5 62844.7 lineto
stroke
newpath
56001.1 48419.1 moveto
56228.1 48192.1 lineto
stroke
newpath
56228.1 48419.1 moveto
56001.1 48192.1 lineto
stroke
newpath
56794.1 53512.7 moveto
57021.1 53285.6 lineto
stroke
newpath
57021.1 53512.7 moveto
56794.1 53285.6 lineto
stroke
newpath
56890.2 57068.6 moveto
57117.3 56841.5 lineto
stroke
newpath
57117.3 57068.6 moveto
56890.2 56841.5 lineto
stroke
newpath
57514.5 48419.1 moveto
57741.6 48192.1 lineto
stroke
newpath
57741.6 48419.1 moveto
57514.5 48192.1 lineto
stroke
newpath
57983.7 63071.7 moveto
58210.7 62844.7 lineto
stroke
newpath
58210.7 63071.7 moveto
57983.7 62844.7 lineto
stroke
newpath
58098 56441.2 moveto
58325 56214.2 lineto
stroke
newpath
58325 56441.2 moveto
58098 56214.2 lineto
stroke
newpath
58098 54711.3 moveto
58325 54484.3 lineto
stroke
newpath
58325 54711.3 moveto
58098 54484.3 lineto
stroke
newpath
58908.4 47073.6 moveto
59135.5 46846.6 lineto
stroke
newpath
59135.5 47073.6 moveto
58908.4 46846.6 lineto
stroke
newpath
64226.8 76314.6 moveto
64453.8 76087.6 lineto
stroke
newpath
64453.8 76314.6 moveto
64226.8 76087.6 lineto
stroke
newpath
64226.8 73287.7 moveto
64453.8 73060.7 lineto
stroke
newpath
64453.8 73287.7 moveto
64226.8 73060.7 lineto
stroke
newpath
64226.8 70260.7 moveto
64453.8 70033.7 lineto
stroke
newpath
64453.8 70260.7 moveto
64226.8 70033.7 lineto
stroke
newpath
64226.8 65215.6 moveto
64453.8 64988.6 lineto
stroke
newpath
64453.8 65215.6 moveto
64226.8 64988.6 lineto
stroke
newpath
64226.8 62945.4 moveto
64453.8 62718.4 lineto
stroke
newpath
64453.8 62945.4 moveto
64226.8 62718.4 lineto
stroke
newpath
64226.8 60675.2 moveto
64453.8 60448.1 lineto
stroke
newpath
64453.8 60675.2 moveto
64226.8 60448.1 lineto
stroke
newpath
64226.8 58405 moveto
64453.8 58177.9 lineto
stroke
newpath
64453.8 58405 moveto
64226.8 58177.9 lineto
stroke
newpath
64226.8 56134.8 moveto
64453.8 55907.7 lineto
stroke
newpath
64453.8 56134.8 moveto
64226.8 55907.7 lineto
stroke
newpath
67253.7 76314.6 moveto
67480.8 76087.6 lineto
stroke
newpath
67480.8 76314.6 moveto
67253.7 76087.6 lineto
stroke
newpath
67253.7 73287.7 moveto
67480.8 73060.7 lineto
stroke
newpath
67480.8 73287.7 moveto
67253.7 73060.7 lineto
stroke
newpath
67253.7 70260.7 moveto
67480.8 70033.7 lineto
stroke
newpath
67480.8 70260.7 moveto
67253.7 70033.7 lineto
stroke
newpath
68010.5 65215.6 moveto
68237.5 64988.6 lineto
stroke
newpath
68237.5 65215.6 moveto
68010.5 64988.6 lineto
stroke
newpath
68010.5 62945.4 moveto
68237.5 62718.4 lineto
stroke
newpath
68237.5 62945.4 moveto
68010.5 62718.4 lineto
stroke
newpath
68010.5 60675.2 moveto
68237.5 60448.1 lineto
stroke
newpath
68237.5 60675.2 moveto
68010.5 60448.1 lineto
stroke
newpath
68010.5 58405 moveto
68237.5 58177.9 lineto
stroke
newpath
68237.5 58405 moveto
68010.5 58177.9 lineto
stroke
newpath
68010.5 56134.8 moveto
68237.5 55907.7 lineto
stroke
newpath
68237.5 56134.8 moveto
68010.5 55907.7 lineto
stroke
newpath
68578 49450.5 moveto
68805 49223.5 lineto
stroke
newpath
68805 49450.5 moveto
68578 49223.5 lineto
stroke
newpath
68578 47180.3 moveto
68805 46953.3 lineto
stroke
newpath
68805 47180.3 moveto
68578 46953.3 lineto
stroke
newpath
68578 44910.1 moveto
68805 44683.1 lineto
stroke
newpath
68805 44910.1 moveto
68578 44683.1 lineto
stroke
newpath
68578 42639.9 moveto
68805 42412.9 lineto
stroke
newpath
68805 42639.9 moveto
68578 42412.9 lineto
stroke
newpath
70280.7 76314.6 moveto
70507.7 76087.6 lineto
stroke
newpath
70507.7 76314.6 moveto
70280.7 76087.6 lineto
stroke
newpath
70280.7 73287.7 moveto
70507.7 73060.7 lineto
stroke
newpath
70507.7 73287.7 moveto
70280.7 73060.7 lineto
stroke
newpath
70848.2 49450.5 moveto
71075.2 49223.5 lineto
stroke
newpath
71075.2 49450.5 moveto
70848.2 49223.5 lineto
stroke
newpath
70848.2 47180.3 moveto
71075.2 46953.3 lineto
stroke
newpath
71075.2 47180.3 moveto
70848.2 46953.3 lineto
stroke
newpath
70848.2 44910.1 moveto
71075.2 44683.1 lineto
stroke
newpath
71075.2 44910.1 moveto
70848.2 44683.1 lineto
stroke
newpath
70848.2 42639.9 moveto
71075.2 42412.9 lineto
stroke
newpath
71075.2 42639.9 moveto
70848.2 42412.9 lineto
stroke
newpath
73118.4 49450.5 moveto
73345.5 49223.5 lineto
stroke
newpath
73345.5 49450.5 moveto
73118.4 49223.5 lineto
stroke
newpath
73118.4 47180.3 moveto
73345.5 46953.3 lineto
stroke
newpath
73345.5 47180.3 moveto
73118.4 46953.3 lineto
stroke
newpath
73118.4 44910.1 moveto
73345.5 44683.1 lineto
stroke
newpath
73345.5 44910.1 moveto
73118.4 44683.1 lineto
stroke
newpath
73118.4 42639.9 moveto
73345.5 42412.9 lineto
stroke
newpath
73345.5 42639.9 moveto
73118.4 42412.9 lineto
stroke
newpath
73307.6 76314.6 moveto
73534.6 76087.6 lineto
stroke
newpath
73534.6 76314.6 moveto
73307.6 76087.6 lineto
stroke
newpath
73307.6 73287.7 moveto
73534.6 73060.7 lineto
stroke
newpath
73534.6 73287.7 moveto
73307.6 73060.7 lineto
stroke
newpath
75388.6 49450.5 moveto
75615.7 49223.5 lineto
stroke
newpath
75615.7 49450.5 moveto
75388.6 49223.5 lineto
stroke
newpath
75388.6 47180.3 moveto
75615.7 46953.3 lineto
stroke
newpath
75615.7 47180.3 moveto
75388.6 46953.3 lineto
stroke
newpath
75388.6 44910.1 moveto
75615.7 44683.1 lineto
stroke
newpath
75615.7 44910.1 moveto
75388.6 44683.1 lineto
stroke
newpath
75388.6 42639.9 moveto
75615.7 42412.9 lineto
stroke
newpath
75615.7 42639.9 moveto
75388.6 42412.9 lineto
stroke
44798.4 48882.2 151.347 cir0
46143.8 53591.4 151.347 cir0
47201 54360.2 151.347 cir0
52006.3 46191.2 151.347 cir0
56583.8 65985.2 151.347 cir0
57227.7 42843.4 151.347 cir0
57868.7 51765.4 151.347 cir0
59022 69929.3 151.347 cir0
newpath
38102.8 52989.8 moveto
38102.8 52384.4 lineto
stroke
newpath
37800.1 52687.1 moveto
38405.4 52687.1 lineto
stroke
newpath
38102.8 51097.9 moveto
38102.8 50492.5 lineto
stroke
newpath
37800.1 50795.2 moveto
38405.4 50795.2 lineto
stroke
newpath
38102.8 49206.1 moveto
38102.8 48600.7 lineto
stroke
newpath
37800.1 48903.4 moveto
38405.4 48903.4 lineto
stroke
newpath
38102.8 47314.2 moveto
38102.8 46708.8 lineto
stroke
newpath
37800.1 47011.5 moveto
38405.4 47011.5 lineto
stroke
newpath
38102.8 45422.4 moveto
38102.8 44817 lineto
stroke
newpath
37800.1 45119.7 moveto
38405.4 45119.7 lineto
stroke
newpath
38102.8 43530.6 moveto
38102.8 42925.2 lineto
stroke
newpath
37800.1 43227.9 moveto
38405.4 43227.9 lineto
stroke
newpath
41859.9 39686.3 moveto
41859.9 39081 lineto
stroke
newpath
41557.3 39383.6 moveto
42162.6 39383.6 lineto
stroke
newpath
43751.8 39686.3 moveto
43751.8 39081 lineto
stroke
newpath
43449.1 39383.6 moveto
44054.5 39383.6 lineto
stroke
newpath
45643.6 39686.3 moveto
45643.6 39081 lineto
stroke
newpath
45340.9 39383.6 moveto
45946.3 39383.6 lineto
stroke
newpath
46367.8 56071.9 moveto
46367.8 55466.6 lineto
stroke
newpath
46065.1 55769.2 moveto
46670.5 55769.2 lineto
stroke
newpath
47535.5 39686.3 moveto
47535.5 39081 lineto
stroke
newpath
47232.8 39383.6 moveto
47838.2 39383.6 lineto
stroke
newpath
48259.7 56071.9 moveto
48259.7 55466.6 lineto
stroke
newpath
47957 55769.2 moveto
48562.4 55769.2 lineto
stroke
newpath
48859.8 77151.6 moveto
48859.8 76546.2 lineto
stroke
newpath
48557.1 76848.9 moveto
49162.4 76848.9 lineto
stroke
newpath
49427.3 39686.3 moveto
49427.3 39081 lineto
stroke
newpath
49124.6 39383.6 moveto
49730 39383.6 lineto
stroke
newpath
49441.7 52260.3 moveto
49441.7 51654.9 lineto
stroke
newpath
49139 51957.6 moveto
49744.4 51957.6 lineto
stroke
newpath
50151.5 56071.9 moveto
50151.5 55466.6 lineto
stroke
newpath
49848.8 55769.2 moveto
50454.2 55769.2 lineto
stroke
newpath
50751.6 77151.6 moveto
50751.6 76546.2 lineto
stroke
newpath
50448.9 76848.9 moveto
51054.3 76848.9 lineto
stroke
newpath
51009.6 45532.9 moveto
51009.6 44927.5 lineto
stroke
newpath
50706.9 45230.2 moveto
51312.3 45230.2 lineto
stroke
newpath
51319.1 39686.3 moveto
51319.1 39081 lineto
stroke
newpath
51016.4 39383.6 moveto
51621.8 39383.6 lineto
stroke
newpath
51333.5 52260.3 moveto
51333.5 51654.9 lineto
stroke
newpath
51030.8 51957.6 moveto
51636.2 51957.6 lineto
stroke
newpath
52043.3 56071.9 moveto
52043.3 55466.6 lineto
stroke
newpath
51740.6 55769.2 moveto
52346 55769.2 lineto
stroke
newpath
52643.4 77151.6 moveto
52643.4 76546.2 lineto
stroke
newpath
52340.7 76848.9 moveto
52946.1 76848.9 lineto
stroke
newpath
52901.5 45532.9 moveto
52901.5 44927.5 lineto
stroke
newpath
52598.8 45230.2 moveto
53204.2 45230.2 lineto
stroke
newpath
53211 39686.3 moveto
53211 39081 lineto
stroke
newpath
52908.3 39383.6 moveto
53513.7 39383.6 lineto
stroke
newpath
54535.3 77151.6 moveto
54535.3 76546.2 lineto
stroke
newpath
54232.6 76848.9 moveto
54838 76848.9 lineto
stroke
newpath
54793.3 45532.9 moveto
54793.3 44927.5 lineto
stroke
newpath
54490.6 45230.2 moveto
55096 45230.2 lineto
stroke
newpath
55102.8 39686.3 moveto
55102.8 39081 lineto
stroke
newpath
54800.1 39383.6 moveto
55405.5 39383.6 lineto
stroke
newpath
56427.1 77151.6 moveto
56427.1 76546.2 lineto
stroke
newpath
56124.4 76848.9 moveto
56729.8 76848.9 lineto
stroke
newpath
56994.7 39686.3 moveto
56994.7 39081 lineto
stroke
newpath
56692 39383.6 moveto
57297.4 39383.6 lineto
stroke
newpath
58886.5 39686.3 moveto
58886.5 39081 lineto
stroke
newpath
58583.8 39383.6 moveto
59189.2 39383.6 lineto
stroke
newpath
60778.3 39686.3 moveto
60778.3 39081 lineto
stroke
newpath
60475.6 39383.6 moveto
61081 39383.6 lineto
stroke
newpath
62670.2 39686.3 moveto
62670.2 39081 lineto
stroke
newpath
62367.5 39383.6 moveto
62972.9 39383.6 lineto
stroke
newpath
64562 39686.3 moveto
64562 39081 lineto
stroke
newpath
64259.3 39383.6 moveto
64864.7 39383.6 lineto
stroke
newpath
66453.9 39686.3 moveto
66453.9 39081 lineto
stroke
newpath
66151.2 39383.6 moveto
66756.6 39383.6 lineto
stroke
newpath
78896.9 63854.2 moveto
78896.9 63248.8 lineto
stroke
newpath
78594.2 63551.5 moveto
79199.6 63551.5 lineto
stroke
newpath
78896.9 61962.4 moveto
78896.9 61357 lineto
stroke
newpath
78594.2 61659.7 moveto
79199.6 61659.7 lineto
stroke
newpath
78896.9 60070.5 moveto
78896.9 59465.1 lineto
stroke
newpath
78594.2 59767.8 moveto
79199.6 59767.8 lineto
stroke
newpath
78896.9 58178.7 moveto
78896.9 57573.3 lineto
stroke
newpath
78594.2 57876 moveto
79199.6 57876 lineto
stroke
newpath
78896.9 56286.9 moveto
78896.9 55681.5 lineto
stroke
newpath
78594.2 55984.2 moveto
79199.6 55984.2 lineto
stroke
newpath
78896.9 54395 moveto
78896.9 53789.6 lineto
stroke
newpath
78594.2 54092.3 moveto
79199.6 54092.3 lineto
stroke
newpath
78896.9 52503.2 moveto
78896.9 51897.8 lineto
stroke
newpath
78594.2 52200.5 moveto
79199.6 52200.5 lineto
stroke
newpath
78896.9 50611.3 moveto
78896.9 50005.9 lineto
stroke
newpath
78594.2 50308.6 moveto
79199.6 50308.6 lineto
stroke
newpath
38927.1 75512.2 moveto
38927.1 77224.5 lineto
37214.8 77224.5 lineto
37214.8 75512.2 lineto
38927.1 75512.2 lineto
poly0
newpath
38927.1 38511.6 moveto
38927.1 40223.9 lineto
37214.8 40223.9 lineto
37214.8 38511.6 lineto
38927.1 38511.6 lineto
poly0
newpath
79675.8 75416.1 moveto
79675.8 77128.4 lineto
77963.5 77128.4 lineto
77963.5 75416.1 lineto
79675.8 75416.1 lineto
poly0
newpath
79675.8 38607.7 moveto
79675.8 40320 lineto
77963.5 40320 lineto
77963.5 38607.7 lineto
79675.8 38607.7 lineto
poly0
118.111 setlinewidth
newpath
36774.8 35175.5 moveto
36774.8 36356.6 lineto
37056 36356.6 lineto
37224.7 36300.3 lineto
37337.2 36187.9 lineto
37393.5 36075.4 lineto
37449.7 35850.4 lineto
37449.7 35681.7 lineto
37393.5 35456.7 lineto
37337.2 35344.2 lineto
37224.7 35231.7 lineto
37056 35175.5 lineto
36774.8 35175.5 lineto
stroke
newpath
37955.9 35175.5 moveto
37955.9 35962.9 lineto
stroke
newpath
37955.9 35737.9 moveto
38012.1 35850.4 lineto
38068.4 35906.6 lineto
38180.9 35962.9 lineto
38293.3 35962.9 lineto
stroke
newpath
38687 35175.5 moveto
38687 35962.9 lineto
stroke
newpath
38687 36356.6 moveto
38630.8 36300.3 lineto
38687 36244.1 lineto
38743.3 36300.3 lineto
38687 36356.6 lineto
38687 36244.1 lineto
stroke
newpath
39418.2 35175.5 moveto
39305.7 35231.7 lineto
39249.5 35344.2 lineto
39249.5 36356.6 lineto
stroke
newpath
40036.9 35175.5 moveto
39924.4 35231.7 lineto
39868.1 35344.2 lineto
39868.1 36356.6 lineto
stroke
newpath
41386.7 35175.5 moveto
41386.7 36356.6 lineto
41780.4 35512.9 lineto
42174.1 36356.6 lineto
42174.1 35175.5 lineto
stroke
newpath
43242.7 35175.5 moveto
43242.7 35794.2 lineto
43186.5 35906.6 lineto
43074 35962.9 lineto
42849 35962.9 lineto
42736.5 35906.6 lineto
stroke
newpath
43242.7 35231.7 moveto
43130.2 35175.5 lineto
42849 35175.5 lineto
42736.5 35231.7 lineto
42680.3 35344.2 lineto
42680.3 35456.7 lineto
42736.5 35569.2 lineto
42849 35625.4 lineto
43130.2 35625.4 lineto
43242.7 35681.7 lineto
stroke
newpath
43805.2 35962.9 moveto
43805.2 34781.8 lineto
stroke
newpath
43805.2 35906.6 moveto
43917.6 35962.9 lineto
44142.6 35962.9 lineto
44255.1 35906.6 lineto
44311.3 35850.4 lineto
44367.6 35737.9 lineto
44367.6 35400.5 lineto
44311.3 35288 lineto
44255.1 35231.7 lineto
44142.6 35175.5 lineto
43917.6 35175.5 lineto
43805.2 35231.7 lineto
stroke
newpath
44873.8 35288 moveto
44930 35231.7 lineto
44873.8 35175.5 lineto
44817.5 35231.7 lineto
44873.8 35288 lineto
44873.8 35175.5 lineto
stroke
newpath
44873.8 35906.6 moveto
44930 35850.4 lineto
44873.8 35794.2 lineto
44817.5 35850.4 lineto
44873.8 35906.6 lineto
44873.8 35794.2 lineto
stroke
newpath
35479.1 33343 moveto
35706.2 33116 lineto
stroke
newpath
35706.2 33343 moveto
35479.1 33116 lineto
stroke
newpath
36999.8 33876.3 moveto
37112.2 33876.3 lineto
37224.7 33820 lineto
37281 33763.8 lineto
37337.2 33651.3 lineto
37393.5 33426.3 lineto
37393.5 33145.1 lineto
37337.2 32920.1 lineto
37281 32807.7 lineto
37224.7 32751.4 lineto
37112.2 32695.2 lineto
36999.8 32695.2 lineto
36887.3 32751.4 lineto
36831 32807.7 lineto
36774.8 32920.1 lineto
36718.5 33145.1 lineto
36718.5 33426.3 lineto
36774.8 33651.3 lineto
36831 33763.8 lineto
36887.3 33820 lineto
36999.8 33876.3 lineto
stroke
newpath
37899.6 32807.7 moveto
37955.9 32751.4 lineto
37899.6 32695.2 lineto
37843.4 32751.4 lineto
37899.6 32807.7 lineto
37899.6 32695.2 lineto
stroke
newpath
38349.6 33876.3 moveto
39080.7 33876.3 lineto
38687 33426.3 lineto
38855.8 33426.3 lineto
38968.3 33370.1 lineto
39024.5 33313.8 lineto
39080.7 33201.4 lineto
39080.7 32920.1 lineto
39024.5 32807.7 lineto
38968.3 32751.4 lineto
38855.8 32695.2 lineto
38518.3 32695.2 lineto
38405.8 32751.4 lineto
38349.6 32807.7 lineto
stroke
newpath
39811.9 33876.3 moveto
39924.4 33876.3 lineto
40036.9 33820 lineto
40093.1 33763.8 lineto
40149.4 33651.3 lineto
40205.6 33426.3 lineto
40205.6 33145.1 lineto
40149.4 32920.1 lineto
40093.1 32807.7 lineto
40036.9 32751.4 lineto
39924.4 32695.2 lineto
39811.9 32695.2 lineto
39699.4 32751.4 lineto
39643.2 32807.7 lineto
39586.9 32920.1 lineto
39530.7 33145.1 lineto
39530.7 33426.3 lineto
39586.9 33651.3 lineto
39643.2 33763.8 lineto
39699.4 33820 lineto
39811.9 33876.3 lineto
stroke
newpath
40711.8 32695.2 moveto
40711.8 33482.6 lineto
stroke
newpath
40711.8 33370.1 moveto
40768 33426.3 lineto
40880.5 33482.6 lineto
41049.3 33482.6 lineto
41161.7 33426.3 lineto
41218 33313.8 lineto
41218 32695.2 lineto
stroke
newpath
41218 33313.8 moveto
41274.2 33426.3 lineto
41386.7 33482.6 lineto
41555.4 33482.6 lineto
41667.9 33426.3 lineto
41724.2 33313.8 lineto
41724.2 32695.2 lineto
stroke
newpath
42286.6 32695.2 moveto
42286.6 33482.6 lineto
stroke
newpath
42286.6 33370.1 moveto
42342.8 33426.3 lineto
42455.3 33482.6 lineto
42624.1 33482.6 lineto
42736.5 33426.3 lineto
42792.8 33313.8 lineto
42792.8 32695.2 lineto
stroke
newpath
42792.8 33313.8 moveto
42849 33426.3 lineto
42961.5 33482.6 lineto
43130.2 33482.6 lineto
43242.7 33426.3 lineto
43299 33313.8 lineto
43299 32695.2 lineto
stroke
newpath
45604.9 33932.5 moveto
44592.6 32414 lineto
stroke
newpath
47123.5 33876.3 moveto
47236 33876.3 lineto
47348.5 33820 lineto
47404.7 33763.8 lineto
47461 33651.3 lineto
47517.2 33426.3 lineto
47517.2 33145.1 lineto
47461 32920.1 lineto
47404.7 32807.7 lineto
47348.5 32751.4 lineto
47236 32695.2 lineto
47123.5 32695.2 lineto
47011 32751.4 lineto
46954.8 32807.7 lineto
46898.5 32920.1 lineto
46842.3 33145.1 lineto
46842.3 33426.3 lineto
46898.5 33651.3 lineto
46954.8 33763.8 lineto
47011 33820 lineto
47123.5 33876.3 lineto
stroke
newpath
48023.4 32807.7 moveto
48079.6 32751.4 lineto
48023.4 32695.2 lineto
47967.1 32751.4 lineto
48023.4 32807.7 lineto
48023.4 32695.2 lineto
stroke
newpath
48810.8 33876.3 moveto
48923.3 33876.3 lineto
49035.8 33820 lineto
49092 33763.8 lineto
49148.2 33651.3 lineto
49204.5 33426.3 lineto
49204.5 33145.1 lineto
49148.2 32920.1 lineto
49092 32807.7 lineto
49035.8 32751.4 lineto
48923.3 32695.2 lineto
48810.8 32695.2 lineto
48698.3 32751.4 lineto
48642.1 32807.7 lineto
48585.8 32920.1 lineto
48529.6 33145.1 lineto
48529.6 33426.3 lineto
48585.8 33651.3 lineto
48642.1 33763.8 lineto
48698.3 33820 lineto
48810.8 33876.3 lineto
stroke
newpath
50329.3 32695.2 moveto
49654.4 32695.2 lineto
stroke
newpath
49991.9 32695.2 moveto
49991.9 33876.3 lineto
49879.4 33707.5 lineto
49766.9 33595.1 lineto
49654.4 33538.8 lineto
stroke
newpath
50779.3 33763.8 moveto
50835.5 33820 lineto
50948 33876.3 lineto
51229.2 33876.3 lineto
51341.7 33820 lineto
51398 33763.8 lineto
51454.2 33651.3 lineto
51454.2 33538.8 lineto
51398 33370.1 lineto
50723 32695.2 lineto
51454.2 32695.2 lineto
stroke
newpath
51904.1 33876.3 moveto
51904.1 33651.3 lineto
stroke
newpath
52354.1 33876.3 moveto
52354.1 33651.3 lineto
stroke
newpath
54097.6 32245.2 moveto
54041.4 32301.5 lineto
53928.9 32470.2 lineto
53872.7 32582.7 lineto
53816.4 32751.4 lineto
53760.2 33032.6 lineto
53760.2 33257.6 lineto
53816.4 33538.8 lineto
53872.7 33707.5 lineto
53928.9 33820 lineto
54041.4 33988.8 lineto
54097.6 34045 lineto
stroke
newpath
54716.3 33370.1 moveto
54603.8 33426.3 lineto
54547.6 33482.6 lineto
54491.3 33595.1 lineto
54491.3 33651.3 lineto
54547.6 33763.8 lineto
54603.8 33820 lineto
54716.3 33876.3 lineto
54941.3 33876.3 lineto
55053.8 33820 lineto
55110 33763.8 lineto
55166.2 33651.3 lineto
55166.2 33595.1 lineto
55110 33482.6 lineto
55053.8 33426.3 lineto
54941.3 33370.1 lineto
54716.3 33370.1 lineto
54603.8 33313.8 lineto
54547.6 33257.6 lineto
54491.3 33145.1 lineto
54491.3 32920.1 lineto
54547.6 32807.7 lineto
54603.8 32751.4 lineto
54716.3 32695.2 lineto
54941.3 32695.2 lineto
55053.8 32751.4 lineto
55110 32807.7 lineto
55166.2 32920.1 lineto
55166.2 33145.1 lineto
55110 33257.6 lineto
55053.8 33313.8 lineto
54941.3 33370.1 lineto
stroke
newpath
55897.4 33876.3 moveto
56009.9 33876.3 lineto
56122.4 33820 lineto
56178.6 33763.8 lineto
56234.9 33651.3 lineto
56291.1 33426.3 lineto
56291.1 33145.1 lineto
56234.9 32920.1 lineto
56178.6 32807.7 lineto
56122.4 32751.4 lineto
56009.9 32695.2 lineto
55897.4 32695.2 lineto
55784.9 32751.4 lineto
55728.7 32807.7 lineto
55672.4 32920.1 lineto
55616.2 33145.1 lineto
55616.2 33426.3 lineto
55672.4 33651.3 lineto
55728.7 33763.8 lineto
55784.9 33820 lineto
55897.4 33876.3 lineto
stroke
newpath
57697.2 32695.2 moveto
57697.2 33876.3 lineto
stroke
newpath
58203.4 32695.2 moveto
58203.4 33313.8 lineto
58147.1 33426.3 lineto
58034.6 33482.6 lineto
57865.9 33482.6 lineto
57753.4 33426.3 lineto
57697.2 33370.1 lineto
stroke
newpath
58934.5 32695.2 moveto
58822 32751.4 lineto
58765.8 32807.7 lineto
58709.5 32920.1 lineto
58709.5 33257.6 lineto
58765.8 33370.1 lineto
58822 33426.3 lineto
58934.5 33482.6 lineto
59103.3 33482.6 lineto
59215.7 33426.3 lineto
59272 33370.1 lineto
59328.2 33257.6 lineto
59328.2 32920.1 lineto
59272 32807.7 lineto
59215.7 32751.4 lineto
59103.3 32695.2 lineto
58934.5 32695.2 lineto
stroke
newpath
60003.1 32695.2 moveto
59890.7 32751.4 lineto
59834.4 32863.9 lineto
59834.4 33876.3 lineto
stroke
newpath
60903 32751.4 moveto
60790.5 32695.2 lineto
60565.6 32695.2 lineto
60453.1 32751.4 lineto
60396.8 32863.9 lineto
60396.8 33313.8 lineto
60453.1 33426.3 lineto
60565.6 33482.6 lineto
60790.5 33482.6 lineto
60903 33426.3 lineto
60959.3 33313.8 lineto
60959.3 33201.4 lineto
60396.8 33088.9 lineto
stroke
newpath
61409.2 32751.4 moveto
61521.7 32695.2 lineto
61746.7 32695.2 lineto
61859.2 32751.4 lineto
61915.4 32863.9 lineto
61915.4 32920.1 lineto
61859.2 33032.6 lineto
61746.7 33088.9 lineto
61577.9 33088.9 lineto
61465.5 33145.1 lineto
61409.2 33257.6 lineto
61409.2 33313.8 lineto
61465.5 33426.3 lineto
61577.9 33482.6 lineto
61746.7 33482.6 lineto
61859.2 33426.3 lineto
stroke
newpath
62309.1 32245.2 moveto
62365.3 32301.5 lineto
62477.8 32470.2 lineto
62534.1 32582.7 lineto
62590.3 32751.4 lineto
62646.6 33032.6 lineto
62646.6 33257.6 lineto
62590.3 33538.8 lineto
62534.1 33707.5 lineto
62477.8 33820 lineto
62365.3 33988.8 lineto
62309.1 34045 lineto
stroke
35554.8 31670.4 151.347 cir0
newpath
36999.8 32317.2 moveto
37112.2 32317.2 lineto
37224.7 32261 lineto
37281 32204.7 lineto
37337.2 32092.2 lineto
37393.5 31867.3 lineto
37393.5 31586.1 lineto
37337.2 31361.1 lineto
37281 31248.6 lineto
37224.7 31192.4 lineto
37112.2 31136.1 lineto
36999.8 31136.1 lineto
36887.3 31192.4 lineto
36831 31248.6 lineto
36774.8 31361.1 lineto
36718.5 31586.1 lineto
36718.5 31867.3 lineto
36774.8 32092.2 lineto
36831 32204.7 lineto
36887.3 32261 lineto
36999.8 32317.2 lineto
stroke
newpath
37899.6 31248.6 moveto
37955.9 31192.4 lineto
37899.6 31136.1 lineto
37843.4 31192.4 lineto
37899.6 31248.6 lineto
37899.6 31136.1 lineto
stroke
newpath
38968.3 31923.5 moveto
38968.3 31136.1 lineto
stroke
newpath
38687 32373.5 moveto
38405.8 31529.8 lineto
39137 31529.8 lineto
stroke
newpath
39811.9 32317.2 moveto
39924.4 32317.2 lineto
40036.9 32261 lineto
40093.1 32204.7 lineto
40149.4 32092.2 lineto
40205.6 31867.3 lineto
40205.6 31586.1 lineto
40149.4 31361.1 lineto
40093.1 31248.6 lineto
40036.9 31192.4 lineto
39924.4 31136.1 lineto
39811.9 31136.1 lineto
39699.4 31192.4 lineto
39643.2 31248.6 lineto
39586.9 31361.1 lineto
39530.7 31586.1 lineto
39530.7 31867.3 lineto
39586.9 32092.2 lineto
39643.2 32204.7 lineto
39699.4 32261 lineto
39811.9 32317.2 lineto
stroke
newpath
40711.8 31136.1 moveto
40711.8 31923.5 lineto
stroke
newpath
40711.8 31811 moveto
40768 31867.3 lineto
40880.5 31923.5 lineto
41049.3 31923.5 lineto
41161.7 31867.3 lineto
41218 31754.8 lineto
41218 31136.1 lineto
stroke
newpath
41218 31754.8 moveto
41274.2 31867.3 lineto
41386.7 31923.5 lineto
41555.4 31923.5 lineto
41667.9 31867.3 lineto
41724.2 31754.8 lineto
41724.2 31136.1 lineto
stroke
newpath
42286.6 31136.1 moveto
42286.6 31923.5 lineto
stroke
newpath
42286.6 31811 moveto
42342.8 31867.3 lineto
42455.3 31923.5 lineto
42624.1 31923.5 lineto
42736.5 31867.3 lineto
42792.8 31754.8 lineto
42792.8 31136.1 lineto
stroke
newpath
42792.8 31754.8 moveto
42849 31867.3 lineto
42961.5 31923.5 lineto
43130.2 31923.5 lineto
43242.7 31867.3 lineto
43299 31754.8 lineto
43299 31136.1 lineto
stroke
newpath
45604.9 32373.5 moveto
44592.6 30854.9 lineto
stroke
newpath
47123.5 32317.2 moveto
47236 32317.2 lineto
47348.5 32261 lineto
47404.7 32204.7 lineto
47461 32092.2 lineto
47517.2 31867.3 lineto
47517.2 31586.1 lineto
47461 31361.1 lineto
47404.7 31248.6 lineto
47348.5 31192.4 lineto
47236 31136.1 lineto
47123.5 31136.1 lineto
47011 31192.4 lineto
46954.8 31248.6 lineto
46898.5 31361.1 lineto
46842.3 31586.1 lineto
46842.3 31867.3 lineto
46898.5 32092.2 lineto
46954.8 32204.7 lineto
47011 32261 lineto
47123.5 32317.2 lineto
stroke
newpath
48023.4 31248.6 moveto
48079.6 31192.4 lineto
48023.4 31136.1 lineto
47967.1 31192.4 lineto
48023.4 31248.6 lineto
48023.4 31136.1 lineto
stroke
newpath
48810.8 32317.2 moveto
48923.3 32317.2 lineto
49035.8 32261 lineto
49092 32204.7 lineto
49148.2 32092.2 lineto
49204.5 31867.3 lineto
49204.5 31586.1 lineto
49148.2 31361.1 lineto
49092 31248.6 lineto
49035.8 31192.4 lineto
48923.3 31136.1 lineto
48810.8 31136.1 lineto
48698.3 31192.4 lineto
48642.1 31248.6 lineto
48585.8 31361.1 lineto
48529.6 31586.1 lineto
48529.6 31867.3 lineto
48585.8 32092.2 lineto
48642.1 32204.7 lineto
48698.3 32261 lineto
48810.8 32317.2 lineto
stroke
newpath
50329.3 31136.1 moveto
49654.4 31136.1 lineto
stroke
newpath
49991.9 31136.1 moveto
49991.9 32317.2 lineto
49879.4 32148.5 lineto
49766.9 32036 lineto
49654.4 31979.8 lineto
stroke
newpath
51341.7 32317.2 moveto
51116.7 32317.2 lineto
51004.3 32261 lineto
50948 32204.7 lineto
50835.5 32036 lineto
50779.3 31811 lineto
50779.3 31361.1 lineto
50835.5 31248.6 lineto
50891.8 31192.4 lineto
51004.3 31136.1 lineto
51229.2 31136.1 lineto
51341.7 31192.4 lineto
51398 31248.6 lineto
51454.2 31361.1 lineto
51454.2 31642.3 lineto
51398 31754.8 lineto
51341.7 31811 lineto
51229.2 31867.3 lineto
51004.3 31867.3 lineto
50891.8 31811 lineto
50835.5 31754.8 lineto
50779.3 31642.3 lineto
stroke
newpath
51904.1 32317.2 moveto
51904.1 32092.2 lineto
stroke
newpath
52354.1 32317.2 moveto
52354.1 32092.2 lineto
stroke
newpath
54097.6 30686.2 moveto
54041.4 30742.4 lineto
53928.9 30911.1 lineto
53872.7 31023.6 lineto
53816.4 31192.4 lineto
53760.2 31473.6 lineto
53760.2 31698.5 lineto
53816.4 31979.8 lineto
53872.7 32148.5 lineto
53928.9 32261 lineto
54041.4 32429.7 lineto
54097.6 32485.9 lineto
stroke
newpath
54716.3 31811 moveto
54603.8 31867.3 lineto
54547.6 31923.5 lineto
54491.3 32036 lineto
54491.3 32092.2 lineto
54547.6 32204.7 lineto
54603.8 32261 lineto
54716.3 32317.2 lineto
54941.3 32317.2 lineto
55053.8 32261 lineto
55110 32204.7 lineto
55166.2 32092.2 lineto
55166.2 32036 lineto
55110 31923.5 lineto
55053.8 31867.3 lineto
54941.3 31811 lineto
54716.3 31811 lineto
54603.8 31754.8 lineto
54547.6 31698.5 lineto
54491.3 31586.1 lineto
54491.3 31361.1 lineto
54547.6 31248.6 lineto
54603.8 31192.4 lineto
54716.3 31136.1 lineto
54941.3 31136.1 lineto
55053.8 31192.4 lineto
55110 31248.6 lineto
55166.2 31361.1 lineto
55166.2 31586.1 lineto
55110 31698.5 lineto
55053.8 31754.8 lineto
54941.3 31811 lineto
stroke
newpath
56572.3 31136.1 moveto
56572.3 32317.2 lineto
stroke
newpath
57078.5 31136.1 moveto
57078.5 31754.8 lineto
57022.3 31867.3 lineto
56909.8 31923.5 lineto
56741 31923.5 lineto
56628.6 31867.3 lineto
56572.3 31811 lineto
stroke
newpath
57809.7 31136.1 moveto
57697.2 31192.4 lineto
57640.9 31248.6 lineto
57584.7 31361.1 lineto
57584.7 31698.5 lineto
57640.9 31811 lineto
57697.2 31867.3 lineto
57809.7 31923.5 lineto
57978.4 31923.5 lineto
58090.9 31867.3 lineto
58147.1 31811 lineto
58203.4 31698.5 lineto
58203.4 31361.1 lineto
58147.1 31248.6 lineto
58090.9 31192.4 lineto
57978.4 31136.1 lineto
57809.7 31136.1 lineto
stroke
newpath
58878.3 31136.1 moveto
58765.8 31192.4 lineto
58709.5 31304.8 lineto
58709.5 32317.2 lineto
stroke
newpath
59778.2 31192.4 moveto
59665.7 31136.1 lineto
59440.7 31136.1 lineto
59328.2 31192.4 lineto
59272 31304.8 lineto
59272 31754.8 lineto
59328.2 31867.3 lineto
59440.7 31923.5 lineto
59665.7 31923.5 lineto
59778.2 31867.3 lineto
59834.4 31754.8 lineto
59834.4 31642.3 lineto
59272 31529.8 lineto
stroke
newpath
60284.4 31192.4 moveto
60396.8 31136.1 lineto
60621.8 31136.1 lineto
60734.3 31192.4 lineto
60790.5 31304.8 lineto
60790.5 31361.1 lineto
60734.3 31473.6 lineto
60621.8 31529.8 lineto
60453.1 31529.8 lineto
60340.6 31586.1 lineto
60284.4 31698.5 lineto
60284.4 31754.8 lineto
60340.6 31867.3 lineto
60453.1 31923.5 lineto
60621.8 31923.5 lineto
60734.3 31867.3 lineto
stroke
newpath
61184.2 30686.2 moveto
61240.5 30742.4 lineto
61353 30911.1 lineto
61409.2 31023.6 lineto
61465.5 31192.4 lineto
61521.7 31473.6 lineto
61521.7 31698.5 lineto
61465.5 31979.8 lineto
61409.2 32148.5 lineto
61353 32261 lineto
61240.5 32429.7 lineto
61184.2 32485.9 lineto
stroke
newpath
35403.5 30414.1 moveto
35403.5 29808.7 lineto
stroke
newpath
35100.8 30111.4 moveto
35706.2 30111.4 lineto
stroke
newpath
36999.8 30758.2 moveto
37112.2 30758.2 lineto
37224.7 30701.9 lineto
37281 30645.7 lineto
37337.2 30533.2 lineto
37393.5 30308.2 lineto
37393.5 30027 lineto
37337.2 29802 lineto
37281 29689.5 lineto
37224.7 29633.3 lineto
37112.2 29577.1 lineto
36999.8 29577.1 lineto
36887.3 29633.3 lineto
36831 29689.5 lineto
36774.8 29802 lineto
36718.5 30027 lineto
36718.5 30308.2 lineto
36774.8 30533.2 lineto
36831 30645.7 lineto
36887.3 30701.9 lineto
36999.8 30758.2 lineto
stroke
newpath
37899.6 29689.5 moveto
37955.9 29633.3 lineto
37899.6 29577.1 lineto
37843.4 29633.3 lineto
37899.6 29689.5 lineto
37899.6 29577.1 lineto
stroke
newpath
38630.8 30252 moveto
38518.3 30308.2 lineto
38462.1 30364.5 lineto
38405.8 30476.9 lineto
38405.8 30533.2 lineto
38462.1 30645.7 lineto
38518.3 30701.9 lineto
38630.8 30758.2 lineto
38855.8 30758.2 lineto
38968.3 30701.9 lineto
39024.5 30645.7 lineto
39080.7 30533.2 lineto
39080.7 30476.9 lineto
39024.5 30364.5 lineto
38968.3 30308.2 lineto
38855.8 30252 lineto
38630.8 30252 lineto
38518.3 30195.7 lineto
38462.1 30139.5 lineto
38405.8 30027 lineto
38405.8 29802 lineto
38462.1 29689.5 lineto
38518.3 29633.3 lineto
38630.8 29577.1 lineto
38855.8 29577.1 lineto
38968.3 29633.3 lineto
39024.5 29689.5 lineto
39080.7 29802 lineto
39080.7 30027 lineto
39024.5 30139.5 lineto
38968.3 30195.7 lineto
38855.8 30252 lineto
stroke
newpath
39811.9 30758.2 moveto
39924.4 30758.2 lineto
40036.9 30701.9 lineto
40093.1 30645.7 lineto
40149.4 30533.2 lineto
40205.6 30308.2 lineto
40205.6 30027 lineto
40149.4 29802 lineto
40093.1 29689.5 lineto
40036.9 29633.3 lineto
39924.4 29577.1 lineto
39811.9 29577.1 lineto
39699.4 29633.3 lineto
39643.2 29689.5 lineto
39586.9 29802 lineto
39530.7 30027 lineto
39530.7 30308.2 lineto
39586.9 30533.2 lineto
39643.2 30645.7 lineto
39699.4 30701.9 lineto
39811.9 30758.2 lineto
stroke
newpath
40711.8 29577.1 moveto
40711.8 30364.5 lineto
stroke
newpath
40711.8 30252 moveto
40768 30308.2 lineto
40880.5 30364.5 lineto
41049.3 30364.5 lineto
41161.7 30308.2 lineto
41218 30195.7 lineto
41218 29577.1 lineto
stroke
newpath
41218 30195.7 moveto
41274.2 30308.2 lineto
41386.7 30364.5 lineto
41555.4 30364.5 lineto
41667.9 30308.2 lineto
41724.2 30195.7 lineto
41724.2 29577.1 lineto
stroke
newpath
42286.6 29577.1 moveto
42286.6 30364.5 lineto
stroke
newpath
42286.6 30252 moveto
42342.8 30308.2 lineto
42455.3 30364.5 lineto
42624.1 30364.5 lineto
42736.5 30308.2 lineto
42792.8 30195.7 lineto
42792.8 29577.1 lineto
stroke
newpath
42792.8 30195.7 moveto
42849 30308.2 lineto
42961.5 30364.5 lineto
43130.2 30364.5 lineto
43242.7 30308.2 lineto
43299 30195.7 lineto
43299 29577.1 lineto
stroke
newpath
45604.9 30814.4 moveto
44592.6 29295.8 lineto
stroke
newpath
47123.5 30758.2 moveto
47236 30758.2 lineto
47348.5 30701.9 lineto
47404.7 30645.7 lineto
47461 30533.2 lineto
47517.2 30308.2 lineto
47517.2 30027 lineto
47461 29802 lineto
47404.7 29689.5 lineto
47348.5 29633.3 lineto
47236 29577.1 lineto
47123.5 29577.1 lineto
47011 29633.3 lineto
46954.8 29689.5 lineto
46898.5 29802 lineto
46842.3 30027 lineto
46842.3 30308.2 lineto
46898.5 30533.2 lineto
46954.8 30645.7 lineto
47011 30701.9 lineto
47123.5 30758.2 lineto
stroke
newpath
48023.4 29689.5 moveto
48079.6 29633.3 lineto
48023.4 29577.1 lineto
47967.1 29633.3 lineto
48023.4 29689.5 lineto
48023.4 29577.1 lineto
stroke
newpath
48810.8 30758.2 moveto
48923.3 30758.2 lineto
49035.8 30701.9 lineto
49092 30645.7 lineto
49148.2 30533.2 lineto
49204.5 30308.2 lineto
49204.5 30027 lineto
49148.2 29802 lineto
49092 29689.5 lineto
49035.8 29633.3 lineto
48923.3 29577.1 lineto
48810.8 29577.1 lineto
48698.3 29633.3 lineto
48642.1 29689.5 lineto
48585.8 29802 lineto
48529.6 30027 lineto
48529.6 30308.2 lineto
48585.8 30533.2 lineto
48642.1 30645.7 lineto
48698.3 30701.9 lineto
48810.8 30758.2 lineto
stroke
newpath
49598.2 30758.2 moveto
50329.3 30758.2 lineto
49935.6 30308.2 lineto
50104.4 30308.2 lineto
50216.9 30252 lineto
50273.1 30195.7 lineto
50329.3 30083.2 lineto
50329.3 29802 lineto
50273.1 29689.5 lineto
50216.9 29633.3 lineto
50104.4 29577.1 lineto
49766.9 29577.1 lineto
49654.4 29633.3 lineto
49598.2 29689.5 lineto
stroke
newpath
51454.2 29577.1 moveto
50779.3 29577.1 lineto
stroke
newpath
51116.7 29577.1 moveto
51116.7 30758.2 lineto
51004.3 30589.4 lineto
50891.8 30476.9 lineto
50779.3 30420.7 lineto
stroke
newpath
51904.1 30758.2 moveto
51904.1 30533.2 lineto
stroke
newpath
52354.1 30758.2 moveto
52354.1 30533.2 lineto
stroke
newpath
54097.6 29127.1 moveto
54041.4 29183.4 lineto
53928.9 29352.1 lineto
53872.7 29464.6 lineto
53816.4 29633.3 lineto
53760.2 29914.5 lineto
53760.2 30139.5 lineto
53816.4 30420.7 lineto
53872.7 30589.4 lineto
53928.9 30701.9 lineto
54041.4 30870.6 lineto
54097.6 30926.9 lineto
stroke
newpath
55053.8 30364.5 moveto
55053.8 29577.1 lineto
stroke
newpath
54772.5 30814.4 moveto
54491.3 29970.8 lineto
55222.5 29970.8 lineto
stroke
newpath
55616.2 30645.7 moveto
55672.4 30701.9 lineto
55784.9 30758.2 lineto
56066.1 30758.2 lineto
56178.6 30701.9 lineto
56234.9 30645.7 lineto
56291.1 30533.2 lineto
56291.1 30420.7 lineto
56234.9 30252 lineto
55559.9 29577.1 lineto
56291.1 29577.1 lineto
stroke
newpath
57697.2 29577.1 moveto
57697.2 30758.2 lineto
stroke
newpath
58203.4 29577.1 moveto
58203.4 30195.7 lineto
58147.1 30308.2 lineto
58034.6 30364.5 lineto
57865.9 30364.5 lineto
57753.4 30308.2 lineto
57697.2 30252 lineto
stroke
newpath
58934.5 29577.1 moveto
58822 29633.3 lineto
58765.8 29689.5 lineto
58709.5 29802 lineto
58709.5 30139.5 lineto
58765.8 30252 lineto
58822 30308.2 lineto
58934.5 30364.5 lineto
59103.3 30364.5 lineto
59215.7 30308.2 lineto
59272 30252 lineto
59328.2 30139.5 lineto
59328.2 29802 lineto
59272 29689.5 lineto
59215.7 29633.3 lineto
59103.3 29577.1 lineto
58934.5 29577.1 lineto
stroke
newpath
60003.1 29577.1 moveto
59890.7 29633.3 lineto
59834.4 29745.8 lineto
59834.4 30758.2 lineto
stroke
newpath
60903 29633.3 moveto
60790.5 29577.1 lineto
60565.6 29577.1 lineto
60453.1 29633.3 lineto
60396.8 29745.8 lineto
60396.8 30195.7 lineto
60453.1 30308.2 lineto
60565.6 30364.5 lineto
60790.5 30364.5 lineto
60903 30308.2 lineto
60959.3 30195.7 lineto
60959.3 30083.2 lineto
60396.8 29970.8 lineto
stroke
newpath
61409.2 29633.3 moveto
61521.7 29577.1 lineto
61746.7 29577.1 lineto
61859.2 29633.3 lineto
61915.4 29745.8 lineto
61915.4 29802 lineto
61859.2 29914.5 lineto
61746.7 29970.8 lineto
61577.9 29970.8 lineto
61465.5 30027 lineto
61409.2 30139.5 lineto
61409.2 30195.7 lineto
61465.5 30308.2 lineto
61577.9 30364.5 lineto
61746.7 30364.5 lineto
61859.2 30308.2 lineto
stroke
newpath
62309.1 29127.1 moveto
62365.3 29183.4 lineto
62477.8 29352.1 lineto
62534.1 29464.6 lineto
62590.3 29633.3 lineto
62646.6 29914.5 lineto
62646.6 30139.5 lineto
62590.3 30420.7 lineto
62534.1 30589.4 lineto
62477.8 30701.9 lineto
62365.3 30870.6 lineto
62309.1 30926.9 lineto
stroke
newpath
35351.5 27696.2 moveto
35351.5 29408.5 lineto
33639.2 29408.5 lineto
33639.2 27696.2 lineto
35351.5 27696.2 lineto
poly0
newpath
36662.3 29199.1 moveto
37393.5 29199.1 lineto
36999.8 28749.2 lineto
37168.5 28749.2 lineto
37281 28692.9 lineto
37337.2 28636.7 lineto
37393.5 28524.2 lineto
37393.5 28243 lineto
37337.2 28130.5 lineto
37281 28074.2 lineto
37168.5 28018 lineto
36831 28018 lineto
36718.5 28074.2 lineto
36662.3 28130.5 lineto
stroke
newpath
37899.6 28130.5 moveto
37955.9 28074.2 lineto
37899.6 28018 lineto
37843.4 28074.2 lineto
37899.6 28130.5 lineto
37899.6 28018 lineto
stroke
newpath
38405.8 29086.6 moveto
38462.1 29142.9 lineto
38574.6 29199.1 lineto
38855.8 29199.1 lineto
38968.3 29142.9 lineto
39024.5 29086.6 lineto
39080.7 28974.1 lineto
39080.7 28861.6 lineto
39024.5 28692.9 lineto
38349.6 28018 lineto
39080.7 28018 lineto
stroke
newpath
39811.9 29199.1 moveto
39924.4 29199.1 lineto
40036.9 29142.9 lineto
40093.1 29086.6 lineto
40149.4 28974.1 lineto
40205.6 28749.2 lineto
40205.6 28467.9 lineto
40149.4 28243 lineto
40093.1 28130.5 lineto
40036.9 28074.2 lineto
39924.4 28018 lineto
39811.9 28018 lineto
39699.4 28074.2 lineto
39643.2 28130.5 lineto
39586.9 28243 lineto
39530.7 28467.9 lineto
39530.7 28749.2 lineto
39586.9 28974.1 lineto
39643.2 29086.6 lineto
39699.4 29142.9 lineto
39811.9 29199.1 lineto
stroke
newpath
40711.8 28018 moveto
40711.8 28805.4 lineto
stroke
newpath
40711.8 28692.9 moveto
40768 28749.2 lineto
40880.5 28805.4 lineto
41049.3 28805.4 lineto
41161.7 28749.2 lineto
41218 28636.7 lineto
41218 28018 lineto
stroke
newpath
41218 28636.7 moveto
41274.2 28749.2 lineto
41386.7 28805.4 lineto
41555.4 28805.4 lineto
41667.9 28749.2 lineto
41724.2 28636.7 lineto
41724.2 28018 lineto
stroke
newpath
42286.6 28018 moveto
42286.6 28805.4 lineto
stroke
newpath
42286.6 28692.9 moveto
42342.8 28749.2 lineto
42455.3 28805.4 lineto
42624.1 28805.4 lineto
42736.5 28749.2 lineto
42792.8 28636.7 lineto
42792.8 28018 lineto
stroke
newpath
42792.8 28636.7 moveto
42849 28749.2 lineto
42961.5 28805.4 lineto
43130.2 28805.4 lineto
43242.7 28749.2 lineto
43299 28636.7 lineto
43299 28018 lineto
stroke
newpath
45604.9 29255.4 moveto
44592.6 27736.8 lineto
stroke
newpath
47123.5 29199.1 moveto
47236 29199.1 lineto
47348.5 29142.9 lineto
47404.7 29086.6 lineto
47461 28974.1 lineto
47517.2 28749.2 lineto
47517.2 28467.9 lineto
47461 28243 lineto
47404.7 28130.5 lineto
47348.5 28074.2 lineto
47236 28018 lineto
47123.5 28018 lineto
47011 28074.2 lineto
46954.8 28130.5 lineto
46898.5 28243 lineto
46842.3 28467.9 lineto
46842.3 28749.2 lineto
46898.5 28974.1 lineto
46954.8 29086.6 lineto
47011 29142.9 lineto
47123.5 29199.1 lineto
stroke
newpath
48023.4 28130.5 moveto
48079.6 28074.2 lineto
48023.4 28018 lineto
47967.1 28074.2 lineto
48023.4 28130.5 lineto
48023.4 28018 lineto
stroke
newpath
49204.5 28018 moveto
48529.6 28018 lineto
stroke
newpath
48867 28018 moveto
48867 29199.1 lineto
48754.5 29030.4 lineto
48642.1 28917.9 lineto
48529.6 28861.6 lineto
stroke
newpath
49654.4 29086.6 moveto
49710.7 29142.9 lineto
49823.2 29199.1 lineto
50104.4 29199.1 lineto
50216.9 29142.9 lineto
50273.1 29086.6 lineto
50329.3 28974.1 lineto
50329.3 28861.6 lineto
50273.1 28692.9 lineto
49598.2 28018 lineto
50329.3 28018 lineto
stroke
newpath
51341.7 29199.1 moveto
51116.7 29199.1 lineto
51004.3 29142.9 lineto
50948 29086.6 lineto
50835.5 28917.9 lineto
50779.3 28692.9 lineto
50779.3 28243 lineto
50835.5 28130.5 lineto
50891.8 28074.2 lineto
51004.3 28018 lineto
51229.2 28018 lineto
51341.7 28074.2 lineto
51398 28130.5 lineto
51454.2 28243 lineto
51454.2 28524.2 lineto
51398 28636.7 lineto
51341.7 28692.9 lineto
51229.2 28749.2 lineto
51004.3 28749.2 lineto
50891.8 28692.9 lineto
50835.5 28636.7 lineto
50779.3 28524.2 lineto
stroke
newpath
51904.1 29199.1 moveto
51904.1 28974.1 lineto
stroke
newpath
52354.1 29199.1 moveto
52354.1 28974.1 lineto
stroke
newpath
54097.6 27568.1 moveto
54041.4 27624.3 lineto
53928.9 27793 lineto
53872.7 27905.5 lineto
53816.4 28074.2 lineto
53760.2 28355.5 lineto
53760.2 28580.4 lineto
53816.4 28861.6 lineto
53872.7 29030.4 lineto
53928.9 29142.9 lineto
54041.4 29311.6 lineto
54097.6 29367.8 lineto
stroke
newpath
55053.8 28805.4 moveto
55053.8 28018 lineto
stroke
newpath
54772.5 29255.4 moveto
54491.3 28411.7 lineto
55222.5 28411.7 lineto
stroke
newpath
56572.3 28018 moveto
56572.3 29199.1 lineto
stroke
newpath
57078.5 28018 moveto
57078.5 28636.7 lineto
57022.3 28749.2 lineto
56909.8 28805.4 lineto
56741 28805.4 lineto
56628.6 28749.2 lineto
56572.3 28692.9 lineto
stroke
newpath
57809.7 28018 moveto
57697.2 28074.2 lineto
57640.9 28130.5 lineto
57584.7 28243 lineto
57584.7 28580.4 lineto
57640.9 28692.9 lineto
57697.2 28749.2 lineto
57809.7 28805.4 lineto
57978.4 28805.4 lineto
58090.9 28749.2 lineto
58147.1 28692.9 lineto
58203.4 28580.4 lineto
58203.4 28243 lineto
58147.1 28130.5 lineto
58090.9 28074.2 lineto
57978.4 28018 lineto
57809.7 28018 lineto
stroke
newpath
58878.3 28018 moveto
58765.8 28074.2 lineto
58709.5 28186.7 lineto
58709.5 29199.1 lineto
stroke
newpath
59778.2 28074.2 moveto
59665.7 28018 lineto
59440.7 28018 lineto
59328.2 28074.2 lineto
59272 28186.7 lineto
59272 28636.7 lineto
59328.2 28749.2 lineto
59440.7 28805.4 lineto
59665.7 28805.4 lineto
59778.2 28749.2 lineto
59834.4 28636.7 lineto
59834.4 28524.2 lineto
59272 28411.7 lineto
stroke
newpath
60284.4 28074.2 moveto
60396.8 28018 lineto
60621.8 28018 lineto
60734.3 28074.2 lineto
60790.5 28186.7 lineto
60790.5 28243 lineto
60734.3 28355.5 lineto
60621.8 28411.7 lineto
60453.1 28411.7 lineto
60340.6 28467.9 lineto
60284.4 28580.4 lineto
60284.4 28636.7 lineto
60340.6 28749.2 lineto
60453.1 28805.4 lineto
60621.8 28805.4 lineto
60734.3 28749.2 lineto
stroke
newpath
61184.2 27568.1 moveto
61240.5 27624.3 lineto
61353 27793 lineto
61409.2 27905.5 lineto
61465.5 28074.2 lineto
61521.7 28355.5 lineto
61521.7 28580.4 lineto
61465.5 28861.6 lineto
61409.2 29030.4 lineto
61353 29142.9 lineto
61240.5 29311.6 lineto
61184.2 29367.8 lineto
stroke
showpage
grestore
%%EOF
