(module Lora_DRF1276G (layer F.Cu) (tedit 5BACD643)
  (attr smd)
  (fp_text reference Lora_DRF1276G (at 0.1 -10.95) (layer F.SilkS) hide
    (effects (font (size 1.40302 1.40302) (thickness 0.1)))
  )
  (fp_text value VAL** (at 0.15 10.55) (layer F.SilkS)
    (effects (font (size 1.40376 1.40376) (thickness 0.15)))
  )
  (fp_circle (center -10.75 -8.85) (end -10.6 -8.85) (layer F.SilkS) (width 0.3))
  (fp_circle (center -10.75 -8.85) (end -10.6 -8.85) (layer Dwgs.User) (width 0.3))
  (pad 1 smd rect (at -8.625 -7.425 180) (size 2.5 1.5) (layers F.Cu F.Paste F.Mask))
  (pad 2 smd rect (at -8.625 -5.425 180) (size 2.5 1.5) (layers F.Cu F.Paste F.Mask))
  (pad 3 smd rect (at -8.625 -3.425 180) (size 2.5 1.5) (layers F.Cu F.Paste F.Mask))
  (pad 4 smd rect (at -8.625 -1.425 180) (size 2.5 1.5) (layers F.Cu F.Paste F.Mask))
  (pad 5 smd rect (at -8.625 0.575 180) (size 2.5 1.5) (layers F.Cu F.Paste F.Mask))
  (pad 6 smd rect (at -8.625 2.575 180) (size 2.5 1.5) (layers F.Cu F.Paste F.Mask))
  (pad 7 smd rect (at -8.625 4.575 180) (size 2.5 1.5) (layers F.Cu F.Paste F.Mask))
  (pad 8 smd rect (at -8.625 6.575 180) (size 2.5 1.5) (layers F.Cu F.Paste F.Mask))
  (pad 9 smd rect (at 7.975 6.575 180) (size 2.5 1.5) (layers F.Cu F.Paste F.Mask))
  (pad 10 smd rect (at 7.975 4.575 180) (size 2.5 1.5) (layers F.Cu F.Paste F.Mask))
  (pad 11 smd rect (at 7.975 2.575 180) (size 2.5 1.5) (layers F.Cu F.Paste F.Mask))
  (pad 12 smd rect (at 7.975 0.575 180) (size 2.5 1.5) (layers F.Cu F.Paste F.Mask))
  (pad 13 smd rect (at 7.975 -1.425 180) (size 2.5 1.5) (layers F.Cu F.Paste F.Mask))
  (pad 14 smd rect (at 7.975 -3.425 180) (size 2.5 1.5) (layers F.Cu F.Paste F.Mask))
  (pad 15 smd rect (at 7.975 -5.425 180) (size 2.5 1.5) (layers F.Cu F.Paste F.Mask))
  (pad 16 smd rect (at 7.975 -7.425 180) (size 2.5 1.5) (layers F.Cu F.Paste F.Mask))
)
