PCBNEW-LibModule-V1  
# encoding utf-8
Units mm
$INDEX
SOD3716X117N
$EndINDEX
$MODULE SOD3716X117N
Po 0 0 0 15 00000000 00000000 ~~
Li SOD3716X117N
Cd 
Sc 00000000
At SMD
Op 0 0 0
.SolderMask 0
.SolderPaste 0
T0 0.140299 -1.93907 1.0021 1.0021 0 0.05 N V 21 "SOD3716X117N"
T1 0.57631 1.86923 1.00228 1.00228 0 0.05 N V 21 "VAL**"
DS -1 -0.8 1 -0.8 0.127 21
DS -1 0.8 1 0.8 0.127 21
DS -1 -0.8 -1 0.8 0.127 21
DS 1 -0.8 1 0.8 0.127 21
DP 0 0 0 0 4 0 21
Dl -1.00134 -0.8
Dl -0.3 -0.8
Dl -0.3 0.80107
Dl -1.00134 0.80107
DS -2.4 -1.1 -2.4 1.1 0.127 26
DS -2.4 1.1 2.4 1.1 0.127 26
DS 2.4 1.1 2.4 -1.1 0.127 26
DS 2.4 -1.1 -2.4 -1.1 0.127 26
DC -1.651 -1.143 -1.524 -1.143 0.254 21
$PAD
Sh "C" R 0.91 1.22 0 0 0
At SMD N 00888000
.SolderMask 0
.SolderPaste 0
Ne 0 ""
Po -1.635 0
$EndPAD
$PAD
Sh "A" R 0.91 1.22 0 0 0
At SMD N 00888000
.SolderMask 0
.SolderPaste 0
Ne 0 ""
Po 1.635 0
$EndPAD
$EndMODULE SOD3716X117N
