Title,LoRa Stack
Revision,v1.1
Date,2018-09-17
Generated,Sat 22 Sep 2018 11:41:26 IST
Company,Soil Agritech Pvt. Ltd.
Comment 1,Designed by SRS
Comment 2,
Comment 3,
Comment 4,
Total Parts,21
Total Unique Parts,15



Ref,Qty,Value,Footprint,Field4,Field5,Field6,Field7,Field8,
C3 C1 ,2,100u,Capacitors_THT:CP_Radial_D5.0mm_P2.50mm, , , , , 
C4 C2 C10 C18 C19 C5 ,6,0.1u,Capacitors_SMD:C_0805_HandSoldering, , , , , 
C20 ,1,1000p,Capacitors_SMD:C_0805_HandSoldering, , , , , 
J2 ,1,U.FL-R-SMT(10),U.FL-R-SMT_10_:HRS_U.FL-R-SMT(10),FakePackage u,U.FL-R-SMT_10_,U.FL Series 50 Ohm Receptacle Male Pins Ultra Small SMT Coaxial Connector,Unavailable,None
J5 ,1,Conn_01x06_Male,6PIN:06x2.50mm, , , , , 
J3 ,1,Conn_01x02_Male,2PIN:02x2.5mm, , , , , 
J6 ,1,Conn_01x08_Male,8PIN:08x2.50mm, , , , , 
J7 ,1,Conn_01x14_Male,14PIN:14x2.50mm_Straight, , , , , 
J1 ,1,Conn_01x05_Male,4PIN:05x2.50mm_Straight, , , , , 
J8 ,1,Conn_01x03_Male,4PIN:03x2.50mm_Straight, , , , , 
J4 ,1,Conn_01x04_Male,4PIN:04x2.50mm_Straight, , , , , 
R6 ,1,47k,Resistors_SMD:R_0805_HandSoldering, , , , , 
U2 ,1,MSP430FR2433IPW20R,MSP430FR2433IRGER:QFN50P400X400X100-25N,None,Unavailable,TSSOP-20 Texas Instruments,MSP430FR2433IPW20R,MSP430FRxx  Mixed Signal Microcontroller 20-TSSOP -40 to 85
U3 ,1,LoRa_DRF1276G,Lora_DRF1276G:Lora_DRF1276G,LORA RF Tranceiver Module ,RF Solutions,None,Lora_DRF1276G, 
U1 ,1,LM1117-3.3,TO_SOT_Packages_SMD:SOT-223-3_TabPin2, , , , , 




BOM made with KICAD_BOM_WIZARD (https://github.com/HashDefineElectronics/KiCad_BOM_Wizard.git)
Generated Sat 22 Sep 2018 11:41:26 IST
