(module lora:lora (layer F.Cu) (tedit 5B3230E5)
  (fp_text reference U3 (at 15 10 180) (layer F.SilkS)
    (effects (font (size 1 1) (thickness 0.15)))
  )
  (fp_text value LoRa_DRF1276DM (at 0 -10 180) (layer F.Fab)
    (effects (font (size 1 1) (thickness 0.15)))
  )
  (fp_line (start -17 -3) (end -30 -3) (layer F.SilkS) (width 0.15))
  (fp_line (start -30 -3) (end -30 2) (layer F.SilkS) (width 0.15))
  (fp_line (start -30 2) (end -17 2) (layer F.SilkS) (width 0.15))
  (fp_line (start -17 -9) (end 17 -9) (layer F.SilkS) (width 0.15))
  (fp_line (start 17 -9) (end 17 9) (layer F.SilkS) (width 0.15))
  (fp_line (start 17 9) (end -17 9) (layer F.SilkS) (width 0.15))
  (fp_line (start -17 9) (end -17 -9) (layer F.SilkS) (width 0.15))
  (pad 7 thru_hole oval (at 15 -8) (size 3 1.75) (drill 0.7) (layers *.Cu *.Mask))
  (pad 6 thru_hole oval (at 15 -5.46) (size 3 1.75) (drill 0.7) (layers *.Cu *.Mask))
  (pad 5 thru_hole oval (at 15 -2.92) (size 3 1.75) (drill 0.7) (layers *.Cu *.Mask))
  (pad 4 thru_hole oval (at 15 -0.38) (size 3 1.75) (drill 0.7) (layers *.Cu *.Mask))
  (pad 3 thru_hole oval (at 15 2.16) (size 3 1.75) (drill 0.7) (layers *.Cu *.Mask))
  (pad 2 thru_hole oval (at 15 4.7) (size 3 1.75) (drill 0.7) (layers *.Cu *.Mask))
  (pad 1 thru_hole oval (at 15 7.24) (size 3 1.75) (drill 0.7) (layers *.Cu *.Mask))
  (pad 8 thru_hole oval (at -15 -8) (size 3 1.75) (drill 0.7) (layers *.Cu *.Mask))
  (pad 9 thru_hole oval (at -15 -5.46) (size 3 1.75) (drill 0.7) (layers *.Cu *.Mask))
  (pad 10 thru_hole oval (at -15 -2.92) (size 3 1.75) (drill 0.7) (layers *.Cu *.Mask))
  (pad 11 thru_hole oval (at -15 -0.38) (size 3 1.75) (drill 0.7) (layers *.Cu *.Mask))
  (pad 12 thru_hole oval (at -15 2.16) (size 3 1.75) (drill 0.7) (layers *.Cu *.Mask))
  (pad 13 thru_hole oval (at -15 4.7) (size 3 1.75) (drill 0.7) (layers *.Cu *.Mask))
  (pad 14 thru_hole oval (at -15 7.24) (size 3 1.75) (drill 0.7) (layers *.Cu *.Mask))
)
