PCBNEW-LibModule-V1  
# encoding utf-8
Units mm
$INDEX
QFN50P700X700X100-49N
$EndINDEX
$MODULE QFN50P700X700X100-49N
Po 0 0 0 15 00000000 00000000 ~~
Li QFN50P700X700X100-49N
Cd 
Sc 00000000
At SMD
Op 0 0 0
.SolderMask 0
.SolderPaste 0
T0 4.76746 -53.846 11.002 11.002 0 0.05 N V 21 "QFN50P700X700X100-49N"
T1 12.2561 50.4369 11.4676 11.4676 0 0.05 N V 21 "VAL**"
DS 3.5814 -3.2258 3.5814 -3.5814 0.1524 21
DS 3.2258 3.5814 3.5814 3.5814 0.1524 21
DS -3.5814 3.2258 -3.5814 3.5814 0.1524 21
DS -3.2258 -3.5814 -3.5814 -3.5814 0.1524 21
DS -3.5814 3.5814 -3.2258 3.5814 0.1524 21
DS 3.5814 3.5814 3.5814 3.2258 0.1524 21
DS 3.5814 -3.5814 3.2258 -3.5814 0.1524 21
DS -3.5814 -3.5814 -3.5814 -3.2258 0.1524 21
DS -3.5814 -2.3114 -2.3114 -3.5814 0 24
DS 2.8956 -3.5814 2.5908 -3.5814 0 24
DS 2.3876 -3.5814 2.1082 -3.5814 0 24
DS 1.905 -3.5814 1.6002 -3.5814 0 24
DS 1.397 -3.5814 1.0922 -3.5814 0 24
DS 0.889 -3.5814 0.6096 -3.5814 0 24
DS 0.4064 -3.5814 0.1016 -3.5814 0 24
DS -0.1016 -3.5814 -0.4064 -3.5814 0 24
DS -0.6096 -3.5814 -0.889 -3.5814 0 24
DS -1.0922 -3.5814 -1.397 -3.5814 0 24
DS -1.6002 -3.5814 -1.905 -3.5814 0 24
DS -2.1082 -3.5814 -2.3876 -3.5814 0 24
DS -2.5908 -3.5814 -2.8956 -3.5814 0 24
DS -3.5814 -2.8956 -3.5814 -2.5908 0 24
DS -3.5814 -2.3876 -3.5814 -2.1082 0 24
DS -3.5814 -1.905 -3.5814 -1.6002 0 24
DS -3.5814 -1.397 -3.5814 -1.0922 0 24
DS -3.5814 -0.889 -3.5814 -0.6096 0 24
DS -3.5814 -0.4064 -3.5814 -0.1016 0 24
DS -3.5814 0.1016 -3.5814 0.4064 0 24
DS -3.5814 0.6096 -3.5814 0.889 0 24
DS -3.5814 1.0922 -3.5814 1.397 0 24
DS -3.5814 1.6002 -3.5814 1.905 0 24
DS -3.5814 2.1082 -3.5814 2.3876 0 24
DS -3.5814 2.5908 -3.5814 2.8956 0 24
DS -2.8956 3.5814 -2.5908 3.5814 0 24
DS -2.3876 3.5814 -2.1082 3.5814 0 24
DS -1.905 3.5814 -1.6002 3.5814 0 24
DS -1.397 3.5814 -1.0922 3.5814 0 24
DS -0.889 3.5814 -0.6096 3.5814 0 24
DS -0.4064 3.5814 -0.1016 3.5814 0 24
DS 0.1016 3.5814 0.4064 3.5814 0 24
DS 0.6096 3.5814 0.889 3.5814 0 24
DS 1.0922 3.5814 1.397 3.5814 0 24
DS 1.6002 3.5814 1.905 3.5814 0 24
DS 2.1082 3.5814 2.3876 3.5814 0 24
DS 2.5908 3.5814 2.8956 3.5814 0 24
DS 3.5814 2.8956 3.5814 2.5908 0 24
DS 3.5814 2.3876 3.5814 2.1082 0 24
DS 3.5814 1.905 3.5814 1.6002 0 24
DS 3.5814 1.397 3.5814 1.0922 0 24
DS 3.5814 0.889 3.5814 0.6096 0 24
DS 3.5814 0.4064 3.5814 0.1016 0 24
DS 3.5814 -0.1016 3.5814 -0.4064 0 24
DS 3.5814 -0.6096 3.5814 -0.889 0 24
DS 3.5814 -1.0922 3.5814 -1.397 0 24
DS 3.5814 -1.6002 3.5814 -1.905 0 24
DS 3.5814 -2.1082 3.5814 -2.3876 0 24
DS 3.5814 -2.5908 3.5814 -2.8956 0 24
DS -3.5814 3.5814 3.5814 3.5814 0 24
DS 3.5814 3.5814 3.5814 -3.5814 0 24
DS 3.5814 -3.5814 -3.5814 -3.5814 0 24
DS -3.5814 -3.5814 -3.5814 3.5814 0 24
$PAD
Sh "1" R 0.3048 0.8128 0 0 2700
At SMD N 00888000
.SolderMask 0
.SolderPaste 0
Ne 0 ""
Po -3.4798 -2.7432
$EndPAD
$PAD
Sh "2" R 0.3048 0.8128 0 0 2700
At SMD N 00888000
.SolderMask 0
.SolderPaste 0
Ne 0 ""
Po -3.4798 -2.2606
$EndPAD
$PAD
Sh "3" R 0.3048 0.8128 0 0 2700
At SMD N 00888000
.SolderMask 0
.SolderPaste 0
Ne 0 ""
Po -3.4798 -1.7526
$EndPAD
$PAD
Sh "4" R 0.3048 0.8128 0 0 2700
At SMD N 00888000
.SolderMask 0
.SolderPaste 0
Ne 0 ""
Po -3.4798 -1.2446
$EndPAD
$PAD
Sh "5" R 0.3048 0.8128 0 0 2700
At SMD N 00888000
.SolderMask 0
.SolderPaste 0
Ne 0 ""
Po -3.4798 -0.762
$EndPAD
$PAD
Sh "6" R 0.3048 0.8128 0 0 2700
At SMD N 00888000
.SolderMask 0
.SolderPaste 0
Ne 0 ""
Po -3.4798 -0.254
$EndPAD
$PAD
Sh "7" R 0.3048 0.8128 0 0 2700
At SMD N 00888000
.SolderMask 0
.SolderPaste 0
Ne 0 ""
Po -3.4798 0.254
$EndPAD
$PAD
Sh "8" R 0.3048 0.8128 0 0 2700
At SMD N 00888000
.SolderMask 0
.SolderPaste 0
Ne 0 ""
Po -3.4798 0.762
$EndPAD
$PAD
Sh "9" R 0.3048 0.8128 0 0 2700
At SMD N 00888000
.SolderMask 0
.SolderPaste 0
Ne 0 ""
Po -3.4798 1.2446
$EndPAD
$PAD
Sh "10" R 0.3048 0.8128 0 0 2700
At SMD N 00888000
.SolderMask 0
.SolderPaste 0
Ne 0 ""
Po -3.4798 1.7526
$EndPAD
$PAD
Sh "11" R 0.3048 0.8128 0 0 2700
At SMD N 00888000
.SolderMask 0
.SolderPaste 0
Ne 0 ""
Po -3.4798 2.2606
$EndPAD
$PAD
Sh "12" R 0.3048 0.8128 0 0 2700
At SMD N 00888000
.SolderMask 0
.SolderPaste 0
Ne 0 ""
Po -3.4798 2.7432
$EndPAD
$PAD
Sh "13" R 0.3048 0.8128 0 0 1800
At SMD N 00888000
.SolderMask 0
.SolderPaste 0
Ne 0 ""
Po -2.7432 3.4798
$EndPAD
$PAD
Sh "14" R 0.3048 0.8128 0 0 1800
At SMD N 00888000
.SolderMask 0
.SolderPaste 0
Ne 0 ""
Po -2.2606 3.4798
$EndPAD
$PAD
Sh "15" R 0.3048 0.8128 0 0 1800
At SMD N 00888000
.SolderMask 0
.SolderPaste 0
Ne 0 ""
Po -1.7526 3.4798
$EndPAD
$PAD
Sh "16" R 0.3048 0.8128 0 0 1800
At SMD N 00888000
.SolderMask 0
.SolderPaste 0
Ne 0 ""
Po -1.2446 3.4798
$EndPAD
$PAD
Sh "17" R 0.3048 0.8128 0 0 1800
At SMD N 00888000
.SolderMask 0
.SolderPaste 0
Ne 0 ""
Po -0.762 3.4798
$EndPAD
$PAD
Sh "18" R 0.3048 0.8128 0 0 1800
At SMD N 00888000
.SolderMask 0
.SolderPaste 0
Ne 0 ""
Po -0.254 3.4798
$EndPAD
$PAD
Sh "19" R 0.3048 0.8128 0 0 1800
At SMD N 00888000
.SolderMask 0
.SolderPaste 0
Ne 0 ""
Po 0.254 3.4798
$EndPAD
$PAD
Sh "20" R 0.3048 0.8128 0 0 1800
At SMD N 00888000
.SolderMask 0
.SolderPaste 0
Ne 0 ""
Po 0.762 3.4798
$EndPAD
$PAD
Sh "21" R 0.3048 0.8128 0 0 1800
At SMD N 00888000
.SolderMask 0
.SolderPaste 0
Ne 0 ""
Po 1.2446 3.4798
$EndPAD
$PAD
Sh "22" R 0.3048 0.8128 0 0 1800
At SMD N 00888000
.SolderMask 0
.SolderPaste 0
Ne 0 ""
Po 1.7526 3.4798
$EndPAD
$PAD
Sh "23" R 0.3048 0.8128 0 0 1800
At SMD N 00888000
.SolderMask 0
.SolderPaste 0
Ne 0 ""
Po 2.2606 3.4798
$EndPAD
$PAD
Sh "24" R 0.3048 0.8128 0 0 1800
At SMD N 00888000
.SolderMask 0
.SolderPaste 0
Ne 0 ""
Po 2.7432 3.4798
$EndPAD
$PAD
Sh "25" R 0.3048 0.8128 0 0 2700
At SMD N 00888000
.SolderMask 0
.SolderPaste 0
Ne 0 ""
Po 3.4798 2.7432
$EndPAD
$PAD
Sh "26" R 0.3048 0.8128 0 0 2700
At SMD N 00888000
.SolderMask 0
.SolderPaste 0
Ne 0 ""
Po 3.4798 2.2606
$EndPAD
$PAD
Sh "27" R 0.3048 0.8128 0 0 2700
At SMD N 00888000
.SolderMask 0
.SolderPaste 0
Ne 0 ""
Po 3.4798 1.7526
$EndPAD
$PAD
Sh "28" R 0.3048 0.8128 0 0 2700
At SMD N 00888000
.SolderMask 0
.SolderPaste 0
Ne 0 ""
Po 3.4798 1.2446
$EndPAD
$PAD
Sh "29" R 0.3048 0.8128 0 0 2700
At SMD N 00888000
.SolderMask 0
.SolderPaste 0
Ne 0 ""
Po 3.4798 0.762
$EndPAD
$PAD
Sh "30" R 0.3048 0.8128 0 0 2700
At SMD N 00888000
.SolderMask 0
.SolderPaste 0
Ne 0 ""
Po 3.4798 0.254
$EndPAD
$PAD
Sh "31" R 0.3048 0.8128 0 0 2700
At SMD N 00888000
.SolderMask 0
.SolderPaste 0
Ne 0 ""
Po 3.4798 -0.254
$EndPAD
$PAD
Sh "32" R 0.3048 0.8128 0 0 2700
At SMD N 00888000
.SolderMask 0
.SolderPaste 0
Ne 0 ""
Po 3.4798 -0.762
$EndPAD
$PAD
Sh "33" R 0.3048 0.8128 0 0 2700
At SMD N 00888000
.SolderMask 0
.SolderPaste 0
Ne 0 ""
Po 3.4798 -1.2446
$EndPAD
$PAD
Sh "34" R 0.3048 0.8128 0 0 2700
At SMD N 00888000
.SolderMask 0
.SolderPaste 0
Ne 0 ""
Po 3.4798 -1.7526
$EndPAD
$PAD
Sh "35" R 0.3048 0.8128 0 0 2700
At SMD N 00888000
.SolderMask 0
.SolderPaste 0
Ne 0 ""
Po 3.4798 -2.2606
$EndPAD
$PAD
Sh "36" R 0.3048 0.8128 0 0 2700
At SMD N 00888000
.SolderMask 0
.SolderPaste 0
Ne 0 ""
Po 3.4798 -2.7432
$EndPAD
$PAD
Sh "37" R 0.3048 0.8128 0 0 1800
At SMD N 00888000
.SolderMask 0
.SolderPaste 0
Ne 0 ""
Po 2.7432 -3.4798
$EndPAD
$PAD
Sh "38" R 0.3048 0.8128 0 0 1800
At SMD N 00888000
.SolderMask 0
.SolderPaste 0
Ne 0 ""
Po 2.2606 -3.4798
$EndPAD
$PAD
Sh "39" R 0.3048 0.8128 0 0 1800
At SMD N 00888000
.SolderMask 0
.SolderPaste 0
Ne 0 ""
Po 1.7526 -3.4798
$EndPAD
$PAD
Sh "40" R 0.3048 0.8128 0 0 1800
At SMD N 00888000
.SolderMask 0
.SolderPaste 0
Ne 0 ""
Po 1.2446 -3.4798
$EndPAD
$PAD
Sh "41" R 0.3048 0.8128 0 0 1800
At SMD N 00888000
.SolderMask 0
.SolderPaste 0
Ne 0 ""
Po 0.762 -3.4798
$EndPAD
$PAD
Sh "42" R 0.3048 0.8128 0 0 1800
At SMD N 00888000
.SolderMask 0
.SolderPaste 0
Ne 0 ""
Po 0.254 -3.4798
$EndPAD
$PAD
Sh "43" R 0.3048 0.8128 0 0 1800
At SMD N 00888000
.SolderMask 0
.SolderPaste 0
Ne 0 ""
Po -0.254 -3.4798
$EndPAD
$PAD
Sh "44" R 0.3048 0.8128 0 0 1800
At SMD N 00888000
.SolderMask 0
.SolderPaste 0
Ne 0 ""
Po -0.762 -3.4798
$EndPAD
$PAD
Sh "45" R 0.3048 0.8128 0 0 1800
At SMD N 00888000
.SolderMask 0
.SolderPaste 0
Ne 0 ""
Po -1.2446 -3.4798
$EndPAD
$PAD
Sh "46" R 0.3048 0.8128 0 0 1800
At SMD N 00888000
.SolderMask 0
.SolderPaste 0
Ne 0 ""
Po -1.7526 -3.4798
$EndPAD
$PAD
Sh "47" R 0.3048 0.8128 0 0 1800
At SMD N 00888000
.SolderMask 0
.SolderPaste 0
Ne 0 ""
Po -2.2606 -3.4798
$EndPAD
$PAD
Sh "48" R 0.3048 0.8128 0 0 1800
At SMD N 00888000
.SolderMask 0
.SolderPaste 0
Ne 0 ""
Po -2.7432 -3.4798
$EndPAD
$PAD
Sh "49" R 5.588 5.588 0 0 0
At SMD N 00888000
.SolderMask 0
.SolderPaste 0
Ne 0 ""
Po 0 0
$EndPAD
$EndMODULE QFN50P700X700X100-49N
