PCBNEW-LibModule-V1  
# encoding utf-8
Units mm
$INDEX
TO263-5
$EndINDEX
$MODULE TO263-5
Po 0 0 0 15 00000000 00000000 ~~
Li TO263-5
Cd <b>TO-263</b>
Sc 00000000
At SMD
Op 0 0 0
.SolderMask 0
.SolderPaste 0
T0 -6.24506 3.0588 1.00355 1.00355 900 0.05 N V 21 "TO263-5"
T1 6.25587 2.42576 1.00528 1.00528 900 0.05 N V 21 "VAL**"
DS 5.094 -7.165 5.094 2.88 0.2032 24
DS 5.094 2.88 -5.094 2.88 0.2032 21
DS -5.094 2.88 -5.094 -7.165 0.2032 24
DS -5.094 -7.165 5.094 -7.165 0.2032 24
DS -5.105 -7.267 -5.105 -7.678 0.2032 24
DS -5.105 -7.678 -3.378 -8.135 0.2032 24
DS -3.378 -8.135 3.378 -8.135 0.2032 24
DS 3.378 -8.135 5.105 -7.678 0.2032 24
DS 5.105 -7.678 5.105 -7.267 0.2032 24
DS 5.105 -7.267 -5.105 -7.267 0.2032 24
DP 0 0 0 0 4 0 24
Dl -3.90183 4.445
Dl -2.921 4.445
Dl -2.921 6.63056
Dl -3.90183 6.63056
DP 0 0 0 0 4 0 21
Dl -3.89652 2.794
Dl -2.921 2.794
Dl -2.921 4.48226
Dl -3.89652 4.48226
DP 0 0 0 0 4 0 24
Dl -2.19485 4.445
Dl -1.2192 4.445
Dl -1.2192 6.6356
Dl -2.19485 6.6356
DP 0 0 0 0 4 0 24
Dl -0.483567 4.445
Dl 0.4826 4.445
Dl 0.4826 6.61724
Dl -0.483567 6.61724
DP 0 0 0 0 4 0 24
Dl 1.22422 4.445
Dl 2.1844 4.445
Dl 2.1844 6.63117
Dl 1.22422 6.63117
DP 0 0 0 0 4 0 24
Dl 2.92648 4.445
Dl 3.8862 4.445
Dl 3.8862 6.61638
Dl 2.92648 6.61638
DP 0 0 0 0 4 0 21
Dl -2.19151 2.794
Dl -1.2192 2.794
Dl -1.2192 4.48493
Dl -2.19151 4.48493
DP 0 0 0 0 4 0 21
Dl -0.484651 2.794
Dl 0.4826 2.794
Dl 0.4826 4.4894
Dl -0.484651 4.4894
DP 0 0 0 0 4 0 21
Dl 1.22338 2.794
Dl 2.1844 2.794
Dl 2.1844 4.48571
Dl 1.22338 4.48571
DP 0 0 0 0 4 0 21
Dl 2.92755 2.794
Dl 3.8862 2.794
Dl 3.8862 4.48042
Dl 2.92755 4.48042
DP 0 0 0 0 6 0.2032 24
Dl -5.1054 -7.267
Dl -5.1054 -7.6782
Dl -3.3782 -8.1354
Dl 3.3782 -8.1354
Dl 5.1054 -7.6782
Dl 5.1054 -7.267
$PAD
Sh "6" R 10.8 10.41 0 0 0
At SMD N 00888000
.SolderMask 0
.SolderPaste 0
Ne 0 ""
Po 0 -2.54
$EndPAD
$PAD
Sh "1" R 1.0668 2.159 0 0 0
At SMD N 00888000
.SolderMask 0
.SolderPaste 0
Ne 0 ""
Po -3.4036 5.7912
$EndPAD
$PAD
Sh "2" R 1.0668 2.159 0 0 0
At SMD N 00888000
.SolderMask 0
.SolderPaste 0
Ne 0 ""
Po -1.7018 5.7912
$EndPAD
$PAD
Sh "3" R 1.0668 2.159 0 0 0
At SMD N 00888000
.SolderMask 0
.SolderPaste 0
Ne 0 ""
Po 0 5.7912
$EndPAD
$PAD
Sh "4" R 1.0668 2.159 0 0 0
At SMD N 00888000
.SolderMask 0
.SolderPaste 0
Ne 0 ""
Po 1.7018 5.7912
$EndPAD
$PAD
Sh "5" R 1.0668 2.159 0 0 0
At SMD N 00888000
.SolderMask 0
.SolderPaste 0
Ne 0 ""
Po 3.4036 5.7912
$EndPAD
$EndMODULE TO263-5
