G04 #@! TF.FileFunction,Other,User*
%FSLAX46Y46*%
G04 Gerber Fmt 4.6, Leading zero omitted, Abs format (unit mm)*
G04 Created by KiCad (PCBNEW 4.0.7-e2-6376~58~ubuntu16.04.1) date Fri Sep 28 16:13:36 2018*
%MOMM*%
%LPD*%
G01*
G04 APERTURE LIST*
%ADD10C,0.100000*%
%ADD11C,0.150000*%
%ADD12C,0.300000*%
%ADD13C,0.400000*%
%ADD14C,0.050000*%
G04 APERTURE END LIST*
D10*
D11*
X177002200Y-166007200D02*
X177002200Y-198007200D01*
X285002200Y-198007200D01*
X285002200Y-166007200D01*
X177002200Y-166007200D01*
D10*
D11*
X10000000Y-10000000D02*
X10000000Y-200007200D01*
X287002200Y-200007200D01*
X287002200Y-10000000D01*
X10000000Y-10000000D01*
D10*
D11*
X12000000Y-12000000D02*
X12000000Y-198007200D01*
X285002200Y-198007200D01*
X285002200Y-12000000D01*
X12000000Y-12000000D01*
D10*
D11*
X60000000Y-12000000D02*
X60000000Y-10000000D01*
D10*
D11*
X110000000Y-12000000D02*
X110000000Y-10000000D01*
D10*
D11*
X160000000Y-12000000D02*
X160000000Y-10000000D01*
D10*
D11*
X210000000Y-12000000D02*
X210000000Y-10000000D01*
D10*
D11*
X260000000Y-12000000D02*
X260000000Y-10000000D01*
D10*
D11*
X35990476Y-11588095D02*
X35247619Y-11588095D01*
X35619048Y-11588095D02*
X35619048Y-10288095D01*
X35495238Y-10473810D01*
X35371429Y-10597619D01*
X35247619Y-10659524D01*
D10*
D11*
X85247619Y-10411905D02*
X85309524Y-10350000D01*
X85433333Y-10288095D01*
X85742857Y-10288095D01*
X85866667Y-10350000D01*
X85928571Y-10411905D01*
X85990476Y-10535714D01*
X85990476Y-10659524D01*
X85928571Y-10845238D01*
X85185714Y-11588095D01*
X85990476Y-11588095D01*
D10*
D11*
X135185714Y-10288095D02*
X135990476Y-10288095D01*
X135557143Y-10783333D01*
X135742857Y-10783333D01*
X135866667Y-10845238D01*
X135928571Y-10907143D01*
X135990476Y-11030952D01*
X135990476Y-11340476D01*
X135928571Y-11464286D01*
X135866667Y-11526190D01*
X135742857Y-11588095D01*
X135371429Y-11588095D01*
X135247619Y-11526190D01*
X135185714Y-11464286D01*
D10*
D11*
X185866667Y-10721429D02*
X185866667Y-11588095D01*
X185557143Y-10226190D02*
X185247619Y-11154762D01*
X186052381Y-11154762D01*
D10*
D11*
X235928571Y-10288095D02*
X235309524Y-10288095D01*
X235247619Y-10907143D01*
X235309524Y-10845238D01*
X235433333Y-10783333D01*
X235742857Y-10783333D01*
X235866667Y-10845238D01*
X235928571Y-10907143D01*
X235990476Y-11030952D01*
X235990476Y-11340476D01*
X235928571Y-11464286D01*
X235866667Y-11526190D01*
X235742857Y-11588095D01*
X235433333Y-11588095D01*
X235309524Y-11526190D01*
X235247619Y-11464286D01*
D10*
D11*
X285866667Y-10288095D02*
X285619048Y-10288095D01*
X285495238Y-10350000D01*
X285433333Y-10411905D01*
X285309524Y-10597619D01*
X285247619Y-10845238D01*
X285247619Y-11340476D01*
X285309524Y-11464286D01*
X285371429Y-11526190D01*
X285495238Y-11588095D01*
X285742857Y-11588095D01*
X285866667Y-11526190D01*
X285928571Y-11464286D01*
X285990476Y-11340476D01*
X285990476Y-11030952D01*
X285928571Y-10907143D01*
X285866667Y-10845238D01*
X285742857Y-10783333D01*
X285495238Y-10783333D01*
X285371429Y-10845238D01*
X285309524Y-10907143D01*
X285247619Y-11030952D01*
D10*
D11*
X60000000Y-198007200D02*
X60000000Y-200007200D01*
D10*
D11*
X110000000Y-198007200D02*
X110000000Y-200007200D01*
D10*
D11*
X160000000Y-198007200D02*
X160000000Y-200007200D01*
D10*
D11*
X210000000Y-198007200D02*
X210000000Y-200007200D01*
D10*
D11*
X260000000Y-198007200D02*
X260000000Y-200007200D01*
D10*
D11*
X35990476Y-199595295D02*
X35247619Y-199595295D01*
X35619048Y-199595295D02*
X35619048Y-198295295D01*
X35495238Y-198481010D01*
X35371429Y-198604819D01*
X35247619Y-198666724D01*
D10*
D11*
X85247619Y-198419105D02*
X85309524Y-198357200D01*
X85433333Y-198295295D01*
X85742857Y-198295295D01*
X85866667Y-198357200D01*
X85928571Y-198419105D01*
X85990476Y-198542914D01*
X85990476Y-198666724D01*
X85928571Y-198852438D01*
X85185714Y-199595295D01*
X85990476Y-199595295D01*
D10*
D11*
X135185714Y-198295295D02*
X135990476Y-198295295D01*
X135557143Y-198790533D01*
X135742857Y-198790533D01*
X135866667Y-198852438D01*
X135928571Y-198914343D01*
X135990476Y-199038152D01*
X135990476Y-199347676D01*
X135928571Y-199471486D01*
X135866667Y-199533390D01*
X135742857Y-199595295D01*
X135371429Y-199595295D01*
X135247619Y-199533390D01*
X135185714Y-199471486D01*
D10*
D11*
X185866667Y-198728629D02*
X185866667Y-199595295D01*
X185557143Y-198233390D02*
X185247619Y-199161962D01*
X186052381Y-199161962D01*
D10*
D11*
X235928571Y-198295295D02*
X235309524Y-198295295D01*
X235247619Y-198914343D01*
X235309524Y-198852438D01*
X235433333Y-198790533D01*
X235742857Y-198790533D01*
X235866667Y-198852438D01*
X235928571Y-198914343D01*
X235990476Y-199038152D01*
X235990476Y-199347676D01*
X235928571Y-199471486D01*
X235866667Y-199533390D01*
X235742857Y-199595295D01*
X235433333Y-199595295D01*
X235309524Y-199533390D01*
X235247619Y-199471486D01*
D10*
D11*
X285866667Y-198295295D02*
X285619048Y-198295295D01*
X285495238Y-198357200D01*
X285433333Y-198419105D01*
X285309524Y-198604819D01*
X285247619Y-198852438D01*
X285247619Y-199347676D01*
X285309524Y-199471486D01*
X285371429Y-199533390D01*
X285495238Y-199595295D01*
X285742857Y-199595295D01*
X285866667Y-199533390D01*
X285928571Y-199471486D01*
X285990476Y-199347676D01*
X285990476Y-199038152D01*
X285928571Y-198914343D01*
X285866667Y-198852438D01*
X285742857Y-198790533D01*
X285495238Y-198790533D01*
X285371429Y-198852438D01*
X285309524Y-198914343D01*
X285247619Y-199038152D01*
D10*
D11*
X10000000Y-60000000D02*
X12000000Y-60000000D01*
D10*
D11*
X10000000Y-110000000D02*
X12000000Y-110000000D01*
D10*
D11*
X10000000Y-160000000D02*
X12000000Y-160000000D01*
D10*
D11*
X10690476Y-35216667D02*
X11309524Y-35216667D01*
X10566667Y-35588095D02*
X11000000Y-34288095D01*
X11433333Y-35588095D01*
D10*
D11*
X11092857Y-84907143D02*
X11278571Y-84969048D01*
X11340476Y-85030952D01*
X11402381Y-85154762D01*
X11402381Y-85340476D01*
X11340476Y-85464286D01*
X11278571Y-85526190D01*
X11154762Y-85588095D01*
X10659524Y-85588095D01*
X10659524Y-84288095D01*
X11092857Y-84288095D01*
X11216667Y-84350000D01*
X11278571Y-84411905D01*
X11340476Y-84535714D01*
X11340476Y-84659524D01*
X11278571Y-84783333D01*
X11216667Y-84845238D01*
X11092857Y-84907143D01*
X10659524Y-84907143D01*
D10*
D11*
X11402381Y-135464286D02*
X11340476Y-135526190D01*
X11154762Y-135588095D01*
X11030952Y-135588095D01*
X10845238Y-135526190D01*
X10721429Y-135402381D01*
X10659524Y-135278571D01*
X10597619Y-135030952D01*
X10597619Y-134845238D01*
X10659524Y-134597619D01*
X10721429Y-134473810D01*
X10845238Y-134350000D01*
X11030952Y-134288095D01*
X11154762Y-134288095D01*
X11340476Y-134350000D01*
X11402381Y-134411905D01*
D10*
D11*
X10659524Y-185588095D02*
X10659524Y-184288095D01*
X10969048Y-184288095D01*
X11154762Y-184350000D01*
X11278571Y-184473810D01*
X11340476Y-184597619D01*
X11402381Y-184845238D01*
X11402381Y-185030952D01*
X11340476Y-185278571D01*
X11278571Y-185402381D01*
X11154762Y-185526190D01*
X10969048Y-185588095D01*
X10659524Y-185588095D01*
D10*
D11*
X287002200Y-60000000D02*
X285002200Y-60000000D01*
D10*
D11*
X287002200Y-110000000D02*
X285002200Y-110000000D01*
D10*
D11*
X287002200Y-160000000D02*
X285002200Y-160000000D01*
D10*
D11*
X285692676Y-35216667D02*
X286311724Y-35216667D01*
X285568867Y-35588095D02*
X286002200Y-34288095D01*
X286435533Y-35588095D01*
D10*
D11*
X286095057Y-84907143D02*
X286280771Y-84969048D01*
X286342676Y-85030952D01*
X286404581Y-85154762D01*
X286404581Y-85340476D01*
X286342676Y-85464286D01*
X286280771Y-85526190D01*
X286156962Y-85588095D01*
X285661724Y-85588095D01*
X285661724Y-84288095D01*
X286095057Y-84288095D01*
X286218867Y-84350000D01*
X286280771Y-84411905D01*
X286342676Y-84535714D01*
X286342676Y-84659524D01*
X286280771Y-84783333D01*
X286218867Y-84845238D01*
X286095057Y-84907143D01*
X285661724Y-84907143D01*
D10*
D11*
X286404581Y-135464286D02*
X286342676Y-135526190D01*
X286156962Y-135588095D01*
X286033152Y-135588095D01*
X285847438Y-135526190D01*
X285723629Y-135402381D01*
X285661724Y-135278571D01*
X285599819Y-135030952D01*
X285599819Y-134845238D01*
X285661724Y-134597619D01*
X285723629Y-134473810D01*
X285847438Y-134350000D01*
X286033152Y-134288095D01*
X286156962Y-134288095D01*
X286342676Y-134350000D01*
X286404581Y-134411905D01*
D10*
D11*
X285661724Y-185588095D02*
X285661724Y-184288095D01*
X285971248Y-184288095D01*
X286156962Y-184350000D01*
X286280771Y-184473810D01*
X286342676Y-184597619D01*
X286404581Y-184845238D01*
X286404581Y-185030952D01*
X286342676Y-185278571D01*
X286280771Y-185402381D01*
X286156962Y-185526190D01*
X285971248Y-185588095D01*
X285661724Y-185588095D01*
D10*
D11*
X200359343Y-193785771D02*
X200359343Y-192285771D01*
X200716486Y-192285771D01*
X200930771Y-192357200D01*
X201073629Y-192500057D01*
X201145057Y-192642914D01*
X201216486Y-192928629D01*
X201216486Y-193142914D01*
X201145057Y-193428629D01*
X201073629Y-193571486D01*
X200930771Y-193714343D01*
X200716486Y-193785771D01*
X200359343Y-193785771D01*
X202502200Y-193785771D02*
X202502200Y-193000057D01*
X202430771Y-192857200D01*
X202287914Y-192785771D01*
X202002200Y-192785771D01*
X201859343Y-192857200D01*
X202502200Y-193714343D02*
X202359343Y-193785771D01*
X202002200Y-193785771D01*
X201859343Y-193714343D01*
X201787914Y-193571486D01*
X201787914Y-193428629D01*
X201859343Y-193285771D01*
X202002200Y-193214343D01*
X202359343Y-193214343D01*
X202502200Y-193142914D01*
X203002200Y-192785771D02*
X203573629Y-192785771D01*
X203216486Y-192285771D02*
X203216486Y-193571486D01*
X203287914Y-193714343D01*
X203430772Y-193785771D01*
X203573629Y-193785771D01*
X204645057Y-193714343D02*
X204502200Y-193785771D01*
X204216486Y-193785771D01*
X204073629Y-193714343D01*
X204002200Y-193571486D01*
X204002200Y-193000057D01*
X204073629Y-192857200D01*
X204216486Y-192785771D01*
X204502200Y-192785771D01*
X204645057Y-192857200D01*
X204716486Y-193000057D01*
X204716486Y-193142914D01*
X204002200Y-193285771D01*
X205359343Y-193642914D02*
X205430771Y-193714343D01*
X205359343Y-193785771D01*
X205287914Y-193714343D01*
X205359343Y-193642914D01*
X205359343Y-193785771D01*
X205359343Y-192857200D02*
X205430771Y-192928629D01*
X205359343Y-193000057D01*
X205287914Y-192928629D01*
X205359343Y-192857200D01*
X205359343Y-193000057D01*
X207145057Y-192428629D02*
X207216486Y-192357200D01*
X207359343Y-192285771D01*
X207716486Y-192285771D01*
X207859343Y-192357200D01*
X207930772Y-192428629D01*
X208002200Y-192571486D01*
X208002200Y-192714343D01*
X207930772Y-192928629D01*
X207073629Y-193785771D01*
X208002200Y-193785771D01*
X208930771Y-192285771D02*
X209073628Y-192285771D01*
X209216485Y-192357200D01*
X209287914Y-192428629D01*
X209359343Y-192571486D01*
X209430771Y-192857200D01*
X209430771Y-193214343D01*
X209359343Y-193500057D01*
X209287914Y-193642914D01*
X209216485Y-193714343D01*
X209073628Y-193785771D01*
X208930771Y-193785771D01*
X208787914Y-193714343D01*
X208716485Y-193642914D01*
X208645057Y-193500057D01*
X208573628Y-193214343D01*
X208573628Y-192857200D01*
X208645057Y-192571486D01*
X208716485Y-192428629D01*
X208787914Y-192357200D01*
X208930771Y-192285771D01*
X210859342Y-193785771D02*
X210002199Y-193785771D01*
X210430771Y-193785771D02*
X210430771Y-192285771D01*
X210287914Y-192500057D01*
X210145056Y-192642914D01*
X210002199Y-192714343D01*
X211716485Y-192928629D02*
X211573627Y-192857200D01*
X211502199Y-192785771D01*
X211430770Y-192642914D01*
X211430770Y-192571486D01*
X211502199Y-192428629D01*
X211573627Y-192357200D01*
X211716485Y-192285771D01*
X212002199Y-192285771D01*
X212145056Y-192357200D01*
X212216485Y-192428629D01*
X212287913Y-192571486D01*
X212287913Y-192642914D01*
X212216485Y-192785771D01*
X212145056Y-192857200D01*
X212002199Y-192928629D01*
X211716485Y-192928629D01*
X211573627Y-193000057D01*
X211502199Y-193071486D01*
X211430770Y-193214343D01*
X211430770Y-193500057D01*
X211502199Y-193642914D01*
X211573627Y-193714343D01*
X211716485Y-193785771D01*
X212002199Y-193785771D01*
X212145056Y-193714343D01*
X212216485Y-193642914D01*
X212287913Y-193500057D01*
X212287913Y-193214343D01*
X212216485Y-193071486D01*
X212145056Y-193000057D01*
X212002199Y-192928629D01*
X212930770Y-193214343D02*
X214073627Y-193214343D01*
X215073627Y-192285771D02*
X215216484Y-192285771D01*
X215359341Y-192357200D01*
X215430770Y-192428629D01*
X215502199Y-192571486D01*
X215573627Y-192857200D01*
X215573627Y-193214343D01*
X215502199Y-193500057D01*
X215430770Y-193642914D01*
X215359341Y-193714343D01*
X215216484Y-193785771D01*
X215073627Y-193785771D01*
X214930770Y-193714343D01*
X214859341Y-193642914D01*
X214787913Y-193500057D01*
X214716484Y-193214343D01*
X214716484Y-192857200D01*
X214787913Y-192571486D01*
X214859341Y-192428629D01*
X214930770Y-192357200D01*
X215073627Y-192285771D01*
X216287912Y-193785771D02*
X216573627Y-193785771D01*
X216716484Y-193714343D01*
X216787912Y-193642914D01*
X216930770Y-193428629D01*
X217002198Y-193142914D01*
X217002198Y-192571486D01*
X216930770Y-192428629D01*
X216859341Y-192357200D01*
X216716484Y-192285771D01*
X216430770Y-192285771D01*
X216287912Y-192357200D01*
X216216484Y-192428629D01*
X216145055Y-192571486D01*
X216145055Y-192928629D01*
X216216484Y-193071486D01*
X216287912Y-193142914D01*
X216430770Y-193214343D01*
X216716484Y-193214343D01*
X216859341Y-193142914D01*
X216930770Y-193071486D01*
X217002198Y-192928629D01*
X217645055Y-193214343D02*
X218787912Y-193214343D01*
X220287912Y-193785771D02*
X219430769Y-193785771D01*
X219859341Y-193785771D02*
X219859341Y-192285771D01*
X219716484Y-192500057D01*
X219573626Y-192642914D01*
X219430769Y-192714343D01*
X221002197Y-193785771D02*
X221287912Y-193785771D01*
X221430769Y-193714343D01*
X221502197Y-193642914D01*
X221645055Y-193428629D01*
X221716483Y-193142914D01*
X221716483Y-192571486D01*
X221645055Y-192428629D01*
X221573626Y-192357200D01*
X221430769Y-192285771D01*
X221145055Y-192285771D01*
X221002197Y-192357200D01*
X220930769Y-192428629D01*
X220859340Y-192571486D01*
X220859340Y-192928629D01*
X220930769Y-193071486D01*
X221002197Y-193142914D01*
X221145055Y-193214343D01*
X221430769Y-193214343D01*
X221573626Y-193142914D01*
X221645055Y-193071486D01*
X221716483Y-192928629D01*
D10*
D11*
X177002200Y-194507200D02*
X285002200Y-194507200D01*
D10*
D11*
X178359343Y-196585771D02*
X178359343Y-195085771D01*
X179216486Y-196585771D02*
X178573629Y-195728629D01*
X179216486Y-195085771D02*
X178359343Y-195942914D01*
X179859343Y-196585771D02*
X179859343Y-195585771D01*
X179859343Y-195085771D02*
X179787914Y-195157200D01*
X179859343Y-195228629D01*
X179930771Y-195157200D01*
X179859343Y-195085771D01*
X179859343Y-195228629D01*
X181430772Y-196442914D02*
X181359343Y-196514343D01*
X181145057Y-196585771D01*
X181002200Y-196585771D01*
X180787915Y-196514343D01*
X180645057Y-196371486D01*
X180573629Y-196228629D01*
X180502200Y-195942914D01*
X180502200Y-195728629D01*
X180573629Y-195442914D01*
X180645057Y-195300057D01*
X180787915Y-195157200D01*
X181002200Y-195085771D01*
X181145057Y-195085771D01*
X181359343Y-195157200D01*
X181430772Y-195228629D01*
X182716486Y-196585771D02*
X182716486Y-195800057D01*
X182645057Y-195657200D01*
X182502200Y-195585771D01*
X182216486Y-195585771D01*
X182073629Y-195657200D01*
X182716486Y-196514343D02*
X182573629Y-196585771D01*
X182216486Y-196585771D01*
X182073629Y-196514343D01*
X182002200Y-196371486D01*
X182002200Y-196228629D01*
X182073629Y-196085771D01*
X182216486Y-196014343D01*
X182573629Y-196014343D01*
X182716486Y-195942914D01*
X184073629Y-196585771D02*
X184073629Y-195085771D01*
X184073629Y-196514343D02*
X183930772Y-196585771D01*
X183645058Y-196585771D01*
X183502200Y-196514343D01*
X183430772Y-196442914D01*
X183359343Y-196300057D01*
X183359343Y-195871486D01*
X183430772Y-195728629D01*
X183502200Y-195657200D01*
X183645058Y-195585771D01*
X183930772Y-195585771D01*
X184073629Y-195657200D01*
X185930772Y-195800057D02*
X186430772Y-195800057D01*
X186645058Y-196585771D02*
X185930772Y-196585771D01*
X185930772Y-195085771D01*
X186645058Y-195085771D01*
X187287915Y-196442914D02*
X187359343Y-196514343D01*
X187287915Y-196585771D01*
X187216486Y-196514343D01*
X187287915Y-196442914D01*
X187287915Y-196585771D01*
X188002201Y-196585771D02*
X188002201Y-195085771D01*
X188359344Y-195085771D01*
X188573629Y-195157200D01*
X188716487Y-195300057D01*
X188787915Y-195442914D01*
X188859344Y-195728629D01*
X188859344Y-195942914D01*
X188787915Y-196228629D01*
X188716487Y-196371486D01*
X188573629Y-196514343D01*
X188359344Y-196585771D01*
X188002201Y-196585771D01*
X189502201Y-196442914D02*
X189573629Y-196514343D01*
X189502201Y-196585771D01*
X189430772Y-196514343D01*
X189502201Y-196442914D01*
X189502201Y-196585771D01*
X190145058Y-196157200D02*
X190859344Y-196157200D01*
X190002201Y-196585771D02*
X190502201Y-195085771D01*
X191002201Y-196585771D01*
X191502201Y-196442914D02*
X191573629Y-196514343D01*
X191502201Y-196585771D01*
X191430772Y-196514343D01*
X191502201Y-196442914D01*
X191502201Y-196585771D01*
X194502201Y-196585771D02*
X194502201Y-195085771D01*
X194645058Y-196014343D02*
X195073629Y-196585771D01*
X195073629Y-195585771D02*
X194502201Y-196157200D01*
X195716487Y-196585771D02*
X195716487Y-195585771D01*
X195716487Y-195085771D02*
X195645058Y-195157200D01*
X195716487Y-195228629D01*
X195787915Y-195157200D01*
X195716487Y-195085771D01*
X195716487Y-195228629D01*
X197073630Y-196514343D02*
X196930773Y-196585771D01*
X196645059Y-196585771D01*
X196502201Y-196514343D01*
X196430773Y-196442914D01*
X196359344Y-196300057D01*
X196359344Y-195871486D01*
X196430773Y-195728629D01*
X196502201Y-195657200D01*
X196645059Y-195585771D01*
X196930773Y-195585771D01*
X197073630Y-195657200D01*
X198359344Y-196585771D02*
X198359344Y-195800057D01*
X198287915Y-195657200D01*
X198145058Y-195585771D01*
X197859344Y-195585771D01*
X197716487Y-195657200D01*
X198359344Y-196514343D02*
X198216487Y-196585771D01*
X197859344Y-196585771D01*
X197716487Y-196514343D01*
X197645058Y-196371486D01*
X197645058Y-196228629D01*
X197716487Y-196085771D01*
X197859344Y-196014343D01*
X198216487Y-196014343D01*
X198359344Y-195942914D01*
X199716487Y-196585771D02*
X199716487Y-195085771D01*
X199716487Y-196514343D02*
X199573630Y-196585771D01*
X199287916Y-196585771D01*
X199145058Y-196514343D01*
X199073630Y-196442914D01*
X199002201Y-196300057D01*
X199002201Y-195871486D01*
X199073630Y-195728629D01*
X199145058Y-195657200D01*
X199287916Y-195585771D01*
X199573630Y-195585771D01*
X199716487Y-195657200D01*
X202216487Y-195585771D02*
X202216487Y-196585771D01*
X201859344Y-195014343D02*
X201502201Y-196085771D01*
X202430773Y-196085771D01*
X203002201Y-196442914D02*
X203073629Y-196514343D01*
X203002201Y-196585771D01*
X202930772Y-196514343D01*
X203002201Y-196442914D01*
X203002201Y-196585771D01*
X204002201Y-195085771D02*
X204145058Y-195085771D01*
X204287915Y-195157200D01*
X204359344Y-195228629D01*
X204430773Y-195371486D01*
X204502201Y-195657200D01*
X204502201Y-196014343D01*
X204430773Y-196300057D01*
X204359344Y-196442914D01*
X204287915Y-196514343D01*
X204145058Y-196585771D01*
X204002201Y-196585771D01*
X203859344Y-196514343D01*
X203787915Y-196442914D01*
X203716487Y-196300057D01*
X203645058Y-196014343D01*
X203645058Y-195657200D01*
X203716487Y-195371486D01*
X203787915Y-195228629D01*
X203859344Y-195157200D01*
X204002201Y-195085771D01*
X205145058Y-196442914D02*
X205216486Y-196514343D01*
X205145058Y-196585771D01*
X205073629Y-196514343D01*
X205145058Y-196442914D01*
X205145058Y-196585771D01*
X205716487Y-195085771D02*
X206716487Y-195085771D01*
X206073630Y-196585771D01*
X207287915Y-196014343D02*
X208430772Y-196014343D01*
X209716486Y-196514343D02*
X209573629Y-196585771D01*
X209287915Y-196585771D01*
X209145058Y-196514343D01*
X209073629Y-196371486D01*
X209073629Y-195800057D01*
X209145058Y-195657200D01*
X209287915Y-195585771D01*
X209573629Y-195585771D01*
X209716486Y-195657200D01*
X209787915Y-195800057D01*
X209787915Y-195942914D01*
X209073629Y-196085771D01*
X210359343Y-195228629D02*
X210430772Y-195157200D01*
X210573629Y-195085771D01*
X210930772Y-195085771D01*
X211073629Y-195157200D01*
X211145058Y-195228629D01*
X211216486Y-195371486D01*
X211216486Y-195514343D01*
X211145058Y-195728629D01*
X210287915Y-196585771D01*
X211216486Y-196585771D01*
X211859343Y-196014343D02*
X213002200Y-196014343D01*
X214359343Y-195085771D02*
X214073629Y-195085771D01*
X213930772Y-195157200D01*
X213859343Y-195228629D01*
X213716486Y-195442914D01*
X213645057Y-195728629D01*
X213645057Y-196300057D01*
X213716486Y-196442914D01*
X213787914Y-196514343D01*
X213930772Y-196585771D01*
X214216486Y-196585771D01*
X214359343Y-196514343D01*
X214430772Y-196442914D01*
X214502200Y-196300057D01*
X214502200Y-195942914D01*
X214430772Y-195800057D01*
X214359343Y-195728629D01*
X214216486Y-195657200D01*
X213930772Y-195657200D01*
X213787914Y-195728629D01*
X213716486Y-195800057D01*
X213645057Y-195942914D01*
X215002200Y-195085771D02*
X215930771Y-195085771D01*
X215430771Y-195657200D01*
X215645057Y-195657200D01*
X215787914Y-195728629D01*
X215859343Y-195800057D01*
X215930771Y-195942914D01*
X215930771Y-196300057D01*
X215859343Y-196442914D01*
X215787914Y-196514343D01*
X215645057Y-196585771D01*
X215216485Y-196585771D01*
X215073628Y-196514343D01*
X215002200Y-196442914D01*
X216430771Y-195085771D02*
X217430771Y-195085771D01*
X216787914Y-196585771D01*
X218645056Y-195085771D02*
X218359342Y-195085771D01*
X218216485Y-195157200D01*
X218145056Y-195228629D01*
X218002199Y-195442914D01*
X217930770Y-195728629D01*
X217930770Y-196300057D01*
X218002199Y-196442914D01*
X218073627Y-196514343D01*
X218216485Y-196585771D01*
X218502199Y-196585771D01*
X218645056Y-196514343D01*
X218716485Y-196442914D01*
X218787913Y-196300057D01*
X218787913Y-195942914D01*
X218716485Y-195800057D01*
X218645056Y-195728629D01*
X218502199Y-195657200D01*
X218216485Y-195657200D01*
X218073627Y-195728629D01*
X218002199Y-195800057D01*
X217930770Y-195942914D01*
X220145056Y-195085771D02*
X219430770Y-195085771D01*
X219359341Y-195800057D01*
X219430770Y-195728629D01*
X219573627Y-195657200D01*
X219930770Y-195657200D01*
X220073627Y-195728629D01*
X220145056Y-195800057D01*
X220216484Y-195942914D01*
X220216484Y-196300057D01*
X220145056Y-196442914D01*
X220073627Y-196514343D01*
X219930770Y-196585771D01*
X219573627Y-196585771D01*
X219430770Y-196514343D01*
X219359341Y-196442914D01*
X221073627Y-195728629D02*
X220930769Y-195657200D01*
X220859341Y-195585771D01*
X220787912Y-195442914D01*
X220787912Y-195371486D01*
X220859341Y-195228629D01*
X220930769Y-195157200D01*
X221073627Y-195085771D01*
X221359341Y-195085771D01*
X221502198Y-195157200D01*
X221573627Y-195228629D01*
X221645055Y-195371486D01*
X221645055Y-195442914D01*
X221573627Y-195585771D01*
X221502198Y-195657200D01*
X221359341Y-195728629D01*
X221073627Y-195728629D01*
X220930769Y-195800057D01*
X220859341Y-195871486D01*
X220787912Y-196014343D01*
X220787912Y-196300057D01*
X220859341Y-196442914D01*
X220930769Y-196514343D01*
X221073627Y-196585771D01*
X221359341Y-196585771D01*
X221502198Y-196514343D01*
X221573627Y-196442914D01*
X221645055Y-196300057D01*
X221645055Y-196014343D01*
X221573627Y-195871486D01*
X221502198Y-195800057D01*
X221359341Y-195728629D01*
X219073627Y-194827200D02*
X221930769Y-194827200D01*
X222930769Y-195585771D02*
X222930769Y-196585771D01*
X222287912Y-195585771D02*
X222287912Y-196371486D01*
X222359340Y-196514343D01*
X222502198Y-196585771D01*
X222716483Y-196585771D01*
X222859340Y-196514343D01*
X222930769Y-196442914D01*
X223645055Y-196585771D02*
X223645055Y-195085771D01*
X223645055Y-195657200D02*
X223787912Y-195585771D01*
X224073626Y-195585771D01*
X224216483Y-195657200D01*
X224287912Y-195728629D01*
X224359341Y-195871486D01*
X224359341Y-196300057D01*
X224287912Y-196442914D01*
X224216483Y-196514343D01*
X224073626Y-196585771D01*
X223787912Y-196585771D01*
X223645055Y-196514343D01*
X225645055Y-195585771D02*
X225645055Y-196585771D01*
X225002198Y-195585771D02*
X225002198Y-196371486D01*
X225073626Y-196514343D01*
X225216484Y-196585771D01*
X225430769Y-196585771D01*
X225573626Y-196514343D01*
X225645055Y-196442914D01*
X226359341Y-195585771D02*
X226359341Y-196585771D01*
X226359341Y-195728629D02*
X226430769Y-195657200D01*
X226573627Y-195585771D01*
X226787912Y-195585771D01*
X226930769Y-195657200D01*
X227002198Y-195800057D01*
X227002198Y-196585771D01*
X227502198Y-195585771D02*
X228073627Y-195585771D01*
X227716484Y-195085771D02*
X227716484Y-196371486D01*
X227787912Y-196514343D01*
X227930770Y-196585771D01*
X228073627Y-196585771D01*
X229216484Y-195585771D02*
X229216484Y-196585771D01*
X228573627Y-195585771D02*
X228573627Y-196371486D01*
X228645055Y-196514343D01*
X228787913Y-196585771D01*
X229002198Y-196585771D01*
X229145055Y-196514343D01*
X229216484Y-196442914D01*
X230716484Y-196585771D02*
X229859341Y-196585771D01*
X230287913Y-196585771D02*
X230287913Y-195085771D01*
X230145056Y-195300057D01*
X230002198Y-195442914D01*
X229859341Y-195514343D01*
X232002198Y-195085771D02*
X231716484Y-195085771D01*
X231573627Y-195157200D01*
X231502198Y-195228629D01*
X231359341Y-195442914D01*
X231287912Y-195728629D01*
X231287912Y-196300057D01*
X231359341Y-196442914D01*
X231430769Y-196514343D01*
X231573627Y-196585771D01*
X231859341Y-196585771D01*
X232002198Y-196514343D01*
X232073627Y-196442914D01*
X232145055Y-196300057D01*
X232145055Y-195942914D01*
X232073627Y-195800057D01*
X232002198Y-195728629D01*
X231859341Y-195657200D01*
X231573627Y-195657200D01*
X231430769Y-195728629D01*
X231359341Y-195800057D01*
X231287912Y-195942914D01*
X232787912Y-196442914D02*
X232859340Y-196514343D01*
X232787912Y-196585771D01*
X232716483Y-196514343D01*
X232787912Y-196442914D01*
X232787912Y-196585771D01*
X233787912Y-195085771D02*
X233930769Y-195085771D01*
X234073626Y-195157200D01*
X234145055Y-195228629D01*
X234216484Y-195371486D01*
X234287912Y-195657200D01*
X234287912Y-196014343D01*
X234216484Y-196300057D01*
X234145055Y-196442914D01*
X234073626Y-196514343D01*
X233930769Y-196585771D01*
X233787912Y-196585771D01*
X233645055Y-196514343D01*
X233573626Y-196442914D01*
X233502198Y-196300057D01*
X233430769Y-196014343D01*
X233430769Y-195657200D01*
X233502198Y-195371486D01*
X233573626Y-195228629D01*
X233645055Y-195157200D01*
X233787912Y-195085771D01*
X235573626Y-195585771D02*
X235573626Y-196585771D01*
X235216483Y-195014343D02*
X234859340Y-196085771D01*
X235787912Y-196085771D01*
X236359340Y-196442914D02*
X236430768Y-196514343D01*
X236359340Y-196585771D01*
X236287911Y-196514343D01*
X236359340Y-196442914D01*
X236359340Y-196585771D01*
X237859340Y-196585771D02*
X237002197Y-196585771D01*
X237430769Y-196585771D02*
X237430769Y-195085771D01*
X237287912Y-195300057D01*
X237145054Y-195442914D01*
X237002197Y-195514343D01*
D10*
D11*
X177002200Y-191507200D02*
X285002200Y-191507200D01*
D10*
D12*
X264216486Y-193785771D02*
X263716486Y-193071486D01*
X263359343Y-193785771D02*
X263359343Y-192285771D01*
X263930771Y-192285771D01*
X264073629Y-192357200D01*
X264145057Y-192428629D01*
X264216486Y-192571486D01*
X264216486Y-192785771D01*
X264145057Y-192928629D01*
X264073629Y-193000057D01*
X263930771Y-193071486D01*
X263359343Y-193071486D01*
X265430771Y-193714343D02*
X265287914Y-193785771D01*
X265002200Y-193785771D01*
X264859343Y-193714343D01*
X264787914Y-193571486D01*
X264787914Y-193000057D01*
X264859343Y-192857200D01*
X265002200Y-192785771D01*
X265287914Y-192785771D01*
X265430771Y-192857200D01*
X265502200Y-193000057D01*
X265502200Y-193142914D01*
X264787914Y-193285771D01*
X266002200Y-192785771D02*
X266359343Y-193785771D01*
X266716485Y-192785771D01*
X267287914Y-193642914D02*
X267359342Y-193714343D01*
X267287914Y-193785771D01*
X267216485Y-193714343D01*
X267287914Y-193642914D01*
X267287914Y-193785771D01*
X267287914Y-192857200D02*
X267359342Y-192928629D01*
X267287914Y-193000057D01*
X267216485Y-192928629D01*
X267287914Y-192857200D01*
X267287914Y-193000057D01*
X268930771Y-192285771D02*
X269430771Y-193785771D01*
X269930771Y-192285771D01*
X271216485Y-193785771D02*
X270359342Y-193785771D01*
X270787914Y-193785771D02*
X270787914Y-192285771D01*
X270645057Y-192500057D01*
X270502199Y-192642914D01*
X270359342Y-192714343D01*
X271859342Y-193642914D02*
X271930770Y-193714343D01*
X271859342Y-193785771D01*
X271787913Y-193714343D01*
X271859342Y-193642914D01*
X271859342Y-193785771D01*
X273216485Y-192785771D02*
X273216485Y-193785771D01*
X272859342Y-192214343D02*
X272502199Y-193285771D01*
X273430771Y-193285771D01*
D10*
D11*
X178287914Y-193714343D02*
X178502200Y-193785771D01*
X178859343Y-193785771D01*
X179002200Y-193714343D01*
X179073629Y-193642914D01*
X179145057Y-193500057D01*
X179145057Y-193357200D01*
X179073629Y-193214343D01*
X179002200Y-193142914D01*
X178859343Y-193071486D01*
X178573629Y-193000057D01*
X178430771Y-192928629D01*
X178359343Y-192857200D01*
X178287914Y-192714343D01*
X178287914Y-192571486D01*
X178359343Y-192428629D01*
X178430771Y-192357200D01*
X178573629Y-192285771D01*
X178930771Y-192285771D01*
X179145057Y-192357200D01*
X179787914Y-193785771D02*
X179787914Y-192785771D01*
X179787914Y-192285771D02*
X179716485Y-192357200D01*
X179787914Y-192428629D01*
X179859342Y-192357200D01*
X179787914Y-192285771D01*
X179787914Y-192428629D01*
X180359343Y-192785771D02*
X181145057Y-192785771D01*
X180359343Y-193785771D01*
X181145057Y-193785771D01*
X182287914Y-193714343D02*
X182145057Y-193785771D01*
X181859343Y-193785771D01*
X181716486Y-193714343D01*
X181645057Y-193571486D01*
X181645057Y-193000057D01*
X181716486Y-192857200D01*
X181859343Y-192785771D01*
X182145057Y-192785771D01*
X182287914Y-192857200D01*
X182359343Y-193000057D01*
X182359343Y-193142914D01*
X181645057Y-193285771D01*
X183002200Y-193642914D02*
X183073628Y-193714343D01*
X183002200Y-193785771D01*
X182930771Y-193714343D01*
X183002200Y-193642914D01*
X183002200Y-193785771D01*
X183002200Y-192857200D02*
X183073628Y-192928629D01*
X183002200Y-193000057D01*
X182930771Y-192928629D01*
X183002200Y-192857200D01*
X183002200Y-193000057D01*
X184787914Y-193357200D02*
X185502200Y-193357200D01*
X184645057Y-193785771D02*
X185145057Y-192285771D01*
X185645057Y-193785771D01*
X186787914Y-192785771D02*
X186787914Y-193785771D01*
X186430771Y-192214343D02*
X186073628Y-193285771D01*
X187002200Y-193285771D01*
D10*
D11*
X263359343Y-196585771D02*
X263359343Y-195085771D01*
X264716486Y-196585771D02*
X264716486Y-195085771D01*
X264716486Y-196514343D02*
X264573629Y-196585771D01*
X264287915Y-196585771D01*
X264145057Y-196514343D01*
X264073629Y-196442914D01*
X264002200Y-196300057D01*
X264002200Y-195871486D01*
X264073629Y-195728629D01*
X264145057Y-195657200D01*
X264287915Y-195585771D01*
X264573629Y-195585771D01*
X264716486Y-195657200D01*
X265430772Y-196442914D02*
X265502200Y-196514343D01*
X265430772Y-196585771D01*
X265359343Y-196514343D01*
X265430772Y-196442914D01*
X265430772Y-196585771D01*
X265430772Y-195657200D02*
X265502200Y-195728629D01*
X265430772Y-195800057D01*
X265359343Y-195728629D01*
X265430772Y-195657200D01*
X265430772Y-195800057D01*
X268073629Y-196585771D02*
X267216486Y-196585771D01*
X267645058Y-196585771D02*
X267645058Y-195085771D01*
X267502201Y-195300057D01*
X267359343Y-195442914D01*
X267216486Y-195514343D01*
X269787914Y-195014343D02*
X268502200Y-196942914D01*
X271073629Y-196585771D02*
X270216486Y-196585771D01*
X270645058Y-196585771D02*
X270645058Y-195085771D01*
X270502201Y-195300057D01*
X270359343Y-195442914D01*
X270216486Y-195514343D01*
D10*
D11*
X177002200Y-187507200D02*
X285002200Y-187507200D01*
D10*
D13*
X178454581Y-188211962D02*
X179597438Y-188211962D01*
X178776010Y-190211962D02*
X179026010Y-188211962D01*
X180014105Y-190211962D02*
X180180771Y-188878629D01*
X180264105Y-188211962D02*
X180156962Y-188307200D01*
X180240295Y-188402438D01*
X180347439Y-188307200D01*
X180264105Y-188211962D01*
X180240295Y-188402438D01*
X180847438Y-188878629D02*
X181609343Y-188878629D01*
X181216486Y-188211962D02*
X181002200Y-189926248D01*
X181073630Y-190116724D01*
X181252201Y-190211962D01*
X181442677Y-190211962D01*
X182395058Y-190211962D02*
X182216487Y-190116724D01*
X182145057Y-189926248D01*
X182359343Y-188211962D01*
X183930772Y-190116724D02*
X183728391Y-190211962D01*
X183347439Y-190211962D01*
X183168867Y-190116724D01*
X183097438Y-189926248D01*
X183192676Y-189164343D01*
X183311724Y-188973867D01*
X183514105Y-188878629D01*
X183895057Y-188878629D01*
X184073629Y-188973867D01*
X184145057Y-189164343D01*
X184121248Y-189354819D01*
X183145057Y-189545295D01*
X184895057Y-190021486D02*
X184978392Y-190116724D01*
X184871248Y-190211962D01*
X184787915Y-190116724D01*
X184895057Y-190021486D01*
X184871248Y-190211962D01*
X185026010Y-188973867D02*
X185109344Y-189069105D01*
X185002200Y-189164343D01*
X184918867Y-189069105D01*
X185026010Y-188973867D01*
X185002200Y-189164343D01*
X188299820Y-190211962D02*
X187347439Y-190211962D01*
X187597439Y-188211962D01*
X189252202Y-190211962D02*
X189073631Y-190116724D01*
X188990296Y-190021486D01*
X188918868Y-189831010D01*
X188990296Y-189259581D01*
X189109344Y-189069105D01*
X189216488Y-188973867D01*
X189418868Y-188878629D01*
X189704582Y-188878629D01*
X189883154Y-188973867D01*
X189966487Y-189069105D01*
X190037915Y-189259581D01*
X189966487Y-189831010D01*
X189847439Y-190021486D01*
X189740297Y-190116724D01*
X189537916Y-190211962D01*
X189252202Y-190211962D01*
X191918869Y-190211962D02*
X191371249Y-189259581D01*
X190776011Y-190211962D02*
X191026011Y-188211962D01*
X191787916Y-188211962D01*
X191966487Y-188307200D01*
X192049821Y-188402438D01*
X192121250Y-188592914D01*
X192085535Y-188878629D01*
X191966488Y-189069105D01*
X191859344Y-189164343D01*
X191656963Y-189259581D01*
X190895058Y-189259581D01*
X193633154Y-190211962D02*
X193764106Y-189164343D01*
X193692678Y-188973867D01*
X193514106Y-188878629D01*
X193133154Y-188878629D01*
X192930773Y-188973867D01*
X193645059Y-190116724D02*
X193442678Y-190211962D01*
X192966488Y-190211962D01*
X192787916Y-190116724D01*
X192716487Y-189926248D01*
X192740297Y-189735771D01*
X192859344Y-189545295D01*
X193061726Y-189450057D01*
X193537916Y-189450057D01*
X193740297Y-189354819D01*
X196026012Y-190116724D02*
X196299822Y-190211962D01*
X196776012Y-190211962D01*
X196978393Y-190116724D01*
X197085535Y-190021486D01*
X197204584Y-189831010D01*
X197228393Y-189640533D01*
X197156964Y-189450057D01*
X197073631Y-189354819D01*
X196895059Y-189259581D01*
X196526012Y-189164343D01*
X196347441Y-189069105D01*
X196264107Y-188973867D01*
X196192678Y-188783390D01*
X196216488Y-188592914D01*
X196335535Y-188402438D01*
X196442679Y-188307200D01*
X196645060Y-188211962D01*
X197121250Y-188211962D01*
X197395060Y-188307200D01*
X197895059Y-188878629D02*
X198656964Y-188878629D01*
X198264107Y-188211962D02*
X198049821Y-189926248D01*
X198121251Y-190116724D01*
X198299822Y-190211962D01*
X198490298Y-190211962D01*
X200014107Y-190211962D02*
X200145059Y-189164343D01*
X200073631Y-188973867D01*
X199895059Y-188878629D01*
X199514107Y-188878629D01*
X199311726Y-188973867D01*
X200026012Y-190116724D02*
X199823631Y-190211962D01*
X199347441Y-190211962D01*
X199168869Y-190116724D01*
X199097440Y-189926248D01*
X199121250Y-189735771D01*
X199240297Y-189545295D01*
X199442679Y-189450057D01*
X199918869Y-189450057D01*
X200121250Y-189354819D01*
X201835536Y-190116724D02*
X201633155Y-190211962D01*
X201252203Y-190211962D01*
X201073632Y-190116724D01*
X200990297Y-190021486D01*
X200918869Y-189831010D01*
X200990297Y-189259581D01*
X201109345Y-189069105D01*
X201216489Y-188973867D01*
X201418869Y-188878629D01*
X201799821Y-188878629D01*
X201978393Y-188973867D01*
X202680774Y-190211962D02*
X202930774Y-188211962D01*
X202966489Y-189450057D02*
X203442679Y-190211962D01*
X203609345Y-188878629D02*
X202752202Y-189640533D01*
D10*
D11*
X178859343Y-185600057D02*
X178359343Y-185600057D01*
X178359343Y-186385771D02*
X178359343Y-184885771D01*
X179073629Y-184885771D01*
X179645057Y-186385771D02*
X179645057Y-185385771D01*
X179645057Y-184885771D02*
X179573628Y-184957200D01*
X179645057Y-185028629D01*
X179716485Y-184957200D01*
X179645057Y-184885771D01*
X179645057Y-185028629D01*
X180573629Y-186385771D02*
X180430771Y-186314343D01*
X180359343Y-186171486D01*
X180359343Y-184885771D01*
X181716485Y-186314343D02*
X181573628Y-186385771D01*
X181287914Y-186385771D01*
X181145057Y-186314343D01*
X181073628Y-186171486D01*
X181073628Y-185600057D01*
X181145057Y-185457200D01*
X181287914Y-185385771D01*
X181573628Y-185385771D01*
X181716485Y-185457200D01*
X181787914Y-185600057D01*
X181787914Y-185742914D01*
X181073628Y-185885771D01*
X182430771Y-186242914D02*
X182502199Y-186314343D01*
X182430771Y-186385771D01*
X182359342Y-186314343D01*
X182430771Y-186242914D01*
X182430771Y-186385771D01*
X182430771Y-185457200D02*
X182502199Y-185528629D01*
X182430771Y-185600057D01*
X182359342Y-185528629D01*
X182430771Y-185457200D01*
X182430771Y-185600057D01*
X185002200Y-186385771D02*
X184287914Y-186385771D01*
X184287914Y-184885771D01*
X185716486Y-186385771D02*
X185573628Y-186314343D01*
X185502200Y-186242914D01*
X185430771Y-186100057D01*
X185430771Y-185671486D01*
X185502200Y-185528629D01*
X185573628Y-185457200D01*
X185716486Y-185385771D01*
X185930771Y-185385771D01*
X186073628Y-185457200D01*
X186145057Y-185528629D01*
X186216486Y-185671486D01*
X186216486Y-186100057D01*
X186145057Y-186242914D01*
X186073628Y-186314343D01*
X185930771Y-186385771D01*
X185716486Y-186385771D01*
X186859343Y-186385771D02*
X186859343Y-185385771D01*
X186859343Y-185671486D02*
X186930771Y-185528629D01*
X187002200Y-185457200D01*
X187145057Y-185385771D01*
X187287914Y-185385771D01*
X188430771Y-186385771D02*
X188430771Y-185600057D01*
X188359342Y-185457200D01*
X188216485Y-185385771D01*
X187930771Y-185385771D01*
X187787914Y-185457200D01*
X188430771Y-186314343D02*
X188287914Y-186385771D01*
X187930771Y-186385771D01*
X187787914Y-186314343D01*
X187716485Y-186171486D01*
X187716485Y-186028629D01*
X187787914Y-185885771D01*
X187930771Y-185814343D01*
X188287914Y-185814343D01*
X188430771Y-185742914D01*
X189145057Y-186242914D02*
X189216485Y-186314343D01*
X189145057Y-186385771D01*
X189073628Y-186314343D01*
X189145057Y-186242914D01*
X189145057Y-186385771D01*
X189859343Y-186385771D02*
X189859343Y-184885771D01*
X190002200Y-185814343D02*
X190430771Y-186385771D01*
X190430771Y-185385771D02*
X189859343Y-185957200D01*
X191073629Y-186385771D02*
X191073629Y-185385771D01*
X191073629Y-184885771D02*
X191002200Y-184957200D01*
X191073629Y-185028629D01*
X191145057Y-184957200D01*
X191073629Y-184885771D01*
X191073629Y-185028629D01*
X192430772Y-186314343D02*
X192287915Y-186385771D01*
X192002201Y-186385771D01*
X191859343Y-186314343D01*
X191787915Y-186242914D01*
X191716486Y-186100057D01*
X191716486Y-185671486D01*
X191787915Y-185528629D01*
X191859343Y-185457200D01*
X192002201Y-185385771D01*
X192287915Y-185385771D01*
X192430772Y-185457200D01*
X193716486Y-186385771D02*
X193716486Y-185600057D01*
X193645057Y-185457200D01*
X193502200Y-185385771D01*
X193216486Y-185385771D01*
X193073629Y-185457200D01*
X193716486Y-186314343D02*
X193573629Y-186385771D01*
X193216486Y-186385771D01*
X193073629Y-186314343D01*
X193002200Y-186171486D01*
X193002200Y-186028629D01*
X193073629Y-185885771D01*
X193216486Y-185814343D01*
X193573629Y-185814343D01*
X193716486Y-185742914D01*
X195073629Y-186385771D02*
X195073629Y-184885771D01*
X195073629Y-186314343D02*
X194930772Y-186385771D01*
X194645058Y-186385771D01*
X194502200Y-186314343D01*
X194430772Y-186242914D01*
X194359343Y-186100057D01*
X194359343Y-185671486D01*
X194430772Y-185528629D01*
X194502200Y-185457200D01*
X194645058Y-185385771D01*
X194930772Y-185385771D01*
X195073629Y-185457200D01*
X195430772Y-186528629D02*
X196573629Y-186528629D01*
X196930772Y-185385771D02*
X196930772Y-186885771D01*
X196930772Y-185457200D02*
X197073629Y-185385771D01*
X197359343Y-185385771D01*
X197502200Y-185457200D01*
X197573629Y-185528629D01*
X197645058Y-185671486D01*
X197645058Y-186100057D01*
X197573629Y-186242914D01*
X197502200Y-186314343D01*
X197359343Y-186385771D01*
X197073629Y-186385771D01*
X196930772Y-186314343D01*
X198930772Y-186314343D02*
X198787915Y-186385771D01*
X198502201Y-186385771D01*
X198359343Y-186314343D01*
X198287915Y-186242914D01*
X198216486Y-186100057D01*
X198216486Y-185671486D01*
X198287915Y-185528629D01*
X198359343Y-185457200D01*
X198502201Y-185385771D01*
X198787915Y-185385771D01*
X198930772Y-185457200D01*
X199573629Y-186385771D02*
X199573629Y-184885771D01*
X199573629Y-185457200D02*
X199716486Y-185385771D01*
X200002200Y-185385771D01*
X200145057Y-185457200D01*
X200216486Y-185528629D01*
X200287915Y-185671486D01*
X200287915Y-186100057D01*
X200216486Y-186242914D01*
X200145057Y-186314343D01*
X200002200Y-186385771D01*
X199716486Y-186385771D01*
X199573629Y-186314343D01*
D10*
D11*
X177002200Y-181507200D02*
X285002200Y-181507200D01*
D10*
D11*
X178287914Y-183614343D02*
X178502200Y-183685771D01*
X178859343Y-183685771D01*
X179002200Y-183614343D01*
X179073629Y-183542914D01*
X179145057Y-183400057D01*
X179145057Y-183257200D01*
X179073629Y-183114343D01*
X179002200Y-183042914D01*
X178859343Y-182971486D01*
X178573629Y-182900057D01*
X178430771Y-182828629D01*
X178359343Y-182757200D01*
X178287914Y-182614343D01*
X178287914Y-182471486D01*
X178359343Y-182328629D01*
X178430771Y-182257200D01*
X178573629Y-182185771D01*
X178930771Y-182185771D01*
X179145057Y-182257200D01*
X179787914Y-183685771D02*
X179787914Y-182185771D01*
X180430771Y-183685771D02*
X180430771Y-182900057D01*
X180359342Y-182757200D01*
X180216485Y-182685771D01*
X180002200Y-182685771D01*
X179859342Y-182757200D01*
X179787914Y-182828629D01*
X181716485Y-183614343D02*
X181573628Y-183685771D01*
X181287914Y-183685771D01*
X181145057Y-183614343D01*
X181073628Y-183471486D01*
X181073628Y-182900057D01*
X181145057Y-182757200D01*
X181287914Y-182685771D01*
X181573628Y-182685771D01*
X181716485Y-182757200D01*
X181787914Y-182900057D01*
X181787914Y-183042914D01*
X181073628Y-183185771D01*
X183002199Y-183614343D02*
X182859342Y-183685771D01*
X182573628Y-183685771D01*
X182430771Y-183614343D01*
X182359342Y-183471486D01*
X182359342Y-182900057D01*
X182430771Y-182757200D01*
X182573628Y-182685771D01*
X182859342Y-182685771D01*
X183002199Y-182757200D01*
X183073628Y-182900057D01*
X183073628Y-183042914D01*
X182359342Y-183185771D01*
X183502199Y-182685771D02*
X184073628Y-182685771D01*
X183716485Y-182185771D02*
X183716485Y-183471486D01*
X183787913Y-183614343D01*
X183930771Y-183685771D01*
X184073628Y-183685771D01*
X184573628Y-183542914D02*
X184645056Y-183614343D01*
X184573628Y-183685771D01*
X184502199Y-183614343D01*
X184573628Y-183542914D01*
X184573628Y-183685771D01*
X184573628Y-182757200D02*
X184645056Y-182828629D01*
X184573628Y-182900057D01*
X184502199Y-182828629D01*
X184573628Y-182757200D01*
X184573628Y-182900057D01*
D10*
D12*
X178287914Y-180614343D02*
X178502200Y-180685771D01*
X178859343Y-180685771D01*
X179002200Y-180614343D01*
X179073629Y-180542914D01*
X179145057Y-180400057D01*
X179145057Y-180257200D01*
X179073629Y-180114343D01*
X179002200Y-180042914D01*
X178859343Y-179971486D01*
X178573629Y-179900057D01*
X178430771Y-179828629D01*
X178359343Y-179757200D01*
X178287914Y-179614343D01*
X178287914Y-179471486D01*
X178359343Y-179328629D01*
X178430771Y-179257200D01*
X178573629Y-179185771D01*
X178930771Y-179185771D01*
X179145057Y-179257200D01*
X180002200Y-180685771D02*
X179859342Y-180614343D01*
X179787914Y-180542914D01*
X179716485Y-180400057D01*
X179716485Y-179971486D01*
X179787914Y-179828629D01*
X179859342Y-179757200D01*
X180002200Y-179685771D01*
X180216485Y-179685771D01*
X180359342Y-179757200D01*
X180430771Y-179828629D01*
X180502200Y-179971486D01*
X180502200Y-180400057D01*
X180430771Y-180542914D01*
X180359342Y-180614343D01*
X180216485Y-180685771D01*
X180002200Y-180685771D01*
X181145057Y-180685771D02*
X181145057Y-179685771D01*
X181145057Y-179185771D02*
X181073628Y-179257200D01*
X181145057Y-179328629D01*
X181216485Y-179257200D01*
X181145057Y-179185771D01*
X181145057Y-179328629D01*
X182073629Y-180685771D02*
X181930771Y-180614343D01*
X181859343Y-180471486D01*
X181859343Y-179185771D01*
X183716485Y-180257200D02*
X184430771Y-180257200D01*
X183573628Y-180685771D02*
X184073628Y-179185771D01*
X184573628Y-180685771D01*
X185716485Y-179685771D02*
X185716485Y-180900057D01*
X185645056Y-181042914D01*
X185573628Y-181114343D01*
X185430771Y-181185771D01*
X185216485Y-181185771D01*
X185073628Y-181114343D01*
X185716485Y-180614343D02*
X185573628Y-180685771D01*
X185287914Y-180685771D01*
X185145056Y-180614343D01*
X185073628Y-180542914D01*
X185002199Y-180400057D01*
X185002199Y-179971486D01*
X185073628Y-179828629D01*
X185145056Y-179757200D01*
X185287914Y-179685771D01*
X185573628Y-179685771D01*
X185716485Y-179757200D01*
X186430771Y-180685771D02*
X186430771Y-179685771D01*
X186430771Y-179971486D02*
X186502199Y-179828629D01*
X186573628Y-179757200D01*
X186716485Y-179685771D01*
X186859342Y-179685771D01*
X187359342Y-180685771D02*
X187359342Y-179685771D01*
X187359342Y-179185771D02*
X187287913Y-179257200D01*
X187359342Y-179328629D01*
X187430770Y-179257200D01*
X187359342Y-179185771D01*
X187359342Y-179328629D01*
X187859342Y-179685771D02*
X188430771Y-179685771D01*
X188073628Y-179185771D02*
X188073628Y-180471486D01*
X188145056Y-180614343D01*
X188287914Y-180685771D01*
X188430771Y-180685771D01*
X189502199Y-180614343D02*
X189359342Y-180685771D01*
X189073628Y-180685771D01*
X188930771Y-180614343D01*
X188859342Y-180471486D01*
X188859342Y-179900057D01*
X188930771Y-179757200D01*
X189073628Y-179685771D01*
X189359342Y-179685771D01*
X189502199Y-179757200D01*
X189573628Y-179900057D01*
X189573628Y-180042914D01*
X188859342Y-180185771D01*
X190859342Y-180614343D02*
X190716485Y-180685771D01*
X190430771Y-180685771D01*
X190287913Y-180614343D01*
X190216485Y-180542914D01*
X190145056Y-180400057D01*
X190145056Y-179971486D01*
X190216485Y-179828629D01*
X190287913Y-179757200D01*
X190430771Y-179685771D01*
X190716485Y-179685771D01*
X190859342Y-179757200D01*
X191502199Y-180685771D02*
X191502199Y-179185771D01*
X192145056Y-180685771D02*
X192145056Y-179900057D01*
X192073627Y-179757200D01*
X191930770Y-179685771D01*
X191716485Y-179685771D01*
X191573627Y-179757200D01*
X191502199Y-179828629D01*
X194002199Y-180685771D02*
X194002199Y-179185771D01*
X194573627Y-179185771D01*
X194716485Y-179257200D01*
X194787913Y-179328629D01*
X194859342Y-179471486D01*
X194859342Y-179685771D01*
X194787913Y-179828629D01*
X194716485Y-179900057D01*
X194573627Y-179971486D01*
X194002199Y-179971486D01*
X195359342Y-179685771D02*
X195716485Y-180685771D01*
X196073627Y-179685771D01*
X196430770Y-179685771D02*
X197002199Y-179685771D01*
X196645056Y-179185771D02*
X196645056Y-180471486D01*
X196716484Y-180614343D01*
X196859342Y-180685771D01*
X197002199Y-180685771D01*
X197502199Y-180542914D02*
X197573627Y-180614343D01*
X197502199Y-180685771D01*
X197430770Y-180614343D01*
X197502199Y-180542914D01*
X197502199Y-180685771D01*
X200073628Y-180685771D02*
X199359342Y-180685771D01*
X199359342Y-179185771D01*
X200359342Y-179685771D02*
X200930771Y-179685771D01*
X200573628Y-179185771D02*
X200573628Y-180471486D01*
X200645056Y-180614343D01*
X200787914Y-180685771D01*
X200930771Y-180685771D01*
X202073628Y-180685771D02*
X202073628Y-179185771D01*
X202073628Y-180614343D02*
X201930771Y-180685771D01*
X201645057Y-180685771D01*
X201502199Y-180614343D01*
X201430771Y-180542914D01*
X201359342Y-180400057D01*
X201359342Y-179971486D01*
X201430771Y-179828629D01*
X201502199Y-179757200D01*
X201645057Y-179685771D01*
X201930771Y-179685771D01*
X202073628Y-179757200D01*
X202787914Y-180542914D02*
X202859342Y-180614343D01*
X202787914Y-180685771D01*
X202716485Y-180614343D01*
X202787914Y-180542914D01*
X202787914Y-180685771D01*
D10*
D11*
X178359343Y-177685771D02*
X178359343Y-176185771D01*
X178716486Y-176185771D01*
X178930771Y-176257200D01*
X179073629Y-176400057D01*
X179145057Y-176542914D01*
X179216486Y-176828629D01*
X179216486Y-177042914D01*
X179145057Y-177328629D01*
X179073629Y-177471486D01*
X178930771Y-177614343D01*
X178716486Y-177685771D01*
X178359343Y-177685771D01*
X180430771Y-177614343D02*
X180287914Y-177685771D01*
X180002200Y-177685771D01*
X179859343Y-177614343D01*
X179787914Y-177471486D01*
X179787914Y-176900057D01*
X179859343Y-176757200D01*
X180002200Y-176685771D01*
X180287914Y-176685771D01*
X180430771Y-176757200D01*
X180502200Y-176900057D01*
X180502200Y-177042914D01*
X179787914Y-177185771D01*
X181073628Y-177614343D02*
X181216485Y-177685771D01*
X181502200Y-177685771D01*
X181645057Y-177614343D01*
X181716485Y-177471486D01*
X181716485Y-177400057D01*
X181645057Y-177257200D01*
X181502200Y-177185771D01*
X181287914Y-177185771D01*
X181145057Y-177114343D01*
X181073628Y-176971486D01*
X181073628Y-176900057D01*
X181145057Y-176757200D01*
X181287914Y-176685771D01*
X181502200Y-176685771D01*
X181645057Y-176757200D01*
X182359343Y-177685771D02*
X182359343Y-176685771D01*
X182359343Y-176185771D02*
X182287914Y-176257200D01*
X182359343Y-176328629D01*
X182430771Y-176257200D01*
X182359343Y-176185771D01*
X182359343Y-176328629D01*
X183716486Y-176685771D02*
X183716486Y-177900057D01*
X183645057Y-178042914D01*
X183573629Y-178114343D01*
X183430772Y-178185771D01*
X183216486Y-178185771D01*
X183073629Y-178114343D01*
X183716486Y-177614343D02*
X183573629Y-177685771D01*
X183287915Y-177685771D01*
X183145057Y-177614343D01*
X183073629Y-177542914D01*
X183002200Y-177400057D01*
X183002200Y-176971486D01*
X183073629Y-176828629D01*
X183145057Y-176757200D01*
X183287915Y-176685771D01*
X183573629Y-176685771D01*
X183716486Y-176757200D01*
X184430772Y-176685771D02*
X184430772Y-177685771D01*
X184430772Y-176828629D02*
X184502200Y-176757200D01*
X184645058Y-176685771D01*
X184859343Y-176685771D01*
X185002200Y-176757200D01*
X185073629Y-176900057D01*
X185073629Y-177685771D01*
X186359343Y-177614343D02*
X186216486Y-177685771D01*
X185930772Y-177685771D01*
X185787915Y-177614343D01*
X185716486Y-177471486D01*
X185716486Y-176900057D01*
X185787915Y-176757200D01*
X185930772Y-176685771D01*
X186216486Y-176685771D01*
X186359343Y-176757200D01*
X186430772Y-176900057D01*
X186430772Y-177042914D01*
X185716486Y-177185771D01*
X187716486Y-177685771D02*
X187716486Y-176185771D01*
X187716486Y-177614343D02*
X187573629Y-177685771D01*
X187287915Y-177685771D01*
X187145057Y-177614343D01*
X187073629Y-177542914D01*
X187002200Y-177400057D01*
X187002200Y-176971486D01*
X187073629Y-176828629D01*
X187145057Y-176757200D01*
X187287915Y-176685771D01*
X187573629Y-176685771D01*
X187716486Y-176757200D01*
X189573629Y-177685771D02*
X189573629Y-176185771D01*
X189573629Y-176757200D02*
X189716486Y-176685771D01*
X190002200Y-176685771D01*
X190145057Y-176757200D01*
X190216486Y-176828629D01*
X190287915Y-176971486D01*
X190287915Y-177400057D01*
X190216486Y-177542914D01*
X190145057Y-177614343D01*
X190002200Y-177685771D01*
X189716486Y-177685771D01*
X189573629Y-177614343D01*
X190787915Y-176685771D02*
X191145058Y-177685771D01*
X191502200Y-176685771D02*
X191145058Y-177685771D01*
X191002200Y-178042914D01*
X190930772Y-178114343D01*
X190787915Y-178185771D01*
X193145057Y-177614343D02*
X193359343Y-177685771D01*
X193716486Y-177685771D01*
X193859343Y-177614343D01*
X193930772Y-177542914D01*
X194002200Y-177400057D01*
X194002200Y-177257200D01*
X193930772Y-177114343D01*
X193859343Y-177042914D01*
X193716486Y-176971486D01*
X193430772Y-176900057D01*
X193287914Y-176828629D01*
X193216486Y-176757200D01*
X193145057Y-176614343D01*
X193145057Y-176471486D01*
X193216486Y-176328629D01*
X193287914Y-176257200D01*
X193430772Y-176185771D01*
X193787914Y-176185771D01*
X194002200Y-176257200D01*
X194502200Y-176685771D02*
X194787914Y-177685771D01*
X195073628Y-176971486D01*
X195359343Y-177685771D01*
X195645057Y-176685771D01*
X196859343Y-177685771D02*
X196859343Y-176900057D01*
X196787914Y-176757200D01*
X196645057Y-176685771D01*
X196359343Y-176685771D01*
X196216486Y-176757200D01*
X196859343Y-177614343D02*
X196716486Y-177685771D01*
X196359343Y-177685771D01*
X196216486Y-177614343D01*
X196145057Y-177471486D01*
X196145057Y-177328629D01*
X196216486Y-177185771D01*
X196359343Y-177114343D01*
X196716486Y-177114343D01*
X196859343Y-177042914D01*
X197573629Y-177685771D02*
X197573629Y-176685771D01*
X197573629Y-176971486D02*
X197645057Y-176828629D01*
X197716486Y-176757200D01*
X197859343Y-176685771D01*
X198002200Y-176685771D01*
X198716486Y-177685771D02*
X198573628Y-177614343D01*
X198502200Y-177542914D01*
X198430771Y-177400057D01*
X198430771Y-176971486D01*
X198502200Y-176828629D01*
X198573628Y-176757200D01*
X198716486Y-176685771D01*
X198930771Y-176685771D01*
X199073628Y-176757200D01*
X199145057Y-176828629D01*
X199216486Y-176971486D01*
X199216486Y-177400057D01*
X199145057Y-177542914D01*
X199073628Y-177614343D01*
X198930771Y-177685771D01*
X198716486Y-177685771D01*
X200073629Y-177685771D02*
X199930771Y-177614343D01*
X199859343Y-177542914D01*
X199787914Y-177400057D01*
X199787914Y-176971486D01*
X199859343Y-176828629D01*
X199930771Y-176757200D01*
X200073629Y-176685771D01*
X200287914Y-176685771D01*
X200430771Y-176757200D01*
X200502200Y-176828629D01*
X200573629Y-176971486D01*
X200573629Y-177400057D01*
X200502200Y-177542914D01*
X200430771Y-177614343D01*
X200287914Y-177685771D01*
X200073629Y-177685771D01*
X201216486Y-176685771D02*
X201216486Y-178185771D01*
X201216486Y-176757200D02*
X201359343Y-176685771D01*
X201645057Y-176685771D01*
X201787914Y-176757200D01*
X201859343Y-176828629D01*
X201930772Y-176971486D01*
X201930772Y-177400057D01*
X201859343Y-177542914D01*
X201787914Y-177614343D01*
X201645057Y-177685771D01*
X201359343Y-177685771D01*
X201216486Y-177614343D01*
X203645057Y-177614343D02*
X203859343Y-177685771D01*
X204216486Y-177685771D01*
X204359343Y-177614343D01*
X204430772Y-177542914D01*
X204502200Y-177400057D01*
X204502200Y-177257200D01*
X204430772Y-177114343D01*
X204359343Y-177042914D01*
X204216486Y-176971486D01*
X203930772Y-176900057D01*
X203787914Y-176828629D01*
X203716486Y-176757200D01*
X203645057Y-176614343D01*
X203645057Y-176471486D01*
X203716486Y-176328629D01*
X203787914Y-176257200D01*
X203930772Y-176185771D01*
X204287914Y-176185771D01*
X204502200Y-176257200D01*
X205787914Y-177685771D02*
X205787914Y-176900057D01*
X205716485Y-176757200D01*
X205573628Y-176685771D01*
X205287914Y-176685771D01*
X205145057Y-176757200D01*
X205787914Y-177614343D02*
X205645057Y-177685771D01*
X205287914Y-177685771D01*
X205145057Y-177614343D01*
X205073628Y-177471486D01*
X205073628Y-177328629D01*
X205145057Y-177185771D01*
X205287914Y-177114343D01*
X205645057Y-177114343D01*
X205787914Y-177042914D01*
X207145057Y-177685771D02*
X207145057Y-176185771D01*
X207145057Y-177614343D02*
X207002200Y-177685771D01*
X206716486Y-177685771D01*
X206573628Y-177614343D01*
X206502200Y-177542914D01*
X206430771Y-177400057D01*
X206430771Y-176971486D01*
X206502200Y-176828629D01*
X206573628Y-176757200D01*
X206716486Y-176685771D01*
X207002200Y-176685771D01*
X207145057Y-176757200D01*
X208502200Y-177685771D02*
X208502200Y-176900057D01*
X208430771Y-176757200D01*
X208287914Y-176685771D01*
X208002200Y-176685771D01*
X207859343Y-176757200D01*
X208502200Y-177614343D02*
X208359343Y-177685771D01*
X208002200Y-177685771D01*
X207859343Y-177614343D01*
X207787914Y-177471486D01*
X207787914Y-177328629D01*
X207859343Y-177185771D01*
X208002200Y-177114343D01*
X208359343Y-177114343D01*
X208502200Y-177042914D01*
X209216486Y-177685771D02*
X209216486Y-176685771D01*
X209216486Y-176971486D02*
X209287914Y-176828629D01*
X209359343Y-176757200D01*
X209502200Y-176685771D01*
X209645057Y-176685771D01*
X210145057Y-176685771D02*
X210145057Y-177971486D01*
X210073628Y-178114343D01*
X209930771Y-178185771D01*
X209859343Y-178185771D01*
X210145057Y-176185771D02*
X210073628Y-176257200D01*
X210145057Y-176328629D01*
X210216485Y-176257200D01*
X210145057Y-176185771D01*
X210145057Y-176328629D01*
X211073629Y-177685771D02*
X210930771Y-177614343D01*
X210859343Y-177542914D01*
X210787914Y-177400057D01*
X210787914Y-176971486D01*
X210859343Y-176828629D01*
X210930771Y-176757200D01*
X211073629Y-176685771D01*
X211287914Y-176685771D01*
X211430771Y-176757200D01*
X211502200Y-176828629D01*
X211573629Y-176971486D01*
X211573629Y-177400057D01*
X211502200Y-177542914D01*
X211430771Y-177614343D01*
X211287914Y-177685771D01*
X211073629Y-177685771D01*
X212145057Y-177614343D02*
X212287914Y-177685771D01*
X212573629Y-177685771D01*
X212716486Y-177614343D01*
X212787914Y-177471486D01*
X212787914Y-177400057D01*
X212716486Y-177257200D01*
X212573629Y-177185771D01*
X212359343Y-177185771D01*
X212216486Y-177114343D01*
X212145057Y-176971486D01*
X212145057Y-176900057D01*
X212216486Y-176757200D01*
X212359343Y-176685771D01*
X212573629Y-176685771D01*
X212716486Y-176757200D01*
X213430772Y-177685771D02*
X213430772Y-176185771D01*
X214073629Y-177685771D02*
X214073629Y-176900057D01*
X214002200Y-176757200D01*
X213859343Y-176685771D01*
X213645058Y-176685771D01*
X213502200Y-176757200D01*
X213430772Y-176828629D01*
X214787915Y-177685771D02*
X214787915Y-176685771D01*
X214787915Y-176185771D02*
X214716486Y-176257200D01*
X214787915Y-176328629D01*
X214859343Y-176257200D01*
X214787915Y-176185771D01*
X214787915Y-176328629D01*
D10*
D11*
X178287914Y-174257200D02*
X179002200Y-174257200D01*
X178145057Y-174685771D02*
X178645057Y-173185771D01*
X179145057Y-174685771D01*
X180359343Y-174685771D02*
X179645057Y-174685771D01*
X179645057Y-173185771D01*
X181573629Y-174685771D02*
X180859343Y-174685771D01*
X180859343Y-173185771D01*
X183145057Y-174257200D02*
X183859343Y-174257200D01*
X183002200Y-174685771D02*
X183502200Y-173185771D01*
X184002200Y-174685771D01*
X185359343Y-174685771D02*
X184859343Y-173971486D01*
X184502200Y-174685771D02*
X184502200Y-173185771D01*
X185073628Y-173185771D01*
X185216486Y-173257200D01*
X185287914Y-173328629D01*
X185359343Y-173471486D01*
X185359343Y-173685771D01*
X185287914Y-173828629D01*
X185216486Y-173900057D01*
X185073628Y-173971486D01*
X184502200Y-173971486D01*
X185787914Y-173185771D02*
X186645057Y-173185771D01*
X186216486Y-174685771D02*
X186216486Y-173185771D01*
X187002200Y-173185771D02*
X187359343Y-174685771D01*
X187645057Y-173614343D01*
X187930771Y-174685771D01*
X188287914Y-173185771D01*
X189145057Y-173185771D02*
X189430771Y-173185771D01*
X189573629Y-173257200D01*
X189716486Y-173400057D01*
X189787914Y-173685771D01*
X189787914Y-174185771D01*
X189716486Y-174471486D01*
X189573629Y-174614343D01*
X189430771Y-174685771D01*
X189145057Y-174685771D01*
X189002200Y-174614343D01*
X188859343Y-174471486D01*
X188787914Y-174185771D01*
X188787914Y-173685771D01*
X188859343Y-173400057D01*
X189002200Y-173257200D01*
X189145057Y-173185771D01*
X191287915Y-174685771D02*
X190787915Y-173971486D01*
X190430772Y-174685771D02*
X190430772Y-173185771D01*
X191002200Y-173185771D01*
X191145058Y-173257200D01*
X191216486Y-173328629D01*
X191287915Y-173471486D01*
X191287915Y-173685771D01*
X191216486Y-173828629D01*
X191145058Y-173900057D01*
X191002200Y-173971486D01*
X190430772Y-173971486D01*
X191930772Y-174685771D02*
X191930772Y-173185771D01*
X192787915Y-174685771D02*
X192145058Y-173828629D01*
X192787915Y-173185771D02*
X191930772Y-174042914D01*
X194359343Y-173185771D02*
X194859343Y-174685771D01*
X195359343Y-173185771D01*
X195859343Y-174685771D02*
X195859343Y-173185771D01*
X196573629Y-173900057D02*
X197073629Y-173900057D01*
X197287915Y-174685771D02*
X196573629Y-174685771D01*
X196573629Y-173185771D01*
X197287915Y-173185771D01*
X197787915Y-173185771D02*
X198145058Y-174685771D01*
X198430772Y-173614343D01*
X198716486Y-174685771D01*
X199073629Y-173185771D01*
X199645058Y-173900057D02*
X200145058Y-173900057D01*
X200359344Y-174685771D02*
X199645058Y-174685771D01*
X199645058Y-173185771D01*
X200359344Y-173185771D01*
X201002201Y-174685771D02*
X201002201Y-173185771D01*
X201359344Y-173185771D01*
X201573629Y-173257200D01*
X201716487Y-173400057D01*
X201787915Y-173542914D01*
X201859344Y-173828629D01*
X201859344Y-174042914D01*
X201787915Y-174328629D01*
X201716487Y-174471486D01*
X201573629Y-174614343D01*
X201359344Y-174685771D01*
X201002201Y-174685771D01*
X204145058Y-173900057D02*
X203645058Y-173900057D01*
X203645058Y-174685771D02*
X203645058Y-173185771D01*
X204359344Y-173185771D01*
X205787915Y-174685771D02*
X205287915Y-173971486D01*
X204930772Y-174685771D02*
X204930772Y-173185771D01*
X205502200Y-173185771D01*
X205645058Y-173257200D01*
X205716486Y-173328629D01*
X205787915Y-173471486D01*
X205787915Y-173685771D01*
X205716486Y-173828629D01*
X205645058Y-173900057D01*
X205502200Y-173971486D01*
X204930772Y-173971486D01*
X206716486Y-173185771D02*
X207002200Y-173185771D01*
X207145058Y-173257200D01*
X207287915Y-173400057D01*
X207359343Y-173685771D01*
X207359343Y-174185771D01*
X207287915Y-174471486D01*
X207145058Y-174614343D01*
X207002200Y-174685771D01*
X206716486Y-174685771D01*
X206573629Y-174614343D01*
X206430772Y-174471486D01*
X206359343Y-174185771D01*
X206359343Y-173685771D01*
X206430772Y-173400057D01*
X206573629Y-173257200D01*
X206716486Y-173185771D01*
X208002201Y-174685771D02*
X208002201Y-173185771D01*
X208502201Y-174257200D01*
X209002201Y-173185771D01*
X209002201Y-174685771D01*
X210645058Y-173185771D02*
X211502201Y-173185771D01*
X211073630Y-174685771D02*
X211073630Y-173185771D01*
X212287915Y-173185771D02*
X212573629Y-173185771D01*
X212716487Y-173257200D01*
X212859344Y-173400057D01*
X212930772Y-173685771D01*
X212930772Y-174185771D01*
X212859344Y-174471486D01*
X212716487Y-174614343D01*
X212573629Y-174685771D01*
X212287915Y-174685771D01*
X212145058Y-174614343D01*
X212002201Y-174471486D01*
X211930772Y-174185771D01*
X211930772Y-173685771D01*
X212002201Y-173400057D01*
X212145058Y-173257200D01*
X212287915Y-173185771D01*
X213573630Y-174685771D02*
X213573630Y-173185771D01*
X214145058Y-173185771D01*
X214287916Y-173257200D01*
X214359344Y-173328629D01*
X214430773Y-173471486D01*
X214430773Y-173685771D01*
X214359344Y-173828629D01*
X214287916Y-173900057D01*
X214145058Y-173971486D01*
X213573630Y-173971486D01*
X216145058Y-174614343D02*
X216359344Y-174685771D01*
X216716487Y-174685771D01*
X216859344Y-174614343D01*
X216930773Y-174542914D01*
X217002201Y-174400057D01*
X217002201Y-174257200D01*
X216930773Y-174114343D01*
X216859344Y-174042914D01*
X216716487Y-173971486D01*
X216430773Y-173900057D01*
X216287915Y-173828629D01*
X216216487Y-173757200D01*
X216145058Y-173614343D01*
X216145058Y-173471486D01*
X216216487Y-173328629D01*
X216287915Y-173257200D01*
X216430773Y-173185771D01*
X216787915Y-173185771D01*
X217002201Y-173257200D01*
X217645058Y-174685771D02*
X217645058Y-173185771D01*
X218359344Y-174685771D02*
X218359344Y-173185771D01*
X218716487Y-173185771D01*
X218930772Y-173257200D01*
X219073630Y-173400057D01*
X219145058Y-173542914D01*
X219216487Y-173828629D01*
X219216487Y-174042914D01*
X219145058Y-174328629D01*
X219073630Y-174471486D01*
X218930772Y-174614343D01*
X218716487Y-174685771D01*
X218359344Y-174685771D01*
X219859344Y-173900057D02*
X220359344Y-173900057D01*
X220573630Y-174685771D02*
X219859344Y-174685771D01*
X219859344Y-173185771D01*
X220573630Y-173185771D01*
D10*
D11*
X197002200Y-191507200D02*
X197002200Y-194507200D01*
D10*
D11*
X261002200Y-191507200D02*
X261002200Y-198007200D01*
D14*
X151482000Y-88408000D02*
X155982000Y-88408000D01*
X151482000Y-88408000D02*
X151482000Y-90158000D01*
X155982000Y-90158000D02*
X155982000Y-88408000D01*
X155982000Y-90158000D02*
X151482000Y-90158000D01*
X122695300Y-84529200D02*
X118195300Y-84529200D01*
X122695300Y-84529200D02*
X122695300Y-82779200D01*
X118195300Y-82779200D02*
X118195300Y-84529200D01*
X118195300Y-82779200D02*
X122695300Y-82779200D01*
X125616000Y-116200000D02*
X130116000Y-116200000D01*
X125616000Y-116200000D02*
X125616000Y-117950000D01*
X130116000Y-117950000D02*
X130116000Y-116200000D01*
X130116000Y-117950000D02*
X125616000Y-117950000D01*
X138570000Y-125979000D02*
X143070000Y-125979000D01*
X138570000Y-125979000D02*
X138570000Y-127729000D01*
X143070000Y-127729000D02*
X143070000Y-125979000D01*
X143070000Y-127729000D02*
X138570000Y-127729000D01*
X162609500Y-96089000D02*
X162609500Y-91589000D01*
X162609500Y-96089000D02*
X164359500Y-96089000D01*
X164359500Y-91589000D02*
X162609500Y-91589000D01*
X164359500Y-91589000D02*
X164359500Y-96089000D01*
X133971000Y-124410000D02*
X133971000Y-119910000D01*
X133971000Y-124410000D02*
X135721000Y-124410000D01*
X135721000Y-119910000D02*
X133971000Y-119910000D01*
X135721000Y-119910000D02*
X135721000Y-124410000D01*
X136110000Y-127812000D02*
X136110000Y-123112000D01*
X136110000Y-127812000D02*
X137910000Y-127812000D01*
X137910000Y-123112000D02*
X136110000Y-123112000D01*
X137910000Y-123112000D02*
X137910000Y-127812000D01*
X112636000Y-129674000D02*
G75*
G03X112636000Y-129674000I-3100000J0D01*
G01*
X166484000Y-129547000D02*
G75*
G03X166484000Y-129547000I-3100000J0D01*
G01*
X166484000Y-80906000D02*
G75*
G03X166484000Y-80906000I-3100000J0D01*
G01*
X112636000Y-80779000D02*
G75*
G03X112636000Y-80779000I-3100000J0D01*
G01*
X156136000Y-99738000D02*
X156136000Y-104238000D01*
X156136000Y-99738000D02*
X154386000Y-99738000D01*
X154386000Y-104238000D02*
X156136000Y-104238000D01*
X154386000Y-104238000D02*
X154386000Y-99738000D01*
X157680000Y-92145000D02*
X157680000Y-96845000D01*
X157680000Y-92145000D02*
X155880000Y-92145000D01*
X155880000Y-96845000D02*
X157680000Y-96845000D01*
X155880000Y-96845000D02*
X155880000Y-92145000D01*
X159817000Y-96845000D02*
X159817000Y-92145000D01*
X159817000Y-96845000D02*
X161617000Y-96845000D01*
X161617000Y-92145000D02*
X159817000Y-92145000D01*
X161617000Y-92145000D02*
X161617000Y-96845000D01*
X159565000Y-92372000D02*
X159565000Y-96872000D01*
X159565000Y-92372000D02*
X157815000Y-92372000D01*
X157815000Y-96872000D02*
X159565000Y-96872000D01*
X157815000Y-96872000D02*
X157815000Y-92372000D01*
M02*
