PCBNEW-LibModule-V1  
# encoding utf-8
Units mm
$INDEX
SOIC127P780X200-14N
$EndINDEX
$MODULE SOIC127P780X200-14N
Po 0 0 0 15 00000000 00000000 ~~
Li SOIC127P780X200-14N
Cd 
Sc 00000000
At SMD
Op 0 0 0
.SolderMask 0
.SolderPaste 0
T0 22.7019 -215.572 52.3314 52.3314 0 0.05 N V 21 "SOIC127P780X200-14N"
T1 55.3368 207.706 51.7737 51.7737 0 0.05 N V 21 "VAL**"
DS -2.794 -3.556 -2.794 -4.064 0 24
DS -2.794 -4.064 -4.0894 -4.064 0 24
DS -4.0894 -4.064 -4.0894 -3.556 0 24
DS -4.0894 -3.556 -2.794 -3.556 0 24
DS -2.794 -2.286 -2.794 -2.794 0 24
DS -2.794 -2.794 -4.0894 -2.794 0 24
DS -4.0894 -2.794 -4.0894 -2.286 0 24
DS -4.0894 -2.286 -2.794 -2.286 0 24
DS -2.794 -1.016 -2.794 -1.524 0 24
DS -2.794 -1.524 -4.0894 -1.524 0 24
DS -4.0894 -1.524 -4.0894 -1.016 0 24
DS -4.0894 -1.016 -2.794 -1.016 0 24
DS -2.794 0.254 -2.794 -0.254 0 24
DS -2.794 -0.254 -4.0894 -0.254 0 24
DS -4.0894 -0.254 -4.0894 0.254 0 24
DS -4.0894 0.254 -2.794 0.254 0 24
DS -2.794 1.524 -2.794 1.016 0 24
DS -2.794 1.016 -4.0894 1.016 0 24
DS -4.0894 1.016 -4.0894 1.524 0 24
DS -4.0894 1.524 -2.794 1.524 0 24
DS -2.794 2.794 -2.794 2.286 0 24
DS -2.794 2.286 -4.0894 2.286 0 24
DS -4.0894 2.286 -4.0894 2.794 0 24
DS -4.0894 2.794 -2.794 2.794 0 24
DS -2.794 4.064 -2.794 3.556 0 24
DS -2.794 3.556 -4.0894 3.556 0 24
DS -4.0894 3.556 -4.0894 4.064 0 24
DS -4.0894 4.064 -2.794 4.064 0 24
DS 2.794 3.556 2.794 4.064 0 24
DS 2.794 4.064 4.0894 4.064 0 24
DS 4.0894 4.064 4.0894 3.556 0 24
DS 4.0894 3.556 2.794 3.556 0 24
DS 2.794 2.286 2.794 2.794 0 24
DS 2.794 2.794 4.0894 2.794 0 24
DS 4.0894 2.794 4.0894 2.286 0 24
DS 4.0894 2.286 2.794 2.286 0 24
DS 2.794 1.016 2.794 1.524 0 24
DS 2.794 1.524 4.0894 1.524 0 24
DS 4.0894 1.524 4.0894 1.016 0 24
DS 4.0894 1.016 2.794 1.016 0 24
DS 2.794 -0.254 2.794 0.254 0 24
DS 2.794 0.254 4.0894 0.254 0 24
DS 4.0894 0.254 4.0894 -0.254 0 24
DS 4.0894 -0.254 2.794 -0.254 0 24
DS 2.794 -1.524 2.794 -1.016 0 24
DS 2.794 -1.016 4.0894 -1.016 0 24
DS 4.0894 -1.016 4.0894 -1.524 0 24
DS 4.0894 -1.524 2.794 -1.524 0 24
DS 2.794 -2.794 2.794 -2.286 0 24
DS 2.794 -2.286 4.0894 -2.286 0 24
DS 4.0894 -2.286 4.0894 -2.794 0 24
DS 4.0894 -2.794 2.794 -2.794 0 24
DS 2.794 -4.064 2.794 -3.556 0 24
DS 2.794 -3.556 4.0894 -3.556 0 24
DS 4.0894 -3.556 4.0894 -4.064 0 24
DS 4.0894 -4.064 2.794 -4.064 0 24
DS -2.794 5.2578 2.794 5.2578 0 24
DS 2.794 5.2578 2.794 -5.2578 0 24
DS 2.794 -5.2578 0.3048 -5.2578 0 24
DS 0.3048 -5.2578 -0.3048 -5.2578 0 24
DS -0.3048 -5.2578 -2.794 -5.2578 0 24
DS -2.794 -5.2578 -2.794 5.2578 0 24
DA 0 -5.2578 -0.3048 -5.2578 -1800 0 24
DS 2.794 -4.4196 2.794 -5.2578 0.1524 21
DS -2.794 4.4196 -2.794 5.2578 0.1524 21
DS -2.794 5.2578 2.794 5.2578 0.1524 21
DS 2.794 5.2578 2.794 4.4196 0.1524 21
DS 2.794 -5.2578 0.3048 -5.2578 0.1524 21
DS 0.3048 -5.2578 -0.3048 -5.2578 0.1524 21
DS -0.3048 -5.2578 -2.794 -5.2578 0.1524 21
DS -2.794 -5.2578 -2.794 -4.4196 0.1524 21
DA 0 -5.2578 -0.3048 -5.2578 -1800 0.1524 21
$PAD
Sh "1" R 1.7526 0.5588 0 0 0
At SMD N 00888000
.SolderMask 0
.SolderPaste 0
Ne 0 ""
Po -3.5814 -3.81
$EndPAD
$PAD
Sh "2" R 1.7526 0.5588 0 0 0
At SMD N 00888000
.SolderMask 0
.SolderPaste 0
Ne 0 ""
Po -3.5814 -2.54
$EndPAD
$PAD
Sh "3" R 1.7526 0.5588 0 0 0
At SMD N 00888000
.SolderMask 0
.SolderPaste 0
Ne 0 ""
Po -3.5814 -1.27
$EndPAD
$PAD
Sh "4" R 1.7526 0.5588 0 0 0
At SMD N 00888000
.SolderMask 0
.SolderPaste 0
Ne 0 ""
Po -3.5814 0
$EndPAD
$PAD
Sh "5" R 1.7526 0.5588 0 0 0
At SMD N 00888000
.SolderMask 0
.SolderPaste 0
Ne 0 ""
Po -3.5814 1.27
$EndPAD
$PAD
Sh "6" R 1.7526 0.5588 0 0 0
At SMD N 00888000
.SolderMask 0
.SolderPaste 0
Ne 0 ""
Po -3.5814 2.54
$EndPAD
$PAD
Sh "7" R 1.7526 0.5588 0 0 0
At SMD N 00888000
.SolderMask 0
.SolderPaste 0
Ne 0 ""
Po -3.5814 3.81
$EndPAD
$PAD
Sh "8" R 1.7526 0.5588 0 0 0
At SMD N 00888000
.SolderMask 0
.SolderPaste 0
Ne 0 ""
Po 3.5814 3.81
$EndPAD
$PAD
Sh "9" R 1.7526 0.5588 0 0 0
At SMD N 00888000
.SolderMask 0
.SolderPaste 0
Ne 0 ""
Po 3.5814 2.54
$EndPAD
$PAD
Sh "10" R 1.7526 0.5588 0 0 0
At SMD N 00888000
.SolderMask 0
.SolderPaste 0
Ne 0 ""
Po 3.5814 1.27
$EndPAD
$PAD
Sh "11" R 1.7526 0.5588 0 0 0
At SMD N 00888000
.SolderMask 0
.SolderPaste 0
Ne 0 ""
Po 3.5814 0
$EndPAD
$PAD
Sh "12" R 1.7526 0.5588 0 0 0
At SMD N 00888000
.SolderMask 0
.SolderPaste 0
Ne 0 ""
Po 3.5814 -1.27
$EndPAD
$PAD
Sh "13" R 1.7526 0.5588 0 0 0
At SMD N 00888000
.SolderMask 0
.SolderPaste 0
Ne 0 ""
Po 3.5814 -2.54
$EndPAD
$PAD
Sh "14" R 1.7526 0.5588 0 0 0
At SMD N 00888000
.SolderMask 0
.SolderPaste 0
Ne 0 ""
Po 3.5814 -3.81
$EndPAD
$EndMODULE SOIC127P780X200-14N
