(module Connectors_JST:JST_EH_B14B-EH-A_14x2.50mm_Straight (layer F.Cu) (tedit 58A3B0B5)
  (descr "JST EH series connector, B14B-EH-A, 2.50mm pitch, top entry")
  (tags "connector jst eh top vertical straight")
  (fp_text reference J7 (at 16.25 -3) (layer F.SilkS)
    (effects (font (size 1 1) (thickness 0.15)))
  )
  (fp_text value Conn_01x14_Male (at 16.25 3.5) (layer F.Fab)
    (effects (font (size 1 1) (thickness 0.15)))
  )
  (fp_text user %R (at 16.25 -3) (layer F.Fab)
    (effects (font (size 1 1) (thickness 0.15)))
  )
  (fp_line (start -2.5 -1.6) (end -2.5 2.2) (layer F.Fab) (width 0.1))
  (fp_line (start -2.5 2.2) (end 35 2.2) (layer F.Fab) (width 0.1))
  (fp_line (start 35 2.2) (end 35 -1.6) (layer F.Fab) (width 0.1))
  (fp_line (start 35 -1.6) (end -2.5 -1.6) (layer F.Fab) (width 0.1))
  (fp_line (start -2.65 -1.75) (end -2.65 2.35) (layer F.SilkS) (width 0.12))
  (fp_line (start -2.65 2.35) (end 35.15 2.35) (layer F.SilkS) (width 0.12))
  (fp_line (start 35.15 2.35) (end 35.15 -1.75) (layer F.SilkS) (width 0.12))
  (fp_line (start 35.15 -1.75) (end -2.65 -1.75) (layer F.SilkS) (width 0.12))
  (fp_line (start -2.65 0) (end -2.15 0) (layer F.SilkS) (width 0.12))
  (fp_line (start -2.15 0) (end -2.15 -1.25) (layer F.SilkS) (width 0.12))
  (fp_line (start -2.15 -1.25) (end 34.65 -1.25) (layer F.SilkS) (width 0.12))
  (fp_line (start 34.65 -1.25) (end 34.65 0) (layer F.SilkS) (width 0.12))
  (fp_line (start 34.65 0) (end 35.15 0) (layer F.SilkS) (width 0.12))
  (fp_line (start -2.65 0.85) (end -1.65 0.85) (layer F.SilkS) (width 0.12))
  (fp_line (start -1.65 0.85) (end -1.65 2.35) (layer F.SilkS) (width 0.12))
  (fp_line (start 35.15 0.85) (end 34.15 0.85) (layer F.SilkS) (width 0.12))
  (fp_line (start 34.15 0.85) (end 34.15 2.35) (layer F.SilkS) (width 0.12))
  (fp_line (start -2.95 0.15) (end -2.95 2.65) (layer F.SilkS) (width 0.12))
  (fp_line (start -2.95 2.65) (end -0.45 2.65) (layer F.SilkS) (width 0.12))
  (fp_line (start -2.95 0.15) (end -2.95 2.65) (layer F.Fab) (width 0.1))
  (fp_line (start -2.95 2.65) (end -0.45 2.65) (layer F.Fab) (width 0.1))
  (fp_line (start -3.15 -2.25) (end -3.15 2.85) (layer F.CrtYd) (width 0.05))
  (fp_line (start -3.15 2.85) (end 35.65 2.85) (layer F.CrtYd) (width 0.05))
  (fp_line (start 35.65 2.85) (end 35.65 -2.25) (layer F.CrtYd) (width 0.05))
  (fp_line (start 35.65 -2.25) (end -3.15 -2.25) (layer F.CrtYd) (width 0.05))
  (pad 1 thru_hole rect (at 0 0) (size 1.85 1.85) (drill 0.9) (layers *.Cu *.Mask))
  (pad 2 thru_hole circle (at 2.5 0) (size 1.85 1.85) (drill 0.9) (layers *.Cu *.Mask))
  (pad 3 thru_hole circle (at 5 0) (size 1.85 1.85) (drill 0.9) (layers *.Cu *.Mask))
  (pad 4 thru_hole circle (at 7.5 0) (size 1.85 1.85) (drill 0.9) (layers *.Cu *.Mask))
  (pad 5 thru_hole circle (at 10 0) (size 1.85 1.85) (drill 0.9) (layers *.Cu *.Mask))
  (pad 6 thru_hole circle (at 12.5 0) (size 1.85 1.85) (drill 0.9) (layers *.Cu *.Mask))
  (pad 7 thru_hole circle (at 15 0) (size 1.85 1.85) (drill 0.9) (layers *.Cu *.Mask))
  (pad 8 thru_hole circle (at 17.5 0) (size 1.85 1.85) (drill 0.9) (layers *.Cu *.Mask))
  (pad 9 thru_hole circle (at 20 0) (size 1.85 1.85) (drill 0.9) (layers *.Cu *.Mask))
  (pad 10 thru_hole circle (at 22.5 0) (size 1.85 1.85) (drill 0.9) (layers *.Cu *.Mask))
  (pad 11 thru_hole circle (at 25 0) (size 1.85 1.85) (drill 0.9) (layers *.Cu *.Mask))
  (pad 12 thru_hole circle (at 27.5 0) (size 1.85 1.85) (drill 0.9) (layers *.Cu *.Mask))
  (pad 13 thru_hole circle (at 30 0) (size 1.85 1.85) (drill 0.9) (layers *.Cu *.Mask))
  (pad 14 thru_hole circle (at 32.5 0) (size 1.85 1.85) (drill 0.9) (layers *.Cu *.Mask))
  (model Connectors_JST.3dshapes/JST_EH_B14B-EH-A_14x2.50mm_Straight.wrl
    (at (xyz 0 0 0))
    (scale (xyz 1 1 1))
    (rotate (xyz 0 0 0))
  )
)
