EESchema Schematic File Version 2
LIBS:power
LIBS:device
LIBS:switches
LIBS:relays
LIBS:motors
LIBS:transistors
LIBS:conn
LIBS:linear
LIBS:regul
LIBS:74xx
LIBS:cmos4000
LIBS:adc-dac
LIBS:memory
LIBS:xilinx
LIBS:microcontrollers
LIBS:dsp
LIBS:microchip
LIBS:analog_switches
LIBS:motorola
LIBS:texas
LIBS:intel
LIBS:audio
LIBS:interface
LIBS:digital-audio
LIBS:philips
LIBS:display
LIBS:cypress
LIBS:siliconi
LIBS:opto
LIBS:atmel
LIBS:contrib
LIBS:valves
LIBS:Sensor_2v-cache
EELAYER 25 0
EELAYER END
$Descr A4 11693 8268
encoding utf-8
Sheet 1 1
Title "Capacitive Soil Moisture Sensor"
Date "2018-06-06"
Rev "v2.0"
Comp "Soil Agritech Pvt. Ltd."
Comment1 "Designed by Swaroop Sadarjoshi"
Comment2 ""
Comment3 ""
Comment4 ""
$EndDescr
$Comp
L NE555 U1
U 1 1 5B1809B2
P 5900 3600
F 0 "U1" H 5500 3950 50  0000 L CNN
F 1 "NE555" H 6000 3950 50  0000 L CNN
F 2 "NE555:DIP8_300" H 5900 3600 50  0001 C CNN
F 3 "" H 5900 3600 50  0001 C CNN
	1    5900 3600
	1    0    0    -1  
$EndComp
$Comp
L +5V #PWR01
U 1 1 5B180A4E
P 5100 5750
F 0 "#PWR01" H 5100 5600 50  0001 C CNN
F 1 "+5V" H 5100 5890 50  0000 C CNN
F 2 "" H 5100 5750 50  0001 C CNN
F 3 "" H 5100 5750 50  0001 C CNN
	1    5100 5750
	-1   0    0    1   
$EndComp
$Comp
L GND #PWR02
U 1 1 5B180A64
P 5550 5750
F 0 "#PWR02" H 5550 5500 50  0001 C CNN
F 1 "GND" H 5550 5600 50  0000 C CNN
F 2 "" H 5550 5750 50  0001 C CNN
F 3 "" H 5550 5750 50  0001 C CNN
	1    5550 5750
	1    0    0    -1  
$EndComp
$Comp
L PWR_FLAG #FLG03
U 1 1 5B180A7A
P 5550 5500
F 0 "#FLG03" H 5550 5575 50  0001 C CNN
F 1 "PWR_FLAG" H 5550 5650 50  0000 C CNN
F 2 "" H 5550 5500 50  0001 C CNN
F 3 "" H 5550 5500 50  0001 C CNN
	1    5550 5500
	1    0    0    -1  
$EndComp
$Comp
L PWR_FLAG #FLG04
U 1 1 5B180A9A
P 5100 5500
F 0 "#FLG04" H 5100 5575 50  0001 C CNN
F 1 "PWR_FLAG" H 5100 5650 50  0000 C CNN
F 2 "" H 5100 5500 50  0001 C CNN
F 3 "" H 5100 5500 50  0001 C CNN
	1    5100 5500
	1    0    0    -1  
$EndComp
$Comp
L GND #PWR05
U 1 1 5B180B1E
P 5900 4200
F 0 "#PWR05" H 5900 3950 50  0001 C CNN
F 1 "GND" H 5900 4050 50  0000 C CNN
F 2 "" H 5900 4200 50  0001 C CNN
F 3 "" H 5900 4200 50  0001 C CNN
	1    5900 4200
	1    0    0    -1  
$EndComp
$Comp
L +5V #PWR06
U 1 1 5B180B39
P 5900 2800
F 0 "#PWR06" H 5900 2650 50  0001 C CNN
F 1 "+5V" H 5900 2940 50  0000 C CNN
F 2 "" H 5900 2800 50  0001 C CNN
F 3 "" H 5900 2800 50  0001 C CNN
	1    5900 2800
	1    0    0    -1  
$EndComp
$Comp
L +5V #PWR07
U 1 1 5B180B63
P 4700 3750
F 0 "#PWR07" H 4700 3600 50  0001 C CNN
F 1 "+5V" H 4700 3890 50  0000 C CNN
F 2 "" H 4700 3750 50  0001 C CNN
F 3 "" H 4700 3750 50  0001 C CNN
	1    4700 3750
	1    0    0    -1  
$EndComp
$Comp
L R R2
U 1 1 5B180B81
P 6800 3600
F 0 "R2" V 6880 3600 50  0000 C CNN
F 1 "1.6k" V 6800 3600 50  0000 C CNN
F 2 "Resistors_THT:R_Axial_DIN0204_L3.6mm_D1.6mm_P7.62mm_Horizontal" V 6730 3600 50  0001 C CNN
F 3 "" H 6800 3600 50  0001 C CNN
	1    6800 3600
	1    0    0    -1  
$EndComp
$Comp
L R R1
U 1 1 5B180BC6
P 6800 3100
F 0 "R1" H 6880 3100 50  0000 C CNN
F 1 "300" V 6800 3100 50  0000 C CNN
F 2 "Resistors_THT:R_Axial_DIN0204_L3.6mm_D1.6mm_P7.62mm_Horizontal" V 6730 3100 50  0001 C CNN
F 3 "" H 6800 3100 50  0001 C CNN
	1    6800 3100
	1    0    0    -1  
$EndComp
$Comp
L C C1
U 1 1 5B180BFC
P 6800 4000
F 0 "C1" H 6825 4100 50  0000 L CNN
F 1 "470p" H 6825 3900 50  0000 L CNN
F 2 "Capacitors_THT:CP_Radial_D5.0mm_P2.50mm" H 6838 3850 50  0001 C CNN
F 3 "" H 6800 4000 50  0001 C CNN
	1    6800 4000
	1    0    0    -1  
$EndComp
Wire Wire Line
	5100 5750 5100 5500
Wire Wire Line
	5550 5750 5550 5500
Wire Wire Line
	5900 4200 5900 4000
Wire Wire Line
	5900 3200 5900 2800
Wire Wire Line
	4700 3750 4700 3850
Wire Wire Line
	4700 3800 5400 3800
Wire Wire Line
	6800 3750 6800 3850
Wire Wire Line
	6800 3250 6800 3450
Wire Wire Line
	6400 3800 6800 3800
Connection ~ 6800 3800
Wire Wire Line
	6400 3600 6600 3600
Wire Wire Line
	6600 3600 6600 3400
Wire Wire Line
	6600 3400 6800 3400
Connection ~ 6800 3400
Wire Wire Line
	6400 3400 6500 3400
Wire Wire Line
	6500 3400 6500 3300
$Comp
L C C5
U 1 1 5B180CBC
P 5100 4000
F 0 "C5" H 5125 4100 50  0000 L CNN
F 1 "1u" H 5125 3900 50  0000 L CNN
F 2 "Capacitors_THT:CP_Radial_D5.0mm_P2.50mm" H 5138 3850 50  0001 C CNN
F 3 "" H 5100 4000 50  0001 C CNN
	1    5100 4000
	1    0    0    -1  
$EndComp
Wire Wire Line
	5100 3600 5100 3850
Wire Wire Line
	5100 3600 5400 3600
$Comp
L GND #PWR08
U 1 1 5B180D71
P 5100 4200
F 0 "#PWR08" H 5100 3950 50  0001 C CNN
F 1 "GND" H 5100 4050 50  0000 C CNN
F 2 "" H 5100 4200 50  0001 C CNN
F 3 "" H 5100 4200 50  0001 C CNN
	1    5100 4200
	1    0    0    -1  
$EndComp
Wire Wire Line
	5100 4150 5100 4200
$Comp
L GND #PWR09
U 1 1 5B180DB3
P 6800 4200
F 0 "#PWR09" H 6800 3950 50  0001 C CNN
F 1 "GND" H 6800 4050 50  0000 C CNN
F 2 "" H 6800 4200 50  0001 C CNN
F 3 "" H 6800 4200 50  0001 C CNN
	1    6800 4200
	1    0    0    -1  
$EndComp
Wire Wire Line
	6800 4200 6800 4150
Wire Wire Line
	5400 3400 5300 3400
Wire Wire Line
	5300 3400 5300 4050
Wire Wire Line
	5300 4050 6500 4050
Wire Wire Line
	6500 4050 6500 3800
Connection ~ 6500 3800
$Comp
L C C4
U 1 1 5B180EE6
P 4700 4000
F 0 "C4" H 4725 4100 50  0000 L CNN
F 1 "10u" H 4725 3900 50  0000 L CNN
F 2 "Capacitors_THT:CP_Radial_D5.0mm_P2.50mm" H 4738 3850 50  0001 C CNN
F 3 "" H 4700 4000 50  0001 C CNN
	1    4700 4000
	1    0    0    -1  
$EndComp
Connection ~ 4700 3800
$Comp
L GND #PWR010
U 1 1 5B180F46
P 4700 4200
F 0 "#PWR010" H 4700 3950 50  0001 C CNN
F 1 "GND" H 4700 4050 50  0000 C CNN
F 2 "" H 4700 4200 50  0001 C CNN
F 3 "" H 4700 4200 50  0001 C CNN
	1    4700 4200
	1    0    0    -1  
$EndComp
Wire Wire Line
	4700 4200 4700 4150
$Comp
L +5V #PWR011
U 1 1 5B1812FD
P 6800 2800
F 0 "#PWR011" H 6800 2650 50  0001 C CNN
F 1 "+5V" H 6800 2940 50  0000 C CNN
F 2 "" H 6800 2800 50  0001 C CNN
F 3 "" H 6800 2800 50  0001 C CNN
	1    6800 2800
	1    0    0    -1  
$EndComp
Wire Wire Line
	6800 2950 6800 2800
$Comp
L R R3
U 1 1 5B1814CE
P 7200 3300
F 0 "R3" V 7280 3300 50  0000 C CNN
F 1 "10k" V 7200 3300 50  0000 C CNN
F 2 "Resistors_THT:R_Axial_DIN0204_L3.6mm_D1.6mm_P7.62mm_Horizontal" V 7130 3300 50  0001 C CNN
F 3 "" H 7200 3300 50  0001 C CNN
	1    7200 3300
	0    1    1    0   
$EndComp
$Comp
L D D1
U 1 1 5B18156A
P 7700 3300
F 0 "D1" H 7700 3400 50  0000 C CNN
F 1 "D" H 7700 3200 50  0000 C CNN
F 2 "Diodes_THT:D_DO-41_SOD81_P7.62mm_Horizontal" H 7700 3300 50  0001 C CNN
F 3 "" H 7700 3300 50  0001 C CNN
	1    7700 3300
	-1   0    0    1   
$EndComp
$Comp
L R R4
U 1 1 5B1815AC
P 8050 3550
F 0 "R4" H 8130 3550 50  0000 C CNN
F 1 "1M" V 8050 3550 50  0000 C CNN
F 2 "Resistors_THT:R_Axial_DIN0204_L3.6mm_D1.6mm_P7.62mm_Horizontal" V 7980 3550 50  0001 C CNN
F 3 "" H 8050 3550 50  0001 C CNN
	1    8050 3550
	1    0    0    -1  
$EndComp
$Comp
L C C3
U 1 1 5B181604
P 8400 3550
F 0 "C3" H 8425 3650 50  0000 L CNN
F 1 "C" H 8425 3450 50  0000 L CNN
F 2 "Capacitors_THT:CP_Radial_D5.0mm_P2.50mm" H 8438 3400 50  0001 C CNN
F 3 "" H 8400 3550 50  0001 C CNN
	1    8400 3550
	1    0    0    -1  
$EndComp
$Comp
L GND #PWR012
U 1 1 5B181694
P 8050 3750
F 0 "#PWR012" H 8050 3500 50  0001 C CNN
F 1 "GND" H 8050 3600 50  0000 C CNN
F 2 "" H 8050 3750 50  0001 C CNN
F 3 "" H 8050 3750 50  0001 C CNN
	1    8050 3750
	1    0    0    -1  
$EndComp
$Comp
L GND #PWR013
U 1 1 5B1816C0
P 8400 3750
F 0 "#PWR013" H 8400 3500 50  0001 C CNN
F 1 "GND" H 8400 3600 50  0000 C CNN
F 2 "" H 8400 3750 50  0001 C CNN
F 3 "" H 8400 3750 50  0001 C CNN
	1    8400 3750
	1    0    0    -1  
$EndComp
Wire Wire Line
	8050 3750 8050 3700
Wire Wire Line
	8400 3750 8400 3700
Wire Wire Line
	8400 3300 8400 3400
Wire Wire Line
	7850 3300 8650 3300
Wire Wire Line
	7350 3300 7550 3300
Wire Wire Line
	8050 3400 8050 3300
Connection ~ 8050 3300
Wire Wire Line
	6500 3300 7050 3300
$Comp
L Screw_Terminal_01x03 J2
U 1 1 5B1819C7
P 7450 6000
F 0 "J2" H 7450 6200 50  0000 C CNN
F 1 "Screw_Terminal_01x03" H 7450 5800 50  0000 C CNN
F 2 "Connectors_JST:JST_EH_B03B-EH-A_03x2.50mm_Straight" H 7450 6000 50  0001 C CNN
F 3 "" H 7450 6000 50  0001 C CNN
	1    7450 6000
	1    0    0    -1  
$EndComp
Wire Wire Line
	6900 5900 7250 5900
Wire Wire Line
	6900 6000 7250 6000
Wire Wire Line
	7250 6100 6800 6100
Text GLabel 6800 6100 0    60   Input ~ 0
DATA
Text Notes 7400 3600 0    60   ~ 0
PCB \nProbe
Connection ~ 8400 3300
Text GLabel 8650 3300 2    60   Input ~ 0
DATA
$Comp
L +5V #PWR014
U 1 1 5B182C47
P 6900 5800
F 0 "#PWR014" H 6900 5650 50  0001 C CNN
F 1 "+5V" H 6900 5940 50  0000 C CNN
F 2 "" H 6900 5800 50  0001 C CNN
F 3 "" H 6900 5800 50  0001 C CNN
	1    6900 5800
	1    0    0    -1  
$EndComp
$Comp
L GND #PWR015
U 1 1 5B182C73
P 6900 6300
F 0 "#PWR015" H 6900 6050 50  0001 C CNN
F 1 "GND" H 6900 6150 50  0000 C CNN
F 2 "" H 6900 6300 50  0001 C CNN
F 3 "" H 6900 6300 50  0001 C CNN
	1    6900 6300
	1    0    0    -1  
$EndComp
Wire Wire Line
	6900 5900 6900 5800
Wire Wire Line
	6900 6300 6900 6000
$Comp
L C C2
U 1 1 5B183FE2
P 5100 3100
F 0 "C2" H 5125 3200 50  0000 L CNN
F 1 "10u" H 5125 3000 50  0000 L CNN
F 2 "Capacitors_THT:CP_Radial_D5.0mm_P2.50mm" H 5138 2950 50  0001 C CNN
F 3 "" H 5100 3100 50  0001 C CNN
	1    5100 3100
	1    0    0    -1  
$EndComp
Wire Wire Line
	5100 2950 5100 2850
Wire Wire Line
	5100 2850 5900 2850
Connection ~ 5900 2850
$Comp
L GND #PWR016
U 1 1 5B184092
P 5100 3350
F 0 "#PWR016" H 5100 3100 50  0001 C CNN
F 1 "GND" H 5100 3200 50  0000 C CNN
F 2 "" H 5100 3350 50  0001 C CNN
F 3 "" H 5100 3350 50  0001 C CNN
	1    5100 3350
	1    0    0    -1  
$EndComp
Wire Wire Line
	5100 3350 5100 3250
$EndSCHEMATC
