{
  "foret": {
    "nom": "Forêt",
    "argent": 0,
    "bois": 5,
    "pierre": 0,
    "nourriture": 0,
    "image":"tuile_foret.png"
  },
  "montagne": {
    "nom": "Montagne",
    "argent": 0,
    "bois": 0,
    "pierre": 5,
    "nourriture": 0,
    "image":"tuile_montagne.png"
  },
  "plaine": {
    "nom": "Plaine",
    "argent": 0,
    "bois": 0,
    "pierre": 0,
    "nourriture": 5,
    "image":"tuile_plaine.png"
  },
  "lac": {
    "nom": "Plaine",
    "argent": 0,
    "bois": 0,
    "pierre": 0,
    "nourriture": 0,
    "image":"tuile_lac.png"
  }
}