<?xml version="1.0" encoding="UTF-8"?>
<svg width="30px" height="30px" viewBox="0 0 30 30" version="1.1" xmlns="http://www.w3.org/2000/svg" xmlns:xlink="http://www.w3.org/1999/xlink">
    <!-- Generator: Sketch 47.1 (45422) - http://www.bohemiancoding.com/sketch -->
    <title>Right Arrow Fill</title>
    <desc>Created with Sketch.</desc>
    <defs></defs>
    <g id="Mobile" stroke="none" stroke-width="1" fill="none" fill-rule="evenodd">
        <g id="Right-Arrow-Fill" fill="#97CCCA">
            <polygon id="Triangle" transform="translate(15.500000, 15.500000) rotate(90.000000) translate(-15.500000, -15.500000) " points="15.5 8 23 23 8 23"></polygon>
        </g>
    </g>
</svg>