<?xml version="1.0" encoding="UTF-8"?>
<svg width="47px" height="34px" viewBox="0 0 47 34" version="1.1" xmlns="http://www.w3.org/2000/svg" xmlns:xlink="http://www.w3.org/1999/xlink">
    <!-- Generator: Sketch 47.1 (45422) - http://www.bohemiancoding.com/sketch -->
    <title>Mobile Nav</title>
    <desc>Created with Sketch.</desc>
    <defs></defs>
    <g id="Mobile" stroke="none" stroke-width="1" fill="none" fill-rule="evenodd" stroke-linecap="round">
        <g id="Mobile-Nav" stroke-width="1.5" stroke="#333333">
            <g id="Group-8" transform="translate(1.000000, 1.000000)">
                <g id="Group-2">
                    <path d="M44.6477273,16.75 L14.1481507,16.75" id="Line"></path>
                    <path d="M44.6477273,1 L25.9732063,1" id="Line-Copy-2"></path>
                    <path d="M44.6481481,30.8333333 L0.998727214,30.8333333" id="Line-Copy"></path>
                </g>
            </g>
        </g>
    </g>
</svg>