<?xml version="1.0" encoding="UTF-8"?>
<svg width="30px" height="30px" viewBox="0 0 30 30" version="1.1" xmlns="http://www.w3.org/2000/svg" xmlns:xlink="http://www.w3.org/1999/xlink">
    <!-- Generator: Sketch 47.1 (45422) - http://www.bohemiancoding.com/sketch -->
    <title>Accordian Open</title>
    <desc>Created with Sketch.</desc>
    <defs></defs>
    <g id="Mobile" stroke="none" stroke-width="1" fill="none" fill-rule="evenodd">
        <g id="Accordian-Open" fill="#333333">
            <path d="M14.29,21.498 C14.29,21.736 14.494,21.94 14.732,21.94 L15.276,21.94 C15.514,21.94 15.718,21.736 15.718,21.498 L15.718,15.684 L21.532,15.684 C21.77,15.684 21.974,15.48 21.974,15.242 L21.974,14.732 C21.974,14.494 21.77,14.29 21.532,14.29 L15.718,14.29 L15.718,8.408 C15.718,8.17 15.514,8 15.276,8 L14.732,8 C14.494,8 14.29,8.17 14.29,8.408 L14.29,14.29 L8.442,14.29 C8.204,14.29 8,14.494 8,14.732 L8,15.242 C8,15.48 8.204,15.684 8.442,15.684 L14.29,15.684 L14.29,21.498 Z" id="+-copy-7"></path>
        </g>
    </g>
</svg>