019F0502C07FDD727777ED18DEEC3B33.cache.js
user.agent safari

3731F3BA9409B9DE6B138BEA4D9BA2E6.cache.js
user.agent ie10

47B20CF2D42983D0493E6F4B04E0948E.cache.js
user.agent gecko1_8

AD2E99A073E0A026C7735A0E8FAA1B16.cache.js
user.agent ie8

B555366C5B58111E8A9EDDECB82758BF.cache.js
user.agent ie9

Devmode:devmode.js