# Blender v2.78 (sub 0) OBJ File: ''
# www.blender.org
mtllib wall.mtl
o Cube.001
v -1.000000 0.000000 1.000000
v -0.900000 2.000000 0.900000
v -1.000000 0.000000 -1.000000
v -0.900000 2.000000 -0.900000
v 1.000000 0.000000 1.000000
v 0.900000 2.000000 0.900000
v 1.000000 0.000000 -1.000000
v 0.900000 2.000000 -0.900000
vn -0.9988 0.0499 0.0000
vn 0.0000 0.0499 -0.9988
vn 0.9988 0.0499 0.0000
vn 0.0000 0.0499 0.9988
vn 0.0000 -1.0000 0.0000
vn 0.0000 1.0000 0.0000
usemtl None
s off
f 1//1 2//1 4//1 3//1
f 3//2 4//2 8//2 7//2
f 7//3 8//3 6//3 5//3
f 5//4 6//4 2//4 1//4
f 3//5 7//5 5//5 1//5
f 8//6 4//6 2//6 6//6
