# Blender v2.78 (sub 0) OBJ File: 'player.blend'
# www.blender.org
mtllib delta2.mtl
o Cube
v 0.256262 0.062659 -0.159878
v 0.005229 0.375956 0.128996
v -0.041049 0.346906 0.217185
v 0.004395 0.062659 0.786218
v 0.005229 0.062659 -0.064594
v 0.147435 0.219307 -0.040629
v 0.005229 0.219307 0.457607
v 0.147435 0.062659 0.287982
v 0.076435 0.297631 0.044184
v 0.005229 0.140983 0.621912
v 0.076435 0.062659 0.537100
v 0.188989 0.140983 -0.075066
v 0.005229 0.297631 0.293302
v 0.218434 0.062659 0.038865
v 0.147435 0.140983 0.123677
v 0.076435 0.219307 0.208489
v 0.076435 0.140983 0.372795
v 0.445223 0.062659 0.038865
v 0.374224 0.062659 0.188871
v 0.374224 0.140983 0.053976
v 0.374224 0.219307 -0.040629
v 0.303225 0.219307 0.109378
v 0.303225 0.140983 0.273684
v 0.782522 0.111267 -0.612355
v 0.076435 0.219307 0.208489
v 0.099789 0.339728 0.016540
v 0.092231 0.261404 0.169644
v 0.039031 0.339728 0.250962
v 0.114125 0.360144 -0.003602
v 0.109490 0.299871 0.143934
v 0.051507 0.346906 0.217185
v 0.137696 0.388807 -0.066393
v -0.099032 0.299871 0.143934
v -0.103668 0.360144 -0.003602
v -0.028574 0.339728 0.250962
v -0.081774 0.261404 0.169644
v -0.089332 0.339728 0.016540
v -0.065978 0.219307 0.208489
v -0.065978 0.297631 0.044184
v -0.772065 0.111267 -0.612355
v -0.292767 0.140983 0.273684
v -0.292767 0.219307 0.109378
v -0.363767 0.219307 -0.040629
v -0.363767 0.140983 0.053976
v -0.363767 0.062659 0.188871
v -0.434766 0.062659 0.038865
v -0.065978 0.140983 0.372795
v -0.065978 0.219307 0.208489
v -0.136977 0.140983 0.123677
v -0.207977 0.062659 0.038865
v -0.178531 0.140983 -0.075066
v -0.065978 0.062659 0.537100
v -0.136977 0.062659 0.287982
v -0.136977 0.219307 -0.040629
v -0.245805 0.062659 -0.159878
v 0.409724 0.062659 0.113868
v 0.374224 0.180145 0.006674
v 0.338724 0.219307 0.034375
v 0.338724 0.101821 0.231277
v 0.303225 0.180145 0.191531
v 0.409724 0.101821 0.046420
v 0.652361 0.140984 -0.326492
v 0.661106 0.062660 -0.211742
v 0.682137 0.062660 -0.286745
v 0.661106 0.101822 -0.279190
v 0.625606 0.101822 -0.169336
v 0.625606 0.140984 -0.251489
v -0.127239 0.388807 -0.066393
v -0.399266 0.062659 0.113868
v -0.363767 0.180145 0.006674
v -0.328267 0.219307 0.034375
v -0.328267 0.101821 0.231277
v -0.292767 0.180145 0.191531
v -0.399266 0.101821 0.046420
v -0.650649 0.140984 -0.326492
v -0.650649 0.062660 -0.211742
v -0.686148 0.062660 -0.286745
v -0.650649 0.101822 -0.279190
v -0.615149 0.101822 -0.169336
v -0.615149 0.140984 -0.251489
vn 0.8330 0.4995 0.2381
vn -0.8237 -0.5203 -0.2255
vn -0.1282 -0.9195 -0.3716
vn -0.1858 0.3112 -0.9320
vn 0.8994 0.3945 0.1881
vn 0.3389 -0.5326 0.7756
vn 0.8337 0.4985 0.2376
vn 0.8337 0.4969 0.2411
vn 0.1848 0.8871 0.4229
vn 0.0000 1.0000 0.0000
vn 0.8269 0.5398 0.1574
vn 0.8148 0.5541 0.1704
vn 0.0000 -1.0000 -0.0000
vn 0.0000 0.0000 1.0000
vn -0.6458 -0.5881 -0.4869
vn 0.8085 0.1060 0.5789
vn -0.6874 -0.5266 -0.5002
vn 0.0000 0.1894 -0.9819
vn -0.0660 -0.9007 -0.4294
vn 0.5740 0.7392 0.3524
vn 0.4688 0.8550 0.2219
vn 0.7733 0.0166 0.6339
vn 0.8995 0.2180 0.3786
vn -0.9072 0.3489 -0.2351
vn 0.8030 -0.5379 -0.2564
vn 0.8065 0.4979 0.3187
vn -0.8882 0.3988 -0.2280
vn 0.8237 -0.5203 -0.2255
vn -0.9423 0.2181 -0.2542
vn 0.1282 -0.9195 -0.3716
vn 0.8652 0.4486 -0.2242
vn -0.5740 0.7392 0.3524
vn -0.4486 0.8682 0.2123
vn -0.8085 0.1060 0.5789
vn 0.6789 -0.5143 -0.5241
vn 0.8615 0.4441 -0.2462
vn 0.9423 0.2181 -0.2542
vn 0.6458 -0.5881 -0.4869
vn -0.7733 0.0166 0.6339
vn -0.8065 0.4979 0.3187
vn -0.8995 0.2180 0.3786
vn -0.8337 0.4985 0.2376
vn -0.8269 0.5398 0.1574
vn -0.8148 0.5541 0.1704
vn -0.8330 0.4995 0.2381
vn -0.8030 -0.5379 -0.2564
vn 0.1923 -0.7559 -0.6258
vn -0.3389 -0.5326 0.7756
vn -0.8323 0.5021 0.2351
vn -0.1848 0.8871 0.4229
vn 0.3996 0.4821 -0.7797
vn -0.8994 0.3945 0.1881
vn 0.7024 0.6663 0.2505
vn 0.3863 0.9120 0.1378
vn 0.4486 0.8682 0.2123
vn 0.7576 0.5892 0.2809
vn -0.8581 -0.3983 -0.3240
vn -0.7567 -0.2936 -0.5842
vn -0.6789 -0.5143 -0.5241
vn 0.8468 0.4328 0.3092
vn -0.7858 -0.5399 -0.3017
vn -0.6126 -0.6607 -0.4338
vn -0.6574 -0.5805 -0.4806
vn 0.9476 -0.1771 0.2657
vn -0.8327 -0.3891 0.3941
vn -0.7576 0.5892 0.2809
vn 0.7368 -0.6127 -0.2859
vn -0.8468 0.4328 0.3092
vn 0.8606 -0.3923 -0.3248
vn -0.5597 0.7852 0.2649
vn -0.6392 -0.7187 -0.2735
vn -0.2897 0.5776 -0.7632
vn -0.3989 0.4820 -0.7801
vn -0.3996 0.4821 -0.7797
vn -0.2329 0.6095 -0.7578
vn -0.1923 -0.7559 -0.6258
vn 0.0000 -0.7703 -0.6377
vn 0.8758 0.1059 0.4709
vn 0.7971 0.0448 0.6022
vn -0.8615 0.4441 -0.2462
vn 0.7574 -0.5957 -0.2674
vn -0.8652 0.4486 -0.2242
vn 0.6392 -0.7187 -0.2735
vn 0.8882 0.3988 -0.2280
vn 0.9072 0.3489 -0.2351
vn -0.8758 0.1059 0.4709
vn -0.7971 0.0448 0.6022
vn -0.7574 -0.5957 -0.2674
vn 0.2329 0.6095 -0.7578
vn 0.0660 -0.9007 -0.4294
vn 0.2897 0.5776 -0.7632
vn 0.1858 0.3112 -0.9320
vn 0.3989 0.4820 -0.7801
usemtl Material
s off
f 2//1 13//1 9//1
f 33//2 37//2 36//2
f 33//3 68//3 34//3
f 5//4 6//4 12//4
f 6//5 15//5 12//5
f 8//6 59//6 23//6
f 7//1 10//1 17//1
f 17//7 11//7 8//7
f 17//1 10//1 11//1
f 10//8 4//8 11//8
f 23//9 60//9 16//9
f 22//10 58//10 6//10
f 16//1 7//1 17//1
f 12//11 14//11 1//11
f 12//12 15//12 14//12
f 14//13 56//13 19//13
f 9//7 16//7 6//7
f 13//14 16//14 25//14
f 13//1 7//1 16//1
f 19//13 56//13 63//13
f 20//15 57//15 65//15
f 23//16 59//16 66//16
f 18//17 61//17 64//17
f 20//18 61//18 14//18
f 6//19 57//19 15//19
f 22//20 60//20 67//20
f 21//21 58//21 62//21
f 25//22 28//22 13//22
f 16//14 9//14 25//14
f 27//23 31//23 28//23
f 9//24 28//24 26//24
f 9//25 27//25 25//25
f 31//26 30//26 32//26
f 26//27 31//27 29//27
f 26//28 30//28 27//28
f 29//29 31//29 32//29
f 30//30 29//30 32//30
f 37//31 3//31 35//31
f 42//32 80//32 73//32
f 43//33 75//33 71//33
f 41//34 79//34 72//34
f 46//35 77//35 74//35
f 13//14 38//14 48//14
f 39//36 35//36 13//36
f 48//14 38//14 39//14
f 34//37 68//37 3//37
f 44//38 78//38 70//38
f 35//39 38//39 13//39
f 3//40 68//40 33//40
f 45//13 76//13 69//13
f 3//41 36//41 35//41
f 39//42 54//42 48//42
f 51//43 55//43 50//43
f 51//44 50//44 49//44
f 45//13 69//13 50//13
f 13//45 48//45 7//45
f 36//46 39//46 38//46
f 43//10 71//10 54//10
f 48//45 47//45 7//45
f 47//45 52//45 10//45
f 74//18 44//18 50//18
f 44//47 70//47 49//47
f 41//48 72//48 53//48
f 10//49 52//49 4//49
f 42//50 73//50 48//50
f 2//45 39//45 13//45
f 7//45 47//45 10//45
f 47//42 53//42 52//42
f 54//51 39//51 5//51
f 54//52 51//52 49//52
f 62//53 67//53 24//53
f 62//54 58//54 67//54
f 58//55 22//55 67//55
f 67//56 66//56 24//56
f 67//20 60//20 66//20
f 60//20 23//20 66//20
f 64//57 65//57 24//57
f 64//58 61//58 65//58
f 61//59 20//59 65//59
f 66//60 63//60 24//60
f 66//16 59//16 63//16
f 59//16 19//16 63//16
f 65//61 62//61 24//61
f 65//62 57//62 62//62
f 57//63 21//63 62//63
f 63//64 64//64 24//64
f 63//13 56//13 64//13
f 56//13 18//13 64//13
f 75//65 40//65 80//65
f 75//33 80//33 71//33
f 71//33 80//33 42//33
f 80//66 40//66 79//66
f 80//32 79//32 73//32
f 73//32 79//32 41//32
f 77//67 40//67 78//67
f 77//35 78//35 74//35
f 74//35 78//35 44//35
f 79//68 40//68 76//68
f 79//34 76//34 72//34
f 72//34 76//34 45//34
f 78//69 40//69 75//69
f 78//38 75//38 70//38
f 70//38 75//38 43//38
f 76//70 40//70 77//70
f 76//13 77//13 69//13
f 69//13 77//13 46//13
f 33//71 34//71 37//71
f 12//72 1//72 5//72
f 5//73 2//73 9//73
f 9//74 6//74 5//74
f 23//6 17//6 8//6
f 8//6 19//6 59//6
f 22//9 16//9 60//9
f 17//9 23//9 16//9
f 21//10 6//10 58//10
f 16//10 22//10 6//10
f 19//13 8//13 14//13
f 14//13 18//13 56//13
f 18//18 14//18 61//18
f 15//75 20//75 14//75
f 20//76 15//76 57//76
f 6//77 21//77 57//77
f 25//78 27//78 28//78
f 27//79 30//79 31//79
f 9//80 13//80 28//80
f 9//81 26//81 27//81
f 26//82 28//82 31//82
f 26//83 29//83 30//83
f 37//84 34//84 3//84
f 39//85 37//85 35//85
f 35//86 36//86 38//86
f 3//87 33//87 36//87
f 50//13 53//13 45//13
f 69//13 46//13 50//13
f 36//88 37//88 39//88
f 48//10 54//10 42//10
f 71//10 42//10 54//10
f 49//89 50//89 44//89
f 46//18 74//18 50//18
f 54//90 49//90 70//90
f 70//77 43//77 54//77
f 53//48 47//48 41//48
f 72//48 45//48 53//48
f 47//50 48//50 41//50
f 73//50 41//50 48//50
f 5//91 55//91 51//91
f 51//92 54//92 5//92
f 39//93 2//93 5//93
