%YAML 1.1
%TAG !u! tag:unity3d.com,2011:
--- !u!29 &1
OcclusionCullingSettings:
  m_ObjectHideFlags: 0
  serializedVersion: 2
  m_OcclusionBakeSettings:
    smallestOccluder: 5
    smallestHole: 0.25
    backfaceThreshold: 100
  m_SceneGUID: 00000000000000000000000000000000
  m_OcclusionCullingData: {fileID: 0}
--- !u!104 &2
RenderSettings:
  m_ObjectHideFlags: 0
  serializedVersion: 8
  m_Fog: 0
  m_FogColor: {r: 0.5, g: 0.5, b: 0.5, a: 1}
  m_FogMode: 3
  m_FogDensity: 0.01
  m_LinearFogStart: 0
  m_LinearFogEnd: 300
  m_AmbientSkyColor: {r: 0.212, g: 0.227, b: 0.259, a: 1}
  m_AmbientEquatorColor: {r: 0.114, g: 0.125, b: 0.133, a: 1}
  m_AmbientGroundColor: {r: 0.047, g: 0.043, b: 0.035, a: 1}
  m_AmbientIntensity: 1
  m_AmbientMode: 0
  m_SubtractiveShadowColor: {r: 0.42, g: 0.478, b: 0.627, a: 1}
  m_SkyboxMaterial: {fileID: 10304, guid: 0000000000000000f000000000000000, type: 0}
  m_HaloStrength: 0.5
  m_FlareStrength: 1
  m_FlareFadeSpeed: 3
  m_HaloTexture: {fileID: 0}
  m_SpotCookie: {fileID: 10001, guid: 0000000000000000e000000000000000, type: 0}
  m_DefaultReflectionMode: 0
  m_DefaultReflectionResolution: 128
  m_ReflectionBounces: 1
  m_ReflectionIntensity: 1
  m_CustomReflection: {fileID: 0}
  m_Sun: {fileID: 0}
  m_IndirectSpecularColor: {r: 0.44657844, g: 0.49641222, b: 0.57481694, a: 1}
--- !u!157 &3
LightmapSettings:
  m_ObjectHideFlags: 0
  serializedVersion: 11
  m_GIWorkflowMode: 0
  m_GISettings:
    serializedVersion: 2
    m_BounceScale: 1
    m_IndirectOutputScale: 1
    m_AlbedoBoost: 1
    m_TemporalCoherenceThreshold: 1
    m_EnvironmentLightingMode: 0
    m_EnableBakedLightmaps: 1
    m_EnableRealtimeLightmaps: 1
  m_LightmapEditorSettings:
    serializedVersion: 9
    m_Resolution: 2
    m_BakeResolution: 40
    m_TextureWidth: 1024
    m_TextureHeight: 1024
    m_AO: 0
    m_AOMaxDistance: 1
    m_CompAOExponent: 1
    m_CompAOExponentDirect: 0
    m_Padding: 2
    m_LightmapParameters: {fileID: 0}
    m_LightmapsBakeMode: 1
    m_TextureCompression: 1
    m_FinalGather: 0
    m_FinalGatherFiltering: 1
    m_FinalGatherRayCount: 256
    m_ReflectionCompression: 2
    m_MixedBakeMode: 2
    m_BakeBackend: 0
    m_PVRSampling: 1
    m_PVRDirectSampleCount: 32
    m_PVRSampleCount: 500
    m_PVRBounces: 2
    m_PVRFilterTypeDirect: 0
    m_PVRFilterTypeIndirect: 0
    m_PVRFilterTypeAO: 0
    m_PVRFilteringMode: 1
    m_PVRCulling: 1
    m_PVRFilteringGaussRadiusDirect: 1
    m_PVRFilteringGaussRadiusIndirect: 5
    m_PVRFilteringGaussRadiusAO: 2
    m_PVRFilteringAtrousPositionSigmaDirect: 0.5
    m_PVRFilteringAtrousPositionSigmaIndirect: 2
    m_PVRFilteringAtrousPositionSigmaAO: 1
  m_LightingDataAsset: {fileID: 0}
  m_UseShadowmask: 1
--- !u!196 &4
NavMeshSettings:
  serializedVersion: 2
  m_ObjectHideFlags: 0
  m_BuildSettings:
    serializedVersion: 2
    agentTypeID: 0
    agentRadius: 0.5
    agentHeight: 2
    agentSlope: 45
    agentClimb: 0.4
    ledgeDropHeight: 0
    maxJumpAcrossDistance: 0
    minRegionArea: 2
    manualCellSize: 0
    cellSize: 0.16666667
    manualTileSize: 0
    tileSize: 256
    accuratePlacement: 0
    debug:
      m_Flags: 0
  m_NavMeshData: {fileID: 0}
--- !u!1 &34770181
GameObject:
  m_ObjectHideFlags: 0
  m_PrefabParentObject: {fileID: 0}
  m_PrefabInternal: {fileID: 0}
  serializedVersion: 5
  m_Component:
  - component: {fileID: 34770183}
  - component: {fileID: 34770182}
  m_Layer: 0
  m_Name: Directional Light
  m_TagString: Untagged
  m_Icon: {fileID: 0}
  m_NavMeshLayer: 0
  m_StaticEditorFlags: 0
  m_IsActive: 1
--- !u!108 &34770182
Light:
  m_ObjectHideFlags: 0
  m_PrefabParentObject: {fileID: 0}
  m_PrefabInternal: {fileID: 0}
  m_GameObject: {fileID: 34770181}
  m_Enabled: 1
  serializedVersion: 8
  m_Type: 1
  m_Color: {r: 1, g: 0.95686275, b: 0.8392157, a: 1}
  m_Intensity: 1
  m_Range: 10
  m_SpotAngle: 30
  m_CookieSize: 10
  m_Shadows:
    m_Type: 2
    m_Resolution: -1
    m_CustomResolution: -1
    m_Strength: 1
    m_Bias: 0.05
    m_NormalBias: 0.4
    m_NearPlane: 0.2
  m_Cookie: {fileID: 0}
  m_DrawHalo: 0
  m_Flare: {fileID: 0}
  m_RenderMode: 0
  m_CullingMask:
    serializedVersion: 2
    m_Bits: 4294967295
  m_Lightmapping: 4
  m_AreaSize: {x: 1, y: 1}
  m_BounceIntensity: 1
  m_ColorTemperature: 6570
  m_UseColorTemperature: 0
  m_ShadowRadius: 0
  m_ShadowAngle: 0
--- !u!4 &34770183
Transform:
  m_ObjectHideFlags: 0
  m_PrefabParentObject: {fileID: 0}
  m_PrefabInternal: {fileID: 0}
  m_GameObject: {fileID: 34770181}
  m_LocalRotation: {x: 0.40821788, y: -0.23456968, z: 0.10938163, w: 0.8754261}
  m_LocalPosition: {x: 0, y: 3, z: -1.63}
  m_LocalScale: {x: 1, y: 1, z: 1}
  m_Children: []
  m_Father: {fileID: 0}
  m_RootOrder: 4
  m_LocalEulerAnglesHint: {x: 50, y: -30, z: 0}
--- !u!1 &211176353
GameObject:
  m_ObjectHideFlags: 0
  m_PrefabParentObject: {fileID: 0}
  m_PrefabInternal: {fileID: 0}
  serializedVersion: 5
  m_Component:
  - component: {fileID: 211176356}
  - component: {fileID: 211176355}
  - component: {fileID: 211176354}
  m_Layer: 0
  m_Name: EventSystem
  m_TagString: Untagged
  m_Icon: {fileID: 0}
  m_NavMeshLayer: 0
  m_StaticEditorFlags: 0
  m_IsActive: 1
--- !u!114 &211176354
MonoBehaviour:
  m_ObjectHideFlags: 0
  m_PrefabParentObject: {fileID: 0}
  m_PrefabInternal: {fileID: 0}
  m_GameObject: {fileID: 211176353}
  m_Enabled: 1
  m_EditorHideFlags: 0
  m_Script: {fileID: 1077351063, guid: f70555f144d8491a825f0804e09c671c, type: 3}
  m_Name: 
  m_EditorClassIdentifier: 
  m_HorizontalAxis: Horizontal
  m_VerticalAxis: Vertical
  m_SubmitButton: Submit
  m_CancelButton: Cancel
  m_InputActionsPerSecond: 10
  m_RepeatDelay: 0.5
  m_ForceModuleActive: 0
--- !u!114 &211176355
MonoBehaviour:
  m_ObjectHideFlags: 0
  m_PrefabParentObject: {fileID: 0}
  m_PrefabInternal: {fileID: 0}
  m_GameObject: {fileID: 211176353}
  m_Enabled: 1
  m_EditorHideFlags: 0
  m_Script: {fileID: -619905303, guid: f70555f144d8491a825f0804e09c671c, type: 3}
  m_Name: 
  m_EditorClassIdentifier: 
  m_FirstSelected: {fileID: 0}
  m_sendNavigationEvents: 1
  m_DragThreshold: 5
--- !u!4 &211176356
Transform:
  m_ObjectHideFlags: 0
  m_PrefabParentObject: {fileID: 0}
  m_PrefabInternal: {fileID: 0}
  m_GameObject: {fileID: 211176353}
  m_LocalRotation: {x: 0, y: 0, z: 0, w: 1}
  m_LocalPosition: {x: 0, y: 0, z: 0}
  m_LocalScale: {x: 1, y: 1, z: 1}
  m_Children: []
  m_Father: {fileID: 0}
  m_RootOrder: 6
  m_LocalEulerAnglesHint: {x: 0, y: 0, z: 0}
--- !u!1 &407389006
GameObject:
  m_ObjectHideFlags: 0
  m_PrefabParentObject: {fileID: 0}
  m_PrefabInternal: {fileID: 0}
  serializedVersion: 5
  m_Component:
  - component: {fileID: 407389007}
  - component: {fileID: 407389009}
  - component: {fileID: 407389008}
  m_Layer: 5
  m_Name: Text
  m_TagString: Untagged
  m_Icon: {fileID: 0}
  m_NavMeshLayer: 0
  m_StaticEditorFlags: 0
  m_IsActive: 1
--- !u!224 &407389007
RectTransform:
  m_ObjectHideFlags: 0
  m_PrefabParentObject: {fileID: 0}
  m_PrefabInternal: {fileID: 0}
  m_GameObject: {fileID: 407389006}
  m_LocalRotation: {x: 0, y: 0, z: 0, w: 1}
  m_LocalPosition: {x: 0, y: 3.8999996, z: 0}
  m_LocalScale: {x: 1, y: 1, z: 1}
  m_Children: []
  m_Father: {fileID: 641587366}
  m_RootOrder: 0
  m_LocalEulerAnglesHint: {x: 0, y: 0, z: 0}
  m_AnchorMin: {x: 0, y: 0}
  m_AnchorMax: {x: 1, y: 1}
  m_AnchoredPosition: {x: 0, y: 3.9}
  m_SizeDelta: {x: 0, y: 0}
  m_Pivot: {x: 0.5, y: 0.5}
--- !u!114 &407389008
MonoBehaviour:
  m_ObjectHideFlags: 0
  m_PrefabParentObject: {fileID: 0}
  m_PrefabInternal: {fileID: 0}
  m_GameObject: {fileID: 407389006}
  m_Enabled: 1
  m_EditorHideFlags: 0
  m_Script: {fileID: 708705254, guid: f70555f144d8491a825f0804e09c671c, type: 3}
  m_Name: 
  m_EditorClassIdentifier: 
  m_Material: {fileID: 0}
  m_Color: {r: 0.19607843, g: 0.19607843, b: 0.19607843, a: 1}
  m_RaycastTarget: 1
  m_OnCullStateChanged:
    m_PersistentCalls:
      m_Calls: []
    m_TypeName: UnityEngine.UI.MaskableGraphic+CullStateChangedEvent, UnityEngine.UI,
      Version=1.0.0.0, Culture=neutral, PublicKeyToken=null
  m_FontData:
    m_Font: {fileID: 12800000, guid: 434ff1b73022c4b43a3f292fca5e6c3a, type: 3}
    m_FontSize: 39
    m_FontStyle: 2
    m_BestFit: 0
    m_MinSize: 10
    m_MaxSize: 62
    m_Alignment: 4
    m_AlignByGeometry: 0
    m_RichText: 1
    m_HorizontalOverflow: 0
    m_VerticalOverflow: 0
    m_LineSpacing: 1
  m_Text: PLAY!
--- !u!222 &407389009
CanvasRenderer:
  m_ObjectHideFlags: 0
  m_PrefabParentObject: {fileID: 0}
  m_PrefabInternal: {fileID: 0}
  m_GameObject: {fileID: 407389006}
--- !u!1001 &415273968
Prefab:
  m_ObjectHideFlags: 0
  serializedVersion: 2
  m_Modification:
    m_TransformParent: {fileID: 501181242}
    m_Modifications:
    - target: {fileID: 4217681768868214, guid: 6e01cb7103be1504ca58918d43ef4e20, type: 2}
      propertyPath: m_LocalPosition.x
      value: 1.06
      objectReference: {fileID: 0}
    - target: {fileID: 4217681768868214, guid: 6e01cb7103be1504ca58918d43ef4e20, type: 2}
      propertyPath: m_LocalPosition.y
      value: 0.64
      objectReference: {fileID: 0}
    - target: {fileID: 4217681768868214, guid: 6e01cb7103be1504ca58918d43ef4e20, type: 2}
      propertyPath: m_LocalPosition.z
      value: 2.57
      objectReference: {fileID: 0}
    - target: {fileID: 4217681768868214, guid: 6e01cb7103be1504ca58918d43ef4e20, type: 2}
      propertyPath: m_LocalRotation.x
      value: -0.054268844
      objectReference: {fileID: 0}
    - target: {fileID: 4217681768868214, guid: 6e01cb7103be1504ca58918d43ef4e20, type: 2}
      propertyPath: m_LocalRotation.y
      value: -0.0515489
      objectReference: {fileID: 0}
    - target: {fileID: 4217681768868214, guid: 6e01cb7103be1504ca58918d43ef4e20, type: 2}
      propertyPath: m_LocalRotation.z
      value: 0.058692634
      objectReference: {fileID: 0}
    - target: {fileID: 4217681768868214, guid: 6e01cb7103be1504ca58918d43ef4e20, type: 2}
      propertyPath: m_LocalRotation.w
      value: 0.9954661
      objectReference: {fileID: 0}
    - target: {fileID: 4217681768868214, guid: 6e01cb7103be1504ca58918d43ef4e20, type: 2}
      propertyPath: m_RootOrder
      value: 1
      objectReference: {fileID: 0}
    - target: {fileID: 4217681768868214, guid: 6e01cb7103be1504ca58918d43ef4e20, type: 2}
      propertyPath: m_LocalScale.x
      value: 0.7694291
      objectReference: {fileID: 0}
    - target: {fileID: 4217681768868214, guid: 6e01cb7103be1504ca58918d43ef4e20, type: 2}
      propertyPath: m_LocalScale.y
      value: 0.76942784
      objectReference: {fileID: 0}
    - target: {fileID: 4217681768868214, guid: 6e01cb7103be1504ca58918d43ef4e20, type: 2}
      propertyPath: m_LocalScale.z
      value: 1.0243891
      objectReference: {fileID: 0}
    - target: {fileID: 4217681768868214, guid: 6e01cb7103be1504ca58918d43ef4e20, type: 2}
      propertyPath: m_LocalEulerAnglesHint.x
      value: -5.854
      objectReference: {fileID: 0}
    - target: {fileID: 4217681768868214, guid: 6e01cb7103be1504ca58918d43ef4e20, type: 2}
      propertyPath: m_LocalEulerAnglesHint.y
      value: -6.2910004
      objectReference: {fileID: 0}
    - target: {fileID: 4217681768868214, guid: 6e01cb7103be1504ca58918d43ef4e20, type: 2}
      propertyPath: m_LocalEulerAnglesHint.z
      value: 7.07
      objectReference: {fileID: 0}
    m_RemovedComponents: []
  m_ParentPrefab: {fileID: 100100000, guid: 6e01cb7103be1504ca58918d43ef4e20, type: 2}
  m_IsPrefabParent: 0
--- !u!4 &501181242 stripped
Transform:
  m_PrefabParentObject: {fileID: 400002, guid: 27131b30cb4118a46b0094472c2d99d8, type: 3}
  m_PrefabInternal: {fileID: 1616343436}
--- !u!1 &641587365
GameObject:
  m_ObjectHideFlags: 0
  m_PrefabParentObject: {fileID: 0}
  m_PrefabInternal: {fileID: 0}
  serializedVersion: 5
  m_Component:
  - component: {fileID: 641587366}
  - component: {fileID: 641587370}
  - component: {fileID: 641587369}
  - component: {fileID: 641587368}
  - component: {fileID: 641587367}
  m_Layer: 5
  m_Name: Button
  m_TagString: Untagged
  m_Icon: {fileID: 0}
  m_NavMeshLayer: 0
  m_StaticEditorFlags: 0
  m_IsActive: 1
--- !u!224 &641587366
RectTransform:
  m_ObjectHideFlags: 0
  m_PrefabParentObject: {fileID: 0}
  m_PrefabInternal: {fileID: 0}
  m_GameObject: {fileID: 641587365}
  m_LocalRotation: {x: 0, y: 0, z: 0, w: 1}
  m_LocalPosition: {x: 0, y: -136, z: 0}
  m_LocalScale: {x: 1, y: 1, z: 1}
  m_Children:
  - {fileID: 407389007}
  m_Father: {fileID: 1549719901}
  m_RootOrder: 0
  m_LocalEulerAnglesHint: {x: 0, y: 0, z: 0}
  m_AnchorMin: {x: 0.5, y: 0.5}
  m_AnchorMax: {x: 0.5, y: 0.5}
  m_AnchoredPosition: {x: 0, y: -136}
  m_SizeDelta: {x: 160, y: 70}
  m_Pivot: {x: 0.5, y: 0.5}
--- !u!114 &641587367
MonoBehaviour:
  m_ObjectHideFlags: 0
  m_PrefabParentObject: {fileID: 0}
  m_PrefabInternal: {fileID: 0}
  m_GameObject: {fileID: 641587365}
  m_Enabled: 1
  m_EditorHideFlags: 0
  m_Script: {fileID: 11500000, guid: 4af93b3650a1d9b46b481d1e692f01e2, type: 3}
  m_Name: 
  m_EditorClassIdentifier: 
--- !u!114 &641587368
MonoBehaviour:
  m_ObjectHideFlags: 0
  m_PrefabParentObject: {fileID: 0}
  m_PrefabInternal: {fileID: 0}
  m_GameObject: {fileID: 641587365}
  m_Enabled: 1
  m_EditorHideFlags: 0
  m_Script: {fileID: 1392445389, guid: f70555f144d8491a825f0804e09c671c, type: 3}
  m_Name: 
  m_EditorClassIdentifier: 
  m_Navigation:
    m_Mode: 3
    m_SelectOnUp: {fileID: 0}
    m_SelectOnDown: {fileID: 0}
    m_SelectOnLeft: {fileID: 0}
    m_SelectOnRight: {fileID: 0}
  m_Transition: 1
  m_Colors:
    m_NormalColor: {r: 1, g: 1, b: 1, a: 1}
    m_HighlightedColor: {r: 0.15862082, g: 1, b: 0, a: 1}
    m_PressedColor: {r: 0.78431374, g: 0.78431374, b: 0.78431374, a: 1}
    m_DisabledColor: {r: 0.78431374, g: 0.78431374, b: 0.78431374, a: 0.5019608}
    m_ColorMultiplier: 1
    m_FadeDuration: 0.1
  m_SpriteState:
    m_HighlightedSprite: {fileID: 0}
    m_PressedSprite: {fileID: 0}
    m_DisabledSprite: {fileID: 0}
  m_AnimationTriggers:
    m_NormalTrigger: Normal
    m_HighlightedTrigger: Highlighted
    m_PressedTrigger: Pressed
    m_DisabledTrigger: Disabled
  m_Interactable: 1
  m_TargetGraphic: {fileID: 641587369}
  m_OnClick:
    m_PersistentCalls:
      m_Calls:
      - m_Target: {fileID: 641587367}
        m_MethodName: LoadMyLevel
        m_Mode: 5
        m_Arguments:
          m_ObjectArgument: {fileID: 0}
          m_ObjectArgumentAssemblyTypeName: UnityEngine.Object, UnityEngine
          m_IntArgument: 0
          m_FloatArgument: 0
          m_StringArgument: main_scene
          m_BoolArgument: 0
        m_CallState: 2
    m_TypeName: UnityEngine.UI.Button+ButtonClickedEvent, UnityEngine.UI, Version=1.0.0.0,
      Culture=neutral, PublicKeyToken=null
--- !u!114 &641587369
MonoBehaviour:
  m_ObjectHideFlags: 0
  m_PrefabParentObject: {fileID: 0}
  m_PrefabInternal: {fileID: 0}
  m_GameObject: {fileID: 641587365}
  m_Enabled: 1
  m_EditorHideFlags: 0
  m_Script: {fileID: -765806418, guid: f70555f144d8491a825f0804e09c671c, type: 3}
  m_Name: 
  m_EditorClassIdentifier: 
  m_Material: {fileID: 0}
  m_Color: {r: 1, g: 1, b: 1, a: 1}
  m_RaycastTarget: 1
  m_OnCullStateChanged:
    m_PersistentCalls:
      m_Calls: []
    m_TypeName: UnityEngine.UI.MaskableGraphic+CullStateChangedEvent, UnityEngine.UI,
      Version=1.0.0.0, Culture=neutral, PublicKeyToken=null
  m_Sprite: {fileID: 10905, guid: 0000000000000000f000000000000000, type: 0}
  m_Type: 1
  m_PreserveAspect: 0
  m_FillCenter: 1
  m_FillMethod: 4
  m_FillAmount: 1
  m_FillClockwise: 1
  m_FillOrigin: 0
--- !u!222 &641587370
CanvasRenderer:
  m_ObjectHideFlags: 0
  m_PrefabParentObject: {fileID: 0}
  m_PrefabInternal: {fileID: 0}
  m_GameObject: {fileID: 641587365}
--- !u!1 &1475152206
GameObject:
  m_ObjectHideFlags: 0
  m_PrefabParentObject: {fileID: 0}
  m_PrefabInternal: {fileID: 0}
  serializedVersion: 5
  m_Component:
  - component: {fileID: 1475152210}
  - component: {fileID: 1475152209}
  - component: {fileID: 1475152208}
  - component: {fileID: 1475152207}
  m_Layer: 0
  m_Name: Main Camera
  m_TagString: MainCamera
  m_Icon: {fileID: 0}
  m_NavMeshLayer: 0
  m_StaticEditorFlags: 0
  m_IsActive: 1
--- !u!81 &1475152207
AudioListener:
  m_ObjectHideFlags: 0
  m_PrefabParentObject: {fileID: 0}
  m_PrefabInternal: {fileID: 0}
  m_GameObject: {fileID: 1475152206}
  m_Enabled: 1
--- !u!124 &1475152208
Behaviour:
  m_ObjectHideFlags: 0
  m_PrefabParentObject: {fileID: 0}
  m_PrefabInternal: {fileID: 0}
  m_GameObject: {fileID: 1475152206}
  m_Enabled: 1
--- !u!20 &1475152209
Camera:
  m_ObjectHideFlags: 0
  m_PrefabParentObject: {fileID: 0}
  m_PrefabInternal: {fileID: 0}
  m_GameObject: {fileID: 1475152206}
  m_Enabled: 1
  serializedVersion: 2
  m_ClearFlags: 1
  m_BackGroundColor: {r: 0.19215687, g: 0.3019608, b: 0.4745098, a: 0}
  m_NormalizedViewPortRect:
    serializedVersion: 2
    x: 0
    y: 0
    width: 1
    height: 1
  near clip plane: 0.3
  far clip plane: 1000
  field of view: 60
  orthographic: 0
  orthographic size: 5
  m_Depth: -1
  m_CullingMask:
    serializedVersion: 2
    m_Bits: 4294967295
  m_RenderingPath: -1
  m_TargetTexture: {fileID: 0}
  m_TargetDisplay: 0
  m_TargetEye: 3
  m_HDR: 1
  m_AllowMSAA: 1
  m_ForceIntoRT: 0
  m_OcclusionCulling: 1
  m_StereoConvergence: 10
  m_StereoSeparation: 0.022
--- !u!4 &1475152210
Transform:
  m_ObjectHideFlags: 0
  m_PrefabParentObject: {fileID: 0}
  m_PrefabInternal: {fileID: 0}
  m_GameObject: {fileID: 1475152206}
  m_LocalRotation: {x: 0, y: 0, z: 0, w: 1}
  m_LocalPosition: {x: 0, y: 7.6, z: -10}
  m_LocalScale: {x: 1, y: 1, z: 1}
  m_Children: []
  m_Father: {fileID: 0}
  m_RootOrder: 0
  m_LocalEulerAnglesHint: {x: 0, y: 0, z: 0}
--- !u!1 &1549719897
GameObject:
  m_ObjectHideFlags: 0
  m_PrefabParentObject: {fileID: 0}
  m_PrefabInternal: {fileID: 0}
  serializedVersion: 5
  m_Component:
  - component: {fileID: 1549719901}
  - component: {fileID: 1549719900}
  - component: {fileID: 1549719899}
  - component: {fileID: 1549719898}
  m_Layer: 5
  m_Name: Canvas
  m_TagString: Untagged
  m_Icon: {fileID: 0}
  m_NavMeshLayer: 0
  m_StaticEditorFlags: 0
  m_IsActive: 1
--- !u!114 &1549719898
MonoBehaviour:
  m_ObjectHideFlags: 0
  m_PrefabParentObject: {fileID: 0}
  m_PrefabInternal: {fileID: 0}
  m_GameObject: {fileID: 1549719897}
  m_Enabled: 1
  m_EditorHideFlags: 0
  m_Script: {fileID: 1301386320, guid: f70555f144d8491a825f0804e09c671c, type: 3}
  m_Name: 
  m_EditorClassIdentifier: 
  m_IgnoreReversedGraphics: 1
  m_BlockingObjects: 0
  m_BlockingMask:
    serializedVersion: 2
    m_Bits: 4294967295
--- !u!114 &1549719899
MonoBehaviour:
  m_ObjectHideFlags: 0
  m_PrefabParentObject: {fileID: 0}
  m_PrefabInternal: {fileID: 0}
  m_GameObject: {fileID: 1549719897}
  m_Enabled: 1
  m_EditorHideFlags: 0
  m_Script: {fileID: 1980459831, guid: f70555f144d8491a825f0804e09c671c, type: 3}
  m_Name: 
  m_EditorClassIdentifier: 
  m_UiScaleMode: 1
  m_ReferencePixelsPerUnit: 100
  m_ScaleFactor: 1
  m_ReferenceResolution: {x: 800, y: 600}
  m_ScreenMatchMode: 0
  m_MatchWidthOrHeight: 0
  m_PhysicalUnit: 3
  m_FallbackScreenDPI: 96
  m_DefaultSpriteDPI: 96
  m_DynamicPixelsPerUnit: 1
--- !u!223 &1549719900
Canvas:
  m_ObjectHideFlags: 0
  m_PrefabParentObject: {fileID: 0}
  m_PrefabInternal: {fileID: 0}
  m_GameObject: {fileID: 1549719897}
  m_Enabled: 1
  serializedVersion: 3
  m_RenderMode: 0
  m_Camera: {fileID: 0}
  m_PlaneDistance: 100
  m_PixelPerfect: 0
  m_ReceivesEvents: 1
  m_OverrideSorting: 0
  m_OverridePixelPerfect: 0
  m_SortingBucketNormalizedSize: 0
  m_AdditionalShaderChannelsFlag: 0
  m_SortingLayerID: 0
  m_SortingOrder: 0
  m_TargetDisplay: 0
--- !u!224 &1549719901
RectTransform:
  m_ObjectHideFlags: 0
  m_PrefabParentObject: {fileID: 0}
  m_PrefabInternal: {fileID: 0}
  m_GameObject: {fileID: 1549719897}
  m_LocalRotation: {x: 0, y: 0, z: 0, w: 1}
  m_LocalPosition: {x: 291, y: 163.5, z: 0}
  m_LocalScale: {x: 0.7275, y: 0.7275, z: 0.7275}
  m_Children:
  - {fileID: 641587366}
  - {fileID: 2085205333}
  m_Father: {fileID: 0}
  m_RootOrder: 5
  m_LocalEulerAnglesHint: {x: 0, y: 0, z: 0}
  m_AnchorMin: {x: 0.5, y: 0.5}
  m_AnchorMax: {x: 0.5, y: 0.5}
  m_AnchoredPosition: {x: 0, y: 0}
  m_SizeDelta: {x: 100, y: 100}
  m_Pivot: {x: 0.5, y: 0.5}
--- !u!1001 &1616343436
Prefab:
  m_ObjectHideFlags: 0
  serializedVersion: 2
  m_Modification:
    m_TransformParent: {fileID: 0}
    m_Modifications:
    - target: {fileID: 400002, guid: 27131b30cb4118a46b0094472c2d99d8, type: 3}
      propertyPath: m_LocalPosition.x
      value: -106
      objectReference: {fileID: 0}
    - target: {fileID: 400002, guid: 27131b30cb4118a46b0094472c2d99d8, type: 3}
      propertyPath: m_LocalPosition.y
      value: -16
      objectReference: {fileID: 0}
    - target: {fileID: 400002, guid: 27131b30cb4118a46b0094472c2d99d8, type: 3}
      propertyPath: m_LocalPosition.z
      value: 198
      objectReference: {fileID: 0}
    - target: {fileID: 400002, guid: 27131b30cb4118a46b0094472c2d99d8, type: 3}
      propertyPath: m_LocalRotation.x
      value: 0.030568693
      objectReference: {fileID: 0}
    - target: {fileID: 400002, guid: 27131b30cb4118a46b0094472c2d99d8, type: 3}
      propertyPath: m_LocalRotation.y
      value: 0.8148582
      objectReference: {fileID: 0}
    - target: {fileID: 400002, guid: 27131b30cb4118a46b0094472c2d99d8, type: 3}
      propertyPath: m_LocalRotation.z
      value: -0.11719962
      objectReference: {fileID: 0}
    - target: {fileID: 400002, guid: 27131b30cb4118a46b0094472c2d99d8, type: 3}
      propertyPath: m_LocalRotation.w
      value: 0.56686497
      objectReference: {fileID: 0}
    - target: {fileID: 400002, guid: 27131b30cb4118a46b0094472c2d99d8, type: 3}
      propertyPath: m_RootOrder
      value: 1
      objectReference: {fileID: 0}
    - target: {fileID: 400002, guid: 27131b30cb4118a46b0094472c2d99d8, type: 3}
      propertyPath: m_LocalScale.x
      value: 31.330788
      objectReference: {fileID: 0}
    - target: {fileID: 400002, guid: 27131b30cb4118a46b0094472c2d99d8, type: 3}
      propertyPath: m_LocalScale.y
      value: 31.330809
      objectReference: {fileID: 0}
    - target: {fileID: 400002, guid: 27131b30cb4118a46b0094472c2d99d8, type: 3}
      propertyPath: m_LocalScale.z
      value: 31.330809
      objectReference: {fileID: 0}
    - target: {fileID: 400002, guid: 27131b30cb4118a46b0094472c2d99d8, type: 3}
      propertyPath: m_LocalEulerAnglesHint.y
      value: 109.79101
      objectReference: {fileID: 0}
    - target: {fileID: 400002, guid: 27131b30cb4118a46b0094472c2d99d8, type: 3}
      propertyPath: m_LocalEulerAnglesHint.x
      value: 13.042001
      objectReference: {fileID: 0}
    - target: {fileID: 400002, guid: 27131b30cb4118a46b0094472c2d99d8, type: 3}
      propertyPath: m_LocalEulerAnglesHint.z
      value: -4.8910003
      objectReference: {fileID: 0}
    m_RemovedComponents: []
  m_ParentPrefab: {fileID: 100100000, guid: 27131b30cb4118a46b0094472c2d99d8, type: 3}
  m_IsPrefabParent: 0
--- !u!1001 &1938855315
Prefab:
  m_ObjectHideFlags: 0
  serializedVersion: 2
  m_Modification:
    m_TransformParent: {fileID: 0}
    m_Modifications:
    - target: {fileID: 400002, guid: 03a233d58ffbbf144b1e7bec834d591d, type: 3}
      propertyPath: m_LocalPosition.x
      value: 59.9
      objectReference: {fileID: 0}
    - target: {fileID: 400002, guid: 03a233d58ffbbf144b1e7bec834d591d, type: 3}
      propertyPath: m_LocalPosition.y
      value: -17.3
      objectReference: {fileID: 0}
    - target: {fileID: 400002, guid: 03a233d58ffbbf144b1e7bec834d591d, type: 3}
      propertyPath: m_LocalPosition.z
      value: 86.5
      objectReference: {fileID: 0}
    - target: {fileID: 400002, guid: 03a233d58ffbbf144b1e7bec834d591d, type: 3}
      propertyPath: m_LocalRotation.x
      value: -0.2725772
      objectReference: {fileID: 0}
    - target: {fileID: 400002, guid: 03a233d58ffbbf144b1e7bec834d591d, type: 3}
      propertyPath: m_LocalRotation.y
      value: -0.84280866
      objectReference: {fileID: 0}
    - target: {fileID: 400002, guid: 03a233d58ffbbf144b1e7bec834d591d, type: 3}
      propertyPath: m_LocalRotation.z
      value: 0.20395301
      objectReference: {fileID: 0}
    - target: {fileID: 400002, guid: 03a233d58ffbbf144b1e7bec834d591d, type: 3}
      propertyPath: m_LocalRotation.w
      value: 0.41686735
      objectReference: {fileID: 0}
    - target: {fileID: 400002, guid: 03a233d58ffbbf144b1e7bec834d591d, type: 3}
      propertyPath: m_RootOrder
      value: 3
      objectReference: {fileID: 0}
    - target: {fileID: 400002, guid: 03a233d58ffbbf144b1e7bec834d591d, type: 3}
      propertyPath: m_LocalScale.x
      value: 43.31654
      objectReference: {fileID: 0}
    - target: {fileID: 400002, guid: 03a233d58ffbbf144b1e7bec834d591d, type: 3}
      propertyPath: m_LocalScale.y
      value: 43.31651
      objectReference: {fileID: 0}
    - target: {fileID: 400002, guid: 03a233d58ffbbf144b1e7bec834d591d, type: 3}
      propertyPath: m_LocalScale.z
      value: 43.31651
      objectReference: {fileID: 0}
    - target: {fileID: 400002, guid: 03a233d58ffbbf144b1e7bec834d591d, type: 3}
      propertyPath: m_LocalEulerAnglesHint.y
      value: -124.97001
      objectReference: {fileID: 0}
    - target: {fileID: 400002, guid: 03a233d58ffbbf144b1e7bec834d591d, type: 3}
      propertyPath: m_LocalEulerAnglesHint.x
      value: 6.6920004
      objectReference: {fileID: 0}
    - target: {fileID: 400002, guid: 03a233d58ffbbf144b1e7bec834d591d, type: 3}
      propertyPath: m_LocalEulerAnglesHint.z
      value: 39.333
      objectReference: {fileID: 0}
    - target: {fileID: 2300000, guid: 03a233d58ffbbf144b1e7bec834d591d, type: 3}
      propertyPath: m_Materials.Array.data[0]
      value: 
      objectReference: {fileID: 2100000, guid: 4fb34c4af8f50f14487f82373409b4f3, type: 2}
    - target: {fileID: 2300000, guid: 03a233d58ffbbf144b1e7bec834d591d, type: 3}
      propertyPath: m_DynamicOccludee
      value: 1
      objectReference: {fileID: 0}
    - target: {fileID: 400000, guid: 03a233d58ffbbf144b1e7bec834d591d, type: 3}
      propertyPath: m_LocalRotation.x
      value: 0.13034447
      objectReference: {fileID: 0}
    - target: {fileID: 400000, guid: 03a233d58ffbbf144b1e7bec834d591d, type: 3}
      propertyPath: m_LocalRotation.y
      value: 0.0915475
      objectReference: {fileID: 0}
    - target: {fileID: 400000, guid: 03a233d58ffbbf144b1e7bec834d591d, type: 3}
      propertyPath: m_LocalRotation.z
      value: 0.16443738
      objectReference: {fileID: 0}
    - target: {fileID: 400000, guid: 03a233d58ffbbf144b1e7bec834d591d, type: 3}
      propertyPath: m_LocalRotation.w
      value: 0.97344226
      objectReference: {fileID: 0}
    - target: {fileID: 400000, guid: 03a233d58ffbbf144b1e7bec834d591d, type: 3}
      propertyPath: m_LocalEulerAnglesHint.x
      value: 12.924001
      objectReference: {fileID: 0}
    - target: {fileID: 400000, guid: 03a233d58ffbbf144b1e7bec834d591d, type: 3}
      propertyPath: m_LocalEulerAnglesHint.y
      value: 13.111001
      objectReference: {fileID: 0}
    - target: {fileID: 400000, guid: 03a233d58ffbbf144b1e7bec834d591d, type: 3}
      propertyPath: m_LocalEulerAnglesHint.z
      value: 20.668001
      objectReference: {fileID: 0}
    - target: {fileID: 100000, guid: 03a233d58ffbbf144b1e7bec834d591d, type: 3}
      propertyPath: m_IsActive
      value: 1
      objectReference: {fileID: 0}
    - target: {fileID: 100002, guid: 03a233d58ffbbf144b1e7bec834d591d, type: 3}
      propertyPath: m_IsActive
      value: 1
      objectReference: {fileID: 0}
    m_RemovedComponents: []
  m_ParentPrefab: {fileID: 100100000, guid: 03a233d58ffbbf144b1e7bec834d591d, type: 3}
  m_IsPrefabParent: 0
--- !u!1001 &2045758144
Prefab:
  m_ObjectHideFlags: 0
  serializedVersion: 2
  m_Modification:
    m_TransformParent: {fileID: 0}
    m_Modifications:
    - target: {fileID: 400002, guid: 48d16237984e91e4d93fcd5d81b9c6a9, type: 3}
      propertyPath: m_LocalPosition.x
      value: -612
      objectReference: {fileID: 0}
    - target: {fileID: 400002, guid: 48d16237984e91e4d93fcd5d81b9c6a9, type: 3}
      propertyPath: m_LocalPosition.y
      value: -245
      objectReference: {fileID: 0}
    - target: {fileID: 400002, guid: 48d16237984e91e4d93fcd5d81b9c6a9, type: 3}
      propertyPath: m_LocalPosition.z
      value: 777
      objectReference: {fileID: 0}
    - target: {fileID: 400002, guid: 48d16237984e91e4d93fcd5d81b9c6a9, type: 3}
      propertyPath: m_LocalRotation.x
      value: -0
      objectReference: {fileID: 0}
    - target: {fileID: 400002, guid: 48d16237984e91e4d93fcd5d81b9c6a9, type: 3}
      propertyPath: m_LocalRotation.y
      value: -0.35192764
      objectReference: {fileID: 0}
    - target: {fileID: 400002, guid: 48d16237984e91e4d93fcd5d81b9c6a9, type: 3}
      propertyPath: m_LocalRotation.z
      value: -0
      objectReference: {fileID: 0}
    - target: {fileID: 400002, guid: 48d16237984e91e4d93fcd5d81b9c6a9, type: 3}
      propertyPath: m_LocalRotation.w
      value: 0.9360272
      objectReference: {fileID: 0}
    - target: {fileID: 400002, guid: 48d16237984e91e4d93fcd5d81b9c6a9, type: 3}
      propertyPath: m_RootOrder
      value: 2
      objectReference: {fileID: 0}
    - target: {fileID: 2300000, guid: 48d16237984e91e4d93fcd5d81b9c6a9, type: 3}
      propertyPath: m_Materials.Array.data[0]
      value: 
      objectReference: {fileID: 2100000, guid: b9dd07a8482b5654c8f20773dd1f33ac, type: 2}
    - target: {fileID: 2300000, guid: 48d16237984e91e4d93fcd5d81b9c6a9, type: 3}
      propertyPath: m_Materials.Array.data[1]
      value: 
      objectReference: {fileID: 2100000, guid: ee03d97cf641a384b8aa80b37a8e1a59, type: 2}
    - target: {fileID: 400000, guid: 48d16237984e91e4d93fcd5d81b9c6a9, type: 3}
      propertyPath: m_LocalRotation.x
      value: 0.0052153966
      objectReference: {fileID: 0}
    - target: {fileID: 400000, guid: 48d16237984e91e4d93fcd5d81b9c6a9, type: 3}
      propertyPath: m_LocalRotation.y
      value: 0.9849423
      objectReference: {fileID: 0}
    - target: {fileID: 400000, guid: 48d16237984e91e4d93fcd5d81b9c6a9, type: 3}
      propertyPath: m_LocalRotation.w
      value: 0.17014715
      objectReference: {fileID: 0}
    - target: {fileID: 400000, guid: 48d16237984e91e4d93fcd5d81b9c6a9, type: 3}
      propertyPath: m_LocalEulerAnglesHint.y
      value: 160.39801
      objectReference: {fileID: 0}
    - target: {fileID: 400000, guid: 48d16237984e91e4d93fcd5d81b9c6a9, type: 3}
      propertyPath: m_LocalRotation.z
      value: -0.030190727
      objectReference: {fileID: 0}
    - target: {fileID: 400000, guid: 48d16237984e91e4d93fcd5d81b9c6a9, type: 3}
      propertyPath: m_LocalEulerAnglesHint.x
      value: 3.5110002
      objectReference: {fileID: 0}
    - target: {fileID: 400000, guid: 48d16237984e91e4d93fcd5d81b9c6a9, type: 3}
      propertyPath: m_LocalPosition.x
      value: 0
      objectReference: {fileID: 0}
    - target: {fileID: 400000, guid: 48d16237984e91e4d93fcd5d81b9c6a9, type: 3}
      propertyPath: m_LocalPosition.y
      value: 0
      objectReference: {fileID: 0}
    - target: {fileID: 400000, guid: 48d16237984e91e4d93fcd5d81b9c6a9, type: 3}
      propertyPath: m_LocalPosition.z
      value: 0
      objectReference: {fileID: 0}
    - target: {fileID: 400002, guid: 48d16237984e91e4d93fcd5d81b9c6a9, type: 3}
      propertyPath: m_LocalScale.x
      value: 201.96532
      objectReference: {fileID: 0}
    - target: {fileID: 400002, guid: 48d16237984e91e4d93fcd5d81b9c6a9, type: 3}
      propertyPath: m_LocalScale.y
      value: 201.9656
      objectReference: {fileID: 0}
    - target: {fileID: 400002, guid: 48d16237984e91e4d93fcd5d81b9c6a9, type: 3}
      propertyPath: m_LocalScale.z
      value: 201.9656
      objectReference: {fileID: 0}
    - target: {fileID: 400002, guid: 48d16237984e91e4d93fcd5d81b9c6a9, type: 3}
      propertyPath: m_LocalEulerAnglesHint.y
      value: -41.211002
      objectReference: {fileID: 0}
    m_RemovedComponents: []
  m_ParentPrefab: {fileID: 100100000, guid: 48d16237984e91e4d93fcd5d81b9c6a9, type: 3}
  m_IsPrefabParent: 0
--- !u!1 &2085205332
GameObject:
  m_ObjectHideFlags: 0
  m_PrefabParentObject: {fileID: 0}
  m_PrefabInternal: {fileID: 0}
  serializedVersion: 5
  m_Component:
  - component: {fileID: 2085205333}
  - component: {fileID: 2085205335}
  - component: {fileID: 2085205334}
  m_Layer: 5
  m_Name: Text
  m_TagString: Untagged
  m_Icon: {fileID: 0}
  m_NavMeshLayer: 0
  m_StaticEditorFlags: 0
  m_IsActive: 1
--- !u!224 &2085205333
RectTransform:
  m_ObjectHideFlags: 0
  m_PrefabParentObject: {fileID: 0}
  m_PrefabInternal: {fileID: 0}
  m_GameObject: {fileID: 2085205332}
  m_LocalRotation: {x: 0, y: 0, z: 0, w: 1}
  m_LocalPosition: {x: 0, y: 34, z: 0}
  m_LocalScale: {x: 1, y: 1, z: 1}
  m_Children: []
  m_Father: {fileID: 1549719901}
  m_RootOrder: 1
  m_LocalEulerAnglesHint: {x: 0, y: 0, z: 0}
  m_AnchorMin: {x: 0.5, y: 0.5}
  m_AnchorMax: {x: 0.5, y: 0.5}
  m_AnchoredPosition: {x: 0, y: 34}
  m_SizeDelta: {x: 160, y: 30}
  m_Pivot: {x: 0.5, y: 0.5}
--- !u!114 &2085205334
MonoBehaviour:
  m_ObjectHideFlags: 0
  m_PrefabParentObject: {fileID: 0}
  m_PrefabInternal: {fileID: 0}
  m_GameObject: {fileID: 2085205332}
  m_Enabled: 1
  m_EditorHideFlags: 0
  m_Script: {fileID: 708705254, guid: f70555f144d8491a825f0804e09c671c, type: 3}
  m_Name: 
  m_EditorClassIdentifier: 
  m_Material: {fileID: 0}
  m_Color: {r: 0, g: 0, b: 0, a: 1}
  m_RaycastTarget: 1
  m_OnCullStateChanged:
    m_PersistentCalls:
      m_Calls: []
    m_TypeName: UnityEngine.UI.MaskableGraphic+CullStateChangedEvent, UnityEngine.UI,
      Version=1.0.0.0, Culture=neutral, PublicKeyToken=null
  m_FontData:
    m_Font: {fileID: 12800000, guid: 434ff1b73022c4b43a3f292fca5e6c3a, type: 3}
    m_FontSize: 45
    m_FontStyle: 0
    m_BestFit: 0
    m_MinSize: 2
    m_MaxSize: 52
    m_Alignment: 4
    m_AlignByGeometry: 0
    m_RichText: 1
    m_HorizontalOverflow: 1
    m_VerticalOverflow: 1
    m_LineSpacing: 1.03
  m_Text: NEW AWESOMEST GAMEST GAME
--- !u!222 &2085205335
CanvasRenderer:
  m_ObjectHideFlags: 0
  m_PrefabParentObject: {fileID: 0}
  m_PrefabInternal: {fileID: 0}
  m_GameObject: {fileID: 2085205332}
