C:\Users\SDUBL97\Documents\AccADDemICT\ProjectExercise\togethairgroup2\src\main\java\com\realdolmen\air\beans\AirportSearchBean.java
C:\Users\SDUBL97\Documents\AccADDemICT\ProjectExercise\togethairgroup2\src\main\java\com\realdolmen\air\exceptions\InvalidCapacityException.java
C:\Users\SDUBL97\Documents\AccADDemICT\ProjectExercise\togethairgroup2\src\main\java\com\realdolmen\air\datamodel\accounts\Person.java
C:\Users\SDUBL97\Documents\AccADDemICT\ProjectExercise\togethairgroup2\src\main\java\com\realdolmen\air\datamodel\flightmodel\Airport.java
C:\Users\SDUBL97\Documents\AccADDemICT\ProjectExercise\togethairgroup2\src\main\java\com\realdolmen\air\util\FlightRouteCountryComparator.java
C:\Users\SDUBL97\Documents\AccADDemICT\ProjectExercise\togethairgroup2\src\main\java\com\realdolmen\air\datamodel\accounts\Partner.java
C:\Users\SDUBL97\Documents\AccADDemICT\ProjectExercise\togethairgroup2\src\main\java\com\realdolmen\air\util\InputTester.java
C:\Users\SDUBL97\Documents\AccADDemICT\ProjectExercise\togethairgroup2\src\main\java\com\realdolmen\air\services\PersonService.java
C:\Users\SDUBL97\Documents\AccADDemICT\ProjectExercise\togethairgroup2\src\main\java\com\realdolmen\air\exceptions\InvalidTimeZoneException.java
C:\Users\SDUBL97\Documents\AccADDemICT\ProjectExercise\togethairgroup2\src\main\java\com\realdolmen\air\exceptions\InvalidStringArgException.java
C:\Users\SDUBL97\Documents\AccADDemICT\ProjectExercise\togethairgroup2\src\main\java\com\realdolmen\air\datamodel\Booking.java
C:\Users\SDUBL97\Documents\AccADDemICT\ProjectExercise\togethairgroup2\src\main\java\com\realdolmen\air\beans\LanguageSwitcher.java
C:\Users\SDUBL97\Documents\AccADDemICT\ProjectExercise\togethairgroup2\src\main\java\com\realdolmen\air\util\UserRole.java
C:\Users\SDUBL97\Documents\AccADDemICT\ProjectExercise\togethairgroup2\src\main\java\com\realdolmen\air\util\AirlineLuxuryClassEnum.java
C:\Users\SDUBL97\Documents\AccADDemICT\ProjectExercise\togethairgroup2\src\main\java\com\realdolmen\air\util\FlightRouteNameComparator.java
C:\Users\SDUBL97\Documents\AccADDemICT\ProjectExercise\togethairgroup2\src\main\java\com\realdolmen\air\util\LocalDateTimeAttributeConverter.java
C:\Users\SDUBL97\Documents\AccADDemICT\ProjectExercise\togethairgroup2\src\main\java\com\realdolmen\air\services\FlightSearchService.java
C:\Users\SDUBL97\Documents\AccADDemICT\ProjectExercise\togethairgroup2\src\main\java\com\realdolmen\air\beans\AirportBean.java
C:\Users\SDUBL97\Documents\AccADDemICT\ProjectExercise\togethairgroup2\src\main\java\com\realdolmen\air\beans\RouteSearchBean.java
C:\Users\SDUBL97\Documents\AccADDemICT\ProjectExercise\togethairgroup2\src\main\java\com\realdolmen\air\exceptions\InvalidScheduleException.java
C:\Users\SDUBL97\Documents\AccADDemICT\ProjectExercise\togethairgroup2\src\main\java\com\realdolmen\air\services\LoginService.java
C:\Users\SDUBL97\Documents\AccADDemICT\ProjectExercise\togethairgroup2\src\main\java\com\realdolmen\air\datamodel\LuxuryWithCapacityAndPrices.java
C:\Users\SDUBL97\Documents\AccADDemICT\ProjectExercise\togethairgroup2\src\main\java\com\realdolmen\air\beans\FlightCreationBean.java
C:\Users\SDUBL97\Documents\AccADDemICT\ProjectExercise\togethairgroup2\src\main\java\com\realdolmen\air\services\SearchResultBean.java
C:\Users\SDUBL97\Documents\AccADDemICT\ProjectExercise\togethairgroup2\src\main\java\com\realdolmen\air\util\VolumeDiscountComparator.java
C:\Users\SDUBL97\Documents\AccADDemICT\ProjectExercise\togethairgroup2\src\main\java\com\realdolmen\air\beans\FlightSearchBean.java
C:\Users\SDUBL97\Documents\AccADDemICT\ProjectExercise\togethairgroup2\src\main\java\com\realdolmen\air\util\StringToDateConverter.java
C:\Users\SDUBL97\Documents\AccADDemICT\ProjectExercise\togethairgroup2\src\main\java\com\realdolmen\air\exceptions\NotValidFormException.java
C:\Users\SDUBL97\Documents\AccADDemICT\ProjectExercise\togethairgroup2\src\main\java\com\realdolmen\air\services\DateBean.java
C:\Users\SDUBL97\Documents\AccADDemICT\ProjectExercise\togethairgroup2\src\main\java\com\realdolmen\air\datamodel\flightmodel\Airline.java
C:\Users\SDUBL97\Documents\AccADDemICT\ProjectExercise\togethairgroup2\src\main\java\com\realdolmen\air\beans\AirlineSearchBean.java
C:\Users\SDUBL97\Documents\AccADDemICT\ProjectExercise\togethairgroup2\src\main\java\com\realdolmen\air\exceptions\InvalidPasswordException.java
C:\Users\SDUBL97\Documents\AccADDemICT\ProjectExercise\togethairgroup2\src\main\java\com\realdolmen\air\datamodel\flightmodel\FlightRoute.java
C:\Users\SDUBL97\Documents\AccADDemICT\ProjectExercise\togethairgroup2\src\main\java\com\realdolmen\air\beans\CurrentUser.java
C:\Users\SDUBL97\Documents\AccADDemICT\ProjectExercise\togethairgroup2\src\main\java\com\realdolmen\air\datamodel\VolumeDiscount.java
C:\Users\SDUBL97\Documents\AccADDemICT\ProjectExercise\togethairgroup2\src\main\java\com\realdolmen\air\beans\AirportAutoCompleteBean.java
C:\Users\SDUBL97\Documents\AccADDemICT\ProjectExercise\togethairgroup2\src\main\java\com\realdolmen\air\datamodel\flightmodel\FlightInstance.java
C:\Users\SDUBL97\Documents\AccADDemICT\ProjectExercise\togethairgroup2\src\main\java\com\realdolmen\air\util\PayementStatus.java
