{{ define "response" }}
[{{ range $index, $page := .Site.Pages }}{{ if ne $index 0 }},{{ end }}
    {
        "ref": "{{ $page.Permalink }}",
        "title": {{ $page.Title | jsonify }},
        "section": "{{ $page.Section }}",
        "date" : {{ $page.Date.Format "2006.01.02" | jsonify }},
        "body": {{ $page.Plain | jsonify }}
    }
{{ end }}]
{{ end }}