﻿#
#  Locale language support:fr
#

#
# RES_ID: Resource ID 
# MAX_LEN_OF_BYTE_FULL: Maximun length of full name (counted by bytes) 
# MAX_LEN_OF_BYTE_ABBR: Maximun length of abbreviated name (counted by bytes)
# FULL_IN_EN: Full English name
# ABBR_IN_EN: Abbreviated English name
# FULL_IN_LOCALE: Full name in locale language
# ABBR_IN_LOCALE: Abbreviated locale name
#
[LOCALE_LANGUAGE]
fr


[RES_INFO]
#RES_ID		MAX_LEN_OF_BYTE_FULL	MAX_LEN_OF_BYTE_ABBR	FULL_IN_EN			ABBR_IN_EN		FULL_IN_LOCALE		ABBR_IN_LOCALE
1		32			15			TSI Group			TSI Group		TSI Groupe			TSI Groupe
2		32			15			Number of TSI			NumOfTSI		Nombre de TSI			Nombre de TSI
3		32			15			Communication Fail		Comm Fail		Echec de communication		Echec Comm
4		32			15			Existence State			Existence State		Etat d'existence		Etat Existence
5		32			15			Existent			Existent		Existant			Existant
6		32			15			Not Existent			Not Existent		Non existant			Non existant
7		32			15			TSI Existence State		TSI State		TSI Etat			TSI Etat


