﻿#
#  Locale language support:chinese
#

#
# RES_ID: Resource ID 
# MAX_LEN_OF_BYTE_FULL: Maximun length of full name (counted by bytes) 
# MAX_LEN_OF_BYTE_ABBR: Maximun length of abbreviated name (counted by bytes)
# FULL_IN_EN: Full English name
# ABBR_IN_EN: Abbreviated English name
# FULL_IN_LOCALE: Full name in locale language
# ABBR_IN_LOCALE: Abbreviated locale name
#
[LOCALE_LANGUAGE]
zh


[RES_INFO]
#RES_ID		MAX_LEN_OF_BYTE_FULL	MAX_LEN_OF_BYTE_ABBR	FULL_IN_EN			ABBR_IN_EN		FULL_IN_LOCALE		ABBR_IN_LOCALE
1		32			15			BMS Group			BMS Group		BMS Группа			BMS Группа
2		32			15			Number of BMS		NumOfBMS		Количество BMS		КоличествоBMS
3		32			15			Communication Fail		Comm Fail		Связь Сбой		Связь Сбой
4		32			15			Existence State			Existence State		Существование		Существование
5		32			15			Existent			Existent		существующий			существующий
6		32			15			Not Existent			Not Existent		не Существующее			не Существующее
7		32			15			BMS Existence State	BMSState		BMS Существование 	BMS состояние


