﻿#
# Locale language support: fr
#

#
# RES_ID: Resource ID
# MAX_LEN_OF_BYTE_FULL: Maximum length of full name (counted by bytes)
# MAX_LEN_OF_BYTE_ABBR: Maximum length of abbreviated name (counted by bytes)
# FULL_IN_EN: Full English name
# ABBR_IN_EN: Abbreviated English name
# FULL_IN_LOCALE: Full locale name
# ABBR_IN_LOCALE: Abbreviated locale name
#

[LOCALE_LANGUAGE]
fr

[RES_INFO]
#RES_ID		MAX_LEN_OF_BYTE_FULL	MAX_LEN_OF_BYTE_ABBR	FULL_IN_EN				ABBR_IN_EN		FULL_IN_LOCALE				ABBR_IN_LOCALE
1		32			15			SMDUHH Group				SMDUHH Group		Groupe SMDUHH				Groupe SMDUHH
2		32			15			Standby					Standby			Standby					Standby
3		32			15			Refresh					Refresh			Actualiser				Actualiser
4		32			15			Setting Refresh				Setting Refresh		Actualiser Paramètre 	Actualiser Paramètre
5		32			15			E-Stop					E-Stop			E-Stop					E-Stop
6		32			15			Yes					Yes			Oui					Oui
7		32			15			Existence State				Existence State		Etat existant				Etat existant
8		32			15			Existent				Existent		Existant				Existant
9		32			15			Not Existent				Not Existent		Inexistant				Inexistant
10		32			15			Number of SMDUHHs			Num of SMDUHHs		Quantité de SMDUHH	Qte de SMDUHH
11		32			15			SMDUHH Config Changed			Cfg Changed		Config SMDU modifiee	Conf SMDU modif
12		32			15			Not Changed				Not Changed		Non modifie				Non modifie
13		32			15			Changed					Changed			Modifie					Modifie
