﻿#
# Locale language support:  Portuguese
#

#
# RES_ID: Resource ID
# MAX_LEN_OF_BYTE_FULL: Maximum length of full name (counted by bytes)
# MAX_LEN_OF_BYTE_ABBR: Maximum length of abbreviated name (counted by bytes)
# FULL_IN_EN: Full English name
# ABBR_IN_EN: Abbreviated English name
# FULL_IN_LOCALE: Full locale name
# ABBR_IN_LOCALE: Abbreviated locale name
#

[LOCALE_LANGUAGE]
pt

[RES_INFO]
#RES_ID		MAX_LEN_OF_BYTE_FULL	MAX_LEN_OF_BYTE_ABBR	FULL_IN_EN				ABBR_IN_EN		FULL_IN_LOCALE				ABBR_IN_LOCALE
1		32			15			LVD Unit				LVD			LVD					LVD
11		32			15			Connect					Connect			Fechado					Fechado
12		32			15			Disconnect				Disconnect		Aberto					Aberto
13		32			15			No					No			Não					Não
14		32			15			Yes					Yes			Sim					Sim
21		32			15			LVD1 Status				LVD1 Status		Estado LVD1				Estado LVD1
22		32			15			LVD2 Status				LVD2 Status		Estado LVD2				Estado LVD2
23		32			15			LVD1 Fail				LVD1 Fail		Falha LVD1				Falha LVD1
24		32			15			LVD2 Fail				LVD2 Fail		Falha LVD2				Falha LVD2
25		32			15			Communication Fail			Comm Fail		Falha Comunicaτão			Falha Com
26		32			15			State					State			Estado					Estado
27		32			15			LVD1 Control				LVD1 Control		Controle LVD1				Control LVD1
28		32			15			LVD2 Control				LVD2 Control		Controle LVD2				Control LVD2
29		32			15			LVD Disabled				LVD Disabled		LVD Disabled				LVD Disabled
31		32			15			LVD1					LVD1			Desconexão LVD1			Descon LVD1
32		32			15			LVD1 Mode				LVD1 Mode		Modo LVD1				Modo LVD1
33		32			15			LVD1 Voltage				LVD1 Voltage		Tensão LVD1				Tensão LVD1
34		32			15			LVD1 Reconnect Voltage			LVD1 ReconnVolt		Tensão Reconexão LVD1			Tens recon LVD1
35		32			15			LVD1 Reconnect Delay			LVD1 ReconDelay		Retardo Reconexão LVD1			Ret recon LVD1
36		32			15			LVD1 Time				LVD1 Time		Tempo LVD1				Tempo LVD1
37		32			15			LVD1 Dependency				LVD1 Dependency		Dependencia LVD1			Depend LVD1
41		32			15			LVD2					LVD2			Desconexão LVD2			Descon LVD2
42		32			15			LVD2 Mode				LVD2 Mode		Modo LVD2				Modo LVD2
43		32			15			LVD2 Voltage				LVD2 Voltage		Tensão LVD2				Tensão LVD2
44		32			15			LVR2 Reconnect Voltage			LVR2 ReconnVolt		Tensão Reconexão LVD2			Tens recon LVD2
45		32			15			LVD2 Reconnect Delay			LVD2 ReconDelay		Retardo Reconexão LVD2			Retard recn LVD2
46		32			15			LVD2 Time				LVD2 Time		Tempo LVD2				Tempo LVD2
47		32			15			LVD2 Dependency				LVD2 Dependency		Dependencia LVD2			Depend LVD2
51		32			15			Disabled				Disabled		Desabilitada				Desabilitada
52		32			15			Enabled					Enabled			Habilitada				Habilitada
53		32			15			By Voltage				By Voltage		Tensão					Tensão
54		32			15			By Time					By Time			Tempo					Tempo
55		32			15			None					None			Nenhum					Nenhum
56		32			15			LVD1					LVD1			LVD1					LVD1
57		32			15			LVD2					LVD2			LVD2					LVD2
103		32			15			High Temp Disconnect 1			HTD1			Habilitada HTD1				Habil HTD1
104		32			15			High Temp Disconnect 2			HTD2			Habilitada HTD2				Habil HTD2
105		32			15			Battery LVD				Batt LVD		LVD de Bateria				LVD Bateria
106		32			15			No Battery				No Batt			Sem Bateria				Sem Bateria
107		32			15			LVD1					LVD1			LVD1					LVD1
108		32			15			LVD2					LVD2			LVD2					LVD2
109		32			15			Battery Always On			BattAlwaysOn		Bateria sempre conectada		Sempre com Bat
110		32			15			LVD Contactor Type			LVD Type		Tipo contactor LVD			Tipo LVD
111		32			15			Bistable				Bistable		Biestavel				Biestavel
112		32			15			Monostable				Monostable		Monoestavel				Monoestavel
113		32			15			Monostable with Sampler			Mono with Samp		Estavel com sinal			Com sinal
116		32			15			LVD1 Disconnected			LVD1 Disconnect		LVD1 Aberto				LVD1 Aberto
117		32			15			LVD2 Disconnected			LVD2 Disconnect		LVD2 Aberto				LVD2 Aberto
118		32			15			LVD1 Monostable with Sampler		LVD1 Mono Sample	LVD1 Estavel com sinal			LVD1 com sinal
119		32			15			LVD2 Monostable with Sampler		LVD2 Mono Sample	LVD2 Estavel com sinal			LVD2 com sinal
125		32			15			State					State			Estado					Estado
126		32			15			LVD1 Voltage(24V)			LVD1 Voltage		Tensão LVD1(24V)			Tensão LVD1
127		32			15			LVD1 Reconnect Voltage(24V)		LVD1 ReconnVolt		Tensão Reconexão LVD1(24V)		Tens recon LVD1
128		32			15			LVD2 Voltage(24V)			LVD2 Voltage		Tensão LVD2(24V)			Tensão LVD2
129		32			15			LVD2 Reconnect Voltage(24V)		LVD2 ReconnVolt		Tensão Reconexão LVD2(24V)		Tens recon LVD2
130		32			15			LVD 3					LVD 3			LVD 3					LVD 3
200		32			15			Disconnect				Disconnect		Aberto					Aberto
201		32			15			Connect					Connect			Fechado					Fechado
