Domain,Sub-domain,Group-Id
Planning and Eng v45,Network Planning,5813221
,Template Management,5813221
,Engineering Design and Instance Creation,5813221
,Equipment Inventory,5813221
,Port and Connection Management,5813221
Service Provisioning45,5G Fixed Wireless Service Qualification,5813221
,FiOS Service Qualification,5813221
,VBI Service Qualification,5813221
,Enterprise Service Qualification,5813221
,LOB Order Transformation -  Standardization,5813221
Service-Assurance-v245,Wireline Performance Data Collection,5813221
,Wireless Performance Data Collection,5813221
,Fault and Alarms Data Collection,5813221
,Logs Data Collection,5813221
,Data Processing-Intra Domain-Inter Domain Correlations,5813221
