<svg width="31" height="31" viewBox="0 0 31 31" fill="none" xmlns="http://www.w3.org/2000/svg">
<g clip-path="url(#clip0)">
<path d="M15.5276 16.7761C15.5591 16.7761 15.5906 16.7761 15.6284 16.7761C15.641 16.7761 15.6536 16.7761 15.6662 16.7761C15.6851 16.7761 15.7104 16.7761 15.7293 16.7761C17.5759 16.7446 19.0696 16.0954 20.1725 14.8538C22.599 12.1185 22.1956 7.42945 22.1515 6.98198C21.994 3.62274 20.4057 2.0156 19.0948 1.26561C18.1179 0.704683 16.9772 0.402163 15.7041 0.376953H15.6599C15.6536 0.376953 15.641 0.376953 15.6347 0.376953H15.5969C14.8973 0.376953 13.5234 0.490398 12.2062 1.2404C10.8826 1.99039 9.2692 3.59753 9.11164 6.98198C9.06752 7.42945 8.66416 12.1185 11.0906 14.8538C12.1873 16.0954 13.681 16.7446 15.5276 16.7761ZM10.7944 7.13954C10.7944 7.12063 10.8007 7.10172 10.8007 7.08912C11.0087 2.57022 14.2167 2.08493 15.5906 2.08493H15.6158C15.6284 2.08493 15.6473 2.08493 15.6662 2.08493C17.3679 2.12275 20.2608 2.81602 20.4561 7.08912C20.4561 7.10803 20.4561 7.12693 20.4624 7.13954C20.4687 7.18366 20.9099 11.4694 18.9057 13.7257C18.1116 14.6206 17.0528 15.0618 15.6599 15.0744C15.6473 15.0744 15.641 15.0744 15.6284 15.0744C15.6158 15.0744 15.6095 15.0744 15.5969 15.0744C14.2104 15.0618 13.1452 14.6206 12.3574 13.7257C10.3595 11.482 10.7881 7.17735 10.7944 7.13954Z" fill="white"/>
<path d="M28.5799 24.5524C28.5799 24.5461 28.5799 24.5398 28.5799 24.5335C28.5799 24.4831 28.5736 24.4326 28.5736 24.3759C28.5358 23.128 28.4539 20.21 25.7186 19.2772C25.6997 19.2709 25.6745 19.2646 25.6556 19.2583C22.8132 18.5335 20.4497 16.8948 20.4245 16.8759C20.0401 16.6049 19.5106 16.6995 19.2396 17.0839C18.9686 17.4684 19.0632 17.9978 19.4476 18.2688C19.5548 18.3444 22.0632 20.0902 25.2018 20.8969C26.6703 21.42 26.8341 22.9894 26.8783 24.4263C26.8783 24.4831 26.8783 24.5335 26.8846 24.5839C26.8909 25.1511 26.8531 26.0272 26.7522 26.5314C25.7312 27.1112 21.7291 29.1154 15.6409 29.1154C9.5779 29.1154 5.5506 27.1049 4.52329 26.5251C4.42245 26.0209 4.37833 25.1448 4.39094 24.5776C4.39094 24.5272 4.39724 24.4767 4.39724 24.42C4.44136 22.9831 4.60522 21.4137 6.0737 20.8906C9.21235 20.0839 11.7207 18.3318 11.8279 18.2625C12.2123 17.9915 12.3069 17.4621 12.0359 17.0776C11.7649 16.6932 11.2355 16.5986 10.851 16.8696C10.8258 16.8885 8.47496 18.5272 5.61992 19.252C5.59471 19.2583 5.57581 19.2646 5.5569 19.2709C2.82161 20.21 2.73968 23.128 2.70187 24.3696C2.70187 24.4263 2.70187 24.4768 2.69556 24.5272C2.69556 24.5335 2.69556 24.5398 2.69556 24.5461C2.68926 24.8738 2.68296 26.5566 3.01699 27.4011C3.08002 27.565 3.19346 27.7036 3.34472 27.7982C3.5338 27.9242 8.0653 30.8108 15.6472 30.8108C23.2291 30.8108 27.7606 27.9179 27.9497 27.7982C28.0946 27.7036 28.2144 27.565 28.2774 27.4011C28.5925 26.5629 28.5862 24.8801 28.5799 24.5524Z" fill="white"/>
</g>
<defs>
<clipPath id="clip0">
<rect x="0.42041" y="0.376953" width="30.4348" height="30.4348" fill="white"/>
</clipPath>
</defs>
</svg>
