<svg width="30" height="30" viewBox="0 0 30 30" fill="none" xmlns="http://www.w3.org/2000/svg">
<path d="M29.5 17H29V15.5C28.9987 14.5071 28.41 13.6091 27.5 13.212V5.5C27.4999 5.30125 27.3821 5.1215 27.2 5.042C27.3951 4.72938 27.4989 4.3685 27.5 4C27.5 2.89544 26.6046 2 25.5 2C24.3954 2 23.5 2.89544 23.5 4C23.5021 4.35213 23.5981 4.69731 23.778 5H6.222C6.40194 4.69731 6.49794 4.35213 6.5 4C6.5 2.89544 5.60456 2 4.5 2C3.39544 2 2.5 2.89544 2.5 4C2.50106 4.3685 2.60494 4.72938 2.8 5.042C2.61787 5.1215 2.50012 5.30125 2.5 5.5V13.212C1.59 13.6091 1.00131 14.5071 1 15.5V17H0.5C0.223875 17 0 17.2239 0 17.5V24.5C0 24.7761 0.223875 25 0.5 25H1V27.5C1 27.7761 1.22388 28 1.5 28H3.5C3.77612 28 4 27.7761 4 27.5V25H26V27.5C26 27.7761 26.2239 28 26.5 28H28.5C28.7761 28 29 27.7761 29 27.5V25H29.5C29.7761 25 30 24.7761 30 24.5V17.5C30 17.2239 29.7761 17 29.5 17ZM25.5 3C26.0523 3 26.5 3.44769 26.5 4C26.5 4.55231 26.0523 5 25.5 5C24.9477 5 24.5 4.55231 24.5 4C24.5 3.44769 24.9477 3 25.5 3ZM4.5 3C5.05231 3 5.5 3.44769 5.5 4C5.5 4.55231 5.05231 5 4.5 5C3.94769 5 3.5 4.55231 3.5 4C3.5 3.44769 3.94769 3 4.5 3ZM3.5 6H26.5V13H24.487C24.8179 12.5698 24.9982 12.0428 25 11.5V10.5C24.9984 9.12 23.88 8.00163 22.5 8H18.5C17.12 8.00163 16.0016 9.12 16 10.5V11.5C16.0018 12.0428 16.1821 12.5698 16.513 13H13.487C13.8179 12.5698 13.9982 12.0428 14 11.5V10.5C13.9984 9.12 12.88 8.00163 11.5 8H7.5C6.12 8.00163 5.00163 9.12 5 10.5V11.5C5.00181 12.0428 5.18213 12.5698 5.513 13H3.5V6ZM24 10.5V11.5C24 12.3284 23.3284 13 22.5 13H18.5C17.6716 13 17 12.3284 17 11.5V10.5C17 9.67156 17.6716 9 18.5 9H22.5C23.3284 9 24 9.67156 24 10.5ZM13 10.5V11.5C13 12.3284 12.3284 13 11.5 13H7.5C6.67156 13 6 12.3284 6 11.5V10.5C6 9.67156 6.67156 9 7.5 9H11.5C12.3284 9 13 9.67156 13 10.5ZM2 15.5C2 14.6716 2.67156 14 3.5 14H26.5C27.3284 14 28 14.6716 28 15.5V17H2V15.5ZM3 27H2V25H3V27ZM28 27H27V25H28V27ZM29 24H1V18H29V24Z" fill="white"/>
<path d="M4.5 22H2.5C2.22387 22 2 22.2239 2 22.5C2 22.7761 2.22387 23 2.5 23H4.5C4.77612 23 5 22.7761 5 22.5C5 22.2239 4.77612 22 4.5 22Z" fill="white"/>
<path d="M27.5 22H6.5C6.22388 22 6 22.2239 6 22.5C6 22.7761 6.22388 23 6.5 23H27.5C27.7761 23 28 22.7761 28 22.5C28 22.2239 27.7761 22 27.5 22Z" fill="white"/>
</svg>
