<svg width="26" height="26" viewBox="0 0 26 26" fill="none" xmlns="http://www.w3.org/2000/svg">
<g clip-path="url(#clip0)">
<path d="M5.36955 5.39551V10.1888L12.4537 7.77771L13.0001 7.59175L13.5464 7.77771L20.6304 10.1887V5.39551H5.36955Z" fill="#BE8D55"/>
<path d="M22.0536 23.9767C21.7562 24.1882 21.5923 24.3047 21.1812 24.3047C20.7701 24.3047 20.6062 24.1882 20.3088 23.9767C19.9279 23.7059 19.4063 23.335 18.4538 23.335C17.5013 23.335 16.9797 23.7059 16.5988 23.9768C16.3014 24.1882 16.1377 24.3047 15.7266 24.3047C15.3156 24.3047 15.1518 24.1882 14.8544 23.9768C14.4735 23.7059 13.9519 23.335 12.9994 23.335C12.0469 23.335 11.5254 23.7059 11.1446 23.9768C10.8472 24.1882 10.6835 24.3047 10.2724 24.3047C9.86137 24.3047 9.69755 24.1882 9.40027 23.9768C9.01941 23.7059 8.49789 23.335 7.54539 23.335C6.59288 23.335 6.07131 23.7059 5.6905 23.9768C5.39313 24.1882 5.22941 24.3047 4.81833 24.3047C4.40731 24.3047 4.24349 24.1882 3.94622 23.9768C3.56536 23.706 3.04378 23.335 2.09128 23.335V25.0306C2.5023 25.0306 2.66612 25.1471 2.96345 25.3586C3.34425 25.6294 3.86583 26.0003 4.81833 26.0003C5.77084 26.0003 6.29241 25.6294 6.67327 25.3585C6.97064 25.1471 7.13441 25.0306 7.54554 25.0306C7.95656 25.0306 8.12038 25.1471 8.41766 25.3585C8.79851 25.6294 9.32004 26.0003 10.2725 26.0003C11.225 26.0003 11.7466 25.6294 12.1274 25.3585C12.4248 25.1471 12.5885 25.0306 12.9995 25.0306C13.4106 25.0306 13.5744 25.1471 13.8718 25.3585C14.2527 25.6294 14.7742 26.0003 15.7268 26.0003C16.6793 26.0003 17.2008 25.6294 17.5816 25.3585C17.879 25.1471 18.0428 25.0306 18.4539 25.0306C18.865 25.0306 19.0289 25.1471 19.3263 25.3586C19.7071 25.6294 20.2288 26.0003 21.1813 26.0003C22.1339 26.0003 22.6555 25.6294 23.0364 25.3586C23.3338 25.1471 23.4977 25.0306 23.9088 25.0306V23.335C22.9561 23.335 22.4344 23.7059 22.0536 23.9767Z" fill="#BE8D55"/>
<path d="M13.8478 1.3V0H12.1522V1.3H8.13911V3.69957H17.9174V1.3H13.8478Z" fill="#BE8D55"/>
<path d="M2.43414 12.9784L6.0223 21.8838C6.43799 21.7405 6.94093 21.6387 7.54543 21.6387C8.92912 21.6387 9.78108 22.172 10.2724 22.5161C10.6541 22.2488 11.2549 21.8684 12.1521 21.7114V9.6709L2.43414 12.9784Z" fill="#BE8D55"/>
<path d="M13.8478 9.6709V21.7116C14.7446 21.8687 15.3451 22.249 15.7266 22.5161C16.218 22.1721 17.07 21.6387 18.4538 21.6387C19.0418 21.6387 19.533 21.7355 19.9422 21.8727L23.5696 12.9796L13.8478 9.6709Z" fill="#BE8D55"/>
</g>
<defs>
<clipPath id="clip0">
<rect width="26" height="26" fill="white"/>
</clipPath>
</defs>
</svg>
