<svg width="27" height="24" viewBox="0 0 27 24" fill="none" xmlns="http://www.w3.org/2000/svg">
<path d="M12.9007 15.3444C13.0719 15.4949 13.2856 15.5704 13.4995 15.5704C13.7134 15.5704 13.9272 15.4949 14.0983 15.3444C14.3151 15.1534 19.4063 10.6154 19.4063 5.90903C19.4063 2.6508 16.7566 0 13.4996 0C10.2424 0 7.59264 2.6508 7.59264 5.90903C7.59245 10.6154 12.6839 15.1534 12.9007 15.3444ZM13.4995 4.36509C14.3451 4.36509 15.0308 5.05616 15.0308 5.90903C15.0308 6.76181 14.3451 7.45297 13.4995 7.45297C12.6536 7.45297 11.968 6.76172 11.968 5.90903C11.968 5.05616 12.6536 4.36509 13.4995 4.36509Z" fill="#BE8D55"/>
<path d="M24.8496 15.3423L24.1653 12.9445C24.0542 12.5554 23.6987 12.2871 23.2942 12.2871H18.4108C18.2343 12.5496 18.048 12.813 17.851 13.0779C16.4823 14.9169 15.0908 16.1609 14.9365 16.2969C14.5393 16.6467 14.029 16.8393 13.4995 16.8393C12.9703 16.8393 12.4601 16.6468 12.0623 16.2967C11.9082 16.1609 10.5165 14.9167 9.14783 13.0779C8.95084 12.813 8.76458 12.5495 8.58804 12.2871H3.7046C3.30007 12.2871 2.94454 12.5554 2.83346 12.9445L2.01794 15.8022L20.2471 19.1412L24.8496 15.3423Z" fill="#BE8D55"/>
<path d="M26.964 22.7526L25.2159 16.626L16.5424 23.9073H26.093C26.3772 23.9073 26.6449 23.774 26.8161 23.5471C26.9873 23.3201 27.0419 23.0259 26.964 22.7526Z" fill="#BE8D55"/>
<path d="M4.43549 17.5342L1.66833 17.0273L0.0347592 22.7525C-0.0431467 23.0257 0.0114875 23.3199 0.182753 23.5468C0.353928 23.7737 0.621644 23.9071 0.905905 23.9071H4.43549V17.5342Z" fill="#BE8D55"/>
<path d="M5.70389 17.7656V23.906H14.5696L18.9862 20.1984L5.70389 17.7656Z" fill="#BE8D55"/>
</svg>
