<svg width="20" height="20" viewBox="0 0 20 20" fill="none" xmlns="http://www.w3.org/2000/svg">
<path d="M19.8255 18.98L14.9652 14.1197C16.2689 12.6208 17.0583 10.6652 17.0583 8.52772C17.0583 3.82262 13.2313 0 8.53059 0C3.8255 0 0.0028801 3.82705 0.0028801 8.52772C0.0028801 13.2284 3.82993 17.0554 8.53059 17.0554C10.6681 17.0554 12.6237 16.2661 14.1226 14.9623L18.9829 19.8226C19.0982 19.9379 19.2534 20 19.4042 20C19.555 20 19.7102 19.9424 19.8255 19.8226C20.0561 19.592 20.0561 19.2106 19.8255 18.98ZM1.19578 8.52772C1.19578 4.48337 4.48625 1.19734 8.52616 1.19734C12.5705 1.19734 15.8565 4.4878 15.8565 8.52772C15.8565 12.5676 12.5705 15.8625 8.52616 15.8625C4.48625 15.8625 1.19578 12.5721 1.19578 8.52772Z" fill="#233D57" fill-opacity="0.4"/>
</svg>
