<svg width="26" height="26" viewBox="0 0 26 26" fill="none" xmlns="http://www.w3.org/2000/svg">
<path d="M24.175 8.17773H23.4629V16.0046C23.4629 17.2233 22.7533 18.3252 21.3308 18.3252H7.39417V18.6973C7.39417 19.7747 8.61961 20.8623 9.87805 20.8623H20.5333L24.6097 23.259L24.0185 20.8623H24.175C25.4325 20.8623 26 19.7773 26 18.6973V10.0357C26 8.95831 25.4325 8.17773 24.175 8.17773Z" fill="#BE8D55"/>
<path d="M19.2503 2.74023H3.0632C1.63901 2.74023 0 4.00539 0 5.22488V15.0349C0 16.158 1.38867 16.969 2.72068 17.0942L1.85382 20.3848L7.40852 17.117H19.2503C20.6745 17.117 21.9887 16.2536 21.9887 15.0349V7.09809V5.22488C21.9887 4.00539 20.6736 2.74023 19.2503 2.74023ZM5.53271 11.0213C4.72504 11.0213 4.07046 10.3667 4.07046 9.55906C4.07046 8.75142 4.72504 8.09686 5.53271 8.09686C6.33952 8.09686 6.99496 8.75142 6.99496 9.55906C6.99496 10.3667 6.33952 11.0213 5.53271 11.0213ZM10.9944 11.0213C10.1867 11.0213 9.53212 10.3667 9.53212 9.55906C9.53212 8.75142 10.1867 8.09686 10.9944 8.09686C11.802 8.09686 12.4566 8.75142 12.4566 9.55906C12.4566 10.3667 11.802 11.0213 10.9944 11.0213ZM16.4569 11.0213C15.6492 11.0213 14.9938 10.3667 14.9938 9.55906C14.9938 8.75142 15.6492 8.09686 16.4569 8.09686C17.2629 8.09686 17.9191 8.75142 17.9191 9.55906C17.9191 10.3667 17.2629 11.0213 16.4569 11.0213Z" fill="#BE8D55"/>
</svg>
