<svg width="16" height="20" viewBox="0 0 16 20" fill="none" xmlns="http://www.w3.org/2000/svg">
<path d="M13.5604 19.35H2.43961C1.5877 19.35 0.94875 18.5706 1.11582 17.7352L1.67272 14.9508C2.17286 12.4501 4.36858 10.65 6.91882 10.65L9.08118 10.65C11.6314 10.65 13.8271 12.4501 14.3273 14.9508L14.8842 17.7352C15.0512 18.5706 14.4123 19.35 13.5604 19.35Z" stroke-width="1.3"  fill="none"/>
<path d="M11.35 4C11.35 5.85016 9.85015 7.35001 8 7.35001C6.14985 7.35001 4.65 5.85016 4.65 4C4.65 2.14985 6.14985 0.65 8 0.65C9.85015 0.65 11.35 2.14985 11.35 4Z" stroke-width="1.3"  fill="none"/>
</svg>
