<svg width="783" height="355" viewBox="0 0 783 355" fill="none" xmlns="http://www.w3.org/2000/svg">
<g style="mix-blend-mode:soft-light">
<path d="M782.884 147.935L782.1 147.909L781.654 149.471L780.038 150.796L776.833 152.66L774 155.127L771.41 156.223L770.612 156.591L770.383 157.568L771.441 161.15L769.629 162.469L767.876 162.017L768.053 162.614L768.222 163.408L767.993 164.385L767.175 165.343L765.004 165.665L761.323 164.163L759.753 164.111L758.001 163.659L756.079 162.413L754.725 161.777L756.066 162.806L756.608 164.204L756.777 164.997L756.967 165.201L759.484 166.27L760.425 167.483L760.968 168.881L761.117 170.265L760.665 172.023L759.076 172.561L757.513 172.312L754.015 171.211L752.236 171.546L750.673 171.297L750.72 169.919L749.928 170.09L749.529 170.274L747.711 171.789L747.88 172.583L747.821 174.354L746.787 175.896L744.373 177.59L744.562 177.793L745.34 178.016L746.707 178.258L747.871 178.691L748.636 179.308L748.583 180.882L747.19 181.427L746.405 181.401L745.627 181.178L745.025 181.552L743.449 181.697L741.683 181.638L740.696 181.802L740.277 182.576L740.23 183.954L739.994 185.128L739.379 185.896L737.561 187.412L736.763 187.779L735.206 187.334L734.259 186.317L733.337 184.513L732.579 183.7L731.625 182.88L731.612 183.273L731.971 184.27L731.728 185.642L730.146 185.983L727.988 185.911L726.817 185.675L725.653 185.242L724.679 185.013L723.731 183.996L721.58 183.728L720.037 182.888L719.448 182.869L718.258 183.223L717.27 183.387L716.296 183.158L715.145 182.331L715.139 182.528L715.302 183.519L714.856 185.08L712.875 185.606L707.964 185.639L706.178 186.171L705.334 187.916L703.96 187.871L700.599 188.547L695.412 190.936L693.633 191.271L691.468 191.396L688.951 190.327L687.252 188.3L685.748 186.28L684.219 185.046L683.637 184.83L683.238 185.014L682.44 185.381L681.452 185.546L680.275 185.506L677.156 184.812L676.83 182.83L676.444 182.62L676.66 182.036L676.248 182.614L674.915 181.387L674.17 180.18L674.419 178.612L675.832 177.477L678.219 176.571L678.226 176.374L678.678 174.616L679.097 173.842L679.699 173.468L680.699 172.91L680.902 172.72L681.753 170.778L685.437 166.368L685.084 165.174L683.724 164.735L679.611 164.401L678.271 163.371L677.519 162.361L677.769 160.793L678.756 160.629L670.094 155.415L667.969 154.359L666.236 153.316L664.477 153.06L664.078 153.244L665.096 158.007L663.61 161.307L661.386 163.204L657.782 165.251L654.923 168.506L648.336 171.636L647.93 172.017L647.518 172.594L646.654 174.93L645.829 176.085L644.429 176.827L642.481 176.368L641.134 175.535L639.794 174.505L639.218 174.092L638.055 173.659L637.087 173.233L634.603 171.18L633.635 170.753L632.458 170.714L631.484 170.485L630.13 169.849L629.738 169.835L628.744 170.196L628.947 170.006L628.737 170.393L628.305 171.561L628.272 172.545L628.618 173.936L629.35 175.537L630.826 178.344L630.983 179.532L629.969 180.483L627.595 180.995L627.182 181.573L627.372 181.776L630.046 184.033L632.117 186.663L632.882 187.28L634.595 188.913L635.549 189.733L636.484 191.143L637.555 194.331L635.37 195.047L633.808 194.798L637.861 196.903L638.769 199.101L636.761 200.413L634.393 200.729L630.287 200.198L626.978 199.3L626.194 199.274L620.242 201.046L619.64 201.42L618.43 202.365L617.239 202.72L614.885 202.641L614.094 202.812L611.307 203.901L611.693 204.111L613.831 204.774L615.198 205.016L624.531 201.977L627.63 203.262L628.389 204.076L628.754 204.876L629.114 205.873L628.871 207.244L627.282 207.783L624.339 207.685L623.94 207.868L622.913 209.214L621.919 209.575L622.101 209.975L622.291 210.178L628.037 214.507L628.959 216.311L626.349 217.998L624.819 216.764L624.786 217.749L624.38 218.129L624.177 218.319L624.171 218.516L624.53 219.513L623.902 220.675L622.149 220.222L620.43 218.786L619.605 219.941L619.017 219.921L621.904 227.505L622.25 228.895L622.001 230.464L621.17 231.815L619.953 232.957L621.09 234.177L619.487 235.109L617.093 236.211L614.916 236.73L612.555 236.849L608.847 236.134L602.739 236.719L587.267 235.416L585.495 235.554L584.494 236.112L581.641 239.17L578.665 240.056L578.659 240.253L579.77 242.26L579.141 243.422L578.343 243.789L577.362 243.757L577.506 245.338L578.034 247.129L578.753 249.123L578.889 250.901L579.405 253.086L578.404 253.643L578.012 253.63L578.188 254.227L579.116 255.834L580.273 256.464L585.74 257.434L589.088 257.151L591.429 257.623L591.815 257.833L592.39 258.246L592.985 258.069L593.764 258.292L594.711 259.309L595.084 259.912L596.135 263.691L596.697 264.498L597.272 264.911L602.576 264.891L603.367 264.72L607.168 262.679L607.959 262.508L609.326 262.751L610.097 263.17L610.489 263.183L610.692 262.993L611.301 262.422L612.092 262.251L612.681 262.271L612.877 262.278L613.073 262.284L614.609 263.32L617.074 265.964L618.793 267.4L619.93 268.62L620.472 270.018L620.439 271.002L620.007 272.17L619.595 272.747L618.587 273.502L617.397 273.856L617.39 274.053L618.528 275.273L618.894 276.073L619.253 277.071L618.664 277.051L618.056 277.622L618.049 277.819L618.422 278.422L619.546 280.036L620.101 281.04L621.185 283.834L621.551 284.635L621.93 285.041L623.65 286.478L624.212 287.285L624.943 288.885L625.316 289.489L625.695 289.895L628.009 291.155L630.487 293.405L631.258 293.824L633.782 294.696L638.418 297.018L640.13 298.651L641.241 300.659L641.73 303.631L641.827 306.589L641.152 309.128L641.126 309.916L641.269 311.497L641.236 312.481L640.418 313.439L639.823 313.616L637.841 314.141L637.043 314.509L636.834 314.896L637.06 319.83L636.778 322.382L635.246 327.06L633.793 329.376L632.719 332.099L632.234 334.841L632.331 337.8L632.86 339.591L635.094 343.212L636.002 345.41L636.531 347.201L636.661 349.175L636.412 350.743L636.588 351.34L634.999 351.879L634.437 351.072L633.862 350.658L633.28 350.442L632.495 350.416L631.115 350.567L630.33 350.541L629.748 350.325L628.395 349.688L628.199 349.682L627.597 350.056L627.584 350.45L627.361 351.23L626.36 351.788L624.817 350.949L623.497 349.329L622.915 349.112L622.516 349.296L622.111 349.676L621.273 351.225L620.462 351.986L619.657 352.55L618.663 352.911L617.675 353.076L617.08 353.253L615.66 354.585L614.666 354.946L613.103 354.697L612.149 353.877L611.397 352.867L610.829 352.257L609.861 351.83L607.912 351.372L606.363 350.729L605.598 350.112L604.095 348.092L603.709 347.882L602.735 347.653L600.021 346.577L598.249 346.715L594.868 347.982L589.531 348.987L588.916 349.754L588.118 350.122L586.345 350.26L583.226 349.565L582.246 349.533L581.454 349.703L580.453 350.261L578.322 349.402L577.983 347.815L578.421 346.45L578.84 345.676L579.056 345.092L578.867 344.888L578.095 344.469L576.742 343.832L575.422 342.212L574.893 340.421L574.423 336.859L573.895 335.068L572.052 331.46L571.34 329.269L571.825 326.526L573.109 323.416L573.391 320.864L572.071 319.244L571.678 319.231L571.685 319.034L570.521 318.601L568.965 318.156L567.402 317.907L564.243 318.393L562.68 318.144L557.423 316.786L554.547 314.72L553.2 313.887L551.644 313.442L548.511 313.14L545.223 311.652L544.059 311.219L541.116 311.121L536.251 309.777L535.264 309.941L534.662 310.315L533.229 312.041L532.222 312.795L529.056 313.478L525.538 312.967L504.988 304.993L492.441 298.468L489.139 297.373L482.502 296.167L475.898 293.977L464.496 288.474L459.122 284.749L458.344 284.526L457.553 284.696L454.936 286.58L453.746 286.934L452.176 286.882L450.62 286.436L429.508 277.655L429.311 277.649L425.846 275.563L419.146 270.414L416.249 268.939L415.674 268.525L370.148 249.869L366.872 247.986L366.29 247.77L361.877 244.667L360.936 243.454L359.061 240.83L358.322 239.426L357.97 238.232L357.827 236.651L357.461 235.851L355.186 233.411L354.631 232.407L354.088 231.01L353.526 230.203L352.958 229.593L351.245 227.959L350.493 226.949L349.579 224.948L349.193 224.739L345.309 223.427L343.158 223.158L341.804 222.522L341.236 221.912L340.105 220.495L337.993 219.046L336.849 218.023L334.784 215.195L334.216 214.585L332.483 213.543L331.529 212.723L330.777 211.712L329.281 209.495L326.464 205.658L325.326 204.438L325.542 203.854L325.36 203.454L323.347 199.052L322.779 198.442L318.007 194.342L317.046 193.719L305.617 189.004L301.719 188.086L297.41 187.746L296.226 187.903L296.023 188.094L296.004 188.684L296.27 192.437L295.459 193.198L295.21 194.766L294.372 196.315L292.763 197.443L290.984 197.778L289.035 197.319L283.804 195.175L283.216 195.155L280.632 196.055L280.443 195.851L280.031 196.429L279.618 197.006L276.539 195.13L273.792 195.039L266.082 196.556L261.686 198.774L259.116 199.28L257.161 199.018L255.611 198.375L252.525 196.696L249.426 195.411L239.5 192.716L237.761 191.87L236.833 190.263L235.795 186.09L235.828 185.106L236.26 183.938L236.876 183.171L238.079 182.423L237.896 182.022L233.869 179.13L231.588 176.887L230.281 174.873L231.138 172.734L232.153 171.782L233.735 171.441L235.69 171.703L237.829 172.365L237.253 171.952L236.678 171.539L236.096 171.322L233.762 170.654L232.794 170.227L230.493 168.574L229.14 167.938L224.647 167.198L222.476 167.52L221.312 167.087L220.358 166.267L220.005 165.073L220.633 163.912L221.628 163.551L222.831 162.802L222.276 161.799L220.393 159.372L219.702 156.59L220.716 155.639L221.317 155.265L220.932 155.055L219.957 154.825L217.813 154.36L215.884 153.311L213.969 151.868L212.426 151.028L210.849 151.173L209.267 151.514L205.526 151.784L197.592 154.081L195.225 154.397L193.662 154.148L191.544 152.895L190.57 152.665L188.405 152.791L186.463 152.135L185.319 151.112L183.274 147.694L182.516 146.88L181.98 145.286L178.515 143.201L177.737 142.978L177.142 143.155L176.134 143.91L174.937 144.461L173.754 144.619L171.596 144.547L167.895 143.636L164.423 141.747L151.923 133.843L153.157 138.022L152.685 140.371L150.494 141.283L148.329 141.408L145.975 141.33L141.097 140.38L140.306 140.55L139.907 140.734L138.291 142.06L137.087 142.808L136.878 143.195L137.257 143.602L138.028 144.021L143.874 145.398L146.006 146.257L147.921 147.7L150.006 149.937L154.589 153.833L157.668 155.709L158.04 156.312L158.197 157.5L156.993 158.248L154.416 158.95L153.239 158.911L152.089 158.085L151.54 156.884L151.194 155.494L150.259 154.083L148.913 153.25L147.363 152.608L142.884 151.473L142.099 151.447L141.7 151.631L140.503 152.182L139.712 152.353L138.352 151.914L137.012 150.884L136.43 150.668L135.841 150.648L135.05 150.819L134.455 150.996L134.252 151.186L134.245 151.383L134.022 152.164L133.388 153.522L132.387 154.08L132.759 154.683L134.276 156.31L134.831 157.314L134.987 158.501L134.659 162.431L133.841 163.389L132.84 163.947L133.03 164.15L133.794 164.767L134.546 165.777L133.126 167.109L132.132 167.47L129.372 167.772L128.777 167.95L126.769 169.262L124.787 169.787L118.699 169.782L115.141 170.452L112.328 172.328L110.463 175.222L109.742 179.139L108.871 181.671L107.445 183.2L104.429 185.267L104.004 186.238L104.546 187.636L106.97 191.46L107.695 193.258L108.028 195.042L108.577 196.243L109.904 197.666L111.244 198.696L112.375 200.113L113.113 201.516L113.838 203.314L114.583 204.521L115.524 205.734L116.668 206.758L117.825 207.387L118.989 207.82L121.337 208.095L122.108 208.515L122.271 209.506L121.846 210.477L121.034 211.238L119.628 212.176L119.216 212.754L118.744 215.102L117.534 216.047L107.731 215.524L73.6522 218.529L51.7566 163.023L35.0665 122.075L32.1728 114.688L15.822 75.3271L1.80293 42.5462L0.848526 41.7263L1.24752 41.5425L1.05797 41.3392L1.25415 41.3457L1.26078 41.1489L2.24169 41.1815L68.8738 10.4923L92.1918 0.430728L93.1727 0.463357L94.5394 0.705858L120.746 9.85327L216.457 42.9871L218.189 44.0299L219.523 45.2565L220.268 46.4635L221.758 48.8776L222.516 49.691L223.091 50.1042L226.347 52.577L229.236 54.2494L238.873 59.693L273.341 80.1495L274.903 80.3985L291.582 75.0421L319.156 66.8955L369.531 64.0392L370.526 63.6782L382.831 54.0385L384.427 53.3034L386.192 53.3621L388.128 54.2147L401.393 62.7346L406.983 65.8761L417.085 69.1677L419.595 70.4335L439.605 88.6357L439.801 88.6422L449.679 81.0892L460.13 109.022L460.083 110.4L459.285 110.768L466.576 127.562L467.497 129.366L478.543 127.96L486.633 126.849L487.215 127.066L487.594 127.473L488.888 129.88L492.782 136.709L494.272 139.123L502.141 150.419L511.702 163.939L514.01 165.395L517.338 165.703L554.31 158.46L555.48 158.696L558.207 159.377L558.606 159.194L561.648 156.339L563.923 158.779L566.42 160.439L567.368 161.456L568.681 163.273L569.283 162.899L570.068 162.925L570.088 162.334L572.266 161.815L573.579 163.633L574.547 164.059L573.729 165.017L574.082 166.211L574.813 167.811L575.153 169.399L575.289 171.177L575.027 173.139L574.392 174.497L573.574 175.455L574.163 175.474L575.719 175.92L581.119 178.858L584.604 180.354L595.308 183.271L595.72 182.694L596.112 182.707L596.126 182.313L596.937 181.552L597.918 181.585L599.67 182.037L600.136 179.885L598.998 178.665L598.626 178.061L597.645 178.029L596.873 177.609L596.494 177.202L595.736 176.389L593.325 172.171L593.162 171.18L593.581 170.406L593.398 170.006L592.666 168.405L592.124 167.008L593.491 167.25L593.504 166.857L594.721 165.715L596.526 164.593L596.742 164.009L596.482 160.06L597.327 158.314L599.538 156.811L600.212 154.272L601.213 153.715L602.803 153.176L603.81 152.422L605.04 150.886L603.061 145.5L602.1 144.877L601.538 144.07L601.558 143.48L601.571 143.086L601.983 142.509L603.593 141.38L604.593 140.822L604.607 140.429L604.803 140.435L605.634 139.084L607.656 137.377L608.454 137.01L609.82 137.252L610.016 137.259L611.233 136.117L612.031 135.75L613.405 135.795L612.457 134.779L612.483 133.991L611.502 133.959L612.516 133.007L612.929 132.43L613.544 131.662L615.342 130.737L618.006 127.476L618.647 125.921L619.262 125.153L624.442 122.961L628.785 122.317L629.786 121.759L630.853 119.233L631.265 118.656L633.064 117.731L635.112 115.237L635.537 114.266L636.481 109.568L636.9 108.794L638.516 107.469L638.536 106.878L638.622 104.32L640.062 102.397L643.476 100.146L644.065 100.166L644.653 100.185L645.817 100.618L646.974 101.248L648.105 102.665L648.68 103.078L649.459 103.301L650.047 103.32L650.453 102.94L650.885 101.772L650.742 100.191L651.011 98.0323L651.659 96.2806L651.496 95.2899L651.935 93.9252L653.518 93.5838L655.473 93.8459L656.663 93.4914L657.67 92.7367L659.319 90.4271L659.738 89.6529L661.171 87.9272L662.754 87.5858L664.513 87.8413L671.882 90.648L674.033 90.9166L674.326 93.8819L672.697 95.6011L669.904 96.8875L666.018 101.487L664.029 102.209L662.061 102.341L661.263 102.708L661.426 103.699L662.706 106.5L662.457 108.068L660.658 108.993L657.094 109.86L656.289 110.424L653.816 113.889L652.965 115.831L652.885 118.193L652.44 119.754L651.426 120.706L650.418 121.46L648.782 123.376L643.928 127.55L643.712 128.134L644.66 129.15L646.216 129.596L652.703 129.418L652.893 129.621L654.449 130.067L655.417 130.493L656.378 131.117L658.097 132.553L658.679 132.769L659.268 132.789L660.268 132.231L664.305 129.016L665.888 128.674L667.248 129.114L668.398 129.94L672.412 133.226L673.36 134.243L674.288 135.85L674.091 135.844L674.601 138.225L674.973 138.829L675.359 139.038L676.163 138.474L677.151 138.31L678.321 138.546L679.485 138.979L680.642 139.608L681.603 140.231L682.375 140.651L682.963 140.671L684.749 140.139L686.907 140.211L688.078 140.447L690.019 141.102L691.589 141.155L692.942 141.791L692.759 141.391L692.407 140.197L693.617 139.252L695.193 139.107L696.344 139.934L697.657 141.751L698.037 142.157L698.043 141.96L698.901 139.822L702.771 141.527L702.412 140.529L700.57 136.921L700.387 136.521L699.648 135.117L698.178 132.113L698.035 130.532L699.99 130.794L702.501 132.06L704.26 132.315L705.051 132.145L705.47 131.37L705.556 128.812L705.413 127.231L705.237 126.634L704.864 126.03L703.328 124.994L702.184 123.971L702.197 123.577L702.074 121.405L702.5 120.434L703.703 119.686L705.077 119.732L706.227 120.558L707.182 121.378L707.724 122.776L708.07 124.166L708.848 124.389L709.463 123.622L710.437 123.851L711.209 124.271L717.341 128.81L718.857 130.436L719.785 132.044L720.693 134.241L721.621 135.848L722.399 136.071L725.375 135.185L726.918 136.025L727.879 136.648L728.271 136.661L728.677 136.28L729.299 135.316L730.11 134.554L731.496 134.206L733.249 134.659L734.386 135.879L734.941 136.883L735.869 138.49L737.359 140.904L737.901 142.301L738.071 143.095L739.87 142.17L740.864 141.809L740.701 140.818L740.721 140.227L741.748 138.882L743.298 139.525L745.017 140.961L745.795 141.184L746.972 141.224L749.333 141.105L750.105 141.525L750.667 142.332L750.653 142.725L751.026 143.329L751.418 143.342L752.406 143.178L753.576 143.414L757.028 145.893L758.179 146.719L759.741 146.968L761.514 146.83L765.078 145.964L766.661 145.622L769.008 145.897L769.753 147.104L770.133 147.511L770.95 146.553L771.552 146.179L773.763 144.676L775.117 145.312L775.881 145.929L776.66 146.152L778.837 145.633L780.799 145.698L781.368 146.308L781.93 147.115L782.884 147.935Z" fill="#D9D9D9"/>
</g>
</svg>
