<?xml version="1.0" encoding="utf-8"?>
<!-- Generator: Adobe Illustrator 22.0.1, SVG Export Plug-In . SVG Version: 6.00 Build 0)  -->
<svg version="1.1" id="Слой_1" xmlns="http://www.w3.org/2000/svg" xmlns:xlink="http://www.w3.org/1999/xlink" x="0px" y="0px"
	 width="9.5px" height="9.5px" viewBox="0 0 9.5 9.5" style="enable-background:new 0 0 9.5 9.5;" xml:space="preserve">
<style type="text/css">
	.st0{fill:none;}
</style>
<path class="st0" d="M8,8v0.8h1.5V8H8z M8.7,0.8h0.8V0H8.7V0.8z M1.4,0H0.7v1.5h0.8V0z M9.5,8V0.8H8V8H9.5z M8.7,0H1.4v1.5h7.3V0z
	 M8.2,0.2L0,8.4l1.1,1.1l8.2-8.2L8.2,0.2z"/>
</svg>
