<svg width="92" height="11" viewBox="0 0 92 11" fill="none" xmlns="http://www.w3.org/2000/svg">
<path fill-rule="evenodd" clip-rule="evenodd" d="M88.1857 5.7548C88.1857 5.31027 88.1605 4.76702 87.8589 4.76702C87.4053 4.76702 86.9775 5.4829 86.9775 5.7548V9.92871H84.1327V5.7548C84.1327 5.08801 84.0576 4.76702 83.7806 4.76702C83.2766 4.76702 82.8488 5.4829 82.8488 5.7548V9.92871H80.055V5.70517C80.055 4.98928 80.0298 3.95187 79.3497 3.63035C79.6015 3.3099 80.3567 2.91446 81.062 2.91446C81.8923 2.91446 82.5214 3.40862 82.8488 4.24858C83.3775 3.45772 83.9567 2.88965 84.9888 2.88965C85.9706 2.88965 86.4993 3.48253 86.8015 4.34731C87.4305 3.48253 88.1101 2.88965 89.0671 2.88965C90.6784 2.88965 91.0053 4.17414 91.0053 5.92743V7.50809C91.0053 8.20024 91.0557 8.8913 91.7857 9.41028C91.257 10.1013 90.5775 10.2502 89.9983 10.2502C89.4192 10.2502 88.1857 10.0032 88.1857 8.49641V5.7548ZM31.3419 4.56945V3.26015H32.0215C32.0215 2.61817 32.2233 1.0127 34.9168 1.0127V3.26015H36.5786C38.9446 3.26015 39.9521 3.43278 39.9521 5.48278V9.92859H37.132V6.22402C37.132 4.8899 36.5786 4.56945 35.4707 4.56945H34.9168V7.63151C34.9168 8.71855 35.2694 9.41016 36.4524 9.41016C35.9237 10.003 35.0928 10.2501 34.489 10.2501C33.3059 10.2501 32.0472 9.68205 32.0472 7.3348V4.56945H31.3419ZM8.76048 6.96515C8.45882 9.08851 6.59572 10.25 4.85823 10.25C2.16476 10.25 0 8.2 0 5.08778C0 2.19836 1.9887 0 5.13573 0C6.59572 0 8.48351 0.716421 8.48351 2.44489C8.48351 3.40839 7.72829 4.05037 6.94837 4.05037C5.00959 4.05037 5.79004 1.97555 4.75785 1.97555C4.12823 1.97555 3.12127 2.76588 3.12127 5.08778C3.12127 7.18687 4.38051 8.323 5.79004 8.323C6.97306 8.323 7.8292 7.80457 8.76048 6.96515ZM27.9183 3.25987H30.7127V7.50768C30.7127 8.19983 30.7631 8.89089 31.4926 9.40987C30.9644 10.1009 30.2843 10.2498 29.7057 10.2498C29.1265 10.2498 28.2205 10.027 27.8931 9.11316C27.2388 10.0767 26.4331 10.2498 25.7278 10.2498C24.0413 10.2498 23.1599 8.59472 23.1599 6.54472C23.1599 4.56917 24.0665 2.91406 25.7535 2.91406C26.6091 2.91406 27.2634 3.18596 27.9183 3.92665V3.25987ZM27.9185 5.26063C27.7672 4.91482 27.2637 4.61865 26.9368 4.61865C26.1311 4.61865 25.8794 5.85351 25.8794 6.69347C25.8794 7.60733 26.1564 8.49638 26.9867 8.49638C27.4403 8.49638 27.7173 8.24931 27.8933 7.92832L27.9185 5.26063ZM43.3757 3.25988V7.43379C43.3757 7.97758 43.4261 8.61955 43.9291 8.61955C44.987 8.61955 45.2635 6.94017 45.2635 6.12502C45.2635 5.11243 44.8609 4.00112 44.1057 3.7044C44.1057 3.25988 44.6848 2.54346 45.6161 2.54346C47.177 2.54346 47.8566 3.95148 47.8566 5.45823C47.8566 8.4221 46.0691 10.2498 43.9038 10.2498C42.0413 10.2498 40.606 9.33543 40.606 7.4586V3.25988H43.3757ZM18.302 7.68085C18.4276 8.22464 19.1329 8.81699 20.2655 8.81699C21.0706 8.81699 21.8263 8.54509 22.3797 8.19983C21.8516 9.5825 20.7437 10.2498 19.3841 10.2498C16.9929 10.2498 15.4824 8.81699 15.4824 6.54472C15.4824 4.54381 16.9929 2.91406 19.4598 2.91406C21.2724 2.91406 22.632 3.90184 22.632 5.38377C22.632 6.42118 21.8516 7.68085 19.7367 7.68085H18.302ZM19.0066 6.49561C19.7113 6.49561 20.1643 5.97664 20.1643 5.35948C20.1643 4.79088 19.7618 4.51953 19.334 4.51953C18.8053 4.51953 18.2009 5.03796 18.2009 6.49561H19.0066ZM12.2095 4.24818C12.7881 3.3095 13.4177 2.91406 14.0221 2.91406C14.8026 2.91406 15.4569 3.53122 15.4569 4.37172C15.4569 5.30986 14.7768 5.92702 14.0973 5.92702C13.166 5.92702 12.8386 5.21114 12.6877 4.84052L12.2594 5.26023V9.92829H9.4151V5.70476C9.4151 4.98888 9.38987 3.95147 8.71033 3.62994C8.96153 3.3095 9.7173 2.91406 10.4221 2.91406C11.2524 2.91406 11.8821 3.40822 12.2095 4.24818ZM36.6539 1.30866C36.6539 1.97545 37.3834 2.51869 38.29 2.51869C39.196 2.51869 39.9518 1.97545 39.9518 1.30866C39.9518 0.641879 39.196 0.0986328 38.29 0.0986328C37.3834 0.0986328 36.6539 0.641879 36.6539 1.30866ZM61.9036 4.56945V7.63151C61.9036 8.71855 62.2557 9.41016 63.4393 9.41016C62.9106 10.003 62.0797 10.2501 61.4753 10.2501C60.2922 10.2501 59.0335 9.68205 59.0335 7.3348V4.56945H58.3287V3.26015H59.0083C59.0083 2.61817 59.2096 1.0127 61.9036 1.0127V3.26015H63.2627V4.56945H61.9036ZM51.1541 7.68085C51.2802 8.22464 51.985 8.81699 53.1175 8.81699C53.9232 8.81699 54.6784 8.54509 55.2323 8.19983C54.7036 9.5825 53.5963 10.2498 52.2367 10.2498C49.8449 10.2498 48.3345 8.81699 48.3345 6.54472C48.3345 4.54381 49.8449 2.91406 52.3124 2.91406C54.1245 2.91406 55.4841 3.90184 55.4841 5.38377C55.4841 6.42118 54.7036 7.68085 52.5893 7.68085H51.1541ZM51.8596 6.49561C52.5643 6.49561 53.0173 5.97664 53.0173 5.35948C53.0173 4.79088 52.6142 4.51953 52.1865 4.51953C51.6578 4.51953 51.0535 5.03796 51.0535 6.49561H51.8596ZM66.4604 7.68085C66.586 8.22464 67.2907 8.81699 68.4239 8.81699C69.2295 8.81699 69.9847 8.54509 70.5387 8.19983C70.01 9.5825 68.9021 10.2498 67.543 10.2498C65.1512 10.2498 63.6403 8.81699 63.6403 6.54472C63.6403 4.54381 65.1512 2.91406 67.6182 2.91406C69.4308 2.91406 70.7904 3.90184 70.7904 5.38377C70.7904 6.42118 70.01 7.68085 67.8951 7.68085H66.4604ZM67.1648 6.49561C67.8696 6.49561 68.3225 5.97664 68.3225 5.35948C68.3225 4.79088 67.92 4.51953 67.4922 4.51953C66.9636 4.51953 66.3593 5.03796 66.3593 6.49561H67.1648ZM75.9255 3.25987H78.7198V7.50768C78.7198 8.19983 78.7703 8.89089 79.5003 9.40987C78.9721 10.1009 78.292 10.2498 77.7129 10.2498C77.1342 10.2498 76.2282 10.027 75.9002 9.11316C75.2464 10.0767 74.4408 10.2498 73.7355 10.2498C72.049 10.2498 71.1676 8.59472 71.1676 6.54472C71.1676 4.56917 72.0742 2.91406 73.7607 2.91406C74.6168 2.91406 75.2706 3.18596 75.9255 3.92665V3.25987ZM75.9256 5.26063C75.7748 4.91482 75.2708 4.61865 74.9445 4.61865C74.1389 4.61865 73.8866 5.85351 73.8866 6.69347C73.8866 7.60733 74.1636 8.49638 74.9944 8.49638C75.4479 8.49638 75.7244 8.24931 75.9004 7.92832L75.9256 5.26063Z"/>
</svg>
