<svg width="924" height="395" viewBox="0 0 924 395" fill="none" xmlns="http://www.w3.org/2000/svg">
<g style="mix-blend-mode:overlay">
<mask id="path-1-inside-1" fill="white">
<path d="M924 145.903H923.076L922.614 147.75L920.766 149.366L917.07 151.674L913.836 154.676L910.833 156.061L909.909 156.523L909.678 157.677L911.064 161.832L908.985 163.448L906.906 162.987L907.137 163.679L907.368 164.603L907.137 165.757L906.213 166.911L903.672 167.373L899.283 165.757H897.435L895.356 165.295L893.046 163.91L891.429 163.217L893.046 164.372L893.739 165.988L893.97 166.911L894.201 167.142L897.204 168.296L898.359 169.681L899.052 171.297L899.283 172.913L898.821 174.991L896.973 175.684L895.125 175.453L890.967 174.299L888.888 174.76L887.04 174.53V172.913L886.116 173.144L885.654 173.375L883.575 175.222L883.806 176.146V178.223L882.651 180.07L879.879 182.148L880.11 182.379L881.034 182.61L882.651 182.84L884.037 183.302L884.961 183.995V185.842L883.344 186.534H882.42L881.496 186.303L880.803 186.765L878.955 186.996H876.876L875.721 187.227L875.259 188.15V189.766L875.028 191.151L874.335 192.075L872.256 193.922L871.332 194.383L869.484 193.922L868.329 192.767L867.174 190.69L866.25 189.766L865.095 188.843V189.304L865.557 190.459L865.326 192.075L863.478 192.537H860.937L859.551 192.306L858.165 191.844L857.01 191.613L855.855 190.459L853.314 190.228L851.466 189.304H850.773L849.387 189.766L848.232 189.997L847.077 189.766L845.691 188.843V189.074L845.922 190.228L845.46 192.075L843.15 192.767L837.375 192.998L835.296 193.691L834.372 195.769H832.755L828.828 196.692L822.822 199.693L820.743 200.155L818.202 200.386L815.199 199.231L813.12 196.923L811.272 194.614L809.424 193.229L808.731 192.998L808.269 193.229L807.345 193.691L806.19 193.922H804.804L801.108 193.229L800.646 190.921L800.184 190.69L800.415 189.997L799.953 190.69L798.336 189.304L797.412 187.919L797.643 186.072L799.26 184.687L802.032 183.533V183.302L802.494 181.224L802.956 180.301L803.649 179.839L804.804 179.147L805.035 178.916L805.959 176.607L810.117 171.297L809.655 169.912L808.038 169.451L803.187 169.22L801.57 168.065L800.646 166.911L800.877 165.064L802.032 164.833L791.637 159.062L789.096 157.908L787.017 156.753L784.938 156.523L784.476 156.753L785.862 162.294L784.245 166.219L781.704 168.527L777.546 171.067L774.312 174.991L766.689 178.916L766.227 179.378L765.765 180.07L764.841 182.84L763.917 184.226L762.3 185.149L759.99 184.687L758.373 183.764L756.756 182.61L756.063 182.148L754.677 181.686L753.522 181.224L750.519 178.916L749.364 178.454H747.978L746.823 178.223L745.206 177.531H744.744L743.589 177.992L743.82 177.762L743.589 178.223L743.127 179.608V180.763L743.589 182.379L744.513 184.226L746.361 187.458L746.592 188.843L745.437 189.997L742.665 190.69L742.203 191.382L742.434 191.613L745.668 194.153L748.209 197.154L749.133 197.846L751.212 199.693L752.367 200.617L753.522 202.233L754.908 205.926L752.367 206.85L750.519 206.619L755.37 208.928L756.525 211.467L754.215 213.083L751.443 213.545L746.592 213.083L742.665 212.16H741.741L734.811 214.468L734.118 214.93L732.732 216.084L731.346 216.546H728.574L727.65 216.777L724.416 218.162L724.878 218.393L727.419 219.085L729.036 219.316L739.893 215.392L743.589 216.777L744.513 217.7L744.975 218.624L745.437 219.778L745.206 221.394L743.358 222.086H739.893L739.431 222.317L738.276 223.933L737.121 224.395L737.352 224.857L737.583 225.088L744.513 229.936L745.668 232.013L742.665 234.091L740.817 232.706V233.86L740.355 234.322L740.124 234.553V234.784L740.586 235.938L739.893 237.323L737.814 236.861L735.735 235.245L734.811 236.631H734.118L737.814 245.403L738.276 247.019L738.045 248.866L737.121 250.482L735.735 251.867L737.121 253.252L735.273 254.407L732.501 255.792L729.96 256.484L727.188 256.715L722.799 256.023L715.638 256.946L697.389 256.023L695.31 256.254L694.155 256.946L690.921 260.64L687.456 261.794V262.025L688.842 264.334L688.149 265.719L687.225 266.181H686.07L686.301 268.027L686.994 270.105L687.918 272.414L688.149 274.492L688.842 277.031L687.687 277.724H687.225L687.456 278.416L688.611 280.263L689.997 280.956L696.465 281.879L700.392 281.417L703.164 281.879L703.626 282.11L704.319 282.572L705.012 282.341L705.936 282.572L707.091 283.726L707.553 284.418L708.939 288.805L709.632 289.728L710.325 290.19L716.562 289.959L717.486 289.728L721.875 287.189L722.799 286.958L724.416 287.189L725.34 287.65H725.802L726.033 287.42L726.726 286.727L727.65 286.496H728.343H728.574H728.805L730.653 287.65L733.656 290.652L735.735 292.268L737.121 293.653L737.814 295.269V296.423L737.352 297.808L736.89 298.501L735.735 299.424L734.349 299.886V300.117L735.735 301.502L736.197 302.425L736.659 303.58H735.966L735.273 304.272V304.503L735.735 305.196L737.121 307.043L737.814 308.197L739.2 311.429L739.662 312.352L740.124 312.814L742.203 314.43L742.896 315.354L743.82 317.2L744.282 317.893L744.744 318.355L747.516 319.74L750.519 322.279L751.443 322.741L754.446 323.664L759.99 326.204L762.069 328.051L763.455 330.359L764.148 333.822L764.379 337.285L763.686 340.286V341.21L763.917 343.057V344.211L762.993 345.365L762.3 345.596L759.99 346.289L759.066 346.75L758.835 347.212L759.297 352.984L759.066 355.985L757.449 361.525L755.832 364.296L754.677 367.528L754.215 370.76L754.446 374.223L755.139 376.3L757.911 380.456L759.066 382.995L759.759 385.073L759.99 387.382L759.759 389.229L759.99 389.921L758.142 390.614L757.449 389.69L756.756 389.229L756.063 388.998H755.139L753.522 389.229H752.598L751.905 388.998L750.288 388.305H750.057L749.364 388.767V389.229L749.133 390.152L747.978 390.845L746.13 389.921L744.513 388.074L743.82 387.843L743.358 388.074L742.896 388.536L741.972 390.383L741.048 391.306L740.124 391.999L738.969 392.461L737.814 392.691L737.121 392.922L735.504 394.538L734.349 395L732.501 394.769L731.346 393.846L730.422 392.691L729.729 391.999L728.574 391.537L726.264 391.075L724.416 390.383L723.492 389.69L721.644 387.382L721.182 387.151L720.027 386.92L716.793 385.766L714.714 385.996L710.787 387.612L704.55 388.998L703.857 389.921L702.933 390.383L700.854 390.614L697.158 389.921H696.003L695.079 390.152L693.924 390.845L691.383 389.921L690.921 388.074L691.383 386.458L691.845 385.535L692.076 384.842L691.845 384.611L690.921 384.15L689.304 383.457L687.687 381.61L686.994 379.532L686.301 375.377L685.608 373.299L683.298 369.144L682.374 366.604L682.836 363.372L684.222 359.679L684.453 356.677L682.836 354.83H682.374V354.6L680.988 354.138L679.14 353.676L677.292 353.445L673.596 354.138L671.748 353.907L665.511 352.522L662.046 350.213L660.429 349.29L658.581 348.828L654.885 348.597L650.958 346.981L649.572 346.52H646.107L640.332 345.134L639.177 345.365L638.484 345.827L636.867 347.905L635.712 348.828L632.016 349.752L627.858 349.29L603.372 340.748L588.357 333.591L584.43 332.437L576.576 331.283L568.722 328.974L555.093 322.972L548.625 318.816L547.701 318.586L546.777 318.816L543.774 321.125L542.388 321.587H540.54L538.692 321.125L513.513 311.66H513.282L509.124 309.351L501.039 303.58L497.574 301.964L496.881 301.502L442.596 281.417L438.669 279.34L437.976 279.109L432.663 275.646L431.508 274.261L429.198 271.259L428.274 269.643L427.812 268.258L427.581 266.411L427.119 265.488L424.347 262.718L423.654 261.563L422.961 259.947L422.268 259.024L421.575 258.331L419.496 256.484L418.572 255.33L417.417 253.022L416.955 252.791L412.335 251.406L409.794 251.175L408.177 250.482L407.484 249.79L406.098 248.174L403.557 246.558L402.171 245.403L399.63 242.171L398.937 241.479L396.858 240.324L395.703 239.401L394.779 238.247L392.931 235.707L389.466 231.321L388.08 229.936L388.311 229.243L388.08 228.781L385.539 223.702L384.846 223.01L379.071 218.393L377.916 217.7L364.287 212.621L359.667 211.698L354.585 211.467L353.199 211.698L352.968 211.929V212.621L353.43 217.008L352.506 217.931L352.275 219.778L351.351 221.625L349.503 223.01L347.424 223.472L345.114 223.01L338.877 220.701H338.184L335.181 221.856L334.95 221.625L334.488 222.317L334.026 223.01L330.33 220.932H327.096L318.087 223.01L313.005 225.78L310.002 226.473L307.692 226.242L305.844 225.549L302.148 223.702L298.452 222.317L286.671 219.547L284.592 218.624L283.437 216.777L282.051 211.929V210.774L282.513 209.389L283.206 208.466L284.592 207.542L284.361 207.081L279.51 203.849L276.738 201.309L275.121 199.001L276.045 196.461L277.2 195.307L279.048 194.845L281.358 195.076L283.899 195.769L283.206 195.307L282.513 194.845L281.82 194.614L279.048 193.922L277.893 193.46L275.121 191.613L273.504 190.921L268.191 190.228L265.65 190.69L264.264 190.228L263.109 189.304L262.647 187.919L263.34 186.534L264.495 186.072L265.881 185.149L265.188 183.995L262.878 181.224L261.954 177.992L263.109 176.838L263.802 176.376L263.34 176.146L262.185 175.915L259.644 175.453L257.334 174.299L255.024 172.683L253.176 171.759L251.328 171.99L249.48 172.452L245.091 172.913L235.851 175.915L233.079 176.376L231.231 176.146L228.69 174.76L227.535 174.53L224.994 174.76L222.684 174.068L221.298 172.913L218.757 168.989L217.833 168.065L217.14 166.219L212.982 163.91L212.058 163.679L211.365 163.91L210.21 164.833L208.824 165.526L207.438 165.757H204.897L200.508 164.833L196.35 162.756L181.335 153.983L182.952 158.831L182.49 161.601L179.949 162.756L177.408 162.987H174.636L168.861 162.063L167.937 162.294L167.475 162.525L165.627 164.141L164.241 165.064L164.01 165.526L164.472 165.988L165.396 166.449L172.326 167.835L174.867 168.758L177.177 170.374L179.718 172.913L185.262 177.3L188.958 179.378L189.42 180.07L189.651 181.455L188.265 182.379L185.262 183.302H183.876L182.49 182.379L181.797 180.994L181.335 179.378L180.18 177.762L178.563 176.838L176.715 176.146L171.402 174.991H170.478L170.016 175.222L168.63 175.915L167.706 176.146L166.089 175.684L164.472 174.53L163.779 174.299H163.086L162.162 174.53L161.469 174.76L161.238 174.991V175.222L161.007 176.146L160.314 177.762L159.159 178.454L159.621 179.147L161.469 180.994L162.162 182.148L162.393 183.533L162.162 188.15L161.238 189.304L160.083 189.997L160.314 190.228L161.238 190.921L162.162 192.075L160.545 193.691L159.39 194.153L156.156 194.614L155.463 194.845L153.153 196.461L150.843 197.154L143.682 197.385L139.524 198.308L136.29 200.617L134.211 204.079L133.518 208.697L132.594 211.698L130.977 213.545L127.512 216.084L127.05 217.238L127.743 218.854L130.746 223.241L131.67 225.319L132.132 227.396L132.825 228.781L134.442 230.397L136.059 231.552L137.445 233.168L138.369 234.784L139.293 236.861L140.217 238.247L141.372 239.632L142.758 240.786L144.144 241.479L145.53 241.94L148.302 242.171L149.226 242.633L149.457 243.787L148.995 244.942L148.071 245.865L146.454 247.019L145.992 247.712L145.53 250.482L144.144 251.636L132.594 251.406L92.631 256.254L64.68 192.075L43.428 144.749L39.732 136.207L18.942 90.7276L1.155 52.8667L0 51.9433L0.462 51.7124L0.231 51.4816H0.462V51.2507H1.617L78.771 12.6973L105.798 0H106.953L108.57 0.230859L139.755 9.92694L253.638 45.0175L255.717 46.1718L257.334 47.557L258.258 48.9421L260.106 51.7124L261.03 52.6359L261.723 53.0976L265.65 55.8679L269.115 57.7148L280.665 63.7171L322.014 86.3413L323.862 86.5722L343.266 79.6464L375.375 69.0269L434.511 63.7171L435.666 63.2554L449.757 51.4816L451.605 50.5582H453.684L455.994 51.4816L471.933 60.9468L478.632 64.4097L490.644 67.8726L493.647 69.2577L517.902 89.8042H518.133L529.452 80.5698L542.85 112.89V114.506L541.926 114.968L551.166 134.36L552.321 136.438L565.257 134.36L574.728 132.744L575.421 132.975L575.883 133.437L577.5 136.207L582.351 144.056L584.199 146.826L593.901 159.755L605.682 175.222L608.454 176.838L612.381 177.069L655.578 167.142L656.964 167.373L660.198 168.065L660.66 167.835L664.125 164.372L666.897 167.142L669.9 168.989L671.055 170.143L672.672 172.221L673.365 171.759H674.289V171.067L676.83 170.374L678.447 172.452L679.602 172.913L678.678 174.068L679.14 175.453L680.064 177.3L680.526 179.147L680.757 181.224L680.526 183.533L679.833 185.149L678.909 186.303H679.602L681.45 186.765L687.918 189.997L692.076 191.613L704.781 194.614L705.243 193.922H705.705V193.46L706.629 192.537H707.784L709.863 192.998L710.325 190.459L708.939 189.074L708.477 188.381H707.322L706.398 187.919L705.936 187.458L705.012 186.534L702.009 181.686L701.778 180.532L702.24 179.608L702.009 179.147L701.085 177.3L700.392 175.684L702.009 175.915V175.453L703.395 174.068L705.474 172.683L705.705 171.99L705.243 167.373L706.167 165.295L708.708 163.448L709.401 160.447L710.556 159.755L712.404 159.062L713.559 158.139L714.945 156.292L712.404 150.058L711.249 149.366L710.556 148.442V147.75V147.288L711.018 146.596L712.866 145.21L714.021 144.518V144.056H714.252L715.176 142.44L717.486 140.362L718.41 139.901L720.027 140.132H720.258L721.644 138.746L722.568 138.285H724.185L723.03 137.13V136.207H721.875L723.03 135.053L723.492 134.36L724.185 133.437L726.264 132.282L729.267 128.358L729.96 126.511L730.653 125.587L736.659 122.817L741.741 121.894L742.896 121.201L744.051 118.2L744.513 117.507L746.592 116.353L748.902 113.352L749.364 112.198L750.288 106.657L750.75 105.733L752.598 104.117V103.425V100.424L754.215 98.1151L758.142 95.3448H758.835H759.528L760.914 95.8065L762.3 96.4991L763.686 98.1151L764.379 98.5769L765.303 98.8077H765.996L766.458 98.346L766.92 96.9608L766.689 95.114L766.92 92.5745L767.613 90.4968L767.382 89.3425L767.844 87.7265L769.692 87.2648L772.002 87.4956L773.388 87.0339L774.543 86.1105L776.391 83.3401L776.853 82.4167L778.47 80.339L780.318 79.8773L782.397 80.1081L791.175 83.1093L793.716 83.3401L794.178 86.803L792.33 88.8808L789.096 90.4968L784.707 96.0374L782.397 96.9608L780.087 97.1917L779.163 97.6534L779.394 98.8077L781.011 102.04L780.78 103.887L778.701 105.041L774.543 106.195L773.619 106.888L770.847 111.043L769.923 113.352V116.122L769.461 117.969L768.306 119.123L767.151 120.047L765.303 122.355L759.759 127.434L759.528 128.127L760.683 129.281L762.531 129.743L770.154 129.281L770.385 129.512L772.233 129.974L773.388 130.435L774.543 131.128L776.622 132.744L777.315 132.975H778.008L779.163 132.282L783.783 128.358L785.631 127.896L787.248 128.358L788.634 129.281L793.485 132.975L794.64 134.129L795.795 135.976H795.564L796.257 138.746L796.719 139.439L797.181 139.67L798.105 138.977L799.26 138.746L800.646 138.977L802.032 139.439L803.418 140.132L804.573 140.824L805.497 141.286H806.19L808.269 140.593H810.81L812.196 140.824L814.506 141.517H816.354L817.971 142.209L817.74 141.748L817.278 140.362L818.664 139.208L820.512 138.977L821.898 139.901L823.515 141.978L823.977 142.44V142.209L824.901 139.67L829.521 141.517L829.059 140.362L826.749 136.207L826.518 135.745L825.594 134.129L823.746 130.666L823.515 128.819L825.825 129.05L828.828 130.435L830.907 130.666L831.831 130.435L832.293 129.512V126.511L832.062 124.664L831.831 123.971L831.369 123.279L829.521 122.124L828.135 120.97V120.508L827.904 117.969L828.366 116.815L829.752 115.891H831.369L832.755 116.815L833.91 117.738L834.603 119.354L835.065 120.97L835.989 121.201L836.682 120.278L837.837 120.508L838.761 120.97L846.153 126.049L848.001 127.896L849.156 129.743L850.311 132.282L851.466 134.129L852.39 134.36L855.855 133.206L857.703 134.129L858.858 134.822H859.32L859.782 134.36L860.475 133.206L861.399 132.282L863.016 131.821L865.095 132.282L866.481 133.667L867.174 134.822L868.329 136.669L870.177 139.439L870.87 141.055L871.101 141.978L873.18 140.824L874.335 140.362L874.104 139.208V138.515L875.259 136.899L877.107 137.592L879.186 139.208L880.11 139.439H881.496L884.268 139.208L885.192 139.67L885.885 140.593V141.055L886.347 141.748H886.809L887.964 141.517L889.35 141.748L893.508 144.518L894.894 145.441L896.742 145.672L898.821 145.441L902.979 144.287L904.827 143.825L907.599 144.056L908.523 145.441L908.985 145.903L909.909 144.749L910.602 144.287L913.143 142.44L914.76 143.133L915.684 143.825L916.608 144.056L919.149 143.364H921.459L922.152 144.056L922.845 144.98L924 145.903Z"/>
</mask>
<path d="M924 145.903H923.076L922.614 147.75L920.766 149.366L917.07 151.674L913.836 154.676L910.833 156.061L909.909 156.523L909.678 157.677L911.064 161.832L908.985 163.448L906.906 162.987L907.137 163.679L907.368 164.603L907.137 165.757L906.213 166.911L903.672 167.373L899.283 165.757H897.435L895.356 165.295L893.046 163.91L891.429 163.217L893.046 164.372L893.739 165.988L893.97 166.911L894.201 167.142L897.204 168.296L898.359 169.681L899.052 171.297L899.283 172.913L898.821 174.991L896.973 175.684L895.125 175.453L890.967 174.299L888.888 174.76L887.04 174.53V172.913L886.116 173.144L885.654 173.375L883.575 175.222L883.806 176.146V178.223L882.651 180.07L879.879 182.148L880.11 182.379L881.034 182.61L882.651 182.84L884.037 183.302L884.961 183.995V185.842L883.344 186.534H882.42L881.496 186.303L880.803 186.765L878.955 186.996H876.876L875.721 187.227L875.259 188.15V189.766L875.028 191.151L874.335 192.075L872.256 193.922L871.332 194.383L869.484 193.922L868.329 192.767L867.174 190.69L866.25 189.766L865.095 188.843V189.304L865.557 190.459L865.326 192.075L863.478 192.537H860.937L859.551 192.306L858.165 191.844L857.01 191.613L855.855 190.459L853.314 190.228L851.466 189.304H850.773L849.387 189.766L848.232 189.997L847.077 189.766L845.691 188.843V189.074L845.922 190.228L845.46 192.075L843.15 192.767L837.375 192.998L835.296 193.691L834.372 195.769H832.755L828.828 196.692L822.822 199.693L820.743 200.155L818.202 200.386L815.199 199.231L813.12 196.923L811.272 194.614L809.424 193.229L808.731 192.998L808.269 193.229L807.345 193.691L806.19 193.922H804.804L801.108 193.229L800.646 190.921L800.184 190.69L800.415 189.997L799.953 190.69L798.336 189.304L797.412 187.919L797.643 186.072L799.26 184.687L802.032 183.533V183.302L802.494 181.224L802.956 180.301L803.649 179.839L804.804 179.147L805.035 178.916L805.959 176.607L810.117 171.297L809.655 169.912L808.038 169.451L803.187 169.22L801.57 168.065L800.646 166.911L800.877 165.064L802.032 164.833L791.637 159.062L789.096 157.908L787.017 156.753L784.938 156.523L784.476 156.753L785.862 162.294L784.245 166.219L781.704 168.527L777.546 171.067L774.312 174.991L766.689 178.916L766.227 179.378L765.765 180.07L764.841 182.84L763.917 184.226L762.3 185.149L759.99 184.687L758.373 183.764L756.756 182.61L756.063 182.148L754.677 181.686L753.522 181.224L750.519 178.916L749.364 178.454H747.978L746.823 178.223L745.206 177.531H744.744L743.589 177.992L743.82 177.762L743.589 178.223L743.127 179.608V180.763L743.589 182.379L744.513 184.226L746.361 187.458L746.592 188.843L745.437 189.997L742.665 190.69L742.203 191.382L742.434 191.613L745.668 194.153L748.209 197.154L749.133 197.846L751.212 199.693L752.367 200.617L753.522 202.233L754.908 205.926L752.367 206.85L750.519 206.619L755.37 208.928L756.525 211.467L754.215 213.083L751.443 213.545L746.592 213.083L742.665 212.16H741.741L734.811 214.468L734.118 214.93L732.732 216.084L731.346 216.546H728.574L727.65 216.777L724.416 218.162L724.878 218.393L727.419 219.085L729.036 219.316L739.893 215.392L743.589 216.777L744.513 217.7L744.975 218.624L745.437 219.778L745.206 221.394L743.358 222.086H739.893L739.431 222.317L738.276 223.933L737.121 224.395L737.352 224.857L737.583 225.088L744.513 229.936L745.668 232.013L742.665 234.091L740.817 232.706V233.86L740.355 234.322L740.124 234.553V234.784L740.586 235.938L739.893 237.323L737.814 236.861L735.735 235.245L734.811 236.631H734.118L737.814 245.403L738.276 247.019L738.045 248.866L737.121 250.482L735.735 251.867L737.121 253.252L735.273 254.407L732.501 255.792L729.96 256.484L727.188 256.715L722.799 256.023L715.638 256.946L697.389 256.023L695.31 256.254L694.155 256.946L690.921 260.64L687.456 261.794V262.025L688.842 264.334L688.149 265.719L687.225 266.181H686.07L686.301 268.027L686.994 270.105L687.918 272.414L688.149 274.492L688.842 277.031L687.687 277.724H687.225L687.456 278.416L688.611 280.263L689.997 280.956L696.465 281.879L700.392 281.417L703.164 281.879L703.626 282.11L704.319 282.572L705.012 282.341L705.936 282.572L707.091 283.726L707.553 284.418L708.939 288.805L709.632 289.728L710.325 290.19L716.562 289.959L717.486 289.728L721.875 287.189L722.799 286.958L724.416 287.189L725.34 287.65H725.802L726.033 287.42L726.726 286.727L727.65 286.496H728.343H728.574H728.805L730.653 287.65L733.656 290.652L735.735 292.268L737.121 293.653L737.814 295.269V296.423L737.352 297.808L736.89 298.501L735.735 299.424L734.349 299.886V300.117L735.735 301.502L736.197 302.425L736.659 303.58H735.966L735.273 304.272V304.503L735.735 305.196L737.121 307.043L737.814 308.197L739.2 311.429L739.662 312.352L740.124 312.814L742.203 314.43L742.896 315.354L743.82 317.2L744.282 317.893L744.744 318.355L747.516 319.74L750.519 322.279L751.443 322.741L754.446 323.664L759.99 326.204L762.069 328.051L763.455 330.359L764.148 333.822L764.379 337.285L763.686 340.286V341.21L763.917 343.057V344.211L762.993 345.365L762.3 345.596L759.99 346.289L759.066 346.75L758.835 347.212L759.297 352.984L759.066 355.985L757.449 361.525L755.832 364.296L754.677 367.528L754.215 370.76L754.446 374.223L755.139 376.3L757.911 380.456L759.066 382.995L759.759 385.073L759.99 387.382L759.759 389.229L759.99 389.921L758.142 390.614L757.449 389.69L756.756 389.229L756.063 388.998H755.139L753.522 389.229H752.598L751.905 388.998L750.288 388.305H750.057L749.364 388.767V389.229L749.133 390.152L747.978 390.845L746.13 389.921L744.513 388.074L743.82 387.843L743.358 388.074L742.896 388.536L741.972 390.383L741.048 391.306L740.124 391.999L738.969 392.461L737.814 392.691L737.121 392.922L735.504 394.538L734.349 395L732.501 394.769L731.346 393.846L730.422 392.691L729.729 391.999L728.574 391.537L726.264 391.075L724.416 390.383L723.492 389.69L721.644 387.382L721.182 387.151L720.027 386.92L716.793 385.766L714.714 385.996L710.787 387.612L704.55 388.998L703.857 389.921L702.933 390.383L700.854 390.614L697.158 389.921H696.003L695.079 390.152L693.924 390.845L691.383 389.921L690.921 388.074L691.383 386.458L691.845 385.535L692.076 384.842L691.845 384.611L690.921 384.15L689.304 383.457L687.687 381.61L686.994 379.532L686.301 375.377L685.608 373.299L683.298 369.144L682.374 366.604L682.836 363.372L684.222 359.679L684.453 356.677L682.836 354.83H682.374V354.6L680.988 354.138L679.14 353.676L677.292 353.445L673.596 354.138L671.748 353.907L665.511 352.522L662.046 350.213L660.429 349.29L658.581 348.828L654.885 348.597L650.958 346.981L649.572 346.52H646.107L640.332 345.134L639.177 345.365L638.484 345.827L636.867 347.905L635.712 348.828L632.016 349.752L627.858 349.29L603.372 340.748L588.357 333.591L584.43 332.437L576.576 331.283L568.722 328.974L555.093 322.972L548.625 318.816L547.701 318.586L546.777 318.816L543.774 321.125L542.388 321.587H540.54L538.692 321.125L513.513 311.66H513.282L509.124 309.351L501.039 303.58L497.574 301.964L496.881 301.502L442.596 281.417L438.669 279.34L437.976 279.109L432.663 275.646L431.508 274.261L429.198 271.259L428.274 269.643L427.812 268.258L427.581 266.411L427.119 265.488L424.347 262.718L423.654 261.563L422.961 259.947L422.268 259.024L421.575 258.331L419.496 256.484L418.572 255.33L417.417 253.022L416.955 252.791L412.335 251.406L409.794 251.175L408.177 250.482L407.484 249.79L406.098 248.174L403.557 246.558L402.171 245.403L399.63 242.171L398.937 241.479L396.858 240.324L395.703 239.401L394.779 238.247L392.931 235.707L389.466 231.321L388.08 229.936L388.311 229.243L388.08 228.781L385.539 223.702L384.846 223.01L379.071 218.393L377.916 217.7L364.287 212.621L359.667 211.698L354.585 211.467L353.199 211.698L352.968 211.929V212.621L353.43 217.008L352.506 217.931L352.275 219.778L351.351 221.625L349.503 223.01L347.424 223.472L345.114 223.01L338.877 220.701H338.184L335.181 221.856L334.95 221.625L334.488 222.317L334.026 223.01L330.33 220.932H327.096L318.087 223.01L313.005 225.78L310.002 226.473L307.692 226.242L305.844 225.549L302.148 223.702L298.452 222.317L286.671 219.547L284.592 218.624L283.437 216.777L282.051 211.929V210.774L282.513 209.389L283.206 208.466L284.592 207.542L284.361 207.081L279.51 203.849L276.738 201.309L275.121 199.001L276.045 196.461L277.2 195.307L279.048 194.845L281.358 195.076L283.899 195.769L283.206 195.307L282.513 194.845L281.82 194.614L279.048 193.922L277.893 193.46L275.121 191.613L273.504 190.921L268.191 190.228L265.65 190.69L264.264 190.228L263.109 189.304L262.647 187.919L263.34 186.534L264.495 186.072L265.881 185.149L265.188 183.995L262.878 181.224L261.954 177.992L263.109 176.838L263.802 176.376L263.34 176.146L262.185 175.915L259.644 175.453L257.334 174.299L255.024 172.683L253.176 171.759L251.328 171.99L249.48 172.452L245.091 172.913L235.851 175.915L233.079 176.376L231.231 176.146L228.69 174.76L227.535 174.53L224.994 174.76L222.684 174.068L221.298 172.913L218.757 168.989L217.833 168.065L217.14 166.219L212.982 163.91L212.058 163.679L211.365 163.91L210.21 164.833L208.824 165.526L207.438 165.757H204.897L200.508 164.833L196.35 162.756L181.335 153.983L182.952 158.831L182.49 161.601L179.949 162.756L177.408 162.987H174.636L168.861 162.063L167.937 162.294L167.475 162.525L165.627 164.141L164.241 165.064L164.01 165.526L164.472 165.988L165.396 166.449L172.326 167.835L174.867 168.758L177.177 170.374L179.718 172.913L185.262 177.3L188.958 179.378L189.42 180.07L189.651 181.455L188.265 182.379L185.262 183.302H183.876L182.49 182.379L181.797 180.994L181.335 179.378L180.18 177.762L178.563 176.838L176.715 176.146L171.402 174.991H170.478L170.016 175.222L168.63 175.915L167.706 176.146L166.089 175.684L164.472 174.53L163.779 174.299H163.086L162.162 174.53L161.469 174.76L161.238 174.991V175.222L161.007 176.146L160.314 177.762L159.159 178.454L159.621 179.147L161.469 180.994L162.162 182.148L162.393 183.533L162.162 188.15L161.238 189.304L160.083 189.997L160.314 190.228L161.238 190.921L162.162 192.075L160.545 193.691L159.39 194.153L156.156 194.614L155.463 194.845L153.153 196.461L150.843 197.154L143.682 197.385L139.524 198.308L136.29 200.617L134.211 204.079L133.518 208.697L132.594 211.698L130.977 213.545L127.512 216.084L127.05 217.238L127.743 218.854L130.746 223.241L131.67 225.319L132.132 227.396L132.825 228.781L134.442 230.397L136.059 231.552L137.445 233.168L138.369 234.784L139.293 236.861L140.217 238.247L141.372 239.632L142.758 240.786L144.144 241.479L145.53 241.94L148.302 242.171L149.226 242.633L149.457 243.787L148.995 244.942L148.071 245.865L146.454 247.019L145.992 247.712L145.53 250.482L144.144 251.636L132.594 251.406L92.631 256.254L64.68 192.075L43.428 144.749L39.732 136.207L18.942 90.7276L1.155 52.8667L0 51.9433L0.462 51.7124L0.231 51.4816H0.462V51.2507H1.617L78.771 12.6973L105.798 0H106.953L108.57 0.230859L139.755 9.92694L253.638 45.0175L255.717 46.1718L257.334 47.557L258.258 48.9421L260.106 51.7124L261.03 52.6359L261.723 53.0976L265.65 55.8679L269.115 57.7148L280.665 63.7171L322.014 86.3413L323.862 86.5722L343.266 79.6464L375.375 69.0269L434.511 63.7171L435.666 63.2554L449.757 51.4816L451.605 50.5582H453.684L455.994 51.4816L471.933 60.9468L478.632 64.4097L490.644 67.8726L493.647 69.2577L517.902 89.8042H518.133L529.452 80.5698L542.85 112.89V114.506L541.926 114.968L551.166 134.36L552.321 136.438L565.257 134.36L574.728 132.744L575.421 132.975L575.883 133.437L577.5 136.207L582.351 144.056L584.199 146.826L593.901 159.755L605.682 175.222L608.454 176.838L612.381 177.069L655.578 167.142L656.964 167.373L660.198 168.065L660.66 167.835L664.125 164.372L666.897 167.142L669.9 168.989L671.055 170.143L672.672 172.221L673.365 171.759H674.289V171.067L676.83 170.374L678.447 172.452L679.602 172.913L678.678 174.068L679.14 175.453L680.064 177.3L680.526 179.147L680.757 181.224L680.526 183.533L679.833 185.149L678.909 186.303H679.602L681.45 186.765L687.918 189.997L692.076 191.613L704.781 194.614L705.243 193.922H705.705V193.46L706.629 192.537H707.784L709.863 192.998L710.325 190.459L708.939 189.074L708.477 188.381H707.322L706.398 187.919L705.936 187.458L705.012 186.534L702.009 181.686L701.778 180.532L702.24 179.608L702.009 179.147L701.085 177.3L700.392 175.684L702.009 175.915V175.453L703.395 174.068L705.474 172.683L705.705 171.99L705.243 167.373L706.167 165.295L708.708 163.448L709.401 160.447L710.556 159.755L712.404 159.062L713.559 158.139L714.945 156.292L712.404 150.058L711.249 149.366L710.556 148.442V147.75V147.288L711.018 146.596L712.866 145.21L714.021 144.518V144.056H714.252L715.176 142.44L717.486 140.362L718.41 139.901L720.027 140.132H720.258L721.644 138.746L722.568 138.285H724.185L723.03 137.13V136.207H721.875L723.03 135.053L723.492 134.36L724.185 133.437L726.264 132.282L729.267 128.358L729.96 126.511L730.653 125.587L736.659 122.817L741.741 121.894L742.896 121.201L744.051 118.2L744.513 117.507L746.592 116.353L748.902 113.352L749.364 112.198L750.288 106.657L750.75 105.733L752.598 104.117V103.425V100.424L754.215 98.1151L758.142 95.3448H758.835H759.528L760.914 95.8065L762.3 96.4991L763.686 98.1151L764.379 98.5769L765.303 98.8077H765.996L766.458 98.346L766.92 96.9608L766.689 95.114L766.92 92.5745L767.613 90.4968L767.382 89.3425L767.844 87.7265L769.692 87.2648L772.002 87.4956L773.388 87.0339L774.543 86.1105L776.391 83.3401L776.853 82.4167L778.47 80.339L780.318 79.8773L782.397 80.1081L791.175 83.1093L793.716 83.3401L794.178 86.803L792.33 88.8808L789.096 90.4968L784.707 96.0374L782.397 96.9608L780.087 97.1917L779.163 97.6534L779.394 98.8077L781.011 102.04L780.78 103.887L778.701 105.041L774.543 106.195L773.619 106.888L770.847 111.043L769.923 113.352V116.122L769.461 117.969L768.306 119.123L767.151 120.047L765.303 122.355L759.759 127.434L759.528 128.127L760.683 129.281L762.531 129.743L770.154 129.281L770.385 129.512L772.233 129.974L773.388 130.435L774.543 131.128L776.622 132.744L777.315 132.975H778.008L779.163 132.282L783.783 128.358L785.631 127.896L787.248 128.358L788.634 129.281L793.485 132.975L794.64 134.129L795.795 135.976H795.564L796.257 138.746L796.719 139.439L797.181 139.67L798.105 138.977L799.26 138.746L800.646 138.977L802.032 139.439L803.418 140.132L804.573 140.824L805.497 141.286H806.19L808.269 140.593H810.81L812.196 140.824L814.506 141.517H816.354L817.971 142.209L817.74 141.748L817.278 140.362L818.664 139.208L820.512 138.977L821.898 139.901L823.515 141.978L823.977 142.44V142.209L824.901 139.67L829.521 141.517L829.059 140.362L826.749 136.207L826.518 135.745L825.594 134.129L823.746 130.666L823.515 128.819L825.825 129.05L828.828 130.435L830.907 130.666L831.831 130.435L832.293 129.512V126.511L832.062 124.664L831.831 123.971L831.369 123.279L829.521 122.124L828.135 120.97V120.508L827.904 117.969L828.366 116.815L829.752 115.891H831.369L832.755 116.815L833.91 117.738L834.603 119.354L835.065 120.97L835.989 121.201L836.682 120.278L837.837 120.508L838.761 120.97L846.153 126.049L848.001 127.896L849.156 129.743L850.311 132.282L851.466 134.129L852.39 134.36L855.855 133.206L857.703 134.129L858.858 134.822H859.32L859.782 134.36L860.475 133.206L861.399 132.282L863.016 131.821L865.095 132.282L866.481 133.667L867.174 134.822L868.329 136.669L870.177 139.439L870.87 141.055L871.101 141.978L873.18 140.824L874.335 140.362L874.104 139.208V138.515L875.259 136.899L877.107 137.592L879.186 139.208L880.11 139.439H881.496L884.268 139.208L885.192 139.67L885.885 140.593V141.055L886.347 141.748H886.809L887.964 141.517L889.35 141.748L893.508 144.518L894.894 145.441L896.742 145.672L898.821 145.441L902.979 144.287L904.827 143.825L907.599 144.056L908.523 145.441L908.985 145.903L909.909 144.749L910.602 144.287L913.143 142.44L914.76 143.133L915.684 143.825L916.608 144.056L919.149 143.364H921.459L922.152 144.056L922.845 144.98L924 145.903Z" fill="#D5D1CB" fill-opacity="0.4"/>
<path d="M924 145.903H923.076L922.614 147.75L920.766 149.366L917.07 151.674L913.836 154.676L910.833 156.061L909.909 156.523L909.678 157.677L911.064 161.832L908.985 163.448L906.906 162.987L907.137 163.679L907.368 164.603L907.137 165.757L906.213 166.911L903.672 167.373L899.283 165.757H897.435L895.356 165.295L893.046 163.91L891.429 163.217L893.046 164.372L893.739 165.988L893.97 166.911L894.201 167.142L897.204 168.296L898.359 169.681L899.052 171.297L899.283 172.913L898.821 174.991L896.973 175.684L895.125 175.453L890.967 174.299L888.888 174.76L887.04 174.53V172.913L886.116 173.144L885.654 173.375L883.575 175.222L883.806 176.146V178.223L882.651 180.07L879.879 182.148L880.11 182.379L881.034 182.61L882.651 182.84L884.037 183.302L884.961 183.995V185.842L883.344 186.534H882.42L881.496 186.303L880.803 186.765L878.955 186.996H876.876L875.721 187.227L875.259 188.15V189.766L875.028 191.151L874.335 192.075L872.256 193.922L871.332 194.383L869.484 193.922L868.329 192.767L867.174 190.69L866.25 189.766L865.095 188.843V189.304L865.557 190.459L865.326 192.075L863.478 192.537H860.937L859.551 192.306L858.165 191.844L857.01 191.613L855.855 190.459L853.314 190.228L851.466 189.304H850.773L849.387 189.766L848.232 189.997L847.077 189.766L845.691 188.843V189.074L845.922 190.228L845.46 192.075L843.15 192.767L837.375 192.998L835.296 193.691L834.372 195.769H832.755L828.828 196.692L822.822 199.693L820.743 200.155L818.202 200.386L815.199 199.231L813.12 196.923L811.272 194.614L809.424 193.229L808.731 192.998L808.269 193.229L807.345 193.691L806.19 193.922H804.804L801.108 193.229L800.646 190.921L800.184 190.69L800.415 189.997L799.953 190.69L798.336 189.304L797.412 187.919L797.643 186.072L799.26 184.687L802.032 183.533V183.302L802.494 181.224L802.956 180.301L803.649 179.839L804.804 179.147L805.035 178.916L805.959 176.607L810.117 171.297L809.655 169.912L808.038 169.451L803.187 169.22L801.57 168.065L800.646 166.911L800.877 165.064L802.032 164.833L791.637 159.062L789.096 157.908L787.017 156.753L784.938 156.523L784.476 156.753L785.862 162.294L784.245 166.219L781.704 168.527L777.546 171.067L774.312 174.991L766.689 178.916L766.227 179.378L765.765 180.07L764.841 182.84L763.917 184.226L762.3 185.149L759.99 184.687L758.373 183.764L756.756 182.61L756.063 182.148L754.677 181.686L753.522 181.224L750.519 178.916L749.364 178.454H747.978L746.823 178.223L745.206 177.531H744.744L743.589 177.992L743.82 177.762L743.589 178.223L743.127 179.608V180.763L743.589 182.379L744.513 184.226L746.361 187.458L746.592 188.843L745.437 189.997L742.665 190.69L742.203 191.382L742.434 191.613L745.668 194.153L748.209 197.154L749.133 197.846L751.212 199.693L752.367 200.617L753.522 202.233L754.908 205.926L752.367 206.85L750.519 206.619L755.37 208.928L756.525 211.467L754.215 213.083L751.443 213.545L746.592 213.083L742.665 212.16H741.741L734.811 214.468L734.118 214.93L732.732 216.084L731.346 216.546H728.574L727.65 216.777L724.416 218.162L724.878 218.393L727.419 219.085L729.036 219.316L739.893 215.392L743.589 216.777L744.513 217.7L744.975 218.624L745.437 219.778L745.206 221.394L743.358 222.086H739.893L739.431 222.317L738.276 223.933L737.121 224.395L737.352 224.857L737.583 225.088L744.513 229.936L745.668 232.013L742.665 234.091L740.817 232.706V233.86L740.355 234.322L740.124 234.553V234.784L740.586 235.938L739.893 237.323L737.814 236.861L735.735 235.245L734.811 236.631H734.118L737.814 245.403L738.276 247.019L738.045 248.866L737.121 250.482L735.735 251.867L737.121 253.252L735.273 254.407L732.501 255.792L729.96 256.484L727.188 256.715L722.799 256.023L715.638 256.946L697.389 256.023L695.31 256.254L694.155 256.946L690.921 260.64L687.456 261.794V262.025L688.842 264.334L688.149 265.719L687.225 266.181H686.07L686.301 268.027L686.994 270.105L687.918 272.414L688.149 274.492L688.842 277.031L687.687 277.724H687.225L687.456 278.416L688.611 280.263L689.997 280.956L696.465 281.879L700.392 281.417L703.164 281.879L703.626 282.11L704.319 282.572L705.012 282.341L705.936 282.572L707.091 283.726L707.553 284.418L708.939 288.805L709.632 289.728L710.325 290.19L716.562 289.959L717.486 289.728L721.875 287.189L722.799 286.958L724.416 287.189L725.34 287.65H725.802L726.033 287.42L726.726 286.727L727.65 286.496H728.343H728.574H728.805L730.653 287.65L733.656 290.652L735.735 292.268L737.121 293.653L737.814 295.269V296.423L737.352 297.808L736.89 298.501L735.735 299.424L734.349 299.886V300.117L735.735 301.502L736.197 302.425L736.659 303.58H735.966L735.273 304.272V304.503L735.735 305.196L737.121 307.043L737.814 308.197L739.2 311.429L739.662 312.352L740.124 312.814L742.203 314.43L742.896 315.354L743.82 317.2L744.282 317.893L744.744 318.355L747.516 319.74L750.519 322.279L751.443 322.741L754.446 323.664L759.99 326.204L762.069 328.051L763.455 330.359L764.148 333.822L764.379 337.285L763.686 340.286V341.21L763.917 343.057V344.211L762.993 345.365L762.3 345.596L759.99 346.289L759.066 346.75L758.835 347.212L759.297 352.984L759.066 355.985L757.449 361.525L755.832 364.296L754.677 367.528L754.215 370.76L754.446 374.223L755.139 376.3L757.911 380.456L759.066 382.995L759.759 385.073L759.99 387.382L759.759 389.229L759.99 389.921L758.142 390.614L757.449 389.69L756.756 389.229L756.063 388.998H755.139L753.522 389.229H752.598L751.905 388.998L750.288 388.305H750.057L749.364 388.767V389.229L749.133 390.152L747.978 390.845L746.13 389.921L744.513 388.074L743.82 387.843L743.358 388.074L742.896 388.536L741.972 390.383L741.048 391.306L740.124 391.999L738.969 392.461L737.814 392.691L737.121 392.922L735.504 394.538L734.349 395L732.501 394.769L731.346 393.846L730.422 392.691L729.729 391.999L728.574 391.537L726.264 391.075L724.416 390.383L723.492 389.69L721.644 387.382L721.182 387.151L720.027 386.92L716.793 385.766L714.714 385.996L710.787 387.612L704.55 388.998L703.857 389.921L702.933 390.383L700.854 390.614L697.158 389.921H696.003L695.079 390.152L693.924 390.845L691.383 389.921L690.921 388.074L691.383 386.458L691.845 385.535L692.076 384.842L691.845 384.611L690.921 384.15L689.304 383.457L687.687 381.61L686.994 379.532L686.301 375.377L685.608 373.299L683.298 369.144L682.374 366.604L682.836 363.372L684.222 359.679L684.453 356.677L682.836 354.83H682.374V354.6L680.988 354.138L679.14 353.676L677.292 353.445L673.596 354.138L671.748 353.907L665.511 352.522L662.046 350.213L660.429 349.29L658.581 348.828L654.885 348.597L650.958 346.981L649.572 346.52H646.107L640.332 345.134L639.177 345.365L638.484 345.827L636.867 347.905L635.712 348.828L632.016 349.752L627.858 349.29L603.372 340.748L588.357 333.591L584.43 332.437L576.576 331.283L568.722 328.974L555.093 322.972L548.625 318.816L547.701 318.586L546.777 318.816L543.774 321.125L542.388 321.587H540.54L538.692 321.125L513.513 311.66H513.282L509.124 309.351L501.039 303.58L497.574 301.964L496.881 301.502L442.596 281.417L438.669 279.34L437.976 279.109L432.663 275.646L431.508 274.261L429.198 271.259L428.274 269.643L427.812 268.258L427.581 266.411L427.119 265.488L424.347 262.718L423.654 261.563L422.961 259.947L422.268 259.024L421.575 258.331L419.496 256.484L418.572 255.33L417.417 253.022L416.955 252.791L412.335 251.406L409.794 251.175L408.177 250.482L407.484 249.79L406.098 248.174L403.557 246.558L402.171 245.403L399.63 242.171L398.937 241.479L396.858 240.324L395.703 239.401L394.779 238.247L392.931 235.707L389.466 231.321L388.08 229.936L388.311 229.243L388.08 228.781L385.539 223.702L384.846 223.01L379.071 218.393L377.916 217.7L364.287 212.621L359.667 211.698L354.585 211.467L353.199 211.698L352.968 211.929V212.621L353.43 217.008L352.506 217.931L352.275 219.778L351.351 221.625L349.503 223.01L347.424 223.472L345.114 223.01L338.877 220.701H338.184L335.181 221.856L334.95 221.625L334.488 222.317L334.026 223.01L330.33 220.932H327.096L318.087 223.01L313.005 225.78L310.002 226.473L307.692 226.242L305.844 225.549L302.148 223.702L298.452 222.317L286.671 219.547L284.592 218.624L283.437 216.777L282.051 211.929V210.774L282.513 209.389L283.206 208.466L284.592 207.542L284.361 207.081L279.51 203.849L276.738 201.309L275.121 199.001L276.045 196.461L277.2 195.307L279.048 194.845L281.358 195.076L283.899 195.769L283.206 195.307L282.513 194.845L281.82 194.614L279.048 193.922L277.893 193.46L275.121 191.613L273.504 190.921L268.191 190.228L265.65 190.69L264.264 190.228L263.109 189.304L262.647 187.919L263.34 186.534L264.495 186.072L265.881 185.149L265.188 183.995L262.878 181.224L261.954 177.992L263.109 176.838L263.802 176.376L263.34 176.146L262.185 175.915L259.644 175.453L257.334 174.299L255.024 172.683L253.176 171.759L251.328 171.99L249.48 172.452L245.091 172.913L235.851 175.915L233.079 176.376L231.231 176.146L228.69 174.76L227.535 174.53L224.994 174.76L222.684 174.068L221.298 172.913L218.757 168.989L217.833 168.065L217.14 166.219L212.982 163.91L212.058 163.679L211.365 163.91L210.21 164.833L208.824 165.526L207.438 165.757H204.897L200.508 164.833L196.35 162.756L181.335 153.983L182.952 158.831L182.49 161.601L179.949 162.756L177.408 162.987H174.636L168.861 162.063L167.937 162.294L167.475 162.525L165.627 164.141L164.241 165.064L164.01 165.526L164.472 165.988L165.396 166.449L172.326 167.835L174.867 168.758L177.177 170.374L179.718 172.913L185.262 177.3L188.958 179.378L189.42 180.07L189.651 181.455L188.265 182.379L185.262 183.302H183.876L182.49 182.379L181.797 180.994L181.335 179.378L180.18 177.762L178.563 176.838L176.715 176.146L171.402 174.991H170.478L170.016 175.222L168.63 175.915L167.706 176.146L166.089 175.684L164.472 174.53L163.779 174.299H163.086L162.162 174.53L161.469 174.76L161.238 174.991V175.222L161.007 176.146L160.314 177.762L159.159 178.454L159.621 179.147L161.469 180.994L162.162 182.148L162.393 183.533L162.162 188.15L161.238 189.304L160.083 189.997L160.314 190.228L161.238 190.921L162.162 192.075L160.545 193.691L159.39 194.153L156.156 194.614L155.463 194.845L153.153 196.461L150.843 197.154L143.682 197.385L139.524 198.308L136.29 200.617L134.211 204.079L133.518 208.697L132.594 211.698L130.977 213.545L127.512 216.084L127.05 217.238L127.743 218.854L130.746 223.241L131.67 225.319L132.132 227.396L132.825 228.781L134.442 230.397L136.059 231.552L137.445 233.168L138.369 234.784L139.293 236.861L140.217 238.247L141.372 239.632L142.758 240.786L144.144 241.479L145.53 241.94L148.302 242.171L149.226 242.633L149.457 243.787L148.995 244.942L148.071 245.865L146.454 247.019L145.992 247.712L145.53 250.482L144.144 251.636L132.594 251.406L92.631 256.254L64.68 192.075L43.428 144.749L39.732 136.207L18.942 90.7276L1.155 52.8667L0 51.9433L0.462 51.7124L0.231 51.4816H0.462V51.2507H1.617L78.771 12.6973L105.798 0H106.953L108.57 0.230859L139.755 9.92694L253.638 45.0175L255.717 46.1718L257.334 47.557L258.258 48.9421L260.106 51.7124L261.03 52.6359L261.723 53.0976L265.65 55.8679L269.115 57.7148L280.665 63.7171L322.014 86.3413L323.862 86.5722L343.266 79.6464L375.375 69.0269L434.511 63.7171L435.666 63.2554L449.757 51.4816L451.605 50.5582H453.684L455.994 51.4816L471.933 60.9468L478.632 64.4097L490.644 67.8726L493.647 69.2577L517.902 89.8042H518.133L529.452 80.5698L542.85 112.89V114.506L541.926 114.968L551.166 134.36L552.321 136.438L565.257 134.36L574.728 132.744L575.421 132.975L575.883 133.437L577.5 136.207L582.351 144.056L584.199 146.826L593.901 159.755L605.682 175.222L608.454 176.838L612.381 177.069L655.578 167.142L656.964 167.373L660.198 168.065L660.66 167.835L664.125 164.372L666.897 167.142L669.9 168.989L671.055 170.143L672.672 172.221L673.365 171.759H674.289V171.067L676.83 170.374L678.447 172.452L679.602 172.913L678.678 174.068L679.14 175.453L680.064 177.3L680.526 179.147L680.757 181.224L680.526 183.533L679.833 185.149L678.909 186.303H679.602L681.45 186.765L687.918 189.997L692.076 191.613L704.781 194.614L705.243 193.922H705.705V193.46L706.629 192.537H707.784L709.863 192.998L710.325 190.459L708.939 189.074L708.477 188.381H707.322L706.398 187.919L705.936 187.458L705.012 186.534L702.009 181.686L701.778 180.532L702.24 179.608L702.009 179.147L701.085 177.3L700.392 175.684L702.009 175.915V175.453L703.395 174.068L705.474 172.683L705.705 171.99L705.243 167.373L706.167 165.295L708.708 163.448L709.401 160.447L710.556 159.755L712.404 159.062L713.559 158.139L714.945 156.292L712.404 150.058L711.249 149.366L710.556 148.442V147.75V147.288L711.018 146.596L712.866 145.21L714.021 144.518V144.056H714.252L715.176 142.44L717.486 140.362L718.41 139.901L720.027 140.132H720.258L721.644 138.746L722.568 138.285H724.185L723.03 137.13V136.207H721.875L723.03 135.053L723.492 134.36L724.185 133.437L726.264 132.282L729.267 128.358L729.96 126.511L730.653 125.587L736.659 122.817L741.741 121.894L742.896 121.201L744.051 118.2L744.513 117.507L746.592 116.353L748.902 113.352L749.364 112.198L750.288 106.657L750.75 105.733L752.598 104.117V103.425V100.424L754.215 98.1151L758.142 95.3448H758.835H759.528L760.914 95.8065L762.3 96.4991L763.686 98.1151L764.379 98.5769L765.303 98.8077H765.996L766.458 98.346L766.92 96.9608L766.689 95.114L766.92 92.5745L767.613 90.4968L767.382 89.3425L767.844 87.7265L769.692 87.2648L772.002 87.4956L773.388 87.0339L774.543 86.1105L776.391 83.3401L776.853 82.4167L778.47 80.339L780.318 79.8773L782.397 80.1081L791.175 83.1093L793.716 83.3401L794.178 86.803L792.33 88.8808L789.096 90.4968L784.707 96.0374L782.397 96.9608L780.087 97.1917L779.163 97.6534L779.394 98.8077L781.011 102.04L780.78 103.887L778.701 105.041L774.543 106.195L773.619 106.888L770.847 111.043L769.923 113.352V116.122L769.461 117.969L768.306 119.123L767.151 120.047L765.303 122.355L759.759 127.434L759.528 128.127L760.683 129.281L762.531 129.743L770.154 129.281L770.385 129.512L772.233 129.974L773.388 130.435L774.543 131.128L776.622 132.744L777.315 132.975H778.008L779.163 132.282L783.783 128.358L785.631 127.896L787.248 128.358L788.634 129.281L793.485 132.975L794.64 134.129L795.795 135.976H795.564L796.257 138.746L796.719 139.439L797.181 139.67L798.105 138.977L799.26 138.746L800.646 138.977L802.032 139.439L803.418 140.132L804.573 140.824L805.497 141.286H806.19L808.269 140.593H810.81L812.196 140.824L814.506 141.517H816.354L817.971 142.209L817.74 141.748L817.278 140.362L818.664 139.208L820.512 138.977L821.898 139.901L823.515 141.978L823.977 142.44V142.209L824.901 139.67L829.521 141.517L829.059 140.362L826.749 136.207L826.518 135.745L825.594 134.129L823.746 130.666L823.515 128.819L825.825 129.05L828.828 130.435L830.907 130.666L831.831 130.435L832.293 129.512V126.511L832.062 124.664L831.831 123.971L831.369 123.279L829.521 122.124L828.135 120.97V120.508L827.904 117.969L828.366 116.815L829.752 115.891H831.369L832.755 116.815L833.91 117.738L834.603 119.354L835.065 120.97L835.989 121.201L836.682 120.278L837.837 120.508L838.761 120.97L846.153 126.049L848.001 127.896L849.156 129.743L850.311 132.282L851.466 134.129L852.39 134.36L855.855 133.206L857.703 134.129L858.858 134.822H859.32L859.782 134.36L860.475 133.206L861.399 132.282L863.016 131.821L865.095 132.282L866.481 133.667L867.174 134.822L868.329 136.669L870.177 139.439L870.87 141.055L871.101 141.978L873.18 140.824L874.335 140.362L874.104 139.208V138.515L875.259 136.899L877.107 137.592L879.186 139.208L880.11 139.439H881.496L884.268 139.208L885.192 139.67L885.885 140.593V141.055L886.347 141.748H886.809L887.964 141.517L889.35 141.748L893.508 144.518L894.894 145.441L896.742 145.672L898.821 145.441L902.979 144.287L904.827 143.825L907.599 144.056L908.523 145.441L908.985 145.903L909.909 144.749L910.602 144.287L913.143 142.44L914.76 143.133L915.684 143.825L916.608 144.056L919.149 143.364H921.459L922.152 144.056L922.845 144.98L924 145.903Z" stroke="#A08E84" stroke-width="2" mask="url(#path-1-inside-1)"/>
</g>
</svg>
