%YAML 1.1
%TAG !u! tag:unity3d.com,2011:
--- !u!21 &2100000
Material:
  serializedVersion: 6
  m_ObjectHideFlags: 0
  m_CorrespondingSourceObject: {fileID: 0}
  m_PrefabInstance: {fileID: 0}
  m_PrefabAsset: {fileID: 0}
  m_Name: Livingroom_Skybox
  m_Shader: {fileID: -6465566751694194690, guid: 8c5437e1e79866b42acb52178e585574,
    type: 3}
  m_ShaderKeywords: 
  m_LightmapFlags: 4
  m_EnableInstancingVariants: 0
  m_DoubleSidedGI: 0
  m_CustomRenderQueue: -1
  stringTagMap: {}
  disabledShaderPasses: []
  m_SavedProperties:
    serializedVersion: 3
    m_TexEnvs:
    - _BaseMap:
        m_Texture: {fileID: 0}
        m_Scale: {x: 1, y: 1}
        m_Offset: {x: 0, y: 0}
    - _BumpMap:
        m_Texture: {fileID: 0}
        m_Scale: {x: 1, y: 1}
        m_Offset: {x: 0, y: 0}
    - _EmissionMap:
        m_Texture: {fileID: 0}
        m_Scale: {x: 1, y: 1}
        m_Offset: {x: 0, y: 0}
    - _MainTex:
        m_Texture: {fileID: 0}
        m_Scale: {x: 1, y: 1}
        m_Offset: {x: 0, y: 0}
    - _MetallicGlossMap:
        m_Texture: {fileID: 0}
        m_Scale: {x: 1, y: 1}
        m_Offset: {x: 0, y: 0}
    - _OcclusionMap:
        m_Texture: {fileID: 0}
        m_Scale: {x: 1, y: 1}
        m_Offset: {x: 0, y: 0}
    - _SpecGlossMap:
        m_Texture: {fileID: 0}
        m_Scale: {x: 1, y: 1}
        m_Offset: {x: 0, y: 0}
    m_Floats:
    - Vector1_290D65B0: 3.94
    - Vector1_2B7D0A32: 1.8
    - Vector1_3CDCEF3E: 1.6
    - Vector1_4A0BE23E: 2.33
    - Vector1_512B361C: 66.8
    - Vector1_631565C2: 46
    - Vector1_69B7B8C7: -0.8
    - Vector1_78AF7052: 0.18
    - Vector1_792538A4: 2.11
    - Vector1_81A3149D: 49.99
    - Vector1_A20C3F78: 1.44
    - Vector1_BC12DC95: 2.76
    - Vector1_C4E6E8BF: 0.002
    - Vector1_C70FC1AE: 5
    - Vector1_F1E1102B: 50.7
    - Vector1_FAC11F3B: 149.87
    - _AlphaClip: 0
    - _Blend: 0
    - _BumpScale: 1
    - _Cull: 2
    - _Cutoff: 0.5
    - _DstBlend: 0
    - _EnvironmentReflections: 1
    - _GlossMapScale: 0
    - _Glossiness: 0
    - _GlossyReflections: 0
    - _Metallic: 0
    - _OcclusionStrength: 1
    - _QueueOffset: 0
    - _ReceiveShadows: 1
    - _Smoothness: 0.5
    - _SmoothnessTextureChannel: 0
    - _SpecularHighlights: 1
    - _SrcBlend: 1
    - _Surface: 0
    - _WorkflowMode: 1
    - _ZWrite: 1
    m_Colors:
    - Color_25ACFDA5: {r: 1, g: 1, b: 1, a: 0}
    - Color_91360F3B: {r: 0, g: 0.42916012, b: 0.7924528, a: 0}
    - Color_EF903152: {r: 0, g: 0, b: 0, a: 0}
    - Color_FC71471D: {r: 0, g: 0.114737496, b: 0.509434, a: 0}
    - Vector2_2050B7BD: {r: 1, g: 0.3, b: 0, a: 0}
    - Vector2_33866471: {r: 5, g: 1, b: 0, a: 0}
    - Vector2_8ACBD29D: {r: 0.02, g: -0.1, b: 0, a: 0}
    - Vector2_BA63C991: {r: 2, g: 1, b: 0, a: 0}
    - Vector2_E3D949A4: {r: 1, g: 20, b: 0, a: 0}
    - _BaseColor: {r: 1, g: 1, b: 1, a: 1}
    - _Color: {r: 1, g: 1, b: 1, a: 1}
    - _EmissionColor: {r: 0, g: 0, b: 0, a: 1}
    - _SpecColor: {r: 0.19999996, g: 0.19999996, b: 0.19999996, a: 1}
--- !u!114 &4405450522758551580
MonoBehaviour:
  m_ObjectHideFlags: 11
  m_CorrespondingSourceObject: {fileID: 0}
  m_PrefabInstance: {fileID: 0}
  m_PrefabAsset: {fileID: 0}
  m_GameObject: {fileID: 0}
  m_Enabled: 1
  m_EditorHideFlags: 0
  m_Script: {fileID: 11500000, guid: d0353a89b1f911e48b9e16bdc9f2e058, type: 3}
  m_Name: 
  m_EditorClassIdentifier: 
  version: 1
