%YAML 1.1
%TAG !u! tag:unity3d.com,2011:
--- !u!114 &-4517160133838989715
MonoBehaviour:
  m_ObjectHideFlags: 11
  m_CorrespondingSourceObject: {fileID: 0}
  m_PrefabInstance: {fileID: 0}
  m_PrefabAsset: {fileID: 0}
  m_GameObject: {fileID: 0}
  m_Enabled: 1
  m_EditorHideFlags: 0
  m_Script: {fileID: 11500000, guid: d0353a89b1f911e48b9e16bdc9f2e058, type: 3}
  m_Name: 
  m_EditorClassIdentifier: 
  version: 1
--- !u!21 &2100000
Material:
  serializedVersion: 6
  m_ObjectHideFlags: 0
  m_CorrespondingSourceObject: {fileID: 0}
  m_PrefabInstance: {fileID: 0}
  m_PrefabAsset: {fileID: 0}
  m_Name: M_Sol_LivingRoom
  m_Shader: {fileID: -6465566751694194690, guid: d0de55b24fb877142ae42fad7523187d,
    type: 3}
  m_ShaderKeywords: 
  m_LightmapFlags: 4
  m_EnableInstancingVariants: 0
  m_DoubleSidedGI: 0
  m_CustomRenderQueue: -1
  stringTagMap: {}
  disabledShaderPasses: []
  m_SavedProperties:
    serializedVersion: 3
    m_TexEnvs:
    - _BaseMap:
        m_Texture: {fileID: 0}
        m_Scale: {x: 1, y: 1}
        m_Offset: {x: 0, y: 0}
    - _BumpMap:
        m_Texture: {fileID: 0}
        m_Scale: {x: 1, y: 1}
        m_Offset: {x: 0, y: 0}
    - _EmissionMap:
        m_Texture: {fileID: 0}
        m_Scale: {x: 1, y: 1}
        m_Offset: {x: 0, y: 0}
    - _MainTex:
        m_Texture: {fileID: 0}
        m_Scale: {x: 1, y: 1}
        m_Offset: {x: 0, y: 0}
    - _MetallicGlossMap:
        m_Texture: {fileID: 0}
        m_Scale: {x: 1, y: 1}
        m_Offset: {x: 0, y: 0}
    - _OcclusionMap:
        m_Texture: {fileID: 0}
        m_Scale: {x: 1, y: 1}
        m_Offset: {x: 0, y: 0}
    - _SampleTexture2D_128D7AAF_Texture_1:
        m_Texture: {fileID: 2800000, guid: 1291130c6cdcd5e4f9b633e3c881055f, type: 3}
        m_Scale: {x: 1, y: 1}
        m_Offset: {x: 0, y: 0}
    - _SampleTexture2D_15C1BB18_Texture_1:
        m_Texture: {fileID: 2800000, guid: c1a21c4432b5d6b458f60e80a2585e76, type: 3}
        m_Scale: {x: 1, y: 1}
        m_Offset: {x: 0, y: 0}
    - _SampleTexture2D_16D4D244_Texture_1:
        m_Texture: {fileID: 2800000, guid: e45d4d9c949651248bae265dfc761a1c, type: 3}
        m_Scale: {x: 1, y: 1}
        m_Offset: {x: 0, y: 0}
    - _SampleTexture2D_1D865E1C_Texture_1:
        m_Texture: {fileID: 2800000, guid: cbf00cd93a637f8428ce8d58961a6a5f, type: 3}
        m_Scale: {x: 1, y: 1}
        m_Offset: {x: 0, y: 0}
    - _SampleTexture2D_2453A798_Texture_1:
        m_Texture: {fileID: 2800000, guid: e45d4d9c949651248bae265dfc761a1c, type: 3}
        m_Scale: {x: 1, y: 1}
        m_Offset: {x: 0, y: 0}
    - _SampleTexture2D_325A9249_Texture_1:
        m_Texture: {fileID: 2800000, guid: e45d4d9c949651248bae265dfc761a1c, type: 3}
        m_Scale: {x: 1, y: 1}
        m_Offset: {x: 0, y: 0}
    - _SampleTexture2D_5306262D_Texture_1:
        m_Texture: {fileID: 2800000, guid: 89590900462fdbc48b8c7ffdb29a7f21, type: 3}
        m_Scale: {x: 1, y: 1}
        m_Offset: {x: 0, y: 0}
    - _SampleTexture2D_5B63393F_Texture_1:
        m_Texture: {fileID: 2800000, guid: cbf00cd93a637f8428ce8d58961a6a5f, type: 3}
        m_Scale: {x: 1, y: 1}
        m_Offset: {x: 0, y: 0}
    - _SampleTexture2D_5C3A74BC_Texture_1:
        m_Texture: {fileID: 2800000, guid: eebdda12a8161a1469f0482856bb56aa, type: 3}
        m_Scale: {x: 1, y: 1}
        m_Offset: {x: 0, y: 0}
    - _SampleTexture2D_79B7DFC9_Texture_1:
        m_Texture: {fileID: 2800000, guid: 1344ecaf6ebf1b548bf2a98c715a60da, type: 3}
        m_Scale: {x: 1, y: 1}
        m_Offset: {x: 0, y: 0}
    - _SampleTexture2D_7B5D1BB7_Texture_1:
        m_Texture: {fileID: 2800000, guid: 2229539ea3b2c434ab4ce3da22435ec3, type: 3}
        m_Scale: {x: 1, y: 1}
        m_Offset: {x: 0, y: 0}
    - _SampleTexture2D_8859F0D9_Texture_1:
        m_Texture: {fileID: 2800000, guid: 1a6fa359e5df17c40bd3be38b0682707, type: 3}
        m_Scale: {x: 1, y: 1}
        m_Offset: {x: 0, y: 0}
    - _SampleTexture2D_8F1C70FB_Texture_1:
        m_Texture: {fileID: 2800000, guid: cf3cd38cdd7b39740b9af12152c04d9c, type: 3}
        m_Scale: {x: 1, y: 1}
        m_Offset: {x: 0, y: 0}
    - _SampleTexture2D_97020953_Texture_1:
        m_Texture: {fileID: 2800000, guid: e45d4d9c949651248bae265dfc761a1c, type: 3}
        m_Scale: {x: 1, y: 1}
        m_Offset: {x: 0, y: 0}
    - _SampleTexture2D_98EEFBA0_Texture_1:
        m_Texture: {fileID: 2800000, guid: 1291130c6cdcd5e4f9b633e3c881055f, type: 3}
        m_Scale: {x: 1, y: 1}
        m_Offset: {x: 0, y: 0}
    - _SampleTexture2D_A4C1537A_Texture_1:
        m_Texture: {fileID: 2800000, guid: 09d0e5b057508ae48b4ab5b3ae560df1, type: 3}
        m_Scale: {x: 1, y: 1}
        m_Offset: {x: 0, y: 0}
    - _SampleTexture2D_B05DEC6_Texture_1:
        m_Texture: {fileID: 2800000, guid: cbf00cd93a637f8428ce8d58961a6a5f, type: 3}
        m_Scale: {x: 1, y: 1}
        m_Offset: {x: 0, y: 0}
    - _SampleTexture2D_BB19219B_Texture_1:
        m_Texture: {fileID: 2800000, guid: 89590900462fdbc48b8c7ffdb29a7f21, type: 3}
        m_Scale: {x: 1, y: 1}
        m_Offset: {x: 0, y: 0}
    - _SampleTexture2D_C7C805AE_Texture_1:
        m_Texture: {fileID: 2800000, guid: 89590900462fdbc48b8c7ffdb29a7f21, type: 3}
        m_Scale: {x: 1, y: 1}
        m_Offset: {x: 0, y: 0}
    - _SampleTexture2D_DC28A7D1_Texture_1:
        m_Texture: {fileID: 2800000, guid: 89590900462fdbc48b8c7ffdb29a7f21, type: 3}
        m_Scale: {x: 1, y: 1}
        m_Offset: {x: 0, y: 0}
    - _SampleTexture2D_EE47FDAC_Texture_1:
        m_Texture: {fileID: 2800000, guid: 09d0e5b057508ae48b4ab5b3ae560df1, type: 3}
        m_Scale: {x: 1, y: 1}
        m_Offset: {x: 0, y: 0}
    - _SampleTexture2D_F414767B_Texture_1:
        m_Texture: {fileID: 2800000, guid: 8eff51038d6e02347ad27979a3e94635, type: 3}
        m_Scale: {x: 1, y: 1}
        m_Offset: {x: 0, y: 0}
    - _SampleTexture2D_F4B14E5_Texture_1:
        m_Texture: {fileID: 2800000, guid: 8bda4535cc18104478a3938a9749fef2, type: 3}
        m_Scale: {x: 1, y: 1}
        m_Offset: {x: 0, y: 0}
    - _SampleTexture2D_FA0287_Texture_1:
        m_Texture: {fileID: 2800000, guid: cbf00cd93a637f8428ce8d58961a6a5f, type: 3}
        m_Scale: {x: 1, y: 1}
        m_Offset: {x: 0, y: 0}
    - _SpecGlossMap:
        m_Texture: {fileID: 0}
        m_Scale: {x: 1, y: 1}
        m_Offset: {x: 0, y: 0}
    m_Floats:
    - _AlphaClip: 0
    - _Blend: 0
    - _BumpScale: 1
    - _Cull: 2
    - _Cutoff: 0.5
    - _DstBlend: 0
    - _EnvironmentReflections: 1
    - _GlossMapScale: 0
    - _Glossiness: 0
    - _GlossyReflections: 0
    - _Metallic: 0
    - _OcclusionStrength: 1
    - _QueueOffset: 0
    - _ReceiveShadows: 1
    - _Smoothness: 0.5
    - _SmoothnessTextureChannel: 0
    - _SpecularHighlights: 1
    - _SrcBlend: 1
    - _Surface: 0
    - _WorkflowMode: 1
    - _ZWrite: 1
    m_Colors:
    - _BaseColor: {r: 1, g: 1, b: 1, a: 1}
    - _Color: {r: 1, g: 1, b: 1, a: 1}
    - _EmissionColor: {r: 0, g: 0, b: 0, a: 1}
    - _SpecColor: {r: 0.19999996, g: 0.19999996, b: 0.19999996, a: 1}
