%YAML 1.1
%TAG !u! tag:unity3d.com,2011:
--- !u!1 &1576990427241600874
GameObject:
  m_ObjectHideFlags: 0
  m_CorrespondingSourceObject: {fileID: 0}
  m_PrefabInstance: {fileID: 0}
  m_PrefabAsset: {fileID: 0}
  serializedVersion: 6
  m_Component:
  - component: {fileID: 1576990427241600873}
  - component: {fileID: 1576990427241600872}
  m_Layer: 0
  m_Name: TabouretBox
  m_TagString: Untagged
  m_Icon: {fileID: 0}
  m_NavMeshLayer: 0
  m_StaticEditorFlags: 4294967295
  m_IsActive: 1
--- !u!4 &1576990427241600873
Transform:
  m_ObjectHideFlags: 0
  m_CorrespondingSourceObject: {fileID: 0}
  m_PrefabInstance: {fileID: 0}
  m_PrefabAsset: {fileID: 0}
  m_GameObject: {fileID: 1576990427241600874}
  m_LocalRotation: {x: 0, y: 0, z: 0, w: 1}
  m_LocalPosition: {x: -2.22, y: -0.583704, z: 0.6742165}
  m_LocalScale: {x: 1, y: 1, z: 1}
  m_Children:
  - {fileID: 7481505301725837086}
  m_Father: {fileID: 0}
  m_RootOrder: 0
  m_LocalEulerAnglesHint: {x: 0, y: 0, z: 0}
--- !u!65 &1576990427241600872
BoxCollider:
  m_ObjectHideFlags: 0
  m_CorrespondingSourceObject: {fileID: 0}
  m_PrefabInstance: {fileID: 0}
  m_PrefabAsset: {fileID: 0}
  m_GameObject: {fileID: 1576990427241600874}
  m_Material: {fileID: 0}
  m_IsTrigger: 0
  m_Enabled: 1
  serializedVersion: 2
  m_Size: {x: 0.8664851, y: 0.72076774, z: 0.87468386}
  m_Center: {x: -0.25614142, y: 0.9135722, z: -1.0171502}
--- !u!1001 &6942611171051344117
PrefabInstance:
  m_ObjectHideFlags: 0
  serializedVersion: 2
  m_Modification:
    m_TransformParent: {fileID: 1576990427241600873}
    m_Modifications:
    - target: {fileID: -8679921383154817045, guid: 34a4c2bfc0ad87c49b8b2db32b1d3017,
        type: 3}
      propertyPath: m_LocalPosition.x
      value: -0.019633293
      objectReference: {fileID: 0}
    - target: {fileID: -8679921383154817045, guid: 34a4c2bfc0ad87c49b8b2db32b1d3017,
        type: 3}
      propertyPath: m_LocalPosition.y
      value: 0.832
      objectReference: {fileID: 0}
    - target: {fileID: -8679921383154817045, guid: 34a4c2bfc0ad87c49b8b2db32b1d3017,
        type: 3}
      propertyPath: m_LocalPosition.z
      value: -0.8901967
      objectReference: {fileID: 0}
    - target: {fileID: -8679921383154817045, guid: 34a4c2bfc0ad87c49b8b2db32b1d3017,
        type: 3}
      propertyPath: m_LocalRotation.x
      value: -0.18715812
      objectReference: {fileID: 0}
    - target: {fileID: -8679921383154817045, guid: 34a4c2bfc0ad87c49b8b2db32b1d3017,
        type: 3}
      propertyPath: m_LocalRotation.y
      value: -0.21887596
      objectReference: {fileID: 0}
    - target: {fileID: -8679921383154817045, guid: 34a4c2bfc0ad87c49b8b2db32b1d3017,
        type: 3}
      propertyPath: m_LocalRotation.z
      value: 0.67420346
      objectReference: {fileID: 0}
    - target: {fileID: -8679921383154817045, guid: 34a4c2bfc0ad87c49b8b2db32b1d3017,
        type: 3}
      propertyPath: m_LocalRotation.w
      value: 0.68008447
      objectReference: {fileID: 0}
    - target: {fileID: -8679921383154817045, guid: 34a4c2bfc0ad87c49b8b2db32b1d3017,
        type: 3}
      propertyPath: m_RootOrder
      value: 0
      objectReference: {fileID: 0}
    - target: {fileID: -8679921383154817045, guid: 34a4c2bfc0ad87c49b8b2db32b1d3017,
        type: 3}
      propertyPath: m_LocalEulerAnglesHint.x
      value: 2.325
      objectReference: {fileID: 0}
    - target: {fileID: -8679921383154817045, guid: 34a4c2bfc0ad87c49b8b2db32b1d3017,
        type: 3}
      propertyPath: m_LocalEulerAnglesHint.y
      value: -33.403
      objectReference: {fileID: 0}
    - target: {fileID: -8679921383154817045, guid: 34a4c2bfc0ad87c49b8b2db32b1d3017,
        type: 3}
      propertyPath: m_LocalEulerAnglesHint.z
      value: 88.80501
      objectReference: {fileID: 0}
    - target: {fileID: -7511558181221131132, guid: 34a4c2bfc0ad87c49b8b2db32b1d3017,
        type: 3}
      propertyPath: m_Materials.Array.data[0]
      value: 
      objectReference: {fileID: 2100000, guid: 98befdc661bb1b84594b3cce064bad5a, type: 2}
    - target: {fileID: 919132149155446097, guid: 34a4c2bfc0ad87c49b8b2db32b1d3017,
        type: 3}
      propertyPath: m_Name
      value: Tabouret
      objectReference: {fileID: 0}
    - target: {fileID: 919132149155446097, guid: 34a4c2bfc0ad87c49b8b2db32b1d3017,
        type: 3}
      propertyPath: m_StaticEditorFlags
      value: 4294967295
      objectReference: {fileID: 0}
    m_RemovedComponents: []
  m_SourcePrefab: {fileID: 100100000, guid: 34a4c2bfc0ad87c49b8b2db32b1d3017, type: 3}
--- !u!4 &7481505301725837086 stripped
Transform:
  m_CorrespondingSourceObject: {fileID: -8679921383154817045, guid: 34a4c2bfc0ad87c49b8b2db32b1d3017,
    type: 3}
  m_PrefabInstance: {fileID: 6942611171051344117}
  m_PrefabAsset: {fileID: 0}
