%YAML 1.1
%TAG !u! tag:unity3d.com,2011:
--- !u!114 &-8103695695072756331
MonoBehaviour:
  m_ObjectHideFlags: 11
  m_CorrespondingSourceObject: {fileID: 0}
  m_PrefabInstance: {fileID: 0}
  m_PrefabAsset: {fileID: 0}
  m_GameObject: {fileID: 0}
  m_Enabled: 1
  m_EditorHideFlags: 0
  m_Script: {fileID: 11500000, guid: d0353a89b1f911e48b9e16bdc9f2e058, type: 3}
  m_Name: 
  m_EditorClassIdentifier: 
  version: 1
--- !u!21 &2100000
Material:
  serializedVersion: 6
  m_ObjectHideFlags: 0
  m_CorrespondingSourceObject: {fileID: 0}
  m_PrefabInstance: {fileID: 0}
  m_PrefabAsset: {fileID: 0}
  m_Name: Aurora 2
  m_Shader: {fileID: -6465566751694194690, guid: dbd3205539cd63d43bca4d0bb79bab48,
    type: 3}
  m_ShaderKeywords: 
  m_LightmapFlags: 4
  m_EnableInstancingVariants: 0
  m_DoubleSidedGI: 0
  m_CustomRenderQueue: -1
  stringTagMap: {}
  disabledShaderPasses: []
  m_SavedProperties:
    serializedVersion: 3
    m_TexEnvs:
    - Texture2D_8641B9D4:
        m_Texture: {fileID: 10300, guid: 0000000000000000f000000000000000, type: 0}
        m_Scale: {x: 1, y: 1}
        m_Offset: {x: 0, y: 0}
    - _BaseMap:
        m_Texture: {fileID: 0}
        m_Scale: {x: 1, y: 1}
        m_Offset: {x: 0, y: 0}
    - _BumpMap:
        m_Texture: {fileID: 0}
        m_Scale: {x: 1, y: 1}
        m_Offset: {x: 0, y: 0}
    - _EmissionMap:
        m_Texture: {fileID: 0}
        m_Scale: {x: 1, y: 1}
        m_Offset: {x: 0, y: 0}
    - _MainTex:
        m_Texture: {fileID: 0}
        m_Scale: {x: 1, y: 1}
        m_Offset: {x: 0, y: 0}
    - _MetallicGlossMap:
        m_Texture: {fileID: 0}
        m_Scale: {x: 1, y: 1}
        m_Offset: {x: 0, y: 0}
    - _OcclusionMap:
        m_Texture: {fileID: 0}
        m_Scale: {x: 1, y: 1}
        m_Offset: {x: 0, y: 0}
    - _SampleTexture2DLOD_611ED420_Texture_1:
        m_Texture: {fileID: 2800000, guid: 070962df95c98f349bf4919424bc8801, type: 3}
        m_Scale: {x: 1, y: 1}
        m_Offset: {x: 0, y: 0}
    - _SampleTexture2DLOD_BC7218DF_Texture_1:
        m_Texture: {fileID: 2800000, guid: 070962df95c98f349bf4919424bc8801, type: 3}
        m_Scale: {x: 1, y: 1}
        m_Offset: {x: 0, y: 0}
    - _SpecGlossMap:
        m_Texture: {fileID: 0}
        m_Scale: {x: 1, y: 1}
        m_Offset: {x: 0, y: 0}
    - _Texture2DAsset_5E431BEC_Out_0:
        m_Texture: {fileID: 10300, guid: 0000000000000000f000000000000000, type: 0}
        m_Scale: {x: 1, y: 1}
        m_Offset: {x: 0, y: 0}
    m_Floats:
    - Vector1_1E81ECFF: 12.4
    - Vector1_2A1B1288: 0.02
    - Vector1_3DAA530F: 2.1
    - Vector1_3F715A72: 0
    - Vector1_44E24CF1: 8
    - Vector1_5F3584F8: 0.05
    - Vector1_6ACA632A: 0.5
    - Vector1_7A165989: 1
    - Vector1_7F36E25: 0.6
    - Vector1_818A6030: 10
    - Vector1_971B3027: 0.1
    - Vector1_9F3FA441: 20
    - Vector1_B0BC4319: 0
    - Vector1_B1824218: 0
    - Vector1_CFC9FE06: 6.25
    - Vector1_D31CBA58: 1
    - Vector1_D698C362: 1.7
    - Vector1_EA177A6B: 40.16
    - Vector1_FB561A63: 8.88
    - _AlphaClip: 0
    - _Blend: 0
    - _BumpScale: 1
    - _Cull: 2
    - _Cutoff: 0.5
    - _DstBlend: 0
    - _EnvironmentReflections: 1
    - _GlossMapScale: 0
    - _Glossiness: 0
    - _GlossyReflections: 0
    - _Metallic: 0
    - _OcclusionStrength: 1
    - _QueueOffset: 0
    - _ReceiveShadows: 1
    - _Smoothness: 0.5
    - _SmoothnessTextureChannel: 0
    - _SpecularHighlights: 1
    - _SrcBlend: 1
    - _Surface: 0
    - _WorkflowMode: 1
    - _ZWrite: 1
    m_Colors:
    - Color_5B4E7E59: {r: 0.21960784, g: 0.6901961, b: 0.33540544, a: 0}
    - Color_7F5013B5: {r: 0.34117648, g: 0.70140606, b: 0.7921569, a: 0}
    - Color_FFBADAA4: {r: 0.23497665, g: 1, b: 0, a: 0}
    - Vector2_54F5EA22: {r: 1, g: 4.3, b: 0, a: 0}
    - Vector2_65783D0A: {r: 1, g: -30, b: 0, a: 0}
    - Vector3_22AD699B: {r: 1, g: 0, b: 0, a: 0}
    - Vector3_5BD191C8: {r: 20, g: 1, b: 1, a: 1}
    - Vector3_92C37967: {r: 0, g: 0, b: 0, a: 0}
    - Vector3_A4217F9D: {r: 0, g: 0, b: 0, a: 0}
    - _BaseColor: {r: 1, g: 1, b: 1, a: 1}
    - _Color: {r: 1, g: 1, b: 1, a: 1}
    - _EmissionColor: {r: 0, g: 0, b: 0, a: 1}
    - _SpecColor: {r: 0.19999996, g: 0.19999996, b: 0.19999996, a: 1}
