%YAML 1.1
%TAG !u! tag:unity3d.com,2011:
--- !u!65 &241737640
BoxCollider:
  m_ObjectHideFlags: 0
  m_CorrespondingSourceObject: {fileID: 0}
  m_PrefabInstance: {fileID: 0}
  m_PrefabAsset: {fileID: 0}
  m_GameObject: {fileID: 5582429322714310075}
  m_Material: {fileID: 0}
  m_IsTrigger: 0
  m_Enabled: 1
  serializedVersion: 2
  m_Size: {x: 15, y: 10, z: 15}
  m_Center: {x: 0, y: 6, z: 0}
--- !u!114 &241737638
MonoBehaviour:
  m_ObjectHideFlags: 0
  m_CorrespondingSourceObject: {fileID: 0}
  m_PrefabInstance: {fileID: 0}
  m_PrefabAsset: {fileID: 0}
  m_GameObject: {fileID: 5582429322714310075}
  m_Enabled: 1
  m_EditorHideFlags: 0
  m_Script: {fileID: 11500000, guid: e6fec36eef97e9b409b0f4248ddcef16, type: 3}
  m_Name: 
  m_EditorClassIdentifier: 
--- !u!1001 &4736005829878175978
PrefabInstance:
  m_ObjectHideFlags: 0
  serializedVersion: 2
  m_Modification:
    m_TransformParent: {fileID: 0}
    m_Modifications:
    - target: {fileID: -8679921383154817045, guid: 6539568afdf8cf349a7ab87669b42988, type: 3}
      propertyPath: m_RootOrder
      value: 0
      objectReference: {fileID: 0}
    - target: {fileID: -8679921383154817045, guid: 6539568afdf8cf349a7ab87669b42988, type: 3}
      propertyPath: m_LocalScale.x
      value: 0.05
      objectReference: {fileID: 0}
    - target: {fileID: -8679921383154817045, guid: 6539568afdf8cf349a7ab87669b42988, type: 3}
      propertyPath: m_LocalScale.y
      value: 0.07
      objectReference: {fileID: 0}
    - target: {fileID: -8679921383154817045, guid: 6539568afdf8cf349a7ab87669b42988, type: 3}
      propertyPath: m_LocalScale.z
      value: 0.05
      objectReference: {fileID: 0}
    - target: {fileID: -8679921383154817045, guid: 6539568afdf8cf349a7ab87669b42988, type: 3}
      propertyPath: m_LocalPosition.x
      value: -0.37791
      objectReference: {fileID: 0}
    - target: {fileID: -8679921383154817045, guid: 6539568afdf8cf349a7ab87669b42988, type: 3}
      propertyPath: m_LocalPosition.y
      value: 0.245
      objectReference: {fileID: 0}
    - target: {fileID: -8679921383154817045, guid: 6539568afdf8cf349a7ab87669b42988, type: 3}
      propertyPath: m_LocalPosition.z
      value: -9.143519
      objectReference: {fileID: 0}
    - target: {fileID: -8679921383154817045, guid: 6539568afdf8cf349a7ab87669b42988, type: 3}
      propertyPath: m_LocalRotation.w
      value: 0.9238798
      objectReference: {fileID: 0}
    - target: {fileID: -8679921383154817045, guid: 6539568afdf8cf349a7ab87669b42988, type: 3}
      propertyPath: m_LocalRotation.x
      value: 0.38268274
      objectReference: {fileID: 0}
    - target: {fileID: -8679921383154817045, guid: 6539568afdf8cf349a7ab87669b42988, type: 3}
      propertyPath: m_LocalRotation.y
      value: -0
      objectReference: {fileID: 0}
    - target: {fileID: -8679921383154817045, guid: 6539568afdf8cf349a7ab87669b42988, type: 3}
      propertyPath: m_LocalRotation.z
      value: -0
      objectReference: {fileID: 0}
    - target: {fileID: -8679921383154817045, guid: 6539568afdf8cf349a7ab87669b42988, type: 3}
      propertyPath: m_LocalEulerAnglesHint.x
      value: 45
      objectReference: {fileID: 0}
    - target: {fileID: -8679921383154817045, guid: 6539568afdf8cf349a7ab87669b42988, type: 3}
      propertyPath: m_LocalEulerAnglesHint.y
      value: 0
      objectReference: {fileID: 0}
    - target: {fileID: -8679921383154817045, guid: 6539568afdf8cf349a7ab87669b42988, type: 3}
      propertyPath: m_LocalEulerAnglesHint.z
      value: 0
      objectReference: {fileID: 0}
    - target: {fileID: -693396932640005380, guid: 6539568afdf8cf349a7ab87669b42988, type: 3}
      propertyPath: m_Materials.Array.data[0]
      value: 
      objectReference: {fileID: 2100000, guid: 51c75bde845739644ba9a3b6d6e4bd73, type: 2}
    - target: {fileID: 919132149155446097, guid: 6539568afdf8cf349a7ab87669b42988, type: 3}
      propertyPath: m_Name
      value: diamond
      objectReference: {fileID: 0}
    m_RemovedComponents: []
  m_SourcePrefab: {fileID: 100100000, guid: 6539568afdf8cf349a7ab87669b42988, type: 3}
--- !u!1 &5582429322714310075 stripped
GameObject:
  m_CorrespondingSourceObject: {fileID: 919132149155446097, guid: 6539568afdf8cf349a7ab87669b42988, type: 3}
  m_PrefabInstance: {fileID: 4736005829878175978}
  m_PrefabAsset: {fileID: 0}
