1) std::cout << "f[6] = " << f[6];

2) std::cin >> b[4];

3) for (int i = 0; i < 5; ++i) {
    g[i] = 8;
   }

4) double sum = 0;
   for (int i = 0; i < 100; ++i) {
    sum += g[i];
   }

   std::cout << "Sum: " << sum;

5) double a[11];
   double b[11];
   for (int i = 0; i < 11; ++i) {
    b[i] = a[i];
   }

6) double max = w[0];
   double min = w[0];

   for (int i = 1; i < 99; ++i) {
    if (w[i] > max) {
     max = w[i];
    } else if (w[i] < min) {
     min = w[i];
    }
   }

   std::cout << "Max: " << max << std::endl;
   std::cout << "Min: " << min;